
##TITLE=UV1248_M9_1261-1207_90_7241173_lqGwhHHLvY
##JCAMPDX= 6.0         $$ Bruker NMR JCAMP-DX V2.0
##DATA TYPE= NMR SPECTRUM
##DATA CLASS= NTUPLES
##ORIGIN= BRUKER
##OWNER= Administrator
$$ 1.72 TOPSPIN		Version 2.1
$$ 2013-01-24 03:50:11.169 -0500  Administrator@X
$$ Compression mode = diff/dup
##.OBSERVE FREQUENCY= 400.02188249412
##.OBSERVE NUCLEUS= ^1H
##.ACQUISITION MODE= SIMULTANEOUS (DQD)
##.ACQUISITION SCHEME= undefined
##.AVERAGES= 64
##.DIGITISER RES= 22
##SPECTROMETER/DATA SYSTEM= spect
##.PULSE SEQUENCE= noesygpps1d.comp
##.SOLVENT NAME= COFFEE_meoh
##.SHIFT REFERENCE= INTERNAL, COFFEE_meoh, 1, 14.96097
##AUDIT TRAIL= $$ (NUMBER, WHEN, WHO, WHERE, PROCESS, VERSION, WHAT)
$$ ##TITLE= Audit trail, TOPSPIN		Version 2.1
$$ ##JCAMPDX= 5.01
$$ ##ORIGIN= Bruker BioSpin GmbH
$$ ##OWNER= Administrator
$$ $$ E:\/data/COFFEE/nmr/UV1248_M9_1261-1207_90_7241173_lqGwhHHLvY/22/pdata/1/auditp.txt
$$ ##AUDIT TRAIL=  $$ (NUMBER, WHEN, WHO, WHERE, PROCESS, VERSION, WHAT)
(   1,<2013-01-24 03:50:05.419 -0500>,<Administrator>,<X>,<go>,<TOPSPIN 2.1>,
      <created by zg
	started at 2013-01-24 03:38:35.075 -0500,
	POWCHK enabled, PULCHK disabled,
       configuration hash MD5:
       86 BA 57 50 F2 9D 5C 9B 26 00 A9 28 5F 66 2E 89
       data hash MD5: 64K
       5C EC C7 7E E7 5D 62 6A 9B 24 EA 0B C2 D5 4D AF>)
(   2,<2013-01-24 03:50:08.466 -0500>,<Administrator>,<X>,<proc1d>,<TOPSPIN 2.1>,
      <Start of raw data processing
       efp LB = 0.3 FT_mod = 6 PKNL = 1 PHC0 = 0 PHC1 = 0 SI = 128K 
       data hash MD5: 128K
       7E 83 18 B3 9F 7D 0A 45 C2 3F BE 69 AF 6D 40 3E>)
(   3,<2013-01-24 03:50:09.482 -0500>,<Administrator>,<X>,<proc1d>,<TOPSPIN 2.1>,
      <pk PHC0 = -78.5083 PHC1 = 0 
       data hash MD5: 128K
       C1 C5 C9 52 A8 DD B6 84 52 08 C1 46 AA A3 3E 23>)
(   4,<2013-01-24 03:50:10.153 -0500>,<Administrator>,<X>,<proc1d>,<TOPSPIN 2.1>,
      <abs ABSG = 1 
       data hash MD5: 128K
       BF 79 BA 70 A6 45 25 86 17 11 97 43 24 13 14 A3>)
(   5,<2013-01-24 03:50:10.310 -0500>,<Administrator>,<X>,<proc1d>,<TOPSPIN 2.1>,
      <abs ABSG = 2 
       data hash MD5: 128K
       8B E7 42 9E E6 BF 25 5F BA 44 AF 06 C9 28 F5 E8>)
(   6,<2013-01-24 03:50:10.466 -0500>,<Administrator>,<X>,<proc1d>,<TOPSPIN 2.1>,
      <abs ABSG = 3 
       data hash MD5: 128K
       69 D1 15 33 B8 84 12 AB F3 49 76 B7 17 CD 39 2D>)
(   7,<2013-01-24 03:50:10.669 -0500>,<Administrator>,<X>,<proc1d>,<TOPSPIN 2.1>,
      <abs ABSG = 4 
       data hash MD5: 128K
       1D 82 6C B0 DE 84 74 07 E3 08 83 3C 14 46 39 FC>)
(   8,<2013-01-24 03:50:10.841 -0500>,<Administrator>,<X>,<proc1d>,<TOPSPIN 2.1>,
      <abs ABSG = 5 
       data hash MD5: 128K
       82 6E 14 D2 D0 D4 77 FF 01 76 CA AF B1 C5 F5 14>)
$$ ##END=
$$ 
$$ $$ hash MD5
$$ $$ 24 09 D1 6C 12 95 AE 16 FE 0A A2 24 CD 92 1F 4E
##$RELAX= 
##$RELAX= 
##$RELAX= 
##$RELAX= 
##$RELAX= 
##$RELAX= 
##$RELAX= 
##$RELAX= 
$$ Bruker specific parameters
$$ --------------------------
##$DU= <E:\>
##$EXPNO= 22
$$ [...]
150 150 150 150 150 150 150 150
##$TP07= 0
##$TPNAME0= <>
##$TPNAME1= <>
##$TPNAME2= <>
##$TPNAME3= <>
##$TPNAME4= <>
##$TPNAME5= <>
##$TPNAME6= <>
##$TPNAME7= <>
##$TPOAL= (0..7)
0.5 0.5 0.5 0.5 0.5 0.5 0.5 0.5
##$TPOFFS= (0..7)
0 0 0 0 0 0 0 0
##$TUNHIN= 0
##$TUNHOUT= 0
##$TUNXOUT= 0
##$USERA1= <user>
##$USERA2= <user>
##$USERA3= <user>
##$USERA4= <user>
##$USERA5= <user>
##$V9= 5
##$VALIST= <valist>
##$VCLIST= <CCCCCCCCCCCCCCC>
##$VD= 0
##$VDLIST= <DDDDDDDDDDDDDDD>
##$VPLIST= <PPPPPPPPPPPPPPP>
##$VTLIST= <TTTTTTTTTTTTTTT>
##$WBST= 1024
##$WBSW= 4
##$XGAIN= (0..3)
0 0 0 0
##$XL= 0
##$YL= 0
##$YMAX_a= 6367447
##$YMIN_a= -12668210
##$ZGOPTNS= <>
##$ZL1= 120
##$ZL2= 120
##$ZL3= 120
##$ZL4= 120
##$ABSF1= 14.96097
##$ABSF2= -5.597212
##$ABSG= 5
##$ABSL= 3
##$ALPHA= 0
##$AQORDER= 0
##$ASSFAC= 0
##$ASSFACI= 0
##$ASSFACX= 0
##$ASSWID= 0
##$AUNMP= <proc_prof1d_extract.lims>
##$AXLEFT= 0
##$AXNAME= <>
##$AXNUC= <1H>
##$AXRIGHT= 0
##$AXTYPE= 0
##$AXUNIT= <>
##$AZFE= 0.1
##$AZFW= 0.1
##$BCFW= 0
##$BC_mod= 0
##$BYTORDP= 0
##$COROFFS= 0
##$CY= 15
##$DATMOD= 1
##$DC= 0
##$DFILT= <>
##$DTYPP= 0
##$F1P= 0
##$F2P= 0
##$FCOR= 0.5
##$FTSIZE= 131072
##$FT_mod= 6
##$GAMMA= 0
##$GB= 0
##$INTBC= 1
##$INTSCL= 1
##$ISEN= 128
##$LB= 0.3
##$LEV0= 0
##$LPBIN= 0
##$MAXI= 10000
##$MC2= 0
##$MEAN= 0
##$ME_mod= 0
##$MI= 0
##$NCOEF= 0
##$NC_proc= -2
##$NLEV= 6
##$NOISF1= 0
##$NOISF2= 0
##$NSP= 0
##$NTH_PI= 0
##$NZP= 0
##$OFFSET= 14.96097
##$PC= 1
##$PHC0= -78.5083
##$PHC1= 0
##$PH_mod= 1
##$PKNL= yes
##$PPARMOD= 0
##$PPDIAG= 0
##$PPIPTYP= 0
##$PPMPNUM= 2147483647
##$PPRESOL= 1
##$PSCAL= 4
##$PSIGN= 0
##$PYNMP= <proc.py>
##$REVERSE= no
##$SF= 400.020009647518
##$SI= 131072
##$SIGF1= 0
##$SIGF2= 0
##$SINO= 400
##$SIOLD= 131072
##$SPECTYP= <>
##$SREGLST= <1H.CDCl3>
##$SSB= 0
##$STSI= 131072
##$STSR= 0
##$SW_p= 8223.68421052631
##$SYMM= 0
##$S_DEV= 0
##$TDeff= 65536
##$TDoff= 0
##$TI= <>
##$TILT= no
##$TM1= 0
##$TM2= 0
##$TOPLEV= 0
##$USERP1= <user>
##$USERP2= <user>
##$USERP3= <user>
##$USERP4= <user>
##$USERP5= <user>
##$WDW= 1
##$XDIM= 131072
##$YMAX_p= 413094885
##$YMIN_p= -12606
##$CURPLOT= <Network HP LaserJet P1505>
##$CURPRIN= <$Network HP LaserJet P1505>
##$DFORMAT= <normdp>
##$LAYOUT= <+/1D_H.xwp>
##$LFORMAT= <normlp>
##$PFORMAT= <normpl>
##$SURQMSG= 1
$$ End of Bruker specific parameters
$$ ---------------------------------
##NTUPLES= NMR SPECTRUM
##VAR_NAME=  FREQUENCY,     SPECTRUM/REAL,   SPECTRUM/IMAG
##SYMBOL=    X,             R,               I
##VAR_TYPE=  INDEPENDENT,   DEPENDENT,       DEPENDENT
##VAR_FORM=  AFFN,          ASDF,            ASDF
##VAR_DIM=   131072,        131072,          131072
##UNITS=     HZ,            ARBITRARY UNITS, ARBITRARY UNITS
##FACTOR=    0.0627417313425164, 1,          1
##FIRST=     8223.62146879497, -8,           -56299
##LAST=      0,             836,             -57107
##MIN=       0,             -12606,          0
##MAX=       8223.62146879497, 413094885,    0
$$ Real data points
##PAGE= N=1
##DATA TABLE= (X++(R..R)), XYDATA
$$ [...]
63864E20397J2064J4215J6274J7940J9396K1481K4652K8270L1407L3906L6148
63853G76150L8245M0110M1901M3713M5040M5136M3885M1853L9697L7757L5920
63842A229407L3483K9517K3910J7692J1810N979o18p873j4770k0662k5756l0338
63830A251781l4376l7992m1518m4816m7110m7877m7560m7002m6474m5459m3360
63819G68237m0206l6730l3810l1748l0100k8295k6176k3869k1364j8620j5924
63808D61395j3729j2120j0776r365p807o198m761l730l004k139j038m98j471l814
63794C80945o257p708q130q077p879p548p074o456n644m720m042l957m425m986
63780B94042n083m415l198k076j609j734j878j628j165j020j465k168k415j792
$$ y = [520397, 532461, 546676, 562950, 580890, 600286, 621767, 646419, 674689, 706096, 740002, 776150, 814395, 854505, 896406, 940119, 985159, 1030295, 1074180, 1116033, 1155730, 1193487, 1229407, 1262890, 1292407, 1316317, 1334009, 1345819, 1351798, 1351180, 1343307, 1328537, 1307875, 1282119, 1251781, 1217405, 1179413, 1137895, 1093079, 1045969, 998092, 950532, 903530, 857056, 811597, 768237, 728031, 691301, 657491, 625743, 595643, 567348, 541172, 517303, 495939, 477319, 461395, 447666, 435546, 424770, 415405, 407598, 401400, 396639, 392909, 389905, 387766, 386728, 386230, 384759, 380945, 374688, 366980, 358850, 350773, 342894, 335346, 328272, 321816, 316172, 311452, 307410, 303453, 299028, 294042, 288959, 284544, 281346, 279270, 277661, 275927, 274049, 272421, 271256, 270236, 268771, 266603, 264188, 262396]
63766B62396p25j49m10p83m48L17M68l36j260j473j178j059j204j127o35j51j28
63749B52115n54j083j415j468j306j023n74J90J260K283K775K586K049J668J698
63734B59201K036K440K795L140L399L314K809K314K419L094L644L609L419L795
63720C01428M774N688O015N771N113M007K519J103K52l3k99j174k794m465n001
63705C22904l826j828o65r87j773j791j157q96j286j492q55K91J296K027K655
63690C12617L125L269L186L041K750K146J316N01j85o58p38l83N6J06l37r27j127
63673C27758m80J056K842L900L838L178K625K318K085J975K071K098J704R30n1
63658C57847j311k767l770l858l603l905m563m516l515k550k358k412j954j187
$$ y = [262396, 261671, 261522, 261112, 260329, 259881, 260198, 260666, 260330, 259070, 257597, 256419, 255360, 254156, 253029, 252394, 252243, 252115, 251561, 250478, 249063, 247595, 246289, 245266, 244692, 244882, 246142, 248425, 251200, 253786, 255835, 257503, 259201, 261237, 263677, 266472, 269612, 273011, 276325, 279134, 281448, 283867, 286961, 290605, 294214, 297633, 301428, 306202, 311890, 317905, 323676, 328789, 332796, 335315, 336418, 336670, 336637, 336338, 335164, 332370, 327905, 322904, 319078, 317250, 316585, 315598, 313825, 312034, 310877, 309981, 308695, 307203, 306348, 306639, 307935, 309962, 312617, 315742, 319011, 322197, 325238, 327988, 330134, 331450, 331951, 331766, 331108, 330370, 329987, 330043, 330149, 329812, 328885, 327758, 327278, 328334, 331176, 335076, 338914, 342092, 344717, 347035, 349120, 351095, 353166, 355264, 356968, 357898, 357847, 356536, 353769, 349999, 346141, 342538, 338633, 334070, 329554, 326039, 323489, 321131, 318719, 316765, 315578]
63644C15578p63o67l18M20J058J219J100J162J705K737L948M837N026M572L932
63629C45546L672M079M894N474N370M812M464M817N965P765R836J1566J2532J2944
63615D43736J3383J4221J5566J7485J9784K1846K3313K4664K6472K8351K9427
63604F78248K9633K9443K8472K5602K0770J5386J0517N926J464j907l383l650
63592H36521l827l982l777l871n349q154j1299j4369j7656k0899k3098k3755k3406
63579F73079k2705k1677k0071j7900j5409j2907j0645q533o131l294n24J634L256
63566E38173M574N340N331N134N524O360O807O562O040N621N497O124P836J0139
63552F25062J2159J3872J6034J8978K2395K6258L0874L5930M0437M3777M5719
$$ y = [315578, 314815, 314148, 313830, 314250, 315308, 316527, 317627, 318789, 320494, 323231, 327179, 332016, 337042, 341614, 345546, 349218, 353297, 358191, 363665, 369035, 373847, 378311, 383128, 389093, 396858, 406694, 418260, 430792, 443736, 457119, 471340, 486906, 504391, 524175, 546021, 569334, 593998, 620470, 648821, 678248, 707881, 737324, 765796, 791398, 812168, 827554, 838071, 843997, 845461, 843554, 840171, 836521, 832694, 828712, 824935, 821064, 815715, 807561, 796262, 781893, 764237, 743338, 720240, 696485, 673079, 650374, 628697, 608626, 590726, 575317, 562410, 551765, 543232, 537101, 533807, 533283, 534917, 538173, 542747, 548087, 553418, 558552, 564076, 570436, 577243, 583805, 589845, 595466, 600963, 607087, 614923, 625062, 637221, 651093, 667127, 686105, 708500, 734758, 765632, 801562, 841999, 885776, 931495]
63541I31495M5085L9719K8724J4131k10j1070j7070j8580j7181j4728j2238r771
63529I58306p569o615p662j0314j3584j6934k0304k3548k6413k8781l0548l1454
63517G34580l1332l0267k8383k5890k3396k1541k0078j8045j5250j2779j1471
63506D96148j0651r203p311o162o195o627o677o366n977n370m233k679j342r05
63492D16450j473k322k546k017j478j469j660j496j015n11J28J124K124K585K599
63477D09023K707L017L191L192L331L491L096K012Q43P3n70j590k981m338n310
63462D19187n703n470m882m456m382m195l309j756k12O15N14j17n41k45O18J405
63446C87071J738J904K408L349M530N973P990J0671J3616J6362J8894K1603K4873
$$ y = [931495, 976580, 1016299, 1045023, 1059154, 1058944, 1047874, 1030804, 1012224, 995043, 980315, 968077, 958306, 950737, 944122, 936460, 926146, 912562, 895628, 875324, 851776, 825363, 796582, 766034, 734580, 703248, 672981, 644598, 618708, 595312, 573771, 553693, 535648, 520398, 507619, 496148, 485497, 476294, 468983, 462821, 456626, 449999, 443322, 436956, 430979, 425609, 421376, 418697, 417355, 416450, 414977, 412655, 410109, 408092, 406614, 405145, 403485, 401989, 400974, 400463, 400591, 401715, 403839, 406424, 409023, 411730, 414747, 417938, 421130, 424461, 427952, 431048, 433060, 433903, 433976, 433406, 431816, 428835, 424497, 419187, 413484, 408014, 403132, 398676, 394294, 390099, 386790, 385034, 384822, 385437, 385951, 385834, 385293, 385048, 385666, 387071, 388809, 390713, 393121, 396470, 401000, 406973, 414963, 425634, 439250, 455612, 474506, 496109, 520982]
63433E20982K8944L4010L9825M4875M6439M2288L2749K0801R898J854l212n653
63421H13800n695l748m71L719Q765J4398J9794K4100K7022K8658K8878K7238K3477
63408A009935J7981J1770O022J516j633l718m983n535n722o245p725j0206j3322
63395I88135j6831k0752k4970k8915l1822l3226l3179l2068l0276k8059k5589
63384F82448k3048k0576j8198j5900j3699j1562r293o754m164j934j31J610L447
63371E62246M978N839O360P161Q295R350J0353J1849J4024J6359J8416K0322K2138
63358G17690K3494K4369K5569K7698L0067L1479L1730L1382L0338K7662K2973
63347A024451J7054J0940N267O03k544m424n814o778o678n818n974q439j2495
$$ y = [520982, 549926, 583936, 623761, 668636, 715075, 757363, 790112, 810913, 820811, 822665, 819453, 813800, 808105, 804357, 803886, 807605, 816370, 830768, 850562, 874662, 901684, 930342, 959220, 986458, 1009935, 1027916, 1039686, 1045708, 1047224, 1045591, 1041873, 1036890, 1031355, 1025633, 1019388, 1011663, 1001457, 988135, 971304, 950552, 925582, 896667, 864845, 831619, 798440, 766372, 736096, 708037, 682448, 659400, 638824, 620626, 604726, 591027, 579465, 570172, 563418, 559254, 557320, 557189, 558799, 562246, 567224, 573063, 579423, 586584, 594879, 604229, 614582, 626431, 640455, 656814, 675230, 695552, 717690, 741184, 765553, 791122, 818820, 848887, 880366, 912096, 943478, 973816, 1001478, 1024451, 1041505, 1052445, 1057712, 1058315, 1055771, 1051347, 1045533, 1038755, 1032077, 1026259, 1020285, 1011846, 999351]
63334I99351j6752k1027k5651k9761l1905l2120l1862l1706l0570k7595k3597
63323F96805j9894j6628j2995q545l531J598O163Q750P468J439p884j7136k3289
63310F12321k5649k5510k4059k1400j7773j4525j2796j2012j0851r275q301q037
63298D22133p431o107m995m765m871m668m315m074l718l277l262l587l324k271
63284C61468j604k088k745k483j950k255k795k043j43J110Q80K04Q6J72j61o80
63268C44973r44j086j229r72j60M60J50p44j249j001m13P3L79N60O61P20O43K50
63250C41071l11m54J62J090J615J673J716J869J743J241R29J247J719J441L23
63235C57074o72n57O86K289L500L966L642K828K239K495L416M098L959L387L158
$$ y = [999351, 982599, 961572, 935921, 906160, 874255, 842135, 810273, 778567, 747997, 720402, 696805, 676911, 660283, 647288, 638743, 635212, 636810, 642973, 651723, 659191, 660630, 652746, 635610, 612321, 586672, 561162, 537103, 515703, 497930, 483405, 470609, 458597, 447746, 438471, 430170, 422133, 414702, 408595, 403600, 398835, 393964, 389296, 384981, 380907, 377189, 373912, 370650, 367063, 363739, 361468, 359864, 357776, 355031, 352548, 350598, 348343, 345548, 343505, 343362, 344472, 345352, 345556, 345642, 345814, 345653, 344973, 344029, 342943, 341714, 340742, 340582, 341042, 341192, 340448, 339199, 338198, 337785, 337858, 338237, 338797, 339458, 340178, 340821, 341071, 340760, 340306, 340468, 341558, 343173, 344846, 346562, 348431, 350174, 351415, 352344, 353591, 355310, 356751, 357074, 356402, 355845, 356531, 358820, 362320, 366286, 369928, 372756, 374995, 377490, 380906, 385004, 388963, 392350, 395508]
63220C95508L489L946M106L981L781L600L433L369L604M214M944N311N035M336
63206D52657L665L253L026K864K647K156J360P69J004J917K650K799K949L761
63192D87477N050O250P342Q645J0051J1182J2198J3753J6046J8506K0538K2125
63180F39163K3540K4818K5781K6234K6014K5120K3927K3051K2804K2927K2950
63169I06329K2609K1818K0483J8556J6168J3501J0555P119K974j951p536j3462
63157A017163j9219k4299k8498l1952l4741l6465l6517l4904l2532l0407k8690
63146F78939k6827k4480k1982j9816j8104j6577j4823j2581j0063p946o653n834
63134D93253m882l862l248k926k313j426r04p48o4J463K815L056K629K506K804
$$ y = [395508, 398997, 402943, 407049, 411030, 414811, 418411, 421844, 425213, 428817, 433031, 437975, 443286, 448321, 452657, 456322, 459575, 462601, 465465, 468112, 470268, 471628, 472397, 473401, 475318, 477968, 480767, 483716, 487477, 492527, 498777, 506119, 514764, 524815, 535997, 548195, 561948, 577994, 596500, 617038, 639163, 662703, 687521, 713302, 739536, 765550, 790670, 814597, 837648, 860452, 883379, 906329, 928938, 950756, 971239, 989795, 1005963, 1019464, 1030019, 1037138, 1040112, 1038161, 1030625, 1017163, 997944, 973645, 945147, 913195, 878454, 841989, 805472, 770568, 738036, 707629, 678939, 652112, 627632, 605650, 585834, 567730, 551153, 536330, 523749, 513686, 505740, 499087, 493253, 488371, 484509, 481261, 478335, 476022, 474596, 473692, 472944, 472880, 474343, 477158, 480214, 482843, 485349, 488153]
63119D88153L157L672M521N149N034M767N221N944N727M624M052M726N723N916
63105E56386N247M222L174K523K794L769M361L974L302L275L845M402M811N282
63091F11367N686N697N363M958M456L680K724J741O03q37k331l559m659n877o935
63076F22077p291o934o381n890n275m579m337m857n614n775n119m139l282k448
63062E50156j334LJ140J794K080K261K462K752L366M546O203P920R276J0096J0439
63047F13160J0497J0519J0700J1137J1855J2733J3344J3145J2118J1038J0759
63036G41005J1355J2191J2733J2930J2900J2649J2140J1327J0126Q588P042N799
63024H70785M719L375J606m07k488m490o087o951p139o890o100m538k545r01J98
$$ y = [488153, 491310, 494982, 499503, 504652, 509686, 514453, 519674, 525618, 531345, 535969, 540021, 544747, 550470, 556386, 561633, 565855, 569029, 571552, 574346, 578115, 582476, 586450, 589752, 593027, 596872, 601274, 606085, 611367, 617053, 622750, 628113, 633071, 637527, 641207, 643931, 645672, 646275, 645438, 643107, 639548, 634889, 629012, 622077, 614786, 607852, 601471, 595581, 590306, 585727, 581390, 576533, 570919, 565144, 560025, 555886, 552604, 550156, 548822, 548825, 549965, 551759, 553839, 556100, 558562, 561314, 564680, 569226, 575429, 583349, 592625, 602721, 613160, 623657, 634176, 644876, 656013, 667868, 680601, 693945, 707090, 719208, 730246, 741005, 752360, 764551, 777284, 790214, 803114, 815763, 827903, 839230, 849356, 857944, 864986, 870785, 875504, 878879, 880485, 880078, 877590, 873100, 867013, 860062, 852923, 846033, 839933, 835395, 832850, 831949, 832147]
63009H32147J537M027P770J2122J6301J9752K2416K4839K7733L1211L4724L7849
62997A072428M0626M3026M4608M5105M4950M4789M4736M4433M3679M2673M1767
62986A552820M1137M0628L9742L7883L4633K9734K3021J4730N720l206j2175k1837
62974A782830l2028m1491m9187n5158n9829o3102o4655o4526o2890n9765n5526
62963A174673n1226m7670m4453m0632l6182l2106k9147k7008k4974k2806k0916
62952G97553j9865j9807k0230k0351j9826j8911j7840j6516j5014j3954j3759
62941F01480j3888j3398j2119j0718r709q952q129p275o663o438o410o089n133
62928D86559l920l363l777m339m091l151k367k067j894j615j346r82k68M39K90
$$ y = [832147, 833684, 837711, 845481, 857603, 873904, 893656, 916072, 940911, 968644, 999855, 1034579, 1072428, 1113054, 1156080, 1200688, 1245793, 1290743, 1335532, 1380268, 1424701, 1468380, 1511053, 1552820, 1593957, 1634585, 1674327, 1712210, 1746843, 1776577, 1799598, 1814328, 1820048, 1816842, 1804667, 1782830, 1750802, 1709311, 1660124, 1604966, 1545137, 1482035, 1417380, 1352854, 1289964, 1230199, 1174673, 1123447, 1075777, 1031324, 990692, 954510, 922404, 893257, 866249, 841275, 818469, 797553, 777688, 757881, 737651, 717300, 697474, 678563, 660723, 644207, 629193, 615239, 601480, 587592, 574194, 562075, 551357, 541648, 532696, 524567, 517292, 510629, 504191, 497781, 491692, 486559, 482639, 479276, 475499, 471160, 467069, 463918, 461551, 459484, 457590, 455975, 454629, 453647, 453379, 453818, 454108]
62913D54108q51j997k159j382l94K75N07L96K10K44M31M70M14P36J535K265K579
62896D57387K864L484M089M247M309M816N395N163M105L174K913K818K336J688
62882E08788J297R83L54m96j233j881k654l365l665l691l940m483m855m797m564
62867D71798m450m436m519m809n110m948m334l997m381m890m656l747k969k688
62853D11864k519k116j602j192r51j011j491k024j929j015J44R32J180Q92K3j097
62837C98088j717j489r68q60j058r06j98N49P67M10q3j85K56Q34R79P10O33J003
62819C96765J251Q18R9k1O45J424J724J593J295R07N32M27O61Q51N63r3m33J46
62801D09154J458K536K550J767J326J860K650K496J181l58j139r78j83R76K318
$$ y = [454108, 453257, 451260, 449101, 447719, 447325, 447600, 448107, 448503, 448713, 448957, 449388, 449858, 450272, 451008, 452543, 454808, 457387, 460251, 463735, 467824, 472071, 476380, 481196, 486591, 491754, 495859, 499033, 501946, 504764, 507100, 508788, 510085, 511068, 511422, 510926, 509693, 507812, 505158, 501793, 498128, 494437, 490497, 486014, 481159, 476362, 471798, 467348, 462912, 458393, 453584, 448474, 443526, 439192, 435195, 430814, 425924, 421268, 417521, 414552, 411864, 409345, 407229, 405627, 404435, 403484, 402473, 400982, 398958, 397029, 396014, 396158, 397090, 398270, 399162, 399185, 398088, 396371, 394882, 393914, 393054, 391996, 391090, 390892, 391441, 392208, 392618, 392535, 392350, 392606, 393440, 394419, 395129, 395762, 396765, 398016, 398834, 398933, 398912, 399557, 400981, 402705, 404298, 405593, 406500, 407032, 407459, 408120, 408971, 409534, 409441, 409008, 409154, 410612, 413148, 415698, 417465, 418791, 420651, 423301, 425797, 426978, 426620, 425481, 424503, 424320, 425296, 427614]
62786D27614L576M497N072N482N915O431P021P737Q759J0115J1421J2127J2187
62773E27954J2132J2236J1971J0742Q856P193O100N186M169L249K534J695M25
62760F14442j183k916m682o294p454q243r111j0120j0672j0483j0295j0911j1833
62747E10245j1649r925p917p053p275p358o578n421m660m317l786k696j279j8
62733D30313P62R61P47O13J047J912K398J971J181J108K034L135L631L780M406
62718D59999N741P210Q294R083R859J0595J1228J2125J3783J6019J7918J8902
62706F00756J9591K1238K4350K8232L1915L5140L8303M1730M5378M9142N3101
62695I88876N7357O1799O6084O9833P2812P4932P6093P5969P4060O9910O3234
$$ y = [427614, 431190, 435687, 440759, 446241, 452156, 458587, 465608, 473345, 482104, 492219, 503640, 515767, 527954, 540086, 552322, 564293, 575035, 583891, 591084, 597184, 602370, 606539, 609788, 612322, 614017, 614442, 613259, 610343, 605661, 599367, 591913, 583670, 574559, 564439, 553767, 543284, 532989, 522078, 510245, 498596, 488671, 480754, 473701, 466426, 459068, 452490, 447069, 442409, 438092, 434306, 431610, 430331, 430313, 431075, 432036, 432783, 433396, 434443, 436355, 438753, 440724, 441905, 443013, 445047, 448182, 451813, 455593, 459999, 465740, 472950, 481244, 490327, 500186, 510781, 522009, 534134, 547917, 563936, 581854, 600756, 620347, 641585, 665935, 694167, 726082, 761222, 799525, 841255, 886633, 935775, 988876, 1046233, 1108032, 1174116, 1243949, 1316761, 1391693, 1467786, 1543755, 1617815, 1687725, 1750959]
62684A750959N3894M1981K8087J3260j446j5459k8596m0720n1586o0884o8230
62673A621260p3238p5880p6645p6103p4320p1017o6356o1239n6623n2721m9062
62662H88056m5192m1107l7051l3188k9642k6656k4484k2993k1515j9303j6251
62651E70674j3133j1025j0445j1032j1927j2390j2103j1067r507p819o425n455
62639D48346m679l806k833j948j298r94j234j997k747k892k591k561k965l105
62625D12696k534j762j434j421j405j675k445k940k281r67k39j71K53J127J264
62610C96066K87m77QQ81Q46J42j93j43m16r33r88o67p01j046q64L4R36J486K143
62591C96401L101L821M028M204M685N085N114N122N266M907L586K056J464J704
$$ y = [1750959, 1804853, 1846834, 1874921, 1888181, 1886735, 1871276, 1842680, 1801960, 1750374, 1689490, 1621260, 1548022, 1472142, 1395497, 1319394, 1245074, 1174057, 1107701, 1046462, 989839, 937118, 888056, 842864, 801757, 764706, 731518, 701876, 675220, 650736, 627743, 606228, 586925, 570674, 557541, 546516, 536071, 525039, 513112, 500722, 488619, 477552, 468045, 460226, 453801, 448346, 443667, 439861, 437028, 435080, 433782, 432788, 431554, 429557, 426810, 423918, 421327, 418766, 415801, 412696, 410162, 408400, 406966, 405545, 404140, 402465, 400020, 397080, 394799, 393832, 393593, 393422, 393675, 394802, 396066, 396353, 395876, 395884, 396765, 397611, 397753, 397560, 397417, 397001, 396068, 395080, 394413, 393712, 392666, 391802, 391836, 392772, 394258, 396401, 399502, 403323, 407351, 411555, 416240, 421325, 426439, 431561, 436827, 441734, 445320, 447376, 448840, 450544]
62577D50544J469l3k051l276l411l373m003m993n368m828m150m057m306m229l821
62562D00114l641l773l638k833j652n75K22P42R38Q29N21N4m76p39n09j38j03
62545C85343j70L61J472K267K266K163K805L987M778M686M017L330K995L063L210
62530D26573L050K749L068M345N840O598O776P503R349J1528J2835J3023J3028
62517E26265J3994J6369J9804K3664K7435L0844L3804L6419L8831M0982M2607
62506H51018M3579M4030M3912M2672L9756L5259K9751K3545J6571Q943J154o404
62494A173786j3571j9920k4556k6761k6660k5061k2803k0320j7602j4415j0700
62483I51417o808l098N58M520Q570J1804J3395J3124J1159P814L743j83l594p016
$$ y = [450544, 452013, 451980, 449929, 446653, 443242, 439869, 435866, 430873, 425505, 420677, 416527, 412470, 408164, 403935, 400114, 396473, 392700, 389062, 386229, 384577, 384002, 384224, 384966, 385904, 386733, 387254, 387308, 386832, 386093, 385584, 385446, 385343, 385173, 385534, 387006, 389273, 391539, 393702, 396507, 400494, 405272, 409958, 413975, 417305, 420300, 423363, 426573, 429623, 432372, 435440, 439785, 445625, 452223, 458999, 466502, 475851, 487379, 500214, 513237, 526265, 540259, 556628, 576432, 600096, 627531, 658375, 692179, 728598, 767429, 808411, 851018, 894597, 938627, 982539, 1025211, 1064967, 1100226, 1129977, 1153522, 1170093, 1179036, 1180190, 1173786, 1160215, 1140295, 1115739, 1088978, 1062318, 1037257, 1014454, 994134, 976532, 962117, 951417, 944609, 941511, 942069, 946589, 955159, 966963, 980358, 993482, 1004641, 1012455, 1016198, 1016015, 1012421, 1005405]
62469A005405j1237j6505k2319k7698l1618l3586l4094l4170l4322l4213l3438
62458F92205l2043l0176k7791k5058k2450k0035j7261j3919j0852q977q013o852
62446D68778n020l147k026j812k078k204j721o43M85J223J724K306K797K811K462
62431D63935K138J687N59j181k648l222l270l486l979m420m661m776m708m290
62417D27678l556k743k012j390r20p02p36r00j020r97q83r26j305j704j448m00
62401D06036N21K31j006j567k61K193L996M278L716L330L377L645M093M690N080
62386D42352M995M810N142O045P067Q008R062J0164J0743J0354R284Q299Q009
62373E44334Q510R397J0094J0350J0439J0712J1121J1480J2038J3317J5420J7937
$$ y = [1005405, 994168, 977663, 955344, 927646, 896028, 862442, 828348, 794178, 759856, 725643, 692205, 660162, 629986, 602195, 577137, 554687, 534652, 517391, 503472, 492620, 483643, 475630, 468778, 463758, 460611, 458585, 456773, 454695, 452491, 450770, 450127, 450612, 451835, 453559, 455865, 458662, 461473, 463935, 466073, 467760, 468319, 467138, 464490, 461268, 457998, 454512, 450533, 446113, 441452, 436676, 431968, 427678, 424122, 421379, 419367, 417977, 417057, 416355, 415619, 414719, 413699, 412702, 411819, 410893, 409588, 407884, 406436, 406036, 406557, 406788, 405782, 404215, 403954, 406147, 410143, 414421, 418137, 421467, 424844, 428489, 432582, 437272, 442352, 447347, 452157, 457299, 463344, 470411, 478419, 487481, 497645, 508388, 518742, 528026, 536325, 544334, 552844, 562241, 572335, 582685, 593124, 603836, 614957, 626437, 638475, 651792, 667212, 685149]
62361F85149K0538K3262K6201K9442L3287L7956M2948M7288N0570N3160N5113
62350A104914N5576N3744M9874M4783L8751L1557K3508J5680R026L460j961q079
62338A420833j4824k1304k6767l1281l5276l8560m0294m0084l8563l6644l4639
62327A062597l2355k9710k6917k4368k2582k2044k2697k3788k4433k4290k3595
62316G85818k2771k2108k1535k0691j9390j7971j6839j5821j4498j2993j1715
62305E89486j0433q547o383n128n086n087m213l120k744k649j771j79J094J641
62291E36881K014K618L254L771M279M704M744M366L817L230K679K424K494K328
62277E83603J454L24k38j05K89Q57J806K903L720M526N987Q023R879J1375J3147
$$ y = [685149, 705687, 728949, 755150, 784592, 817879, 855835, 898783, 946071, 996641, 1049801, 1104914, 1160490, 1214234, 1264108, 1308891, 1347642, 1379199, 1402707, 1418387, 1427413, 1430873, 1428912, 1420833, 1406009, 1384705, 1357938, 1326657, 1291381, 1252821, 1212527, 1172443, 1133880, 1097236, 1062597, 1030242, 1000532, 973615, 949247, 926665, 904621, 881924, 858136, 833703, 809413, 785818, 763047, 740939, 719404, 698713, 679323, 661352, 644513, 628692, 614194, 601201, 589486, 579053, 570506, 564123, 558995, 553909, 548822, 544609, 541489, 538745, 536096, 534325, 534146, 535240, 536881, 538895, 541513, 544767, 548538, 552817, 557521, 562265, 566631, 570448, 573678, 576357, 578781, 581275, 583603, 585057, 585381, 585143, 585038, 585327, 586184, 587990, 590893, 594613, 599139, 605126, 613149, 623028, 634403, 647550]
62262F47550J5534J8183K0968K4339K8420L2640L6607M0670M5074M9325N2837
62251A012147N5559N7407N7629N5321N0320M3241L4896K6076J7461R343J571o068
62239A414903j3642k1218k8797l5976m2212m7449n1919n5176n6089n4155n0251
62228I58019m5708m1217l7023l3465l0675k8151k5375k2488j9891j7531j5129
62217F41366j2854j1127r977r139q536q177p708o768n648n002m965n070m982m729
62203E36684m209l131j588j97O38J154J707K285K795L450M491N728O687P130P238
62188E70862P336P685Q373R263J0087J0725J1270J1663J1531J0630R272Q003O972
62175F93672O015N198M775M686M728N278P149J0401J4036J7378K1053K5791L0901
$$ y = [647550, 663084, 681267, 702235, 726574, 754994, 787634, 824241, 864911, 909985, 959310, 1012147, 1067706, 1125113, 1182742, 1238063, 1288383, 1331624, 1366520, 1392596, 1410057, 1419400, 1420971, 1414903, 1401261, 1380043, 1351246, 1315270, 1273058, 1225609, 1173690, 1118514, 1062425, 1008270, 958019, 912311, 871094, 834071, 800606, 769931, 741780, 716405, 693917, 674026, 656495, 641366, 628512, 617385, 607408, 598269, 589733, 581556, 573848, 567080, 561432, 556430, 551465, 546395, 541413, 536684, 532475, 529344, 527756, 527559, 528197, 529351, 531058, 533343, 536138, 539588, 544079, 549807, 556494, 563624, 570862, 578198, 585883, 594256, 603519, 613606, 624331, 635601, 647264, 658795, 669425, 678697, 686700, 693672, 699687, 704885, 709660, 714346, 719074, 724352, 731501, 741902, 755938, 773316, 794369, 820160, 851061]
62162H51061L4996L7889M0386M2285M2015L8769L3762K8536K3121J6868J0276
62151A199964M671L47l803q826j4694k0771k6483l1382l5157l7664l8728l8046
62139I49428l5770l2822l0015k7103k3472j9492j6264j4101j2236j0142q238p007
62127G12766o302n866n741n731n157l717j969n64N44J642K671L602M948P298J0507
62112G08931J3920J7097J9847K1697K1872J9929J6211J1758P886N667N415O753
62100H76983R104J1872J4073J4372J1968P391K124k460n646p213p200n861l645
62087I15862j096J247L049M364N538O859Q458J0480J3067J6110J9237K2160K4852
62074A050187K7376K9747L1894L3506L3993L3007L0990K8818K6944K5311K3989
$$ y = [851061, 886057, 923946, 964332, 1006617, 1048632, 1087401, 1121163, 1149699, 1172820, 1189688, 1199964, 1204635, 1204982, 1201179, 1192353, 1177659, 1156888, 1130405, 1099023, 1063866, 1026202, 987474, 949428, 913658, 880836, 850821, 823718, 800246, 780754, 764490, 750389, 738153, 728011, 719773, 712766, 706464, 700598, 694857, 689126, 683969, 680252, 678283, 677719, 678263, 679905, 682576, 686178, 691126, 698424, 708931, 722851, 739948, 759795, 781492, 803364, 823293, 839504, 851262, 859148, 864815, 870230, 876983, 886087, 897959, 912032, 926404, 938372, 945763, 947887, 945427, 939781, 932568, 925368, 919507, 915862, 914766, 916013, 919062, 923426, 928964, 935823, 944281, 954761, 967828, 983938, 1003175, 1025335, 1050187, 1077563, 1107310, 1139204, 1172710, 1206703, 1239710, 1270700, 1299518, 1326462, 1351773, 1375762]
62063A375762K3243K2898K2357K1481K0729K0066J8549J5530J1729Q351N588K769
62051A569052k54k792m494o129q844j3031j8166k3505k8608l3236l6992l9418
62039A353583m0502m0938m1550m2467m3074m2784m1646m0115l8473l6582l4095
62028I11357l0907k7477k4525k2189j9898j7437j5659j5341j5634j4742j2289
62017F95259r886r036r467j0115j0614j0981j0705r354p632o638o236n161k842
62004E86592j55J772K822L624M612N661O322O217N355M145K936J693L18q81j548
61989F29485j950k808m413o319p974r207j0026j0325j0039r358q544p692o841
61976E33989o161n860n921o040n866n275m372l240j915o88j74p26j859k598k508
$$ y = [1375762, 1399005, 1421903, 1444260, 1465741, 1486470, 1506536, 1525085, 1540615, 1552344, 1560695, 1566283, 1569052, 1568798, 1566006, 1561512, 1555383, 1546539, 1533508, 1515342, 1491837, 1463229, 1429993, 1393001, 1353583, 1313081, 1272143, 1230593, 1188126, 1145052, 1102268, 1060622, 1020507, 982034, 945452, 911357, 880450, 852973, 828448, 806259, 786361, 768924, 753265, 737924, 722290, 707548, 695259, 685373, 676337, 666870, 656755, 646141, 635160, 624455, 615101, 607469, 600831, 594595, 589434, 586592, 586437, 588209, 591031, 594655, 599267, 604928, 611250, 617467, 622822, 626967, 629903, 631596, 631914, 631033, 629485, 627535, 624727, 620314, 613995, 606021, 596814, 586788, 576463, 566424, 557066, 548522, 540830, 533989, 527828, 521968, 516047, 510007, 504141, 498866, 494494, 491254, 489339, 488651, 488477, 487751, 485892, 483294, 480786]
61961D80786j993j603j434j257q52j12Q45J546J651J622K394M105N760O460O433
61946E04351O516P134Q264R825J1615J3256J4741J6578J8861K0721K1385K1364
61934F74611K1720K2488K2704K1889K0625J9588J8747J7705J6215J4198J1714
61923H82204R051O437L646L12l339o558q846j0180j0551r768p908n366k366J205
61909H37973N282R407J3119J6286J8851K0609K1357K1009J9469J6653J2682P861
61897A020558K498k976p809j1340j3685j5693j7998k0378k2060k2497k1868k0968
61885H45784k0561k0549j9967j8159j5779j4155j3723j3646j3065j2139j1564
61874F72477j1495j1390j0725r523q134o743n271l745k485j675q52N82K397L719
$$ y = [480786, 478793, 477190, 475756, 474499, 473647, 473535, 474380, 475926, 477577, 479199, 481593, 485698, 491458, 497918, 504351, 510867, 518001, 526265, 536090, 547705, 560961, 575702, 592280, 611141, 631862, 653247, 674611, 696331, 718819, 741523, 763412, 784037, 803625, 822372, 840077, 856292, 870490, 882204, 891255, 897692, 901338, 901650, 898311, 891753, 882907, 872727, 862176, 852408, 844500, 839134, 836768, 837973, 843255, 852662, 865781, 882067, 900918, 921527, 942884, 963893, 983362, 1000015, 1012697, 1020558, 1023056, 1020080, 1012271, 1000931, 987246, 971553, 953555, 933177, 911117, 888620, 866752, 845784, 825223, 804674, 784707, 766548, 750769, 736614, 722891, 709245, 696180, 684041, 672477, 660982, 649592, 638867, 629344, 621210, 614467, 609196, 605451, 602966, 601291, 600439, 601021, 603418, 607137]
61860F07137M439N652Q104J0966J3037J4673J7262K0985K4415K6638K8559L1478
61848H13345L5182L8213L9610L9708L9360L8873L7749L5222L1073K5782J9858
61837A193975J3311O207n40n771r434j2426j4916j5673j3644r474m789m44L860
61824A130242Q541J3397J7761K0842K1989K1027J8370J4535R617L520l439j0565
61812A265837j7325k3520k8959l3254l6046l7283l7239l6368l5038l3288l0927
61801I16590k7988k4968k2499k0783j9564j8481j7278j5744j3765j1614r959r264
61789G04683r192q835p726o332n291m452l226j773j076j531k268k327j922j786
61775F46946j815j311k60O12J047J528K247K716K655K433K309K002J465J349K128
$$ y = [607137, 611576, 617228, 625332, 636298, 649335, 664008, 681270, 702255, 726670, 753308, 781867, 813345, 848527, 886740, 926350, 966058, 1005418, 1044291, 1082040, 1117262, 1148335, 1174117, 1193975, 1207286, 1213493, 1212953, 1207182, 1197748, 1185322, 1170406, 1154733, 1141089, 1131615, 1126826, 1126382, 1130242, 1138783, 1152180, 1169941, 1190783, 1212772, 1233799, 1252169, 1266704, 1276321, 1279841, 1276402, 1265837, 1248512, 1224992, 1196033, 1162779, 1126733, 1089450, 1052211, 1015843, 980805, 947517, 916590, 888602, 863634, 841135, 820352, 800788, 782307, 765029, 749285, 735520, 723906, 713947, 704683, 695491, 686656, 678930, 672598, 667307, 662855, 659629, 657856, 656780, 655249, 652981, 650654, 648732, 646946, 645131, 643820, 643560, 644172, 645219, 646747, 648994, 651710, 654365, 656798, 659107, 661109, 662574, 663923, 666051]
61760F66051L263L784L332K264J146M69M36O61N25L2k53k87p94j931k700k413
61744F73585j972k573l745l924k730j418j033j214j174q42o13o48r00j295j509
61729F47995j057P9J279K034K382K463K172J657J582K349L395L883L814L888M367
61714F82282M672M186K983J625N49j95q16j514k240k698k715k535k532k739k919
61699F75394k983l005k856k273j438r85j147j321q34J51R42J227J165Q14J83k17
61683F62817L17J632K638K656K257K325K798K977K673K313K108J820J387J135
61669F91853J146R58J38j106k120k405j992j451j517k432l571m030l582k855k536
61654F64498k744l197l528l347k408r87K15P89R59J084J133R97R42J264J662J444
$$ y = [666051, 669314, 673098, 676430, 678694, 679840, 680309, 680745, 681406, 681931, 681963, 681710, 681423, 680629, 678698, 675998, 673585, 671613, 669040, 665295, 661371, 658641, 657223, 656190, 654976, 653802, 652960, 652347, 651699, 650799, 649504, 647995, 646938, 647017, 648296, 650330, 652712, 655175, 657347, 659004, 660586, 662935, 666330, 670213, 674027, 677915, 682282, 686954, 691140, 694123, 695748, 696297, 696102, 695286, 693772, 691532, 688834, 686119, 683584, 681052, 678313, 675394, 672411, 669406, 666550, 664277, 662839, 661854, 660707, 659386, 658552, 658703, 659645, 660872, 662037, 662851, 663034, 662817, 663134, 664766, 667404, 670060, 672317, 674642, 677440, 680417, 683090, 685403, 687511, 689331, 690718, 691853, 692999, 693957, 694095, 692989, 690869, 688464, 686472, 685021, 683504, 681072, 677501, 673471, 669889, 667034, 664498, 661754, 658557, 655029, 651682, 649274, 648287, 648502, 649291, 650250, 651334, 652467, 653464, 654406, 655670, 657332, 658776]
61638F58776M46o50j114j051j285k390m037n343n758n451m925m472m114l809l480
61623F11343k979k310j816j815k132k179j566m35P55J495J391M64o88j336j434
61608E96758j687k698m247n607o287o341o061n644n166m747m587m709m670l920
61594E30387k557j461j324j860k352k623k941l184k941k377k214k641k996k813
61580D96103k513k575k693k310j536r55p80p27n71l64k54l86q23j315j382r54
61564D75965n73p07j132j400j543j818k079j985j631j349j068n38k1p3n66o86
61548D58796j12N32O30M12L40K93o6m50j99P49J714K150K096J765J208O77P80
61531D71315J727K714K593J231l09r73q15o42j014j842k751l465l820l773l418
$$ y = [658776, 659222, 658572, 657458, 656407, 655122, 652732, 648695, 643352, 637594, 632143, 627218, 622746, 618632, 614823, 611343, 608364, 606054, 604238, 602423, 600291, 598112, 596546, 596111, 596866, 598361, 599752, 600216, 599528, 598192, 596758, 595071, 592373, 588126, 582519, 576232, 569891, 563830, 558186, 553020, 548273, 543686, 538977, 534307, 530387, 527830, 526369, 525045, 523185, 520833, 518210, 515269, 512085, 509144, 506767, 504553, 501912, 498916, 496103, 493590, 491015, 488322, 486012, 484476, 483521, 482741, 482014, 481443, 481079, 480825, 480439, 479616, 478301, 476919, 475965, 475392, 474685, 473553, 472153, 470610, 468792, 466713, 464728, 463097, 461748, 460680, 460142, 460121, 460048, 459482, 458796, 458684, 459216, 459846, 460258, 460598, 460891, 460825, 460375, 460176, 460925, 462639, 464789, 466885, 468650, 469858, 470535, 471315, 473042, 475756, 478349, 479580, 479271, 478298, 477483, 476841, 475827, 473985, 471234, 467769, 463949, 460176, 456758]
61516D56758k914k359j843j462j178q15l80k60p44j498j843j551j035o91m39l6
61500D37710M06N04P1o59j296j647j712j479q94j99On49j164p84N34J475J189
61483D31512M72N64J292J411O10N1P24K103K882K458J299K17l11l81m48p68j088
61466D42599j060p51m42j44J58J54k90n10J56J147J336P82O13J047R84N0n05K03
61448D45527J114Q65l5j30O38J019N47N4J53N49R84J714K784L697M160M360M389
61431D72389M035L322K620K059J473R82R38J199J207R15Q47J062R78N68P90K153
61415D97537L687M097L472K896K766K445J471K06q85j866k877l662l912l791l700
61400D97884l746l757l653l494l258k846k297j751j194n61pJ77L1o6J5p3n14q53
$$ y = [456758, 453844, 451485, 449642, 448180, 447002, 446187, 445807, 445547, 444803, 443305, 441462, 439911, 438876, 438185, 437746, 437710, 438116, 438620, 438691, 438032, 436736, 435089, 433377, 431898, 431004, 430805, 430811, 430262, 429098, 428314, 428848, 430323, 431512, 431984, 432548, 433840, 435251, 435861, 435912, 436636, 438739, 441621, 444079, 445378, 445595, 445284, 444903, 444455, 443687, 442599, 441539, 440788, 440346, 440202, 440360, 440514, 440224, 439714, 439870, 441017, 442353, 443135, 443748, 444795, 445779, 445829, 445324, 445527, 446641, 447506, 447471, 447341, 447979, 448998, 449545, 449599, 449752, 450301, 451285, 452999, 455783, 459480, 463640, 468000, 472389, 476424, 479746, 482366, 484425, 485898, 486880, 487818, 489017, 490224, 491139, 491986, 493048, 494026, 494594, 495384, 497537, 501224, 505321, 508793, 511689, 514455, 516900, 518371, 518577, 517692, 515826, 512949, 509287, 505375, 501584, 497884, 494138, 490381, 486728, 483234, 479976, 477130, 474833, 473082, 471888, 471327, 471320, 471497, 471528, 471462, 471477, 471404, 470890, 470037]
61382D70037n61J51N55L96J68L81R48J400J355P27j93q17o88R5J099K140L225
61365D80418M013L958L123K328K198K521K809L010L362L857M277M452M283L747
61351E28356L172L161L975N245O522P767R023J0062J0733J1280J1917J2355J2212
61338F35780J1568J0659R241O909L955J401o1p58j562k839m100m672m605m625
61324F56291n079n331m661l434k649k439j914p24K07oq68j165m46P61J778K291
61308F32612K375K566L500N059O279O598O675P471Q995J0636J2139J3475J4139
61295G32519J3537J1826R638P082L814k9l713o650q651r599r566r128q849q595
61281G13636p980p244o846o435n251l535k415k159j589K81K826M663N283N285
$$ y = [470037, 469476, 469627, 470182, 470578, 470746, 471127, 472075, 473475, 474830, 475557, 475364, 474547, 473859, 473954, 475053, 477193, 480418, 484431, 488389, 491512, 493840, 496038, 498559, 501368, 504378, 507740, 511597, 515874, 520326, 524609, 528356, 531528, 534689, 538664, 543909, 550431, 558198, 567221, 577283, 588016, 599296, 611213, 623568, 635780, 647348, 658007, 667248, 674157, 678112, 679513, 679452, 678694, 677132, 674293, 670193, 665521, 660916, 656291, 651212, 645881, 641220, 637786, 635137, 632698, 630784, 630060, 630267, 630261, 629393, 628228, 627782, 628543, 630321, 632612, 634987, 637553, 641053, 646112, 652391, 658989, 665664, 673135, 682130, 692766, 704905, 718380, 732519, 746056, 757882, 767520, 774602, 778416, 778387, 774674, 768024, 759373, 749774, 740208, 731080, 722231, 713636, 705656, 698412, 691566, 685131, 679880, 676345, 673930, 671771, 670182, 670463, 673289, 677952, 683235, 688520]
61267F88520N378N756O275O763P156P498P718P515O723N856N901P371R789J2249
61253G90468J4217J5682J6747J7270J6848J5117J2058P971L203j842o420r642
61241H91677j1246j1851j2071j1799j0803r551q786q466p827o448m696l124j894
61228G83115q29L19J581K516K575K065K275M015O421P984Q415Q611R060R362R274
61213H56759R061Q543O982M432K284J735K341K794K678K640L136L816M218M430
61199I15849M755N173N522O131P667J0186J2728J4343J5329J6837J9279K1822
61187A055621K3566K4533K5051K4910K3679K1399J8412J4978J1516Q680O638M733
61175A263716K473L11j206k437m012n770p231q730j1024j4060j7041j9496k1407
$$ y = [688520, 693898, 699654, 705929, 712692, 719848, 727346, 735064, 742579, 749302, 755158, 761059, 768430, 778219, 790468, 804685, 820367, 837114, 854384, 871232, 886349, 898407, 906378, 909581, 907739, 901319, 891677, 880431, 868580, 856509, 844710, 833907, 824356, 815570, 807104, 799277, 792829, 788133, 785009, 783115, 782286, 782605, 784186, 786702, 789277, 791342, 793617, 797632, 804053, 812037, 820452, 829063, 838123, 847485, 856759, 865820, 874363, 881345, 885777, 888061, 889796, 892137, 894931, 897609, 900249, 903385, 907201, 911419, 915849, 920604, 925777, 931299, 937430, 945097, 955283, 968011, 982354, 997683, 1014520, 1033799, 1055621, 1079187, 1103720, 1128771, 1153681, 1177360, 1198759, 1217171, 1232149, 1243665, 1252345, 1258983, 1263716, 1266189, 1266500, 1265294, 1262857, 1258845, 1253075, 1245844, 1237114, 1226090, 1212030, 1194989, 1175493, 1154086]
61162A154086k2700k3432k4158k5037k5051k3280k0648j9042j8836j8617j7330
61151I15955j5341j3237j1021q818p096n752m027j745L81J995L573N258O259N943
61137H72327M622K818O64j496k830k946k367j629n63J073L004M926O927R124J1428
61122I05082J3997J7155K0583K3319K4911K5942K7155K8799L0937L3542L6002
61111A187424L7350L7380L6755L5806L4129L1663K9145K7054K4972K2468J9719
61100A523865J6791J3220Q849M320J78l717p550j1146j4733j9113k4428k9559
61088A456977l3410l6069l8032l9118l8942l7880l6756l5877l4907l3396l1075
61077A061515k8052k4936k2339k0109j7672j5127j3105j1429r069n830k974j579
$$ y = [1154086, 1131386, 1107954, 1083796, 1058759, 1033708, 1010428, 989780, 970738, 951902, 933285, 915955, 900614, 887377, 876356, 867538, 860442, 854690, 850663, 848918, 849299, 851294, 854867, 860125, 866384, 872327, 876949, 879767, 880431, 878935, 876105, 873159, 870792, 869163, 868600, 869673, 872677, 877603, 884530, 893654, 905082, 919079, 936234, 956817, 980136, 1005047, 1030989, 1058144, 1086943, 1117880, 1151422, 1187424, 1224774, 1262154, 1298909, 1334715, 1368844, 1400507, 1429652, 1456706, 1481678, 1504146, 1523865, 1540656, 1553876, 1562725, 1567045, 1567223, 1563506, 1555956, 1544810, 1530077, 1510964, 1486536, 1456977, 1423567, 1387498, 1349466, 1310348, 1271406, 1233526, 1196770, 1160893, 1125986, 1092590, 1061515, 1033463, 1008527, 986188, 966079, 948407, 933280, 920175, 908746, 899677, 893847, 890873, 889294]
61065H89294j222q54q9J029K602M427N652N679M992M578M977O190P894R397J0081
61050I54627J0159J0532J1687J3504J6049J9543K3430K6562K8589L0126L1511
61039A176319L2558L3662L5627L8089L9543L9481L9089L9351L9922M0392M1055
61028A595088M1755M1592M0603M0292M1619M3797M5861M7948N0265N2236N3512
61017B094568N4548N5602N6751N9303O5164P4337Q5062R7020J11778J29216J46444
61006C029793J61836J77720J97818K24957K62532L14783L83649M68800N72631
60997E794519P00941Q56496J037976J250019J508616J829449K212015K632099
60989A7822130L028427L277560L204073K677399J747570O80913j77010o04643
$$ y = [889294, 888072, 887218, 887129, 888158, 890760, 895187, 900839, 906518, 911510, 916088, 921065, 927255, 935149, 944546, 954627, 964786, 975318, 987005, 1000509, 1016558, 1036101, 1059531, 1086093, 1114682, 1144808, 1176319, 1208877, 1242539, 1278166, 1316255, 1355798, 1395279, 1434368, 1473719, 1513641, 1554033, 1595088, 1636843, 1678435, 1719038, 1759330, 1800949, 1844746, 1890607, 1938555, 1988820, 2041056, 2094568, 2149116, 2204718, 2261469, 2320772, 2385936, 2460273, 2545335, 2642355, 2754133, 2883349, 3029793, 3191629, 3369349, 3567167, 3792124, 4054656, 4369439, 4753088, 5221888, 5794519, 6495460, 7351956, 8389932, 9639951, 11148567, 12978016, 15190031, 17822130, 20850557, 24128117, 27332190, 30009589, 31757159, 32438072, 32261062, 31656419]
60981C1656419n92950k72020J96687O40304Q46867O15519j03608j123810k111771
60972B9751637k789990l071673l034803k808706k495161k158315j837892j552436
60964A0002661j302701j084679q98345p43440o14890n07459m20349l53386l02433
60955C774979k62133k30025k04882j83946j64962j48449j35097j22925j09700
60946B212860r6164q4445p5017o7524o2777o1445o2207o3272o4385o5479o5025
60935A445120o1958n7755n4372n1455m7654m3415m0134l7630l4730l1588k9274
60924I55155k7668k5721k3328k1149j9171j7060j5410j4972j5091j4436j2769
60913G48380j0749q627o458m904m359l967k820j518j085j223j064r38j679k760
$$ y = [31656419, 31063469, 30791449, 30988136, 31628440, 32475307, 33090826, 32987218, 31863408, 29751637, 26961647, 23889974, 20855171, 18046465, 15551304, 13392989, 11555097, 10002661, 8699960, 7615281, 6716936, 5973496, 5358606, 4851147, 4430798, 4077412, 3774979, 3512846, 3282821, 3077939, 2893993, 2729031, 2580582, 2445485, 2322560, 2212860, 2116696, 2032251, 1957234, 1889710, 1826933, 1765488, 1703281, 1640009, 1575624, 1510145, 1445120, 1383162, 1325407, 1271035, 1219580, 1171926, 1128511, 1088377, 1050747, 1016017, 984429, 955155, 927487, 901766, 878438, 857289, 838118, 821058, 805648, 790676, 775585, 761149, 748380, 737631, 729004, 722546, 717642, 713283, 709316, 706496, 704978, 703893, 702670, 701606, 700668, 698989, 696229]
60899F96229k859j946j249j385j905k428k913l065k633k098k015k042j649j199
60885F66843j228j279o39K83N49J38l82j058k171l221l595l687m163m733m929
60870F36728n396o861q447q649p519o355n643m974m495m638m662l392j330j80
60856E64187k22M2J324K484K501J872J434J174J000J441K728M119M818M950N111
60841E98963N474N751N546M569K992J614J132J313J421J279J190J180J082J129
60827F34635J526J747J264O33P39J248J072K73M4O96J057K30j212k280k787l125
60811F35760l601m375n334n903n710n473o311q074r384r457q859q284p606o590
60797E40799n597n042m823m654m405l910l043k178j870k024k061j892j906j995
$$ y = [696229, 693370, 691424, 690175, 688790, 686885, 684457, 681544, 678479, 675846, 673748, 671733, 669691, 668042, 666843, 665615, 664336, 663697, 663980, 664529, 664667, 664285, 663227, 661056, 657835, 654240, 650553, 646390, 641657, 636728, 631332, 624471, 616024, 607375, 599856, 593501, 587858, 582884, 578389, 573751, 569089, 565697, 564367, 564187, 563965, 564007, 565331, 567815, 570316, 572188, 573622, 574796, 575796, 577237, 579965, 584084, 588902, 593852, 598963, 604437, 610188, 615734, 620303, 623295, 624909, 626041, 627354, 628775, 630054, 631244, 632424, 633506, 634635, 636161, 637908, 639172, 639805, 640544, 641792, 642864, 643137, 643181, 643877, 644934, 645164, 643952, 641672, 638885, 635760, 632159, 627784, 622450, 616547, 610837, 605364, 599053, 590979, 581595, 572138, 563279, 554995, 547389, 540799, 535202, 530160, 525337, 520683, 516278, 512368, 509325, 507147, 505277, 503253, 501192, 499300, 497394, 495399]
60783D95399j542n43K17L68M24P50R77Q30O52P23Q04P99J084J854K749L526M421
60766E13492N506O364O817P348Q351R439R886R417Q322P165O481O322O150N619
60752F16679N268N679O172N393L286J385Q72J321J759J851J558O10q85k074k385
60737F46489k400l093m586o227p430p984p984p879q181q735q757p922o942o638
60723E51731o920p131o966o557o049n512m986m313l203j759n90p6J02M18Q61J163
60707E00213J299J475J851K493L389M302M944N345N744O167O484O842P487Q124
60693E66159Q129P446O645N966N110M092L463L340L001J944O43j85m70m78l13
60678F14492j95n85j421j779r96L68J260J421J346J388J569J976K662L381L934
$$ y = [495399, 493857, 493314, 493531, 493899, 494323, 495073, 496050, 496880, 497532, 498255, 499059, 499858, 500942, 502796, 505545, 509071, 513492, 518998, 525362, 532179, 539527, 547878, 557317, 567203, 576620, 584942, 592107, 598588, 604910, 611060, 616679, 621947, 627626, 633798, 639191, 642477, 643862, 644734, 646055, 647814, 649665, 651223, 651833, 650948, 648874, 646489, 644089, 640996, 636410, 630183, 622753, 614769, 606785, 598906, 590725, 581990, 573233, 565311, 558369, 551731, 544811, 537680, 530714, 524157, 518108, 512596, 507610, 503297, 500094, 498335, 497745, 497669, 497771, 498189, 499050, 500213, 501512, 502987, 504838, 507331, 510720, 515022, 519966, 525311, 531055, 537222, 543706, 550548, 558035, 566159, 574288, 581734, 588379, 594345, 599455, 603547, 607010, 610350, 613351, 615295, 615938, 615753, 615283, 614805, 614492, 614297, 613712, 612291, 610512, 609516, 609884, 611144, 612565, 613911, 615299, 616868, 618844, 621506, 624887, 628821]
60663F28821M581N601O732P542Q097Q698R293R769J0583J2273J4485J6220J7177
60650G59872J8147J9843K1980K3764K4840K5346K5363K4817K3807K2613K1308
60639A011700J9575J7071J3840J0257O707L452O64j691m047o888j0022j2483j3440
60626A034695j3097j2441j2304j2814j3514j3670j2756j1015r425q771q969r541
60614H96378j0358j1382j2129j2120j1641j1303j1053j0408r556r268r685j0120
60602G67355j0239j0467j0931j0996j0341r670r666r884r427q259p139o472n961
60589F47903n227m338l566l031k618k153j608j095o16K2P76J126P02M3J45J308
60573F27773K949M536O085P659R124J0592J2544J5186J8112K0839K3279K5547
$$ y = [628821, 633402, 639003, 645735, 653277, 661374, 670072, 679365, 689134, 699717, 711990, 726475, 742695, 759872, 778019, 797862, 819842, 843606, 868446, 893792, 919155, 943972, 967779, 990392, 1011700, 1031275, 1048346, 1062186, 1072443, 1079150, 1082602, 1083266, 1081575, 1077528, 1070640, 1060618, 1048135, 1034695, 1021598, 1009157, 996853, 984039, 970525, 956855, 944099, 933084, 923659, 914888, 905919, 896378, 886020, 874638, 862509, 850389, 838748, 827445, 816392, 805984, 796428, 787160, 777475, 767355, 757116, 746649, 735718, 724722, 714381, 704711, 695045, 685161, 675734, 667475, 660336, 653864, 647903, 642676, 638338, 634772, 631741, 629123, 626970, 625362, 624267, 623651, 623673, 624449, 625575, 626277, 626320, 626465, 627773, 630722, 635258, 641343, 649002, 658126, 668718, 681262, 696448, 714560, 735399, 758678, 784225]
60561G84225K7715K9709L1012L0489K7197K1421J4343O759j082q500j4285j7886
60549I31117j9681j9829j7926j4240j0134o543k941J402O069J0307J4392J9111
60537H91104K4374K9347L3604L7120L9375L9380L6612L1263K3782J4764N210l837
60525A202098j1771j8077k1856k2444k0413j7240j3970j0759p711n384m261m116
60513A044096m176l687k253J19L135O330R046J0526J0553J0057J0524J2504J5258
60500A122032J8124K1645K6859L4016M2666N2513O3405P4697Q5384R4852J02821
60489A739014J08573J10814J08454J01113Q8864P1869N0580K6087J27k5423m9208
60478B330864p0562q8875j02981j11797j15482j15323j12260j06322r7802q8067
$$ y = [784225, 811940, 841649, 872661, 903150, 930347, 951768, 966111, 972870, 971788, 963288, 949003, 931117, 911436, 891607, 873681, 859441, 849307, 842764, 839823, 841225, 847294, 857601, 871993, 891104, 915478, 944825, 978429, 1015549, 1054924, 1094304, 1130916, 1162179, 1185961, 1200725, 1205935, 1202098, 1190327, 1172250, 1150394, 1127950, 1107537, 1090297, 1076327, 1065568, 1057857, 1052473, 1048212, 1044096, 1039920, 1036233, 1033980, 1034099, 1037234, 1043564, 1052610, 1063136, 1073689, 1083746, 1094270, 1106774, 1122032, 1140156, 1161801, 1188660, 1222676, 1265342, 1317855, 1381260, 1455957, 1541341, 1636193, 1739014, 1847587, 1958401, 2066855, 2167968, 2256832, 2328701, 2379281, 2405368, 2405495, 2380072, 2330864, 2260302, 2171427, 2068446, 1956649, 1841167, 1725844, 1613584, 1507262, 1409460, 1321393]
60468A321393p8513o9409o0626n2802m6794m2272l8003l3492k9422k6381k4041
60457H19638k1788j9438j7007j4397j1765r778q998r138r184q397p045o055n933
60444F70715o137n784m761l710l016k455j985k032k595k773j849k70J007J655
60430F36010J788J259jj305j865j916k287l017l325k937k468k386k416k268k072
60415F10794j861j272k16P85J297J498J670J678J345R65R18J116J127P30J4p90
60399F19798j331j270o94k00k23m27j50O50J318J389J152J098J194J058O50L62
60383F24374L86L99J38q2K31R45J371J089L57l26p44r13q26m92k0M74R55J376
60365F28692J583J386P26j86p90n23N67J744K390K618K802K820K333J508Q58N75
$$ y = [1321393, 1242880, 1173471, 1112845, 1060043, 1013249, 970977, 932974, 899482, 870060, 843679, 819638, 797850, 778412, 761405, 747008, 735243, 725465, 716467, 707329, 698145, 689748, 682703, 676648, 670715, 664578, 658794, 654033, 650323, 647307, 644852, 642867, 640835, 638240, 635467, 633618, 633348, 634355, 636010, 637798, 639057, 639056, 637751, 635886, 633970, 631683, 628666, 625341, 622404, 619936, 617550, 615134, 612866, 610794, 608933, 607661, 607445, 608230, 609527, 611025, 612695, 614373, 615718, 616683, 617601, 618717, 619844, 620574, 620588, 619798, 618467, 617197, 616503, 616303, 616080, 615653, 615503, 616153, 617471, 618860, 620012, 621110, 622304, 623362, 624012, 624374, 624760, 625159, 625297, 625215, 625446, 626391, 627762, 628851, 629208, 628882, 628138, 627225, 626399, 625907, 625887, 626361, 627316, 628692, 630275, 631661, 632387, 632201, 631411, 630888, 631455, 633199, 635589, 638207, 641009, 643829, 646162, 647670, 648528, 649103]
60349F49103O07J144K145K749K176J143J177K399L317L152K969L756M706M454
60335F84997L093J800J091N61p1p07j390k177k728k732k514k496k409j803j063
60320F71452r82j444j353J5K143L899M627M606M711N526O724P579Q150R362J1675
60305G36690J4449J7044J9825K3546K8407L4240M0604M5890M7286M3009L4150
60294A085140K3223J1391j689j5602k8258l7378m1934m2103l8846l3751k8449
60283H51744k3739j9577j5842j2553r656p208n554m836m575m399m651n575o403
60270G27176o267n569n363n682n603m828l959l346k775k280k187k264j914j241
60256F73898q86q54n53o7j33p33q70j11P27Q59M88J36r8k23q9J50J06j58j38K05
$$ y = [649103, 649710, 650854, 652999, 655748, 657924, 659067, 660244, 662643, 665960, 669112, 672081, 675837, 680543, 684997, 688090, 689890, 690981, 691542, 691471, 690764, 689374, 687197, 684469, 681737, 679223, 676727, 674318, 672515, 671452, 670470, 669026, 667673, 667688, 669831, 673730, 678357, 682963, 687674, 693200, 699924, 707503, 715653, 725015, 736690, 751139, 768183, 788008, 811554, 839961, 874201, 914805, 960695, 1007981, 1050990, 1085140, 1108363, 1119754, 1118065, 1102463, 1074205, 1036827, 994893, 952790, 913944, 880193, 851744, 828005, 808428, 792586, 780033, 770377, 763169, 757615, 752779, 748204, 743805, 739154, 733579, 727176, 720909, 715340, 709977, 704295, 698692, 693864, 689905, 686559, 683784, 681504, 679317, 677053, 675139, 673898, 673012, 672158, 671605, 671538, 671405, 670672, 669802, 669691, 670418, 671277, 671765, 671901, 671803, 671580, 671491, 671641, 671747, 671589, 671451, 671656]
60236F71656M18M67Q03J343J444J107J168J971K884L477M196N332O253O239N346
60221G14104M028K656J730J721K293K458J865J192R88J003R37R48J082J209J762
60206G39976L328N161N434L668J604Q64J006Q47M29L60L11l39j055q12J78P12
60190G61672K88n76j455k328k975l065k776k479k046j243n45o14j150j234p15
60175G38759l53n44q48p95m58m6L78O83P25O74Q37J181J499J924K679L442L603
60158G53340L157K733K718K905K951K694J981Q38k26o22n12o18j071j063P9J985
60142G71269L726M884N749O709P805Q867R831J0818J1875J2736J2897J2036J0179
60129H89381P521M239O43k833n919q583j0576j1313j0538q859p163n614l758j567
$$ y = [671656, 672074, 672541, 673344, 674687, 676131, 677238, 678406, 680377, 683261, 686738, 690934, 696266, 702519, 708758, 714104, 718132, 720788, 722518, 724239, 726532, 728990, 730855, 732047, 733035, 734038, 734975, 735923, 737005, 738214, 739976, 743304, 748465, 753899, 757567, 759171, 760035, 761041, 761888, 762317, 762677, 762988, 762649, 761594, 760782, 760960, 761672, 761960, 761384, 759929, 757601, 754626, 751561, 748785, 746306, 744260, 743017, 742472, 741858, 740708, 739474, 738759, 738406, 737862, 737014, 736219, 735761, 735715, 736093, 736776, 737501, 738175, 739012, 740193, 741692, 743616, 746295, 749737, 753340, 756497, 759230, 761948, 764853, 767804, 770498, 772479, 773317, 773091, 772469, 771957, 771339, 770268, 769205, 769284, 771269, 774995, 779879, 785628, 792337, 800142, 809009, 818840, 829658, 841533, 854269, 867166, 879202, 889381, 896902, 901141, 901784, 898951, 893032, 884449, 873873, 862560, 852022, 843163, 836000, 830386, 826628, 825061]
60115H25061J52O44J39m19m80l55n15p22k49R97K042J875O71m29o14m8O34R25
60097H29309N98j40n48k1J018J429Q48J63L17J265K517L976N625O961P486P470
60081H68273P479P452O856N668M409L234J607q94l936o734q749r917j0475j0667
60067H53606j0492r753q487p224o611o759p163p261o906o315n693n082m530m245
60053G57085m386m646m414l582k924l221m212m857m602l861l247k882k548k006
60039G05697j044L41J707K579L110L789M471M411L428K272J544J033M50M8p3n73
60023G33190k007l859n158n716o113o737p456q051q368q218p632p067o892o817
60009F43099o231n044l769k919k644k777k963k842k399j927j476o97M40J245J114
$$ y = [825061, 825213, 825857, 825996, 825577, 825097, 824742, 824227, 823505, 823256, 824253, 826295, 828170, 828841, 828412, 827798, 827750, 828384, 829309, 829907, 829767, 829219, 829198, 830216, 831645, 832493, 832656, 832973, 834238, 836755, 840731, 846356, 853317, 860803, 868273, 875752, 883204, 890060, 895728, 900137, 903371, 904978, 904084, 900148, 893414, 884665, 874748, 864273, 853606, 843114, 833361, 824874, 817650, 811039, 804280, 797117, 789856, 782950, 776635, 770942, 765860, 761330, 757085, 752699, 748053, 743639, 740057, 737133, 733912, 729700, 724843, 720241, 716380, 713133, 710251, 707703, 705697, 704653, 704994, 706701, 709280, 712390, 716179, 720650, 725061, 728489, 730761, 732305, 733338, 733788, 733836, 733763, 733190, 731183, 727324, 722166, 716450, 710337, 703600, 696144, 688093, 679725, 671507, 663875, 656808, 649916, 643099, 636868, 631824, 628055, 625136, 622492, 619715, 616752, 613910, 611511, 609584, 608108, 607411, 607851, 609096, 610210]
59994F10210M63L58J254K618L672M159M272M191L884L289K643K438K811L195K929
59979F52386K195J765J874J895J351N62K1k92n77p28o30n57q25j308j599j422
59963F54111p45J97Q73Q90N71N82R89J224J042P13K35p42j986k656k577k532k857
59946F47332k791j841o92k4N02J173J214Mj588k341k389k576k774k252j272q25
59930F28860j010j002m85J36Q53K104L610M358L969L100K348J710J240J293J828
59915F52912K255K198J798J142J93o85q65l24L11O49Q31Q60M97j44n94p82j063
59898F59189j333r10M16J855K531K409K055J957K288L005L876M689N504O519P652
59883G01702Q602R219R508R419R057Q876R263R975J0414J0260R458P962N904L762
$$ y = [610210, 610673, 611031, 612285, 614903, 618575, 622734, 627006, 631197, 635081, 638370, 641013, 643451, 646262, 649457, 652386, 654581, 656346, 658220, 660115, 661466, 662028, 662049, 661757, 661180, 660452, 659822, 659265, 658440, 657132, 655533, 654111, 653366, 653563, 654436, 655326, 655897, 656479, 657468, 658692, 659734, 660447, 660682, 659940, 657954, 655298, 652721, 650189, 647332, 644541, 642700, 642008, 641984, 642486, 643659, 644873, 644877, 643289, 640948, 638559, 635983, 633209, 630957, 629685, 628860, 627850, 626848, 626363, 626499, 627352, 629456, 633066, 637424, 641393, 644493, 646841, 648551, 649791, 651084, 652912, 655167, 657365, 659163, 660305, 660498, 659813, 658948, 658624, 658935, 659584, 660415, 661275, 661772, 661628, 661034, 660252, 659189, 657856, 656946, 657362, 659217, 661748, 664157, 666212, 668169, 670457, 673462, 677338, 682027, 687531, 694050, 701702, 710304, 719523, 729031, 738450, 747507, 756383, 765646, 775621, 786035, 796295, 805753, 813715, 819619, 823381]
59869H23381J773m91l379o426q948j0865j2180j2256j0724q689p662p491o647
59856G29396m693l055k898l498l401k281r28K8O84J588L206N423P385Q349Q728
59841G44033R709J1687J3714J4608J3913J1573P642K915p97j898m06K282M804
59828H33779O567P244O164K689k757q419j2456j4494j5472j6005j5679j4326j2989
59815G43846j2699j2916j2218j0232p894o081m952m396m151l559k192p47l51j027
59801F60431j738j836j556j212r07j011j820k692k664j979j850k617l355l531
59787F31663l724m288m548l960l054k530k272j800r67J64J434K203J789O24J8
59772F10752M15R12Q25O04O44L78o16j620j796j399j139j038p82n17m23j40O38
$$ y = [823381, 825154, 824663, 821284, 814858, 805910, 795045, 782865, 770609, 759885, 751196, 743534, 736043, 729396, 724703, 721648, 718750, 715252, 711851, 709570, 708642, 708670, 709354, 710942, 714148, 719571, 726956, 735305, 744033, 753742, 765429, 779143, 793751, 807664, 819237, 826879, 829794, 828997, 827099, 826693, 828975, 833779, 840346, 847590, 853754, 856443, 853686, 845267, 832811, 818317, 802845, 786840, 771161, 756835, 743846, 731147, 718231, 706013, 695781, 687887, 681806, 676854, 672458, 668307, 664748, 662556, 661809, 661458, 660431, 658693, 656857, 655301, 654089, 653182, 652171, 650351, 647659, 644995, 643016, 641166, 638549, 635194, 631663, 627939, 623651, 619103, 615143, 612089, 609559, 607287, 605487, 604520, 604684, 606118, 608321, 610110, 610734, 610752, 611167, 612079, 612904, 613508, 614152, 614530, 613914, 612294, 610498, 609099, 607960, 606922, 606140, 605623, 605200, 605060, 605698]
59755F05698J493J941K212K706L190L271L153L217L352L331L346L494L305K485
59741F46194J572J170J038P05M50P81J376J436Q42J33l90q55j247j394j371j370
59725F49070j311j083q91q88p90l84k4l9q0K62N88K86l54m67N7M91M78M56P87
59706F46164J229J543J966K663L216L072K338J733J749K097K107J634J323J802
59692F74636K848L671L840L458K528Q89j097k471k694k223j759j348o39L90J344
59677F81373J783J474N65l40o98p36j172k155l117l772m492n342n591m736l326
59662F49718k247j685j278p32J20J242K020J717P68P31K247L969M383L799L505
59647F68277L671L428K514J476M16j117k948m178m512m656n095n345m802l625
$$ y = [605698, 607191, 609132, 611344, 614050, 617240, 620511, 623664, 626881, 630233, 633564, 636910, 640404, 643709, 646194, 647766, 648936, 649974, 650679, 651129, 651910, 653286, 654722, 655564, 655697, 655307, 654452, 653205, 651811, 650440, 649070, 647759, 646676, 645785, 644897, 644107, 643723, 643699, 643660, 643580, 643842, 644430, 644716, 644362, 643895, 643952, 644443, 644921, 645377, 646164, 647393, 648936, 650902, 653565, 656781, 659853, 662191, 663924, 665673, 667770, 669877, 671511, 672834, 674636, 677484, 681155, 684995, 688453, 690981, 691870, 690773, 688302, 685608, 683385, 681626, 680278, 679639, 680029, 681373, 683156, 684630, 685195, 684855, 684157, 683421, 682249, 680094, 676977, 673205, 668713, 663371, 657780, 653044, 649718, 647471, 645786, 644508, 643776, 643896, 645138, 647158, 648875, 649643, 650374, 652621, 656590, 660973, 664772, 668277, 671948, 675376, 677890, 679366, 679782, 678665, 675717, 671539, 667027, 662371, 657276, 651931, 647129, 643504]
59633F43504k415j507r34o29m22j48Q7R5N3M09J206J917K096J851J578J496J579
59616F49816J681J544Q93k94j563k168j601j39J216J648J385J399K205L338M073
59601F63433M173L781L001J973J022L96Q4m0j11m29j192j990k122j610j285j580
59585F67504j907j651j087p92p80q63j302k329l460m049m223m550m961m847m064
59570F26639l174k573k071j438q37m58r8O42J771K743K924K274J425J012J062
59555F29843J234J389J490J311P77M36Q06J482J631J341J563K685M118N345O405
59540F61856P276P911R065J1800J5878J9818K2655K4095K2739J6466N904m336
59528H21127r690r829p476m548j239K159M889O912Q595R385Q462O478N080M640
$$ y = [643504, 641089, 639582, 638648, 638019, 637597, 637449, 637536, 637631, 637684, 638093, 639299, 641216, 643312, 645163, 646741, 648237, 649816, 651497, 653041, 653934, 653640, 652077, 649909, 648308, 648169, 649385, 651033, 652418, 653817, 656022, 659360, 663433, 667606, 671387, 674388, 676361, 677383, 677779, 677863, 677823, 677712, 677283, 676091, 674101, 671979, 670369, 669084, 667504, 665597, 663946, 662859, 662067, 661287, 660424, 659122, 656793, 653333, 649284, 645061, 640511, 635550, 630703, 626639, 623465, 620892, 618821, 617383, 616546, 616088, 615990, 616632, 618403, 621146, 624070, 626344, 627769, 628781, 629843, 631077, 632466, 633956, 635267, 636044, 636480, 637286, 638768, 640399, 641740, 643303, 645988, 650106, 655451, 661856, 669132, 677043, 686108, 697908, 713786, 733604, 756259, 780354, 803093, 819559, 825463, 821127, 811437, 801608, 794132, 789584, 788345, 790504, 795393, 802305, 810900, 820285, 828747, 835225, 840305, 844945]
59514H44945M013K501N96j340l673o442q919j0536j1291j1123r985q656q313r001
59500G62776r497r065q275p796p282o054m191k464j560j651k354k956k981k556
59486F94094j984j201o3J224K450L852N608P195Q075Q619R654J1335J3145J4657
59472G76660J5518J5031J2731R139N213J401k000m126m341l412k679k264j116
59459H15755J310M574Q184J1833J4842J6669J7932J9744K1983K3447K3743K3760
59447A003776K4096K4295K3858K2713K0239J5045O526m044j4404k2754k8154l0429
59435A040763l0172k8437k6115k3846k2158k1132k0087j8359j6102j3680j0816
59424H09859p195l414j75L001O918J1014J3999J6001J8369K1424K3972K5344K6406
$$ y = [844945, 848958, 851459, 852055, 850715, 847042, 840600, 831681, 821145, 809854, 798731, 788746, 780090, 771777, 762776, 753279, 744214, 735939, 728143, 720861, 714807, 710616, 708152, 706592, 704941, 702587, 699631, 696650, 694094, 692110, 690909, 690846, 692070, 694520, 698372, 703980, 711175, 719250, 727869, 737523, 748858, 762003, 776660, 792178, 807209, 819940, 829079, 834292, 835693, 833693, 829567, 825226, 821814, 819135, 816871, 815755, 817065, 821639, 829823, 841656, 856498, 873167, 891099, 910843, 932826, 956273, 980016, 1003776, 1027872, 1052167, 1076025, 1098738, 1118977, 1134022, 1140548, 1136504, 1122100, 1099346, 1071192, 1040763, 1010591, 982154, 956039, 932193, 910035, 888903, 868816, 850457, 834355, 820675, 809859, 802664, 799250, 799075, 802076, 808994, 820008, 834007, 850008, 868377, 889801, 913773, 939117, 965523]
59411I65523K8256L0979L3550L3548K7508J3865l925j9133k7386k9219k7168k2654
59399A003744j6439r666k904L881Q907P995j304j5886k9178l6656l8189l6018
59387H38287l2263k8136k3929j9419j4845j1185q985p600o208m943m167l466k374
59374F70767j425j376j835j696o59O11J552K099K254K115K123K653L469M124M630
59359F89406N267N999O587O980P355Q008R388J1593J3780J4848J5050J5942J8311
59346H28514K1140K3204K4556K5666K6159K5583K4529K3705K2577K0117J6427
59335A082177J2416Q295L665j205n453q971j2506j6307j9602k1596k2142k1417
59323I77354j9708j7705j6228j5393j4603j3505j2414j1694j1193j0564r660q471
$$ y = [965523, 993779, 1024758, 1058308, 1091856, 1119364, 1133229, 1129304, 1110171, 1082785, 1053566, 1026398, 1003744, 987305, 977639, 974735, 978616, 987523, 995518, 994214, 978328, 949150, 912494, 874305, 838287, 806024, 777888, 753959, 734540, 719695, 708510, 699525, 691925, 685717, 680774, 676607, 673141, 670767, 669342, 667966, 666131, 664435, 663776, 664387, 665939, 668038, 670292, 672407, 674530, 677183, 680652, 684776, 689406, 694673, 700672, 707259, 714239, 721594, 729602, 738990, 750583, 764363, 779211, 794261, 810203, 828514, 849654, 872858, 897414, 923080, 949239, 974822, 999351, 1023056, 1045633, 1065750, 1082177, 1094593, 1102888, 1106553, 1105348, 1099895, 1090924, 1078418, 1062111, 1042509, 1020913, 998771, 977354, 957646, 939941, 923713, 908320, 893717, 880212, 867798, 856104, 844911, 834347, 824687, 816216]
59311H16216p051n715n004n134n560n357m118k378j043m01N8Q31J808K729L859
59296G83740N654Q092J0874J4088J7982K2229K5953K8221K7744K2836J3062R80
59284I81455r263j5368j7949j8198j6241j2396q258n167k577P56M734Q185J0640
59271I00353J2708J4975J7411J9631K1008K0840J9076J6588J4184J1705Q584M829
59259A081892Q47l297p749j2250j6184j9076k0732k1226k0961k0414j9586j8167
59247I03097j6306j4601j3139j1284q693n806l133q56P48J414J744K834M736O387
59233H47142P348Q284R221Q939O903M343K371M12k215m605n728o510q629j1867
59219H55409j4340j4997j4446j3577j2677j1762j0739r375p923p283p700p964
$$ y = [816216, 809165, 803450, 798446, 793312, 787752, 782395, 778277, 775899, 774856, 774455, 774513, 775344, 777152, 779881, 783740, 789394, 797486, 808360, 822448, 840430, 862659, 888612, 916833, 944577, 967413, 980475, 981455, 972192, 956824, 938875, 920677, 904436, 892040, 883782, 878615, 876038, 876794, 881528, 889713, 900353, 913061, 928036, 945447, 965078, 986086, 1006926, 1026002, 1042590, 1056774, 1068479, 1077063, 1081892, 1082739, 1079442, 1071693, 1059443, 1043259, 1024183, 1003451, 982225, 961264, 940850, 921264, 903097, 886791, 872190, 859051, 847767, 839074, 833268, 830135, 829279, 830027, 831441, 833185, 836019, 840755, 847142, 854490, 862774, 871995, 880934, 887837, 892180, 894551, 894963, 892748, 888143, 882415, 875905, 867276, 855409, 841069, 826072, 811626, 798049, 785372, 773610, 762871, 753496, 745573, 738290, 730590, 722626]
59207G22626o905n046l647k849k020j227r38p84j37M83J76n03m2J760L514M259
59191G08720M292L960L171K316K300L150L765L568L374M133N583O724P002O629
59177G68687O208O276O918P683Q156Q461Q932R600J0439J1664J3181J4205J4145
59164H94555J3543J3354J3635J3694J3151J2042J0246P689M859K270k52l028n712
59151I90046p880r930j2304j4316j4884j4169j3299j2694j1855j0694r802r343
59139H48876q778p797o668n572m446l430k755k174j293k78M78J085J849K605L199
59124H14901M100N597O977P605Q223R892J2136J3666J4466J5552J6905J7394J6821
59111I64235J6273J6293J6146J5278J3948J2147R349N796K674M43j645l961n690
$$ y = [722626, 715721, 710675, 707028, 704179, 702159, 700932, 699994, 699210, 699073, 699556, 699732, 699229, 699187, 700947, 704461, 708720, 713012, 716972, 720143, 722459, 724759, 727909, 731674, 735242, 738616, 742749, 748332, 755056, 762058, 768687, 774895, 781171, 788089, 795772, 803928, 812389, 821321, 830921, 841360, 853024, 866205, 880410, 894555, 908098, 921452, 935087, 948781, 961932, 973974, 984220, 991909, 996768, 999038, 998786, 995758, 990046, 982166, 972236, 959932, 945616, 930732, 916563, 903264, 890570, 878715, 868021, 858219, 848876, 840098, 832301, 825633, 820061, 815615, 812185, 809430, 807256, 805963, 805685, 806163, 807248, 809097, 811702, 814901, 819001, 824598, 831575, 839180, 847403, 857295, 869431, 883097, 897563, 913115, 930020, 947414, 964235, 980508, 996801, 1012947, 1028225, 1042173, 1054320, 1063669, 1069465, 1072139, 1072582, 1070937, 1066976, 1061286]
59098A061286o261o398p009q025q939r581r746r029p644o640o635p042p032o589
59084I54716o148n857n711n885o508p434q454r350r844r970j0316j1152j1656
59071H46431j0862r200p946p338o523n319m571m466l998k658j413j275j959k548
59057G76355k670k352j656j008j150k114k947k938k488k313k523k915l395l709
59043G42177l365k341j269o10j84K34N35P67J258J937K186J745J154J095J780
59028G47099L100M738O069O717P220Q345R767J0421J0204J0209J1038J1893J1743
59015H58563J0450Q361N862L597K224J492N04q03j391p73K06P17J079J890L002
59000H94980M077N314O871Q236Q913R182R534R851R709R024Q013O887N884N126
$$ y = [1061286, 1055025, 1048627, 1041618, 1033593, 1024654, 1015073, 1005327, 996298, 988654, 982014, 975379, 968337, 961305, 954716, 948568, 942711, 937000, 931115, 924607, 917173, 908719, 899369, 889525, 879555, 869239, 858087, 846431, 835569, 826369, 818423, 811085, 804562, 799243, 794672, 790206, 786208, 783550, 782137, 780862, 778903, 776355, 773685, 771333, 769677, 768669, 767519, 765405, 762458, 759520, 757032, 754719, 752196, 749281, 745886, 742177, 738812, 736471, 735202, 734592, 734408, 734642, 735177, 735944, 737202, 739139, 741325, 743070, 744224, 745319, 747099, 750199, 754937, 761006, 767723, 774943, 783288, 793055, 803476, 813680, 823889, 834927, 846820, 858563, 869013, 877374, 883236, 886833, 889057, 890549, 891053, 890250, 888859, 888086, 888292, 889009, 890088, 891978, 894980, 899057, 904371, 911242, 919478, 928391, 937573, 947107, 956958, 966667, 975691, 983704, 990591, 996475, 1001601]
58986A001601M215K471k11l264o258r064j1203j1937j1270j0028q661o834m386
58973I25171j812N72L017N509P422Q524R486J0994J2987J5140J7285J9061J9879
58960A053235J9626J8750J7419J5342J2516R338N739J179m258r693j4542j8779
58948A105872k1967k3244k2725k1797k1411k1072k0020j8401j6635j4575j2042
58937H91983r533p735o825o549o528o300n693n165n148n207m732m200m431m928
58923H09009m432l127k532k988l054j922n91K9M49J227J849J972K308L261M072
58908H05530M296M741N960P172P776Q549J0223J2147J3540J4825J6459J7672J7703
58895I46593J7175J6979J6853J6438J6618J8367K1137K3875K6776L0518L4460
$$ y = [1001601, 1005816, 1008287, 1008076, 1004812, 998554, 989490, 978287, 966350, 955080, 945052, 936391, 929557, 925171, 923359, 923931, 926948, 932457, 939879, 948403, 957889, 968883, 981870, 997010, 1014295, 1033356, 1053235, 1072861, 1091611, 1109030, 1124372, 1136888, 1146226, 1151965, 1153144, 1148886, 1139193, 1124651, 1105872, 1083905, 1060661, 1037936, 1016139, 994728, 973656, 953636, 935235, 918600, 904025, 891983, 882450, 874715, 867890, 861341, 854813, 848513, 842820, 837655, 832507, 827300, 822568, 818368, 813937, 809009, 804577, 801450, 798918, 795930, 792876, 790954, 790363, 790392, 790841, 792068, 793917, 795889, 798197, 801458, 805530, 809826, 814567, 820527, 827699, 835475, 844024, 854247, 866394, 879934, 894759, 911218, 928890, 946593, 963768, 980747, 997600, 1014038, 1030656, 1049023, 1070160, 1094035, 1120811, 1151329, 1185789]
58884A185789L7138L8009L7412L5233L1071K5368J9200J3053O711P6o688j3471
58872A408901j9986k5678l0352l4126l6419l6099l3337l0088k7763k5616k2555
58861A086882j9234j6993j5808j4916j4556j5406j6871j7557j7178j6613j6334
58850I05416j5960j5147j3870j2149j0307r067q618q209p411o934p277p556o872
58837G76039n858n642o048o243o290o633o718n723m203l467l685l946l816l518
58823G04249k887j533K00J617K719L793M449M270L948M427N317N402M479L350
58809G43800K305R72m62j198j018n47l54n99j342k294k674k164j665k183l421
58794G27156m319m461l986k799j020L76N45L0j0O88J731L122M848O099O251O050
$$ y = [1185789, 1222927, 1260936, 1298348, 1333581, 1364652, 1390020, 1409220, 1422273, 1428984, 1429060, 1422372, 1408901, 1388915, 1363237, 1332885, 1298759, 1262340, 1226241, 1192904, 1162816, 1135053, 1109437, 1086882, 1067648, 1050655, 1034847, 1019931, 1005375, 989969, 973098, 955541, 938363, 921750, 905416, 889456, 874309, 860439, 848290, 837983, 828916, 820298, 812089, 804678, 797744, 790467, 782911, 776039, 770181, 764539, 758491, 752248, 745958, 739325, 732607, 726884, 722681, 719214, 715529, 711583, 707767, 704249, 701362, 699829, 700029, 701646, 704365, 708158, 712607, 716877, 720825, 725252, 730569, 735971, 740450, 743800, 746105, 747077, 746615, 745417, 744399, 743852, 743498, 742899, 741557, 739263, 736589, 734425, 732760, 730577, 727156, 722837, 718376, 714390, 711591, 710571, 710947, 711492, 711522, 711512, 712200, 713931, 717053, 721901, 728000, 734251, 740301]
58778G40301O502P070O383M375K334J091L94j54q08j987l777n341n878n790n861
58763G38854n902n318m444m031l908l396k556j779p23J017K704L338L253L482
58749G20591M002M102L989M570N845O966P623Q128Q517Q767R398J0590J1286J0643
58735H25017R711J0117J1568J2349J1885J1075J0432R593Q568P880P487O956O501
58722I49139O553O595N891M941M872N658O423P024P913Q840R211R260R403Q954
58708A050677P102M474K118l72l907p802j0671j2777j5405j8407k0592k2131k4132
58695I28175k6132k6423k4867k3033k1447j9107j5870j3020j1078r303p714p442
58683G22739q539r518r574r444r588r363q462p485o645n521m245l311k188N6K739
$$ y = [740301, 746803, 753873, 760256, 764631, 766965, 768056, 768450, 768296, 767488, 765501, 761724, 756383, 750505, 744715, 738854, 732952, 727634, 723190, 719159, 715251, 711855, 709299, 707520, 706797, 707814, 710518, 713856, 717109, 720591, 724593, 728695, 732684, 737254, 743099, 750065, 757688, 765816, 774333, 783100, 792498, 803088, 814374, 825017, 834728, 844845, 856413, 868762, 880647, 891722, 902154, 911747, 920315, 928195, 935682, 942638, 949139, 955692, 962287, 968178, 973119, 977991, 983649, 990072, 997096, 1005009, 1013849, 1023060, 1032320, 1041723, 1050677, 1057779, 1062253, 1064371, 1063999, 1060092, 1052290, 1041619, 1028842, 1013437, 995030, 974438, 952307, 928175, 902043, 875620, 850753, 827720, 806273, 787166, 771296, 758276, 747198, 737895, 730181, 722739, 714200, 704682, 695108, 685664, 676076, 666713, 658251, 650766, 644121, 638600, 634355, 631044, 628856, 628912, 631651]
58668F31651M149M180M443N733P476R607J2619J5545J6359J4792J2499J0118O694
58655G55865K388q67k316l416n045o085n817n385n681n887n327m734m547l921
58641F99225k534j433r56J56K371M120M301M096M823N730N547M616L830K863J061
58626G37816r73k206k723l135l305k762j650l41J182K927M668O563R051J1826
58612G56938J3971J5326J6387J6802J5519J2678R685P066M038N44k238l893n342
58599H57481o835p386o900o737p402p577o459n036m114l015j258M23J788L882
58585H00855O984R695J1198J2526J4375J5616J5344J4492J3976J3024J0871Q354
58573I47310O345M191J375q50j079K29J919L989O816R789J2184J4391J6904J9067
$$ y = [631651, 635800, 639980, 644423, 650156, 657632, 667239, 679858, 695403, 711762, 726554, 739053, 749171, 755865, 758253, 757386, 755070, 751654, 746609, 740524, 734707, 729322, 723641, 717754, 712427, 707693, 703146, 699225, 696691, 695258, 694302, 694458, 696829, 700949, 705250, 709346, 714169, 719899, 725446, 730062, 733892, 736755, 737816, 736843, 734637, 731914, 728779, 725474, 722712, 721062, 720721, 721903, 724830, 729498, 736061, 745112, 756938, 770909, 786235, 802622, 819424, 834943, 847621, 857306, 864372, 868410, 868954, 866716, 862823, 857481, 850646, 843260, 836360, 829623, 822221, 814644, 808185, 803149, 799035, 796020, 794762, 795185, 796973, 800855, 807839, 817534, 828732, 841258, 855633, 871249, 886593, 901085, 915061, 928085, 938956, 947310, 953655, 957846, 959221, 958371, 957292, 957521, 959440, 963429, 970245, 980034, 992218, 1006609, 1023513, 1042580]
58559A042580K0039K0028J9500J8134J5550J2090Q229M135L84k239m153o672r778
58546A137827j1887j2338j2332j2705j2781j2299j2409j3659j4904j5284j5447
58535I91782j5854j5791j5063j4635j4517j3200j0322p716o522n490l554j802
58523H67316j230p75O60K249L040L780N168O242O220O135O808P144O219N185N216
58508I29377N471N073N200O995R067R381Q179P012O119M769L003J176j084l869
58494I95869o115p166p869q848r265q605p955q044p860o663n486n155m716l387
58480H98735k000r59J060M555P569Q438Q102P784O766M436K249J355M27j868m434
58465I42215n921p120q823r644q458o808o274n655l456r51M8M18J785L398L869
$$ y = [1042580, 1062619, 1082647, 1102147, 1120281, 1135831, 1147921, 1156150, 1160285, 1160669, 1158430, 1154277, 1147605, 1137827, 1125940, 1113602, 1101270, 1088565, 1075784, 1063485, 1051076, 1037417, 1022513, 1007229, 991782, 975928, 960137, 945074, 930439, 915922, 902722, 892400, 884684, 878162, 872672, 869118, 867316, 866086, 865311, 865971, 868220, 871260, 875040, 880208, 886450, 892670, 898805, 905613, 912757, 918976, 924161, 929377, 934848, 939921, 945121, 952116, 961183, 970564, 978743, 985755, 991874, 996643, 999646, 1000822, 999738, 995869, 989754, 982588, 974719, 965871, 956606, 948001, 940046, 932002, 924142, 917479, 911993, 906838, 902122, 898735, 896735, 895776, 896836, 901391, 908960, 917398, 925500, 933284, 940050, 944486, 946735, 948090, 948517, 946649, 942215, 936294, 929174, 920351, 910707, 902249, 895441, 889167, 883512, 880056, 879105, 879153, 879571, 881356, 884754, 888623]
58450H88623M141N555O801N930L803K491J777K90j398j903j805k419l063k388
58436I06435r41J86J710M384O602O639N652N527N542M224K760L292N327O920P972
58421I72231R321J0229R852R487J0268J0413Q090N054L923L744K035m93j367r61
58407A051826j648l440m410m430m759m909l618j939j814k533k118j060j156j829
58393A012163j250M9K40l32k83l91k033l896m018l535m486n494l887o23J200J445
58377I84869K145L022K497J884L798P156Q510P630P269Q045Q237P977R059J0991
58363A073089J1602J1069J1218J1664J0915J0232J1783J4023J3669J1313J0218
58352A200795J0465R411P093N962N886M657K924L342N280N672M735N558Q273R981
$$ y = [888623, 892764, 898319, 905120, 911050, 914853, 917344, 919121, 919411, 918013, 916110, 914305, 911886, 908823, 906435, 905494, 905680, 907390, 911774, 918376, 925015, 930667, 936194, 941736, 945960, 948720, 952012, 957339, 964259, 972231, 981552, 991781, 1001633, 1011120, 1021388, 1031801, 1039891, 1044945, 1048868, 1052612, 1054647, 1054154, 1052787, 1051826, 1050178, 1046738, 1042328, 1037898, 1033139, 1028230, 1024612, 1022673, 1020859, 1018326, 1016208, 1015148, 1013992, 1012163, 1010913, 1010962, 1011202, 1010870, 1010587, 1010196, 1008163, 1004267, 1000249, 996714, 992228, 986734, 982847, 982224, 983424, 984869, 987014, 990036, 992533, 994417, 998215, 1005371, 1013881, 1021511, 1028780, 1036825, 1045062, 1053039, 1062098, 1073089, 1084691, 1095760, 1106978, 1118642, 1129557, 1139789, 1151572, 1165595, 1179264, 1190577, 1200795, 1211260, 1220671, 1227764, 1233726, 1239612, 1244269, 1247193, 1250535, 1255815, 1261487, 1266222, 1271780, 1280053, 1290034]
58338A290034J0265J1450J3578J4426J4350J5835J8459J9497J9219K0184K1716
58327A469013K0724J7668J5936J5545J3392R656P907Q698R006Q211Q683J0229
58315A614668R972Q147Q106J0243J1656J1960J3575J6201J6973J6175J6763J8445
58303A772884J8350J7189J8255K0745K0910J9430K0409K3343K3658K1221K0539
58292A996933K2330K2768K1458K2160K4993K6080K5495K7422L1694L3597L2820
58281B287750L3964L7362L8345L6688L7544M1625M3761M2810M3583M7129M8708
58270B739269M7475M8496N2904N5698N5764N8362O5029P0666P3230P6636Q1581
58259C425110Q3532Q2362Q3662Q7965Q9212Q6516Q6500R1031R4040R3556R5263
$$ y = [1290034, 1300299, 1311749, 1325327, 1339753, 1354103, 1369938, 1388397, 1407894, 1427113, 1447297, 1469013, 1489737, 1507405, 1523341, 1538886, 1552278, 1561934, 1569841, 1578539, 1587545, 1595756, 1604439, 1614668, 1624640, 1632787, 1640893, 1651136, 1662792, 1674752, 1688327, 1704528, 1721501, 1737676, 1754439, 1772884, 1791234, 1808423, 1826678, 1847423, 1868333, 1887763, 1908172, 1931515, 1955173, 1976394, 1996933, 2019263, 2042031, 2063489, 2085649, 2110642, 2136722, 2162217, 2189639, 2221333, 2254930, 2287750, 2321714, 2359076, 2397421, 2434109, 2471653, 2513278, 2557039, 2599849, 2643432, 2690561, 2739269, 2786744, 2835240, 2888144, 2943842, 2999606, 3057968, 3122997, 3193663, 3266893, 3343529, 3425110, 3508642, 3591004, 3674666, 3762631, 3851843, 3938359, 4024859, 4115890, 4209930, 4303486, 4398749]
58248D398749J00874J04898J06426J11824J21964J29495J32675J38989J50819
58239E496713J60973J66958J75788J89798K01946K10354K22779K41136K56843
58230G323288K67475K82318L05006L26924L44626L66942L97348M26735M51818
58221A0492480M82891N24735N68025O08689O56824P16947P79246Q40439R12825
58212A6583101J002075J097794J197176J315216J459699J620660J797249K009058
58204B8082028K267370K563884K903437L318034L832728M451602N196388O122664
58196E8738135P277030Q677066J0353313J2362192J4731987J7454551K0563543
58189A50157817K4143089K8178475L2402447L6239794L8709190L8306661L3347767
$$ y = [4398749, 4499623, 4604521, 4710947, 4822771, 4944735, 5074230, 5206905, 5345894, 5496713, 5657686, 5824644, 6000432, 6190230, 6392176, 6602530, 6825309, 7066445, 7323288, 7590763, 7873081, 8178087, 8505011, 8849637, 9216579, 9613927, 10040662, 10492480, 10975371, 11500106, 12068131, 12676820, 13333644, 14050591, 14829837, 15670276, 16583101, 17585176, 18682970, 19880146, 21195362, 22655061, 24275721, 26072970, 28082028, 30349398, 32913282, 35816719, 39134753, 42967481, 47419083, 52615471, 58738135, 66015165, 74692231, 85045544, 97407736, 112139723, 129594274, 150157817, 174300906, 202479381, 234881828, 271121622, 309830812, 348137473, 381485240]
58182C81485240K3041180Q568465p021419k0296417k9105010l3140922l3340441
58175B90190676l0985980k7209538k2935879j8982082j6054964j4539777j4243696
58168A45238760j4449750j4385052j3704125j2534351j1154233r743794q395040
58161F0872415p183659o145878n255007m478709l822212l289132k847282k464562
58153B5385974k141095j879299j656997j455709j284859j153901j047132r47679
58145A3819303q61422p96524p41865o85161o31889n88416n45519m95541m47955
58136H025011m11916l80007l43839l09679k84655k63102k40239k24193k20806
58127E346575k20547k13501k04063j98563j91722j77963j63666j55641j48910
$$ y = [381485240, 404526420, 413094885, 406073466, 385777049, 356672039, 323531117, 290190676, 259204696, 231995158, 209059279, 190077197, 174022233, 159482456, 145238760, 130789010, 116403958, 102699833, 90165482, 79011249, 69267455, 60872415, 53688756, 47542878, 42287871, 37809162, 33986950, 30697818, 27850536, 25385974, 23244879, 21365580, 19708583, 18252874, 16968015, 15814114, 14766982, 13819303, 12957881, 12161357, 11419492, 10734331, 10102442, 9514026, 8968507, 8472966, 8025011, 7613095, 7233088, 6889249, 6579570, 6294915, 6031813, 5791574, 5567381, 5346575, 5126028, 4912527, 4708464, 4509901, 4318179, 4140216, 3976550, 3820909, 3671999]
58118C671999j37574j26706j21948j17917j08375r7930r2725q9128q2114p5550
58108B622032p3901p2680o7233o2224o2545o3376n9123n3970n3752n5187n2858
58097A945183m9424m9334m9492m5610m1151m0775m1192l7475l2356l0623l0105
58086A497646k6723k2860k2440k3076k1088j9071k0698k3187k2494k0925k2136
58075A252948k3727k2154j9978k0860k2280k0497j7952j8447j9675j7818j5022
58064A034538j5024j5724j3442j0315j0222j1338r902p666q406j0658j0835j0160
58052I00846j1656j3549j2482j0113r884j0347q255n319n257o920o772n597o438
58039G88257q388q646q305r974j1993j1047q361p517q171p610o352o705p826p621
$$ y = [3671999, 3534425, 3407719, 3285771, 3167854, 3059479, 2961549, 2868824, 2779696, 2697582, 2622032, 2548131, 2475451, 2408218, 2345994, 2283449, 2220073, 2160950, 2106980, 2053228, 1998041, 1945183, 1895759, 1846425, 1796933, 1751323, 1710172, 1669397, 1628205, 1590730, 1558374, 1527751, 1497646, 1470923, 1448063, 1425623, 1402547, 1381459, 1362388, 1341690, 1318503, 1296009, 1275084, 1252948, 1229221, 1207067, 1187089, 1166229, 1143949, 1123452, 1105500, 1087053, 1067378, 1049560, 1034538, 1019514, 1003790, 990348, 980033, 969811, 958473, 948571, 940905, 932499, 921841, 911006, 900846, 889190, 875641, 863159, 853046, 843162, 832815, 824560, 819241, 813984, 807064, 800292, 794695, 788257, 779869, 771223, 762918, 752944, 740951, 729904, 721543, 714026, 705855, 698245, 691893, 685188, 677362, 669741]
58025F69741p402r345j1574j1016q932q346q410o589m164m010n105m615l354l819
58011E73060m924m120k585k897l656j939Q69J384L83J028K745K665J632K788N456
57996E71889O213N128N320P136Q168Q221Q995R566P540M072K598L143K803J272
57982F52064P91J237K99j766k508k140l223n731p108p049p651r047r314q558q671
57967E81625r241q138n931n295o147n759l715k317k064j001J079J945P95p85j963
57952E33088l224l996l237k129k615l748l157j447j163j935j013J749L792M558
57938E15523N819P383P031N050M448N989P235P095P241Q271Q415O956N344M080
57924F05880K012o13j978k170l344n794p329p241p401q680r673r783j0211j1099
$$ y = [669741, 662339, 652994, 641420, 630404, 621472, 613126, 604716, 598127, 593963, 589953, 584848, 580233, 576879, 573060, 568136, 564016, 561431, 558534, 554878, 552939, 553808, 555192, 555575, 556603, 559348, 562013, 563645, 566433, 571889, 578102, 583230, 588550, 595686, 603854, 612075, 621070, 630636, 638176, 642248, 644846, 647989, 650792, 652064, 652855, 654092, 654391, 652625, 650117, 647977, 644754, 639023, 631915, 624866, 617215, 608168, 598854, 590296, 581625, 572384, 564246, 558315, 553020, 546873, 541114, 537399, 535082, 533018, 532017, 533096, 535041, 535836, 535051, 533088, 529864, 525868, 522631, 520502, 517887, 514139, 510982, 509535, 508372, 506437, 505424, 507173, 510965, 515523, 521342, 528725, 535756, 540806, 545254, 551243, 558478, 565573, 572814, 581085, 589500, 596456, 601800, 605880, 607892, 607279, 605301, 603131, 599787, 593993, 586664, 579423, 572022, 563342, 553669, 543886, 533675, 522576]
57910E22576j0957r763r420j0237j0150q346o685o495o840o849p065p638p690
57897D14441p207p115p129o011m225l589m171m214l252k381j516M49K710L182
57883C69972K283K612M514N571N041N012O227O517M733K740K060J626M39n20n24
57868D18303o09j317j456m21N18N69O39J241J464J087J387K724L597L141K499
57853D33366K728L334L683L921L892L097K157K294L147L300K875L087L442K308
57839D76631K63l37N60M94j177k274j903j898l183m117l832l815m749n009l927
57824D41727l318m039m145k265M1J165J899L114L801L422L512M896N806M902L755
57809D64273M089M851M183K294J87k530o279r715j1358j1600j1331j0239q194
$$ y = [522576, 511619, 501856, 492436, 482199, 472049, 463703, 457018, 450523, 443683, 436834, 429769, 422131, 414441, 407234, 400119, 392990, 386979, 382754, 379165, 374994, 370780, 367528, 365147, 363631, 364080, 366790, 369972, 372255, 374867, 379381, 384952, 389993, 395005, 401232, 407749, 412482, 415222, 417282, 418908, 419347, 418827, 418303, 417694, 416377, 414921, 414500, 415018, 415587, 416226, 417467, 418931, 420018, 421405, 424129, 427726, 430867, 433366, 436094, 439428, 443111, 447032, 450924, 454021, 456178, 458472, 461619, 464919, 467794, 470881, 474323, 476631, 476894, 476557, 477117, 477611, 476434, 474160, 472257, 470359, 467176, 463059, 459227, 455412, 450663, 445654, 441727, 438409, 434370, 430225, 427960, 428001, 429166, 431065, 434179, 437980, 441402, 444914, 449810, 455616, 460518, 464273, 468362, 473213, 477396, 479690, 479877, 477347, 471068, 461353, 449995, 438395, 427064, 416825, 408631]
57796D08631o613o553o952o453n565n401n759n945o084o238n663m199k891k199
57782C32116j292l7L39l62n01N74J314R58J164K930M457M201L714M927O772P104
57766C68378O200N689N507M509L004K051J236n24k654l598l265k874k984l314
57752C77361l882m730n136m573l706l273k792j664n37k40l30k9L73K54j44m16
57736C46536q65j623j964j600j323j438r27O67K106K409K422L072L632L213K464
57721C56781K247K078J398R63J320J410L08j039j484j541j869j560O5J407O10
57706C61094j487k690k667k690k958k476j109J80Q95J209J059N12L84J176K032
57691C52464K052J728J841J922J340Q65J512K776L546L958M787N877O800Q210
$$ y = [408631, 402018, 395465, 388513, 382060, 376495, 371094, 365335, 359390, 353306, 347068, 341405, 337206, 334315, 332116, 330824, 330787, 331126, 330764, 330263, 330837, 332151, 333109, 334273, 337203, 341660, 345861, 349575, 354502, 361274, 368378, 374578, 380267, 385774, 390283, 393287, 395338, 396574, 396050, 393396, 389798, 386533, 383659, 380675, 377361, 373479, 368749, 363613, 359040, 355334, 352061, 349269, 347605, 347068, 346828, 346498, 346469, 346842, 347096, 346952, 346536, 345671, 344048, 342084, 340484, 339161, 337723, 336796, 337463, 339569, 341978, 344400, 347472, 351104, 354317, 356781, 359028, 361106, 362504, 363467, 364787, 366197, 366505, 365466, 363982, 362441, 360572, 359012, 359077, 360484, 361094, 359607, 356917, 354250, 351560, 348602, 346126, 345017, 345197, 346092, 347301, 348360, 348872, 349256, 350432, 352464, 354516, 356244, 358085, 360007, 361347, 362212, 363724, 366500, 370046, 374004, 378791, 384668, 391468, 399678]
57677C99678J1010J4961J9458K4749L1098L7830M4737N3297O4910P9004R4188
57666H74920J09570J22564J26585J13902Q1536L3890j9221o6183r7762j11320
57656A168481j11311j04379r4297q2275o9799n8476m8194l8192k9425k3557k0214
57645D88362j7495j4790j2922j1801j0226p847n500l731k587k396l046l081j422
57632C91518O57J135K00l92k30l02o29k57N86O12k52q08p76r98j507j429q86j021
57614C85221j877k167j398n27k95m36o17p88o21j7J59p03j478p72O41P97l91j142
57596C73589p23j47k1J25J73p13k258l075k923k992l616l644k574j456r86n35
57580C48224K71O18p8j143j750j888j769j369r57r55j049n40L56P11L50p9l97
$$ y = [399678, 410688, 425649, 445107, 469856, 500954, 538784, 583521, 636818, 701728, 780732, 874920, 984490, 1107054, 1233639, 1347541, 1429077, 1462967, 1443746, 1377563, 1279801, 1168481, 1057170, 952791, 858494, 776219, 706420, 647944, 599750, 561558, 532133, 508576, 488362, 470867, 456077, 443155, 431354, 421128, 413281, 407781, 404050, 401463, 399067, 396021, 392940, 391518, 392175, 393310, 393510, 393118, 392888, 392586, 391957, 391700, 392286, 392898, 392646, 391838, 391062, 390064, 388557, 387128, 386242, 385221, 383344, 381177, 379779, 379252, 378957, 378521, 377904, 377116, 376495, 376478, 376637, 375934, 374456, 373684, 374325, 375122, 374731, 373589, 372866, 372719, 372698, 372823, 372996, 372283, 370025, 366950, 364027, 361035, 357419, 353775, 351201, 349745, 348759, 348224, 348495, 349113, 349035, 347892, 346142, 344254, 342485, 341116, 340159, 339204, 338155, 337615, 337971, 338682, 339032, 338953, 338556]
57563C38556q34r11L3J247J257J74m43j06P1m10o06J4P17J098J803K982L614L168
57545C51424K562K570K721K530K609L628N166O321O736O508N815M974M196L198
57531D10958J864J049J623K877L262K626K268K708L025K643K182K118K036J746
57517D42985J803K443L126L487L623L314K276J292J604K939L612K922J936J526
57503D78888J204M13n02j226j967k507k053p31J60j04p49r17p52n99l17Q3K27
57486D68551K30O72J483J906J806J735J643R74K04O13K168L248K994K260J839
57471D92326J449J027J269K082K262J488J054J702K421K325K127K615L261L498
57457E20906L933N030N898N671M958M717M776M589M356M304L910K967K425L037
$$ y = [338556, 337722, 336811, 336844, 338091, 339348, 339522, 339079, 338973, 339044, 338634, 338028, 338042, 338759, 339857, 341660, 344642, 348256, 351424, 353986, 356556, 359277, 361807, 364416, 368044, 373210, 379531, 386267, 392775, 398590, 403564, 407760, 410958, 412822, 413871, 415494, 418371, 421633, 424259, 426527, 429235, 432260, 434903, 437085, 439203, 441239, 442985, 444788, 447231, 450357, 453844, 457467, 460781, 463057, 464349, 465953, 468892, 472504, 475426, 477362, 478888, 480092, 480505, 480003, 478777, 476810, 474303, 472250, 471519, 471679, 471575, 470826, 469909, 469157, 468558, 468241, 468324, 468551, 468781, 469453, 470936, 472842, 474648, 476383, 478026, 479000, 479204, 479817, 481985, 485233, 488227, 490487, 492326, 493775, 494802, 496071, 498153, 500415, 501903, 502957, 504659, 507080, 509405, 511532, 514147, 517408, 520906, 524839, 529869, 535767, 541438, 546396, 551113, 555889, 560478, 564834, 569138, 573048, 576015, 578440, 581477]
57443E81477M118M675M784M813M378L250K335K532L376L897M021M129M044L599
57429F35428L446M136M999N020M272L635L549L864M328M612M404M033M265M994
57415F94985N148M319L503L535L951M119M301M728M827M373M257N040N900O002
57401G58988N858O160O453O176N937O417O953O644N974N899O180O029N707O004
57387H45379O723P090P174P494P810P673P652Q509R581R452Q103O980P024P768
57373I54412Q307Q109P012N490M741N543P107P981P831P483P561Q027Q748R515
57359A057867R739R095Q205P845P826P604P558Q503J0166J1307J1292J0600R892
57346A177499R489R657J0355J0815J0312R340R125R948J0834J0984J0707J0733
$$ y = [581477, 585595, 590270, 595054, 599867, 604245, 607495, 609830, 612362, 615738, 619635, 623656, 627785, 631829, 635428, 638874, 643010, 648009, 653029, 657301, 660936, 664485, 668349, 672677, 677289, 681693, 685726, 689991, 694985, 700133, 704452, 707955, 711490, 715441, 719560, 723861, 728589, 733416, 737789, 742046, 747086, 752986, 758988, 764846, 771006, 777459, 783635, 789572, 795989, 802942, 809586, 815560, 821459, 827639, 833668, 839375, 845379, 852102, 859192, 866366, 873860, 881670, 889343, 896995, 905504, 915085, 924537, 932640, 939620, 946644, 954412, 962719, 970828, 977840, 983330, 988071, 993614, 1000721, 1008702, 1016533, 1024016, 1031577, 1039604, 1048352, 1057867, 1067606, 1076701, 1084906, 1092751, 1100577, 1108181, 1115739, 1124242, 1134408, 1145715, 1157007, 1167607, 1177499, 1186988, 1196645, 1207000, 1217815, 1228127, 1237467, 1246592, 1256540, 1267374, 1278358, 1289065, 1299798]
57334A299798J1217J1708J1702J1118J0405J0118J0262J0353J0256J0357J0729
57323A418023J0811J0359R983J0204J0745J1307J2170J3310J3796J3109J2255
57312A546072J2500J3571J4226J4138J4036J4281J4486J4372J4073J3731J3501
57301A698987J3716J4336J4672J4397J4206J4645J4920J4095J2868J2805J4097
57290A853744J5409J5842J5770J5686J5432J4861J4334J4280J4845J5996J7339
57279B023538J8029J7556J6499J5803J5648J5714J6123J7108J8107J8266J7793
57268B210184J7693J8285J8969J9453K0065K0779K0914K0163J9070J8277J7961
57257B421813J8100J8601J9063J9135J9091J9464K0092K0256J9780J9232J8957
$$ y = [1299798, 1311015, 1322723, 1334425, 1345543, 1355948, 1366066, 1376328, 1386681, 1396937, 1407294, 1418023, 1428834, 1439193, 1449176, 1459380, 1470125, 1481432, 1493602, 1506912, 1520708, 1533817, 1546072, 1558572, 1572143, 1586369, 1600507, 1614543, 1628824, 1643310, 1657682, 1671755, 1685486, 1698987, 1712703, 1727039, 1741711, 1756108, 1770314, 1784959, 1799879, 1813974, 1826842, 1839647, 1853744, 1869153, 1884995, 1900765, 1916451, 1931883, 1946744, 1961078, 1975358, 1990203, 2006199, 2023538, 2041567, 2059123, 2075622, 2091425, 2107073, 2122787, 2138910, 2156018, 2174125, 2192391, 2210184, 2227877, 2246162, 2265131, 2284584, 2304649, 2325428, 2346342, 2366505, 2385575, 2403852, 2421813, 2439913, 2458514, 2477577, 2496712, 2515803, 2535267, 2555359, 2575615, 2595395, 2614627, 2633584]
57246B633584J8744J8561J8756J9296J9558J9241J8953J9453K0707K1973K2547
57235B851373K2289K1603K1137K1265K1829K2392K2652K2587K2413K2488K2975
57224C095003K3479K3466K3101K3116K3635K3906K3523K3162K3508K4153K4255
57213C354307K3679K2846K1992K1303K1152K1461K1341K0188J8604J7510J6841
57202C581224J5999J5024J4333J3761J2891J1960J1500J1389J1231J1327J2219
57191C722858J3502J4178J4105J4156J4912J6018J6798J6847J6107J5045J4600
57180C889126J5218J6168J6369J5626J4473J3256J2075J1226J0826J0400R591
57169D034354Q860Q702Q709Q322P870P911Q029P478O511N912N610M974M162L911
$$ y = [2633584, 2652328, 2670889, 2689645, 2708941, 2728499, 2747740, 2766693, 2786146, 2806853, 2828826, 2851373, 2873662, 2895265, 2916402, 2937667, 2959496, 2981888, 3004540, 3027127, 3049540, 3072028, 3095003, 3118482, 3141948, 3165049, 3188165, 3211800, 3235706, 3259229, 3282391, 3305899, 3330052, 3354307, 3377986, 3400832, 3422824, 3444127, 3465279, 3486740, 3508081, 3528269, 3546873, 3564383, 3581224, 3597223, 3612247, 3626580, 3640341, 3653232, 3665192, 3676692, 3688081, 3699312, 3710639, 3722858, 3736360, 3750538, 3764643, 3778799, 3793711, 3809729, 3826527, 3843374, 3859481, 3874526, 3889126, 3904344, 3920512, 3936881, 3952507, 3966980, 3980236, 3992311, 4003537, 4014363, 4024763, 4034354, 4043214, 4051916, 4060625, 4068947, 4076817, 4084728, 4092757, 4100235, 4106746, 4112658, 4118268, 4123242, 4127404, 4131315]
57155D131315M229M497M691N226N815N742N205N152N756O256O293O361O777P301
57141D210616P720P980P762O878N824N024L948K054P3j004j763l523n893o948
57127D238748n920m033k415p25J770N296J0039J6047K2223K6866K9761L2462L6018
57114D406137L9764M2931M6090N0305N5984O3304P2705Q4232R7366J12127J29511
57103E200456J50383J74900K03581K38059K80157L31254L93067M68078N58363
57094G998298O64780P87580R26536J079358J240701J403500J560621J704607J827032
57085A9193013J919389J974179J984147J941382J838876J672953J442554J146214
57077C3112707P82892L59686j00299n60388r84438j350759j653228j890908k059579
$$ y = [4131315, 4135544, 4140041, 4144732, 4149958, 4155773, 4161515, 4166720, 4171872, 4177628, 4183884, 4190177, 4196538, 4203315, 4210616, 4218336, 4226316, 4234078, 4240956, 4246780, 4251804, 4255752, 4257806, 4257879, 4256875, 4255112, 4251589, 4245696, 4238748, 4232828, 4228795, 4226380, 4225655, 4227425, 4232721, 4242760, 4258807, 4281030, 4307896, 4337657, 4370119, 4406137, 4445901, 4488832, 4534922, 4585227, 4641211, 4704515, 4777220, 4861452, 4958818, 5070945, 5200456, 5350839, 5525739, 5729320, 5967379, 6247536, 6578790, 6971857, 7439935, 7998298, 8663078, 9450658, 10377194, 11456552, 12697253, 14100753, 15661374, 17365981, 19193013, 21112402, 23086581, 25070728, 27012110, 28850986, 30523939, 31966493, 33112707, 33895599, 34255285, 34154986, 33594598, 32610160, 31259401, 29606173, 27715265, 25655686]
57068B5655686k153843k174155k128913k030910j894312j734047j564221j395102
57060A0580183j232554j080472r42285q19686p11937o17546n35805m66059m06766
57051C767073l56221l13430k77563k47244k21038j98162j78263j60922j45625
57042A668605j31863j19129j07264r6653q7556p9485p1784o4450n7687n1175m4715
57031G56844l8834l3711k8242k1509j4410q092j489P576J9365L2470M6814O4216
57019G80998Q5831J10453J34042J47876J38784R7350K9130m5179j03678j36782
57009A238825j47561j43484j31176j15910j00982q6854p2988o0377n0655m3574
56999B85264l7433l1529k6395k2067j7898j3936j0903q959p636o734o163n298
$$ y = [25655686, 23501843, 21327688, 19198775, 17167865, 15273553, 13539506, 11975285, 10580183, 9347629, 8267157, 7324872, 6505186, 5793249, 5175703, 4639898, 4173839, 3767073, 3410852, 3097422, 2819859, 2572615, 2351577, 2153415, 1975152, 1814230, 1668605, 1536742, 1417613, 1310349, 1213696, 1126140, 1046655, 974871, 910421, 852734, 801559, 756844, 718010, 684299, 656057, 634548, 620138, 612046, 610557, 618133, 637498, 669968, 716782, 780998, 866829, 977282, 1111324, 1259200, 1397984, 1495334, 1524464, 1479285, 1375607, 1238825, 1091264, 947780, 816604, 700694, 599712, 512858, 439870, 379493, 328838, 285264, 247831, 216302, 189907, 167840, 149942, 136006, 125103, 116144, 108508, 101774, 95611, 90313]
56987I0313l594j432O12K745N229P322Q040P349N627K690j417n380p725q520q763
56972I3096q629p648o083m751l705k362p53N35J486K672M271N979P763R863J2244
56957A03978J4729J7241J9183J9101J5877R927K532n281j2399j7061j8141j6674
56945A33012j4819j3469j1881r390o412l742j734k10J527M250P784J0867J2754
56932A08537J4429J7257K0835K3151K2519J8522J1510K382p146j5068k0181k2423
56920A74324k2393k1068j9483j8002j6146j3564j0761q470o899o031n909o057
56908A9541n537m154k850k172j424j26Q45O88K00O02J710K646L517M904O458P458
56892C2306Q298R857J1921J3691J5413J7990K1186K3730K4936K4853K2999J8551
$$ y = [90313, 86719, 85287, 85899, 88644, 93873, 101195, 109235, 116584, 122211, 124901, 123484, 118104, 110379, 101859, 93096, 84467, 76819, 70736, 65985, 62280, 59918, 59165, 59700, 61186, 63858, 68129, 74108, 81871, 91734, 103978, 118707, 135948, 155131, 174232, 190109, 200036, 202568, 197287, 184888, 167827, 149686, 133012, 118193, 104724, 92843, 83453, 77041, 73299, 71565, 71355, 72882, 77132, 84916, 95783, 108537, 122966, 140223, 161058, 184209, 206728, 225250, 236760, 239142, 231996, 216928, 196747, 174324, 151931, 130863, 111380, 93378, 77232, 63668, 52907, 44437, 37538, 31507, 25598, 19541, 14004, 9850, 7000, 4828, 3404, 3278, 4123, 4811, 5011, 5613, 7323, 9969, 13486, 18390, 24848, 32306, 40604, 50461, 62382, 76073, 91486, 109476, 130662, 154392, 179328, 204181, 227180, 245731]
56880B45731J1896M690j746o977j0533j1782j0915q988o784m415j935N17L192
56867B01951O447J0153J3998J8115K2641K7158L1449L6080M1251M5420M6242M2342
56855E43247L3416J9599K412j4389k6815l3635l6144l5545l2100k6562k0410j4410
56843C58664q255j763M815J1616J8937K6334L3288M0596M9505N9538O8593P4961
56831G36829P7421P3417N9652L5625N456k4448m8757o4495p1204p0870o6557o0132
56819E81937n1917m2489l3360k5387j7859r914j830N753J2995K0504K8541L6924
56807E03898M5069N1663N4782N2593M3737K7677N895j7400l7118n0298n6848n7929
56795E65721n5007n0043m4734l9050l1976k3913j6862j1849p714l069J968O719
$$ y = [245731, 257627, 262317, 260571, 253594, 243061, 231279, 220364, 211376, 204592, 200177, 198242, 198759, 201951, 208398, 218551, 232549, 250664, 273305, 300463, 331912, 367992, 409243, 454663, 500905, 543247, 576663, 596262, 598674, 584285, 557470, 523835, 487691, 452146, 420046, 393484, 373074, 358664, 350409, 348646, 353461, 365077, 384014, 410348, 443636, 484232, 533737, 593275, 661868, 736829, 814250, 887667, 947319, 982944, 988400, 963952, 915195, 850700, 779496, 708626, 642069, 581937, 530020, 487531, 454171, 428784, 410925, 401011, 399181, 404934, 417929, 438433, 466974, 503898, 548967, 600630, 655412, 708005, 751742, 779419, 785314, 767914, 730796, 680498, 623650, 565721, 510714, 460671, 415937, 376887, 344911, 320998, 304136, 292287, 284573, 281504, 283472, 290191]
56783B90191J1337J6275K1316K5749K8711K8814K4450J5257K796j0449k2167l0498
56771D01782l4576l5272l4373l2690k9805k5736k1552j8027j4951j2273j0660
56760A31867j0352j0523j0334r687q632p103n580m884m861m414l140j841j065
56747D9451n42l34j048k341k760j890j128j485k049j703r56q40j127r64m19j34
56731B9731j59j57k19m68m79L3N79O77O38Q87J182J228J275J476J437J078J072
56714C9811J705K171J803J068N54j9q46j129k89P80R48N50O00R05M10q86j736
56697D6400j373l91K43K39n1r8L73J122J533J266N53k43q61q89k9J147J564J086
56679E1591P47J047J126K88o53n26M07Q86L64n63j017n33P21J809J700N65j90
$$ y = [290191, 301528, 317803, 339119, 364868, 393579, 422393, 446843, 462100, 464896, 454447, 432280, 401782, 367206, 331934, 297561, 264871, 235066, 209330, 187778, 169751, 154800, 142527, 131867, 121515, 110992, 100658, 90971, 82339, 75236, 69656, 64772, 59911, 55497, 52357, 50516, 49451, 48909, 48575, 47527, 45186, 42426, 40536, 39408, 37923, 35874, 34171, 33215, 32375, 31248, 30284, 29865, 29731, 29572, 29415, 29196, 28728, 28249, 28282, 28861, 29538, 30176, 31063, 32245, 33473, 34748, 36224, 37661, 38739, 39811, 41516, 43687, 45490, 46558, 47112, 47093, 46247, 45118, 44829, 45609, 46557, 47107, 47707, 48612, 49022, 48136, 46400, 45027, 44636, 44879, 45118, 45067, 44969, 45342, 46464, 47997, 49263, 49816, 49573, 48712, 47823, 47794, 48941, 50505, 51591, 52338, 53385, 54511, 54799, 54146, 53620, 54027, 54913, 55277, 54714, 53697, 53164, 53885, 55694, 57394, 57959, 57769]
56662E7769K76J127J155M17j83k29J25P30J358J509J120Q36R92R48K40m38k38
56645F7514M72P29M50L05N37Q68J233J732K072J891J409J119J096J142J310J667
56629H5546J954J990J998K105J972J473J137J345J662J555J190Q88M38l37q88
56614A04028o13K52J061J590J893J810J301P36L51j7k53J77J122J436N76l62j42
56597A14946Q82J526J529J450J417J110O92O35Q49Q32M72j6o35j407k011k223
56581A20048k324k465k145j010L59J140J298J251J094P92O65R69J393J561J544
56566A24170J475J365J636K875M612N422M924M546N439O867P591P633P409O398
56552A92362M203K016J369K058K777L122L430L310K050K59n58j2Q35J083P05k08
$$ y = [57769, 58045, 59172, 60327, 60744, 60561, 60332, 60457, 61187, 62545, 64054, 65174, 66010, 67002, 67950, 68190, 67752, 67514, 67986, 68715, 69165, 69470, 70007, 70875, 72108, 73840, 75912, 77803, 79212, 80331, 81427, 82569, 83879, 85546, 87500, 89490, 91488, 93593, 95565, 97038, 98175, 99520, 101182, 102737, 103927, 104815, 105253, 104916, 104028, 103415, 103667, 104728, 106318, 108211, 110021, 111322, 112058, 112409, 112392, 112139, 112316, 113438, 114874, 115450, 115088, 114946, 115828, 117354, 118883, 120333, 121750, 122860, 123552, 124187, 125036, 125868, 126340, 126324, 125689, 124282, 122271, 120048, 117724, 115259, 113114, 112104, 112463, 113603, 114901, 116152, 117246, 118038, 118703, 119672, 121065, 122626, 124170, 125645, 127010, 128646, 131521, 136133, 141555, 146479, 151025, 156464, 163331, 170922, 178555, 185964, 192362, 196565, 198581, 199950, 202008, 204785, 207907, 211337, 214647, 216697, 216956, 216398, 216386, 217221, 218304, 219009, 218801]
56536B18801j647l108l828l681l153k683k622l272m223m300l130j999k159l010
56522A75986l185k631k247k149j829j515j837k423k313j573j123j186j232j225
56508A49518j612k238k494k320k034j522p51n04j303k172j877r23p19j256j276
56493A26517n29nr4j40R7J07j14j5L20K95J02M30Q77L12j128j934j346j52P98
56474A24398J467J794J440O98L71N49N73L98O66J397J851J841J937K184J931J106
56458A44601M65M30P65J430K549L550L601K896K245J562K48j156j356n06k06j041
56442A60077j811j634j191j164j044k05R28J577J540R80J34m14j51N02N63j32
56426A58555q16j015q88m89J64M79Qm83L6J041J137L06j44K13N71P01J290K255
$$ y = [218801, 217154, 214046, 210218, 206537, 203384, 200701, 198079, 194807, 190584, 186284, 183154, 181155, 178996, 175986, 172801, 170170, 167923, 165774, 163945, 162430, 160593, 158170, 155857, 154284, 153161, 151975, 150743, 149518, 147906, 145668, 143174, 140854, 138820, 137298, 136547, 136043, 134740, 132568, 130691, 129768, 129049, 127793, 126517, 125988, 125983, 125889, 125749, 125846, 125953, 125839, 125824, 126144, 126439, 126541, 126971, 127848, 128160, 127032, 125098, 123752, 123600, 124398, 125865, 127659, 129099, 129797, 130168, 130717, 131290, 131688, 132354, 133751, 135602, 137443, 139380, 141564, 143495, 144601, 145066, 145496, 146261, 147691, 150240, 153790, 157391, 160287, 162532, 164094, 164342, 163186, 161830, 161324, 161118, 160077, 158266, 156632, 155441, 154277, 153233, 153028, 153956, 155533, 157073, 158053, 158187, 157773, 157622, 158124, 158687, 158555, 157739, 156724, 155836, 155347, 155511, 155990, 155998, 155515, 155551, 156592, 157729, 158035, 157891, 158104, 158675, 159376, 160666, 162921]
56408A62921K512J765Q94L26l06q35o30j74o25j639j610l51N58N20P44J815K619
56391A68504K499K302K403J856N22j32M97R86M46J66J182K239J878R03Q65J513
56375A88629J593J090Q75J015R88Q45Q48O73J60L0P39J477J327O12N0m21r35q29
56357A98766K46J280J204N38M84J024J133M47l51n90k74J10M6n18q99m08O25J308
56339B04171J517J808K173K112J874K141K539K084J209J374K508K894K029J402
56325B31835J802K175J968K270L433L985L197K506K794K565O87j157r69M31R91
56310B58513O74P70J245J082L94J07K87N33J230K704M004M183L962M359M703L767
56294B92517K069J137J134J047P10Q49J499J998K278K772L319L449L369L572L911
$$ y = [162921, 165433, 167198, 168092, 168418, 168112, 167277, 166647, 166473, 165848, 164209, 162599, 162248, 162806, 163326, 164070, 165885, 168504, 171003, 173305, 175708, 177564, 178086, 177954, 178451, 179437, 179883, 180049, 181231, 183470, 185348, 186251, 187116, 188629, 190222, 191312, 192187, 193202, 194190, 195035, 195883, 196556, 196716, 196746, 197485, 198962, 200289, 200901, 200951, 200530, 199595, 198766, 199012, 200292, 201496, 202034, 202518, 203542, 204675, 205122, 204771, 204181, 203907, 204017, 204063, 203545, 202646, 202238, 202863, 204171, 205688, 207496, 209669, 211781, 213655, 215796, 218335, 220419, 221628, 223002, 225510, 228404, 230433, 231835, 233637, 235812, 237780, 240050, 243483, 247468, 250665, 253171, 255965, 258530, 259217, 258060, 257091, 257522, 258513, 259187, 259957, 261202, 262284, 262678, 262785, 263072, 263605, 264835, 267539, 271543, 275726, 279688, 284047, 288750, 292517, 294586, 295723, 296857, 297904, 298614, 299463, 300962, 302960, 305238, 308010, 311329, 314778, 318147, 321719, 325630]
56279C25630L998L983L994L697L283L847N741P596Q170Q071Q420Q992R086R074
56265D13582R621J0322J0568J0888J1948J3259J4231J5505J7789K0389K2319K3865
56253E94286K5667K7432K9017L1618L6170M1674M6712N1575N7147O2838O7480
56242A071616P1355P5452P9515Q2513Q4200Q4581Q2784P8068P1096O2627N2075
56231A895882L8938K4506J0287l929j8595l2319m3399n2320o0530o7739p2606
56220A618176p5145p6251p5778p3378p0258o7809o5284o1195n6089n1656m7869
56209H97464m3574l9144l5937l3563l0363k6263k2769k0350j8134j5939j4381
56198E97047j3185j1518r746q855q493p598o433n980n917n193m065l411k840j645
$$ y = [325630, 329628, 333611, 337605, 341302, 344585, 348432, 354173, 361769, 369939, 378010, 386430, 395422, 404508, 413582, 423203, 433525, 444093, 454981, 466929, 480188, 494419, 509924, 527713, 548102, 570421, 594286, 619953, 647385, 676402, 708020, 744190, 785864, 832576, 884151, 941298, 1004136, 1071616, 1142971, 1218423, 1297938, 1380451, 1464651, 1549232, 1632016, 1710084, 1781180, 1843807, 1895882, 1934820, 1959326, 1969613, 1965684, 1947089, 1914770, 1871371, 1819051, 1758521, 1690782, 1618176, 1543031, 1466780, 1391002, 1317624, 1247366, 1179557, 1114273, 1053078, 996989, 945333, 897464, 853890, 814746, 778809, 745246, 714883, 688620, 665851, 645501, 627367, 611428, 597047, 583862, 572344, 562598, 553743, 545250, 537652, 531219, 525239, 519322, 514129, 510064, 506653, 503813, 502168]
56184E02168q08j559k775k364o13M55M66O45R97L48j028j566j027m07L40J927
56168D95199L491L475K454K332L040K868J811J715L091M552N360N887N834M720
56154E45829L923N299P965R366R253R653J1002J1701J1441J1772J3059J4113J5006
56141F79382J7112K0088K2050K3128K5652L0425L5977M1855M9383N8642O7975
56130A071669P7070Q7227R7858J05811J08950J07396J00916Q8753P2985N8605
56120A977240M8865M3133L9921L8544L6987L1748K1720R703j113r682j5593j8238
56108B203235j8841k0610k5731l4302m6333o1685p7570q9465r5497r7035r4729
56097A541437q7589p6620o5496n6181m7262l7809k9390k3033j7557j2348q581
$$ y = [502168, 501360, 499801, 497026, 494662, 494049, 494504, 494970, 495615, 496612, 496960, 495932, 494366, 493339, 492932, 493272, 495199, 498690, 502165, 504619, 506951, 509991, 512859, 514670, 516385, 519476, 524028, 529388, 535275, 541109, 545829, 549752, 555051, 563016, 572382, 581635, 591288, 602290, 613991, 625432, 637204, 650263, 664376, 679382, 696494, 716582, 738632, 761760, 787412, 817837, 853814, 895669, 945052, 1003694, 1071669, 1148739, 1235966, 1333824, 1439635, 1548585, 1655981, 1756897, 1845650, 1918635, 1977240, 2026105, 2069238, 2109159, 2147703, 2184690, 2216438, 2238158, 2247861, 2246748, 2237066, 2221473, 2203235, 2184394, 2163784, 2138053, 2103751, 2057418, 1995733, 1918163, 1828698, 1733201, 1636166, 1541437, 1453848, 1377228, 1311732, 1255551, 1208289, 1170480, 1141090, 1118057, 1100500, 1088152, 1079571]
56086A079571o397l987q22J434K242L242M980N946N908O735Q840J0313J0529J1096
56072A139630J2234J2111J0808J0918J3031J4721J5140J6371J8872K0111J9355
56061A303302J9317K1256K2835K2678K2560K3142K2161J9032J6697J6684J6767
56050A526431J5700J5598J7374J8566J8187J8853K1583K3488K3334K4298K8081
56039A751493L1415L1718L1349L2794L4450L4734L5568L8140L9926L9550L9982
56028B141119M3297M6909M8577N0247N3429N5760N5911N6822O0228O3141O3611
56017B739051O4611O8170P1325P2143P4036P9417Q4887Q7533R0234R5723J01235
56006C628365J04239J07604J13852J20148J24329J29730J38582J47017J52374
$$ y = [1079571, 1073174, 1069187, 1068365, 1069799, 1072041, 1075283, 1080263, 1086209, 1092117, 1098852, 1107692, 1118005, 1128534, 1139630, 1151864, 1163975, 1174783, 1185701, 1198732, 1213453, 1228593, 1244964, 1263836, 1283947, 1303302, 1322619, 1343875, 1366710, 1389388, 1411948, 1435090, 1457251, 1476283, 1492980, 1509664, 1526431, 1542131, 1557729, 1575103, 1593669, 1611856, 1630709, 1652292, 1675780, 1699114, 1723412, 1751493, 1782908, 1814626, 1845975, 1878769, 1913219, 1947953, 1983521, 2021661, 2061587, 2101137, 2141119, 2184416, 2231325, 2279902, 2330149, 2383578, 2439338, 2495249, 2552071, 2612299, 2675440, 2739051, 2803662, 2871832, 2943157, 3015300, 3089336, 3168753, 3253640, 3341173, 3431407, 3527130, 3628365, 3732604, 3840208, 3954060, 4074208, 4198537, 4328267, 4466849, 4613866, 4766240]
55997D766240J58784J69497J80612J88784J98041K12027K26708K38049K49874
55988F588616K66609K85463L03252L23411L48459L73609L96015M21984M56468
55979I763886M94280N30782N71760O22851O79178P36198Q00464Q78202R64056
55970A6041657J053590J155718J279683J421664J578516J762096J984878K245342
55962B8523144K544864K904912L349868L889635M540251N344672O350766P587360
55954F5035472R084175J0888507J3031687J5510054J8338049K1579297K5249418
55947A78716659K9166490L2863679L5500547L5752087L2018976K3295077J0250373
55940C77563888m561572j7866994k7334813l2385995l3767871l2656470l0095856
$$ y = [4766240, 4925024, 5094521, 5275133, 5463917, 5661958, 5873985, 6100693, 6338742, 6588616, 6855225, 7140688, 7443940, 7767351, 8115810, 8489419, 8885434, 9307418, 9763886, 10258166, 10788948, 11360708, 11983559, 12662737, 13398935, 14199399, 15077601, 16041657, 17095247, 18250965, 19530648, 20952312, 22530828, 24292924, 26277802, 28523144, 31068008, 33972920, 37322788, 41212423, 45752674, 51097346, 57448112, 65035472, 74119647, 85008154, 98039841, 113549895, 131887944, 153467241, 178716659, 207883149, 240746828, 276247375, 311999462, 344018438, 367313515, 377563888, 373002316, 355135322, 327800509, 295414514, 261646643, 228990173, 198894317]
55933A98894317k6866524k3489148k0246334j7266924j4624216j2356524j0445837
55926G3598810q840453p500026o395378n483783m718436m074009l538506l090022
55918B9958197k703572k370783k091550j854442j643997j458681j303467j172028
55910A5359677j052984r46539q58630p84941p16051o52710o01243n58655n16266
55901H671658m73871m37296m05711l73716l42545l17428k96751k74792k52430
55892E497118k34836k21148k06292j90537j77867j67157j53999j39151j26560
55883C879571j15135j00702q4110o9375n5717l9233k0802m919P380J7014K0062
55872C434034J0158j2936m3180p5151j05176j27981j39471j42054j41148j37641
$$ y = [198894317, 172027793, 148538645, 128292311, 111025387, 96401171, 84044647, 73598810, 64758357, 57258331, 50862953, 45379170, 40660734, 36586725, 33048219, 29958197, 27254625, 24883842, 22792292, 20937850, 19293853, 17835172, 16531705, 15359677, 14306693, 13360154, 12501524, 11716583, 11000532, 10347822, 9746579, 9187924, 8671658, 8197787, 7760491, 7354780, 6981064, 6638519, 6321091, 6024340, 5749548, 5497118, 5262282, 5041134, 4834842, 4644305, 4466438, 4299281, 4145282, 4006131, 3879571, 3764436, 3663734, 3579624, 3510249, 3454532, 3415299, 3394497, 3389578, 3396958, 3413972, 3434034, 3444192, 3431256, 3388076, 3312925, 3207749, 3079768, 2940297, 2798243, 2657095, 2519454]
55862B519454j29399j18115j08113r9682r0060p9948p2793o8419o3445n7449n2971
55851A579060m9932m5783m0737l7527l6239l4487l2213l1392l1487l0165k7969
55840A181129k7332k7522k5604k2033k0142k0393k0038j8442j7746j8142j7343
55829I46392j5133j3893j4117j3728j2211j1415j1745j1592j0892j1436j3144
55818H07086j3802j2945j2450j2938j2984j2167j1540j0906r066o811o192o732
55806F78553n813l024o18N37J849L605M345M132M932P001Q088O975M836K462p85
55791G17075m616p418q879j0320j1863j2083j0907r992r689q597o715o207q098
55778F01691j0817j2754j3844j4040j2730j0363q314o575l749K62L887O380Q109
$$ y = [2519454, 2390055, 2271940, 2163827, 2064145, 1974085, 1894137, 1821344, 1752925, 1689480, 1632031, 1579060, 1529128, 1483345, 1442608, 1405081, 1368842, 1334355, 1302142, 1270750, 1239263, 1209098, 1181129, 1153797, 1126275, 1100671, 1078638, 1058496, 1038103, 1018065, 999623, 981877, 963735, 946392, 931259, 917366, 903249, 889521, 877310, 865895, 854150, 842558, 831666, 820230, 807086, 793284, 780339, 767889, 754951, 741967, 729800, 718260, 707354, 698288, 691477, 685285, 678553, 672740, 669716, 669098, 669635, 671484, 675089, 679434, 683566, 688498, 695499, 703587, 710562, 715398, 717860, 717075, 712459, 705041, 696162, 685842, 673979, 661896, 650989, 640997, 631308, 622711, 615996, 609789, 601691, 590874, 578120, 564276, 550236, 537506, 527143, 518829, 512254, 508505, 508767, 512654, 519034, 527143]
55765E27143Q265N169m94n514p995q938r480r311q578q686r886j0461r364p716
55751D44154o773o396o382p176q439q850q160p630p767p557o539n682n449m969
55737C46385l885l116l039k798k039j655k032k340k136k015k227k304k467l533
55723C10799n045n495m763m398n021n472m980m144l290j910l02L73K01O28J960
55708B69141K951L285M039N060M600K436P21M46k39k666n110n555m827m900n754
55693B63628o039n618n333n176m475l319k450k185k325k509k132p71Q19J281O30
55678B24026L72J246K328K816K995K836J524p75k420k663k728l537m105l424k284
55663B16207j724j237%J357J718J271R92J216J738K520L364L836M160N084O315
$$ y = [527143, 535408, 540577, 540083, 534569, 526574, 517636, 508156, 498845, 490267, 481581, 471695, 461234, 451870, 444154, 437381, 430985, 424603, 417427, 408988, 400138, 391978, 384348, 376581, 369024, 362485, 356803, 351354, 346385, 342500, 339384, 336345, 333547, 331508, 329853, 327821, 325481, 323345, 321330, 319103, 316799, 314332, 310799, 305754, 300259, 295496, 291098, 286077, 280605, 275625, 271481, 268191, 266281, 265979, 266352, 266553, 267181, 269141, 272092, 275377, 279416, 284476, 289076, 291512, 292233, 292679, 292440, 289774, 284664, 279109, 274282, 269382, 263628, 257589, 251971, 246638, 241462, 236987, 233668, 231218, 229033, 226708, 224199, 222067, 221296, 222115, 223396, 224026, 224398, 225644, 227972, 230788, 233783, 236619, 238143, 237368, 234948, 232285, 229557, 226020, 221915, 218491, 216207, 214483, 213246, 213246, 214603, 216321, 217592, 218584, 219800, 221538, 224058, 227422, 231258, 235418, 240502, 246817]
55648B46817O441N028L319K064M92j658l056l048l200m937p149p889p139o206
55634B19879n523m793m286m317m177l154j971j818k617l388l608l146j843k92
55620A74946J09r68j866j233q3j23j159j809j835j988k291k212j986k161k329
55605A53012j848j279j536k068j522M7J184J137N12j04q02j574j972j742j081
55590A40364k74L43M04J5k50l52r42j950k035m80J389J850J016J81j69l44k47
55573A38519K73N00j81q88l82Q19J086J79n06j69N08P89Q22Q74P77M49O3m87j425
55554A41620k385k653k162j569j375j639k301l059l179k233q48o5j07m59p81r93
55538A15812q85m28r1j80k75k9J04k60n15n3N53M36p0n7L59L14k94q21j070j278
$$ y = [246817, 253258, 258286, 261605, 263669, 264161, 262503, 259447, 256399, 253199, 248262, 241113, 233224, 226085, 219879, 214356, 209563, 205277, 200960, 196783, 193629, 191658, 189840, 187223, 183835, 180227, 177081, 175238, 174946, 175055, 174087, 172221, 170988, 170905, 170782, 169623, 167814, 165979, 163991, 161700, 159488, 157502, 155341, 153012, 151164, 149885, 148349, 146281, 144759, 144806, 145990, 147127, 147639, 147535, 146733, 145159, 143187, 141445, 140364, 140090, 140433, 140837, 140852, 140602, 140250, 139308, 137358, 135323, 134843, 136232, 138082, 139098, 139279, 139110, 138766, 138519, 138792, 139292, 139111, 138223, 137841, 138660, 139746, 139925, 139419, 139250, 139758, 140547, 141369, 142243, 143020, 143469, 143532, 143045, 141620, 139235, 136582, 134420, 132851, 131476, 129837, 127536, 124477, 121298, 119065, 118217, 118152, 118045, 117586, 116805, 115812, 114927, 114499, 114408, 114228, 113953, 113924, 114028, 113768, 113253, 113200, 113753, 114189, 114119, 114062, 114421, 114735, 114441, 113620, 112550, 111272]
55518A11272j249p61m42r99j842j864j258j147j625j730j300j247j763j850j053
55503I1142k65k54n72n32k31n4K8J75L14M55P29R47P82N43R47J981K748K689K185
55484A03757J731J227M44m77j241j677j601r23J4O39Q11Q32R08J011J127J162
55468A07744P75j07q09o44P7M71L32J63J45p1n51q51p03l18L2J65j33p74j074
55449A03869m69N84J094P40ko87j106r71k20M43K41n93j090q15j49M63P50M25
55431A02507m09q73l10O59R41N86M84P09M29n19j189q85J07J268K332K887K505
55414A11229J621J302J815K242J786P38j99q50j467k138k589k369j390m21n96
55399A08714j958l068k782j692r84o52l6O15N95K87O15J243R73j63r02q38p79
$$ y = [111272, 110023, 109262, 108820, 107821, 105979, 104115, 102857, 101710, 100085, 98355, 97055, 95808, 94045, 92195, 91142, 90877, 90623, 90051, 89519, 89288, 89234, 89262, 89437, 89751, 90206, 90935, 91882, 92664, 93207, 94154, 96135, 98883, 101572, 103757, 105488, 106715, 107159, 106682, 105441, 103764, 102163, 101240, 101254, 101893, 102704, 103536, 104444, 105455, 106582, 107744, 108519, 108412, 107603, 106959, 107036, 107507, 107839, 108002, 108147, 108076, 107525, 106674, 105971, 105653, 105685, 105850, 105717, 104943, 103869, 103400, 103984, 105078, 105818, 105816, 105129, 104023, 103052, 102832, 103275, 103516, 102923, 101833, 101018, 100869, 101332, 102082, 102507, 102098, 101225, 100915, 101574, 102515, 103101, 103585, 104294, 104723, 104204, 103015, 102130, 102237, 103505, 105837, 108724, 111229, 112850, 114152, 115967, 118209, 119995, 120733, 120534, 119684, 118217, 116079, 113490, 111121, 109731, 109310, 108714, 106756, 103688, 100906, 99214, 98230, 97578, 97542, 98157, 98752, 99039, 99654, 100897, 101870, 101707, 100805, 99967, 99188]
55382I9188r43n59L61O78Q2k51L93J139J111P10N02J67n91j217j178p31j65O42
55364I9338J395J303L95k03R8N60O06O74R35O14m72j127o08N0j43l02Q07K472
55346A06392K919J880O52N6j94l42k68k12o14j184j183o03k19m16p79q86q06p32
55328A03461p33q67j130j273j083o66k25K14O15P99P70P97Q82O36M3k16L48J245
55310A03617J575J040L1q87j267r94n01l52m67l51j05l65j046j204n10J37O9j17
55292I8303L07J013J384J630K150K508K012Q44k32q12q78n05j53m83j228j154
55276A04706J01J062M03j065j593r10n2N56J238J718J242L3p60o52k29R6N31J049
55258A07474J225J078J104J239Q32j60q77p99l92j91L0O19J214J060m1j407k021
$$ y = [99188, 98245, 97686, 98047, 98725, 98807, 98556, 98949, 100088, 101199, 101909, 102411, 102578, 101987, 100770, 99592, 98861, 98696, 99338, 100733, 102036, 102431, 102228, 102326, 102886, 103492, 104166, 105101, 105715, 105243, 104116, 103508, 103558, 103415, 103113, 103920, 106392, 109311, 111191, 111843, 111899, 111705, 111363, 111095, 110883, 110269, 109085, 107902, 107299, 107080, 106664, 105885, 104999, 104193, 103461, 102728, 101861, 100731, 99458, 98375, 97709, 97484, 97698, 98313, 99112, 99882, 100679, 101561, 102197, 102240, 102024, 102372, 103617, 105192, 106232, 106263, 105376, 104109, 103115, 102614, 102262, 101795, 101444, 101339, 100974, 99928, 98724, 98214, 98351, 98420, 98303, 98610, 99623, 101007, 102637, 104787, 107295, 109307, 110151, 109919, 109107, 108229, 107724, 107571, 107088, 105860, 104706, 104807, 105869, 106272, 105207, 103614, 102704, 102652, 103208, 104446, 106164, 107406, 107439, 106679, 106027, 105798, 105894, 106425, 107474, 108699, 109777, 110881, 112120, 112952, 112792, 111915, 111116, 110724, 110533, 110563, 111182, 112396, 113456, 113415, 112008, 109987]
55241A09987j371J2R11O54k00o41m02K5K29K31J25k9j31k34o28j299j618j059
55223A04562L3Q77J181J108P45J67k83l67l40m13k39M47J138J194P80M33J75j42
55205A11056j44M24Q44L21n91o50J80P04L13m03r35j492k089k167j517p16k37
55188A02901P4L60M06K51K85M29M8q60j198j06J767K947K711J573N11P9J69L60
55170A12707M93P26R52O25l28r41l25R07J338P32K42O06J218J283R14N80L31P6
55152A22136l8j3j70n38o39l25j24m00p34o67m58n21o66n30k96m27q69j143r76
55133A12602m73J52N79M01m28j288j432q13oM82O11N49L67Q7k17m07l74j59P7
55114A10310K24L35M55N26N43O11O32K63n18j016n57N90J486J661J456J286J180
$$ y = [109987, 108616, 108628, 109539, 110193, 109993, 109352, 108950, 108975, 109204, 109435, 109560, 109531, 109400, 109166, 108538, 107239, 105621, 104562, 104595, 105472, 106653, 107761, 108506, 108673, 108390, 108023, 107683, 107270, 107031, 107478, 108616, 109810, 110590, 111023, 111198, 111056, 110912, 111336, 112180, 112501, 111910, 111260, 111440, 112144, 112457, 112054, 111119, 109627, 107538, 105371, 103854, 103138, 102901, 102975, 103335, 103741, 103992, 104277, 104706, 104754, 103894, 102696, 102590, 104357, 107304, 110015, 111588, 112099, 112178, 112347, 112707, 113200, 113926, 114878, 115503, 115175, 114234, 113909, 114816, 116154, 116886, 117128, 117734, 118952, 120235, 121149, 121729, 122060, 122136, 122098, 122085, 121915, 121377, 120738, 120413, 120289, 119889, 119155, 118488, 118030, 117509, 116843, 116313, 116017, 115590, 114721, 113578, 112602, 112129, 112281, 112860, 113261, 112833, 111545, 110113, 109300, 109294, 109776, 110387, 110936, 111303, 111390, 111173, 110766, 110392, 110233, 110310, 110534, 110869, 111324, 111850, 112393, 113004, 113636, 113899, 113381, 112365, 111808, 112398, 113884, 115545, 117001, 118287, 119467]
55097A19467J071R95Q90O54M47M68M39j21r97j320o79L04P97O76L90L29N91R92
55079A25393J119O21l49j189j440j093m15J55O7q61j968k350j900j261p18J08
55063A13919J299K119J902R39J3m81n91l48K23Q06R29L72o23j511j759j268m72
55046A15468J13L89N36N34K68o6j41j2L5Q1M78J145J590J558J124K45j034j946
55028A20365j530l0J047P22l31q40m61K89R91J507J582R28k83j385j726j193l35
55011A19317N9k17n01j79L99M74J36J59N87N36l31j105r22j12N25Q76J292J677
54993A22670J648J233Q55P50Q15Q42O14N3n24o34k85po4j33P8L86N99P87Q44M65
54973A30992j52k10N82J480J709J396R92M18m84j237j215n74j5J12l7k41l10j4
$$ y = [119467, 120538, 121533, 122423, 123077, 123524, 123992, 124431, 124310, 123313, 121993, 121314, 121618, 122415, 123091, 123481, 123810, 124401, 125393, 126512, 127133, 126784, 125595, 124155, 123062, 122647, 122802, 122869, 122008, 120040, 117690, 115790, 114529, 113811, 113919, 115218, 117337, 119239, 120178, 120191, 119710, 119119, 118771, 118994, 119800, 120729, 121101, 120478, 118967, 117208, 115940, 115468, 115581, 115970, 116506, 117040, 117308, 117242, 117101, 117089, 117124, 117205, 117683, 118828, 120418, 121976, 123100, 123345, 122311, 120365, 118835, 118805, 119852, 120574, 120243, 119403, 118942, 119231, 120222, 121729, 123311, 124239, 123956, 122571, 120845, 119652, 119317, 119376, 119159, 118658, 118479, 118878, 119352, 119488, 119647, 120234, 120770, 120439, 119334, 118412, 118300, 118825, 119701, 120993, 122670, 124318, 125551, 126406, 127156, 127971, 128813, 129427, 129480, 128956, 128322, 128037, 128030, 127966, 127833, 127911, 128297, 128896, 129683, 130527, 130992, 130840, 130630, 131212, 132692, 134401, 135797, 136789, 137207, 136723, 135486, 134271, 133697, 133682, 133794, 133757, 133516, 133206, 133192]
54955A33192O10J132J327J515J917K095J568N74k80q22j227j474j440j232r42
54940A36513l49O87J744K242K037J349M83qM98J890L148L503L293L182L168L067
54924A66447L347M559O334P848Q973J0158J1383J2146J2241J1751J0391P799M371
54911B77748R40k352n931r549j2080j2846j2345j1398j0279r033p891o922n774
54898A72288m278k959k482k746k950k499j505m22N10J281J774J751J395J453K421
54883A63032L748M393M155L882M310N374O781Q502J0326J1600J1920J1434J0143
54870B59600P571L736l19l610o262q764j0809j1726j1528j0691r346p541n890
54857A84421n026m703m278l766l541l436l061k696k831l093k684j682q88n31j91
$$ y = [133192, 133802, 134934, 136261, 137776, 139693, 141788, 143356, 143930, 143650, 142828, 141601, 140127, 138687, 137455, 136513, 136164, 136851, 138595, 140837, 142874, 144223, 144706, 144698, 145196, 147086, 150234, 153737, 157030, 160212, 163380, 166447, 169794, 174353, 180687, 188535, 197508, 207666, 219049, 231195, 243436, 255187, 265578, 273377, 277748, 278688, 276336, 270405, 260856, 248776, 235930, 223585, 212187, 201908, 192875, 184984, 178062, 172288, 168010, 165051, 162569, 159823, 156873, 154374, 152869, 152447, 152957, 154238, 156012, 157763, 159158, 160611, 163032, 166780, 171173, 175328, 179210, 183520, 188894, 195675, 204177, 214503, 226103, 238023, 249457, 259600, 267171, 270907, 270588, 266978, 260716, 251952, 241143, 229417, 217889, 207198, 197852, 190311, 184421, 179395, 174692, 170414, 166648, 163107, 159671, 156610, 153914, 151083, 147990, 145306, 143624, 142736, 142205, 142014]
54842A42014J82K26N6P7j7q47k004k323j616r29q47q36n01k69l42k29J54O0p55
54823A31254j368j047l20M5K19O01Q07L19m37n97nQ35J581K055J936J175L94J64
54805A37611K38J64K35R72J908J918Q25j69L6J074J620R24n46j793k263k074j537
54788A39143q45j77K43L83M51M69J99j99K6J181K411K786K727L302M357M606L679
54771A64742K800L084M280N726P392R231J0502J0770J0779J1377J1999J1195Q424
54758B72301M551P83k239m551o614q808j0741j1408j0412q647p323o761o566o415
54744A87150o021m903l010j187k38J21O10J094R01K01k8N61J196J206Q99R57J614
54727A81123K706M044N436O659P615Q280Q564Q490Q424Q590Q397O893L962N52
$$ y = [142014, 142196, 142422, 142478, 142555, 142538, 141691, 139687, 137364, 135748, 134819, 133972, 133136, 132635, 132366, 132024, 131795, 131949, 132009, 131254, 129886, 128839, 128519, 128564, 128783, 129384, 130191, 130510, 130073, 129476, 129471, 130306, 131887, 133942, 135878, 137053, 137447, 137611, 137849, 138013, 138248, 139220, 141128, 143046, 143871, 143702, 143738, 144812, 146432, 147356, 146810, 145017, 142754, 140680, 139143, 138298, 138121, 138364, 138747, 139198, 139667, 139866, 139667, 139693, 140874, 143285, 146071, 148798, 152100, 156457, 161063, 164742, 167542, 170626, 174906, 180632, 188024, 197255, 207757, 218527, 229306, 240683, 252682, 263877, 272301, 276852, 277635, 275396, 270845, 264231, 255423, 244682, 233274, 222862, 214215, 206892, 200131, 193565, 187150, 181129, 176226, 173216, 172029, 171791, 171912, 172522, 173616, 174517, 174718, 174690, 175251, 176447, 177653, 178552, 179509, 181123, 183829, 187873, 193309, 199968, 207583, 215863, 224427, 232917, 241341, 249931, 258328, 265221, 269183, 269735]
54713B69735k408m834p051r030j0404j0917j0551r462q040o768n861n133m380
54700A74896l731l398l258k857j916p47q0m12j497k572l071l000k570j885j085
54685A42817m90k99l43m11n38p04n31J92R06P54l20j362j391l52R79J780J789
54668A42476J340Q35K98m13r97q40L6P37O19J70J36L04j6o45p14j18J98k76q05
54649A42325n18L72R65Q08J91l41l83R6O47P94O80Q53J275J224M27m37p98j046
54631A47134j642k052j495k82N63P53Q35R35N78j35k83N11J347J304O52J94Ol43
54613A48580p34o09J9M61L59Q2J9K4j40l40l20j36pmq1k24k93n3M48P17L64l47
54591A47785q57j046j206j337r97r9O22M09m74r40m89J55N9o45j007o25p7Q5J60
$$ y = [269735, 267327, 262493, 255442, 246412, 236008, 225091, 214540, 205078, 197038, 190270, 184409, 179276, 174896, 171165, 167767, 164509, 161652, 159736, 158989, 158909, 158497, 157000, 154428, 151357, 148357, 145787, 143902, 142817, 142327, 142028, 141685, 141274, 140736, 140032, 139501, 139693, 140599, 141353, 141033, 139671, 138280, 137928, 138907, 140687, 142476, 143816, 144651, 144949, 144536, 143539, 142699, 142735, 143472, 144091, 144261, 144397, 144701, 144685, 144040, 143326, 143208, 143406, 143130, 142325, 141807, 142179, 143144, 143952, 144143, 143802, 143419, 143515, 144162, 144956, 145636, 146489, 147764, 148988, 149415, 148978, 148180, 147134, 145492, 143440, 141945, 141663, 142226, 142979, 143814, 144749, 145327, 145192, 144909, 145420, 146767, 148071, 148723, 148917, 148923, 148580, 147846, 147237, 147256, 147717, 148076, 148158, 148177, 148201, 148061, 147721, 147401, 147265, 147258, 147254, 147173, 146949, 146656, 146603, 147051, 147768, 148132, 147785, 146928, 145882, 144676, 143339, 142342, 142243, 142865, 143274, 142800, 141860, 141371, 141526, 141585, 140940, 139933, 139308, 139231, 139316, 139476]
54572A39476O29J218J290R09P94J177J442J043K84k13k75k05l38q50j608k023
54556A42750j432N4J404J752J257O54L13J73J35R4j27l85j57O77J368J224O31
54539A50385M49P09P69N02M02N58N04J91J90O39Q74N30J97M09P06L23m97p29J15
54520A57226J407K190K115J472O27k79j069j283o37K56K77p24j483r95n6j09r76
54503A57959j060J81J344J121k6r07j230j343j183n15K52M80K06n5j09j8L27Q73
54485A56297J019L67m90o18k9N00O39P04P73N38J14J31P67J348J250O90L29M33
54467A64762P36Q93Q11O81P20Q02N39j30o53n58j80k06o56r07o52k32O1L86Q39
54448A67056J059O66j95j097j770k060j712n88Q85J826J649O81r8o8L30J28q11
$$ y = [139476, 140105, 141323, 142613, 143522, 144316, 145493, 146935, 147978, 148262, 148049, 147774, 147569, 147231, 146381, 144773, 142750, 141318, 141372, 142776, 144528, 145785, 146439, 146752, 146925, 147060, 147154, 147027, 146642, 146485, 147162, 148530, 149754, 150385, 150834, 151543, 152312, 152814, 153216, 153774, 154278, 154469, 154659, 155298, 156172, 156702, 156899, 157308, 158014, 158337, 157840, 157111, 157226, 158633, 160823, 162938, 164410, 165037, 164758, 163689, 162406, 161769, 162025, 162302, 161578, 160095, 159100, 159044, 158935, 157959, 156899, 157080, 158424, 159545, 159519, 158612, 157382, 156039, 154856, 154341, 154593, 155073, 155279, 155224, 155115, 155097, 155424, 156297, 157316, 157683, 157193, 156575, 156546, 157046, 157685, 158389, 159162, 159700, 159814, 159945, 160712, 162060, 163310, 164000, 164329, 164762, 165498, 166391, 167202, 167883, 168603, 169405, 169944, 169814, 169161, 168603, 168423, 168217, 167561, 166654, 166002, 165770, 165831, 166217, 167056, 168115, 168781, 168586, 167489, 165719, 163659, 161947, 161359, 162244, 164070, 165719, 166400, 166302, 166234, 166564, 166692, 165881]
54431A65881j425p43P26J491Q82k54p76n99m05m67l75J27O58P80O84Q48J260J389
54413A69682R69L06k51o97r21m93O24J533J338L23m25m54j41L13J125J956J842
54396A76629N57q02j145o04J41Q90J639J969J581R09M24j55j136j861j503m90
54380A77043n6m39o37m1P00P15K4o99r52o65p6M13N16L10K9k57m56k83L15P96
54360A76300O99L93N04P94M20o72j476j214k88K82j11j251k296k345j280k7M23
54343A68855J46p6k3j61n68o41o0O84R77P58L13j08l06k86m16r31j364j079l49
54324A65365q8m74p79o34n39p64o95J15J116J536J373J028N66J9j87K27P67P76
54306A68728L62J00J18R0j8J36O40J066R66L57l05n04o8P20J439J915K142K036
$$ y = [165881, 164456, 163713, 164439, 165930, 166812, 166558, 165782, 165183, 164778, 164311, 163936, 164063, 164721, 165501, 166185, 167033, 168293, 169682, 170651, 170957, 170706, 170009, 169088, 168595, 169219, 170752, 172090, 172413, 171988, 171534, 171393, 171706, 172831, 174787, 176629, 177186, 176384, 175239, 174635, 174776, 175666, 177305, 179274, 180855, 181764, 182188, 182033, 180897, 179036, 177533, 177043, 176987, 176548, 175911, 175870, 176570, 177285, 177309, 176610, 175658, 174993, 174917, 175330, 175846, 176156, 176185, 175928, 175472, 175189, 175504, 176300, 176999, 177392, 177896, 178690, 179110, 178438, 176962, 175748, 175460, 175742, 175631, 174380, 172084, 169739, 168459, 168432, 168855, 169001, 168925, 168902, 168741, 168173, 167532, 167472, 168156, 169133, 169891, 170204, 170096, 169790, 169504, 169088, 168157, 166793, 165714, 165365, 165277, 164803, 164024, 163390, 162851, 162087, 161392, 161507, 162623, 164159, 165532, 166560, 167126, 167145, 166958, 167185, 167952, 168728, 169090, 169190, 169308, 169398, 169380, 169516, 170156, 171222, 172188, 172545, 172240, 171736, 171668, 172388, 173827, 175742, 177884, 179920]
54288A79920J681J652K486L783M476M153L414K815K162J227L56j04m70j168j999
54273B04384k471k541k479k399k322k405k621k535j900j175r99j385j833j974
54259A75345j730j141m83k55o35j149j236q71l41K20P18R09P35N77O54N85Pp31
54241A71178j026q91p67p30m80K8M89O92O54L74j01n47q28j075j308j191o11j12
54223A63748j95n88p02m79j23N40J618K391J965O32l54m57l55p45j390j721j587
54206A62198j121m51R8J08l33n99l60K3J92L55P95J287J425J195R01P54Q42J121
54188A68430J247P41l64j396j819j866j947j885j182O1J065J221O69ll66m20m29
54171A61757n51o04k63M24R05O90j8m79k00N70J091P66l50j570k132j857j216
$$ y = [179920, 181601, 183253, 185739, 189522, 193998, 198151, 201565, 204380, 206542, 207769, 208125, 208021, 207551, 206383, 204384, 201913, 199372, 196893, 194494, 192172, 189767, 187146, 184611, 182711, 181536, 180537, 179152, 177319, 175345, 173615, 172474, 171991, 171736, 171101, 169952, 168716, 167845, 167504, 167724, 168442, 169351, 170086, 170663, 171317, 171902, 171909, 171178, 170152, 169261, 168494, 167764, 167284, 167312, 167801, 168493, 169147, 169521, 169420, 168873, 168045, 166970, 165662, 164471, 163860, 163748, 163553, 162965, 162263, 161784, 161661, 162201, 163819, 166210, 168175, 168807, 168453, 167996, 167641, 166896, 165506, 163785, 162198, 161077, 160626, 160724, 160832, 160499, 159900, 159540, 159563, 159755, 160110, 160905, 162192, 163617, 164812, 165713, 166467, 167309, 168430, 169677, 170418, 170054, 168658, 166839, 164973, 163026, 161141, 159959, 160020, 161085, 162306, 162975, 162972, 162606, 162186, 161757, 161206, 160602, 160339, 160763, 161668, 162358, 162340, 161861, 161661, 162231, 163322, 164088, 163738, 162168, 160036, 158179, 156963]
54154A56963p27m44j80O4J53K08N17J104J624J782J593J148M97j43l42R1P87J195
54136A65890J187J009Q31O24M24L64M26M57M30L73P3o79j490j545o45L23L96l61
54118A68087j092j197p03J12R42J438J443J212J052R59R02J173J790J964R03r17
54102A78068k126k129j538r32j26R27J535J229N72L16K76j66q71j049m00N28J055
54085A75169R26K57n76r73n49L88J121J281J104J025J200J441J389Q84K72J06
54069A84465M23O26K98k14l34p0J54K17L77P16J004J072J012R21P69M48m7n18
54051A91319n81m9O84R50O68M97R39J730K393K943L531L891L689L176K965L309
54035B22054M034M959N976O843P392P746P967P781P078O308N900N588M931M192
$$ y = [156963, 156236, 155792, 155612, 155676, 155829, 156037, 156554, 157658, 159282, 161064, 162657, 163805, 164302, 164159, 163817, 163908, 164695, 165890, 167077, 168086, 168917, 169541, 169965, 170329, 170755, 171212, 171642, 172015, 172088, 171409, 169919, 168374, 167729, 168052, 168448, 168087, 166995, 165798, 165095, 165207, 166149, 167587, 169030, 170242, 171294, 172253, 173155, 174328, 176118, 178082, 178985, 178068, 175942, 173813, 172275, 171343, 171217, 172144, 173679, 174908, 175480, 175796, 176072, 175906, 175035, 173986, 173586, 174114, 175169, 176095, 176352, 175776, 174803, 174254, 174642, 175763, 177044, 178148, 179173, 180373, 181814, 183203, 184087, 184359, 184465, 184888, 185514, 185812, 185598, 185264, 185194, 185348, 185565, 185942, 186658, 187662, 188734, 189746, 190667, 191436, 191884, 191837, 191319, 190738, 190689, 191373, 192323, 192991, 193488, 194427, 196157, 198550, 201493, 205024, 208915, 212604, 215780, 218745, 222054, 226088, 231047, 237023, 243866, 251258, 259004, 266971, 274752, 281830, 288138, 294038, 299626, 304557, 308749]
54021C08749L947M055L790K919J876R33m4r35j282j131j238k133l416m342m652
54006C07096m605m491m431m431m462m564m854n210n181m554l804l476l325k675
53992B47033j602j034j535k584l287l269k664j785j067r46j449k118k471k275
53978B18947j430p3J168J577J182O81M11pp62j306j149o12k43L0N37J037R71M25
53960B21384J62N89J260J503J197P13M64P22J536K583L200K941K112J525J631
53945B43522K062K207J983J787J837K036K398L196M475N851P011Q063R161J0192
53931C05781J1194J2658J4926J7610K0080K2085K3290K2518J8430J1221K974l913
53919D78854q350j0553j1044j0086p917n171k791j295k22J278L145M301M168L630
$$ y = [308749, 312696, 316751, 320541, 323460, 325336, 326269, 326225, 325290, 324008, 322877, 321639, 319506, 316090, 311748, 307096, 302491, 298000, 293569, 289138, 284676, 280112, 275258, 270048, 264867, 260313, 256509, 253033, 249708, 247033, 245431, 244397, 242862, 240278, 236991, 233722, 231058, 229273, 228206, 227260, 225811, 223693, 221222, 218947, 217517, 217444, 218612, 220189, 221371, 222052, 222463, 222456, 221694, 220388, 219239, 218627, 218384, 218414, 218951, 219988, 220959, 221384, 221546, 222135, 223395, 224898, 226095, 226808, 227272, 227994, 229530, 232113, 235313, 238254, 240366, 241891, 243522, 245584, 247791, 249774, 251561, 253398, 255434, 257832, 261028, 265503, 271354, 278365, 286428, 295589, 305781, 316975, 329633, 344559, 362169, 382249, 404334, 427624, 450142, 468572, 479793, 482767, 478854, 470504, 459951, 448907, 438821, 430904, 425733, 422942, 421647, 421425, 422703, 425848, 430149, 434317, 437947]
53905D37947L791M387M321L384K324J401J54j383k394k569k649l170l632l518
53891D38394l279l642m550n534o571p751q593q467p580o817o675o859o877o611
53877C48588o234n969n884n823n506m916m421m327m443m317l779l130k878l283
53863B83678m071m585m409l805l306k994k533j886j466j533j822j980j909j629
53849B45750j104m38J04M06N19L97m3n70p94p44p86q96n76L61J410J966J827R82
53831B47771m75k008k777k464j625r29n41l97n48r23j171j113r14o22OQ97J445
53814B33612J237N85N0j30J09P99J649K098K042K050K563L368M157M992N795O062
53798B71038N565M834M465M489M753N353O092O222N389M281L687L414K847K051
$$ y = [437947, 441738, 446125, 450446, 453830, 456154, 457555, 457709, 456326, 453932, 451363, 448714, 445544, 441912, 438394, 435115, 431473, 426923, 421389, 414818, 407067, 398474, 390007, 382427, 375610, 368935, 362076, 355199, 348588, 342354, 336385, 330501, 324678, 319172, 314256, 309835, 305508, 301065, 296748, 292969, 289839, 286961, 283678, 279607, 275022, 270613, 266808, 263502, 260508, 257975, 256089, 254623, 253090, 251268, 249288, 247379, 245750, 244646, 244208, 244312, 244718, 245237, 245634, 245591, 245021, 244227, 243483, 242697, 241801, 241225, 241586, 242996, 244962, 246789, 247771, 247296, 245288, 242511, 240047, 238422, 237493, 236952, 236555, 236007, 235084, 233913, 232800, 231886, 231264, 231270, 232167, 233612, 234849, 235434, 235484, 235354, 235463, 236262, 237911, 240009, 242051, 244101, 246664, 250032, 254189, 259181, 264976, 271038, 276603, 281437, 285902, 290391, 295144, 300497, 306589, 312811, 318200, 322481, 326168, 329582, 332429, 334480]
53784C34480J528J221P04L9l09k63j67k11m16j026k182l428m146m391m613m755
53768C12065m328l332k494k432l017l627l655k891j683o57nO62J588K442K981
53753B91617L629M874O588Q471J0761J3799J7305K0626K3244K4264K2024J5325
53741D62527N076o004j5251k1209k3590k3117k1233j9011j6390j3110r896p820
53729B90972o806n878m717l825l324k729j984j565j455j123o27n68q52o93j69
53714B54657l66j496k172j339K22J178J413J578J744J607J437J723K186K161J719
53699B66252J539J807K069K083K136K372K488K196J636J207J232J743K342K437
53685B93539J869J154Q48P96L99n26j529k151k413k610k827k834k448j854j425
$$ y = [334480, 336008, 337229, 337933, 337972, 337663, 337400, 337233, 337022, 336606, 335580, 333398, 329970, 325824, 321433, 316820, 312065, 307737, 304405, 301911, 299479, 296462, 292835, 289180, 286289, 284606, 283949, 283944, 284606, 286194, 288636, 291617, 295246, 300120, 306708, 315179, 325940, 339739, 357044, 377670, 400914, 425178, 447202, 462527, 467603, 461599, 446348, 425139, 401549, 378432, 357199, 338188, 321798, 308688, 298792, 290972, 284166, 278288, 273571, 269746, 266422, 263693, 261709, 260144, 258689, 257566, 256939, 256371, 255519, 254826, 254657, 254291, 252795, 250623, 249284, 249506, 250684, 252097, 253675, 255419, 257026, 258463, 260186, 262372, 264533, 266252, 267791, 269598, 271667, 273750, 275886, 278258, 280746, 282942, 284578, 285785, 287017, 288760, 291102, 293539, 295408, 296562, 297410, 298206, 298605, 298079, 296550, 294399, 291986, 289376, 286549, 283715, 281267, 279413, 277988]
53670B77988j183p11J75R81J080N29j10o25j122j355q46J08M38l08j207j110m9
53653B72673R96J288Q32R1k20N60K339M059M693M295L698L401L266L075K777K233
53637C10056J258Mj109j837k210k223j906j601j687j898j468j67J130J367N23
53622B98232m05n77r4M66Q79J366K035K649L025L300L599L707L381K812K412K282
53606C29069K218K230K551L092L330K989K433K204K394K661K640K147J223K37
53592C61418k96k38ro7l57m79k44J45K88j89j398k889l746l391k285j558j815
53575C42890k561k918k671k324k234k124j620r48o61q00q68o52n60q48j085q45
53559C19171m45m49o63l95M38J168J349J266J225J075O52K87M35J051J630J766
$$ y = [277988, 276805, 276094, 276269, 277250, 278330, 278859, 278749, 278124, 277002, 275647, 274801, 274909, 275347, 275039, 273832, 272722, 272673, 273669, 274957, 275789, 275880, 275660, 276220, 278559, 282618, 287311, 291606, 295304, 298705, 301971, 305046, 307823, 310056, 311314, 311318, 310209, 308372, 306162, 303939, 302033, 300432, 298745, 296847, 295379, 295212, 296342, 297709, 298232, 297827, 297250, 297156, 297622, 298501, 299867, 301902, 304551, 307576, 310876, 314475, 318182, 321563, 324375, 326787, 329069, 331287, 333517, 336068, 339160, 342490, 345479, 347912, 350116, 352510, 355171, 357811, 359958, 361181, 361418, 361122, 360884, 360875, 360808, 360451, 359972, 359728, 359873, 360161, 359972, 358574, 355685, 351939, 348548, 346263, 344705, 342890, 340329, 337411, 334740, 332416, 330182, 328058, 326438, 325490, 324829, 324029, 323161, 322509, 321949, 321101, 320016, 319171, 318726, 318277, 317614, 317219, 317657, 318825, 320174, 321440, 322665, 323740, 324392, 324679, 325114, 326165, 327795, 329561]
53543C29561J588J684K489L621M078L504K900L434M808N675N577N474O105O926
53529C87424P232P325P848Q597Q983R166R814J0914J1706J1819J1751J2112J2899
53516E17590J3699J4257J4732J5578J7082J8861K0080K0468K0788K1873K3457
53505G18465K4506K4591K4258K4065K3813K3046K1832K0735K0167K0035J9949
53494I65462J9678J9401J9493K0004K0500K0524K0136J9817J9887K0176K0222
53483A185300J9687J8642J7531J6684J5836J4399J2336J0445R405Q856P858O148
53471A343127M327K849J359o90l237n758p944r867j1653j3336j4989j6640j7978
53458A249570j8553j8391j8152j8371j8822j9030j9246k0233k2005k3429k3453
$$ y = [329561, 331149, 332833, 335322, 338943, 343021, 346525, 349425, 352859, 357667, 363342, 368919, 374393, 380498, 387424, 394656, 401981, 409829, 418426, 427409, 436575, 446389, 457303, 469009, 480828, 492579, 504691, 517590, 531289, 545546, 560278, 575856, 592938, 611799, 631879, 652347, 673135, 695008, 718465, 742971, 767562, 791820, 815885, 839698, 862744, 884576, 905311, 925478, 945513, 965462, 985140, 1004541, 1024034, 1044038, 1064538, 1085062, 1105198, 1125015, 1144902, 1165078, 1185300, 1204987, 1223629, 1241160, 1257844, 1273680, 1288079, 1300415, 1310860, 1320265, 1329121, 1336979, 1343127, 1347454, 1350303, 1351662, 1350972, 1347735, 1341977, 1334033, 1324166, 1312513, 1299177, 1284188, 1267548, 1249570, 1231017, 1212626, 1194474, 1176103, 1157281, 1138251, 1119005, 1098772, 1076767, 1053338, 1029885]
53447A029885k2262k0764j9423j8184j7162j6589j6191j5431j4373j3501j2619
53436H43386j0848q027n372m120m105m133l393j933j68J585L218M855O614Q228
53422H25787R234R784J0735J2557J4605J5989J6823J7988J9930K2285K4501K6294
53410A026512K7559K8332K8885K9563L0536L1933L3878L6156L8135L9486M0648
53399A391623M2112M3643M4812M5936M7678M9842N1464N2219N2850N3917N4851
53388A930947N4712N3434N1772N0392M9378M8481M7377M5741M3370M0249L6474
53377B452327L2191K7660K3237J9134J5299J1580P905M235M24l743q389j3372
53365B568488j8356k3191k8273l4244m1042m7479n2154n4770n6165n7111n7577
$$ y = [1029885, 1007623, 986859, 967436, 949252, 932090, 915501, 899310, 883879, 869506, 856005, 843386, 832538, 824511, 819139, 815019, 810914, 806781, 803388, 801455, 801287, 802872, 806090, 810945, 817559, 825787, 835021, 844805, 855540, 868097, 882702, 898691, 915514, 933502, 953432, 975717, 1000218, 1026512, 1054071, 1082403, 1111288, 1140851, 1171387, 1203320, 1237198, 1273354, 1311489, 1350975, 1391623, 1433735, 1477378, 1522190, 1568126, 1615804, 1665646, 1717110, 1769329, 1822179, 1876096, 1930947, 1985659, 2039093, 2090865, 2141257, 2190635, 2239116, 2286493, 2332234, 2375604, 2415853, 2452327, 2484518, 2512178, 2535415, 2554549, 2569848, 2581428, 2589333, 2593568, 2593992, 2590249, 2581860, 2568488, 2550132, 2526941, 2498668, 2464424, 2423382, 2375903, 2323749, 2268979, 2212814, 2155703, 2098126]
53354B098126n7265n6392n5435n4374n2727n0373m7979m6358m5638m5293m4869
53343A541423m4383m3996m3620m3051m2284m1374m0128l8255l5819l3244l0852
53332A104417k8683k6806k5386k4305k3023k1110j8706j6291j4201j2573j1465
53321H81868j0750r990q740o995n184l755k843k183j352k18Q75J557K080L175
53307H37545N153P499R511J1008J2211J3320J4506J5985J7780J9530K0836K1670
53295A006554K2278K2889K3745K5121K7024K8965L0285L0627L0076K9005K7751
53284A304320K6294K4280K1680J9187J7408J5841J3414J0098O991M658K406l32
53272A466245l021n121p145r621j1920j3268j4225j5890j8095j9808k0900k2157
$$ y = [2098126, 2040861, 1984469, 1929034, 1874660, 1821933, 1771560, 1723581, 1677223, 1631585, 1586292, 1541423, 1497040, 1453044, 1409424, 1366373, 1324089, 1282715, 1242587, 1204332, 1168513, 1135269, 1104417, 1075734, 1048928, 1023542, 999237, 976214, 955104, 936398, 920107, 905906, 893333, 881868, 871118, 861128, 852388, 845393, 840209, 836454, 833611, 831428, 830076, 829858, 830733, 832290, 834370, 837545, 842698, 850197, 859708, 870716, 882927, 896247, 910753, 926738, 944518, 964048, 984884, 1006554, 1028832, 1051721, 1075466, 1100587, 1127611, 1156576, 1186861, 1217488, 1247564, 1276569, 1304320, 1330614, 1354894, 1376574, 1395761, 1413169, 1429010, 1442424, 1452522, 1459513, 1464171, 1466577, 1466245, 1463224, 1458103, 1450958, 1441337, 1429417, 1416149, 1401924, 1386034, 1367939, 1348131, 1327231, 1305074]
53260A305074k3613k4435k4625k5374k7159k8834k9315k9164k9586l0564l0946
53249A001459l0036k8293k6585k5388k4709k4403k4377k4570k4813k4807k4339
53238G19139k3492k2459k1434k0779k0888k1405k1067j9005j6018j3761j2802
53227E06029j2316j1545j0642r920r245q488p875p560p451p642q366r280r586
53214C86113r086q427p966p244n989m829m455m723n128n424n297m185k239p81
53200C10340r37k214l270l679m001m421m356l478k305j526j376j700k157k227
53186B72693j630q24o61j356k166k290j761j248j198j352j171o36l59p65j230
53171B54046o67R32K155J841N91m7L98R35P36K26K69Q03R27J78q20j074l99L78
$$ y = [1305074, 1281461, 1257026, 1232401, 1207027, 1179868, 1151034, 1121719, 1092555, 1062969, 1032405, 1001459, 971423, 943130, 916545, 891157, 866448, 842045, 817668, 793098, 768285, 743478, 719139, 695647, 673188, 651754, 630975, 610087, 588682, 567615, 548610, 532592, 518831, 506029, 493713, 482168, 471526, 461606, 452361, 443873, 435998, 428438, 420987, 413345, 404979, 395699, 386113, 377027, 368600, 360634, 353390, 347401, 342572, 338117, 333394, 328266, 322842, 317545, 313360, 311121, 310340, 309403, 307189, 303919, 300240, 296239, 291818, 287462, 283984, 281679, 280153, 278777, 277077, 274920, 272693, 271063, 270239, 269578, 268222, 266056, 263766, 262005, 260757, 259559, 258207, 257036, 256400, 256041, 255276, 254046, 253379, 254311, 256466, 258307, 258898, 258851, 259249, 260184, 260920, 261146, 261415, 262218, 263145, 263323, 262503, 261429, 261030, 261408]
53153B61408M20j74o44n90l24j42J46P62J429J734J638J264N61l10o22J28J297
53136B67981J672R86J67n8j7k58o00n44j61N2m5j81k65m67p40p34l47P5J92lm10
53115B66295j062j837k299k114j450o91Q0Q53J206N98p79j975k322k040j621j133
53099B49709m99k4m3l03l02j07k21o78r22o82m03n59j019j355j405j230q82m74
53081B38601k27j85j55j61o09j635k570k546j534l38L80O26N85J38p65j554j439
53064B26612m16N07M23m10r64p53k72j14k21k57k32k51q1M26Q28N95j8l01j50
53045B24951o7j36J53Q95J463J511J519J858K028J444M41j84k44j09L7K02O4p31
53027B35095j805k240j676p40k61m87j144j828k140j782q03L52J195J496J301
$$ y = [261408, 261828, 261654, 261010, 260420, 260096, 259954, 260100, 260862, 262291, 264025, 265663, 266927, 267488, 267178, 266556, 266684, 267981, 269653, 270639, 270806, 270748, 270731, 270473, 269873, 269329, 269168, 269220, 269175, 268994, 268729, 268262, 267522, 266788, 266441, 266516, 266708, 266705, 266295, 265233, 263396, 261097, 258983, 257533, 256842, 256922, 257775, 258981, 259579, 258800, 256825, 254503, 252463, 250842, 249709, 249210, 249186, 249143, 248840, 248538, 248431, 248210, 247532, 246610, 245928, 245525, 244966, 243947, 242592, 241187, 239957, 239075, 238601, 238374, 238189, 238034, 237873, 237264, 235629, 233059, 230513, 228979, 228641, 229021, 229647, 230232, 230370, 229605, 228051, 226612, 226196, 226703, 227126, 226716, 225752, 224999, 224727, 224613, 224392, 224135, 223903, 223652, 223571, 223997, 224825, 225420, 225402, 225101, 224951, 224884, 224748, 224901, 225796, 227259, 228770, 230289, 232147, 234175, 235619, 236060, 235876, 235632, 235523, 235560, 235762, 235826, 235095, 233290, 231050, 229374, 228634, 228373, 227886, 226742, 224914, 222774, 220992, 220189, 220541, 221736, 223232, 224533]
53012B24533Q23L56J16P5Q3J06K16L91M82M47M04L38m0r22j930k286j667o77k31
52993B20617m31n46j32K54j22j026j521j182m28K78Q64J233J114O13L43O29J053
52976B21610J116R12P83P13N37L54L48M29M35M70O50Q25Q14O77M58K1m97o07j78
52957B29870J62r6n42n34k50k81n18l80K3k7n57p40k57Pp37j969k521k031j187
52938B17435p64q98j172j066m51K03K65k65p36p65p39j080j462j271n61N5L66
52921B07094P59J381J682J137M1p45p37k38R1o2l91l50J62N34R9r15j485j059
52903B06998l14j93n04j96R31J710J193J12JJ107K017J489K7p40L4J542K241J383
52885B18838m42k012k575k229j505q49m67l20j52K45P34J017J102J187J100M47
$$ y = [224533, 225356, 225712, 225828, 225903, 225986, 226092, 226308, 226699, 227181, 227628, 228032, 228370, 228330, 227408, 225478, 223192, 221525, 220848, 220617, 220186, 219640, 219508, 219762, 219640, 218614, 217093, 215911, 215483, 215761, 216625, 217858, 218972, 219585, 219928, 220557, 221610, 222726, 223638, 224421, 225134, 225671, 226025, 226373, 226802, 227237, 227707, 228357, 229182, 229996, 230673, 231131, 231152, 230655, 230048, 229870, 230032, 229936, 229394, 228860, 228610, 228329, 227811, 227431, 227454, 227427, 226870, 226130, 225873, 225880, 225143, 223174, 220653, 218622, 217435, 216671, 215773, 214601, 213535, 213084, 213287, 213552, 213287, 212551, 211786, 211047, 209967, 208505, 207234, 206673, 206728, 207094, 207853, 209234, 210916, 212053, 212094, 211349, 210612, 210374, 210465, 210403, 210012, 209662, 209824, 210358, 210457, 209542, 208057, 206998, 206684, 206491, 205987, 205791, 206722, 208432, 209625, 209737, 209738, 210845, 212862, 214351, 214378, 213638, 213672, 215214, 217455, 218838, 218396, 216384, 213809, 211580, 210075, 209226, 208759, 208439, 208287, 208532, 209266, 210283, 211385, 212572, 213672, 214119]
52869B14119m96p16J55J133J174O41N74J006J095O81N79J161J810K004K006K119
52853B29045K120J837J565J418J003J09r04j782k679l454l420k433j453j358j783
52838B17831j853j476j144r16m93j6Jn20j078j221q19J7Q80J146O30o8k53K8K44
52819B10920J37j34l43k70K08P36O79Q9o4Q51K219L136L667M366N117N325M813
52802B41452L587J213k404n880p345o596n179m187l208j737m46k63r66j517j404
52787B05120j020r11j123j341j389j440j682j829j354k85O21Q66Q41J016J045
52772A97135M48k44o4Q43J283P42R3K90J138J761J685J120N59M09O85Q89N14l45
52754B08941j132j480j312n56O67J700J889J439J118J160J146R51R69J310J484
$$ y = [214119, 213623, 212907, 213062, 214195, 215369, 216010, 216584, 217590, 218685, 219366, 219945, 221106, 222916, 224920, 226926, 229045, 231165, 233002, 234567, 235985, 236988, 237097, 236193, 234411, 231732, 228278, 224858, 222425, 220972, 219614, 217831, 215978, 214502, 213358, 212442, 211949, 211933, 211934, 211414, 210336, 209115, 208296, 208313, 209193, 210339, 210969, 210901, 210648, 210676, 210920, 211057, 210923, 210580, 210310, 210518, 211254, 211933, 212022, 211958, 212809, 215028, 218164, 221831, 226197, 231314, 236639, 241452, 245039, 246252, 243848, 237968, 230623, 224027, 218848, 214661, 211453, 209716, 209270, 209007, 208041, 206524, 205120, 204100, 203189, 202066, 200725, 199336, 197896, 196214, 194385, 193031, 192746, 193367, 194233, 195074, 196090, 197135, 197583, 197339, 197275, 198118, 199401, 200143, 200236, 200526, 201664, 203425, 205110, 206230, 206789, 207198, 207883, 208772, 209286, 208941, 207809, 206329, 205017, 204461, 205128, 206828, 208717, 210156, 211274, 212434, 213580, 214531, 215500, 216810, 218294]
52739B18294J159N42j10p23j045p36k3M15L72K64K75Q4l09l70R2N35N28K33k36
52720B19241j124k212k516j530j31M56J64j23L9J97k02j041j667j550q33j73L8
52703B07033J60O39J131R68L07j9K18L88K21K13N43O24K13LM25P87L89k77l44
52684B13622O7K31L9o2J3Nk1J65M02M11L31L20L5p09j143l98R91J539P33l44n21
52663B15706J57R02J226J175R47P29O53P38R85J411J843J865J330P76R14J683
52647B33040K276J994P94q32k128k418j703q42p07j245j786k029k154k139j691
52632B18430r20l01J09P72J745K369K263J931J930J927J186k54j512j917j603
52617B26155j104p54n91n26m48k87q2R9K55L65K73r5m46l68J09M59L58R0O0J55
$$ y = [218294, 219453, 219995, 219885, 219162, 218117, 217381, 217358, 217773, 218145, 218409, 218684, 218768, 218459, 218089, 218181, 218716, 219244, 219477, 219241, 218117, 215905, 213389, 211859, 211728, 212184, 212348, 212225, 212264, 212461, 212259, 211218, 209551, 208001, 207168, 206995, 207033, 207193, 207832, 208963, 209931, 210238, 210219, 210437, 210825, 211046, 211259, 211802, 212426, 212639, 212642, 213067, 213854, 214243, 213966, 213622, 213689, 213920, 213959, 213897, 213910, 213915, 213894, 214059, 214461, 214872, 215203, 215523, 215558, 214849, 213706, 213308, 214299, 215838, 216571, 216227, 215706, 215863, 216765, 217991, 219166, 220113, 220842, 221495, 222233, 223218, 224629, 226472, 228337, 229667, 230443, 231357, 233040, 235316, 237310, 238104, 237272, 235144, 232726, 231023, 230181, 229474, 228229, 226443, 224414, 222260, 220121, 218430, 217510, 217209, 217318, 218090, 219835, 222204, 224467, 226398, 228328, 230255, 231441, 231187, 229675, 227758, 226155, 225051, 224297, 223706, 223180, 222732, 222445, 222363, 222462, 222717, 223082, 223355, 223260, 222814, 222446, 222555, 223014, 223372, 223462, 223522, 223677]
52597B23677N3q8K17R69J559J615J463J515J684J697J618J651J719J640J419J115
52581B43523O95L85O33J331J592R02k9k82n0j07l75k16J84lo63p37RM65o1q35
52561B46361j036r86j177j189m90L42L61k87p12o90q04j296j608j201j88Q87J557
52544B37844J715J562J247N81m97j293r28K96R99N33j46m5M47M95K91M63P27L10
52526B44601n49p96j17O96R61P46K93l37q69q34k13N28J041J312J374J323J531
52509B50691K210K839K702J866J019M11k60r35j106p56o34j214k038k429k349
52494B50017k156j891j254j92Q12J157P89L77N46J004Q55q6q89p57q1K89K05L6
52476B48781j29k20L21J789L220L266J974P48N23R44J354J587J601J260Q52R82
$$ y = [223677, 223730, 223642, 223859, 224828, 226387, 228002, 229465, 230980, 232664, 234361, 235979, 237630, 239349, 240989, 242408, 243523, 244218, 244603, 245236, 246567, 248159, 249061, 249032, 248750, 248700, 248593, 248218, 248002, 248186, 248183, 247520, 246783, 246792, 247257, 247196, 246361, 245325, 244339, 243162, 241973, 241483, 241825, 242186, 241899, 241187, 240497, 239693, 238397, 236789, 235588, 235400, 236287, 237844, 239559, 241121, 242368, 242949, 242452, 241159, 240231, 240527, 241526, 242059, 241913, 241868, 242315, 242810, 243101, 243564, 244291, 244601, 244052, 243256, 243139, 243835, 244796, 245542, 245835, 245498, 244629, 243795, 243582, 244110, 245151, 246463, 247837, 249160, 250691, 252901, 255740, 258442, 260308, 261327, 261738, 261478, 260543, 259437, 258681, 258047, 256833, 254795, 252366, 250017, 247861, 245970, 244716, 244524, 245336, 246493, 247282, 247659, 248205, 249209, 250064, 249978, 249089, 248332, 248251, 248540, 248745, 248781, 248652, 248432, 248753, 250542, 253762, 257028, 259002, 259750, 260273, 261217, 262571, 264158, 265759, 267019, 267871, 268853]
52460B68853J689K241K105J463O74j03o71q59j044j777k791l119k484j706j432
52445B61039j335r93o92q30j164j268j162r93o17qM77O54Q00R41N46m85j196p66
52427B52948K24N24n3n35k59M34R82J284J448J362R44M32J95L32O56J005J492
52410B63415K312L312L979M062M102M862O302P621Q348Q781R136Q864P232M208
52396C46536M55l140n694o659o454o197o381o233n061l615l151l575l564k500
52382B84767j211n05n9P58J766K414K809L454M267M592M131L279K500J947J682
52367C16591J708J608P80o79j826k010j734j852k294k267j542p60l99j61L01P00
52351C06164N19k35j062j484j290n80J87N69O72J022J717K216K230K215K619L159
$$ y = [268853, 270542, 272783, 274888, 276351, 277025, 276922, 276251, 275392, 274348, 272571, 269780, 266661, 264177, 262471, 261039, 259704, 258711, 258019, 257189, 256025, 254757, 253595, 252602, 251985, 251977, 252454, 253108, 253908, 254849, 255395, 254910, 253714, 252948, 253172, 253696, 253643, 253108, 252849, 253283, 254265, 255549, 256997, 258359, 259303, 259735, 259930, 260262, 260918, 261923, 263415, 265727, 269039, 273018, 277080, 281182, 286044, 292346, 299967, 308315, 317096, 326232, 335096, 342328, 346536, 346991, 343851, 338157, 331498, 325044, 318847, 312466, 306233, 301172, 297557, 294406, 290831, 287267, 284767, 283556, 283051, 282992, 283750, 285516, 287930, 290739, 294193, 298460, 303052, 307183, 310462, 312962, 314909, 316591, 318299, 319907, 320687, 320008, 318182, 316172, 314438, 312586, 310292, 308025, 306483, 305723, 305324, 305163, 305464, 306164, 306683, 306448, 305386, 303902, 302612, 302032, 302219, 302788, 303460, 304482, 306199, 308415, 310645, 312860, 315479, 318638]
52335C18638L405L576M094M732M938M742M770N417O539P775Q744R173R228R440
52321D05211R887R907R156Q317Q020P718O622N273M896N465N726N170M709N161
52307E01238O202P125P651P622O874N841N400N728O106O135O234O558O416N321
52293E90451L780K433J143m16k002l164l784l709k639q93M07N85K72L43P44J000
52277E84551J269J947K787L227L334L613M152M632M901M977M810M610M937N860
52263F39607O503O218N710O066P015P263O413N532N663O593P433P667P381O912
52249G31976O546O240N562M166K383J020O04J095K153L327M142M422M531M884
52235G83051N338N487N414N651O352O982P002O564O383P007Q199Q983Q536P145
$$ y = [318638, 322043, 325619, 329713, 334445, 339383, 344125, 348895, 354312, 360851, 368626, 377370, 386543, 395771, 405211, 415098, 425005, 434161, 442478, 450498, 458216, 464838, 470111, 475007, 480472, 486198, 491368, 496077, 501238, 507440, 514565, 522216, 529838, 536712, 542553, 547953, 553681, 559787, 565922, 572156, 578714, 585130, 590451, 594231, 596664, 597807, 597391, 595389, 592225, 588441, 584732, 582093, 581200, 581607, 582192, 582464, 582807, 583551, 584551, 585820, 587767, 590554, 593781, 597115, 600728, 604880, 609512, 614413, 619390, 624200, 628810, 633747, 639607, 646110, 652328, 658038, 664104, 671119, 678382, 684795, 690327, 695990, 702583, 710016, 717683, 725064, 731976, 738522, 744762, 750324, 754490, 756873, 757893, 758497, 759592, 761745, 765072, 769214, 773636, 778167, 783051, 788389, 793876, 799290, 804941, 811293, 818275, 825277, 831841, 838224, 845231, 853430, 862413, 870949, 878094]
52221H78094N971N699N895N958O113O825P705P889P305O791O928P518Q211Q941
52207I75843R551R669R318R095R347R503Q714O990N415N109O056P079P093O347
52193A085129O049O679P272O822N859N675O303O286M732K552J165O56J2j311k839
52178A141041l992m811n583o328o817o836o240n115m043l879m799n794n602m097
52164A067105k343j269q08n62n23p16o28J75J169J355N94l25r15j483k207k517
52148A056102j854n10P47J482J727J693J641J714J591P32q79k622m054n267o219
52133A046024o443n817n007m504l805k243k05J334K215L296N251P709R670J0399
52119A057874J0022R444R563J0270J0548R700Q099O480N162M293M152M430M004
$$ y = [878094, 884065, 889764, 895659, 901617, 907730, 914555, 922260, 930149, 937454, 944245, 951173, 958691, 966902, 975843, 985394, 995063, 1004381, 1013476, 1022823, 1032326, 1041040, 1048030, 1053445, 1058554, 1064610, 1071689, 1078782, 1085129, 1091178, 1097857, 1105129, 1111951, 1117810, 1123485, 1129788, 1136074, 1140806, 1143358, 1144523, 1145179, 1145191, 1143880, 1141041, 1137049, 1132238, 1126655, 1120327, 1113510, 1106674, 1100434, 1095319, 1091276, 1087397, 1082598, 1076804, 1071202, 1067105, 1064762, 1063493, 1062685, 1062123, 1061600, 1060884, 1060256, 1060431, 1061600, 1062955, 1063549, 1063224, 1062309, 1060826, 1058619, 1056102, 1054248, 1053738, 1054485, 1055967, 1057694, 1059387, 1061028, 1062742, 1064333, 1065065, 1064186, 1061564, 1057510, 1052243, 1046024, 1039581, 1033764, 1028757, 1024253, 1020448, 1018205, 1018000, 1019334, 1021549, 1024845, 1030096, 1037805, 1047475, 1057874, 1067896, 1077340, 1086903, 1097173, 1107721, 1117421, 1125520, 1132000, 1137162, 1141455, 1145607, 1150037, 1154041]
52106A154041K360Q19J213L532N951P099P283P416P868Q664R851J1071J1465J0576
52092A249209Q902P099N020K076j639n067p056p277o338n156m286l690k980j769
$$ y = [1154041, 1156401, 1157220, 1158433, 1161965, 1167916, 1175015, 1182298, 1189714, 1197582, 1206246, 1216097, 1227168, 1238633, 1249209, 1258111, 1265210, 1270230, 1272306, 1270667, 1265600, 1258544, 1251267, 1244929, 1239773, 1235487, 1231797, 1228817, 1227048]
$$ [...]
##END NTUPLES=NMR SPECTRUM
##END=
