
##TITLE=UV1249_M10_1340-1211_5_7409397_KHW9QBcY3a
##JCAMPDX= 6.0         $$ Bruker NMR JCAMP-DX V2.0
##DATA TYPE= NMR SPECTRUM
##DATA CLASS= NTUPLES
##ORIGIN= BRUKER
##OWNER= Administrator
$$ 1.72 TOPSPIN		Version 2.1
$$ 2013-01-24 19:30:28.998 -0500  Administrator@X
$$ Compression mode = diff/dup
##.OBSERVE FREQUENCY= 400.02188249412
##.OBSERVE NUCLEUS= ^1H
##.ACQUISITION MODE= SIMULTANEOUS (DQD)
##.ACQUISITION SCHEME= undefined
##.AVERAGES= 64
##.DIGITISER RES= 22
##SPECTROMETER/DATA SYSTEM= spect
##.PULSE SEQUENCE= noesygpps1d.comp
##.SOLVENT NAME= COFFEE_meoh
##.SHIFT REFERENCE= INTERNAL, COFFEE_meoh, 1, 14.96094
##AUDIT TRAIL= $$ (NUMBER, WHEN, WHO, WHERE, PROCESS, VERSION, WHAT)
$$ ##TITLE= Audit trail, TOPSPIN		Version 2.1
$$ ##JCAMPDX= 5.01
$$ ##ORIGIN= Bruker BioSpin GmbH
$$ ##OWNER= Administrator
$$ $$ E:\/data/COFFEE/nmr/UV1249_M10_1340-1211_5_7409397_KHW9QBcY3a/12/pdata/1/auditp.txt
$$ ##AUDIT TRAIL=  $$ (NUMBER, WHEN, WHO, WHERE, PROCESS, VERSION, WHAT)
(   1,<2013-01-24 19:30:23.186 -0500>,<Administrator>,<X>,<go>,<TOPSPIN 2.1>,
      <created by zg
	started at 2013-01-24 19:18:53.467 -0500,
	POWCHK enabled, PULCHK disabled,
       configuration hash MD5:
       86 BA 57 50 F2 9D 5C 9B 26 00 A9 28 5F 66 2E 89
       data hash MD5: 64K
       70 68 0C 2F 51 26 7E C5 C8 7C D6 60 5A 89 E4 49>)
(   2,<2013-01-24 19:30:26.217 -0500>,<Administrator>,<X>,<proc1d>,<TOPSPIN 2.1>,
      <Start of raw data processing
       efp LB = 0.3 FT_mod = 6 PKNL = 1 PHC0 = 0 PHC1 = 0 SI = 128K 
       data hash MD5: 128K
       AF 5A 23 46 52 76 1A 2E 23 48 CC F7 9B 37 9F 50>)
(   3,<2013-01-24 19:30:27.248 -0500>,<Administrator>,<X>,<proc1d>,<TOPSPIN 2.1>,
      <pk PHC0 = -79.24438 PHC1 = 0 
       data hash MD5: 128K
       B0 F0 6B 24 B1 DF 9B 0B 89 07 51 79 02 1F C6 0C>)
(   4,<2013-01-24 19:30:27.983 -0500>,<Administrator>,<X>,<proc1d>,<TOPSPIN 2.1>,
      <abs ABSG = 1 
       data hash MD5: 128K
       B4 C7 70 73 DD C6 23 F4 A6 18 64 D7 80 29 62 AE>)
(   5,<2013-01-24 19:30:28.155 -0500>,<Administrator>,<X>,<proc1d>,<TOPSPIN 2.1>,
      <abs ABSG = 2 
       data hash MD5: 128K
       76 FB 0D E6 62 E1 B8 95 34 88 71 7F 24 01 DC 43>)
(   6,<2013-01-24 19:30:28.342 -0500>,<Administrator>,<X>,<proc1d>,<TOPSPIN 2.1>,
      <abs ABSG = 3 
       data hash MD5: 128K
       DC 6D 4F 9D B7 79 6C FC 2F 7B 13 3B 61 33 0A 8A>)
(   7,<2013-01-24 19:30:28.514 -0500>,<Administrator>,<X>,<proc1d>,<TOPSPIN 2.1>,
      <abs ABSG = 4 
       data hash MD5: 128K
       7C 99 D4 2B A4 7B 55 E7 7E 30 24 B9 FE BA B8 AF>)
(   8,<2013-01-24 19:30:28.686 -0500>,<Administrator>,<X>,<proc1d>,<TOPSPIN 2.1>,
      <abs ABSG = 5 
       data hash MD5: 128K
       AF 6B 80 FB 0B 31 5A E9 F0 85 8F 3E D2 BC 66 99>)
$$ ##END=
$$ 
$$ $$ hash MD5
$$ $$ 83 1B A4 3A 9A 1C 60 68 3F 20 DC F3 38 6F 44 CF
##$RELAX= 
##$RELAX= 
##$RELAX= 
##$RELAX= 
##$RELAX= 
##$RELAX= 
##$RELAX= 
##$RELAX= 
$$ Bruker specific parameters
$$ --------------------------
##$DU= <E:\>
##$EXPNO= 12
$$ [...]
##$TP07= 0
##$TPNAME0= <>
##$TPNAME1= <>
##$TPNAME2= <>
##$TPNAME3= <>
##$TPNAME4= <>
##$TPNAME5= <>
##$TPNAME6= <>
##$TPNAME7= <>
##$TPOAL= (0..7)
0.5 0.5 0.5 0.5 0.5 0.5 0.5 0.5
##$TPOFFS= (0..7)
0 0 0 0 0 0 0 0
##$TUNHIN= 0
##$TUNHOUT= 0
##$TUNXOUT= 0
##$USERA1= <user>
##$USERA2= <user>
##$USERA3= <user>
##$USERA4= <user>
##$USERA5= <user>
##$V9= 5
##$VALIST= <valist>
##$VCLIST= <CCCCCCCCCCCCCCC>
##$VD= 0
##$VDLIST= <DDDDDDDDDDDDDDD>
##$VPLIST= <PPPPPPPPPPPPPPP>
##$VTLIST= <TTTTTTTTTTTTTTT>
##$WBST= 1024
##$WBSW= 4
##$XGAIN= (0..3)
0 0 0 0
##$XL= 0
##$YL= 0
##$YMAX_a= 6305123
##$YMIN_a= -12923035
##$ZGOPTNS= <>
##$ZL1= 120
##$ZL2= 120
##$ZL3= 120
##$ZL4= 120
##$ABSF1= 14.96094
##$ABSF2= -5.597241
##$ABSG= 5
##$ABSL= 3
##$ALPHA= 0
##$AQORDER= 0
##$ASSFAC= 0
##$ASSFACI= 0
##$ASSFACX= 0
##$ASSWID= 0
##$AUNMP= <proc_prof1d_extract.lims>
##$AXLEFT= 0
##$AXNAME= <>
##$AXNUC= <1H>
##$AXRIGHT= 0
##$AXTYPE= 0
##$AXUNIT= <>
##$AZFE= 0.1
##$AZFW= 0.1
##$BCFW= 0
##$BC_mod= 0
##$BYTORDP= 0
##$COROFFS= 0
##$CY= 15
##$DATMOD= 1
##$DC= 0
##$DFILT= <>
##$DTYPP= 0
##$F1P= 0
##$F2P= 0
##$FCOR= 0.5
##$FTSIZE= 131072
##$FT_mod= 6
##$GAMMA= 0
##$GB= 0
##$INTBC= 1
##$INTSCL= 1
##$ISEN= 128
##$LB= 0.3
##$LEV0= 0
##$LPBIN= 0
##$MAXI= 10000
##$MC2= 0
##$MEAN= 0
##$ME_mod= 0
##$MI= 0
##$NCOEF= 0
##$NC_proc= -2
##$NLEV= 6
##$NOISF1= 0
##$NOISF2= 0
##$NSP= 0
##$NTH_PI= 0
##$NZP= 0
##$OFFSET= 14.96094
##$PC= 1
##$PHC0= -79.24438
##$PHC1= 0
##$PH_mod= 1
##$PKNL= yes
##$PPARMOD= 0
##$PPDIAG= 0
##$PPIPTYP= 0
##$PPMPNUM= 2147483647
##$PPRESOL= 1
##$PSCAL= 4
##$PSIGN= 0
##$PYNMP= <proc.py>
##$REVERSE= no
##$SF= 400.020009661733
##$SI= 131072
##$SIGF1= 0
##$SIGF2= 0
##$SINO= 400
##$SIOLD= 131072
##$SPECTYP= <>
##$SREGLST= <1H.CDCl3>
##$SSB= 0
##$STSI= 131072
##$STSR= 0
##$SW_p= 8223.68421052631
##$SYMM= 0
##$S_DEV= 0
##$TDeff= 65536
##$TDoff= 0
##$TI= <>
##$TILT= no
##$TM1= 0
##$TM2= 0
##$TOPLEV= 0
##$USERP1= <user>
##$USERP2= <user>
##$USERP3= <user>
##$USERP4= <user>
##$USERP5= <user>
##$WDW= 1
##$XDIM= 131072
##$YMAX_p= 445671353
##$YMIN_p= -11529
##$CURPLOT= <Network HP LaserJet P1505>
##$CURPRIN= <$Network HP LaserJet P1505>
##$DFORMAT= <normdp>
##$LAYOUT= <+/1D_H.xwp>
##$LFORMAT= <normlp>
##$PFORMAT= <normpl>
##$SURQMSG= 1
$$ End of Bruker specific parameters
$$ ---------------------------------
##NTUPLES= NMR SPECTRUM
##VAR_NAME=  FREQUENCY,     SPECTRUM/REAL,   SPECTRUM/IMAG
##SYMBOL=    X,             R,               I
##VAR_TYPE=  INDEPENDENT,   DEPENDENT,       DEPENDENT
##VAR_FORM=  AFFN,          ASDF,            ASDF
##VAR_DIM=   131072,        131072,          131072
##UNITS=     HZ,            ARBITRARY UNITS, ARBITRARY UNITS
##FACTOR=    0.0627417313425164, 1,          1
##FIRST=     8223.62146879497, 786,          -61465
##LAST=      0,             1676,            -61265
##MIN=       0,             -11529,          0
##MAX=       8223.62146879497, 445671353,    0
$$ Real data points
##PAGE= N=1
##DATA TABLE= (X++(R..R)), XYDATA
$$ [...]
61662C91724j89O90R87O03L31M21K63l62p32k80O22J323J766K276K870L257L248
61645D08818K926K549K423K651K982L123L181L445L822L839L314K493J506J71
61631D47243j465k914l861m516m981m795l703k424j904k011j841j267j185j983
61617D08393k697k326j265o30o54o71m28m72j228k526m028n374n923n266m169
61602C70736m039n046n752n115l880l269l251l094k852l038l342k947j944j276
61588C21891j267j381j416j853k702l109k528j552j064j206j554j719j439o12
61574B98489L99Q81N39j49n19l49J17M38K12m91j025q65l14NJ27N08J045J200
61556C00248J056J202J592J583J273J594K636L079J980K24o86m83n4Nn3K98J277
$$ y = [391724, 391535, 392225, 393212, 393815, 394146, 394567, 394830, 394468, 393736, 393456, 394078, 395401, 397167, 399443, 402313, 405570, 408818, 411744, 414293, 416716, 419367, 422349, 425472, 428653, 432098, 435920, 439759, 443073, 445566, 447072, 447243, 445778, 442864, 439003, 434487, 429506, 424711, 421008, 418584, 416680, 414669, 412828, 411561, 410376, 408393, 405696, 403370, 402105, 401475, 400821, 400150, 399722, 399250, 398022, 395496, 391468, 386094, 380171, 374905, 370736, 366697, 361651, 355899, 350784, 346904, 343635, 340384, 337290, 334438, 331400, 328058, 325111, 323167, 321891, 320624, 319243, 317827, 315974, 313272, 310163, 307635, 306083, 305019, 303813, 302259, 300540, 299101, 298489, 298888, 299769, 300308, 300159, 299640, 299291, 299408, 299846, 300058, 299567, 298542, 297677, 297363, 297368, 297495, 298003, 299048, 300248, 301304, 302506, 304098, 305681, 306954, 308548, 311184, 314263, 316243, 316467, 315781, 315298, 315244, 315249, 315196, 315494, 316771]
61539C16771K520L123K407R00k0K70J036J457J634J922K141K075J982J954J503
61524C41675M35n89j063j432k126k585k218j599j665k195k205j476o53r4L71O45
61508C23226L69l37q64r12o68l16Q1L46M02M50M88K4j085k023j944j153n45l06
61490C15233lM11O40Q46J376J920J889J458J241J133N40l09m31L84J200J283R51
61473C29762P82Q83J157J547J714J216K05o11q57o93j90O75J342R79k71j189j047
61456C35404m38k15l41k75J59P91J459J960K063J941K056K378K257J428N57L76
61440C51560P62J122J250J351J618K166L027L868M070L469K633K134J911J695
61426C82636J586J700J635R49k9m82j26N66J195J886K725L224K863J940J330J317
$$ y = [316771, 319291, 322414, 324821, 325721, 325701, 325971, 327007, 328464, 330098, 332020, 334161, 336236, 338218, 340172, 341675, 342110, 341521, 340458, 339026, 336900, 334315, 332097, 330498, 328833, 326638, 324433, 322957, 322304, 322210, 322581, 323226, 323595, 323258, 322394, 321482, 320814, 320498, 320579, 320925, 321327, 321777, 322265, 322289, 321204, 319181, 317237, 316084, 315539, 315233, 315230, 315641, 316281, 317127, 318503, 320423, 322312, 323770, 325011, 326144, 326684, 326375, 325944, 326328, 327528, 328811, 329762, 330544, 331427, 332584, 334131, 335845, 337061, 337266, 336655, 335798, 335105, 334915, 335590, 336932, 337911, 337640, 336451, 335404, 334966, 334751, 334410, 334135, 334294, 335085, 336544, 338504, 340567, 342508, 344564, 346942, 349199, 350627, 351184, 351560, 352322, 353444, 354694, 356045, 357663, 359829, 362856, 366724, 370794, 374263, 376896, 379030, 380941, 382636, 384222, 385922, 387557, 388506, 388477, 387995, 387869, 388435, 389630, 391516, 394241, 397465, 400328, 402268, 403598, 404915]
61410D04915J198L51p15j062p67q50j687k455k508k381k768l276l166k651k466
61395C79712k512k035j006k10k3j09k91o95j004o18K20N39J14k30m7P0k77n44
61377C71054k61J30K47N96J600K588K709K205J888J833J573J194J250J731K004
61362C92341J748J292J067J258J924K880L564L631L535L989M899N461N344N146
61348D38079N523O344O985P111O900O657O424N978N227M462M076M073M106M044
61334E15989M060M087L649K605J593J221J128L77j285l029l795l232j867o37k06
61319E20658m75q35r61j072j251r66J86J677K585K831L177M008M900N551O468
61304E46481Q215J0443J2219J3120J3410J3231J2185R973P078M324J981k49k358
$$ y = [404915, 406113, 406464, 405749, 404687, 403920, 403070, 401383, 398928, 396420, 394039, 391271, 387995, 384829, 382178, 379712, 377200, 375165, 374159, 373949, 373926, 373817, 373526, 372831, 371827, 371209, 371429, 371968, 372082, 371852, 371805, 371875, 371598, 371054, 370793, 370923, 371170, 371766, 373366, 375954, 378663, 380868, 382756, 384589, 386162, 387356, 388606, 390337, 392341, 394089, 395381, 396448, 397706, 399630, 402510, 406074, 409705, 413240, 417229, 422128, 427589, 432933, 438079, 443602, 449946, 456931, 464042, 470942, 477599, 484023, 490001, 495228, 499690, 503766, 507839, 511945, 515989, 520049, 524136, 527785, 530390, 531983, 533204, 534332, 534709, 533424, 530395, 526600, 523368, 521501, 520864, 520658, 520183, 519348, 518387, 517315, 516064, 515098, 515284, 516961, 519546, 522377, 525554, 529562, 534462, 540013, 546481, 554696, 565139, 577358, 590478, 603888, 617119, 629304, 639277, 646355, 650679, 652660, 652411, 650053]
61291F50053l790m321m682n736p312q486q892r055r351r399q795p782o825n961
61277E49666n070m286l660k778j307L68J655K653L875N155N638M931L664K723
61263E63227K425K682L415M475N545O514P637Q917R682R214P765O433N995O151
61249F50077O037N200L929K801K054J354J38j671l408m305m383m365m652m821
61235F43985m423l786l555l695l625l197k835k604j935n07J172K514L581M658
61221F25748N559N963O059O231O415O314O103O226O653O865O614O109N536M857
61207G11252M075L271K396J492R33R65J153R41O55J227K898M954O849Q867J1381
61192G63309J4136J6517J8050J8399J7396J5323J2733R894O906M333K977K807
$$ y = [650053, 646263, 641942, 637260, 631524, 624212, 615726, 606834, 597779, 588428, 579029, 570234, 562452, 555627, 549666, 544596, 540310, 536650, 533872, 532565, 532933, 534588, 537241, 541116, 546271, 551909, 556840, 560504, 563227, 565652, 568334, 571749, 576224, 581769, 588283, 595920, 604837, 614519, 623733, 631498, 637931, 643926, 650077, 656114, 661314, 665243, 668044, 670098, 671452, 671590, 669919, 666511, 662206, 657823, 653458, 648806, 643985, 639562, 635776, 632221, 628526, 624901, 621704, 618869, 616265, 614330, 613823, 614995, 617509, 621090, 625748, 631307, 637270, 643329, 649560, 655975, 662289, 668392, 674618, 681271, 688136, 694750, 700859, 706395, 711252, 715327, 718598, 720994, 722486, 723419, 724384, 725537, 726478, 727133, 728360, 731258, 736212, 743061, 751928, 763309, 777445, 793962, 812012, 830411, 847807, 863130, 875863, 885757, 892663, 896996, 899973, 902780]
61180I02780K889K585K059J365Qk093m040n082n546o053o569o935p582q737r582
61165H49467r305q565q751j0057j1444j2345j3204j4234j4808j4490j3746j3103
61153G05415j2317j0839q633o115l740j903p87n9Q60J857J951L59k531n598p986
61138F49934r379r711r083p831o255m436k563j148n30l17J93J160K236L411N218
61123F10899P885J0745J2813J3836J4455J5487J7251J9481K1607K3156K4107K4887
61111H16609K5866K6888K7445K7319K6735K5946K4979K3905K2921K1908K0235
61100A090756J7442J3937J0565P532M230J45m466q927j2796j5974j8493k0470
61088A063481k2081k3379k4239k4575k4489k4143k3663k3229k2975k2682k1789
$$ y = [902780, 905669, 908254, 910313, 911678, 911686, 909593, 905553, 900471, 894925, 888872, 882303, 875368, 867786, 859049, 849467, 840162, 831597, 822846, 812789, 801345, 789000, 775796, 761562, 746754, 732264, 718518, 705415, 693098, 682259, 673626, 667511, 663771, 661868, 661081, 661022, 661882, 663739, 665690, 666049, 663518, 657920, 649934, 640555, 630844, 621761, 613930, 607675, 603239, 600676, 599528, 598998, 598681, 598874, 600034, 602270, 605681, 610899, 618784, 629529, 642342, 656178, 670633, 686120, 703371, 722852, 744459, 767615, 791722, 816609, 842475, 869363, 896808, 924127, 950862, 976808, 1001787, 1025692, 1048613, 1070521, 1090756, 1108198, 1122135, 1132700, 1140232, 1144462, 1144607, 1140141, 1131214, 1118418, 1102444, 1083951, 1063481, 1041400, 1018021, 993782, 969207, 944718, 920575, 896912, 873683, 850708, 828026, 806237]
61077H06237j9993j7680j5529j3904j2754j1854j0817r157o834m657l636l742
61065F75680l757k586m13J640K796L175L330L701M493N682O981Q076R027J0122
61051G27947J1309J2152J2547J3082J4338J6137J7912J9524K1228K3037K4675
61040I13888K6111K7616K9291L0991L2648L4258L5608L6578L7630L9412M1873
61029A285904M4337M6451M8414N0396N2342N4215N5648N5604N3567N1102N0989
61018A848969N4569O1007O9227P8990Q9743R9998J08836J16939J25806J37381
61008B791465J54694J80809K16554K61399L17050L87311M73838N76434O99733
60999F059287Q55664J057865J319926J657791K069596K483546K730466K615126
$$ y = [806237, 786244, 768564, 753035, 739131, 726377, 714523, 703706, 694549, 687715, 683058, 679422, 675680, 671923, 669337, 668924, 670564, 673360, 676535, 679865, 683566, 688059, 693741, 700722, 708798, 717825, 727947, 739256, 751408, 763955, 777037, 791375, 807512, 825424, 844948, 866176, 889213, 913888, 939999, 967615, 996906, 1027897, 1060545, 1094803, 1130411, 1166989, 1204619, 1244031, 1285904, 1330241, 1376692, 1425106, 1475502, 1527844, 1582059, 1637707, 1693311, 1746878, 1797980, 1848969, 1903538, 1964545, 2033772, 2112762, 2202505, 2302503, 2411339, 2528278, 2654084, 2791465, 2946159, 3126968, 3343522, 3604921, 3921971, 4309282, 4783120, 5359554, 6059287, 6914951, 7972816, 9292742, 10950533, 13020129, 15503675, 18234141, 20849267]
60991B0849267K064637J219618L63139k53413n24192m66415j48408L18480P42170
60982B4164883Q80413N75032j24497r80685j720981k185516k360357k315329k134591
60973A3798372j887579j624976j376721j153684r57695p90083o50676n34887m37279
60964D384792l56309k92444k43614k05642j75708j52525j34169j18433j04676
60955B601272r3199q3350p4039o5316n7686n0849m4822m1320m1916m5492m9423
60944A953860n2559n5187n6932n6892n5564n4490n4076n3532n2663n1964n1144
60933A358857m9331m6733m4426m2584m0531l8318l6659l5357l3507l1176k9221
60922I31014k7577k5419k3018k1570k1041k0014j8014j6151j5068j3896j1937
$$ y = [20849267, 22913904, 24133522, 24496661, 24243248, 23719056, 23252641, 23104233, 23422713, 24164883, 25045296, 25620328, 25495831, 24515146, 22794165, 20608649, 18248292, 15932963, 13798372, 11910793, 10285817, 8909096, 7755412, 6797717, 6007634, 5356958, 4822071, 4384792, 4028483, 3736039, 3492425, 3286783, 3111075, 2958550, 2824381, 2705948, 2601272, 2508073, 2424723, 2350684, 2285368, 2227682, 2176833, 2132011, 2090691, 2048775, 2003283, 1953860, 1901301, 1846114, 1789182, 1732290, 1676726, 1622236, 1568160, 1514628, 1461965, 1410001, 1358857, 1309526, 1262793, 1218367, 1175783, 1135252, 1096934, 1060275, 1024918, 991411, 960235, 931014, 903437, 878018, 855000, 833430, 812389, 792375, 774361, 758210, 743142, 729246, 717309]
60911G17309r821q279p079n844m761l904k941k014j812k250k156q40R46K091K269
60896F70914J705O63m04j052j451k053k655k721k553k937l654l673l047l120m449
60881F39513n960o666o929p355p690p585p381p362p199o751o527o749o839o451
60867E42069o055n935n589m747m005l790l575k822j847j054k12P57J135L93q45
60852E03878j617j795j731j398n84M88J414J987K004J248R3o08o65r26j996l344
60836D96448m213m565m608m139l109k154j804j776j600j318j017l95N92J305J393
60821D69040J457K058K679K490J598P22R9m70r67j289j647k196k574k463k203
60806D66334k204k191j704r96p58j167j782k205k357k360k505l072l864m344m410
$$ y = [717309, 707488, 699209, 692130, 686286, 681525, 677621, 674680, 672666, 670854, 668604, 666448, 665608, 666554, 668645, 670914, 672619, 673282, 672878, 671826, 670375, 668322, 665667, 662946, 660393, 657456, 653802, 650129, 647082, 643962, 639513, 633553, 626887, 619958, 612603, 604913, 597328, 589947, 582585, 575386, 568635, 562108, 555359, 548520, 542069, 536014, 530079, 524490, 519743, 515738, 511948, 508373, 505551, 503704, 502650, 502438, 503195, 504330, 504723, 503878, 502261, 500466, 498735, 497337, 496753, 497241, 498655, 500642, 502646, 503894, 503987, 503379, 502714, 501788, 499792, 496448, 492235, 487670, 483062, 478923, 475814, 473660, 471856, 470080, 468480, 467162, 466145, 465750, 466342, 467647, 469040, 470497, 472555, 475234, 477724, 479322, 480044, 480143, 479673, 478706, 477417, 475770, 473574, 471000, 468537, 466334, 464130, 461939, 460235, 459239, 458481, 457314, 455532, 453327, 450970, 448610, 446105, 443033, 439169, 434825, 430415]
60791D30415m477m599m214l251k614k921l506l436k858k530k551k414j988j601
60777C87455j377j249j321j644j826j499r38o00l60K29J189K210L255M425N382
60762C93331N533M776L702L014L058L697M427M696M344L570K546J395N03K42L21
60747D39155J01l85m21J74O48L92m00j429k727m063m838n129n861p293q254p655
60731C92015n945m341l408l095l413m141m607m480m231m067l344j801m82l61q65
60716C43434q83m69l56m58j82K38Q6m36m26K48Q14Q36N82L23K36P23J846K705
60698C48861K356J217N88R51J662K131K298K141J738J623K214K992L165K906L000
60683C79843L544M081M686N722O694O648N715N035N072N189M944M582M043K832
$$ y = [430415, 425938, 421339, 417125, 413874, 411260, 408339, 404833, 401397, 398539, 396009, 393458, 391044, 389056, 387455, 386078, 384829, 383508, 381864, 380038, 378539, 377601, 377001, 376641, 376870, 378059, 380269, 383524, 387949, 393331, 398864, 403640, 407342, 410356, 413414, 417111, 421538, 426234, 430578, 434148, 436694, 438089, 438592, 438834, 439155, 439256, 438871, 438450, 438624, 439272, 439664, 439264, 437835, 435108, 431045, 426207, 421078, 415217, 407924, 399670, 392015, 386070, 381729, 378321, 375226, 371813, 367672, 363065, 358585, 354354, 350287, 346943, 345142, 344660, 344299, 343434, 342551, 342082, 341726, 341268, 341086, 341324, 341410, 340974, 340548, 340796, 341610, 342446, 343028, 343351, 343587, 344310, 346156, 348861, 351217, 352434, 353022, 353973, 355635, 357766, 360064, 362205, 363943, 365566, 367780, 370772, 373937, 376843, 379843, 383387, 387468, 392154, 397876, 404570, 411218, 416933, 421968, 427040, 432229, 437173, 441755, 445798, 448630]
60669D48630J190K11K47K11r88l081n021o140o267n478m274l466l418l726l891
60654D04739l844l636l151k360j388k37J124K347K948K970K854K603J786L84j020
60639D06119k024k738l291l599l724l810l632k883j937j542j667j460n76K58L80
60624C73874J11J58O16J005R47M62r0k38J38N54N16K46K83N26L90j03k38K86Q83
60605C80326R63O28K29j12l35k93j9L59R87J968K660K162P22j79M22J770K402
60588C94660J806O13l21o03l49kQ5N2L00P79R65O47K89M06R32J473J797J974K257
60569D07760L006M390O076P503Q530R507J0677J1832J2556J2460J1299R197O703
60556E21496M255J741j018l614n464o605p390p626o779m948k845q42J115K713
$$ y = [448630, 449820, 450031, 450278, 450489, 449501, 446420, 441399, 435259, 428992, 423514, 419240, 415774, 412356, 408630, 404739, 400895, 397259, 394108, 391748, 390360, 390123, 391247, 393594, 396542, 399512, 402366, 404969, 406755, 407139, 406119, 404095, 401357, 398066, 394467, 390743, 386933, 383301, 380418, 378481, 376939, 375272, 373812, 373236, 373494, 373874, 373985, 374143, 374759, 375764, 376711, 377173, 377083, 376845, 376983, 377537, 378053, 378299, 378582, 379108, 379498, 379395, 379157, 379443, 380326, 381289, 381917, 382146, 382034, 381699, 381406, 381387, 381746, 382733, 384701, 387361, 389523, 390245, 390066, 390488, 392258, 394660, 396466, 397079, 396758, 396155, 395806, 395804, 395889, 395941, 396241, 397020, 397985, 398632, 398921, 399327, 400259, 401732, 403529, 405503, 407760, 410766, 415156, 421232, 428735, 437265, 446772, 457449, 469281, 481837, 494297, 505596, 514793, 521496, 525751, 527492, 526474, 522860, 517396, 510791, 503401, 495775, 488996, 484048, 481203, 480361, 481476, 484189]
60542D84189L404L494M108N729P550Q736R580J0963J3208J5776J7724J8137J6677
60529F19275J3930J0802P523L747l55l828n984p047p523p589p368p145o888o174
60515E95376m868l421k268j382p27m86o04o23k71K81R31J901L292M931O849R343
60499F08254J2352J5446J8598K2330K6707L0970L4526L7662M0739M3275M4314
60488I35173M3377M0618L6372L0921K4338J6384O898l454j3356k1927k9252l5646
60476A030446m0903m4503m6102m5623m3384m0285l7279l4466l1243k7538k4188
60465F14932k1852k0178j8419j6294j3939j1608r769q904q786q494p417n789m082
60452D59401k570j684j926k946l527l044k293k233k639k726k450k365k535k490
$$ y = [484189, 487593, 491087, 495195, 500924, 508474, 517210, 526790, 537753, 550961, 566737, 584461, 602598, 619275, 633205, 644007, 651530, 655277, 654922, 651094, 645110, 638063, 630540, 622951, 615583, 608438, 601550, 595376, 590508, 587087, 584819, 583437, 582710, 582224, 581620, 580997, 580726, 581007, 581938, 583839, 587131, 592062, 598911, 608254, 620606, 636052, 654650, 676980, 703687, 734657, 769183, 806845, 847584, 890859, 935173, 978550, 1019168, 1055540, 1086461, 1110799, 1127183, 1134081, 1130627, 1117271, 1095344, 1066092, 1030446, 989543, 945040, 898938, 853315, 809931, 769646, 732367, 697901, 666658, 639120, 614932, 593080, 572902, 554483, 538189, 524250, 512642, 502873, 493969, 485183, 476689, 469272, 463483, 459401, 456831, 455147, 453221, 450275, 446748, 443704, 441411, 439178, 436539, 433813, 431363, 428998, 426463, 423973]
60438D23973k057j524j091p33n48o49q17o89l37k09m62o63l36L88P95L79n36j088
60420D13796r05m44k16q2K74O89Q93J080J458J640J328J100J523J885J092l44
60404D24767o98N36J998K561K587K687K631K219J968K121K042J384R10J275J976
60389D50964K283K388K712K986K822K604K830L255L391L282L062K482J615J245
60375D87921J763K344K179J739J963K731L189L061K739K464K207K029J841J304
60361E19474N26L08J000J884K302K668L499M386M856N472O909Q714J0184J1733
60347E83915J4011J6166J6441J4313J0878P323M121J337j413m965r308j2625j3048
60334F27146j1234r726r739j0013r068p157n468m589m370m483m540m274l958m131
$$ y = [423973, 421916, 420392, 419301, 418568, 418020, 417371, 416554, 415865, 415528, 415319, 414857, 414194, 413858, 414246, 415041, 415420, 414884, 413796, 412891, 412447, 412231, 412149, 412423, 413112, 414005, 415085, 416543, 418183, 419511, 420611, 422134, 424019, 425111, 424767, 424069, 424605, 426603, 429164, 431751, 434438, 437069, 439288, 441256, 443377, 445419, 446803, 447713, 448988, 450964, 453247, 455635, 458347, 461333, 464155, 466759, 469589, 472844, 476235, 479517, 482579, 485061, 486676, 487921, 489684, 492028, 494207, 495946, 497909, 500640, 503829, 506890, 509629, 512093, 514300, 516329, 518170, 519474, 520000, 520308, 521308, 523192, 525494, 528162, 531661, 536047, 540903, 546375, 553284, 561998, 572182, 583915, 597926, 614092, 630533, 644846, 655724, 663047, 667168, 668505, 667092, 662127, 652819, 640194, 627146, 615912, 606186, 596447, 586434, 577366, 570209, 564741, 560152, 555782, 551299, 546759, 542485, 538527, 534396]
60320E34396m696m852m104k773j444m51Q7L14P77J932L493M842O026P714J0203
60305E51464J3121J6078J8997K1759K4027K5400K5288K2867J7885J1307M507k054
60293G50646q672j5140k0532k4137k5824k5505k3173j9522j5793j2705j0153p942
60281E41548o155m842l976l694l957m050l255j966j306j586k035k125k283k926
60267D97392l648l793l281k459j636j029q14r56j196j357j423j383j297j332j417
60252D70371j112k55N99R20J015J403J836J782J562J927K654K637J458p7j125
60237D85595j600j587r97j20L29J72Q1N62J283J742J979K135J956J197K30k21
60221D92736K06J263K362L000L075K900K834L035L621M616N530N634N069N044
$$ y = [534396, 529700, 524848, 520744, 517971, 516527, 516076, 516163, 516477, 517254, 519186, 522679, 527521, 533547, 541261, 551464, 564585, 580663, 599660, 621419, 645446, 670846, 696134, 719001, 736886, 748193, 752700, 750646, 741974, 726834, 706302, 682165, 656341, 630836, 607663, 588141, 572348, 559643, 549490, 541548, 535393, 530551, 526575, 522881, 518924, 514874, 511619, 509653, 508347, 506761, 504726, 502601, 500318, 497392, 493744, 489951, 486670, 484211, 482575, 481546, 480732, 479776, 478580, 477223, 475800, 474417, 473120, 471788, 470371, 469259, 469004, 469603, 470523, 471538, 472941, 474777, 476559, 478121, 480048, 482702, 485339, 486797, 486720, 485595, 483995, 482408, 481411, 481291, 481620, 481792, 481873, 482435, 483718, 485460, 487439, 489574, 491530, 492727, 492957, 492736, 492942, 494205, 496567, 499567, 502642, 505542, 508376, 511411, 515032, 519648, 525178, 530812, 535881, 540925]
60207E40925O186P422P442O655O397O785O761O132N887O330O453N669M760M514
60193F28318M567M307L821L164J706q33l418m652m296l167k048j409j678l010
60179F21372m899o561p581p850p289o051m723l854l422l074k666k332k128j902
60165E57040j470q48l96n47j195j555j077k73o3m84p00k46M12O93O11M78M79P30
60147E51589J264J829K064J939J678J447J460K133L393M301M107L513L845N193
60133E89755O423O915P104P184O621N257L763K530J252Nl69M02J378J731J803
60118F41754K142K444K282K047K302K780K915K813K893K974K504J488M90q0k23
60103F71525j11o8n60j758l293m635n505n810n552m974m393l768k844j745q48
$$ y = [540925, 547111, 554533, 561975, 568630, 575027, 581812, 588573, 594705, 600592, 606922, 613375, 619044, 623804, 628318, 632885, 637192, 641013, 644177, 645883, 645050, 641632, 636980, 632684, 629517, 627469, 626060, 624382, 621372, 616473, 609912, 602331, 594481, 587192, 581141, 576418, 572564, 569142, 566068, 563402, 561070, 558942, 557040, 555570, 554722, 554326, 553779, 552584, 551029, 549952, 549679, 549616, 549132, 548432, 548186, 548598, 549291, 549902, 550380, 550859, 551589, 552853, 554682, 556746, 558685, 560363, 561810, 563270, 565403, 568796, 573097, 577204, 580717, 584562, 589755, 596178, 603093, 610197, 617381, 624002, 629259, 633022, 635552, 636804, 636809, 636440, 636842, 638220, 639951, 641754, 643896, 646340, 648622, 650669, 652971, 655751, 658666, 661479, 664372, 667346, 669850, 671338, 671828, 671748, 671525, 671414, 671346, 670786, 669028, 665735, 661100, 655595, 649785, 644233, 639259, 634866, 631098, 628254, 626509, 625661]
60088F25661j41O63J339J396J105J308J938J851O14n88m97N58J300J032j21j827
60072F35591l632m931n540n893o304o499o285o061o204o505o632o566o259n520
60058E52760m602m123m077l762l058k705k809k351r36K04pp48n80M37J236J657
60042E26536K445L736M862N520N944O098N693M930M312L846L251K655K285J732
60028E83845M69j171k414l215m073m974n537n973o771p522p195n804m688m845
60014E20132n797o448o357n818n309n181n479n826n703m941l703k261j087q18
60000D55404j518k221j904p49J84M02K95J51k04o30l92Q65K447L305L148K626
59984D61209K634L487M608M920L871K083P91O26J082J108P3j702l218l707l385
$$ y = [625661, 625520, 626183, 627522, 628918, 630023, 631331, 633269, 635120, 635734, 635146, 634649, 635207, 636507, 637539, 637418, 635591, 631959, 627028, 621488, 615595, 609291, 602792, 596507, 590446, 584242, 577737, 571105, 564539, 558280, 552760, 548158, 544035, 539958, 536196, 533138, 530433, 527624, 525273, 524337, 524541, 524534, 523786, 523206, 523643, 524879, 526536, 528981, 532717, 537579, 543099, 549043, 555141, 560834, 565764, 570076, 573922, 577173, 579828, 582113, 583845, 584314, 583143, 580729, 577514, 573441, 568467, 562930, 556957, 550186, 542664, 535469, 529665, 524977, 520132, 514335, 507887, 501530, 495712, 490403, 485222, 479743, 473917, 468214, 463273, 459570, 457309, 456222, 455404, 453886, 451665, 449761, 449012, 449196, 449598, 449893, 450044, 449840, 449210, 448818, 449683, 452130, 455435, 458583, 461209, 463843, 467330, 471938, 476858, 480729, 482812, 483603, 484229, 485311, 486419, 486492, 484790, 481572, 477865, 474480]
59969D74480l047k975k732k126j646j624j608j132m65l3L58J028J694J891J681
59954D63744J185J20j400k158j172P03J686J412J072J255J111K8j157j351p50
59939D64328l48m77n87k88N0j73r77j648j481o26R3K85M77J210K131K629K906
59922D67504L628M758N614O016O508P320P954P983P578O917N794M157K475J197
59908E45403K47n29q84n34K50Q08Q14N01K16p2o60j575k236j968q43K73P05O86
59890E40602Q37J303J806K244K767L414M111M855N507N612M923L991L743M474
59876E90189N629O474O619O027N018M094L402K438P10j476l325m465n077n242
59862F11015m762l718k693k272k535l062l246k746j839j160q50k21J427L856O169
$$ y = [474480, 471433, 468458, 465726, 463600, 461954, 460330, 458722, 457590, 457125, 457092, 457450, 458478, 460172, 462063, 463744, 464929, 465049, 463649, 461491, 460319, 461022, 462708, 464120, 465192, 466447, 467558, 467586, 466429, 465078, 464328, 463980, 463503, 462916, 462628, 462678, 462505, 461528, 459880, 458399, 457773, 457866, 458151, 458628, 459838, 461969, 464598, 467504, 471132, 475890, 481504, 487520, 494028, 501348, 509302, 517285, 524863, 531780, 537574, 541731, 544206, 545403, 545650, 545121, 544237, 543703, 543953, 544761, 545575, 546076, 546292, 546220, 545560, 543985, 541749, 539781, 538938, 539211, 539916, 540602, 541439, 542742, 544548, 546792, 549559, 552973, 557084, 561939, 567446, 573058, 577981, 581972, 585715, 590189, 595818, 602292, 608911, 614938, 619956, 624050, 627452, 629890, 630600, 629124, 625799, 621334, 616257, 611015, 606253, 602535, 599842, 597570, 595035, 591973, 588727, 585981, 584142, 582982, 582132, 581911, 583338, 587194, 593363]
59847E93363P753Q698R418J0227J0926J0551P984L351j519m540m986l447q47J824
59833F48756L379L044J136j499m323o886q341q168p105o340o029n477m615m119
59819E93413m162m089l561k990k617k134j507j310j731k062j701j091j098j853
59805E61507k660k888k539k007j518r32j96J70n19k039l195l243k784k687k756
59790E31714k423k090k601l605l718k541j309j211j951k426k139j511j237j614
59776E01338k161j922n92Q42J162M64r4P9N55R52J445K090K590K969L626M466
59760E17809M833M540M143L942L583K959K589K758L033L107L309L845M294M374
59746E69118M450M793M956M547L950L710L699L440K801J854N86p28j319q31PK03
$$ y = [593363, 601116, 609814, 619232, 629459, 640385, 650936, 658920, 662271, 660752, 656212, 651226, 647779, 646932, 648756, 652135, 655179, 656315, 654816, 650493, 643607, 635266, 627098, 619993, 613653, 607624, 602147, 597532, 593413, 589251, 585162, 581601, 578611, 575994, 573860, 572353, 571043, 569312, 567250, 565549, 564458, 563360, 561507, 558847, 555959, 553420, 551413, 549895, 548963, 548767, 548937, 548418, 546379, 543184, 539941, 537157, 534470, 531714, 529291, 527201, 524600, 520995, 517277, 514736, 513427, 512216, 510265, 507839, 505700, 504189, 502952, 501338, 499177, 497255, 496663, 497505, 498667, 499131, 499037, 499116, 499671, 500623, 502068, 504158, 506748, 509717, 513343, 517809, 522642, 527182, 531325, 535267, 538850, 541809, 544398, 547156, 550189, 553296, 556605, 560450, 564744, 569118, 573568, 578361, 583317, 587864, 591814, 595524, 599223, 602663, 605464, 607318, 607904, 607176, 605857, 605026, 605033, 605236]
59730F05236k92p92j005j218j513j484q76j4O32J025J467K018K198J476l2j519
59714F05307k319k522k514k250j516o53l53o53p49l5J140J951J985J431P26J89
59698E99165j37l61m24o7O73J314J575J817K337K643K117J108M89L72J49k50j89
59681F12331M45Q30L53o32j493k073k390k306j979k125l252m981o390o877o539
59666E72922n951n648n545m958l535j968j254j429j622j237m15N52J533K326K816
59651E46587L324M119M783M783M399M186L765K331K38j206j687k232l389m388
59637E65613m634m677n005n016m118k845k012j443n13O02J081N61n54j640k271
59622E33129k405k476k910l384l113k066j198j207j731k178k567k993k963j919
$$ y = [605236, 604944, 604152, 603147, 601929, 600416, 598932, 598056, 598042, 598674, 599699, 601166, 603184, 605382, 606858, 606826, 605307, 602988, 600466, 597952, 595702, 594186, 593533, 593180, 592527, 591778, 591743, 592883, 594834, 596819, 598250, 598976, 599165, 599028, 598667, 598243, 598176, 598849, 600163, 601738, 603555, 605892, 608535, 610652, 611760, 612249, 612621, 612770, 612520, 612331, 612776, 613606, 613959, 613327, 611834, 609761, 607371, 605065, 603086, 600961, 597709, 592728, 586338, 579461, 572922, 566971, 561323, 555778, 550820, 547285, 545317, 544063, 542634, 541012, 539775, 539360, 539912, 541445, 543771, 546587, 549911, 554030, 558813, 563596, 567995, 572181, 575946, 578277, 578515, 577309, 575622, 573390, 570001, 565613, 560979, 556302, 551297, 546281, 542163, 539318, 537306, 535863, 535350, 535952, 537033, 537594, 537040, 535400, 533129, 530724, 528248, 525338, 521954, 518841, 516775, 515577, 514370, 512639, 510461, 507894, 504901, 501938, 500019]
59608E00019r6J572K271J863J011P81J549K429K384J737J630K078J830M16r63
59593E20511j130m49L9J8k19m69n07j9P93J127O44j15o94j266j766j485k32Q93
59575E15674P04o53k075k746k585j982j565j641j704j128l58m22j164j260k83
59560D96812O03N57K75N82J168J475J647J774J398O41N15J211J438N38k19K86
59544E10701J100R23M87J478L901O323Q076R771J2200J5982K1314K6433K7304
59531F45993K1007R387k276r993j3230j3176j1040q006n033k184P52L065L789
59518F19055L335L016L065K568J272m1j107k594m699o653p968q949r712r816r246
59503E71526q622q128p254n900m714m005l328k546k316k985l796l734k722j503
$$ y = [500019, 499923, 501495, 503766, 505629, 506640, 507421, 508970, 511399, 513783, 515520, 517150, 519228, 521058, 521474, 520511, 519381, 518932, 518971, 518989, 518770, 518301, 517794, 517775, 518568, 519695, 520339, 520224, 519530, 518264, 516498, 515013, 514781, 515674, 516378, 515725, 513650, 510904, 508319, 506337, 504772, 503131, 501427, 500299, 499941, 499519, 498355, 497095, 496812, 497415, 497972, 498247, 498829, 499997, 501472, 503119, 504893, 506291, 506932, 507447, 508658, 510096, 510634, 510415, 510701, 511801, 512724, 513211, 514689, 518590, 524913, 532989, 542760, 554960, 570942, 592256, 618689, 645993, 667000, 676387, 674111, 664118, 650888, 637712, 626672, 618666, 613633, 611449, 612201, 615266, 619055, 622390, 625406, 628471, 631039, 632311, 632270, 631163, 628569, 623870, 617217, 609249, 600300, 590588, 580772, 571526, 562904, 554776, 547522, 541622, 536908, 532903, 529575, 527029, 524713, 521728, 517932, 514198, 511476, 509973]
59489E09973p59o60q69q32l28L06O94R62J382J826K078K366K972L638L975M132
59473E30856M424M678M638M527M501M072K916J757J477J825J987J906J979J938
59459E73481J377R08J430K570L263L656M840O792Q183Q442Q415Q657Q550P684
59445F48248O785O512O333N262K990j27l547o642q904j0290j0939j0592r074p103
59431F08912n721n003m234l233k406j652m32J059K034K552L628N746Q355J0962
59417F20567J3543J5812J7365J8657K0524K2791K4847K7431L1563L5085L2860
59406H81045K2086O025r049j9354k4682k5758k3002j7414j0352k156P199J5536
59394H00124J8296J2283o74j4634k4125k7689k7324k5422k2799j9317j5250j1343
$$ y = [509973, 509214, 508554, 507685, 506853, 506525, 506831, 507525, 508487, 509869, 511695, 513773, 516139, 519111, 522749, 526724, 530856, 535280, 539958, 544596, 549123, 553624, 557696, 560612, 562369, 563846, 565671, 567658, 569564, 571543, 573481, 574858, 575766, 577196, 579766, 583029, 586685, 591525, 598317, 606500, 614942, 623357, 632014, 640564, 648248, 655033, 661545, 667878, 673140, 676130, 676003, 672456, 665814, 656910, 646620, 635681, 625089, 616015, 608912, 603191, 598188, 593954, 590721, 588315, 586663, 586231, 587290, 589324, 591876, 595504, 601250, 609605, 620567, 634110, 649922, 667287, 685944, 706468, 729259, 754106, 781537, 813100, 848185, 881045, 903131, 909156, 900107, 880753, 856071, 830313, 807311, 789897, 779545, 777389, 784588, 800124, 818420, 830703, 830029, 815395, 791270, 763581, 736257, 710835, 688036, 668719, 653469, 642126]
59382F42126q014n265l202j882q17N73J999K627K445K459L281M295M580M087L501
59367F52793L368L651L868L561K906K705L345M083L963L184K699K783K979L319
59353F99207M348N865O883P113P464Q598J0081J1362J2573J3827J4627J4714J4704
59340H31366J5217J5838J5635J4215J1852Q974N953L094M05k383n361q255j0723
59327H95827j2559j3700j4389j5098j5805j5741j4457j2749j1606j0818r671q522
59315G40712q238q402p779o562o292p219p574o228m369l548l505l066k007q05
59301F65118N56K313M295O573R952J4589J8555J8931J4329N843m055j2803j8568
59288G25628k0794k0237j8184j5680j3436j1771j0378q627o397m130k104k98J065
$$ y = [642126, 634112, 628847, 625645, 623763, 622946, 623519, 625518, 628145, 630590, 633049, 636330, 640625, 645205, 649292, 652793, 656161, 659812, 663680, 667241, 670147, 672852, 676197, 680280, 684243, 687427, 690126, 692909, 695888, 699207, 703555, 709420, 716303, 723416, 730880, 739478, 749559, 760921, 773494, 787321, 801948, 816662, 831366, 846583, 862421, 878056, 892271, 904123, 913097, 919050, 922144, 922549, 920166, 914805, 906550, 895827, 883268, 869568, 855179, 840081, 824276, 808535, 794078, 781329, 769723, 758905, 749234, 740712, 732474, 724072, 716293, 709731, 703439, 696220, 688646, 682418, 678049, 674501, 670996, 667930, 665923, 665118, 665674, 667987, 672282, 678855, 688807, 703396, 721951, 740882, 755211, 761054, 756999, 744196, 725628, 704834, 684597, 666413, 650733, 637297, 625526, 615148, 606521, 600124, 595994, 593890, 593592, 594657]
59275E94657J749K410M107O748R060J0459J1708J3337J4656J4967J4567J3802
59263G12227J2318J0042P836O280M781K694L20j952m454p190r191r939j0333j1050
59249G02389j1093r417p002n653n412m865l523k197j203J06J907L446M315N015
59235F66813N936O784P265P538P739P682P235O423N153L399J626M03l70j334k721
59220G29571m089n021n622o240p049p922q471q365p764p206o853o328n487m891
59206F38263n014n443n434m853m108l460k895k415j985j474r86r22j344j639j223
59191E95068k54O80J197J201Q58P12J274K208K609K364K401L173L836L606L043
59176F23976L031L312L083K562K799M085N590O550P030P493Q177R014R786J0284
$$ y = [594657, 596406, 598816, 602923, 609671, 618731, 629190, 640898, 654235, 668891, 683858, 698425, 712227, 724545, 734587, 742423, 748703, 753484, 756178, 756498, 754546, 750092, 742902, 733711, 723772, 713439, 702389, 691296, 681879, 674877, 669224, 663812, 658947, 655424, 653227, 652024, 652130, 654037, 657483, 661798, 666813, 672749, 679533, 686798, 694336, 702075, 709757, 716992, 723415, 728568, 731967, 733593, 733996, 733626, 732292, 729571, 725482, 720461, 714839, 708599, 701550, 693628, 685157, 676792, 669028, 661822, 654969, 648641, 643154, 638263, 633249, 627806, 622372, 617519, 613411, 609951, 607056, 604641, 602656, 601182, 600196, 599274, 597930, 596291, 595068, 594814, 595494, 596691, 597892, 598750, 599462, 600736, 602944, 605553, 607917, 610318, 613491, 617327, 620933, 623976, 627007, 630319, 633402, 635964, 638763, 642848, 648438, 654988, 662018, 669511, 677688, 686702, 696488, 706772]
59162G06772J0481J0331R426P388M712K518J167k25k421m962o951q257r280j0103
59148G10596j0583j0873j1205j1442j1302j0715r729q494p542p394p712p568o836
59135E89201o361o440o262n300m185l476k779j869j504k059k367j248P11K082
59121E48144K623L136L927M711N540O654P760Q487R235J0483J1643J1743J0900
59108F44986J0086R631R013P976O963O426O346O331N778M294K372J030M06m55
59094G21183j953l128l256l095l414l481k373q57l64p21n85K68O30k56j886l485
59078F93227m745n558o045o687p602q092p680p058p027p113o408n180m365m018
59064F05649l528k930k651k410j777j360j959k901k817j813j292j743k275k307
$$ y = [706772, 717253, 727584, 737010, 744398, 749110, 751628, 752795, 752570, 750149, 745187, 738236, 729979, 720699, 710596, 700013, 689140, 677935, 666493, 655191, 644476, 634747, 626253, 618711, 611317, 603605, 596037, 589201, 582840, 576400, 570138, 564838, 560653, 557177, 554398, 552529, 551025, 548966, 546599, 545351, 546062, 548144, 550767, 553903, 557830, 562541, 568081, 574735, 582495, 590982, 600217, 610700, 622343, 634086, 644986, 655072, 664703, 673716, 681692, 688655, 695081, 701427, 707758, 713536, 717830, 720202, 721232, 721638, 721183, 719230, 716102, 712846, 709751, 706337, 702856, 700483, 699626, 699262, 698541, 697956, 698224, 698854, 698598, 696712, 693227, 688482, 682924, 676879, 670192, 662590, 654498, 646818, 639760, 632733, 625620, 619212, 614032, 609667, 605649, 602121, 599191, 596540, 594130, 592353, 590993, 589034, 586133, 583316, 581503, 580211, 578468, 576193, 573886]
59050E73886k195k053j475o87n68j183j522j026l06p2l08o86q94n31M63J265J002
59033E63110J1o20n49j71N28J832L150L418K761K528L537N308P153Q846J0224
59018F11066J1115J1755J2284J1989J0170P563N622M483K952N76j635k712k748
59005F82480k221j482j026j145j124Q3K273M157N153N874O683P076O710O004N376
58990G24871M793M231L727K978J751M56n45j736l417m448l603j750q97j273j222
58975G23916n9J087J588K404M160O043P479R243J1779J3881J4245J3284J2294
58962H21344J1804J1640J1815J2304J2491J1693R880P383M372R85k510o006r556
58949H97639j2922j5585j7242j7882j7572j6780j6433j6787j6660j4943j2411
$$ y = [573886, 571691, 569638, 568163, 567476, 566908, 565725, 564203, 563177, 562871, 562799, 562491, 561805, 560911, 560380, 560843, 562108, 563110, 563121, 562501, 561952, 561781, 562309, 564141, 567291, 570709, 573470, 575998, 579535, 584843, 591996, 600842, 611066, 622181, 633936, 646220, 658209, 668379, 675942, 681564, 686047, 688999, 689575, 687940, 685228, 682480, 680259, 678777, 677751, 676606, 675482, 675565, 677838, 681995, 687148, 693022, 699705, 706781, 713491, 719495, 724871, 729664, 733895, 737622, 740600, 742351, 742807, 742262, 740526, 737109, 732661, 729058, 727308, 726411, 725138, 723916, 723857, 724944, 726532, 728936, 733096, 739139, 746618, 755861, 767640, 781521, 795766, 809050, 821344, 833148, 844788, 856603, 868907, 881398, 893091, 902971, 910354, 914726, 915711, 913201, 907195, 897639, 884717, 869132, 851890, 834008, 816436, 799656, 783223, 766436, 749776, 734833, 722422]
58938G22422j0727r948q650o406m463l735l674l502l144k572j501k45L54J79k5
58923F64363Q4J30oj19o07j954l308l137j491rM40N44P34M86j24j5J130K236K724
58904F62101L409M931O800Q593J0575J2519J3531J3694J4196J5136J5062J3516
58892G94063J2243J2698J4057J5028J5949J7744K0123K2300K4344K6336K7229
58881A002114K5995K3137J9784J6112J1825P436L771O33k893p173j1743j5939
58869A073059j9126k0853k1307k1115k0423j8768j6165j3484j1470j0219r711
58858H90418r878j0123r851r645j0555j2174j2921j2405j1868j1923j1659j0583
58846G56833r573r176q659p595o754o587o440o071o251o998p059o150n822o863
$$ y = [722422, 711695, 701747, 693097, 686691, 682228, 678493, 674819, 671317, 668173, 665601, 664100, 663855, 664209, 664388, 664363, 664447, 664577, 664571, 664452, 663845, 661891, 658583, 655446, 653955, 653946, 654386, 654930, 655664, 656150, 656026, 656011, 657141, 659377, 662101, 665510, 670441, 677241, 685834, 696409, 708928, 722459, 736153, 750349, 765485, 780547, 794063, 806306, 819004, 833061, 848089, 864038, 881782, 901905, 924205, 948549, 974885, 1002114, 1028109, 1051246, 1071030, 1087142, 1098967, 1106403, 1110174, 1110807, 1107914, 1100741, 1088998, 1073059, 1053933, 1033080, 1011773, 990658, 970235, 951467, 935302, 921818, 910348, 900129, 890418, 880540, 870417, 860566, 850921, 840366, 828192, 815271, 802866, 790998, 779075, 767416, 756833, 747260, 738084, 729425, 721830, 715076, 708489, 702049, 695978, 689727, 682729, 675670, 669520, 663698, 656835]
58832F56835p741p064n810n483n651n074l899k960k026n40R33J612K018L018M216
58817F22384M718M738N046N506N506N139M817M397L732L306L322L025J954Q88
58803F78478N27J97r95k618l623l812l665l512l687m564n722o108n716n868p109
58788F22203q198p919o556m771k629n19O40J055K174M133N135M437L783M428M999
58773F22395M107K751K074Q81k064n096n780m662m193m996n742n840n764n379
58759E82692m276l215l077l090k018m18L26M26J089K223K890L281M134M827M275
58744E90069L090K778L291L551L729M803O202O294N061M178M426M957N110N184
58730F52723N365N482N748O399O871O568N989N812N609M864M327M738N209M634
$$ y = [656835, 649094, 642030, 636220, 630737, 625086, 620012, 616113, 613153, 611127, 610587, 611520, 613132, 615150, 618168, 622384, 627102, 631840, 636886, 642392, 647898, 653037, 657854, 662251, 665983, 669289, 672611, 675636, 677590, 678478, 679005, 679202, 678207, 675589, 671966, 668154, 664489, 660977, 657290, 652726, 647004, 640896, 635180, 629312, 622203, 614005, 606086, 599530, 594759, 592130, 591611, 592251, 593306, 595480, 599613, 604748, 609185, 612968, 617396, 622395, 626502, 629253, 631327, 632208, 630144, 625048, 619268, 614606, 610413, 605417, 599675, 593835, 588071, 582692, 578416, 575201, 572124, 569034, 567016, 566598, 566924, 567350, 568439, 570662, 573552, 576833, 580967, 585794, 590069, 593159, 595937, 599228, 602779, 606508, 611311, 617513, 623807, 628868, 633046, 637472, 642429, 647539, 652723, 658088, 663570, 669318, 675717, 682588, 689156, 695145, 700957, 706566, 711430, 715757, 720495, 725704, 730338]
58716G30338L864M528O512Q452R941J1264J1861J1113R864R059P737M589O49k039
58702H27732l628n903r062j1720j3678j6011j8565j9977k0164k0332k0482j9307
58690F48903j6731j4260j2598j1008r240q040p482o724n604m767m221l462k875
58677E41891l204l884l688k777k208j930j130j75P7L39K003M523O106O749Q058
58662E50750J0281J1992J2673J3015J2564R818N013M44k481m336n616n868n204
58649F03045m631m402l923l431l767m550m600m129m310m823m199k565j567j472
58635E50676q65O14J728K126K860M074M593M224M094M310L682K105Q48J33j123
58620E84079k747l033j536K62J517K875M354M918M731N322O872P740P253O502
$$ y = [730338, 734202, 738730, 745242, 753694, 763635, 774899, 786760, 797873, 807737, 816796, 824533, 829122, 829771, 827732, 824104, 818201, 809139, 797419, 783741, 767730, 749165, 729188, 709024, 688692, 668210, 648903, 632172, 617912, 605314, 594306, 585066, 577026, 569544, 562820, 557216, 552449, 548228, 544766, 541891, 538687, 534803, 531115, 528338, 526130, 524200, 523070, 522895, 522972, 523311, 525314, 529837, 535943, 542692, 550750, 561031, 573023, 585696, 598711, 611275, 621093, 626106, 626550, 624069, 619733, 614117, 608249, 603045, 598414, 594012, 590089, 586658, 582891, 578341, 573741, 569612, 565302, 560479, 556280, 553715, 552148, 550676, 549811, 550425, 552153, 554279, 557139, 561213, 565806, 570030, 574124, 578434, 582116, 584221, 585069, 585202, 584079, 581332, 578299, 576763, 577025, 578542, 581417, 585771, 590689, 595420, 600742, 607614, 615354, 622607, 629109]
58606F29109N830M200J793N27J036J541P43m92j257k094l348m142m014l645l260
58591F22527k295j114r07j340o47J467L362M368N616P444Q653R033R866J1168
58577F77201J1195R627Q426Q522Q426P316O622P173P516O730O393Q062J0951J3667
58563G97827J6251J9016K1345K2958K4558K6226K6969K6608K5985K4630K0779
58552A053152J4502Q268L459j020n638q670r145q605q439p948o623n750o212p087
58538A004244p908r976j3868j7963k0781k2531k3169k1618j8288j5631j4548j2958
58526H05005r573o282m908m299k742q06L39J121K019J956K97j599k544l219m155
58511G70610m267l123k344k939l566l116k696l269l744l232k749k900k351n68
$$ y = [629109, 634939, 639139, 640932, 641459, 642495, 644036, 644779, 644287, 643030, 640936, 637588, 633446, 629432, 625787, 622527, 620232, 619118, 618211, 616871, 616224, 617691, 621053, 625421, 631037, 638481, 647134, 656167, 666033, 677201, 688396, 698023, 706449, 714971, 723397, 730713, 737335, 744508, 752024, 758754, 765147, 773209, 784160, 797827, 814078, 833094, 854439, 877397, 901955, 928181, 955150, 981758, 1007743, 1032373, 1053152, 1067654, 1075922, 1079381, 1078361, 1072723, 1064053, 1054908, 1046303, 1037864, 1029916, 1023293, 1017543, 1011331, 1004244, 996336, 986360, 972492, 954529, 933748, 911217, 888048, 866430, 848142, 832511, 817963, 805005, 795432, 789150, 784242, 779943, 777201, 776395, 776734, 777855, 779874, 781830, 782127, 780528, 777984, 774765, 770610, 766343, 763220, 760876, 757937, 754371, 751255, 748559, 745290, 741546, 738314, 735565, 732665, 730314, 729746]
58497G29746N00m55j737j569r27j326k046j823j125o36L49K047L001K718L128
58482G29845N421P829Q656Q979J0258J1737J2548J3840J6445J8685J8763J7114
58470H80120J4399R750L246k562n871p883r792j0410r148q142q666q449n494j679
58456H29419N40K096M774P476Q584R452J1925J4503J4519J2184R160N225k48n474
58442I24135q332r577j0924j1768j0813q973p620n902k805J61J318J813L148M077
58428H57938L178K281L827O866R042J0552J2719J4636J4689J3591J2641J0819
58416I72779O900K435n37k793n750q217q636q337r186j0194r789r111r619r896
58402H90049q340o555o367o126l739q06L29R25L083N232M877L396L569M580M069
$$ y = [729746, 730246, 729791, 728054, 726485, 725558, 724232, 722186, 720363, 719238, 718602, 718951, 720998, 723999, 726717, 729845, 735266, 743095, 751751, 760730, 770988, 782725, 795273, 809113, 825558, 844243, 863006, 880120, 894519, 904269, 907515, 904953, 899082, 891199, 881407, 870997, 861849, 853707, 845041, 836592, 831098, 829419, 829959, 832055, 836829, 844305, 852889, 862341, 874266, 888769, 903288, 915472, 924632, 929857, 929609, 924135, 915803, 906226, 895302, 883534, 872721, 863748, 856128, 850226, 847421, 847582, 848900, 850713, 853861, 857938, 861116, 863397, 867224, 874090, 883132, 893684, 906403, 921039, 935728, 949319, 961960, 972779, 979679, 982114, 981577, 978784, 973034, 964817, 956181, 947844, 938658, 928464, 918675, 909564, 899945, 890049, 881709, 875154, 868787, 862661, 858922, 858116, 858445, 859370, 862453, 867685, 872562, 875958, 879527, 884107, 888176]
58387H88176K870L104L681K454P90J219K551K046N70P25J819J588J082K793N641
58372I21109O737O598P666R301R125P867P992R027Q937Q527R757J1462J1498J1291
58358A046894J3301J5996J6324J5263J5661J6520J4776J0981P916N458K102m76
58346A180716J25K009J983J477L711P218Q175P274Q020J0192J1118J1590J4111
58333A267719J7146J7418J6229J7121J9208J9173J7889J8365J9253J7232J3698
58322A460451J2155J1198P424L026K692N026N035L169L728O189O591N831P936
58309A540451J1590J2199J0949J2768J6633J7157J4835J5194J8564K0147J9611
58298A710098K1018K3716K3065J9937J9787K2445K2703K0669K1529K5195K6457
$$ y = [888176, 891046, 894150, 897831, 900285, 901075, 902294, 904845, 906891, 907461, 908186, 910005, 911593, 912675, 915468, 921109, 927846, 934444, 942110, 951411, 960536, 968403, 976395, 985422, 994359, 1002886, 1012643, 1024105, 1035603, 1046894, 1060195, 1076191, 1092515, 1107778, 1123439, 1139959, 1154735, 1165716, 1173632, 1179090, 1181192, 1180716, 1180841, 1182850, 1184833, 1186310, 1190021, 1197239, 1205414, 1212688, 1220708, 1230900, 1242018, 1253608, 1267719, 1284865, 1302283, 1318512, 1335633, 1354841, 1374014, 1391903, 1410268, 1429521, 1446753, 1460451, 1472606, 1483804, 1491228, 1494254, 1496946, 1501972, 1507007, 1510176, 1513904, 1520093, 1526684, 1532515, 1540451, 1552041, 1564240, 1575189, 1587957, 1604590, 1621747, 1636582, 1651776, 1670340, 1690487, 1710098, 1731116, 1754832, 1777897, 1797834, 1817621, 1840066, 1862769, 1883438, 1904967, 1930162, 1956619]
58287A956619K5398K7216L1566L2709L0579L0940L4158L4736L2525L3307L7400
58276B307153L8888L7148L7918M1966M3890M3190M5064M9391N0530M8895N0839
58265B794872N6319N8954N8880O2690O9892P2861P1367P3275P9469Q2274Q0393
58254C561246Q0866Q4469Q4142P9906Q0090Q5536Q8128Q7177R1082J00492J06593
58243D529727J08653J15854J28886J37794J41200J49037J62782J72443J76787
58234E823163J86421K02645K14314K20183K32442K53108K69636K79536K95598
58225G977046L20730L42386L58547L83264M19181M51633M77901N13960N63853
58216A1808501O12350O57054P15832P92426Q68569R41413J032762J149237J272157
$$ y = [1956619, 1982017, 2009233, 2040799, 2073508, 2104087, 2135027, 2169185, 2203921, 2236446, 2269753, 2307153, 2346041, 2383189, 2421107, 2463073, 2506963, 2550153, 2595217, 2644608, 2695138, 2744033, 2794872, 2851191, 2910145, 2969025, 3031715, 3101607, 3174468, 3245835, 3319110, 3398579, 3480853, 3561246, 3642112, 3726581, 3810723, 3890629, 3970719, 4056255, 4144383, 4231560, 4322642, 4423134, 4529727, 4638380, 4754234, 4883120, 5020914, 5162114, 5311151, 5473933, 5646376, 5823163, 6009584, 6212229, 6426543, 6646726, 6879168, 7132276, 7401912, 7681448, 7977046, 8297776, 8640162, 8998709, 9381973, 9801154, 10252787, 10730688, 11244648, 11808501, 12420851, 13077905, 13793737, 14586163, 15454732, 16396145, 17428907, 18578144, 19850301]
58207A9850301J400374J561336J764782J990795K240422K548865K930475L366501
58199C7653851L869858M502975N309523O298391P521098R083156J1049100J3439177
58191I8727129J6366309K0062943K4723030L0435063L7185538M4389195M9969205
58184C21858412N0317275M2268383K5900448N326835j3693583k7217366l4622847
58177C70137557l7494883l7696361l6381238l4072510l1041422k7540383k3876686
58170A42034074k0363508j7203868j4451037j2091315j0114659q491837p153246
58163E2164604o036465n118787m378376l765439l238710k793403k428367k119462
58155B2285595j847568j619982j441155j291209j153781j037342r48964q73030
$$ y = [19850301, 21250675, 22812011, 24576793, 26567588, 28808010, 31356875, 34287350, 37653851, 41523709, 46026684, 51336207, 57634598, 65155696, 74238852, 85287952, 98727129, 115093438, 135156381, 159879411, 190314474, 227500012, 271889207, 321858412, 372175687, 414444070, 440344518, 445671353, 431977770, 404760404, 370137557, 332642674, 294946313, 258565075, 224492565, 193451143, 165910760, 142034074, 121670566, 104466698, 90015661, 77924346, 67809687, 59317850, 52164604, 46128139, 41009352, 36630976, 32865537, 29626827, 26833424, 24405057, 22285595, 20438027, 18818045, 17376890, 16085681, 14931900, 13894558, 12945594, 12072564]
58147A2072564p95071p22765o64876o11786n54355n01118m59937m21914l79145
58138F961597l40094l12853k90721k67968k52189k47521k42577k28398k12523
58129D566753k02741j92814j76896j62424j55811j49816j37688j25970j21112
58120C141481j16811j06835r7534r5445r4605q8056q0533p8150p6467p0086o3734
58109B173225o2773o2496n7334n1371m9767m9009m5193m2712m5211m7118m3514
58098A616727l9416m0091m1164l7592l3571l4045l4876l0983k6228k5826k6616
58087A246319k4009k1126k1978k2911j9822j6697j8137k0324j8312j5525j7060
58076A030418k0114j9870j8612k0260k1902j9587j6607j7384j8819j6358j3061
$$ y = [12072564, 11277493, 10554728, 9889852, 9278066, 8723711, 8222593, 7762656, 7340742, 6961597, 6621503, 6308650, 6017929, 5749961, 5497772, 5250251, 5007674, 4779276, 4566753, 4364012, 4171198, 3994302, 3831878, 3676067, 3526251, 3388563, 3262593, 3141481, 3024670, 2917835, 2820301, 2724856, 2630251, 2542195, 2461662, 2383512, 2307045, 2236959, 2173225, 2110452, 2047956, 1990622, 1939251, 1889484, 1840475, 1795282, 1752570, 1707359, 1660241, 1616727, 1577311, 1537220, 1496056, 1458464, 1424893, 1390848, 1355972, 1324989, 1298761, 1272935, 1246319, 1222310, 1201184, 1179206, 1156295, 1136473, 1119776, 1101639, 1081315, 1063003, 1047478, 1030418, 1010304, 990434, 971822, 951562, 929660, 910073, 893466, 876082, 857263, 840905, 827844]
58065H27844j3797j5777j3716r619q567r320p788n656o926r657r493p958r163
58052G00407j1662j1401r674j0410j2434j1753q906p158o151l931k367l975o338
58039E94247o024m954o543q827p960n373m818n358l996k305l655o506p127o484
58025E14317p867j0173j0035q345q250q917p586n613o145p810o943m224l030l171
58011D16208k240j192k434m210l053k01L94j050j199l0k05j391j008L92J38j209
57995C97710r24N47O72K1J065K874K373o3j428j476k316l582l134j658j682k897
57979C86102l119k857m126n894n550l798l298l693k779j324j652k726j811J18
57965C43593o6j790j859m06k77j206k78K192K795J057j31m4q75k730l117j860
$$ y = [827844, 814047, 798270, 784554, 774935, 766368, 757048, 749260, 743604, 736678, 727021, 717528, 709570, 700407, 688745, 677344, 667670, 657260, 644826, 633073, 624167, 617009, 610858, 606927, 604560, 600585, 594247, 588223, 583269, 576726, 567899, 559939, 554566, 549748, 544390, 540394, 538089, 534434, 527928, 520801, 514317, 506450, 496277, 486242, 477897, 469647, 460730, 453144, 447531, 441386, 433576, 426633, 422409, 419379, 416208, 413968, 412776, 410342, 406132, 403079, 402878, 403272, 402222, 401023, 400993, 400788, 399397, 398389, 398781, 398919, 397710, 396786, 397333, 398005, 398026, 399091, 401965, 404338, 404275, 402847, 401371, 399055, 395473, 392339, 390681, 388999, 386102, 382983, 380126, 376000, 370106, 364556, 360758, 357460, 353767, 350988, 349664, 348012, 345286, 343475, 343593, 343527, 341737, 339878, 339472, 339195, 337989, 337711, 339903, 342698, 343755, 343624, 343580, 342705, 339975, 336858, 334998]
57949C34998j605k813k980j488o36j207j315l60O9j68P71K988M432M697N516P132
57933C48031P950Q071R351J1527J2008J0064P648N745L312K77j891k953m118n345
57919D09677n524n199n913p044o662n143m532m695l804k200j891k475j537R52
57905C54010K553K649K918L435K395k6j502j594k207l595l843k725k288k974k859
57890C44347j448o55j306j976j905j880j818p46N19K2j752k312j340r50j621j599
57874C23580o48o29j844k449j996j960k320j375M75O75j018j834o17O06O70J066
57858C10382K543L515L262L354M657N860O133O289O441N566M038L504L565K023
57844C71132j046k972k994l333m858n581m727m372n547o285n331m346m648m971
$$ y = [334998, 333393, 330580, 327600, 326112, 325476, 324269, 322954, 322594, 322663, 322495, 323266, 326254, 330686, 335383, 340899, 348031, 355981, 364052, 373403, 384930, 396938, 407002, 414650, 420395, 423707, 423984, 422093, 419140, 415022, 409677, 404153, 398954, 393041, 385997, 379335, 374192, 369660, 364965, 361161, 358961, 357070, 354595, 353058, 354010, 356563, 359212, 362130, 365565, 367960, 367934, 366432, 364838, 362631, 359036, 355193, 352468, 350180, 347206, 344347, 342899, 342244, 340938, 338962, 337057, 335177, 333359, 332613, 333132, 333154, 331402, 329090, 327750, 326800, 325179, 323580, 322932, 322303, 320459, 318010, 316014, 314054, 311734, 310359, 310834, 311509, 310491, 308657, 308040, 308646, 309316, 310382, 312925, 316440, 319702, 323056, 327713, 333573, 339706, 345995, 352436, 358002, 362040, 365544, 369109, 371132, 370086, 367114, 364120, 360787, 355929, 350348, 345621, 341249, 335702, 329417, 324086, 319740, 315092, 310121]
57830C10121m256l643l897l755k556j697j876j648k35R49R56Q41J191R60R7M31
57814B91983K482M189M185L508K746O18l096o179p239p606q391q542p353o106
57800B55199n543m488k606j628k186k327r15M25M76N80J703K376J660J251K381
57785B46358L467L171L039M620O503O804O297O530O993O640O236O715P042O076
57771C26491M803M422M040K395K54j083j971l178m075m074m209n363o557o788
57757C05107o877p648q032o927n219m154l303j935p31l78j22O35J032O08O00J722
57741B64378K622K256J811K461L245L031K569K655K356J100M21J436K564K096
57727B95001J075J275K086J924J097Q21P46j13j276j783k092k971l801l824l685
$$ y = [310121, 305865, 302222, 298325, 294570, 292014, 290317, 288441, 286793, 286558, 287507, 288463, 289304, 290495, 291455, 291552, 291983, 294465, 298654, 302839, 306347, 309093, 309711, 306615, 300436, 293197, 285591, 277200, 268658, 261305, 255199, 249656, 245168, 242562, 240934, 238748, 236421, 235506, 235931, 236407, 236987, 238690, 241066, 242726, 243977, 246358, 249825, 252996, 256035, 260655, 267158, 273962, 280259, 286789, 293782, 300422, 306658, 313373, 320415, 326491, 331294, 335716, 339756, 342151, 342405, 341322, 339351, 336173, 332098, 328024, 323815, 318452, 311895, 305107, 298230, 290582, 282550, 275623, 270404, 266250, 262947, 261012, 260281, 259903, 259781, 260416, 261448, 262056, 262656, 264378, 267000, 269256, 271067, 273528, 276773, 279804, 282373, 285028, 287384, 288484, 288905, 290341, 292905, 295001, 296076, 297351, 299437, 301361, 302458, 303279, 304025, 303912, 302636, 300853, 298761, 295790, 291989, 288165, 284480]
57712B84480l977l848k890k570l842n126m839m054m436n311n200m460m066l391
57698B26470j756m77q07j469p99K74R1n13J64J351J144Kj93M72M71p0J93J044
57680B25592J245J189K129L521L979M313O563J0399J3556J5733J9143K4997L2308
57667C64667M0481N0415O1857P1357P3622O4339M2593J2477j7917m1131n4582
57656F68178n9901n9408n4847m8262m1489l4926k8485k3119j9720j7304j4322
57645B66395j1039q734p328n892m673m399m277k997j214o31j081q66K79R38N34
57630B15015q5n36j224j836j557p40n71j128j544j776k384k912k379j204p13j053
57614A93373j358j601k344l002k454j156o11r11p39L04J255J584J587J222L27
$$ y = [284480, 280503, 276655, 273765, 271195, 267353, 262227, 257388, 253334, 248898, 243587, 238387, 233927, 229861, 226470, 224714, 224237, 223430, 221961, 221162, 221436, 221527, 221014, 221178, 222529, 223673, 223675, 223482, 223954, 224425, 224355, 224548, 225592, 226837, 228026, 230155, 233676, 237655, 241968, 248531, 258930, 272486, 288219, 307362, 332359, 364667, 405148, 455563, 517420, 588777, 662399, 726738, 769331, 781808, 763891, 722760, 668178, 608277, 548869, 494022, 445760, 404271, 369345, 340860, 317741, 298021, 280717, 266395, 255356, 246622, 239294, 233402, 228729, 224330, 220053, 217056, 215842, 215211, 214130, 213264, 213543, 214481, 215015, 214930, 214394, 213170, 211334, 209777, 209037, 208466, 207338, 205794, 204018, 201634, 198722, 196343, 195139, 194426, 193373, 192015, 190414, 188070, 185068, 182614, 181458, 180847, 179936, 179197, 179501, 180756, 182340, 183927, 185149, 185476]
57599A85476k12N60J764J640K34p95q51r35j576k109k183k223k382k397k380k468
57583A69163k139j213p67j493k095j211O3j85j394j465l27J21o55j280j224j474
57567A52425k229k438j928j800k290k390j844j511j521j005R5Q49J082J433J720
57552A38648J160K27K33J115J624J621J962K330J502j35q24l91m89j631k394k060
57536A42498j632j635j277m21k39j159k094k417k717l091k703j619j087j376j243
57521A17788j98P54J134J756K819L206K509J877K097K466K272J768J203M94K15
57506A42160J119K437K517J443R50J487J593O00m04q54j555k497k263n87P12M16
57490A47274n43j116j594k084j709n06M2n64r20l10M6m31k38J444K784J997J94
$$ y = [185476, 185264, 185824, 187588, 189228, 189462, 188667, 187816, 186881, 185305, 183196, 181013, 178790, 176408, 174011, 171631, 169163, 167024, 165811, 165044, 163551, 161456, 160245, 160308, 160123, 158729, 157264, 156937, 157058, 156403, 155123, 153899, 152425, 150196, 147758, 145830, 144030, 141740, 139350, 137506, 135995, 134474, 133469, 133564, 134413, 135495, 136928, 138648, 139808, 140035, 140268, 141383, 143007, 144628, 146590, 148920, 150422, 150287, 149463, 149072, 148583, 146952, 144558, 142498, 140866, 139231, 137954, 137533, 137294, 136135, 134041, 131624, 128907, 125816, 123113, 121494, 120407, 119031, 117788, 117590, 118344, 119478, 121234, 124053, 127259, 129768, 131645, 133742, 136208, 138480, 140248, 141451, 141945, 142160, 143279, 145716, 148233, 149676, 150626, 152113, 153706, 154306, 153902, 153048, 151493, 148996, 146733, 146146, 146858, 147274, 146731, 145615, 144021, 141937, 140228, 139722, 139764, 139200, 138280, 137970, 138016, 137585, 137347, 138791, 141575, 143572, 143766]
57473A43766n32k36l71j160j663j603j374r91m33k37o66j025q57p89j280j561
57457A28988q69L30J255J890K301K036J130N59P68R11L92o7J71M66J18m56p21
57440A39202r94j388j097K21J423J436P68N04P09Q23P16M44j01o04l00P55J439
57423A43956J189P54P85Q93P10N50L86m17j630j902p72M40O08J98j3j24j53N52
57405A46010J897K574J989J280J346J422P02j37k57r6k77m06q6J21j21o8O19R76
57387A57488M29O5R34K355L113L172L025K620K029J929K327K111R18M6M26J140
57371A84127J093O24L05k79j196j291k2J332J683J761K271K233R50j71L07J456
57355A95183J660J261J406J677J151O36J413K713K806J952J880K821L338K824
$$ y = [143766, 143234, 142998, 142627, 141467, 139804, 138201, 136827, 135836, 135403, 135166, 134500, 133475, 132618, 131829, 130549, 128988, 128119, 128449, 129704, 131594, 133895, 135931, 137061, 137620, 138388, 139299, 139691, 139624, 139795, 140261, 140379, 139923, 139202, 138208, 136820, 135723, 135944, 137367, 138803, 139571, 140075, 140784, 141607, 142323, 142767, 142666, 142062, 141762, 142517, 143956, 145145, 145899, 146684, 147577, 148287, 148837, 149223, 148806, 147176, 145274, 144502, 144942, 145550, 145748, 145735, 145611, 145458, 146010, 147907, 150481, 152470, 153750, 155096, 156518, 157220, 157083, 156826, 156730, 156453, 156047, 155961, 156082, 155961, 155893, 156512, 157488, 157917, 157982, 158916, 161271, 164384, 167556, 170581, 173201, 175230, 177159, 179486, 181597, 182515, 182561, 182987, 184127, 185220, 185844, 186149, 185870, 184674, 183383, 183361, 184693, 186376, 188137, 190408, 192641, 193591, 193420, 193727, 195183, 196843, 198104, 199510, 201187, 202338, 202974, 204387, 207100, 209906, 211858, 213738, 216559, 219897, 222721]
57341B22721K144J853J644J514J816K255K168J712J521J554J519J850L003M208
57327B51482M350L627L069K961K896K872L036K938K274J784K244L203L820M174
57313B94730M603M668M116L916M887O138O293N468M629L927L169K992L930N133
57299C58599N618N997P226Q482Q234O757N699N621N758N816O234O877P129P059
57285D51106P176P290P024O854P287P661P208O706P407Q939R897J0048J0328J1092
57271E66023J1913J2758J3829J4692J4894J4996J5587J5998J5491J4907J5505
57260G26593J6790J7337J7134J7326J8110J8702J8948J9278J9388J8666J7581
57249I25853J7062J6878J6160J5076J4479J4502J4910J6088J8061J9469J9294
$$ y = [222721, 224865, 226718, 228362, 229876, 231692, 233947, 236115, 237827, 239348, 240902, 242421, 244271, 247274, 251482, 255832, 259459, 262528, 265489, 268385, 271257, 274293, 277231, 279505, 281289, 283533, 286736, 290556, 294730, 299333, 304001, 308117, 312033, 316920, 323058, 329351, 334819, 339448, 343375, 346544, 349536, 353466, 358599, 364217, 370214, 377440, 385922, 394156, 400913, 406612, 412233, 417991, 423807, 430041, 436918, 444047, 451106, 458282, 465572, 472596, 479450, 486737, 494398, 501606, 508312, 515719, 524658, 534555, 544603, 554931, 566023, 577936, 590694, 604523, 619215, 634109, 649105, 664692, 680690, 696181, 711088, 726593, 743383, 760720, 777854, 795180, 813290, 831992, 850940, 870218, 889606, 908272, 925853, 942915, 959793, 975953, 991029, 1005508, 1020010, 1034920, 1051008, 1069069, 1088538, 1107832]
57238A107832J8679J9189K0246K0372J9895K0042K0236J9046J7140J6522J7140
57227A316339J7117J6215J6181J7504J8594J8684J8915J9990K1069K1732K2795
57216A525135K4452K5592K5723K5826K6651K7764K8687K9526L0114L0064K9772
57205A829306K9949L0267L0055L0027L1371L3412L4419L4488L5352L7216L8401
57194B194263L8271L8016L8082L7429L5918L5020L5269L5328L4394L3374L2792
57183B588156L1768L0073K9011K9192K9326K8360K6998K6073K5228K4306K4231
57172B892722K5322K6366K6443K6181K6259K6238K5902K6118K7213K8000K7496
57161C184260K6304K5267K4168K2675K1238J9996J8131J5343J2722J1240J0472
$$ y = [1107832, 1126511, 1145700, 1165946, 1186318, 1206213, 1226255, 1246491, 1265537, 1282677, 1299199, 1316339, 1333456, 1349671, 1365852, 1383356, 1401950, 1420634, 1439549, 1459539, 1480608, 1502340, 1525135, 1549587, 1575179, 1600902, 1626728, 1653379, 1681143, 1709830, 1739356, 1769470, 1799534, 1829306, 1859255, 1889522, 1919577, 1949604, 1980975, 2014387, 2048806, 2083294, 2118646, 2155862, 2194263, 2232534, 2270550, 2308632, 2346061, 2381979, 2416999, 2452268, 2487596, 2521990, 2555364, 2588156, 2619924, 2649997, 2679008, 2708200, 2737526, 2765886, 2792884, 2818957, 2844185, 2868491, 2892722, 2918044, 2944410, 2970853, 2997034, 3023293, 3049531, 3075433, 3101551, 3128764, 3156764, 3184260, 3210564, 3235831, 3259999, 3282674, 3303912, 3323908, 3342039, 3357382, 3370104, 3381344, 3391816]
57150C391816R734R256R412R877J0352J1076J2065J2852J3476J4466J5472J5396
57138C535250J4275J3471J3423J2919J1234R290P950O850N764N497O535Q380J1039
57125C661877J5534K1964K8727L4564L9683M3941M5936M5201M3597M3087M3842
57114D067953M5892N0882O0286P3074Q6871J00488J14018J27764J42753J61359
57104E031340J85755K16388K53154K97255L50912M16386M96618N95866P18390
57095H562064Q67325J045633J256623J501766J778547K081236K402089K730183
57087B2225466L050341L344941L595595L781321L876893L856692L701284L399772
57079E0832305K948320K352103J632565Q31828O424p87302j506317k125022k631126
$$ y = [3391816, 3401550, 3410806, 3420218, 3430095, 3440447, 3451523, 3463588, 3476440, 3489916, 3504382, 3519854, 3535250, 3549525, 3562996, 3576419, 3589338, 3600572, 3609862, 3617812, 3624662, 3630426, 3635923, 3642458, 3650838, 3661877, 3677411, 3699375, 3728102, 3762666, 3802349, 3846290, 3892226, 3937427, 3981024, 4024111, 4067953, 4113845, 4164727, 4225013, 4298087, 4384958, 4485446, 4599464, 4727228, 4869981, 5031340, 5217095, 5433483, 5686637, 5983892, 6334804, 6751190, 7247808, 7843674, 8562064, 9429389, 10475022, 11731645, 13233411, 15011958, 17093194, 19495283, 22225466, 25275807, 28620748, 32216343, 35997664, 39874557, 43731249, 47432533, 50832305, 53780625, 56132728, 57765293, 58597121, 58603545, 57816243, 56309926, 54184904, 51553778]
57070E1553778l019749l291016l450377l507758l474938l364386l190587k970715
57062B5284252k722565k462048k202378j953773j722617j511697j322325j155610
57054A0231239j011334q87011p79299o85724o04482n33701m71971m18710l73076
57045D465931l33324k98028k66981k40059k16200j94503j75231j58557j43264
57036B439784j27976j12916r9262q7388p6814o7129n7674m7051l4320k0136n062
57025A704056J2772L5904O1976Q0880P9616N2023M837m5981q5783j09096j18509
57014A672695j18405j11635j00827q9243p8900o9580o0726n2897m6611m1287l6375
57003H66209l2197k8718k4935k0595j7146j5791j5736j5554j5108j4850j4404
$$ y = [51553778, 48534029, 45243013, 41792636, 38284878, 34809940, 31445554, 28254967, 25284252, 22561687, 20099639, 17897261, 15943488, 14220871, 12709174, 11386849, 10231239, 9219905, 8332894, 7553595, 6867871, 6263389, 5729688, 5257717, 4839007, 4465931, 4132607, 3834579, 3567598, 3327539, 3111339, 2916836, 2741605, 2583048, 2439784, 2311808, 2198892, 2099630, 2012242, 1935428, 1868299, 1810625, 1763574, 1729254, 1709118, 1704056, 1716828, 1752732, 1814708, 1895588, 1975204, 2027227, 2032064, 1986083, 1900300, 1791204, 1672695, 1554290, 1442655, 1341828, 1252585, 1173685, 1104105, 1043379, 990482, 943871, 902584, 866209, 834012, 805294, 780359, 759764, 742618, 726827, 711091, 695537, 680429, 665579, 651175]
56992F51175j3208j1734j0707r798q255o188m114j884R75M332P572R851R753N866
56978F23636j342r197j5265j9185k1499k2068k0804j8704j6779j4762j2082r191
56966D42758o850m846k506K23L099O186R358J2194J5147J9448K4742K7990K6059
56953E73002J8714Q140l281j3667k1390k5750k7396k7131k5000k1261j7136j3619
56941D04225j0588p871n965m718k725Q34N016Q904J3188J8793K5208L1224L5695
56928E11220L6390L0185J6568l00j5003k5349l1975l5193l4710l1530k7709k4261
56916C68333k0971j7817j5086j2577j0096q203p343o898o220n642n401m756l408
56903B43915k481k662k725j489J88J061J736L367N435O880Q211J0389J2779J4358
$$ y = [651175, 637967, 626233, 615526, 605728, 597473, 591285, 587171, 585287, 586262, 590594, 598166, 608017, 617770, 623636, 622294, 613097, 597832, 578647, 557148, 535080, 514276, 495572, 478793, 464031, 451949, 442758, 435908, 431062, 428556, 428779, 431878, 438064, 447422, 459616, 474763, 494211, 518953, 546943, 573002, 591716, 599856, 596575, 582908, 561518, 535768, 508372, 481241, 456241, 434980, 417844, 404225, 393637, 385766, 379801, 375083, 372358, 373192, 378208, 387112, 400300, 419093, 444301, 475525, 511220, 547610, 577795, 594363, 594063, 579060, 553711, 521736, 486543, 451833, 420303, 392594, 368333, 347362, 329545, 314459, 301882, 291786, 283583, 276240, 269342, 263122, 257480, 252079, 247323, 243915, 241434, 238772, 236047, 234558, 234746, 235807, 237543, 240910, 246345, 253225, 261436, 271825, 284604, 298962]
56889B98962J5937J8997K3207K7174L0547L3037L2484K6723J6844O241l096j1068
56877E15989j7015j9591j9027j7141j4970j2325r411o857m245o13L715P624J1261
56864D17394J5835K1669K8305L6147M6003N6899O5760O8929O3141M6568K1314
56853H87964n910k7968m2047m9147n0511m7007m0763l4194k7565j9944j1969n183
56841E25756P82P701J5863K4361L3730M5505N9556P4638R0802J07292J17879J12522
56829A216387Q6015M3360l970m5139p3754q8507r2351q9690q3158p3581o2317
56818G33295n1333m1122l0899k0953j2483n052L324J3235K3421L3548M5009N8262
56806G48252P1177Q0007Q0119O6686L8472J732l2528n6586o9740p4659p3463o8105
$$ y = [298962, 314899, 333896, 357103, 384277, 414824, 447861, 480345, 507068, 523912, 530153, 527057, 515989, 498974, 479383, 460356, 443215, 428245, 415920, 406509, 399652, 395407, 394794, 398509, 406133, 417394, 433229, 454898, 483203, 519350, 565353, 622252, 688012, 756941, 820082, 866650, 887964, 882054, 854086, 812039, 762892, 712381, 665374, 624611, 590417, 562852, 542908, 530939, 525756, 526538, 534239, 550102, 574463, 608193, 653698, 713254, 787892, 878694, 985986, 1103865, 1216387, 1302402, 1345762, 1341792, 1296653, 1222899, 1134392, 1042041, 952351, 869193, 795612, 733295, 681962, 640840, 609941, 588988, 576505, 571453, 574777, 588012, 611433, 644981, 689990, 748252, 819429, 899436, 979555, 1046241, 1084713, 1086445, 1053917, 997331, 927591, 852932, 779469, 711364]
56794G11364o1084n3712m5596l6916k9206k3015j7021j0477m328R49O543J3284
56782D50785K0567K7954L5580M1881M3134L6625K2858M369j5518l2390m2210m4652
56770E48983m3168m0768l7648l3456k9232k5804k2600j9332j6854j5245j3211
56759B51665j0483q633q323q012o618n180m527l632j899q66j808l495m066l557
56745A80566k953k342j485q29o06k63J86j37j108j274l66P0n10n14O97J110o68
56728A69574k732k633j001j21m12n76r2N47J218K065K644K568K202J710N50j102
56712A74409j753o58P69Q61j47r75j078n22O78K073K781K747K797K898K043L73
56696A87296n19j52Q8m45n53K42N11l49p32J98O21q39k441k022m42J55j79J28
$$ y = [711364, 650280, 596568, 550972, 514056, 484850, 461835, 444814, 434337, 430009, 430958, 437501, 450785, 471352, 499306, 534886, 576767, 619901, 656526, 679384, 683753, 668235, 635845, 593635, 548983, 505815, 465047, 427399, 393943, 364711, 338907, 316307, 296975, 280121, 264876, 251665, 241182, 232549, 224226, 216214, 209596, 204416, 199889, 196257, 194358, 193492, 191684, 188189, 184123, 180566, 177613, 175271, 173786, 172957, 172351, 172088, 172274, 172137, 171029, 169755, 169389, 169459, 168949, 168435, 169132, 170242, 169574, 166842, 164209, 163208, 163087, 162675, 162099, 162007, 162554, 163772, 165837, 168481, 171049, 173251, 174961, 175511, 174409, 172656, 171998, 172767, 173628, 173481, 172506, 171428, 170906, 171584, 173657, 176438, 179185, 181982, 184880, 186923, 187296, 186777, 186625, 186713, 186268, 185715, 185957, 186468, 186119, 185387, 185585, 186206, 185367, 182926, 180904, 180462, 180617, 180438, 180566]
56678A80566J270K134K304K029J146k64j130p88j07Q4K91Q42P35l98q74N97K580
56661A91017K894J630L93j26j20M93J414J345j95j649j527m56L05Q65J639J865
56645A99787R73M1J64P72J114J783L097L686K566R55J93m05j681k489j685n22
56629B08349o78j442j281o71r56j763k007k184l186m093l607k516k267k264j086
56614A78348O42J170M92j01m27j088j622j326q98j158j176M5J328J138L43N48
56598A76258J035J76j191r45O40J422J030R59J546J705J400J618K102J705P40
56583A90200M57O06M7p02j69J157J348K71m01k06k29m90K79J998K917K324J378
56566B00785J050J206J826L109M333M596M611N869Q195J0091J1131J1818J1492
$$ y = [180566, 181836, 183970, 186274, 188303, 189449, 189185, 188055, 187267, 187160, 187244, 187535, 188377, 189112, 188714, 187840, 188437, 191017, 193911, 195541, 195934, 195808, 195688, 196181, 197595, 198940, 198745, 197096, 195569, 195113, 195418, 196283, 197922, 199787, 200760, 200801, 200965, 201737, 202851, 204634, 207731, 211417, 213983, 214938, 215131, 214726, 213045, 210556, 208871, 208349, 207671, 206229, 204948, 204277, 203321, 201558, 199551, 197367, 194181, 190088, 186481, 183965, 181698, 179434, 178348, 178990, 180160, 180652, 180551, 180124, 179036, 177414, 176088, 175190, 174032, 172856, 172901, 174229, 175367, 175710, 176258, 177293, 177469, 176278, 175333, 175973, 177395, 178425, 179384, 180930, 182635, 184035, 185653, 187755, 189460, 190200, 190657, 191263, 191310, 190608, 190439, 191596, 192944, 193215, 192814, 192608, 192379, 191889, 192168, 194166, 197083, 199407, 200785, 201835, 203041, 204867, 207976, 212309, 216905, 221516, 227385, 235580, 245671, 256802, 268620, 280112]
56553B80112Q825M362L96j844k864k983j961m95L7m74r58j138j643k353k477k114
56537B72428j999k049j822j887k885l894l674k817k616k697j979j091j331k003
56523B39684j487k84j96j017r60kJ46p41j175r44j399k609l074k517k308k744
56507B18373k559j471p90j009j105n83l6N11J586K489J890K63n24j08J38k21k15
56490B16629K58J95l23j34O99Q83L21J67M64J55n88n29R4j79j166j109K22J141
56472B17200J008R74J421J336O03M48J133J565J474J637J786Q25q04j456j111
56457B28039j263j955j636j67Q66J002J297J719J065l18o48J57L69k00Q0J300
56441B29707J570M77j61K90L37m64o07K99O74J08J92J233J402K04l87N27J154
$$ y = [280112, 288937, 293299, 293695, 291851, 288987, 286004, 284043, 283548, 283585, 283111, 282153, 281015, 279372, 277019, 274542, 272428, 270429, 268380, 266558, 264671, 261786, 257892, 254218, 251401, 248785, 246088, 244109, 243018, 241687, 239684, 238197, 237913, 237717, 236700, 235740, 235738, 235884, 235143, 233968, 233024, 231625, 229016, 225942, 223425, 221117, 218373, 215814, 214343, 213553, 212544, 211439, 210856, 210820, 211331, 212917, 215406, 217296, 217559, 217035, 216927, 217065, 216844, 216629, 216887, 217082, 216759, 216625, 217324, 218207, 218528, 218695, 219159, 219314, 218726, 218197, 218291, 218112, 216946, 215837, 216059, 217200, 218208, 219182, 220603, 221939, 222542, 222990, 224123, 225688, 227162, 228799, 230585, 231410, 230606, 229150, 228039, 226776, 224821, 223185, 223018, 223884, 224886, 226183, 227902, 228967, 228649, 228001, 228158, 228527, 228327, 228407, 229707, 231277, 231754, 231593, 231883, 232220, 231756, 231149, 231448, 232122, 232230, 232422, 233655, 235057, 235261, 234874, 235401, 236555]
56424B36555L94k32M33J129P11J05K31K97l14p57n56m73n02N35K377K873J343
56407B44149j86k81j48j041k092k142j591j171q07o35j211j968j599m18j00p10
56391B28049n65O78J579J815K555L573L268J972J823K823K707J340J339L252M247
56376B60455K979J663J728J403l22j350l45O80P7n47L91J533J398J100J755K132
56360B74730J275O07J157J427L58m85J03O29r9n27O66J949J752J238J800K370
56344B88950J666O56N03M73J0L15J714K298J288R05K548M045L275J682J525K262
56328C14115K391K326K869L218K946L472N244O045M450K304J457Q81n54j420n06
56313C49238O29M77J70P11O81o20j000P86K253J348J84J234K955K876K097K880
$$ y = [236555, 236949, 236717, 237150, 238279, 238990, 239095, 239326, 239623, 239309, 238552, 237996, 237523, 237021, 237556, 239933, 242806, 244149, 243963, 243682, 243534, 242493, 240401, 238259, 236668, 235497, 234690, 234055, 232844, 230876, 229277, 228859, 228759, 228049, 227484, 228162, 229741, 231556, 234111, 237684, 240952, 242924, 244747, 247570, 250277, 251617, 252956, 256208, 260455, 263434, 265097, 266825, 268228, 267906, 266556, 266211, 266891, 266968, 266421, 266812, 268345, 269743, 270843, 272598, 274730, 276005, 276612, 277769, 279196, 279554, 279069, 279172, 279801, 279702, 279175, 279841, 281790, 283542, 284780, 286580, 288950, 290616, 291272, 291775, 292248, 292258, 292573, 294287, 296585, 297873, 298778, 301326, 305371, 308646, 310328, 311853, 314115, 316506, 318832, 321701, 324919, 327865, 331337, 336581, 342626, 347076, 349380, 350837, 351718, 351164, 349744, 349238, 349867, 350344, 350514, 351225, 351906, 351286, 350286, 351072, 353325, 354673, 354857, 356091, 359046, 361922, 364019, 366899]
56297C66899M378M619M334N076N796M924L720M036M900M712M529N723O813O173
56283D36632N467O684Q163P459N911O304Q032Q668Q405R009J0035J0048R955J1352
56269E52124J3132J3403J3165J4449J6554J7785J9076K2024K5122K5930K5603
56258G58367K7269L1227L5410L9378M4231M9794N5329O1753O9939P8359Q5536
56247A336592R3079J03041J14147J24011J33012J42302J50135J54003J54557J53550
56237B658429J49711J40555J26487J09335Q8704O3722L6557J0235j5201m0643
56227C327891o4109q3052r8368j11980j22573j28121j30393j32350j33052j29900
56217B193993j24082j18836j13952j07020r8677r1660q5840p9066p1786o6160
$$ y = [366899, 371277, 375896, 380230, 385306, 391102, 396026, 399746, 403782, 408682, 413394, 417923, 423646, 430459, 436632, 442099, 448783, 456946, 464405, 470316, 476620, 484652, 493320, 501725, 510734, 520769, 530817, 540772, 552124, 565256, 578659, 591824, 606273, 622827, 640612, 659688, 681712, 706834, 732764, 758367, 785636, 816863, 852273, 891651, 935882, 985676, 1041005, 1102758, 1172697, 1251056, 1336592, 1429671, 1532712, 1646859, 1770870, 1903882, 2046184, 2196319, 2350322, 2504879, 2658429, 2808140, 2948695, 3075182, 3184517, 3273221, 3336943, 3373500, 3383735, 3368534, 3327891, 3263782, 3180730, 3082362, 2970382, 2847809, 2719688, 2589295, 2456945, 2323893, 2193993, 2069911, 1951075, 1837123, 1730103, 1631426, 1539766, 1453926, 1374860, 1303074, 1236914]
56207A236914o1679n6298n0765m7236m4821m1036l6447l3293l0871k6960k2501
56196G85007k0120j9217j7270j4656j3445j2745j0294p324o770p811p244n168
56184F42943m244m474l727k431k576l165j748N83P53p53r65J65M55K93J560L134
56168F25803K713J649K664M371L725K119L062N424N430L929M946Q113R372Q476
56154F91796Q990J1262J2167J1548J2321J4446J5191J5181J7664K2102K5069K7211
56142H84948L2548M1129M9194N6475O6300P8330Q8228R4708R9916J02600R8285
56131A692661Q7064P4342O3186N2639M3999M1138M3190M3771L9018L0509J9805
56120B231322O780n902j3483j5664j6743j8992k1989k8030m0838n8399p4082q5117
$$ y = [1236914, 1175235, 1118937, 1068172, 1020936, 976115, 935079, 898632, 865339, 834468, 807508, 785007, 764887, 745670, 728400, 713744, 700299, 687554, 677260, 669936, 663166, 655355, 648111, 642943, 638699, 634225, 630498, 628067, 625491, 622326, 620578, 621161, 621914, 621161, 620196, 620361, 620816, 621109, 622669, 625803, 628516, 630165, 632829, 637200, 640925, 643044, 646106, 651530, 656960, 660889, 665835, 673948, 683320, 691796, 700786, 712048, 724215, 735763, 748084, 762530, 777721, 792902, 810566, 832668, 857737, 884948, 917496, 958625, 1007819, 1064294, 1130594, 1208924, 1297152, 1391860, 1491776, 1594376, 1692661, 1779725, 1854067, 1917253, 1969892, 2013891, 2055029, 2098219, 2141990, 2181008, 2211517, 2231322, 2238102, 2232200, 2218717, 2203053, 2186310, 2167318, 2145329, 2117299, 2076461, 2018062, 1943980, 1858863]
56108A858863r3248r7489r4346q5505p7131p0587o1727m9989m0002l3262k6385
56097A129192j8836j4169j2354r052l939j573k655k630k87N77o06K29L462M646
56083A072005L225L795P206R068Q594R919J3165J3452J0558J0045J2842J3433
56071A187307J0549R783J3065J5341J4488J4715J7352J7984J5646J5151J7580
56060A348961J8213J6479J7684K2274K3963K1339K0441K2928K3019J9381J8331
56049A573013K1525K2388J8879J7811K1893K4544K2530K1791K5530K8353K7569
56038A825826K8514L3183L5434L3073L2745L7282M0248L8561L8265M2107M4075
56027B229313M1968M2487M7894N0931M9037M9923N6660O1265N9890N9987O5352
$$ y = [1858863, 1765615, 1668126, 1573780, 1488275, 1411144, 1340557, 1278830, 1228841, 1188839, 1155577, 1129192, 1110356, 1096187, 1083833, 1074781, 1070842, 1069269, 1066614, 1063984, 1063697, 1064274, 1063668, 1063897, 1067359, 1072005, 1075230, 1079025, 1086231, 1095299, 1103893, 1113812, 1126977, 1140429, 1150987, 1161032, 1173874, 1187307, 1197856, 1207639, 1220704, 1236045, 1250533, 1265248, 1282600, 1300584, 1316230, 1331381, 1348961, 1367174, 1383653, 1401337, 1423611, 1447574, 1468913, 1489354, 1512282, 1535301, 1554682, 1573013, 1594538, 1616926, 1635805, 1653616, 1675509, 1700053, 1722583, 1744374, 1769904, 1798257, 1825826, 1854340, 1887523, 1922957, 1956030, 1988775, 2026057, 2066305, 2104866, 2143131, 2185238, 2229313, 2271281, 2313768, 2361662, 2412593, 2461630, 2511553, 2568213, 2629478, 2689368, 2749355, 2814707]
56016B814707O8703O6583O6697P2694P6806P5512P7014Q4991R0883R0721R3122
56005C678433J01884J07825J07097J09913J21212J30860J33331J38417J51553
55996D780525J62795J66791J73907J89496K02505K07241K15425K33571K50239
55987F582495K59239K72668K96669L18250L31334L50678L83927M16243M39760
55978I651263M70368N17071N64232O03927O54535P25844P98938Q63999R43004
55969A5793181J049830J165511J280541J421497J605669J812768K034889K307845
55961B8471731K657203L065798L536005M127731M890576N824824O961372Q403906
55953F7939146J0232426J2460044J5166413J8572000K2892806K8237762L4647956
$$ y = [2814707, 2883410, 2949993, 3016690, 3089384, 3166190, 3241702, 3318716, 3403707, 3494590, 3585311, 3678433, 3780317, 3888142, 3995239, 4105152, 4226364, 4357224, 4490555, 4628972, 4780525, 4943320, 5110111, 5284018, 5473514, 5676019, 5883260, 6098685, 6332256, 6582495, 6841734, 7114402, 7411071, 7729321, 8060655, 8411333, 8795260, 9211503, 9651263, 10121631, 10638702, 11202934, 11806861, 12461396, 13187240, 13986178, 14850177, 15793181, 16843011, 18008522, 19289063, 20710560, 22316229, 24128997, 26163886, 28471731, 31128934, 34194732, 37730737, 41858468, 46749044, 52573868, 59535240, 67939146, 78171572, 90631616, 105798029, 124370029, 147262835, 175500597, 210148553]
55946B10148553M1750866M7827236M9457796M3134828K8101634P672071j2578262
55939D15514722k8120156l7329613m0941063m0550002l7693711l3617092k9194007
55932A68069078k4898117k0948208j7481515j4564007j2147817j0139406q487522
55925E9402486p156949o074100n164464m405956l793897l289751k850314k472458
55917B4194597k165097j907286j673006j468242j306087j171245j043032r28561
55909A2532041q40849p67440o91464o21703n72257n32794m87131m42240m11628
55900G164535l87716l56760l24845l04003k87754k64286k39755k25574k15797
55891D558045j98990j80114j69660j62821j49560j34399j26754j22106j11195
$$ y = [210148553, 251899419, 299726655, 349184451, 392319279, 420420913, 428092984, 415514722, 387394566, 350064953, 309123890, 268573888, 230880177, 197263085, 168069078, 143170961, 122222753, 104741238, 90177231, 78029414, 67890008, 59402486, 52245537, 46171437, 41006973, 36601017, 32807120, 29517369, 26667055, 24194597, 22029500, 20122214, 18449208, 16980966, 15674879, 14503634, 13460602, 12532041, 11691192, 10923752, 10232288, 9610585, 9038328, 8505534, 8018403, 7576163, 7164535, 6776819, 6420059, 6095214, 5791211, 5503457, 5239171, 4999416, 4773842, 4558045, 4359055, 4178941, 4009281, 3846460, 3696900, 3562501, 3435747, 3313641, 3202446]
55882C202446r8003r0967q6224p6776o8696p1168p9149q2092q1350q3432q4827
55871B299762p9246p1923p1303p3734p0945o5300o3522o2596n6263m8540m6829
55860A589561m7859m4059l7743l5840l6508l3799k9904l0108l1245k7537k2554
55849A212405k3112k6539k5986k3313k4652k7944k6862k2906k2000k3045k0950
55838I45096j7285j7058j8588j7073j4535j5887j8740j7367j3371j2346j3350
55827G69496j1582q267q102r775q719o380p449j0638j1295j0396j1994j4545j3668
55814F36686j0900j0894j2519j1311q256p603q436o736l452k367k420j84K634
55801E54242K277Q26K785O419O776M768M855O175M499R37J0R09q35m517n593m366
$$ y = [3202446, 3104443, 3013476, 2927252, 2850476, 2781780, 2710612, 2631463, 2549371, 2468021, 2384589, 2299762, 2220516, 2148593, 2077290, 2003556, 1932611, 1867311, 1803789, 1741193, 1684930, 1636390, 1589561, 1541702, 1497643, 1459900, 1424060, 1387552, 1353753, 1323849, 1293741, 1262496, 1234959, 1212405, 1189293, 1162754, 1136768, 1113455, 1088803, 1060859, 1033997, 1011091, 989091, 966046, 945096, 927811, 910753, 892165, 875092, 860557, 844670, 825930, 808563, 795192, 782846, 769496, 757914, 749647, 741545, 731770, 723051, 716671, 709222, 698584, 687289, 676893, 664899, 650354, 636686, 625786, 614892, 602373, 591062, 582806, 575203, 566767, 560031, 556579, 554212, 551792, 551608, 554242, 556519, 557345, 560130, 566549, 573325, 578093, 582948, 589123, 593622, 594559, 594569, 595478, 594643, 590126, 584533, 580167]
55785E80167n011p065o256l088k526n628q955j1649j5628j9378j9038j5400j2814
55772D47731j1656q717m357k154j903n2L141L722J167j148k419m873p939q391
55758D02152o395n337n698m919l113l045m629n172m724n585p116o721n345o108
55744C28245q157p820n358m483n629n716m301l914m470l384j119p56k086j844
55730B69208J36P13p24j759k077l489n079m169j928k142m518n122l406k687l500
55715B29457k774k01P84o77j367J55J663K130L147M640M435K899K848M111L394
55700B54644K41k146k724l831n857o166m438l700m821n096l518k445k777k489
55686B04877j095o80j323m61J951K769J404J167L423N408N418N201N505M187P72
$$ y = [580167, 575156, 568091, 561835, 558747, 556221, 550593, 541638, 529989, 514361, 494983, 475945, 460545, 447731, 436075, 427358, 423001, 420847, 418944, 418892, 422033, 425755, 426922, 425774, 423355, 418482, 410543, 402152, 395757, 390420, 384722, 379803, 376690, 373645, 369016, 363844, 359120, 353535, 346419, 339698, 334353, 328245, 320088, 312268, 306910, 302427, 296798, 291082, 286781, 282867, 278397, 275013, 273894, 273138, 271052, 269208, 269344, 270057, 269333, 267574, 265497, 262008, 256929, 252760, 250832, 248690, 244172, 239050, 235644, 232957, 229457, 226683, 226482, 227266, 226589, 225222, 225377, 227040, 229170, 232317, 236957, 241392, 244291, 247139, 251250, 254644, 254885, 252739, 250015, 246184, 240327, 234161, 229723, 226023, 221202, 216106, 212588, 210143, 207366, 204877, 203782, 203102, 201779, 201318, 203269, 206038, 207442, 208609, 212032, 217440, 222858, 228059, 233564, 237751, 238523]
55671B38523j809k012j889k697k729j399j050k611l629k682j689j925j718j43
55657B10541R47N07K13R17R70p4Q2K384M399M316L425K924J791l29j644j511j770
55640B28088l203m024l513l544m933n792n212m928n684n632m079l113l602l427
55626A67402j637n95j701k728j808o07r45j561q60J28M3k90l0l47k012l495l540
55609A45417l206l424l172j847q30q96p54J35J45j399k574k165j680k228k349
55594A19173r78L57L52R7M69L10q21j028N17J503J89j593j535l55J96K53M00j33
55576A17373j454j631K74K112J920R66J188K007K089K027K714L136K252J160J039
55561A37172R02l36j561j456r48j432k343k582k551k715k130m74M95l95j544j174
$$ y = [238523, 236714, 234702, 232813, 230116, 227387, 225988, 224938, 222327, 218698, 216016, 214327, 212402, 210684, 210541, 211488, 211995, 212208, 213125, 214095, 214021, 214103, 216487, 220886, 225202, 228627, 231551, 233342, 233013, 231369, 229858, 228088, 224885, 220861, 217348, 213804, 208871, 203079, 197867, 192939, 187255, 181623, 177544, 174431, 170829, 167402, 165765, 165170, 163469, 160741, 158933, 158326, 157381, 155820, 154960, 155088, 155131, 154841, 154811, 154464, 152452, 148957, 145417, 142211, 138787, 135615, 133768, 132938, 132042, 131288, 131423, 131568, 130169, 127595, 125430, 123750, 121522, 119173, 118195, 118552, 118904, 119001, 119470, 119780, 118959, 117931, 118448, 119951, 120140, 118547, 117012, 116657, 116853, 117106, 117506, 117373, 115919, 114288, 114562, 116674, 118594, 119560, 120748, 122755, 124844, 126871, 129585, 132721, 134973, 136133, 137172, 138074, 137738, 136177, 134721, 133773, 132341, 129998, 127416, 124865, 122150, 120020, 119546, 120041, 119646, 118102, 116928]
55545A16928j50n4m49l00j24m85k20J464K932K527J318J174J693J399N32K85N52
55528A29022N09K50J31k50q84p50J77J71j450k801k435j636j884k282j691j125
55512A13072j713k264j402k04k59q48n40O1k62q31m20L01R2m51j48M76L63jJ92
55493A05214K78m33r14l21J22p50j698j213k77n68j572j902j870k231k082n66
55477H9217Q67O18k22J15Q01J14j144r70K65O81K71L71P11O5q92m61Q75J053j47
55458I2188r58o44q8K71P30R51M70Q5N45P15o72k319k006k10O59K5n43l79l04
55439H8516l60M10J820K506K106J476Q79k8p09l10N19L65p24j540j823k081j986
55422H9036r59J32L4o99o11J44M15M59J363K523K220M97q68j039o80j26P72J272
$$ y = [116928, 116778, 116724, 116275, 115975, 115851, 115366, 115146, 116610, 119542, 122069, 123387, 124561, 126254, 127653, 128185, 128470, 129022, 129531, 129781, 129912, 129662, 128778, 128028, 128205, 128376, 126926, 124125, 121690, 120054, 118170, 115888, 114197, 113072, 111359, 109095, 107693, 107489, 107230, 106382, 105842, 105903, 105641, 104810, 104390, 104691, 104783, 104332, 104184, 104660, 105023, 105022, 105214, 105492, 105059, 104145, 103824, 103946, 103196, 101498, 100285, 100008, 99440, 97868, 95966, 94096, 91865, 89783, 89217, 90084, 90702, 90480, 90595, 91396, 91510, 90366, 89396, 89661, 90342, 90613, 90984, 91695, 91760, 90868, 90407, 91282, 92335, 92188, 91230, 90586, 90498, 90769, 91499, 92450, 92920, 93005, 93550, 94265, 93593, 91274, 89268, 89058, 89717, 89742, 89199, 88820, 88516, 88156, 88566, 90386, 92892, 94998, 96474, 97353, 97325, 96616, 96306, 96825, 97190, 96466, 94926, 93103, 91022, 89036, 88077, 88209, 88243, 87544, 86933, 87077, 87492, 87951, 89314, 91837, 94057, 94554, 93686, 92647, 91967, 91841, 92613, 93885]
55404I3885M89p34q30j09j19q48q54lL80o0m04n43j253k170j956n38P93J519K092
55385H8737K241J300P1J00J051J084j70j227j374j393j585j330p85q64j292q72
55369H3692K09M77k15m45J45K43o36j259q07N0O79J290J769J523Q66Q28J333J307
55351I1049P21O69J230J218L43l42m19o23j107j099n98m97p11j56J125J789J448
55334I4040J074Q65j05j615k013r01j1m63j117o65M04R57Q71N78K21J1K65O22
55316I3018M28Q0N94J688J942J072L06K45J54k59k76J43K6o95q41j64J4r17j763
55297I4795j606j161j186j177o10PK22M19P52O02j10m23J47Q73J176J387J633
55280I5740J373O30K27L34K14j55J76J222J677J001K32j7n35j677k336j800j023
$$ y = [93885, 94374, 93640, 92810, 92701, 92582, 91734, 90880, 90877, 91257, 91197, 90793, 90250, 88997, 86827, 84871, 84333, 85126, 86645, 88737, 90978, 92278, 92349, 92449, 93500, 94584, 94414, 93187, 91813, 90420, 88835, 87505, 86720, 85856, 84564, 83692, 83901, 84378, 84163, 83718, 83863, 84106, 83470, 82211, 81404, 81454, 82133, 83423, 85192, 86715, 87581, 88409, 89742, 91049, 91770, 92439, 93669, 94887, 95230, 94888, 94469, 93846, 92739, 91640, 91042, 90545, 89834, 89678, 90803, 92592, 94040, 95114, 95979, 95874, 94259, 92246, 91345, 91334, 90871, 89754, 89089, 89493, 90450, 91321, 91899, 92120, 92131, 92396, 93018, 93446, 93526, 94120, 95808, 97750, 98822, 99128, 99373, 99527, 99268, 98992, 99135, 99161, 98466, 97625, 97461, 97475, 96558, 94795, 93189, 92028, 90842, 89665, 89055, 89062, 89284, 89703, 90455, 91057, 90947, 90524, 90671, 91544, 92720, 94107, 95740, 97113, 97743, 97970, 98304, 98518, 98363, 98539, 99761, 101438, 102439, 102671, 102654, 102119, 100442, 98106, 96306, 95283]
55263I5283r70j139q01l41k82k43J33L79J99J23L88L60j79m78k21j83p36j119
55245I0173q92o66n81K65J966K945K158P31J56K30Ol94l00J22K98L09M60N12K13
55226I7711j71m71r29j336r40J89Q49M59j06o5J99L04O51J217R94k69j211p89
55208I6286J62M51K93L68L88j01n75n23n59j239j778j235j64K99K16M01Q47Q81
55190I4418M25mj24Q2O93J437J584R24J60j90m67q17o62P9M05j95o80q0R21J137
55170I9046O26J38k50o70n55M60J418J192J94k93k2J49j74m89l24K14P25P41N9
55151A02185p99r64m59k79q29j256r14l60j77P9Q35J459J293P61M95K25l67o36
55133A00292M7J061J411J096O41Pr12j529j335q20n88l05M24R59N33l67p41m99
$$ y = [95283, 94313, 93174, 92373, 92032, 91750, 91507, 91640, 92019, 92218, 92341, 92729, 93089, 92910, 92432, 92211, 92028, 91292, 90173, 89281, 88615, 88034, 88299, 90265, 93210, 95368, 96099, 96255, 96485, 96491, 96097, 95797, 95919, 96217, 96526, 96986, 97498, 97711, 97540, 97069, 96140, 94804, 93864, 94053, 94902, 95361, 95255, 95190, 95389, 95693, 96344, 97561, 98555, 98286, 97075, 96286, 96448, 96899, 97192, 97560, 97948, 97847, 97272, 96749, 96190, 94951, 93173, 91938, 91774, 92073, 92289, 92690, 93537, 94418, 94843, 94839, 94715, 94797, 95490, 96927, 98511, 99435, 99595, 99405, 98938, 98121, 97459, 97538, 97943, 97748, 97068, 96988, 97909, 99046, 99672, 99810, 99560, 98890, 98335, 98795, 100213, 101405, 101599, 101306, 101284, 101433, 101259, 100770, 100446, 100660, 101385, 102126, 102185, 101386, 100422, 99963, 99684, 98855, 97599, 96685, 96325, 96148, 96227, 97062, 98521, 99814, 100575, 101070, 101295, 100928, 100292, 100339, 101400, 102811, 103907, 104548, 104555, 103643, 102114, 100779, 99959, 99371, 99066, 99490, 100449, 100982, 100615, 99874, 99375]
55115I9375j53K56P91R25L40j91R1N87L47k73k42L43M80j6l35o2L98O15M96k6
55095A03746p89j168p81j04K84N63J083J514J453J260J401J544J230Q34Q61Q60
55079A13791J05j097j759j539q29P4J014J659J880J969J928J289K56LQ73J355
55063A20972J09j907k724k022j085o94n92n99p97q10k17N10O36M02N11P43L41
55046A12777n05q54m75m8K7q2k60m62l27K33M25l84j478j708j183q99j014p94
55028A02989k6O96J019J024O08k69q75m12P17J348J124O04Q7o04j265j372r37
55011A04456l92K30J064J628J344O30M12P19P80L92R6J41K60M11P48R67O25jk19
54992A14291PK29M84J086J663J423L52p85j492j817j749j230n38Q6Q84J908K409
$$ y = [99375, 99222, 99478, 100269, 101194, 101534, 101343, 101434, 102021, 102368, 102095, 101853, 102196, 102676, 102660, 102325, 102263, 102661, 103276, 103772, 103746, 102957, 101789, 101008, 100904, 101188, 101751, 102834, 104348, 105801, 107061, 108462, 110006, 111236, 112070, 112931, 113791, 113896, 112799, 111040, 109501, 108672, 108746, 109760, 111419, 113299, 115268, 117196, 118485, 118741, 118744, 119617, 120972, 121081, 119174, 116450, 114428, 113343, 112649, 112057, 111458, 110661, 109851, 109634, 110144, 110780, 111182, 111693, 112436, 112777, 112272, 111418, 110943, 110895, 110922, 110840, 110580, 110118, 109791, 110024, 110449, 110065, 108587, 106879, 105696, 104797, 103783, 102989, 102963, 103659, 104678, 105702, 106310, 106041, 105166, 104754, 105471, 106819, 107943, 108547, 108634, 108030, 106765, 105393, 104456, 104064, 104294, 105358, 106986, 108330, 108960, 109372, 110091, 110871, 111263, 111359, 111500, 111760, 112171, 112919, 113886, 114511, 114510, 114291, 114298, 114527, 115011, 116097, 117760, 119183, 119535, 118750, 117258, 115441, 113692, 112462, 111924, 112010, 112894, 114802, 117211]
54975A17211J786O94J18k9l65o04n2Q94J182P68N27O48M94%j03M28J035J344J420
54956A27396J164M61j82j87J4m08j274j740j704j621j254m1J413J692N33q59j500
54939A21903j402q19L1M30j57r17n66O44J223Q00N39J052J501J317J152J508J782
54922A30021J428R62J045J623K495L824N457O606O801O435N971N239L952K223
54908A84082K50j877l868n249n877n886n262m080k952k444k243j766j287j443
54894A40098j930j862j272j025j314j462j167p71l15M47J154J202R13J085J509
54879A35290J354R31J402K748L677L826M288N558O630O733O357N883M646K254
54865A91577m22k349l495m243m632m712m768m728m248l551l284l378l202k811
$$ y = [117211, 118997, 119691, 119809, 119780, 119415, 118811, 118759, 119653, 120835, 121603, 122130, 122778, 123272, 123272, 123169, 123597, 124632, 125976, 127396, 128560, 129021, 128839, 128652, 128666, 128258, 126984, 125244, 123540, 121919, 120665, 120624, 122037, 123729, 124262, 123403, 121903, 120501, 119682, 119713, 120143, 119986, 119069, 118503, 119147, 120370, 121170, 121709, 122761, 124262, 125579, 126731, 128239, 130021, 131449, 132411, 133456, 135079, 137574, 141398, 146855, 153461, 160262, 166697, 172668, 177907, 181859, 184082, 184332, 182455, 178587, 173338, 167461, 161575, 156313, 152233, 149281, 146837, 144594, 142828, 141541, 140098, 138168, 136306, 135034, 134009, 132695, 131233, 130066, 129295, 128980, 129427, 130581, 131783, 132696, 133781, 135290, 136644, 137575, 138977, 141725, 145402, 149228, 153516, 159074, 165704, 172437, 178794, 184677, 189323, 191577, 191155, 188806, 185311, 181068, 176436, 171724, 166956, 162228, 157980, 154429, 151145, 147767, 144565, 141754]
54851A41754k802k928k311j201q39j387j642j191j010j474j603r92n93q02o05
54836A20374L71P66k53j331r22L86R88N20l14j110j672j491n13L31L87J52J29
54819A16798r6p00q25N2J042J300J293J514J243l2j169r55p4P2l67k75L33N06
54801A19660J39m2Q9P3k4J61K92j02m67N2J070J461J149J059J430J513R49K50
54783A28712j35k65j17M64J202J548J451J300J234J153J251J719K139J906J205
54768A44767Q66J288K141K921L388L601L916M694N680O140N925N688N557M467
54754B01039J705j650l821m415m459m785n300n607n418m579l382k565k451k450
54740A51862k028j601j743k125k107j888k054k420k313j666r10r2R36J772J894
$$ y = [141754, 138952, 136024, 133713, 132512, 131673, 130286, 128644, 127453, 126443, 124969, 123366, 122374, 121781, 120979, 120374, 120745, 121511, 121258, 119927, 119005, 119391, 120379, 120899, 120585, 119475, 117803, 116312, 115799, 116130, 116517, 116669, 116798, 116702, 116002, 115177, 115229, 116271, 117571, 118864, 120378, 121621, 121589, 120420, 119465, 119391, 119463, 119096, 118821, 119154, 119660, 119799, 119757, 119846, 119919, 119895, 120056, 120348, 120246, 119779, 119831, 120901, 122362, 123511, 124570, 126000, 127513, 128462, 128712, 128577, 128312, 128195, 128659, 129861, 131409, 132860, 134160, 135394, 136547, 137798, 139517, 141656, 143562, 144767, 145633, 146921, 149062, 151983, 155371, 158972, 162888, 167582, 173262, 179402, 185327, 191015, 196572, 201039, 202744, 201094, 197273, 192858, 188399, 183614, 178314, 172707, 167289, 162710, 159328, 156763, 154312, 151862, 149834, 148233, 146490, 144365, 142258, 140370, 138316, 135896, 133583, 131917, 131007, 130915, 131851, 133623, 135517]
54725A35517J644J899K756L487L670L660L913M542N442O298O602O143N246M115
54711A94934K368j45k644m191m821n157n343n126m647m346m268m138l874l417
54697A45185k507j194k11j15m45m00P5M79N48K77l84j199j525j177q25r24r73
54680A34685n87l74q35j282r47m19p11j556j902j594j189o46M54J684K104J636
54664A28521R27J75p22j243p96J01M64L84N87Q13J96j002j616j458j381j441o93
54647A21816R01K020J934J428J279J129M97k70p04r22j043q02k06K30L13M10O31
54630A28641N97K67P5R3o8k95oO47P39Q2l48K3M79K41m23r01j114j121o91M9M07
54609A27373J62L3M63P24oj332k117j791o16Q32J835J772Q35J41N06J426J723
$$ y = [135517, 137161, 139060, 141816, 145303, 148973, 152633, 156546, 161088, 166530, 172828, 179430, 185573, 190819, 194934, 197302, 197157, 194513, 190322, 185501, 180344, 175001, 169875, 165228, 160882, 156614, 152476, 148602, 145185, 142678, 141484, 141273, 141158, 140713, 140313, 140388, 140867, 141415, 141692, 141308, 140109, 138584, 137407, 136582, 135658, 134685, 134098, 133724, 132889, 131607, 130660, 130241, 129530, 127974, 126072, 124478, 123289, 122643, 123097, 124781, 126885, 128521, 129448, 129623, 128901, 127658, 126862, 126963, 127427, 127811, 128398, 129211, 129407, 128405, 126789, 125331, 123950, 122509, 121816, 122717, 124737, 126671, 128099, 129378, 130507, 131004, 130734, 130030, 129108, 128065, 127263, 127057, 127287, 127600, 128010, 128641, 129238, 129505, 129580, 129673, 129605, 129310, 129304, 129951, 130690, 130772, 130424, 130447, 130926, 131167, 130744, 129843, 128729, 127608, 126917, 126966, 127373, 127535, 127568, 128031, 128755, 128749, 127417, 125300, 123509, 122893, 123725, 125560, 127332, 128167, 128308, 128814, 130240, 131963]
54592A31963R44l23j178j125l57L26K38l19l95K53P41L79k74k31M81R17N25k38
54574A32327o24n16m71r69j715j880j148k53j4k31o7O33J249J491J715J960J670
54557A33157P54Q5L76J175J531J208O84L06O0j27k52l92n68o13l51J66P27J126
54539A39052J260J217J242J361J210O03K0O8N64Q13O33M72M51J32o07j206j265
54522A46020j091j061r91n72oJ64l42j269j955j748p27J31l7q20j041l54M02N34
54504A35237L34K78K19j45n43m63J13P59J106J050P04L26N7k57p32j030p59k05
54486A36049rj63k6N90J128J252J296J458J333O91L0j31L0Q8Q0K06L40L06L23
54467A44871O39J021J011N89K14L29R85J785K093J554M88m69j073j497j813j882
$$ y = [131963, 132907, 132584, 131406, 130281, 129924, 130250, 130488, 130169, 129774, 130027, 130768, 131147, 130873, 130642, 131123, 132040, 132565, 132327, 131703, 131187, 130716, 129747, 128032, 126152, 125004, 124751, 124737, 124506, 124439, 125072, 126321, 127812, 129527, 131487, 133157, 133911, 133996, 134372, 135547, 137078, 138286, 138970, 139276, 139336, 139209, 138957, 138565, 137997, 137384, 137033, 137199, 137926, 139052, 140312, 141529, 142771, 144132, 145342, 145945, 145965, 146033, 146597, 147410, 148043, 148515, 148966, 149098, 148491, 147285, 146020, 144929, 143868, 142877, 142305, 142299, 142463, 142121, 140852, 138897, 137149, 136422, 136553, 136516, 135696, 134655, 134301, 134703, 135237, 135571, 135849, 136068, 135923, 135380, 134917, 135030, 135789, 136895, 137945, 138649, 138975, 139032, 138775, 138043, 137013, 136254, 136049, 136040, 135877, 135851, 136441, 137569, 138821, 140117, 141575, 142908, 143599, 143629, 143498, 143528, 143616, 143696, 143902, 144242, 144548, 144871, 145510, 146531, 147542, 148131, 148345, 148674, 149659, 151444, 153537, 155091, 155579, 155110, 154037, 152540, 150727, 148845]
54451A48845j740j549j133k19Q21J148N72j33k73QK48L35L28J69j12l50n96j097
54433A45272j641j581p24K92Q11Q71P52M62L2j52K19Q32J142R93O42L48J62M7
54415A48779j2Q2M59R75J210J044Q95J008R03J41p49r17m44o4J01M70Q62O71J55
54396A55569L31J302J934J590R66P18M59k16p44m12N64J446J766J264j14j626
54380A64797k003r56L12O45K57p5j86k75j94J86N55P17R25J196J049N52O45J718
54362A69865K724K596J742J255J364J601J835K124K186J939K005K741L318K781
54348B00076J436J53j095k781m388m849m220l636l621l559k997k330k013j817
54334A64359j297l69O43J193Q16k99j239j352j029r50j037q09m07l64o28o91n58
$$ y = [148845, 147105, 145556, 144423, 144204, 145025, 146173, 146745, 146612, 146339, 146347, 146595, 146930, 147258, 147427, 147315, 146965, 146369, 145272, 143631, 142050, 141326, 141618, 142429, 143300, 144052, 144514, 144546, 144394, 144613, 145445, 146587, 147580, 148222, 148570, 148732, 148779, 148767, 148849, 149308, 150283, 151493, 152537, 153432, 154440, 155343, 155484, 154735, 153818, 153374, 153310, 153411, 153881, 154743, 155414, 155569, 155900, 157202, 159136, 160726, 161692, 162410, 162869, 162653, 161909, 161497, 162061, 163507, 165273, 166537, 166423, 164797, 162794, 161838, 162150, 162795, 163052, 162977, 162791, 162516, 162322, 162508, 163063, 163780, 164705, 165901, 166950, 167502, 168147, 169865, 172589, 175185, 176927, 178182, 179546, 181147, 182982, 185106, 187292, 189231, 191236, 193977, 197295, 200076, 201512, 201665, 200570, 197789, 193401, 188552, 184332, 180696, 177075, 173516, 170519, 168189, 166176, 164359, 163062, 162693, 163336, 164529, 165345, 165046, 163807, 162455, 161426, 160476, 159439, 158630, 158223, 157859, 157231, 156540, 155982]
54317A55982o72r34p10J73J128J607J499Q21k88j208j284o98k57k12p3L38M12
54300A55624k23q98o90K59Q39L46n92p61J01R54P69j74p78o03q5M94J223J698
54282A57503J131j90p63N5R28M38p79j075j85P25R72R59R77P11O8n31q21q86o85
54263A58552j21M55O07O05J065J825K032J386N30J01J07L37O88R35P36P9o44j060
54245A68215j016n89j88l10q43j021n29j13m07q33n17K61N50K20j47m03p65q57
54227A60708j32Q97J148O38L88O31N02l38j032q92k62L79J061J706J789J167L69
54210A68727k57q15j089o11K10J67j008k119k237j859j691j337k33J047J468R90
54194A59353L99J41J64M85J089J514J264M98k09n58n90l99k33m97j152j530j165
$$ y = [155982, 155310, 154376, 153666, 153839, 154967, 156574, 158073, 158894, 158606, 157398, 156114, 155416, 155159, 154947, 154874, 155212, 155624, 155401, 154503, 153813, 154072, 154911, 155257, 154665, 153904, 154005, 154959, 155728, 155554, 154776, 154173, 154088, 154582, 155805, 157503, 158634, 158444, 157681, 157736, 158664, 159102, 158323, 157248, 157063, 157788, 158760, 159719, 160696, 161407, 161475, 160944, 160123, 159237, 158552, 158431, 158886, 159493, 160098, 161163, 162988, 165020, 166406, 166936, 167037, 167144, 167481, 168169, 169104, 169840, 169919, 169275, 168215, 167199, 166610, 166422, 166112, 165269, 164248, 163719, 163606, 163199, 162366, 161849, 162110, 162660, 162880, 162733, 162330, 161565, 160708, 160576, 161473, 162621, 163259, 163647, 164278, 164780, 164442, 163410, 162518, 162256, 162635, 163696, 165402, 167191, 168358, 168727, 168470, 167655, 166566, 165955, 166165, 166332, 165324, 163205, 160968, 159109, 157418, 156081, 155848, 156895, 158363, 159353, 159752, 159893, 160057, 160542, 161631, 163145, 164409, 164907, 164698, 164140, 163550, 163151, 162918, 162421, 161269, 159739, 158574]
54177A58574l97L37J234K441L220K671J068l62r57j124j354j526j376j052q50
54162A60547p67o26l77m2L99Q78J097P99J65k14J3M35K61o50j430j183j30O26
54144A59801M47k01m87j60L84O75N30P9k89j82M20J066J288J061P94Q34J048R21
54126A68029K00o76j027q05n96o13l47M76J161R83L77L63J000J350J008P08J124
54109A72715J795J765Q85J1j2O44Q97m3j576k210j395k73j20o30n24N10J592K098
54091A76129K280K365K075J357P45O40Q82J268J820K432K867L288M061N019N620
54076B12848N888O262O399N221K570k12j829k385k722l264m006m860n417n086
54062B09407l975k968k477j959j128o26q33r83m14K25Q8l28J2Q81J145O20K89
$$ y = [158574, 158177, 158514, 159748, 162189, 165409, 168080, 169148, 168786, 167829, 166705, 165351, 163825, 162449, 161397, 160547, 159780, 159154, 158777, 158735, 159134, 160012, 161109, 161908, 162073, 161859, 161872, 162307, 162568, 161918, 160488, 159305, 159175, 159801, 160248, 160047, 159560, 159400, 159784, 160459, 160989, 161068, 160779, 160597, 161017, 162083, 163371, 164432, 165226, 166060, 167108, 168029, 168229, 167553, 166526, 165721, 165125, 164512, 164165, 164641, 165802, 166785, 167162, 167525, 168525, 169875, 170883, 171591, 172715, 174510, 176275, 177160, 177171, 177159, 177803, 178700, 178657, 177081, 174871, 173476, 173203, 173083, 172453, 171929, 172439, 174031, 176129, 178409, 180774, 182849, 184206, 184951, 185591, 186473, 187741, 189561, 191993, 194860, 198148, 202209, 207228, 212848, 218736, 224998, 231397, 236618, 239188, 238976, 237147, 234762, 232040, 228776, 224770, 219910, 214493, 209407, 205432, 202464, 199987, 198028, 196900, 196274, 195441, 194458, 194044, 194269, 194357, 194029, 194041, 194922, 196067, 196687, 196976]
54045A96976P27J475K076K659L327L817M073M432N038N623O005O224O178N731
54031B54361N296N565O438O923O375N322M709M809N197N391N101M238L134K491
54017C25350K651L026K641J209p22k553m127n409o195o480o732p363q081q171
54003B79044p414o285n226m223l235k518k269k303k448k850l481l746l156k114
53989B27776j463j442j628j687j575j229o95m21q09j488j744j488j146p68j10
53974B10083M59J50r62j781j566p08J02N93N95n0q94j068n17j72m16k85J051K842
53956B07456L629L026J918J212J136J410J622J566J547J954K475K431K102K686
53942B36170M465O046O270N927O507Q027R406J0471J2161J4846J7578J9143J8852
$$ y = [196976, 197703, 199178, 201254, 203913, 207240, 211057, 215130, 219562, 224600, 230223, 236228, 242452, 248630, 254361, 259657, 265222, 271660, 278583, 284958, 290280, 294989, 299798, 304995, 310386, 315487, 319725, 322859, 325350, 328001, 331027, 333668, 334877, 334155, 331602, 327475, 322066, 315871, 309391, 302659, 295296, 287215, 279044, 271630, 265345, 260119, 255896, 252661, 250143, 247874, 245571, 243123, 240273, 236792, 233046, 229890, 227776, 226313, 224871, 223243, 221556, 219981, 218752, 218057, 217636, 216827, 215339, 213595, 212107, 210961, 210193, 210083, 210542, 210692, 209730, 207949, 206383, 205675, 205777, 206370, 206965, 206915, 206021, 204953, 204436, 204264, 203848, 203563, 204614, 207456, 211085, 214111, 216029, 217241, 218377, 219787, 221409, 222975, 224522, 226476, 228951, 231382, 233484, 236170, 240635, 246681, 252951, 258878, 265385, 273412, 282818, 293289, 305450, 320296, 337874, 357017, 375869]
53929C75869J6311J1388M837j719o762r618j0356r568q142o678n035k854n01J128
53915C48300J662J682J963K804M014N248O170O598O527N879M456K419N08n46p66
53900C96918p48j002j654k515l097k921k195j853k517l732m683n221n726o284
53886C52770o729p101p452p350o329m737l547l323l829m532n010m996m487l823
53872B79525l353l096l003l195l626l895l789l602l484l037k135j559j982k771
53858B36998k718j705p46m98o50p87r63j313j682j835j548o96L78P86O7j066j594
53841B20428j532j541j619j169k41L88M41M60O98P08K12l75n79l28L07J097J373
53824B18728O10n86r92m15J06J3L0Q12J793K089J749J359J078P63N77P96J346
$$ y = [375869, 392180, 403568, 408405, 406686, 399924, 390306, 379950, 370382, 362240, 355562, 350527, 347673, 347172, 348300, 349962, 351644, 353607, 356411, 360425, 365673, 371843, 378441, 384968, 390847, 395303, 397722, 398230, 397684, 396918, 396170, 395168, 393514, 390999, 387902, 384981, 382786, 380933, 378416, 374684, 370001, 364780, 359054, 352770, 346041, 338940, 331488, 324138, 317809, 313072, 309525, 306202, 302373, 297841, 292831, 287835, 283348, 279525, 276172, 273076, 270073, 266878, 263252, 259357, 255568, 251966, 248482, 245445, 243310, 241751, 239769, 236998, 234280, 232575, 231829, 231331, 230681, 229894, 228931, 227618, 225936, 224101, 222553, 221857, 222235, 223021, 223088, 222022, 220428, 218896, 217355, 215736, 214567, 214326, 214714, 215155, 215615, 216313, 217021, 217233, 216858, 216279, 215951, 216258, 217355, 218728, 219338, 218752, 217760, 217345, 217451, 217464, 217494, 218306, 220099, 222188, 223937, 225296, 226374, 227137, 227714, 228510, 229856]
53807B29856K048K880L658L918L659L620M235M833M584L836L661M295M824M457
53793B84364L449K581K220K107J788J119M74M60J287K400K908K305P36j206k802
53778C04190l572l638l647m099m773n081m873m577m478m263l511k462j873k096
53764B51247k627k751k392j997j844j854k067k670l445l676k930j616m70K27O31
53749B21766Q76R13O40jq52j442j426j095q87m80P36K201K370R61k66J21J204
53732B25339J310N70K82N03J56p38r21m3P93R67J095J446J235K47l72J27Q51Q52
53714B33699P49J588K970L621L217K477J903J471J307J625K110K206J952J931
53700B62826K419L045L236K668J626J105K044M001N170M391K597J637K109L093
$$ y = [229856, 231904, 234784, 238442, 242360, 246019, 249639, 253874, 258707, 263291, 267127, 270788, 275083, 279907, 284364, 287813, 290394, 292614, 294721, 296509, 297628, 298102, 298562, 299849, 302249, 305157, 307462, 308198, 306992, 304190, 300618, 296980, 293333, 289234, 284461, 279380, 274507, 269930, 265452, 261189, 257678, 255216, 253343, 251247, 248620, 245869, 243477, 241480, 239636, 237782, 235715, 233045, 229600, 225924, 222994, 221378, 220908, 221135, 221766, 222642, 223555, 224195, 224194, 223342, 221900, 220474, 219379, 218492, 218012, 218748, 220949, 223319, 224280, 224014, 224135, 225339, 226649, 227219, 227501, 228004, 228160, 227422, 226501, 226458, 227251, 228218, 229313, 230759, 231994, 232241, 231869, 231996, 232847, 233699, 234448, 236036, 239006, 242627, 245844, 248321, 250224, 251695, 253002, 254627, 256737, 258943, 260895, 262826, 265245, 268290, 271526, 274194, 275820, 276925, 278969, 282970, 288140, 292531, 295128, 296765, 298874, 301967]
53686C01967L561L117J697m23k309k984k529j927j780j834j754j583j271n32M62
53671B91878Q79K19q76j411j328j437k049k360j508J64J469J827J725J560Q98
53656B89650n38j770j571l18L03m07j274j124m02j46k69Q4R58J513J375J077J122
53639B88263J419J776K240K723K845K377J529P00K17L04R10J554J763J666J812
53624C12098K321K707K580K182J995K215K741L436M119M555M679M708M923N437
53610C60696O250P258Q092Q180P274N834M630L972L559L072K566K118J438K46
53596D25185j117j897j893j726j944k259k067j409r22r34j146j172r29m82N6L14
53580D05658k13j518k871l438l015k036j102n99o05r50j383j651j451n38Q45J915
$$ y = [301967, 305528, 308645, 310342, 309919, 307610, 304626, 302097, 300170, 298390, 296556, 294802, 293219, 291948, 291416, 291878, 292757, 292976, 292100, 290689, 289361, 287924, 285875, 283515, 282007, 282171, 283640, 285467, 287192, 288752, 289650, 289112, 287342, 285771, 285453, 285756, 285349, 284075, 282951, 282549, 282403, 282134, 282218, 283176, 284689, 286064, 287141, 288263, 289682, 291458, 293698, 296421, 299266, 301643, 303172, 303872, 304089, 304393, 305303, 306857, 308620, 310286, 312098, 314419, 317126, 319706, 321888, 323883, 326098, 328839, 332275, 336394, 340949, 345628, 350336, 355259, 360696, 366946, 374204, 382296, 390476, 397750, 403584, 408214, 412186, 415745, 418817, 421383, 423501, 424939, 425185, 424068, 422171, 420278, 418552, 416608, 414349, 412282, 410873, 409951, 409017, 407871, 406699, 405770, 405288, 405344, 405658, 405445, 403927, 401056, 397618, 394603, 392567, 391465, 390866, 390261, 389311, 387928, 386277, 384826, 384288, 385133, 387048]
53564C87048K101J701J385J231P59j20q09p95k22L99P25P20P03J164K150K939
53548D01079K856K281K134K432K273J340N07N45J129J647K168K966L732M073M362
53533D35524N308O877Q289Q941Q894Q548Q329Q574R368J0490J1587J2365J2633
53520E55727J2550J2759J3773J5149J5880J5759J5642J6249J7429J8919K0822
53509G30658K2848K4013K3914K3562K4106K5282K6011K5992K5741K5476K5018
53498A002621K4467K4056K3451K2102K0243J8678J7686J6975J6643J7226J8628
53487A222776J9850K0100J9574J8911J8411J8045J7786J7598J7412J7195J6901
53476A424559J6298J5141J3416J1268Q811O288M081K215Q5k752n838q382j0329
$$ y = [387048, 389149, 390850, 392235, 393466, 394225, 394105, 393296, 392501, 392279, 392678, 393403, 394123, 394826, 395990, 398140, 401079, 403935, 406216, 408350, 410782, 413055, 414395, 414902, 415447, 416576, 418223, 420391, 423357, 427089, 431162, 435524, 440832, 447709, 455998, 464939, 473833, 482381, 490710, 499284, 508652, 519142, 530729, 543094, 555727, 568277, 581036, 594809, 609958, 625838, 641597, 657239, 673488, 690917, 709836, 730658, 753506, 777519, 801433, 824995, 849101, 874383, 900394, 926386, 952127, 977603, 1002621, 1027088, 1051144, 1074595, 1096697, 1116940, 1135618, 1153304, 1170279, 1186922, 1204148, 1222776, 1242626, 1262726, 1282300, 1301211, 1319622, 1337667, 1355453, 1373051, 1390463, 1407658, 1424559, 1440857, 1455998, 1469414, 1480682, 1489493, 1495781, 1499862, 1502077, 1502162, 1499410, 1493572, 1485190, 1474861]
53463A474861j2208j4072j5307j5544j5119j4586j4355j4846j6316j8352k0012
53452A304144k0706k0678k0488k0435k0460k0326j9846j9248j9072j9362j9244
53441A084279j7872j5632j3610j2019r982p067m124k221j358p45R5R89J581J805
53427A004119K008K832M657P016Q909R943J0803J2297J4205J5598J6158J6632
53415A125177J7820J9551K1038K2058K3233K5074K7248K9166L0859L2681L4410
53404A408315L5517L6287L7725M0095M2443M4065M5571M7762N0270N2170N3437
53393A893657N4669N5772N6048N5510N5065N5283N5794N6022N5672N4465N2254
53382B500211M9598M7448M5906M4008M1018L7280L3371K9127K4028J8259J2760
$$ y = [1474861, 1462653, 1448581, 1433274, 1417730, 1402611, 1388025, 1373670, 1358824, 1342508, 1324156, 1304144, 1283438, 1262760, 1242272, 1221837, 1201377, 1181051, 1161205, 1141957, 1122885, 1103523, 1084279, 1066407, 1050775, 1037165, 1025146, 1015164, 1008097, 1003973, 1001752, 1000394, 999649, 999744, 1000733, 1002314, 1004119, 1006127, 1008959, 1013616, 1020632, 1029541, 1039484, 1050287, 1062584, 1076789, 1092387, 1108545, 1125177, 1142997, 1162548, 1183586, 1205644, 1228877, 1253951, 1281199, 1310365, 1341224, 1373905, 1408315, 1443832, 1480119, 1517844, 1557939, 1600382, 1644447, 1690018, 1737780, 1788050, 1840220, 1893657, 1948326, 2004098, 2060146, 2115656, 2170721, 2226004, 2281798, 2337820, 2393492, 2447957, 2500211, 2549809, 2597257, 2643163, 2687171, 2728189, 2765469, 2798840, 2827967, 2851995, 2870254, 2883014]
53371B883014Q292M685R65l918j0291j7580k4925l1915l8496m4444m9288n2784
53359B623315n5030n6183n6425n6175n5969n5938n5691n4775n3022n0589m7871
53348B025647m5323m3201m1607m0812m1070m1888m2055m0940l9221l7768l6389
53337A575373l4425l2007k9725k7459k4703k1770j9466j7634j5276j2342j0139
53326A330427r647j0453j1702j3054j4225j4575j3882j2804j2037j1538j0969
53315A195541j0281r428q177o576n021l572j873k9J289J975K896M590O486P963
53301A175783R376J1170J2829J3665J4097J5131J6936J8900K0816K3050K5569
53290A357322K7740K9214L0232L0907L0734K9232K6724K4231K2565K1535K0069
$$ y = [2883014, 2891306, 2895991, 2896956, 2893038, 2882747, 2865167, 2840242, 2808327, 2769831, 2725387, 2676099, 2623315, 2568285, 2512102, 2455677, 2399502, 2343533, 2287595, 2231904, 2177129, 2124107, 2073518, 2025647, 1980324, 1937123, 1895516, 1854704, 1813634, 1771746, 1729691, 1688751, 1649530, 1611762, 1575373, 1540948, 1508941, 1479216, 1451757, 1427054, 1405284, 1385818, 1368184, 1352908, 1340566, 1330427, 1320780, 1310327, 1298625, 1285571, 1271346, 1256771, 1242889, 1230085, 1218048, 1206510, 1195541, 1185260, 1175832, 1167655, 1161079, 1156058, 1152486, 1150613, 1150584, 1151873, 1153848, 1156744, 1161334, 1167820, 1175783, 1185159, 1196329, 1209158, 1222823, 1236920, 1252051, 1268987, 1287887, 1308703, 1331753, 1357322, 1385062, 1414276, 1444508, 1475415, 1506149, 1535381, 1562105, 1586336, 1608901, 1630436, 1650505]
53279A650505J7307J3523R759O579L651N53k621n686q751j1809j4473j6569j8465
53266A623503k0430k2209k3694k5418k7665k9617l0234k9739k9414k9973l0842
53255A324268l1055l0324k9137k8214k7919k7990k7808k7115k6261k5622k5176
53244A017647k4921k5088k5489k5230k3849k2317k1949k2496k2357k0756j8741
53233G64454j7630j7238j6308j4222j1602r380p846o790o197o351p345q735r866
53220F24944j0456j0665j0839j1366j2557j4198j5376j5308j4325j3406j2649
53209D83799j1132q583o343n846o783p622p586p206p048o920o522o134o200o652
53195C83222p004o956o699o620o803o831o230n164m396m354m582m376l695l042
$$ y = [1650505, 1667812, 1681335, 1691094, 1697673, 1701324, 1701877, 1699256, 1693570, 1684819, 1673010, 1658537, 1641968, 1623503, 1603073, 1580864, 1557170, 1531752, 1504087, 1474470, 1444236, 1414497, 1385083, 1355110, 1324268, 1293213, 1262889, 1233752, 1205538, 1177619, 1149629, 1121821, 1094706, 1068445, 1042823, 1017647, 992726, 967638, 942149, 916919, 893070, 870753, 848804, 826308, 803951, 783195, 764454, 746824, 729586, 713278, 699056, 687454, 678074, 670228, 663438, 657241, 650890, 643545, 634810, 624944, 614488, 603823, 592984, 581618, 569061, 554863, 539487, 524179, 509854, 496448, 483799, 472667, 464084, 457741, 451895, 445112, 437490, 429904, 422698, 415650, 408730, 402208, 396074, 389874, 383222, 376218, 369262, 362563, 355943, 349140, 342309, 336079, 330915, 326519, 322165, 317583, 313207, 309512, 306470]
53181C06470k674k379k008j721j673j792j921j900j587j042o93r43j582j922j591
53166B81042j015q69j231j487j171o66p80j585k087j430j42M12k99j433j987j852
53150B63420j434q87k53J47Nm78p79o22j59K12O3o78j415j398o50N5L41P17J528
53131B57735K150J821P74q8k68J08P58J301J223M13m34n64j7P12J442K132K335
53114B71533J688O97K58M70N94J79m58q57r24q11p36r31j358j637j583j541j780
53097B62803j967j779j608j860k039j443m25P7P7M58J314J634Q45l53j129j468
53081B53137j587j273m25M44Q07P22M31j17q75j347j098l06N69J237J503J104
53065B52926Q8j039j791k062j871j271o07l83n92o34k09L14N94P95R54O16l56
$$ y = [306470, 303796, 301417, 299409, 297688, 296015, 294223, 292302, 290402, 288815, 287773, 287080, 286137, 284555, 282633, 281042, 280027, 279158, 277927, 276440, 275269, 274603, 273823, 272238, 270151, 268721, 268579, 268991, 268692, 267259, 265272, 263420, 261986, 261099, 260846, 260993, 260998, 260520, 259741, 259119, 258960, 259172, 259235, 258557, 257142, 255744, 255094, 255149, 255490, 256207, 257735, 259885, 261706, 262480, 262392, 262124, 262232, 262990, 264291, 265514, 265927, 265493, 264929, 264912, 265624, 267066, 269198, 271533, 273221, 273918, 274176, 274646, 275240, 275419, 274961, 274104, 273180, 272369, 271633, 270702, 269344, 267707, 266124, 264583, 262803, 260836, 259057, 257449, 255589, 253550, 252107, 251682, 251759, 251836, 252294, 253608, 255242, 256087, 255734, 254605, 253137, 251550, 250277, 249852, 250296, 251103, 251825, 252256, 252139, 251264, 249917, 248819, 248513, 249082, 250319, 251822, 252926, 253014, 251975, 250184, 248122, 246251, 244980, 244373, 243990, 243398, 242764, 242555, 242869, 243463, 244258, 245212, 245828, 245472]
53048B45472j180j029j55N49Q00J053J572J992J808Q26p18k152k608j805m68M35
53032B44392P01P34O17J05n89p40j36M81M15j2L9O75J087O16m46j239j251o74
53014B44775L0N91R52J081Q83L69j92l49J08Q10J057O02K6L1M29L02p17j791j828
52995B47169p46O00J435J575J174N01m8j62Q0M19Q37J415J902J883J370P98M46
52978B60648K40J83M10P44P21L28K48J036K314L080K734J599N58K56N36N98q0
52961B76153j037j310o09L49P56N37J04l30q61j469j856j763j385j235j572j951
52945B62521j670o99J60K96mk17m69j031j410r03M6J64q12j608j185o7O31O95
52927B54438N31J83m95j005p00M8Q4r12j854j669p20k32n99q48jJ482K050R19
$$ y = [245472, 244292, 243263, 243108, 243657, 244457, 245510, 247082, 249074, 250882, 251708, 250990, 248838, 246230, 244425, 243957, 244392, 245093, 245827, 246444, 246549, 245960, 245220, 245084, 245565, 245980, 245968, 246007, 246682, 247769, 248385, 247939, 246700, 245449, 244775, 244805, 245396, 246348, 247429, 248312, 248681, 248489, 248140, 248248, 249058, 250115, 250717, 250743, 250774, 251203, 251505, 250788, 248997, 247169, 246423, 247023, 248458, 250033, 251207, 251708, 251660, 251498, 251578, 251997, 252834, 254249, 256151, 258034, 259404, 260202, 260648, 260888, 261071, 261481, 262225, 262946, 263274, 263522, 264558, 266872, 269952, 272686, 274285, 274843, 275099, 275635, 276233, 276153, 275116, 273806, 273197, 273546, 274302, 274839, 274943, 274613, 273752, 272283, 270427, 268664, 267279, 266044, 264472, 262521, 260851, 260152, 260312, 260608, 260604, 260387, 259918, 258887, 257477, 256574, 256620, 256784, 255972, 254364, 253179, 253112, 253743, 254438, 254969, 255152, 254657, 253652, 252952, 253000, 253084, 252172, 250318, 248649, 247929, 247697, 247098, 246250, 246249, 247731, 249781, 250700]
52909B50700q75j636r82q6j9n25p40n73o78j344j976j819p84N83J717K411K695
52892B46069K556J977J205P05O77Q04P34O08P50R94Q10J09n99r19r85r90q30m26
52874B53249j9K15M20O59O69M00M00J200K466L300L263K718K123J440M62n04p17
52857B71744Q6J025Q39n27j638j308k50k04j636l283l983l946l812l503k776k067
52841B44761j900j893j369n85m39j033j476j195o45m59n26l23K52P91R05O38M22
52824B35926O31J118J239N77n08j278j428j147n55L52J151J022k13j480j407J36
52808B34136J916K766K817K989L542L660K560N66j279k387k934l186l103k699
52794B39364k282k069j916j641j276q99n37l74o32r93p27K56J062R42L49K06N92
$$ y = [250700, 249825, 248189, 247207, 247121, 247102, 246577, 245837, 245264, 244586, 243242, 241266, 239447, 238663, 239246, 240963, 243374, 246069, 248625, 250602, 251807, 252512, 253189, 253993, 254727, 255335, 256085, 257079, 257889, 257998, 257399, 256480, 255495, 254505, 253675, 253249, 253230, 253445, 253865, 254524, 255193, 255593, 255993, 257193, 259659, 262959, 266222, 268940, 271063, 272503, 272965, 272461, 271744, 271830, 272855, 273694, 273167, 271529, 270221, 269971, 269767, 268131, 264848, 260865, 256919, 253107, 249604, 246828, 244761, 242861, 240968, 239599, 239014, 238575, 237542, 236066, 234871, 234226, 233767, 233241, 232918, 233170, 233961, 234866, 235504, 235926, 236557, 237675, 238914, 239491, 238983, 237705, 236277, 235130, 234575, 234927, 236078, 237100, 236887, 235407, 234000, 234136, 236052, 238818, 241635, 244624, 248166, 251826, 254386, 254952, 253673, 251286, 248352, 245166, 242063, 239364, 237082, 235013, 233097, 231456, 230180, 229281, 228744, 228370, 227738, 226745, 226018, 226274, 227336, 228278, 228627, 228833, 229425]
52777B29425Q86R71J349K054K326J689O93J26l4l92j142j843k093j985j783j462
52761B28785q36J1P40J200J515J639J227L20k47K34J201J334L88l68J15J222J645
52744B40125J218R38J408K099K220J699J107R93J395J788J554P02m2j30J57K60
52728B57491K25M65R17J115J024J070J317J260N89l88j224j813k182k323k327
52713B55216k307k075j368m96j48m18o15l16J0j32m24l01O7Q6k51l72p3J84N4
52694B46321j95j88K1J26R0J32L35N28N31M11L86N36P00O74M60K51J67J62J62
52675B51610J50J01p7l77o45p47o90n14k27Q3K66L73O65J187J542J388R69Q63
52657B55920J189J478J366J018P84P75R92J501K191K528J982O10r60k114k613
$$ y = [229425, 230311, 231282, 232631, 234685, 237011, 238700, 239393, 239519, 239485, 239093, 237951, 236108, 234015, 232030, 230247, 228785, 227949, 227960, 228700, 229900, 231415, 233054, 234281, 234601, 234354, 234588, 235789, 237123, 237511, 237143, 237258, 238480, 240125, 241343, 242281, 243689, 245788, 248008, 249707, 250814, 251807, 253202, 254990, 256544, 257246, 257204, 257074, 257231, 257491, 257716, 258181, 259098, 260213, 261237, 262307, 263624, 264884, 265473, 265085, 263861, 262048, 259866, 257543, 255216, 252909, 250834, 249466, 248970, 248822, 248404, 247789, 247473, 247483, 247351, 246927, 246626, 246693, 246779, 246528, 246156, 246083, 246267, 246321, 246126, 245938, 245959, 246085, 246175, 246307, 246642, 247170, 247701, 248112, 248498, 249034, 249734, 250408, 250868, 251119, 251286, 251448, 251610, 251760, 251861, 251784, 251407, 250762, 250015, 249325, 248811, 248584, 248667, 248933, 249306, 249971, 251158, 252700, 254088, 255057, 255920, 257109, 258587, 259953, 260971, 261755, 262530, 263522, 265023, 267214, 269742, 271724, 272334, 271374, 269260, 266647]
52642B66647k515k062j525r53j97N98P71o3j179j380n13L23L30J5K33R54J605
52625B61089K108K720L165K799J611K67q65k007l203l963l914l226k143o75R63
52610B54726K070K111J346N53K66M66P38O49J83j26J69P20Q06M02K05M63N35P
52592B66289n06k48N24R11N63j19o44p52k60P21J504J353L60n49n64L30J483K147
52574B72543J948J143L75N2N4Q9J02J09o6n60j203j720j968j787r55L13J180R74
52556B70623L1p20q39o66p03j092j625j921j675j010m59l68m64l28m4nk80n33
52538B57922m75p7M77Q18O48J86P8M85P60L50l03l65L06J161J768J975J637Q20
52520B68171Q8r3lq0k2P20J722J906J108M03O75J677K765L739M551M848M403L564
$$ y = [266647, 264132, 262070, 260545, 259592, 259395, 259993, 260764, 260701, 259522, 258142, 257629, 257952, 258282, 258297, 258530, 259484, 261089, 263197, 265917, 269082, 271881, 273492, 273759, 272894, 270887, 267684, 263721, 259807, 256581, 254438, 253763, 254726, 256796, 258907, 260253, 260806, 261072, 261538, 262276, 262925, 263108, 262982, 263151, 263871, 264677, 265079, 265284, 265747, 266282, 266289, 265783, 265535, 266059, 266970, 267533, 267414, 266770, 266018, 265758, 266479, 267983, 269336, 269696, 269147, 268583, 268913, 270396, 272543, 274491, 275634, 276009, 276061, 276115, 276204, 276306, 276415, 276349, 275789, 274586, 272866, 270898, 269111, 268156, 268469, 269649, 270623, 270654, 269934, 269095, 268429, 267726, 266634, 265009, 263088, 261413, 260403, 259944, 259576, 259112, 258784, 258740, 258735, 258455, 257922, 257447, 257370, 257847, 258665, 259313, 259499, 259577, 260062, 260822, 261172, 260869, 260504, 260810, 261971, 263739, 265714, 267351, 268171, 268259, 268166, 268163, 268083, 268061, 268781, 270503, 272409, 273517, 273920, 274595, 276272, 279037, 282776, 287327, 292175, 296578, 300142]
52502C00142K803K071R36p69k647l968m200l534k853k833l190l098k306j350p60
52487B74444n90p01r16q33j32Q50J396J377J344J497J291L78o06p79j21O18Q90
52470B79407Q08P38P89P89O60P40J494K755L591L334K500K146K447K604K138J420
52454C08360P89n2j362k693l451l651l679l635l355k851k338j964j730j532j200
52439B75656o93k98l71q31j291j601j869j895j287j77P36J077J118J037O33O2
52423B70006R4R49J640J252L53K14R35J328P21l4K77J657K998L433L143K892L168
52406B95026L953N186P003R382J1739J3209J3215J1599Q383L765j566o474r846
52393C64574j1015r981p574n216l909l505l220k708k128j428l79O65R11K21n86
$$ y = [300142, 302945, 305016, 305952, 305183, 302536, 298568, 294368, 290834, 287981, 285148, 281958, 278860, 276554, 275204, 274444, 273854, 273153, 272237, 271404, 271272, 272122, 273518, 274895, 276239, 277736, 279027, 279405, 278799, 278020, 277899, 278517, 279407, 280215, 280953, 281742, 282531, 283191, 283931, 285425, 288180, 291771, 295105, 297605, 299751, 302198, 304802, 306940, 308360, 309149, 309097, 307735, 305042, 301591, 297940, 294261, 290626, 287271, 284420, 282082, 280118, 278388, 276856, 275656, 274963, 274665, 274294, 273463, 272172, 270571, 268702, 266807, 265520, 265343, 266079, 267156, 268274, 269311, 269944, 270006, 270100, 271049, 272689, 273941, 274294, 274508, 275443, 276771, 277492, 277458, 277735, 279392, 282390, 285823, 288966, 291858, 295026, 298979, 304165, 311168, 320550, 332289, 345498, 358713, 370312, 378695, 382460, 380894, 374420, 364574, 353559, 343578, 336004, 330788, 326879, 323374, 320154, 317446, 315318, 313890, 313511, 314176, 315087, 315308, 314722]
52378C14722p81m26K15J143K217K934L086L083L251L404L484L933M885N608N325
52363C56083M185K813J464J53q12j130j065j064j117j027r76j153j102j44J573
52348C56681L025L322K503J363Q38J303K205K626K412K379L064L853L952L693
52334C93219M100N336O486O883O899P277Q226R415J0528J1551J2648J3827J4843
52321E11238J5567J6333J7553J8847J9230J8390J7194J6577J6499J6510J6621
52310G00559J6989J7233J6954J6506J6501J6798J6755J6230J5545J4793J3938
52299H78801J3319J3162J2851J1688J0128R136Q446O759L807Q00j503l770o391
52286I57233q215q173p222p257q491r320q668p216o029n036l482j246R57K464
$$ y = [314722, 313941, 313515, 313730, 314873, 317090, 320024, 323110, 326193, 329444, 332848, 336332, 340265, 345150, 350758, 356083, 360268, 363081, 364545, 364698, 363886, 362756, 361691, 360627, 359510, 358483, 357507, 356354, 355252, 355108, 356681, 359706, 363028, 365531, 366894, 367732, 369035, 371240, 373866, 376278, 378657, 381721, 385574, 389526, 393219, 397319, 402655, 409141, 416024, 422923, 430200, 438426, 447841, 458369, 469920, 482568, 496395, 511238, 526805, 543138, 560691, 579538, 598768, 617158, 634352, 650929, 667428, 683938, 700559, 717548, 734781, 751735, 768241, 784742, 801540, 818295, 834525, 850070, 864863, 878801, 892120, 905282, 918133, 929821, 939949, 949085, 957531, 964290, 968097, 968897, 967394, 963624, 957233, 949018, 940845, 933623, 926366, 917875, 908555, 899887, 892671, 886642, 881606, 878124, 876878, 877835, 880299]
52272H80299L260L796M553N778P351Q871R988J0679J1113J1338J1290J1070J0974
52259I90360J1149J1478J1905J2626J3705J4707J5065J4714J4030J3255J2355
52248A135349J1328J0180Q566O034K720o14l464n956q245j0046j1136j1759j2170
52235A110787j2232j1882j1552j1676j2061j2235j2051j1585j0784r699q700q014
52223I78316p415o759o368o288n761m189k178q52l77q5L12O03J018K163L830M947
52207I50917N041M851N085N374M983L931K817J990J498J535K367L795N150N822
52193A005156N715N148M538M093L837L854M251M805M902M149K829J422p3j915
52179A052711l903n548o831q200r714j0774j0851j0044q735p169n573m311l589
$$ y = [880299, 883559, 887355, 891908, 897686, 905037, 913908, 923896, 934575, 945688, 957026, 968316, 979386, 990360, 1001509, 1012987, 1024892, 1037518, 1051223, 1065930, 1080995, 1095709, 1109739, 1122994, 1135349, 1146677, 1156857, 1165423, 1171457, 1174177, 1173563, 1170099, 1164143, 1155898, 1145852, 1134716, 1122957, 1110787, 1098555, 1086673, 1075121, 1063445, 1051384, 1039149, 1027098, 1015513, 1004729, 995030, 986330, 978316, 970901, 964142, 957774, 951486, 945725, 941536, 939358, 938506, 938129, 938044, 938356, 938959, 939977, 942140, 945970, 950917, 955958, 960809, 965894, 971268, 976251, 980182, 982999, 984989, 986487, 988022, 990389, 994184, 999334, 1005156, 1010871, 1016019, 1020557, 1024650, 1028487, 1032341, 1036592, 1041397, 1046299, 1050448, 1053277, 1054699, 1054626, 1052711, 1048808, 1043260, 1036429, 1028229, 1018515, 1007741, 996890, 986846, 978111, 970942, 965369, 961058, 957469]
52166I57469l235k870k188j052M42J922L019L712M196M497M451M040L397K542
52152I80342J441K92m97o76l51R9K37m9k39M04J873L264L867L860L590K799J282
52135A001538l11j146j222q96O8J991M243N928P385R716J2973J6010J8198K0002
52121A094477K1787K3392K5065K7431L0067L1477L1021K9702K8472K7030K5012
52110A394933K3024K1496J9689J6970J4095J2058J0513Q579O509N189M549L781
52098A541385K821K255J944J065m54j726k372l225n216q306j1766j4929j7432
52085A484044j9186k0318k0829k0433j9009j7041j5035j2819r982o904m565l321
52073A314602k506j263P78L596O907J0019J2194J3263J3629J3626J3336J2974
$$ y = [957469, 954234, 951364, 949176, 948124, 948566, 950488, 953507, 957219, 961415, 965912, 970363, 974403, 977800, 980342, 981783, 982075, 981578, 980902, 980551, 980650, 980887, 980838, 980599, 981003, 982876, 986140, 990007, 993867, 997457, 1000256, 1001538, 1001227, 1000081, 998859, 997963, 998031, 1000022, 1004265, 1010193, 1017578, 1027294, 1040267, 1056277, 1074475, 1094477, 1116264, 1139656, 1164721, 1192152, 1222219, 1253696, 1284717, 1314419, 1342891, 1369921, 1394933, 1417957, 1439453, 1459142, 1476112, 1490207, 1502265, 1512778, 1521357, 1527866, 1533055, 1537604, 1541385, 1544206, 1546461, 1548405, 1549470, 1549016, 1547290, 1544918, 1541693, 1536477, 1528171, 1516405, 1501476, 1484044, 1464858, 1444540, 1423711, 1403278, 1384269, 1367228, 1352193, 1339374, 1329392, 1322488, 1317923, 1314602, 1312096, 1310833, 1311611, 1315207, 1322114, 1332133, 1344327, 1357590, 1371219, 1384845, 1398181, 1411155]
52061A411155J2856J2934J2839J2412J1798J1063J0201R462R023Q425P055N254
52049A534477M109L874L337J234k270n981r118j1761j4197j6394j8149j9409k0315
52036A429437k0987k1245k0595j8843j6698j5238j4695j4230j3207j2129j1770
52025A249800j1921j1688j0835j0112j0145j0719j1338j1874j2235j1962j0694
52014A126277q891p483o816o468o145o233p157q601r868j0741j1495j2226j2746
52001A011407j3194j4210j6145j8462k0213k0896k0574j9469j7770j5706j3480
51990H21288j1181r028p582p328q063r007r573r826j0125j0613j1167j1628j1929
51977F94238j2081j2177j2353j2631j2887j3007j2924j2455j1175q766n608k780
$$ y = [1411155, 1424011, 1436945, 1449784, 1462196, 1473994, 1485057, 1495258, 1504720, 1513743, 1522168, 1529223, 1534477, 1538586, 1542460, 1545797, 1547031, 1544761, 1538780, 1529662, 1517901, 1503704, 1487310, 1469161, 1449752, 1429437, 1408450, 1387205, 1366610, 1347767, 1331069, 1315831, 1301136, 1286906, 1273699, 1261570, 1249800, 1237879, 1226191, 1215356, 1205244, 1195099, 1184380, 1173042, 1161168, 1148933, 1136971, 1126277, 1117386, 1109903, 1103087, 1096619, 1090474, 1084241, 1077084, 1068483, 1058615, 1047874, 1036379, 1024153, 1011407, 998213, 984003, 967858, 949396, 929183, 908287, 887713, 868244, 850474, 834768, 821288, 810107, 801079, 793497, 786169, 778106, 769099, 759526, 749700, 739575, 728962, 717795, 706167, 694238, 682157, 669980, 657627, 644996, 632109, 619102, 606178, 593723, 582548, 573782, 568174, 565394]
51965E65394j204p02r3J590M151O625Q426R739J0719J0835R360O368K781n93l679
51950F29717o593q796r360q177o457n545n411m757k676L75L404O122Q809J1392
51936F02047J3386J4673J5629J6326J6241J5016J3062J1021Q894O139K499j562
51924G33371n287q233j0365j1764j2314j1826j0295p865m567l79M242Q072R665
51911F72455Q133L518l200j0206j5573j8443j9315j8812j6783j3181r215o390
51899E52988m605k403P74L721N090M766L143J95l918q123j1198j2847j3387j2908
51885E01288j1432r451p558n830m115k568j314j4J646L399M937O637Q907J1189
51871D95721J2353J2019J0765R146P211M971K666M51j765m114o664r268j1229
$$ y = [565394, 564190, 563488, 563395, 564985, 569136, 575761, 584187, 593926, 604645, 615480, 624840, 631208, 633989, 633396, 629717, 623124, 614328, 604968, 596791, 590334, 584789, 579378, 574621, 571945, 572320, 575724, 581846, 590655, 602047, 615433, 630106, 645735, 662061, 678302, 693318, 706380, 717401, 726295, 732434, 734933, 733371, 728084, 719851, 709486, 697722, 685408, 673582, 663287, 655422, 650855, 650476, 654718, 662790, 672455, 680588, 684106, 680906, 670700, 655127, 636684, 617369, 598557, 581774, 568593, 559378, 552988, 548383, 545980, 546754, 550475, 555565, 560331, 563474, 563669, 559751, 551628, 540430, 527583, 514196, 501288, 489856, 480405, 472847, 467017, 462902, 460334, 459020, 459006, 460652, 464051, 468988, 475625, 484532, 495721, 508074, 520093, 530858, 540004, 547215, 552186, 554852, 555303, 553538, 549424, 542760, 533492, 522263]
51858E22263j1505r802p154m777k769n96J489K628K758K719K827K359Q76r37k205
51843D98174k911l539m195m729n212n760o190o335o420o639o527n324k964l83
51829D31046J345J946K000K174K531K630K232J580R00l6j478l049m020m148l804
51814D31849l266k400j167J48J414K809M258N103M786L547K112Q94j09r09j438
51799D47631j803k192k519k519k127j534q13J8N20n8j828l738m550m165l497l126
51783D13700k668j742p43k54p4L53R13R70M69J07K59N05N04O78J563L048M672
51766D22260O250P734Q864R485R902J0472J0999J0984J0160Q424N547J551k823
51753E19809o537r107j0638j1234j0901r965r010q335p830p362o849o041m677
$$ y = [522263, 510758, 500956, 493802, 489025, 486256, 485660, 487149, 489777, 492535, 495254, 498081, 500440, 501316, 500379, 498174, 495263, 491724, 487529, 482800, 477588, 471828, 465638, 459303, 452883, 446244, 439717, 434393, 431429, 431046, 432391, 434337, 436337, 438511, 441042, 443672, 445904, 447484, 448384, 448348, 446870, 443821, 439801, 435653, 431849, 428583, 426183, 425016, 425164, 426578, 429387, 433645, 438748, 443534, 447081, 449193, 450087, 449978, 449069, 447631, 445828, 443636, 441117, 438598, 436471, 434937, 434124, 434142, 434662, 434604, 432776, 429038, 424488, 420323, 416826, 413700, 411032, 409290, 408547, 408293, 408219, 408572, 409485, 410455, 410924, 411031, 411290, 411795, 412299, 412977, 414540, 417588, 422260, 428510, 436244, 445108, 454593, 464495, 474967, 485966, 496950, 507110, 515534, 521081, 522632, 519809, 513272, 504165, 493527, 482293, 471392, 461427, 452417, 444082, 436252, 428890, 422041, 416000, 411323]
51740D11323k874j037P13K584M571O220P204P870Q918J0482J1630J1005Q171M252
51726D91032R96p05j015j66J836M251N267L448o40m888p491p995o928n063l070
51711D68869j412m78p32k282m232n110m438l229k425j511N30L411N622N984M433
51696D63000J642j252k853k497j001L04J139K090L119L294K053r5k249l832m678
51681D58184n043n484o129o261n256l522j735L17K987N364O036N122M098L679
51667D52357L345L115M011O271Q660J0190J1057J1122R113M511j023n337p906
51654E09486r177q948o895l885j087J796N828J0473J3376J2757Q873L073l406
51641E32264r305j3176j4360j3801j3135j3039j2771j1382r028o799n390m357
$$ y = [411323, 408449, 407412, 408125, 410709, 415280, 421500, 428704, 436574, 445492, 455974, 467604, 478609, 486780, 491032, 492028, 491323, 490308, 490142, 491978, 496229, 501496, 504944, 504304, 499416, 491925, 483930, 477002, 471939, 468869, 467457, 466979, 466247, 463965, 459733, 454623, 450185, 446956, 444531, 443020, 443550, 446961, 452583, 458567, 463000, 464642, 463390, 460537, 458040, 457039, 457343, 458482, 460572, 463691, 466985, 469038, 468943, 466694, 462862, 458184, 453141, 447657, 441528, 435267, 430011, 426489, 424754, 425071, 428058, 433422, 439458, 444580, 448678, 452357, 455702, 458817, 462828, 469099, 477759, 487949, 499006, 510128, 519241, 523752, 522729, 517392, 509486, 500309, 491361, 484466, 480581, 479494, 481290, 487118, 497591, 510967, 523724, 532597, 535670, 532264, 522959, 509783, 495423, 481622, 468487, 455448, 442677, 431295, 422267, 415468, 410078, 405721]
51629D05721l028j639r14o68J40J747K939K613J245R4m53q77j229q65M35J793
51613D07054K021Q74p61j788j953j908k222k656k631k160j676j200l52P85J589
51598C93016J859K100K709L686N210P614J0408J2282J2465J1201Q656M552m87
51585D75271m548o406o892p275p285n919l413r17J239L576O112Q354J0446J2945
51571D75288J5486J6960J7120J6969J7407J8411J9548K0293J9820J7665J4867
51560F69834J3559J5029J8861K4050L0040L6464M2573M7257M9079M6508L9038
51549A032292K8228J6692N880m377j4229k2971l0190l6366m1667m5171m6126m5122
51537G96873m3174m0432l6713l2551k8735k5189k1440j7833j5259j3748j2360
$$ y = [405721, 402693, 401054, 400140, 399472, 399612, 401359, 404298, 406911, 408156, 408250, 407797, 406920, 405691, 404826, 405261, 407054, 409075, 409949, 409188, 407400, 405447, 403539, 401317, 398661, 396030, 393870, 392194, 390994, 390642, 391427, 393016, 394875, 396975, 399684, 403370, 408580, 416194, 426602, 438884, 451349, 462550, 471206, 475758, 475271, 470723, 464317, 457425, 450150, 442865, 436946, 433533, 432616, 433855, 437431, 443543, 451897, 462343, 475288, 490774, 507734, 524854, 541823, 559230, 577641, 597189, 617482, 637302, 654967, 669834, 683393, 698422, 717283, 741333, 771373, 807837, 850410, 897667, 946746, 993254, 1032292, 1060520, 1077212, 1083092, 1078715, 1064486, 1041515, 1011325, 974959, 933292, 888121, 841995, 796873, 753699, 713267, 676554, 644003, 615268, 590079, 568639, 550806, 535547, 521799, 509439]
51526E09439j0490q450o647n047l668k819k460j978r35M05J648K757L513L207
51512D78475J553m41j489j731k481m175n652n854n298n086n258n079m463l913
51498D29108l316k101o41k99j493k916l232k706k310k097j444l88L91O87R13J202
51482D09358J188P35J27n04j313k217k831l046l136l228l097k710k464k678l104
51467C81080l108k290r34L9q3q83j077r5J080J120M2j039j372j063l24P47J669
51450C73509J856J565J725K649L655M223M672N402O350P675J0115J3799J7222
51437D54417J8218J5858J0942N003m11l830m325k396MQ42n42l381o541r344j1386
51422D63128j2114j1125q853o486m842l614k016M6J848K766K915K852K911K933
$$ y = [509439, 498949, 490499, 483852, 478805, 475137, 472318, 469858, 467880, 466945, 467350, 468998, 471755, 475268, 478475, 480028, 479587, 478098, 476367, 473886, 469711, 464059, 458205, 452907, 447821, 442563, 437484, 433021, 429108, 425792, 423691, 423050, 422751, 421258, 418342, 415110, 412404, 410094, 407997, 406553, 406165, 406556, 407243, 408156, 409358, 410546, 411281, 411408, 410904, 409591, 407374, 404543, 401497, 398361, 395133, 392036, 389326, 386862, 384184, 381080, 377972, 375682, 374748, 374787, 374704, 373821, 372744, 372649, 373729, 374849, 374891, 373852, 372480, 371417, 371093, 371840, 373509, 375365, 376930, 378655, 381304, 384959, 389182, 393854, 399256, 405606, 413281, 423396, 437195, 454417, 472635, 488493, 499435, 504438, 504027, 500197, 495872, 493476, 493480, 494322, 493780, 490399, 483858, 474514, 463128, 451014, 439889, 431036, 424550, 419708, 416094, 414078, 414124, 415972, 418738, 421653, 424505, 427416, 430349]
51408D30349K493J495N52M51J128J600J270O71N36O46M74L47R47J931K230J768
51392D48888J647K452L489M163M989O493Q135R159R973J1688J4683J8456K2614
51379E66829K7234L2296L7477M2659M8167N4337O0848O6336O8536O5353N6428
51368A126500M3706L0105J7506N949n532j7574k9604l9999m7335n1735n4623n6911
51356I20453n7834n6140n2050m7227m2876l8665l3728k8146k2923j8860j5935
51345E06069j3702j1908j0568r688r159q854q628q235p458o405n454m766m075
51332C97169l210k504k356k480k202j423q26r97j680k133j880r63J93R97J045
51317C76750N44J59L34R66J796K768L811M635M984M817M081K589M22j825l454
$$ y = [430349, 432842, 434337, 434889, 435340, 436468, 438068, 439338, 440009, 440545, 441191, 441665, 442012, 442959, 444890, 447120, 448888, 450535, 452987, 456476, 460639, 465628, 472121, 480256, 489415, 499388, 511076, 525759, 544215, 566829, 594063, 626359, 663836, 706495, 754662, 808999, 869847, 936183, 1004719, 1070072, 1126500, 1170206, 1200311, 1217817, 1223766, 1218234, 1200660, 1171056, 1131057, 1083722, 1031987, 977364, 920453, 862619, 806479, 754429, 707202, 664326, 625661, 591933, 563787, 540864, 522004, 506069, 492367, 480459, 469891, 460203, 451044, 442190, 433562, 425327, 417869, 411464, 406010, 401244, 397169, 393959, 391455, 389099, 386619, 384417, 382994, 382168, 381171, 379491, 377358, 375478, 374515, 374708, 375705, 376750, 377294, 377453, 377787, 378753, 380549, 383317, 387128, 391763, 396747, 401564, 405645, 408234, 408656, 406831, 403377]
51302D03377m189m105l314k086j044q24j452k253k477k007j473j614k435l131
51288C70973l024k392j999j944j567m73R61K272L472M648N610O276O851P164O502
51273D03330M704K834J986J769R62n13j316n15J222K642L334L582L426K602J193
51258D31242k82j488k555l606m330m239l287k091j460j644k079k062j609j435
51244C99075j916k460k250j400q77j185j743j798j476j396j592j507r88o21q74
51229C76992j466j845j874j719j450j087p14k46N84J666K344K220J767J684J975
51214C78831K248K528L064L568L412K594J840J642J787J913J921J817J661J713
51200D10539K118K425K056J191N53K92j90j188k228k833k993k685j753n78J8o7
$$ y = [403377, 399188, 395083, 391769, 389683, 388639, 387815, 386363, 384110, 381633, 379626, 378153, 376539, 374104, 370973, 367949, 365557, 363558, 361614, 360047, 359574, 360535, 362807, 366279, 370927, 376537, 382813, 389664, 396828, 403330, 408034, 410868, 412854, 414623, 415585, 415072, 413756, 413241, 414463, 417105, 420439, 424021, 427447, 430049, 431242, 430960, 429472, 426917, 423311, 418981, 414742, 411455, 409364, 407904, 406260, 404181, 402119, 400510, 399075, 397159, 394699, 392449, 391049, 390172, 388987, 387244, 385446, 383970, 382574, 380982, 379475, 378487, 377866, 376992, 375526, 373681, 371807, 370088, 368638, 367551, 366837, 366591, 367175, 368841, 371185, 373405, 375172, 376856, 378831, 381079, 383607, 386671, 390239, 393651, 396245, 398085, 399727, 401514, 403427, 405348, 407165, 408826, 410539, 412657, 415082, 417138, 418329, 418882, 419174, 418984, 417796, 415568, 412735, 409742, 407057, 405304, 404726, 404744, 404677]
51184D04677J6O51J036N21j79l2O84Q99M45J88N84J130J280J051O14p7r75j787
51166D10726k276k390k051j170O7J293K318L123L598L581L152K589K091J773J759
51151D28183J945J885J292N15K4l44j153k436l581m178m406m526m439l995l295
51136D01491k536j846j430j513j929k079j532n01N48J458K286K886K951K583K409
51121D03246K918L845M393M082L162K221J643J589K165L290M429M860M328L231
51107D49402K105J218O15L46L78N78Q29J110J341J397J285J084P33J01o31j030
51091D60861r56p48p28q24q33q07q81r80r20o85m50l68m65n72m34KM74P31Q99
51072D52316J190J454J401J113R28R07J040J741L383N454P006Q016R418J1750
$$ y = [404677, 404693, 405344, 406380, 406901, 406722, 406690, 407374, 408273, 408718, 408906, 409490, 410620, 411900, 412951, 413565, 413488, 412513, 410726, 408450, 406060, 404009, 402839, 402906, 404199, 406517, 409640, 413238, 416819, 419971, 422560, 424651, 426424, 428183, 430128, 432013, 433305, 433820, 433844, 433500, 432347, 429911, 426330, 422152, 417746, 413220, 408781, 404786, 401491, 398955, 397109, 395679, 394166, 392237, 390158, 388626, 388125, 388673, 390131, 392417, 395303, 398254, 400837, 403246, 406164, 410009, 414402, 418484, 421646, 423867, 425510, 427099, 429264, 432554, 436983, 441843, 446171, 449402, 451507, 452725, 453340, 453686, 454064, 454642, 455471, 456581, 457922, 459319, 460604, 461688, 462421, 462522, 461891, 460861, 459905, 459157, 458429, 457605, 456772, 455965, 455084, 454104, 453184, 452499, 452049, 451681, 451216, 450644, 450210, 450212, 450686, 451417, 452316, 453506, 454960, 456361, 457474, 458402, 459309, 460349, 462090, 465473, 470927, 477933, 485949, 495367, 507117]
51058E07117J4678J7883K1127K3051K1545J6361J0312O757O717R344J3874J9310
51046F88076K3112K2598J8069J2817R446P316M176q77o797j1954j5148j5718j3687
51033G21429j0065o759n871q524j3795j8885k1153k0219j7786j5403j3092j0189
51021E59688o725l425p83J261K907M185N002N291N148M837M621M524M441M453
51007E95425M883N981P668R581J1247J2336J2898J3263J3624J3860J3870J3758
50995G28394J3447J2472J0558Q147N950M167K576J146O1p01j356j878k010j630
50981G79343o29J344M532Q387J1672J3393J3420J2416J1406J1247J2103J3616
50969H92250J5781J9219K4119K9438L3986L7970M2536M7902N2921N6649N9418
$$ y = [507117, 521795, 539678, 560805, 583856, 605401, 621762, 632074, 638831, 645548, 654892, 668766, 688076, 711188, 733786, 751855, 764672, 774118, 781434, 785610, 784733, 777936, 765982, 750834, 735116, 721429, 711364, 704605, 698734, 690210, 676415, 657530, 636377, 616158, 598372, 582969, 569877, 559688, 552963, 549538, 548755, 550016, 552923, 557108, 562110, 567401, 572549, 577386, 582007, 586531, 590972, 595425, 600308, 606289, 613957, 623538, 634785, 647121, 660019, 673282, 686906, 700766, 714636, 728394, 741841, 754313, 764871, 773018, 778968, 783135, 785711, 786857, 786918, 786217, 784861, 782983, 780973, 779343, 778714, 780058, 784590, 792977, 804649, 818042, 831462, 843878, 855284, 866531, 878634, 892250, 908031, 927250, 951369, 980807, 1014793, 1052763, 1095299, 1143201, 1196122, 1252771, 1312189]
50958A312189O2027O4543O6346O6802O5591O2680N8376N3156M7318M1020L4603
50947A934651K8438K2478J6387J0270M873J055p06m03J298K941K843J77m600j0158
50933B009544j4927j7737j8593j8712j9335k0664k2390k4721k8043l1883l5378
50922A757161l8626m2378m6356m9203n0446n1199n2285n2782n1369m8192m4441
50911A229884m0737l6940l3116k9695k6795k4146k1689j9670j8194j7123j6322
50900I45457j5675j4964j4061j3083j2093j0944r629q433p408o115m363k799k203
50887H23687k397k443j781o93L49J190J836K227K433K782L571M692N745O471P057
50872H54726P938R290J0830J2169J3198J4041J4848J5889J7552J9889K2353K4430
$$ y = [1312189, 1374216, 1438759, 1505105, 1571907, 1637498, 1700178, 1758554, 1811710, 1859028, 1900048, 1934651, 1963089, 1985567, 2001954, 2012224, 2017097, 2018152, 2017446, 2017043, 2018341, 2021282, 2024125, 2024302, 2019702, 2009544, 1994617, 1976880, 1958287, 1939575, 1920240, 1899576, 1877186, 1852465, 1824422, 1792539, 1757161, 1718535, 1676157, 1629801, 1580598, 1530152, 1478953, 1426668, 1373886, 1322517, 1274325, 1229884, 1189147, 1152207, 1119091, 1089396, 1062601, 1038455, 1016766, 997096, 978902, 961779, 945457, 929782, 914818, 900757, 887674, 875581, 864637, 855008, 846575, 839167, 833052, 828689, 825890, 823687, 821290, 818847, 817066, 816373, 816722, 817912, 819748, 821975, 824408, 827190, 830761, 835453, 841198, 847669, 854726, 862664, 871954, 882784, 894953, 908151, 922192, 937040, 952929, 970481, 990370, 1012723, 1037153]
50860A037153K6396K8894L1934L4919L7679M0751M4578M9106N4352O0648O7985
50849A514395P5783Q3666R1919J00787J09773J18068J25274J31426J36715J41470
50839B629276J45861J49136J49562J45610J36966J24137J07670Q8232O7088M5792
50829C789330K5475O667j0355k5317l7724m6663n1238n1419m8177m2460l4574
50818C473545k4837j4431n152J320L633R04o709j7805l0680m4308n8288p2314
50806C204878q6149r9556j11706j21077j26598j28626j28206j25701j20761j13390
50796B043108j04324r4463q4465p4796o5635n6797m8113l9776l2020k4829j8348
50785A399542j3189r644p063m711k888k383l001l643l838m216n243o398p064p506
$$ y = [1037153, 1063549, 1092443, 1124377, 1159296, 1196975, 1237726, 1282304, 1331410, 1385762, 1446410, 1514395, 1590178, 1673844, 1765763, 1866550, 1976323, 2094391, 2219665, 2351091, 2487806, 2629276, 2775137, 2924273, 3073835, 3219445, 3356411, 3480548, 3588218, 3676450, 3743538, 3789330, 3814805, 3821472, 3811117, 3785800, 3748076, 3701413, 3650175, 3598756, 3550579, 3508119, 3473545, 3448708, 3434277, 3429125, 3430445, 3434078, 3434982, 3428273, 3410468, 3379788, 3335480, 3277192, 3204878, 3118729, 3019173, 2907467, 2786390, 2659792, 2531166, 2402960, 2277259, 2156498, 2043108, 1938784, 1844321, 1759856, 1685060, 1619425, 1562628, 1514515, 1474739, 1442719, 1417890, 1399542, 1386353, 1376709, 1369646, 1364935, 1362047, 1359664, 1356663, 1353020, 1349182, 1344966, 1339723, 1333325, 1326261, 1318755]
50771A318755q429r984j1677j3014j3866j4419j5049j6083j7514j8982k0078k0494
50759A139166j9974j8536j6802j5555j4742j3320j0528p039m313k889j871j67
50747A013430K232M630O789R119J1836J4697J7786K1775K6856L2040L6307M0083
50735A237580M4620N0106N5439N9868O3728O7284O9960P1371P2126P2902P3399
50724A938383P3016P1847P0300O8319O5783O3013N9882N4958M6702L5233K1899
50713B569335P556p541k2316l4766m3584m8829n0778m9285m4694l8312l1259k3601
50701B181926j5241p013k37M357O701O706M101j286r389j9751l1252m2354n1969
50688B025299n9811o5746o9273p0090o8631o5557o1040n5116m8362m1566l4867
$$ y = [1318755, 1310326, 1300342, 1288665, 1275651, 1261785, 1247366, 1232317, 1216234, 1198720, 1179738, 1159660, 1139166, 1119192, 1100656, 1083854, 1068299, 1053557, 1040237, 1029709, 1022670, 1018357, 1015468, 1013597, 1013430, 1015662, 1020292, 1027081, 1036200, 1048036, 1062733, 1080519, 1102294, 1129150, 1161190, 1197497, 1237580, 1282200, 1332306, 1387745, 1447613, 1511341, 1578625, 1648585, 1719956, 1792082, 1864984, 1938383, 2011399, 2083246, 2153546, 2221865, 2287648, 2350661, 2410543, 2465501, 2512203, 2547436, 2569335, 2576891, 2569350, 2547034, 2512268, 2468684, 2419855, 2369077, 2319792, 2275098, 2236786, 2205527, 2181926, 2166685, 2159672, 2159435, 2163792, 2170493, 2177199, 2181300, 2180014, 2170625, 2150874, 2119622, 2077268, 2025299, 1965488, 1899742, 1830469, 1760379, 1691748, 1626191, 1565151, 1510035, 1461673, 1420107, 1385240]
50677A385240k7852k0477j3268o549%O756J3558J9915K5454K9904L2920L4261
50665A479862L4015L2452K9773K6269K2469J8881J5667J2850J0762R833R996J0694
50653A713523J1562J2626J3684J4130J3811J3579J4406J6257J8438K0811K3915
50642A886742K7980L2584L7400M2472M7451N1292N3206N3538N3198N2515N0928
50631B389306M7714M2918L7775L4160L3250L4800L8038M2506M6605M5592L3497
50620B826161Q955k1642m8296o4588p0341o8608o2168n2935m2478l1799k1193
50609B351068j1069k416L936Q003J0115J0100P404J749o647j7197k8989m0895
50597B285162n1933o1479o9130p4515p7338p7506p5311p1535o7134o2566n7582
$$ y = [1385240, 1357388, 1336911, 1323643, 1317094, 1317094, 1323850, 1337408, 1357323, 1382777, 1412681, 1445601, 1479862, 1513877, 1546329, 1576102, 1602371, 1624840, 1643721, 1659388, 1672238, 1683000, 1692833, 1702829, 1713523, 1725085, 1737711, 1751395, 1765525, 1779336, 1792915, 1807321, 1823578, 1842016, 1862827, 1886742, 1914722, 1947306, 1984706, 2027178, 2074629, 2125921, 2179127, 2232665, 2285863, 2338378, 2389306, 2437020, 2479938, 2517713, 2551873, 2585123, 2619923, 2657961, 2700467, 2747072, 2792664, 2826161, 2835116, 2813474, 2765178, 2700590, 2630249, 2561641, 2499473, 2446538, 2404060, 2372261, 2351068, 2339999, 2337583, 2341519, 2349522, 2359637, 2369737, 2377141, 2378890, 2372243, 2355046, 2326057, 2285162, 2233229, 2171750, 2102620, 2028105, 1950767, 1873261, 1797950, 1726415, 1659281, 1596715, 1539133]
50586A539133n2019m6479m1817l8117l4806l1630k8908k6860k5296k3990k2721
50575A166490k0838j7573j3107q726n434k911k66K609N039O701Q069R680J1442
50562A141175J2939J4182J5707J7933K0671K3363K5737K8000L0432L2952L5208
50551A398299L6856L7668L7453L6103L3754L0827K7963K5738K4269K3212K2450
50540A734592K2615K4441K7666L1278L4929L9438M5537N2820O0389O7880P5324
50529B216909Q2561Q9479R6397J03580J10744J17557J24095J30114J34458J36106
50519C342000J35305J32713J27813J19374J07274R2629P6156N7638L7193J5837
50509D243932n620k7226m8907o9592q7905j03064j14670j22192j25140j23289
$$ y = [1539133, 1487114, 1440635, 1398818, 1360701, 1325895, 1294265, 1265357, 1238497, 1213201, 1189211, 1166490, 1145652, 1128079, 1114972, 1106246, 1100812, 1097901, 1097635, 1100244, 1105283, 1111984, 1120053, 1129733, 1141175, 1154114, 1168296, 1184003, 1201936, 1222607, 1245970, 1271707, 1299707, 1330139, 1363091, 1398299, 1435155, 1472823, 1510276, 1546379, 1580133, 1610960, 1638923, 1664661, 1688930, 1712142, 1734592, 1757207, 1781648, 1809314, 1840592, 1875521, 1914959, 1960496, 2013316, 2073705, 2141585, 2216909, 2299470, 2388949, 2485346, 2588926, 2699670, 2817227, 2941322, 3071436, 3205894, 3342000, 3477305, 3610018, 3737831, 3857205, 3964479, 4057108, 4133264, 4190902, 4228095, 4243932, 4238312, 4211086, 4162179, 4092587, 4004682, 3901618, 3786948, 3664756, 3539616, 3416327]
50499C416327j16456j04670q8851p0730n1657l1923j1591Q564K7321M3724N6941
50488C076999O5716O8443O3754N0987L0601M382k4977n4810q2849j06951j25231
50477B966064j36951j42857j44266j42041j36640j28705j19205j09105r9024q9050
50467A718220p8894o8580n8935n0969m4718l9233l3800k8590k3957j9784j5954
50456A254806j2854j0927r967r267q280o810m838k554l86J277K478L732N645Q409
50442A210464J1503J4117J6000J7555J8804J8862J6973J3779J0664Q225O198M678
50430A367822M275N045O336P767R389J0778J1132J0632J0567J1587J2882J3562
50418A481774J3918J4732J6345J9088K3565K9592L5743M0801M5070M9465N4147
$$ y = [3416327, 3299871, 3195201, 3106350, 3035620, 2983963, 2952040, 2940449, 2949013, 2976334, 3020058, 3076999, 3142715, 3211158, 3274912, 3325899, 3356500, 3360882, 3335905, 3281095, 3198246, 3091295, 2966064, 2829113, 2686256, 2541990, 2399949, 2263309, 2134604, 2015399, 1906294, 1807270, 1718220, 1639326, 1570746, 1511811, 1460842, 1416124, 1376891, 1343091, 1314501, 1290544, 1270760, 1254806, 1241952, 1231025, 1221058, 1211791, 1203511, 1196701, 1191863, 1189309, 1188923, 1190200, 1192678, 1196410, 1202055, 1210464, 1221967, 1236084, 1252084, 1269639, 1288443, 1307305, 1324278, 1338057, 1348721, 1356946, 1363144, 1367822, 1372097, 1377142, 1383478, 1391245, 1400634, 1411412, 1422544, 1433176, 1443743, 1455330, 1468212, 1481774, 1495692, 1510424, 1526769, 1545857, 1569422, 1599014, 1634757, 1675558, 1720628, 1770093, 1824240]
50407A824240N8805O3436O7667P0150O9822O7343O4060O0144N4975M8892M2796
50396B492330L6160K7054J4724P16j3131k6697m0733n4768o6902p5466q0226q1993
50384B131068q1440p8383p2171o2893n2035m1480l1758k1761j0457J469J2150
50373A692309K0428K6638L1318L3611L1610K4354J2981l80j4335k8298m1308n1883
50361A737045n9257o3886o6360o6506o4104n9848n4965n0319m6378m3482m1481
50350A120459l9438l6434l2514k8297k3966j9319j4489r872n400o38M410R153
50338I23655J3064J5824J6746J4803R674K460m795j0189j2722j2548j0811q889
50326I36272p527o513n215l288r70J137K577L438M201N147O090O663O622N783
$$ y = [1824240, 1883045, 1946481, 2014148, 2084298, 2154120, 2221463, 2285523, 2345667, 2400642, 2449534, 2492330, 2528490, 2555544, 2570268, 2570984, 2557853, 2531156, 2490423, 2435655, 2368753, 2293287, 2213061, 2131068, 2049628, 1971245, 1899074, 1836181, 1784146, 1742666, 1710908, 1689147, 1678690, 1680159, 1692309, 1712737, 1739375, 1770693, 1804304, 1835914, 1860268, 1873249, 1872869, 1858534, 1830236, 1788928, 1737045, 1677788, 1613902, 1547542, 1481036, 1416932, 1357084, 1302119, 1251800, 1205422, 1161940, 1120459, 1081021, 1044587, 1012073, 983776, 959810, 940491, 926002, 916130, 910730, 910092, 914502, 923655, 936719, 952543, 969289, 984092, 993766, 996226, 991431, 981242, 968520, 955972, 945161, 936272, 928745, 922232, 917017, 913729, 912759, 913896, 916473, 919911, 924112, 929259, 935349, 942012, 948634, 954417]
50312I54417M098J990K56p03j208j607j646r29L07J434K205K796L211L250L053
50297I70924L163L849M761N450O028P047Q745J0677J2128J2842J3202J3971J6216
50284A089003K1136K8663L5614L6400K7367J0662p151k0332k7102k8381k5650
50273A140229k0738j5800j1973q740n561l191k474k814l048l104l574m305m646
50260A050261m635m707m619l853k702j714m27J982N005P219Q470J0165J3161J6638
50246A090244J9486K1581K3223K4262K4431K3840K2636K0857J8995J8114J8824
50235A326493K0531K1878K1596J8911J3787O967o33q663j6952k4595l0226l3370
50223A315724l4703l4751l3112k9359k4047j8396j3482j0211r558j2161j7566
$$ y = [954417, 958515, 960505, 960761, 960058, 958850, 957243, 955597, 954668, 954975, 956409, 958614, 961410, 964621, 967871, 970924, 974087, 977936, 982697, 988147, 994175, 1001222, 1009967, 1020644, 1032772, 1045614, 1058816, 1072787, 1089003, 1110139, 1138802, 1174416, 1210816, 1238183, 1248845, 1241694, 1221362, 1194260, 1165879, 1140229, 1119491, 1103691, 1091718, 1082978, 1077417, 1074226, 1071752, 1068938, 1065890, 1062786, 1059212, 1054907, 1050261, 1045626, 1040919, 1036300, 1032447, 1029745, 1028031, 1027604, 1029586, 1034591, 1041810, 1050280, 1060445, 1073606, 1090244, 1109730, 1131311, 1154534, 1178796, 1203227, 1227067, 1249703, 1270560, 1289555, 1307669, 1326493, 1347024, 1368902, 1390498, 1409409, 1423196, 1430163, 1429530, 1420867, 1403915, 1379320, 1349094, 1315724, 1281021, 1246270, 1213158, 1183799, 1159752, 1141356, 1127874, 1117663, 1108105, 1095944, 1078378]
50212A078378k4067k9420l2045l1929l0368k8500k6323k3346j9739j6206j3097
50201H03338j0473q668p932p593o672n323m623m874n164m851m396m331m364m139
50187G19935l970m194m476m420m304m603n122n222m658l794l189l227l876m583
50173F60297m691m069l044j846n85L19M88L59Q22J957K953L453M050N086N949
50158F71498O062N829N899O272O698P339Q401R623J0709J1746J2672J2884J1985
50145G87617J0405Q739O985N051L438K718K785L305M463O636R754J3688J8852
50132H84436K5524L2821L9205M3933M7299M9569N0451M9646M7382M4257M1036
50121A355559L8612L7696L8379M0080M1732M1862L8992L2503K2990J1506j210
$$ y = [1078378, 1054311, 1024891, 992846, 960917, 930549, 902049, 875726, 852380, 832641, 816435, 803338, 792865, 784197, 776265, 768672, 762000, 756677, 752054, 747180, 742016, 737165, 732769, 728438, 724074, 719935, 715965, 711771, 707295, 702875, 698571, 693968, 688846, 683624, 678966, 675172, 671983, 668756, 664880, 660297, 655606, 651537, 648493, 646647, 646062, 646381, 646869, 647228, 648050, 650007, 652960, 656413, 660463, 665549, 671498, 677560, 683389, 689288, 695560, 702258, 709597, 717998, 727621, 738330, 750076, 762748, 775632, 787617, 798022, 806761, 813746, 818797, 822235, 824953, 827738, 831043, 835506, 842142, 851896, 865584, 884436, 909960, 942781, 981986, 1025919, 1073218, 1122787, 1173238, 1222884, 1270266, 1314523, 1355559, 1394171, 1431867, 1470246, 1510326, 1552058, 1593920, 1632912, 1665415, 1688405, 1699911, 1698701]
50110A698701j4360k6540l6379m3568m8629n1831n3038n2473n0911m8911m6385
50099A225676m3029l8771l3835k8855k4920k2931k2704k2997k2565k0997j8616
50088I25456j5996j3516j1143q525n577k775n94J168K990M671N418M931L882L119
50074H93509K795K510J955J161L97p0k78p01j793l307m421m710m624m842n436
50059H72145n954o105n984n697n242m725m436m494m579m169k968j081J087K959
50045H20757L998M078L726L773M685O244P872R071R616R656R713J0230J0975J1243
50031I25637J0883J0658J1218J2122J2443J1974J1140R990Q192N953M111L025
50019A037346K230J417J017J379K111K811L844N784Q477J1288J3986J6729J9279
$$ y = [1698701, 1684341, 1657801, 1621422, 1577854, 1529225, 1477394, 1424356, 1371883, 1320972, 1272061, 1225676, 1182647, 1143876, 1110041, 1081186, 1056266, 1033335, 1010631, 987634, 965069, 944072, 925456, 909460, 895944, 884801, 876276, 870699, 867924, 867330, 868498, 871488, 876159, 881577, 886508, 890390, 893509, 896304, 898814, 900769, 901930, 902327, 902257, 901979, 901278, 899485, 896178, 891757, 887047, 882423, 877581, 872145, 866191, 860086, 854102, 848405, 843163, 838438, 834002, 829508, 824929, 820760, 817792, 816711, 817798, 820757, 824755, 828833, 832559, 836332, 841017, 847261, 855133, 864204, 873820, 883476, 893189, 903419, 914394, 925637, 936520, 947178, 958396, 970518, 982961, 994935, 1006075, 1016065, 1024257, 1030210, 1034321, 1037346, 1039576, 1040993, 1042010, 1043389, 1045500, 1048311, 1052155, 1057939, 1066416, 1077704, 1091690, 1108419, 1127698]
50006A127698K0866K0803J8983J5904J2599J0377J0202J2197J5809K0188K4182
49995A309808K6313K5263K0445J2070J051j0951k1875l0347l6353m0473m2692
49984A212259m2577m0514l8053l6626l6313l6037l4764l2356k9397k6528k3973
49973H35121k1600j9222j6792j4328j1943r936q650q071p777p381o884o467o099
49960F89971n552m672l509k243r81M06K088L860N119N711O560Q745J1925J4376
49946G31804J4888J3915J2538J1023R057O854N115M089L378K669J996J161m81
49933H18006l373p169j1040j4376j6986j8784j9556j9174j7908j6292j4575j2542
49921F46231j0094p718n953m577k863o88J287K566L339L815L774L158K578K638
$$ y = [1127698, 1148564, 1169367, 1188350, 1204254, 1216853, 1227230, 1237432, 1249629, 1265438, 1285626, 1309808, 1336121, 1361384, 1381829, 1393899, 1394950, 1383999, 1362124, 1331777, 1295424, 1254951, 1212259, 1169682, 1129168, 1091115, 1054489, 1018176, 982139, 947375, 915019, 885622, 859094, 835121, 813521, 794299, 777507, 763179, 751236, 741300, 732650, 724579, 716802, 709421, 702537, 696070, 689971, 684419, 679747, 676238, 673995, 673014, 673420, 675508, 679368, 684487, 690198, 696758, 705503, 717428, 731804, 746692, 760607, 773145, 784168, 793225, 800079, 805194, 809283, 812661, 815330, 817326, 818487, 818006, 814633, 807464, 796424, 782048, 765062, 746278, 726722, 707548, 689640, 673348, 658773, 646231, 636137, 628419, 622466, 617889, 615026, 614338, 615625, 618191, 621530, 625345, 629119, 632277, 634855, 637493]
49907F37493L249M068N150O628Q049Q767Q823Q903R536J0781J2523J4490J5986
49894G54446J6080J4315J1062P300M085J970N78j044l416o103q464j0457j2277
49881G68075j3635j4035j3709j3561j4083j4788j4872j4028j2566j0991r685q724
$$ y = [637493, 640742, 644810, 649960, 656588, 664637, 673404, 682227, 691130, 700666, 711447, 723970, 738460, 754446, 770526, 784841, 795903, 803203, 807288, 809258, 809836, 808792, 805376, 799273, 790809, 780352, 768075, 754440, 740405, 726696, 713135, 699052, 684264, 669392, 655364, 642798, 631807, 622122, 613398]
$$ [...]
##END NTUPLES=NMR SPECTRUM
##END=
