
##TITLE=UV1250_M10_1340-1211_10_7409705_FYXwsFkp2I
##JCAMPDX= 6.0         $$ Bruker NMR JCAMP-DX V2.0
##DATA TYPE= NMR SPECTRUM
##DATA CLASS= NTUPLES
##ORIGIN= BRUKER
##OWNER= Administrator
$$ 1.72 TOPSPIN		Version 2.1
$$ 2013-01-31 09:18:54.952 -0500  Administrator@X
$$ Compression mode = diff/dup
##.OBSERVE FREQUENCY= 400.02188249412
##.OBSERVE NUCLEUS= ^1H
##.ACQUISITION MODE= SIMULTANEOUS (DQD)
##.ACQUISITION SCHEME= undefined
##.AVERAGES= 64
##.DIGITISER RES= 22
##SPECTROMETER/DATA SYSTEM= spect
##.PULSE SEQUENCE= noesygpps1d.comp
##.SOLVENT NAME= COFFEE_meoh
##.SHIFT REFERENCE= INTERNAL, COFFEE_meoh, 1, 14.96094
##AUDIT TRAIL= $$ (NUMBER, WHEN, WHO, WHERE, PROCESS, VERSION, WHAT)
$$ ##TITLE= Audit trail, TOPSPIN		Version 2.1
$$ ##JCAMPDX= 5.01
$$ ##ORIGIN= Bruker BioSpin GmbH
$$ ##OWNER= Administrator
$$ $$ E:\/data/COFFEE/nmr/UV1250_M10_1340-1211_10_7409705_FYXwsFkp2I/12/pdata/1/auditp.txt
$$ ##AUDIT TRAIL=  $$ (NUMBER, WHEN, WHO, WHERE, PROCESS, VERSION, WHAT)
(   1,<2013-01-24 20:06:53.082 -0500>,<Administrator>,<X>,<go>,<TOPSPIN 2.1>,
      <created by zg
	started at 2013-01-24 19:55:23.017 -0500,
	POWCHK enabled, PULCHK disabled,
       configuration hash MD5:
       86 BA 57 50 F2 9D 5C 9B 26 00 A9 28 5F 66 2E 89
       data hash MD5: 64K
       5B 40 FF 53 19 C5 4D EB 3F 2A 97 5F B2 1B 92 0B>)
(   2,<2013-01-24 20:06:56.144 -0500>,<Administrator>,<X>,<proc1d>,<TOPSPIN 2.1>,
      <Start of raw data processing
       efp LB = 0.3 FT_mod = 6 PKNL = 1 PHC0 = 0 PHC1 = 0 SI = 128K 
       data hash MD5: 128K
       33 80 68 A9 07 E8 3A 1F 12 E6 AE 78 01 89 13 14>)
(   3,<2013-01-24 20:06:57.207 -0500>,<Administrator>,<X>,<proc1d>,<TOPSPIN 2.1>,
      <pk PHC0 = -80.20569 PHC1 = 0 
       data hash MD5: 128K
       BA 8A E2 5D 5D 78 78 3F 08 F2 0A 9C DD C1 4C 56>)
(   4,<2013-01-24 20:06:57.879 -0500>,<Administrator>,<X>,<proc1d>,<TOPSPIN 2.1>,
      <abs ABSG = 1 
       data hash MD5: 128K
       DF 5A 82 DD 7F F6 01 66 74 27 FE DB 7A BC DD 78>)
(   5,<2013-01-24 20:06:58.050 -0500>,<Administrator>,<X>,<proc1d>,<TOPSPIN 2.1>,
      <abs ABSG = 2 
       data hash MD5: 128K
       D1 70 1B B6 01 A8 5E 5F 52 5D 08 92 FF 4D 75 B8>)
(   6,<2013-01-24 20:06:58.191 -0500>,<Administrator>,<X>,<proc1d>,<TOPSPIN 2.1>,
      <abs ABSG = 3 
       data hash MD5: 128K
       F6 E5 88 CB 30 F0 12 90 03 9B 1F 3A 1E 84 11 4C>)
(   7,<2013-01-24 20:06:58.363 -0500>,<Administrator>,<X>,<proc1d>,<TOPSPIN 2.1>,
      <abs ABSG = 4 
       data hash MD5: 128K
       B2 76 62 A7 D4 FD 30 D0 FE 10 50 43 75 A5 85 32>)
(   8,<2013-01-24 20:06:58.566 -0500>,<Administrator>,<X>,<proc1d>,<TOPSPIN 2.1>,
      <abs ABSG = 5 
       data hash MD5: 128K
       81 AC 18 6D 4B 40 E0 31 B4 9D 9F 14 B4 76 F2 E4>)
(   9,<2013-01-24 20:07:05.191 -0500>,<Administrator>,<X>,<audit>,<TOPSPIN 2.1>,
      <user comment:
       ICON-NMR User ID: COFFEE
       data hash MD5: 128K
       81 AC 18 6D 4B 40 E0 31 B4 9D 9F 14 B4 76 F2 E4>)
$$ ##END=
$$ 
$$ $$ hash MD5
$$ [...]
##$TP07= 0
##$TPNAME0= <>
##$TPNAME1= <>
##$TPNAME2= <>
##$TPNAME3= <>
##$TPNAME4= <>
##$TPNAME5= <>
##$TPNAME6= <>
##$TPNAME7= <>
##$TPOAL= (0..7)
0.5 0.5 0.5 0.5 0.5 0.5 0.5 0.5
##$TPOFFS= (0..7)
0 0 0 0 0 0 0 0
##$TUNHIN= 0
##$TUNHOUT= 0
##$TUNXOUT= 0
##$USERA1= <user>
##$USERA2= <user>
##$USERA3= <user>
##$USERA4= <user>
##$USERA5= <user>
##$V9= 5
##$VALIST= <valist>
##$VCLIST= <CCCCCCCCCCCCCCC>
##$VD= 0
##$VDLIST= <DDDDDDDDDDDDDDD>
##$VPLIST= <PPPPPPPPPPPPPPP>
##$VTLIST= <TTTTTTTTTTTTTTT>
##$WBST= 1024
##$WBSW= 4
##$XGAIN= (0..3)
0 0 0 0
##$XL= 0
##$YL= 0
##$YMAX_a= 6464764
##$YMIN_a= -12479819
##$ZGOPTNS= <>
##$ZL1= 120
##$ZL2= 120
##$ZL3= 120
##$ZL4= 120
##$ABSF1= 14.96094
##$ABSF2= -5.597241
##$ABSG= 5
##$ABSL= 3
##$ALPHA= 0
##$AQORDER= 0
##$ASSFAC= 0
##$ASSFACI= 0
##$ASSFACX= 0
##$ASSWID= 0
##$AUNMP= <proc_prof1d_extract.lims>
##$AXLEFT= 0
##$AXNAME= <>
##$AXNUC= <1H>
##$AXRIGHT= 0
##$AXTYPE= 0
##$AXUNIT= <>
##$AZFE= 0.1
##$AZFW= 0.1
##$BCFW= 0
##$BC_mod= 0
##$BYTORDP= 0
##$COROFFS= 0
##$CY= 15
##$DATMOD= 1
##$DC= 0
##$DFILT= <>
##$DTYPP= 0
##$F1P= 0
##$F2P= 0
##$FCOR= 0.5
##$FTSIZE= 131072
##$FT_mod= 6
##$GAMMA= 0
##$GB= 0
##$INTBC= 1
##$INTSCL= 1
##$ISEN= 128
##$LB= 0.3
##$LEV0= 0
##$LPBIN= 0
##$MAXI= 10000
##$MC2= 0
##$MEAN= 0
##$ME_mod= 0
##$MI= 0
##$NCOEF= 0
##$NC_proc= -2
##$NLEV= 6
##$NOISF1= 0
##$NOISF2= 0
##$NSP= 0
##$NTH_PI= 0
##$NZP= 0
##$OFFSET= 14.96094
##$PC= 1
##$PHC0= -80.20569
##$PHC1= 0
##$PH_mod= 1
##$PKNL= yes
##$PPARMOD= 0
##$PPDIAG= 0
##$PPIPTYP= 0
##$PPMPNUM= 2147483647
##$PPRESOL= 1
##$PSCAL= 4
##$PSIGN= 0
##$PYNMP= <proc.py>
##$REVERSE= no
##$SF= 400.020009662223
##$SI= 131072
##$SIGF1= 0
##$SIGF2= 0
##$SINO= 400
##$SIOLD= 131072
##$SPECTYP= <>
##$SREGLST= <1H.CDCl3>
##$SSB= 0
##$STSI= 131072
##$STSR= 0
##$SW_p= 8223.68421052631
##$SYMM= 0
##$S_DEV= 0
##$TDeff= 65536
##$TDoff= 0
##$TI= <>
##$TILT= no
##$TM1= 0
##$TM2= 0
##$TOPLEV= 0
##$USERP1= <user>
##$USERP2= <user>
##$USERP3= <user>
##$USERP4= <user>
##$USERP5= <user>
##$WDW= 1
##$XDIM= 131072
##$YMAX_p= 435401106
##$YMIN_p= -16244
##$CURPLOT= <Network HP LaserJet P1505>
##$CURPRIN= <$Network HP LaserJet P1505>
##$DFORMAT= <normdp>
##$LAYOUT= <+/1D_H.xwp>
##$LFORMAT= <normlp>
##$PFORMAT= <normpl>
##$SURQMSG= 1
$$ End of Bruker specific parameters
$$ ---------------------------------
##NTUPLES= NMR SPECTRUM
##VAR_NAME=  FREQUENCY,     SPECTRUM/REAL,   SPECTRUM/IMAG
##SYMBOL=    X,             R,               I
##VAR_TYPE=  INDEPENDENT,   DEPENDENT,       DEPENDENT
##VAR_FORM=  AFFN,          ASDF,            ASDF
##VAR_DIM=   131072,        131072,          131072
##UNITS=     HZ,            ARBITRARY UNITS, ARBITRARY UNITS
##FACTOR=    0.0627417313425164, 1,          1
##FIRST=     8223.62146879497, 58,           -65510
##LAST=      0,             2410,            -66382
##MIN=       0,             -16244,          0
##MAX=       8223.62146879497, 435401106,    0
$$ Real data points
##PAGE= N=1
##DATA TABLE= (X++(R..R)), XYDATA
$$ [...]
$$ plain form
63923 4183268 4128970 4049560 3946683 3822886 3681591 3526727 3362213 3191554 3017796 2843852
63913 2843852 2672815 2507722 2350801 2202995 2064237 1934174 1812628 1699647 1595338
63904 1595338 1499639 1412260 1332922 1261579 1198164 1142028 1091963 1046924 1006548 970791 939336
63893 939336 911609 887089 865215 845086 825746 806860 788853 772282 757233 743418 730666
63882 730666 719171 709377 701695 696307 693130 691919 692405 694402 697890 702979 709644 717492 726019 735174
63868 735174 745485 757417 770784 784959 799490 814227 828940 843129 856324 868374 879347
63857 879347 889300 898191 905887 912168 916764 919468 920200 918962 915717 910313 902550 892410 880228 866536
63843 866536 851672 835589 818057 798932 778225 756072 732768 708756 684475 660324 636773
$$ packed form
63923D183268n4298p9410j02877j23797j41295j54864j64514j70659j73758j73944
63913B843852j71037j65093j56921j47806j38758j30063j21546j12981j04309
63904A595338r5699q7379p9338p1343o3415n6136n0065m5039m0376l5757l1455
63893I39336k7727k4520k1874k0129j9340j8886j8007j6571j5049j3815j2752
63882G30666j1495r794p682n388l177j211M86J997L488N089O665P848Q527R155
63868G35174J0311J1932J3367J4175J4531J4737J4713J4189J3195J2050J0973
63857H79347R953Q891P696O281M596K704P32j238l245n404p763j0140j2182j3692
63843H66536j4864j6083j7532j9125k0707k2153k3304k4012k4281k4151k3551
$$ plain form
63832 636773 614259 592825 572078 551733 532067 513607 496459 480197 464390 449003 434246
63821 434246 420312 407366 395654 385403 376529 368477 360514 352296 344171 336750 330265 324530 319516
63808 319516 315566 312857 310938 309070 306847 304250 301364 298377 295705 293686 292174 290669 288773 286277
63794 286277 283022 279126 275263 272133 269561 266626 262910 259195 256559 255123 254045 252608 250894 249425
63780 249425 248452 247681 246566 244836 242827 241245 240526 240451 240488 240417 240444 240698 240845 240360 239111 237522 236145 235178
63762 235178 234467 233907 233650 233869 234407 234767 234479 233486 232231 231274 230753 230287 229572 228939 229007 229725 230290 230247 230300
63743 230300 231531 233996 236670 238748 240514 242723 245557 248482 250911 252708 254157 255688 257616 259904
63729 259904 262077 263518 264046 264325 265531 268354 272254 275980 278967 281981 286167 291674 297589 303018 307699
$$ packed form
63832F36773k2514k1434k0747k0345j9666j8460j7148j6262j5807j5387j4757
63821D34246j3934j2946j1712j0251q874q052p963q218q125p421o485n735n014
63808C19516l950k709j919j868k223k597k886k987k672k019j512j505j896k496
63794B86277l255l896l863l130k572k935l716l715k636j436j078j437j714j469
63780B49425r73p71j115j730k009j582p19p5L7p1K7K54J47m85j249j589j377r67
63762B35178p11n60k57K19N38L60k88r93j255r57n21m66p15o33O8P18N65m3N3
63743B30300J231K465K674K078J766K209K834K925K429J797J449J531J928K288
63729B59904K173J441N28K79J206K823L900L726K987L014M186N507N915N429M681
$$ plain form
63714 307699 311557 314222 315375 315307 314748 314148 313281 311566 308704 304997 301064 297325 293885 290935 288888
63699 288888 287883 287390 286776 286121 286053 286837 288120 289621 291455 293610 295697 297581 299798 302801 306085 308595
63683 308595 309887 310493 311185 312248 313447 314347 314600 314190 313510 313132 313439 314505 316139 317924 319433 320681
63667 320681 322200 324332 326575 327996 328389 328603 329490 330780 331299 330214 327789 324863 321841 318463 314421
63652 314421 309870 305115 300121 294792 289675 285887 284025 283437 282833 281572 280158 279646 280739 283261 286207
63637 286207 288405 289482 290222 291871 295074 299574 304704 309831 314452 318419 322327 327352 334302 342778
63623 342778 351455 359217 365992 372566 379833 388399 398760 411455 426774 444408 463715 484355 506411
63610 506411 529933 554771 581048 609389 640240 673008 706187 738236 768077 794825 817430
$$ packed form
63714C07699L858K665J153o8n59o00q67j715k862l707l933l739l440k950k047
63699B88888j005m93o14o55o8P84J283J501J834K155K087J884K217L003L284K510
63683C08595J292O06O92J063J199R00K53m10o80l78L07J066J634J785J509J248
63667C20681J519K132K243J421L93K14Q87J290N19j085k425k926l022l378m042
63652C14421m551m755m994n329n117l788j862n88o04j261j414n12J093K522K946
63637B86207K198J077P40J649L203M500N130N127M621L967L908N025O950Q476
63623C42778Q677P762O775O574P267Q566J0361J2695J5319J7634J9307K0640K2056
63610E06411K3522K4838K6277K8341L0851L2768L3179L2049K9841K6748K2605
$$ plain form
63599 817430 834854 846557 852815 854610 853103 849070 842896 835107 826621 818153 809506 799742 787997
63586 787997 773923 757450 738551 717337 694170 669582 644274 619185 595359 573644 554543
63575 554543 538197 524304 512237 501572 492460 485236 479810 475900 473705 473816 476317 480501 485651
63562 485651 491649 498550 506071 513897 522206 531500 542035 553740 566462 580093 594701 610871 629680
63549 629680 651941 677628 706332 738159 773794 813685 857248 902393 945399 981571 1007018
63538 1007018 1020320 1022550 1015981 1003202 987078 970429 955108 941644 929914 919677 910262 900397
63526 900397 888936 875401 859361 839714 815370 786588 754944 721915 688069 653811 620228
63515 620228 588651 559679 533113 508704 486525 466631 448817 432889 418908 406958 396792
$$ packed form
63599H17430J7424J1703O258J795j507m033o174p789q486q468q647r764j1745
63586G87997j4074j6473j8899k1214k3167k4588k5308k5089k3826k1715j9101
63575E54543j6346j3893j2067j0665r112p224n426l910k195J11K501M184N150
63562D85651N998O901P521P826Q309R294J0535J1705J2722J3631J4608J6170J8809
63549F29680K2261K5687K8704L1827L5635L9891M3563M5145M3006L6172K5447
63538A007018J3302K230o569j2779j6124j6649j5321j3464j1730j0237r415r865
63526I00397j1461j3535j6040j9647k4344k8782l1644l3029l3846l4258l3583
63515F20228l1577k8972k6566k4409k2179j9894j7814j5928j3981j1950j0166
$$ plain form
63504 396792 387959 380171 373372 367411 361897 356553 351586 347499 344484 342173 340044 337962 336274 335404
63490 335404 335427 335896 336090 335609 334869 334772 335732 337211 338523 339832 341869 344771 347845 350661 353724 357597
63474 357597 361865 365570 368368 370553 372061 372302 371171 369471 367822 365669 362031 357049 352183 348795
63460 348795 346942 345643 343993 341802 339363 336952 334664 332682 331499 331685 333417 336392 340266 344982
63446 344982 350540 356676 363071 369831 377518 386739 397827 410851 425709 442277 460769 481979 506877
63433 506877 535831 568277 602948 638047 671193 699761 721821 736840 745576 749642 751234 752786
63421 752786 756252 762631 772333 785834 803723 826279 853357 884601 919355 956255 993180 1027711
63409 1027711 1057542 1080665 1095787 1102941 1103487 1099212 1091423 1080927 1068588 1055548 1042774 1030401
$$ packed form
63504C96792q833p788o799n961n514n344m967m087l015k311k129k082j688q70
63490C35404K3M69J94m81p40r7R60J479J312J309K037K902L074K816L063L873
63474C57597M268L705K798K185J508K41j131j700j649k153l638m982m866l388
63460C48795j853j299j650k191k439k411k288j982j183J86J732K975L874M716
63446C44982N558O136O395O760P687R221J1088J3024J4858J6568J8492K1210K4898
63433E06877K8954L2446L4671L5099L3146K8568K2060J5019Q736M066J592J552
63421G52786L466O379R702J3501J7889K2556K7078L1244L4754L6900L6925L4531
63409A027711K9831K3123J5122P154N46m275p789j0496j2339j3040j2774j2373
$$ plain form
63397 1030401 1017446 1002159 982883 958867 930418 898452 864095 828557 792871 757472 722335
63386 722335 687864 655378 626298 600911 578320 557639 538947 523102 510922 502528 497171 493642
63374 493642 491164 489966 490718 493441 497407 502199 508399 516946 528174 541769 557344 574650 593443
63361 593443 613598 635293 658825 684366 712144 742651 776224 812448 850264 888584 926464
63350 926464 962711 995705 1023754 1045433 1059835 1066887 1067501 1063036 1054573 1043019 1029737 1016374
63338 1016374 1003713 991048 976910 960180 940382 917419 891452 862914 832349 800343 767715
63327 767715 735493 704586 675709 649754 627718 609986 596059 585426 578296 574931 574365 574242 571848
63314 571848 565059 552773 535288 514431 492693 471883 452659 435153 419417 405241 392213 380337
$$ packed form
63397A030401j2955j5287j9276k4016k8449l1966l4357l5538l5686l5399l5137
63386G22335l4471l2486k9080k5387k2591k0681j8692j5845j2180q394n357l529
63374D93642k478j198P52K723L966M792O200Q547J1228J3595J5575J7306J8793
63361E93443K0155K1695K3532K5541K7778L0507L3573L6224L7816L8320L7880
63350I26464L6247L2994K8049K1679J4402P052O14m465q463j1554j3282j3363
63338A016374j2661j2665j4138j6730j9798k2963k5967k8538l0565l2006l2628
63327G67715l2222l0907k8877k5955k2036j7732j3927j0633p130l365n66j23k394
63314E71848o789j2286j7485k0857k1738k0810j9224j7506j5736j4176j3028j1876
$$ plain form
63302 380337 370293 362674 357164 352714 348446 344231 340530 337762 335737 333707 331123 328288 325864 323785
63288 323785 321164 317509 313543 310415 308470 307269 306525 306380 306728 306887 306238 304937 303720 303156 303230 303554
63272 303554 303798 303973 304348 305155 306308 307418 308085 308195 307999 308001 308722 310456 313152 316479 319980 323250 326125
63255 326125 328759 331443 334339 337486 341040 345244 350067 355138 360315 366125 373197 381296 389377 396803
63241 396803 404187 412711 422876 434275 446501 459772 474552 490923 508647 527642 548024 569675
63229 569675 592053 614550 636865 658935 680661 701872 722470 742504 762158 781755 801679
63218 801679 822098 842738 863067 882708 901591 919680 936652 951854 964494 973834 979284 980421
63206 980421 976984 968871 956174 939137 918095 893543 866367 837906 809597 782490 757149 733913
$$ packed form
63302C80337j0044p619n510m450m268m215l701k768k025k030k584k835k424k079
63288C23785k621l655l966l128j945j201p44j45L48J59o49j301j217n64P4L24
63272C03554K44J75L75Q07J153J110O67J10j96KP21J734K696L327L501L270K875
63255C26125K634K684K896L147L554M204M823N071N177N810P072Q099Q081P426
63241C96803P384Q524J0165J1399J2226J3271J4780J6371J7724J8995K0382K1651
63229E69675K2378K2497K2315K2070K1726K1211K0598K0034J9654J9597J9924
63218H01679K0419K0640K0329J9641J8883J8089J6972J5202J2640R340N450J137
63206I80421l437q113j2697j7037k1042k4552k7176k8461k8309k7107k5341k3236
$$ plain form
63194 733913 713069 694794 679152 666262 656346 649557 645875 645264 647802 653509 662039 672684 684788
63181 684788 698159 713002 729382 746772 764301 781485 798519 815739 832983 849781 865997
63170 865997 881847 897243 911590 924410 935780 945719 953393 957458 957227 953076 945546 934402 918942
63157 918942 899010 875342 848966 820731 791520 762422 734205 706790 679731 653230 628194
63146 628194 605245 584233 565019 548182 534362 523190 513494 504476 496161 488790 482404 477160 473344
63133 473344 470702 468226 465087 461578 458821 457665 458073 459356 460781 462107 463758 466308 469727 473393
63119 473393 476988 480946 485676 490739 495339 499414 503654 508464 513374 517558 520595 522636 524191 525827
63105 525827 527837 530124 532520 535118 537961 540582 542244 542678 542208 541175 539705 538107 536929 536367 535968
$$ packed form
63194G33913k0844j8275j5642j2890r916o789l682o11K538N707Q530J0645J2104
63181F84788J3371J4843J6380J7390J7529J7184J7034J7220J7244J6798J6216
63170H65997J5850J5396J4347J2820J1370R939P674M065k31m151p530j1144j5460
63157I18942j9932k3668k6376k8235k9211k9098k8217k7415k7059k6501k5036
63146F28194k2949k1012j9214j6837j3820j1172r696r018q315p371o386n244l816
63133D73344k642k476l139l509k757j156M08J283J425J326J651K550L419L666
63119D73393L595L958M730N063M600M075M240M810M910M184L037K041J555J636
63105E25827K010K287K396K598K843K621J662M34m70j033j470j598j178n62l99
$$ plain form
63090 535968 535221 534117 532910 531773 530976 531014 532008 533298 534189 535004 536777 539891 543556 546843 549765 553019
63074 553019 556962 561265 565546 570072 575687 583062 592012 601660 611308 621118 631813 643919 657580
63061 657580 673011 690650 710604 732329 755155 779047 804720 833184 865380 901953 942923
63050 942923 987579 1034890 1084038 1134445 1185561 1236999 1288777 1340991 1393238 1444765 1495252
63039 1495252 1545098 1594755 1644109 1692653 1740021 1786145 1831138 1875136 1917966 1958745 1996025
63028 1996025 2028429 2054897 2074218 2084796 2085227 2074847 2053530 2021423 1979310 1928859 1871978 1810217
63016 1810217 1745235 1679370 1614894 1552848 1493485 1437839 1387935 1345213 1309554 1280297 1257432
63005 1257432 1241314 1231797 1228397 1230935 1239370 1253149 1271317 1293163 1318237 1345787 1374665 1403957
$$ packed form
63090E35968p47j104j207j137p97L8R94J290Q91Q15J773L114L665L287K922L254
63074E53019L943M303M281M526N615P375Q950R648R648R810J0695J2106J3661
63061F57580J5431J7639J9954K1725K2826K3892K5673K8464L2196L6573M0970
63050I42923M4656M7311M9148N0407N1116N1438N1778N2214N2247N1527N0487
63039A495252M9846M9657M9354M8544M7368M6124M4993M3998M2830M0779L7280
63028A996025L2404K6468J9321J0578M31j0380k1317l2107m2113n0451n6881o1761
63016A810217o4982o5865o4476o2046n9363n5646m9904m2722l5659k9257k2865
63005A257432j6118r517l400K538Q435J3779J8168K1846K5074K7550K8878K9292
$$ plain form
62993 1403957 1433467 1463503 1494356 1525890 1557453 1588211 1617743 1646172 1673499 1698871 1720694
62982 1720694 1737452 1748358 1753299 1752318 1745068 1730704 1708446 1678294 1640989 1597313 1547905 1493922
62970 1493922 1437376 1380265 1323603 1267666 1212971 1160551 1111368 1065925 1024395 986718 952515
62959 952515 921201 892261 865320 840080 816456 794629 774650 756089 738347 721226 704888
62948 704888 689376 674546 660324 646674 633324 619929 606503 593465 581270 570243 560553 551999
62936 551999 544004 536280 529345 523882 519675 515711 511287 506506 501694 497029 492874 489813 487998 486894
62922 486894 485909 484889 483807 482509 481081 479970 479284 478346 476406 473576 470660 468167 465955 463708 461385
62907 461385 459122 456965 454840 452714 450792 449447 448828 448556 448056 447210 446448 446150 446262 446577 447096 447906 448899
$$ packed form
62993A403957K9510L0036L0853L1534L1563L0758K9532K8429K7327K5372K1823
62982A720694J6758J0906M941r81p250j4364k2258l0152l7305m3676m9408n3983
62970A493922n6546n7111n6662n5937n4695n2420m9183m5443m1530l7677l4203
62959I52515l1314k8940k6941k5240k3624k1827j9979j8561j7742j7121j6338
62948G04888j5512j4830j4222j3650j3350j3395j3426j3038j2195j1027r690q554
62936E51999p995p724o935n463m207l964m424m781m812m665m155l061j815j104
62922D86894r85j020j082j298j428j111o86r38j940k830k916k493k212k247k323
62907D61385k263k157k125k126j922j345o19k72n00q46p62k98J12L15N19Q10R93
$$ plain form
62890 448899 449780 450191 449757 448303 446177 444199 443106 443104 443867 444728 444995 444472 443767 443696 444304 444863 444814 444248 443386
62871 443386 442207 440828 439704 439092 438729 438334 437947 437490 436539 434963 433278 431950 430859 429964 429826 430740
62855 430740 431820 431906 431187 431016 432147 433949 435425 436233 436543 436544 436348 435914 434912 433094 430862 428963 427550
62838 427550 426085 424330 422772 421785 420965 419769 418418 417596 417483 417588 417495 417331 417402 417709 418044 418490 419531
62821 419531 421516 424081 426391 428056 429594 431803 434900 438527 442371 446402 450612 454955 459534 464484
62807 464484 469675 474879 480195 485923 492061 498360 504915 512230 520562 529693 539516 550347 562374 575174
62793 575174 588178 601360 615201 630260 647136 666607 689326 715368 744341 776080 811151
62782 811151 850747 896042 947446 1004376 1065886 1131581 1201671 1276181 1354503 1435827 1519423
$$ packed form
62890D48899Q81M11m34j454k126j978j093kP63Q61K67n23p05p1O08N59m9n66q62
62871D43386j179j379j124o12l63l95l87m57r51j576j685j328j091q95j38R14
62855D30740J080Q6p19j71J131J802J476Q08L10Jj96m34j002j818k232j899j413
62838D27550j465j755j558r87q20j196j351q22j13J05r3j64P1L07L35M46J041
62821D19531J985K565K310J665J538K209L097L627L844M031M210M343M579M950
62807D64484N191N204N316N728O138O299O555P315Q332R131R823J0831J2027J2800
62793E75174J3004J3182J3841J5059J6876J9471K2719K6042K8973L1739L5071
62782H11151L9596M5295N1404N6930O1510O5695P0090P4510P8322Q1324Q3596
$$ plain form
62771 1519423 1603974 1687040 1765765 1837991 1902195 1956495 1998463 2026196 2039159 2037801 2022791
62760 2022791 1994940 1955417 1905537 1846437 1779350 1706076 1628721 1548921 1467807 1386865 1308271
62749 1308271 1233868 1164075 1098345 1036521 979161 926586 878385 834240 794579 759792 729175
62738 729175 701369 675747 652762 632908 615903 601002 587632 575495 564499 554863 546970 540837
62726 540837 535905 531543 527615 524411 522277 521408 521780 523098 525053 527803 531937 537744 544765 552359 560517
62711 560517 569867 581000 594080 608975 625507 643715 664171 687994 716176 748836 785363 825271
62699 825271 868604 915484 965642 1018743 1074940 1134701 1198045 1264175 1331909 1400145 1467622
62688 1467622 1532409 1592054 1644371 1687829 1721160 1743023 1752420 1749254 1734070 1707403 1669769 1622280
$$ packed form
62771A519423Q4551Q3066P8725P2226O4204N4300M1968K7733J2963j358j5010
62760B022791k7851l9523m9880n9100o7087p3274p7355p9800q1114q0942p8594
62749A308271p4403o9793o5730o1824n7360n2575m8201m4145l9661l4787l0617
62738G29175k7806k5622k2985j9854j7005j4901j3370j2137j0996r636p893o133
62726E40837m932m362l928l204k134q69L72J318J955K750M134N807P021P594Q158
62711E60517R350J1133J3080J4895J6532J8208K0456K3823K8182L2660L6527L9908
62699H25271M3333M6880N0158N3101N6197N9761O3344O6130O7734O8236O7477
62688A467622O4787N9645N2317M3458L3331K1863R397l166j5184k6667l7634m7489
$$ plain form
62676 1622280 1566803 1505363 1439649 1371161 1301508 1232225 1164485 1099096 1036700 977887 923241
62665 923241 873272 828123 787334 750111 715906 684625 656370 631216 609138 589774 572283
62654 572283 555871 540550 526959 515368 505246 495887 486902 477958 468663 459118 450127 442406 435958
62641 435958 430528 426156 422782 419863 417043 414851 414062 414592 415728 417121 418738 420019 420135 419183 418150
62626 418150 417373 415980 413417 410686 409177 408750 407901 405758 403130 401499 401627 403423 406605 410920 415903
62611 415903 420956 425887 431121 437161 443967 451139 458636 466968 476544 487146 498362 510332 523722
62598 523722 539095 556736 577102 600907 628502 659449 692971 728617 766227 805476 845794
62587 845794 886616 927280 966509 1002326 1032746 1056584 1073476 1083299 1085830 1081022 1069316 1051460
$$ packed form
62676A622280n5477o1440o5714o8488o9653o9283o7740o5389o2396n8813n4646
62665I23241m9969m5149m0789l7223l4205l1281k8255k5154k2078j9364j7491
62654E72283j6412j5321j3591j1591j0122r359q985q944r295r545q991p721o448
62641D35958n430m372l374k919k820k192p89N30J136J393J617J281J16r52j033
62626D18150p77j393k563k731j509m27q49k143k628j631J28J796L182M315M983
62611D15903N053M931N234O040O806P172P497Q332R576J0602J1216J1970J3390
62598E23722J5373J7641K0366K3805K7595L0947L3522L5646L7610L9249M0318
62587H45794M0822M0664L9229L5817L0420K3838J6892R823K531m808j1706j7856
$$ plain form
62575 1051460 1028171 1000130 968169 933220 896135 857856 819654 782777 747732 714269 682238
62564 682238 652136 624592 599637 576872 556130 537603 521438 507529 495641 485480 476687 468950
62552 468950 462047 455658 449450 443584 438759 435291 432408 429093 425492 422848 421938 422222 422665 422854 422992
62537 422992 423249 423560 423899 424433 425401 426901 428703 430384 431902 433988 437585 442894 449317 456392 464286
62522 464286 473321 483481 494663 507022 520903 536839 555713 578372 604736 633791 664878 698503
62510 698503 735368 774966 815755 856506 896865 936652 975073 1010631 1041530 1066322 1084664
62499 1084664 1097289 1104855 1106971 1102854 1092739 1078025 1060124 1040006 1019009 999204 982341 968876
62487 968876 958556 951606 948813 950640 956879 967163 981425 999785 1022297 1048825 1078870 1111364
$$ packed form
62575A051460k3289k8041l1961l4949l7085l8279l8202l6877l5045l3463l2031
62564F82238l0102k7544k4955k2765k0742j8527j6165j3909j1888j0161q793p737
62552D68950o903o389o208n866m825l468k883l315l601k644r10K84M43J89J38
62537D22992K57L11L39N34R68J500J802J681J518K086L597N309O423P075P894
62522D64286R035J0160J1182J2359J3881J5936J8874K2659K6364K9055L1087L3625
62510F98503L6865L9598M0789M0751M0359L9787L8421L5558L0899K4792J8342
62499A084664J2625P566K116m117j0115j4714j7901k0118k0997j9805j6863j3465
62487I68876j0320o950k793J827O239J0284J4262J8360K2512K6528L0045L2494
$$ plain form
62475 1111364 1144770 1177340 1207071 1231594 1248717 1257510 1258702 1253678 1242991 1225923 1201309 1168703
62463 1168703 1128976 1084125 1036456 987574 938095 888494 840076 794621 752975 714564 678688
62452 678688 645802 617011 592631 572033 554838 541381 531657 524506 518433 512929 508478 505567 504212
62439 504212 504372 506170 509503 513786 518303 522660 526756 530497 533594 535531 535648 533468 529105 523273 516732
62424 516732 509698 501852 492912 483106 473070 463379 454307 445999 438635 432260 426588 421238 416171 411710
62410 411710 408097 405240 402891 400808 398637 395943 392626 389166 386252 384214 382967 382357 382361 382968 384018
62395 384018 385141 385914 386309 387053 389150 392711 396495 399045 400172 400928 402217 403975 405766 407643 410086
62380 410086 413414 417662 422884 429231 436709 445046 453885 463001 472355 482013 492043 502459 513299
$$ packed form
62475A111364L3406L2570K9731K4523J7123Q793J192n024j0687j7068k4614l2606
62463A168703l9727m4851m7669m8882m9479m9601m8418m5455m1646l8411l5876
62452F78688l2886k8791k4380k0598j7195j3457r724p151o073n504m451k911j355
62439E04212J60J798L333M283M517M357M096L741L097J937J17k180m363n832o541
62424E16732p034p846q940r806j0036r691r072q308p364o375n672n350n067m461
62410D11710l613k857k349k083k171k694l317l460k914k038j247o10MO07J050
62395C84018J123P73L95P44K097L561L784K550J127P56J289J758J791J877K443
62380D10086L328M248N222O347P478Q337Q839R116R354R658J0030J0416J0840
$$ plain form
62367 513299 524789 537359 551477 567480 585604 606118 629342 655559 684962 717732 754203
62356 754203 794855 840047 889637 942902 998826 1056333 1114081 1170068 1221766 1266946 1304483
62345 1304483 1334312 1356551 1370813 1376492 1373678 1363460 1347183 1325525 1298470 1266000 1228597 1187269
62333 1187269 1143533 1099310 1056364 1015620 977276 941584 909132 880287 854819 832319 812516
62322 812516 794806 777971 760920 743506 726136 708790 690945 672273 652900 633123 613454
62311 613454 594873 578382 564131 551439 539729 528938 519046 509835 501371 494129 488331 483631 479718
62298 479718 476764 474859 473515 472187 470936 470061 469409 468677 468207 468788 470592 472860 474800 476374 478028
62283 478028 480015 482306 484895 487888 491320 495152 499431 504225 509313 514116 518150 521579 525211 529894
$$ packed form
62367E13299J1490J2570J4118J6003J8124K0514K3224K6217K9403L2770L6471
62356G54203M0652M5192M9590N3265N5924N7507N7748N5987N1698M5180L7537
62345A304483K9829K2239J4262N679k814j0218j6277k1658k7055l2470l7403m1328
62333A187269m3736m4223m2946m0744l8344l5692l2452k8845k5468k2500j9803
62322H12516j7710j6835j7051j7414j7370j7346j7845j8672j9373j9777j9669
62311F13454j8581j6491j4251j2692j1710j0791r892r211q464p242n798m700l913
62298D79718k954j905j344j328j251q75o52p32m70N81J804K268J940J574J654
62283D78028J987K291K589K993L432L832M279M794N088M803M034L429L632M683
$$ plain form
62269 529894 536073 543859 553201 563740 574886 586615 600119 617104 638280 663043 690830 722252
62257 722252 758484 799973 846304 897023 951895 1010364 1071329 1133535 1195673 1255842 1311402
62246 1311402 1359792 1399508 1430191 1451986 1465068 1469603 1465816 1453950 1434263 1407153 1373272 1333486
62234 1333486 1288802 1240405 1189773 1138619 1088548 1040772 996176 955479 918995 886235 856147
62223 856147 828129 802650 780608 762117 746094 731051 716114 701333 687191 673909 661135
62212 661135 648304 635295 622595 610751 599818 589518 579731 570559 562030 554121 547104 541510 537567
62199 537567 534894 532934 531548 531056 531769 533614 536195 539151 542530 546880 552898 560871 570377 580495
62185 580495 590387 599783 609058 618819 629330 640293 651098 661167 670083 677671 684187 690323 696819
$$ packed form
62269E29894O179P786R342J0539J1146J1729J3504J6985K1176K4763K7787L1422
62257G22252L6232M1489M6331N0719N4872N8469O0965O2206O2138O0169N5560
62246A311402M8390L9716L0683K1795J3082M535l787j1866j9687k7110l3881l9786
62234A333486m4684m8397n0632n1154n0071m7776m4596m0697l6484l2760l0088
62223H56147k8018k5479k2042j8491j6023j5043j4937j4781j4142j3282j2774
62212F61135j2831j3009j2700j1844j0933j0300r787r172q529p909p017n594l943
62199E37567k673j960j386m92P13J845K581K956L379M350O018P973R506J0118
62185E80495R892R396R275R761J0511J0963J0805J0069Q916P588O516O136O496
$$ plain form
62172 696819 704147 712648 722729 734679 748540 764588 783821 807407 835584 867602 902873 941536
62160 941536 983440 1027034 1069820 1109742 1145584 1176214 1200250 1216827 1226277 1229598 1227417 1219727
62148 1219727 1206472 1188020 1164964 1137695 1106358 1071305 1033608 995114 957820 923017 891010
62137 891010 861666 835154 812013 792580 776593 763436 752638 744055 737669 733288 730372 728108
62125 728108 725863 723678 722235 722172 723584 726320 730585 736830 745068 754604 764441 773682 781530 787417 791376
62110 791376 793925 795305 795101 792959 789382 785334 781169 776398 770480 763452 755788 748045 740769 734371
62096 734371 728916 724311 720843 719219 719913 722679 726888 732072 737961 744287 750915 757967 765455 772919
62082 772919 779832 786369 793336 801206 809613 818107 827193 838198 852129 868875 887515 907039 926660
$$ packed form
62172F96819P328Q501J0081J1950J3861J6048J9233K3586K8177L2018L5271L8663
62160I41536M1904M3594M2786L9922L5842L0630K4036J6577R450L321k181p690
62148A219727j3255j8452k3056k7269l1337l5053l7697l8494l7294l4803l2007
62137H91010k9344k6512k3141j9433j5987j3157j0798q583o386m381k916k264
62125G28108k245k185j443o3J412K736M265O245Q238R536R837R241P848N887L959
62110G91376K549J380k04k142l577m048m165m771n918p028p664p743p276o398
62096G34371n455m605l468j624O94K766M209N184N889O326O628P052P488P464
62082G72919O913O537O967P870Q407Q494R086J1005J3931J6746J8640J9524J9621
$$ plain form
62069 926660 945882 964789 984253 1005342 1028280 1052268 1076529 1101260 1127228 1154607 1182636
62058 1182636 1210249 1236452 1259952 1279078 1292673 1300897 1304692 1304479 1299774 1290068 1275650 1257267
62046 1257267 1235271 1209395 1179284 1144983 1107011 1066281 1024019 981490 939554 898541 858656
62035 858656 820385 784368 750979 720197 691814 665636 641581 619817 600781 584827 571844
62024 571844 561342 552812 545711 539174 532216 524452 516372 508765 502127 496660 492379 488930 485680 482464
62010 482464 479986 479058 479654 481123 483104 485685 488738 491724 494317 496781 499600 503080 507398 512592 518238
61995 518238 523451 527460 530046 531347 531461 530358 527985 524279 519205 512851 505396 497055 488229 479544
61981 479544 471399 463549 455514 447347 439619 432683 426427 420728 415590 410773 405901 401154 397261 394527
$$ packed form
62069I26660J9222J8907J9464K1089K2938K3988K4261K4731K5968K7379K8029
62058A182636K7613K6203K3500J9126J3595Q224L795k13m705r706j4418j8383
62046A257267k1996k5876l0111l4301l7972m0730m2262m2529m1936m1013l9885
62035H58656l8271l6017l3389l0782k8383k6178k4055k1764j9036j5954j2983
62024E71844j0502q530p101o537o958p764q080p607o638n467m281l449l250l216
62010D82464k478r28N96J469J981K581L053K986K593K464K819L480M318N194N646
61995E18238N213M009K586J301J14j103k373l706n074o354p455q341q826q685
61981D79544q145p850q035q167p728o936o256n699n138m817m872m747l893k734
$$ plain form
61967 394527 392422 390478 388999 388462 388743 389453 390576 392174 393816 395017 396013 397521 399779 402325 404608
61952 404608 406457 408150 410423 414173 419576 425712 431573 437301 443863 451750 460610 470067 480193 491130
61938 491130 502904 515687 529650 544489 559649 575055 591015 607327 623170 637986 651791
61927 651791 664444 675398 684516 692318 698894 703225 704288 702385 698702 693921 687966 680891 673300 665918
61913 665918 659363 654335 651476 650917 652420 656107 662681 672680 685665 700307 715165 729367 742644
61900 742644 754803 765239 773065 777724 779224 777727 773187 765664 755715 744121 731308 717386 702698
61887 702698 687981 673956 660992 649176 638452 628648 619570 611162 603402 596071 588762 581183 573301
61874 573301 565227 557163 549508 542812 537478 533529 530697 528702 527426 526943 527411 528929 531515 535225 540186
$$ packed form
61967C94527k105j944j479n37K81P10J123J598J642J201R96J508K258K546K283
61952D04608J849J693K273L750N403O136N861N728O562P887Q860R457J0126J0937
61938D91130J1774J2783J3963J4839J5160J5406J5960J6312J5843J4816J3805
61927F51791J2653J0954R118P802O576M331J063j903l683m781n955p075p591p382
61913F65918o555n028k859n59J503L687O574R999J2985J4642J4858J4202J3277
61900G42644J2159J0436P826M659J500j497m540p523r949j1594j2813j3922j4688
61887G02698j4717j4025j2964j1816j0724r804r078q408p760p331p309p579p882
61874E73301q074q064p655o696n334l949k832j995j276m83M68J518K586L710M961
$$ plain form
61859 540186 546441 553805 562027 571104 581454 593774 608667 626226 645876 666732 688207 710274
61847 710274 733212 757314 782833 809783 837419 864131 888235 908915 926166 939930 949665 954812
61835 954812 955310 951424 943417 931793 917864 903702 891241 881404 874177 869420 867436 868697 873297
61822 873297 880890 891010 903058 915905 927847 937196 942919 944613 941993 934557 921775 903659 881196
61809 881196 855991 829231 801109 771649 741938 713935 688923 666722 646692 628862 613578
61798 613578 600602 589229 579006 569698 560814 551952 543510 536302 530419 525175 520267 516184 513188
61785 513188 510648 507919 505306 503563 502790 502389 501823 500842 499135 496436 493040 489683 486762 484062 481394
61770 481394 479081 477518 476542 475652 474711 474052 473822 473653 473189 472659 472592 473101 473864 474784 476217 478367 480848
$$ packed form
61859E40186O255P364Q222R077J0350J2320J4893J7559J9650K0856K1475K2067
61847G10274K2938K4102K5519K6950K7636K6712K4104K0680J7251J3764R735N147
61835I54812M98l886q007j1624j3929j4162j2461r837p227m757j984J261M600
61822H73297P593J0120J2048J2847J1942R349N723J694k620p436j2782j8116k2463
61809H81196k5205k6760k8122k9460k9711k8003k5012k2201k0030j7830j5284
61798F13578j2976j1373j0223r308q884q862q442p208n883n244m908m083k996
61785E13188k540k729k613j743p73m01n66r81j707k699l396l357k921k700k668
61770D81394k313j563r76q90r41o59k30j69m64n30o7N09P63R20J433K150K481
$$ plain form
61753 480848 483114 485003 486539 487502 487653 487260 486917 486846 486675 485849 483958 480883 477095 473646 471221 469239
61737 469239 466575 463263 460705 459929 460401 461019 461479 461928 461955 461016 459665 459341 460768 463336 466175 469051
61721 469051 471895 474309 476184 478295 481491 485460 488972 491355 493097 494863 496502 497448 497655 497520 497089
61706 497089 495960 494090 492078 490340 488471 485928 482949 480190 477585 474356 470268 466148 462776 459727
61692 459727 455900 450928 445584 440889 437237 434396 431907 429311 426227 422505 418428 414668 411847 409915
61678 409915 408073 405567 402552 399822 397712 395804 393822 392193 391261 390459 388936 386742 384767 383589 382990
61663 382990 382617 382496 382758 383267 383728 383929 383876 383918 384649 386289 388272 389831 390955 392289 394168 396317 398501
61646 398501 400775 402944 404542 405694 407351 410104 413269 415712 417221 418494 420036 421679 423005 423711
$$ packed form
61753D80848K266J889J536R63J51l93l43p1j71q26j891l075l788l449k425j982
61737D69239k664l312k558p76M72O18M60M49K7r39j351l24J427K568K839K876
61721D69051K844K414J875K111L196L969L512K383J742J766J639R46K07j35m31
61706D97089j129j870k012j738j869k543k979k759k605l229m088m120l372l049
61692D59727l827m972n344m695l652k841k489k596l084l722m077l760k821j932
61678D09915j842k506l015k730k110j908j982j629r32q02j523k194j975j178n99
61663C82990l73j21K62N09M61K01n3M2P31J640J983J559J124J334J879K149K184
61646C98501K274K169J598J152J657K753L165K443J509J273J542J643J326P06
$$ plain form
61632 423711 423605 422712 421343 419656 417258 413700 409290 404863 400771 396700 392638 389374 387634 387098 386701
61617 386701 385777 384521 383465 382847 382545 382325 381988 381357 380200 378217 375153 371009 366128 361024 356106 351551
61601 351551 347376 343501 339724 335779 331564 327341 323561 320399 317558 314648 311651 308896 306671 305080
61587 305080 304166 303841 303676 303133 302129 301062 300150 299111 297687 296134 294841 293788 292784 291941 291435 290988
61571 290988 290142 288943 287846 287020 286360 286120 286814 288232 289289 289292 288886 289249 290750 292869 295093 297265 299205
61554 299205 300641 301599 302435 303327 304041 304323 304239 304066 304031 304286 304913 305889 307134 308604 310250 311885 313306
61537 313306 314534 315795 317214 318702 320124 321448 322729 324040 325334 326299 326533 326113 325780 326121 326679 326395
61521 326395 325039 323610 323023 322885 322060 320111 317663 315544 314157 313673 314208 315500 316802 317410 317152 316254
$$ packed form
61632D23711j06q93j369j687k398l558m410m427m092m071m062l264j740n36l97
61617C86701r24j256j056o18l02k20l37o31j157j983l064m144m881n104m918m555
61601C51551m175l875l777l945m215m223l780l162k841k910k997k755k225j591
61587C05080r14l25j65n43j004j067r12j039j424j553j293j053j004q43n06m47
61571B90988q46j199j097q26o60k40O94J418J057Lm06L63J501K119K224K172J940
61554B99205J436R58Q36Q92P14K82q4j73l5K55O27R76J245J470J646J635J421
61537C13306J228J261J419J488J422J324J281J311J294R65K34m20l33L41N58k84
61521C26395j356j429n87j38q25j949k448k119j387m84N35J292J302O08k58q98
$$ plain form
61505 316254 315001 313719 312784 312272 311733 310653 309116 307698 306746 306146 305833 306069 306954 308000 308658 309074 309829
61488 309829 310986 311897 312132 312103 312419 312975 313181 312921 312775 313246 314232 315387 316637 318086 319689 321258 322666
61471 322666 323906 325061 326325 327799 329110 329531 328840 327823 327491 327895 328155 327701 327001 326888 327581 328673
61455 328673 329799 330865 331814 332593 333375 334435 335673 336546 336704 336478 336500 336974 337571 338053 338668 339858 341755
61438 341755 344100 346513 348722 350664 352590 354961 358036 361596 365222 368721 372018 374722 376299 376802
61424 376802 377038 377743 378873 379994 381063 382469 384473 387006 389876 392752 395058 396373 396959 397486 398141
61409 398141 398392 397735 396337 394807 393618 392846 392149 390906 388700 385817 382936 380336 377887 375824 374753
61394 374753 374533 373868 371750 368803 366474 365251 364504 363815 363459 363497 363369 362706 361879 361364 361137 361064 361350 362214
$$ packed form
61505C16254j253j282r35n12n39j080j537j418r52o00l13K36Q85J046O58M16P55
61488C09829J157R11K35k9L16N56K06k60j46M71R86J155J250J449J603J569J408
61471C22666J240J155J264J474J311M21o91j017l32M04K60m54p00j13O93J092
61455C28673J126J066R49P79P82J060J238Q73J58k26K2M74N97M82O15J190J897
61438C41755K345K413K209J942J926K371L075L560L626L499L297K704J577N03
61424C76802K36P05J130J121J069J406K004K533K870K876K306J315N86N27O55
61409C98141K51o57j398j530j189p72o97j243k206k883k881k600k449k063j071
61394C74753k20o65k118k947k329j223p47o89l56L8j28o63q27n15k27p3K86Q64
$$ plain form
61376 362214 363491 364960 366652 368426 369725 370272 370733 372050 374258 376499 378199 379666 381476 383758 386305
61361 386305 389027 391975 395075 398069 400777 403326 406080 409318 413001 416930 421101 425715 430875 436524
61347 436524 442752 449779 457395 464751 471050 476286 481001 485610 490308 495329 500675 505733 509759 512788
61333 512788 515450 517909 519638 520511 521334 522761 524153 524169 522323 519463 516768 514714 513059 511437 509826
61318 509826 508547 507897 507840 508171 508977 510631 513260 516607 520679 526097 533267 541448 549259 556137 562790
61303 562790 570148 578391 587132 596000 604652 612598 619427 625044 629381 632003 632376 630428 626584 621268
61289 621268 614716 607308 599727 592559 585855 579246 572421 565398 558437 551892 546140 541484 538034 535709
61275 535709 534361 533859 534091 535021 536794 539581 543188 546978 550418 553577 556833 560196 563314 566173 569293
$$ packed form
61376C62214J277J469J692J774J299N47M61J317K208K241J700J467J810K282K547
61361C86305K722K948L100K994K708K549K754L238L683L929M171M614N160N649
61347D36524O228P027P616P356O299N236M715M609M698N021N346N058M026L029
61333E12788K662K459J729Q73Q23J427J392J6j846k860k695k054j655j622j611
61318E09826j279o50n7L31Q06J654K629L347M072N418P170Q181P811O878O653
61303E62790P358Q243Q741Q868Q652P946O829N617M337K622L73j948l844n316
61289F21268o552p408p581p168o704o609o825p023o961o545n752m656l450k325
61275E35709j348n02K32R30J773K787L607L790L440L159L256L363L118K859L120
$$ plain form
61260 569293 573082 577425 582258 588029 595067 602782 610169 617034 624043 631488 638662 644663 649292 652826
61246 652826 655411 657114 658206 658876 658840 657605 655048 651375 646725 641237 635501 630503 626899 624469 622325
61231 622325 619648 616390 613359 611493 610896 610804 610657 610893 612383 615412 619641 624781 630743 637265 644063
61216 644063 651315 659361 667769 675347 681383 686367 691185 696010 700311 703620 705880 707369 708629 710305
61202 710305 712712 715690 719076 723088 728063 734125 741373 750051 760151 771142 782523 794439 807245
61189 807245 820608 833509 845116 855233 863938 871195 876872 880822 882915 883372 883024 882817 882917 882648
61175 882648 881326 878841 875376 871004 865804 860015 853812 847064 839504 830960 821392 810873 799648 787955
61161 787955 775779 763013 749984 737478 726042 715456 705062 694459 683836 673895 665519 659153
$$ packed form
61260E69293L789M343M833N771P038P715P387O865P009P445P174O001M629L534
61246F52826K585J703J092O70l6j235k557l673m650n488n736m998l604k430k144
61231F22325k677l258l031j866n97r2j47K36J490L029M229N140N962O522O798
61216F44063P252Q046Q408P578O036M984M818M825M301L309K260J489J260J676
61202G10305K407K978L386M012M975O062P248Q678J0100J0991J1381J1916J2806
61189H07245J3363J2901J1607J0117Q705P257N677L950K093M57l48k07J00k69
61175H82648j322k485l465m372n200n789o203o748p560q544r568j0519j1225j1693
61161G87955j2176j2766j3029j2506j1436j0586j0394j0603j0623r941q376o366
$$ plain form
61149 659153 654297 649865 645242 640747 636909 633651 630513 627301 624093 620810 617241 613442 609752 606390
61135 606390 603330 600546 598146 596312 595369 595822 598030 601821 606648 612107 618097 624669 632079 640990 652176
61120 652176 665834 681422 698292 716314 735851 757355 780991 806342 832357 857951 882908
61109 882908 907986 933859 960098 985417 1008824 1030240 1050005 1068056 1083752 1096381 1105624 1111519
61097 1111519 1114137 1113474 1109667 1103162 1094467 1083727 1070585 1054506 1035248 1013163 989177 964440
61085 964440 939853 915845 892544 869994 848170 827007 806675 787691 770461 754734 739880
61074 739880 725765 713036 702378 693757 686630 680673 675999 672743 670764 669780 669613 670279 671973 674948
61060 674948 679204 684228 689225 693813 698458 704124 711532 720877 732187 745612 761075 777814 794721
$$ packed form
61149F59153m856m432m623m495l838l258l138l212l208l283l569l799l690l362
61135F06390l060k784k400j834r43M53K208L791M827N459N990O572P410Q911J1186
61120F52176J3658J5588J6870J8022J9537K1504K3636K5351K6015K5594K4957
61109H82908K5078K5873K6239K5319K3407K1416J9765J8051J5696J2629R243N895
61097A111519K618o63l807o505q695j0740j3142j6079j9258k2085k3986k4737
61085I64440k4587k4008k3301k2550k1824k1163k0332j8984j7230j5727j4854
61074G39880j4115j2729j0658q621p127n957m674l256j979r84j67O66J694K975
61060F74948M256N024M997M588M645N666P408R345J1310J3425J5463J6739J6907
$$ plain form
61047 794721 811385 828573 847519 868851 892361 917547 944066 971766 1000817 1031875 1065752
61036 1065752 1102656 1141957 1182861 1225094 1268788 1313977 1360562 1408646 1458570 1510611 1564831
61025 1564831 1621184 1679562 1739801 1801938 1866546 1934641 2007260 2085399 2170482 2264600 2369977
61014 2369977 2488235 2620465 2768277 2934875 3125325 3346060 3604446 3909001 4269986
61005 4269986 4699470 5210573 5816822 6532639 7374374 8360019 9507084 10829796 12335311
60996 12335311 14015094 15829313 17691968 19473148 21028680 22246879 23086184 23582544
60988 23582544 23826704 23927547 23976368 24017761 24031027 23931511 23599817 22931510 21882890 20488045
60978 20488045 18841594 17063014 15264377 13532813 11926105 10475463 9191679 8072458
$$ packed form
61047G94721J6664J7188J8946K1332K3510K5186K6519K7700K9051L1058L3877
61036A065752L6904L9301M0904M2233M3694M5189M6585M8084M9924N2041N4220
61025A564831N6353N8378O0239O2137O4608O8095P2619P8139Q5083R4118J05377
61014B369977J18258J32230J47812J66598J90450K20735K58386L04555L60985
61005D269986M29484N11103O06249P15817Q41735R85645J147065J322712J505515
60996A2335311J679783J814219J862655J781180J555532J218199Q39305M96360
60988B3582544K44160J00843M8821M1393J3266r9516l31694o68307j048620j394845
60978B0488045j646451j778580j798637j731564j606708j450642j283784j119221
$$ plain form
60970 8072458 7108456 6286617 5591806 5008270 4520741 4114493 3775200 3489836 3247969
60961 3247969 3041864 2865508 2714011 2583670 2471627 2375060 2291108 2217701 2153833 2098738
60951 2098738 2051175 2009645 1972656 1938413 1904823 1870409 1834958 1798883 1762234 1724765 1686597
60940 1686597 1648159 1609539 1570342 1530200 1489083 1447182 1404810 1362402 1320340 1278845 1238197
60929 1238197 1198811 1160815 1123776 1087358 1052089 1018985 988487 960196 933609 908626 885268
60918 885268 863377 842735 823178 804569 787024 771158 757582 746061 735659 725888 717186 710010
60906 710010 703990 698456 693416 689462 686837 685115 683702 682249 680543 678483 676258 674261 672579 670779
60892 670779 668354 665283 661966 658678 655306 651675 647924 644328 640796 636804 631897 626034 619403 612164
$$ packed form
60970H072458r64002q21839o94811n83536m87529m06248l39293k85364k41867
60961C247969k06105j76356j51497j30341j12043r6567q3952p3407o3868n5095
60951B098738m7563m1530l6989l4243l3590l4414l5451l6075l6649l7469l8168
60940A686597l8438l8620l9197m0142m1117m1901m2372m2408m2062m1495m0648
60929A238197l9386l7996l7039l6418l5269l3104l0498k8291k6587k4983k3358
60918H85268k1891k0642j9557j8609j7545j5866j3576j1521j0402r771q702p176
60906G10010o020n534n040l954k625j722j413j453j706k060k225j997j682j800
60892F70779k425l071l317l288l372l631l751l596l532l992m907n863o631p239
$$ plain form
60878 612164 604607 597265 590512 584184 577943 571805 565908 559966 553575 547024 541101 535947 530812 525232
60864 525232 519739 514961 510712 506686 503572 502488 503426 505034 506031 506151 505624 504458 502632 500512 498626
60849 498626 497186 496024 494824 493280 491251 488913 486584 484366 482209 480284 478849 477611 475691 472554
60835 472554 468642 464782 461282 457997 454951 452359 450199 448324 446994 446759 447650 448884 449637 449814 449886 450261
60819 450261 451070 452347 453989 455530 456273 455845 454548 453116 452114 451540 450969 450038 448784 447466 446176 444787
60803 444787 443245 441641 439916 437753 435002 432010 429263 426806 424348 421867 419693 417864 415792 412893
60789 412893 409331 405806 402664 399510 395737 391239 386541 382358 379097 376727 375091 374275 374433 375207 375620
60774 375620 374912 373356 371840 370742 369754 368876 368914 370512 373152 375743 378025 380714 384277 388213 391782
$$ packed form
60878F12164p557p342o753o328o241o138n897n942o391o551n923n154n135n580
60864E25232n493m778m249m026l114j084R38J608R97J20n27j166j826k120j886
60849D98626j440j162j200j544k029k338k329k218k157j925j435j238j920l137
60835D72554l912l860l500l285l046k592k160j875j330k35Q91J234P53J77P2L75
60819D50261Q09J277J642J541P43m28j297j432j002n74n71r31j254j318j290j389
60803D44787j542j604j725k163k751k992k747k457k458k481k174j829k072k899
60789D12893l562l525l142l154l773m498m698m183l261k370j636q16J58P74M13
60774C75620p08j556j516j098r88q78L8J598K640K591K282K689L563L936L569
$$ plain form
60759 391782 394877 397805 400631 403254 405883 408871 412082 414825 416507 417103 417038 416964 417593 419227 421255 422534
60743 422534 422565 421946 421341 420383 418140 414447 410146 405939 401575 396417 390351 383809 377242 370961 365316
60728 365316 360600 356759 353432 350281 347151 344042 341174 338992 337792 337299 336870 336147 335313 334696 334409 334408
60712 334408 334565 334512 333788 332470 331399 331349 332031 332416 332104 331872 332638 334290 336001 337364 338580 339598 339914
60695 339914 339571 339702 341420 344457 347579 350193 352875 356309 360428 364796 369134 373102 376219 378611 381388
60680 381388 385580 390904 396162 400712 405004 409729 415048 420653 425994 430399 433473 435520 437127 438290
60666 438290 438374 437032 434604 431497 427663 422942 417427 411312 404901 399022 394849 392829 392212 392000 391934 392100
60650 392100 392109 391440 390383 389906 390610 392312 394551 396922 398857 399680 399102 397375 394872 391843 388589 385541
$$ packed form
60759C91782L095K928K826K623K629K988L211K743J682N96o5p4O29J634K028J279
60743D22534L1o19o05r58k243l693m301m207m364n158o066o542o567o281n645
60728C65316m716l841l327l151l130l109k868k182j200m93m29p23q34o17k87j
60712C34408J57n3p24j318j071n0O82L85l12k32P66J652J711J363J216J018L16
60695C39914l43J31J718L037L122K614K682L434M119M368M338L968L117K392K777
60680C81388M192N324N258M550M292M725N319N605N341M405L074K047J607J163
60666D38290Q4j342k428l107l834m721n515o115o411n879m173k020o17k12o6J66
60650C92100Ro69j057m77P04J702K239K371J935Q23n78j727k503l029l254l048
$$ plain form
60634 385541 382989 380965 379434 378411 377886 377802 377992 377991 377147 375316 373287 372058 371798 371925 372010 372065 372024 371723
60616 371723 371437 371710 372362 372426 371468 370334 370055 370580 371238 372008 373441 375433 376940 377130 376308 375438 375082 375056
60598 375056 374919 374581 374405 374756 375458 375913 375912 376116 377399 379800 382454 384502 385737 386362 386562 386558 386696 387136
60580 387136 387569 387563 387176 386979 387433 388459 389745 391368 393932 398070 403915 411084 419045 427404 435928 444594
60564 444594 453637 463388 473845 484450 494363 502894 509558 513796 514954 512752 507849 501797 496239 491946
60550 491946 488619 485677 483149 481614 481391 482110 483258 484930 487750 492131 497861 504471 511813 520170 529903
60535 529903 541114 553674 567437 582237 597528 612115 624497 633640 639361 641988 641850 639225 634633
60522 634633 628851 622576 616163 609723 603392 597407 592004 587378 583817 581712 581150 581457 581466 580590 579544 579719
$$ packed form
60634C85541k552k024j531j023n25q4J90jq44j831k029j229k60J27Q5N5m1l01
60616C71723k86K73O52O4r58j134k79N25O58P70J433J992J507J90q22q70l56k6
60598C75056j37l38j76L51P02M55jK04J283K401K654K048J235O25K00mJ38M40
60580C87136M33ol87j97M54J026J286J623K564M138N845P169P961Q359Q524Q666
60564D44594R043R751J0457J0605R913Q531O664M238J158k202m903o052n558m293
60550D91946l327k942k528j535k23P19J148J672K820M381N730O610P342Q357R733
60535E29903J1211J2560J3763J4800J5291J4587J2382R143N721K627j38k625m592
60522F34633n782o275o413o440o331n985n403m626l561k105n62L07Rq76j046J75
$$ plain form
60506 579719 581885 585826 591177 598132 607131 618307 631623 647337 666008 688142 714029 743717
60494 743717 776755 812106 848620 885584 922565 958821 993176 1024395 1051307 1072541 1086550
60483 1086550 1092190 1089185 1078013 1059537 1034771 1004759 970500 933042 893685 853931 815136 778201
60471 778201 743516 711094 680797 652638 626805 603322 581789 561742 543254 526894 513060
60460 513060 501555 491847 483484 476173 469680 463803 458385 453335 448731 444754 441355 438107 434710 431520
60446 431520 429118 427389 425577 423379 421395 420217 419595 418946 418213 417590 416744 415040 412527 410050 408298
60431 408298 407206 406430 405851 405411 404870 404104 403446 403382 404028 405029 405908 406364 406425 406391 406541 406757 406693 406412 406580
60412 406580 407706 409420 410882 411798 412587 413573 414530 415228 416013 417422 419430 421457 423038 424124 424839 425356
$$ packed form
60506E79719K166L941N351O955Q999J1176J3316J5714J8671K2134K5887K9688
60494G43717L3038L5351L6514L6964L6981L6256L4355L1219K6912K1234J4009
60483A086550N640l005j1172j8476k4766l0012l4259l7458l9357l9754l8795l6935
60471G78201l4685l2422l0297k8159k5833k3483k1533k0047j8488j6360j3834
60460E13060j1505r708q363p311o493n877n418n050m604l977l399l248l397l190
60446D31520k402j729j812k198j984j178o22o49p33o23q46j704k513k477j752
60431D08298j092p76n79m40n41p66o58o4O46J001Q79M56O1l4J50K16o4k81J68
60412D06580J126J714J462R16P89R86R57O98P85J409K008K027J581J086P15N17
$$ plain form
60396 425356 426089 427509 429522 431351 432432 433196 434614 437094 440228 443535 446911 450252 453161 455399 457320
60381 457320 459486 461999 464496 466696 468650 470555 472633 475125 478059 481024 483544 485758 488364 491668
60367 491668 494961 497151 497925 498027 498476 499711 501456 503184 504658 506182 508426 511954 516823 522680 529235
60352 529235 536573 544924 554253 564233 574731 586073 598518 611316 622566 630328 633967 634243 632207
60339 632207 628295 622526 615113 606530 597205 587502 577906 568861 560435 552487 545232 539286 534950 531690
60325 531690 528552 524989 521092 517160 513316 509614 506294 503753 502271 501808 502102 502956 504392 506525 509454
60310 509454 513386 518765 526082 535623 547596 562347 580027 600023 621160 642671 664465 686066
60298 686066 705693 720961 730320 733340 729794 719354 702444 680896 657327 634039 612575 593792
$$ packed form
60396D25356P33J420K013J829J081P64J418K480L134L307L376L341K909K238J921
60381D57320K166K513K497K200J954J905K078K492K934K965K520K214K606L304
60367D91668L293K190P74J02M49J235J745J728J474J524K244L528M869N857O555
60352E29235P338Q351R329R980J0498J1342J2445J2798J1250P762L639K76k036
60339F32207l912n769p413q583r325r703r596r045q426p948p255n946m336l260
60325E31690l138l563l897l932l844l702l320k541j482m63K94Q54J436K133K929
60310E09454L932N379P317R541J1973J4751J7680J9996K1137K1511K1794K1601
60298F86066J9627J5268R359L020l546j0440j6910k1548k3569k3288k1464j8783
$$ plain form
60286 593792 577836 564240 552455 542388 534270 528120 523480 519602 515788 511692 507524 503826 500859
60273 500859 498224 495213 491471 487210 482924 479055 475844 473270 471140 469286 467659 466228 464957 463872
60259 463872 462928 461772 459998 457803 456008 455115 454651 453851 452791 452376 453275 455300 457789 460174 462109 463448
60243 463448 464313 465024 465857 466946 468286 469616 470410 470307 469506 468516 467639 467081 467297 468711 471043 473485 475684
60226 475684 478077 481085 484444 487557 490128 492183 493834 495273 496726 498216 499690 501519 504409 508559
60212 508559 513338 518148 523156 528772 534846 540983 547347 554442 562147 569556 575853 580950 585257 589244
60198 589244 593294 597600 602073 606505 610735 614419 616801 617252 616093 614481 613317 612510 611356 609290 606211
60183 606211 602452 598614 595213 592268 589325 585920 581919 577458 572815 568278 563832 558984 553359 547567
$$ packed form
60286E93792j5956j3596j1785j0067q118o150m640l878l814m096m168l698k967
60273E00859k635l011l742m261m286l869l211k574k130j854j627j431j271j085
60259D63872r44j156j774k195j795q93m64q00j060m15Q99K025K489K385J935J339
60243D63448Q65P11Q33J089J340J330P94j03q01r90q77n58K16J414K332K442K199
60226D75684K393L008L359L113K571K055J651J439J453J490J474J829K890M150
60212E08559M779M810N008N616O074O137O364P095P705P409O297N097M307L987
60198E89244M050M306M473M432M230L684K382M51j159j612j164q07j154k066l079
60183F06211l759l838l401k945k943l405m001m461m643m537m446m848n625n792
$$ plain form
60169 547567 543023 540610 539806 539381 538673 537794 536892 535777 534348 532995 532312 532526 533341 534237 534788 534791 534356 534001
60151 534001 534457 535992 537901 539016 538991 538824 539779 541986 544549 546892 549461 552922 557257 561991 566936
60136 566936 572229 577802 583263 588362 593249 598207 603271 608205 612687 616514 619681 622290 624367 625779
60122 625779 626423 626529 626695 627548 629263 631369 633125 634193 634935 636019 637810 640185 642775 645155 646890
60107 646890 647721 647738 647213 646255 644820 642965 640769 638045 634529 630439 626501 623224 620445 617703 614724
60092 614724 611488 608240 605746 605047 606486 609200 611935 614123 615839 617060 617667 618018 618826 620295 621791
60077 621791 622502 622037 620344 617480 613699 609378 604636 599269 593259 587022 581019 575321 569805 564477 559347
60062 559347 554164 548642 542951 537721 533482 530123 526891 522991 518358 513851 510458 508256 506402 504245
$$ packed form
60169E47567m544k413q04m25p08q79r02j115j429j353o83K14Q15Q96N51Lm35l55
60151E34001M56J535J909J115k5j67R55K207K563K343K569L461M335M734M945
60136E66936N293N573N461N099M887M958N064M934M482L827L167K609K077J412
60122F25779O44J06J66Q53J715K106J756J068P42J084J791K375K590K380J735
60107F46890Q31J7n25r58j435j855k196k724l516m090l938l277k779k742k979
60092F14724l236l248k494o99J439K714K735K188J716J221O07L51Q08J469J496
60077F21791P11m65j693k864l781m321m742n367o010o237o003n698n516n328n130
60062E59347n183n522n691n230m239l359l232l900m633m507l393k202j854k157
$$ plain form
60048 504245 502180 501196 501864 504017 507165 510893 514973 519494 524799 530957 537317 542961 547609 551724 555669
60033 555669 559156 561702 563264 564165 564569 564284 562905 560046 555670 550401 545233 540601 535960 530609 524688
60018 524688 518881 513332 507491 501143 494956 489673 485174 480711 475804 470578 465494 461101 457782 455256
60004 455256 452501 448684 444229 440504 438408 437621 437298 437000 436793 436861 437341 438279 439408 440195 440417 440568 441452
59987 441452 443451 446386 449900 453669 457379 460900 464465 468326 472128 474929 476007 475488 474057 472230
59973 472230 470079 467556 464814 462158 459799 457745 455899 454131 452253 450118 447881 446123 445477 446006 447099
59958 447099 448052 448643 449057 449468 449895 450363 450876 451258 451238 450790 450217 449804 449533 449238 448945 448949 449542 450735 452274
59939 452274 453873 455361 456537 457032 456522 455161 453600 452460 451893 451750 451993 452718 453922 455503 457446 459849
$$ packed form
60048E04245k065r84O68K153L148L728M080M521N305O158O360N644M648M115L945
60033E55669L487K546J562R01M04k85j379k859m376n269n168m632m641n351n921
60018E24688n807n549n841o348o187n283m499m463m907n226n084m393l319k526
60004D55256k755l817m455l725k096p87l23k98k07O8M80R38J129P87K22J51Q84
59987D41452J999K935L514L769L710L521L565L861L802K801J078n19j431j827
59973D72230k151k523k742k656k359k054j846j768j878k135k237j758o46N29J093
59958D47099R53N91M14M11M27M68N13L82k0m48n73m13k71k95k93MN93J193J539
59939D52274J599J488J176M95n10j361j561j140n67j43K43P25J204J581J943K403
$$ plain form
59923 459849 462800 466413 470902 476330 482302 488177 493696 499217 505262 511960 518937 525544 531138 535340
59909 535340 538196 539970 540800 540681 539821 538810 538248 538260 538396 538006 536769 535047 533670 533169 533200 532925 532017
59892 532017 531052 530833 531614 533115 535078 537613 541054 545613 550987 556283 560595 563897 567175 571513 577151
59877 577151 583569 590171 596552 602278 606916 610370 612895 614667 615538 615283 613876 611467 608268 604563 600687
59862 600687 596832 592933 588870 584795 581189 578481 576670 575419 574614 574638 575861 577992 580367 582958 586639
59847 586639 592173 599303 607182 615249 623092 629765 634123 636018 636492 636518 636082 634843 633073 631344 629658
59832 629658 627518 624719 621500 617973 613988 609604 605106 600399 594917 588574 582421 577832 575086 573095
59818 573095 570537 566999 563041 559480 556806 555061 554052 553502 553091 552436 551185 549222 546781 544299 542133
$$ packed form
59923D59849K951L613M489N428N972N875N519N521O045O698O977O607N594M202
59909E35340K856J774Q30j19q60j011n62J2J36l90j237j722j377n01L1k75r08
59892E32017r65k19P81J501J963K535L441M559N374N296M312L302L278M338N638
59877E77151O418O602O381N726M638L454K525J772Q71k55j407k409l199l705l876
59862F00687l855l899m063m075l606k708j811j251q05K4J223K131K375K591L681
59847E86639N534P130P879Q067P843O673M358J895M74K6m36j239j770j729j686
59832F29658k140k799l219l527l985m384m498m707n482o343o153m589k746j991
59818E73095k558l538l958l561k674j745j009n50m11o55j251j963k441k482k166
$$ plain form
59803 542133 540374 538883 537461 536083 534925 534021 532892 530860 527908 524905 522582 520450 517298 512772
59789 512772 507940 504051 501241 498831 496513 494679 493680 493227 492608 491236 488996 486308 483863 482137 481223
59774 481223 481250 482622 485353 488425 490463 491176 491573 492585 494061 495432 496762 498589 501053 503811 506624
59759 506624 509540 512495 515245 517791 520488 523593 526967 530275 533328 536137 538869 541756 544904 548179
59745 548179 551505 555176 559533 564286 568495 571458 573409 575109 576930 578562 579573 579906 579790 579425 578998
59730 578998 578916 579601 580892 581888 581724 580466 578958 577832 577118 576827 577332 578711 580149 580540 579564 577758 575716
59713 575716 573714 572025 570944 570342 569672 568642 567575 566905 566652 566606 566787 567475 568909 571002 573300 575256
59697 575256 576754 578229 579985 581591 582455 582902 583992 586150 588627 590514 591562 591695 590551 588190 585671
$$ packed form
59803E42133j759j491j422j378j158r04j129k032k952l003k323k132l152m526
59789E12772m832l889k810k410k318j834r99m53o19j372k240k688k445j726r14
59774D81223K7J372K731L072K038P13L97J012J476J371J330J827K464K758K813
59759E06624K916K955K750K546K697L105L374L308L053K809K732K887L148L275
59745E48179L326L671M357M753M209K963J951J700J821J632J011L33j16l65m27
59730E78998q2O85J291R96j64j258j508j126p14k91N05J379J438L91r76j806k042
59713E75716k002j689j081o02o70j030j067o70k53m6J81O88J434K093K298J956
59697E75256J498J475J756J606Q64M47J090K158K477J887J048J33j144k361k519
$$ plain form
59682 585671 584142 583693 583724 584049 584768 585281 584417 581709 577842 573714 569620 565452 561076 556330 551198 546156
59666 546156 541892 538474 535315 532076 529115 526835 525187 524098 523842 524540 525774 527203 529189 532271 536184
59651 536184 539917 542708 544679 546581 549155 552517 555900 558170 558873 558557 557826 556414 553681 549699 545211
59636 545211 540584 535506 529940 524835 521474 520296 520628 521399 521878 521815 521173 519935 518174 516147 514151 512265
59620 512265 510406 508573 506768 504627 501600 497737 493901 490818 488248 485600 483109 481705 481755 482578 483428
59605 483428 484381 485974 488353 491098 493702 495933 497895 499857 501895 503665 504716 505035 504971 504670 504028 503273
59589 503273 503070 503687 504520 504835 504673 504566 504599 504301 503395 502158 500930 499610 497823 495404 492612 489926 487648
59572 487648 485668 483683 481698 480137 479358 479260 479537 480073 480813 481460 481658 481411 481002 480554 480017 479500 479258 479348
$$ packed form
59682E85671j529m49L1L25P19N13q64k708l867m128m094m168m376m746n132n042
59666E46156m264l418l159l239k961k280j648j089k56O98J234J429J986L082L913
59651E36184L733K791J971J902K574L362L383K270P03l16p31j412k733l982m488
59636E45211m627n078n566n105l361j178L32P71M79o3o42j238j761k027j996j886
59620E12265j859j833j805k141l027l863l836l083k570k648k491j404N0Q23Q50
59605D83428R53J593K379K745K604K231J962J962K038J770J051L19o4l01o42p55
59589E03273k03O17Q33L15j62j07L3k98r06j237j228j320j787k419k792k686k278
59572D87648j980j985j985j561p79r8K77N36P40O47J98k47m09m48n37n17k42R0
$$ plain form
59554 479348 479666 480369 481842 484098 486510 488435 489884 491412 493582 496737 501035 506315 512023 517667 523519
59539 523519 530661 540119 552054 565994 581745 599542 618771 636711 649286 653713 650445 642440
59527 642440 632812 623464 615443 609515 605909 604034 603044 602637 603052 604489 606758 609348 611480 612221 610970
59512 610970 607888 603601 598366 591794 583547 574062 564383 555402 547497 540744 535041 529901 524552 518671
59498 518671 512897 508173 504594 501354 497941 494920 493169 492733 492827 492744 492220 491155 489659 488504 488880 491293
59482 491293 495032 498963 502564 505896 508972 511700 514352 517551 521620 526206 530678 534764 538621 542426
59468 542426 546075 549349 552220 554780 556903 558251 558863 559474 560919 563297 566069 568928 572173 576155 580837
59453 580837 586139 592314 599635 607944 616806 625842 634644 642575 649065 654020 657638 659936 660659 659518
$$ packed form
59554D79348L18P03J473K256K412J925J449J528K170L155M298N280N708N644N852
59539E23519P142R458J1935J3940J5751J7797J9229J7940J2575M427l268q005
59527F42440r628r348q021n928l606j875r90m07M15J437K269K590K132P41j251
59512F10970l082m287n235o572q247r485r679q981p905o753n703n140n349n881
59498E18671n774m724l579l240l413l021j751m36R4q3n24j065j496j155L76K413
59482D91293L739L931L601L332L076K728K652L199M069M586M472M086L857L805
59468E42426L649L274K871K560K123J348O12O11J445K378K772K859L245L982M682
59453E80837N302O175P321Q309Q862R036Q802P931O490M955L618K298P23j141
$$ plain form
59439 659518 656196 650324 641932 631979 622069 613415 606201 599885 593949 588374 583641 580359 578808 578840 580255
59424 580255 583061 587163 592116 597642 604313 613172 624654 638282 653575 670757 690262 711944 735247
59411 735247 760046 786668 814686 841702 863576 876225 877612 868560 852072 832053 812219 795438
59399 795438 783530 777574 778267 785259 795739 804247 805105 795710 777535 754238 729317 705316 683960
59386 683960 665990 651058 638457 628046 620145 614658 610796 607754 605336 603761 603179 603574 604989 607512
59372 607512 610982 614886 618686 622221 625687 629283 632952 636470 639616 642295 644694 647387 650980 655471
59358 655471 660197 664647 669118 674241 680059 685975 691592 697257 703801 712007 722214 734040 746585
59345 746585 759322 772711 787465 803260 818842 833395 847083 859971 871180 879598 884923 887582
$$ packed form
59439F59518l322n872q392r953r910q654p214o316n936n575m733l282j551L2J415
59424E80255K806M102M953N526O671Q859J1482J3628J5293J7182J9505K1682K3303
59411G35247K4799K6622K8018K7016K1874J2649J387r052j6488k0019j9834j6781
59399G95438j1908n956O93O992J0480Q508Q58r395j8175k3297k4921k4001k1356
59386F83960j7970j4932j2601j0411p901n487l862l042k418j575n82L95J415K523
59372F07512L470L904L800L535L466L596L669L518L146K679K399K693L593M491
59358F55471M726M450M471N123N818N916N617N665O544Q206J0207J1826J2545
59345G46585J2737J3389J4754J5795J5582J4553J3688J2888J1209Q418N325K659
$$ plain form
59333 887582 888106 887028 884817 881259 875308 866236 854633 841664 827743 812768 797380 782861 769682
59320 769682 757042 744200 731480 719666 709074 699683 691536 684448 677759 670964 664327 658424 653378
59307 653378 649059 645728 643843 643344 643809 645354 648764 654543 662380 671815 682846 695284 707649 717279
59293 717279 721699 719806 712003 699625 684404 668080 652103 637460 624618 613478 603566 594635
59281 594635 587178 582010 579255 578122 577964 579133 582371 587618 594094 601477 610327 621140 633520 646538
59267 646538 659515 672184 684450 696313 707673 717886 725874 731039 733762 734541 733034 728597 721576
59254 721576 713350 705051 696882 688775 680997 673758 666856 660210 654432 650315 647932 646710 646280 646799 648350
59239 648350 650494 652709 655065 658198 662638 668350 674898 681819 688700 695088 700621 705275 709197 712248
$$ packed form
59333H87582N24j078k211l558n951r072j1603j2969j3921j4975j5388j4519j3179
59320G69682j2640j2842j2720j1814j0592r391q147p088o689o795o637n903n046
59307F53378m319l331j885m99M65J545L410N779P837R435J1031J2438J2365R630
59293G17279M420j893p803j2378j5221j6324j5977j4643j2842j1140r912q931
59281E94635p457n168k755j133j58J169L238N247O476P383Q850J0813J2380J3018
59267F46538J2977J2669J2266J1863J1360J0213P988N165K723P79j507m437p021
59254G21576q226q299q169q107p778p239o902o646n778m117k383j222m30N19J551
59239F48350K144K215K356L133M440N712O548O921O881O388N533M654L922L051
$$ plain form
59225 712248 713948 714041 712872 710933 708264 704625 700174 695503 690920 685990 679996 672694 664514 656161 648141
59210 648141 640588 633442 626754 620806 615812 611584 607578 603291 598569 593657 589071 585350 582709 580966
59196 580966 579884 579432 579584 580048 580477 580829 581211 581531 581746 582356 584113 587121 590641 593905 596743 599347
59180 599347 601881 604643 608158 612678 617730 622479 626447 629792 633085 637030 642093 648135 654562 661049
59166 661049 667886 675348 683019 690143 696520 702629 708824 714707 719375 722102 722774 721760 719379 715468
59152 715468 709606 701826 692844 683371 673444 662757 651514 640519 630374 620936 611715 602585 593909
59139 593909 586042 578877 571970 565083 558549 552942 548447 544721 541414 538508 535991 533496 530631 527564
59125 527564 525023 523728 523976 525653 528420 531919 536083 541225 547640 555149 563267 571729 580646 590137
$$ packed form
59225G12248J700R3j169j939k669l639m451m671m583m930n994p302q180q353q020
59210F48141p553p146o688n948m994m228m006m287m722m912m586l721k641j743
59196E80966j082m52J52M64M29L52L82L20K15O10J757L008L520L264K838K604
59180E99347K534K762L515M520N052M749L968L345L293L945N063O042O427O487
59166F61049O837P462P671P124O377O109O195N883M668K727O72j014k381l911
59152G15468n862p780q982r473r927j0687j1243j0995j0145r438r221r130q676
59139E93909p867p165o907o887o534n607m495l726l307k906k517k495k865l067
59125E27564k541j295K48J677K767L499M164N142O415P509Q118Q462Q917R491
$$ plain form
59111 590137 600074 610217 620342 630195 639506 648119 656025 663278 670022 676534 682975 688988 693728 696423
59097 696423 696921 695704 693492 690823 687930 684940 682080 679593 677465 675489 673665 672277 671424 670741 669862
59082 669862 668898 668046 666880 664496 660415 654965 648767 642172 635331 628489 622016 616224 611201 606719 602339
59067 602339 597747 592898 587792 582404 577133 572890 570153 568132 565575 562371 559605 557934 556775 555411
59053 555411 554109 553520 553539 553483 553001 552162 550910 549242 547805 547561 548647 550066 550653 550033 548603 547048 546020
59036 546020 545849 546265 546626 546582 546362 546321 546549 547113 548430 551022 554949 559701 564758 570144 576406 584050 593017
59019 593017 602714 612522 622191 631744 641143 650120 658189 664711 669111 671271 671623 670684 668650 665676 662404
59004 662404 659807 658430 658124 658581 659912 662582 666978 673041 680042 686761 692247 696570 700546 704679 708719
$$ packed form
59111E90137R937J0143J0125R853R311Q613P906P253O744O512O441O013M740K695
59097F96423M98j217k212k669k893k990k860k487k128j976j824j388q53o83q79
59082F69862r64q52j166k384m081n450o198o595o841o842o473n792n023m482m380
59067F02339m592m849n106n388n271m243k737k021k557l204k766j671j159j364
59053E55411j302n89J9n6m82q39j252j668j437k44J086J419N87o20j430j555j028
59036E46020j71M16L61m4k20m1K28N64J317K592L927M752N057N386O262P644Q967
59019E93017R697R808R669R553R399Q977Q069O522M400K160L52r39k034k974l272
59004F62404k597j377l06M57J331K670M396O063P001O719N486M323L976M133M040
$$ plain form
58989 708719 712326 715592 718612 720994 722301 722672 722530 721898 720565 718753 717015 715508 713937 712378 711615
58974 711615 712484 715227 719638 725367 731931 738929 746576 755619 766338 777955 789389 800284 810899
58961 810899 821375 831625 841711 851654 860883 868372 873377 875597 874699 870340 862828 853169 842129
58948 842129 829631 815340 799491 782810 765923 749263 733383 718968 706475 695910 686916 678998
58936 678998 671841 665524 660299 656100 652455 648931 645412 641950 638764 636503 635880 636676 637547 637338 636190
58921 636190 634882 633581 632062 630835 630942 632401 633753 633612 632153 630664 630155 630863 632675 635377 638574
58906 638574 641933 645719 650799 657896 666880 676922 687379 698435 710735 724426 738848 753289
58894 753289 767612 781838 795608 808714 821938 836593 853213 871377 890791 911646 933699
$$ packed form
58989G08719L607L266L020K382J307L71j42o32j333j812j738j507j571j559p63
58974G11615Q69K743M411N729O564O998P647R043J0719J1617J1434J0895J0615
58961H10899J0476J0250J0086R943R229P489N005K220q98m359p512r659j1040
58948H42129j2498j4291j5849j6681j6887j6660j5880j4415j2493j0565q994p918
58936F78998p157o317n225m199l645l524l519l462l186k261o23P96Q71k09j148
58921F36190j308j301j519j227J07J459J352j41j459j489n09P08J812K702L197
58906F38574L359L786N080P097Q984J0042J0457J1056J2300J3691J4422J4441
58894G53289J4323J4226J3770J3106J3224J4655J6620J8164J9414K0855K2053
$$ plain form
58883 933699 955907 977423 998094 1017393 1033703 1045595 1053265 1057790 1059409 1057540 1052159 1043895 1032794
58870 1032794 1018239 1000511 981417 962777 945097 928262 912762 899366 887964 877573 867386
58859 867386 857188 846878 836269 825473 814883 804527 793845 782393 770525 759040 748320
58848 748320 738090 727991 718048 708467 699229 690224 681667 673990 667189 660628 653798 647023 641018 635866
58834 635866 630900 625590 620037 614519 609153 604313 600760 598725 597222 595070 592555 591286 592187 594317
58820 594317 596101 597210 598575 600860 603720 606650 609822 613688 618159 622653 626761 630462 633737 636337
58806 636337 637972 638481 637873 636461 634897 633688 632591 630841 628105 624860 621663 618447 614846 610840 606635
58791 606635 602158 597219 592131 587643 584231 581848 580389 579891 580104 580433 580746 581873 584827 589586 595098
$$ packed form
58883I33699K2208K1516K0671J9299J6310J1892P670M525J619j869n381q264j1101
58870A032794j4555j7728j9094j8640j7680j6835j5500j3396j1402j0391j0187
58859H67386j0198j0310j0609j0796j0590j0356j0682j1452j1868j1485j0720
58848G48320j0230j0099r943r581r238r005q557p677o801o561o830o775o005n152
58834F35866m966n310n553n518n366m840l553k035j503k152k515j269R01K130
58820E94317J784J109J365K285K860K930L172L866M471M494M108L701L275K600
58806F36337J635N09o08j412j564j209j097j750k736l245l197l216l601m006m205
58791F06635m477m939n088m488l412k383j459m98K13L29L13J127K954M759N512
$$ plain form
58776 595098 600451 605621 610886 615845 619384 620595 619514 616915 613496 609408 604460 598621 592263 585995
58762 585995 580341 575451 571056 566760 562478 558600 555721 554269 554319 555570 557355 558907 559835 560364 561057
58747 561057 562398 564689 568017 572043 576021 579416 582497 585982 590170 594771 599570 604764 610485 616398
58733 616398 622114 627800 634026 641031 648317 655020 660676 665660 670805 676470 682167 687311 692171 697542
58719 697542 703474 708957 713185 716738 721106 727270 735104 743826 752543 760482 767251 772978 777882 781656
58705 781656 783550 783105 780506 776109 769861 761351 750252 736589 720757 703506 685827 668596 652222
58692 652222 636659 621820 607883 595096 583353 572260 561770 552542 545333 540011 535513 530838
58680 530838 525829 520901 516434 512700 510004 508374 507227 505841 504309 503646 504747 507480 511061 515163
$$ packed form
58776E95098N353N170N265M959L539J211j081k599l419m088m948n839o358o268
58762E85995n654m890m395m296m282l878k879j452N0J251J785J552R28N29O93
58747E61057J341K291L328M026L978L395L081L485M188M601M799N194N721N913
58733F16398N716N686O226P005P286O703N656M984N145N665N697N144M860N371
58719F97542N932N483M228L553M368O164P834Q722Q717P939O769N727M904L774
58705G81656J894m45k599m397o248q510j1099j3663j5832j7251j7679j7231j6374
58692F52222j5563j4839j3937j2787j1743j1093j0490r228p209n322m498m675
58680E30838n009m928m467l734k696j630j147j386j532o63J101K733L581M102
$$ plain form
58666 515163 520296 527023 535091 543656 552305 561484 571692 582449 592351 600037 604843 606695 605929 603375
58652 603375 600109 596702 592825 587885 581886 575488 569430 564155 559802 556258 553278 550771 548917 547839
58638 547839 547371 547359 547986 549504 551784 554439 557253 560149 562799 564624 565178 564333 562243 559428 556717 554642
58622 554642 552942 551134 549556 549259 550753 553318 555895 558240 560949 564690 569785 576249 583655 590980
58608 590980 597049 601374 604384 606666 608180 608492 607681 606618 606073 605797 604911 603102 600961 599068 597274
58593 597274 595198 592970 591073 589819 589453 590440 593033 596776 601027 605844 611775 618882 626659 634799 643340
58578 643340 652008 660303 668387 677043 686413 695533 703584 710871 718055 725227 732487 740780 751203 763822
58564 763822 778009 793723 811488 831172 851796 872789 894595 917601 941002 963166 982695
$$ packed form
58666E15163N133O727Q068Q565Q649R179J0208J0757R902P686M806J852p66k554
58652F03375l266l407l877m940n999o398o058n275m353l544k980k507j854j078
58638E47839m68j2O27J518K280K655K814K896K650J825N54q45k090k815k711k075
58622E54642j700j808j578k97J494K565K577K345K709L741N095O464P406P325
58608E90980O069M325L010K282J514L12q11j063n45k76q86j809k141j893j794
58593E97274k076k228j897j254l66R87K593L743M251M817N931P107P777Q140Q541
58578F43340Q668Q295Q084Q656R370R120Q051P287P184P172P260Q293J0423J2619
58564G63822J4187J5714J7765J9684K0624K0993K1806K3006K3401K2164J9529
$$ plain form
58553 982695 998773 1010861 1018699 1022569 1023156 1020997 1016292 1009363 1001135 992897 985480 978689 971616 963435
58539 963435 953816 942724 930140 916051 900462 883327 864736 845294 826038 807825 791069 776245
58527 776245 764172 755364 749368 745237 742499 741184 741050 741380 741671 742002 742489 742733 742095 740347 737805 734867
58511 734867 731559 727590 722862 717923 713715 710783 708857 707409 706312 705662 705108 703879 701576 698605 695655
58496 695655 692989 690376 687554 684587 681836 679641 678048 676961 676596 677591 680400 684741 689895 695475 701613
58481 701613 708493 716114 724533 734038 744896 757147 770681 785286 800502 815472 828981 839680
58469 839680 846575 849577 849441 846852 841768 834010 824392 814714 806542 800322 795684 792210 789849 789043 790606
58454 790606 795129 802314 811145 820809 831086 841764 852090 861028 867689 871317 871284 867528 860902 852778
$$ packed form
58553I82695J6078J2088P838L870N87k159m705o929q228q238p417o791p073q181
58539I63435r619j1092j2584j4089j5589j7135j8591j9442j9256j8213j6756j4824
58527G76245j2073q808n996m131k738j315j34L30K91L31M87K44o38j748k542k938
58511G34867l308l969m728m939m208k932j926j448j097o50n54j229k303k971k950
58496F95655k666k613k822k967k751k195j593j087l65R95K809M341N154N580O138
58481G01613O880P621Q419R505J0858J2251J3534J4605J5216J4970J3509J0699
58469H39680O895L002j36k589n084p758r618r678q172o220m638l474k361q06J563
58454G90606M523P185Q831R664J0277J0678J0326Q938O661L628l3l756o626q124
$$ plain form
58440 852778 844362 836348 828911 821859 815104 809180 805059 803285 803552 805214 807851 811135 814696 818522
58426 818522 823207 829340 836834 845249 854488 864713 875684 886633 896657 904881 910420 912800 912469
58413 912469 910421 907166 902447 895970 887954 878825 868868 858544 848738 840197 832866 826134 819711 813932
58399 813932 809247 805809 803687 803139 804349 807039 810638 814808 819566 824844 830153 834828 838520 841393
58385 841393 843936 846651 849782 853192 856586 859948 863679 868255 873831 880183 886817 893029 898154 902047
58371 902047 905244 908435 911904 915661 919923 925140 931615 939298 947917 957104 966614 976680 987975 1000906
58357 1000906 1014995 1029197 1042652 1054903 1065681 1074900 1082688 1089132 1094213 1098355 1102566 1107454 1112491
58344 1112491 1116926 1121084 1125913 1131589 1137650 1144384 1152840 1163268 1174739 1186700 1199819 1214746 1231045
$$ packed form
58440H52778q416q014p437p052o755n924m121j774K67J662K637L284L561L826
58426H18522M685O133P494Q415R239J0225J0971J0949J0024Q224N539K380l31
58413I12469k048l255m719o477q016r129r957j0324r806q541p331o732o423n779
58399H13932m685l438k122n48J210K690L599M170M758N278N309M675L692K873
58385H41393K543K715L131L410L394L362L731M576N576O352O634O212N125L893
58371I02047L197L191L469L757M262N217O475P683Q619R187R510J0066J1295J2931
58357A000906J4089J4202J3455J2251J0778R219P788O444N081M142M211M888N037
58344A112491M435M158M829N676O061O734Q456J0428J1471J1961J3119J4927J6299
$$ plain form
58331 1231045 1248025 1265765 1284460 1303413 1321501 1338274 1353942 1368655 1382266 1394398 1404365
58320 1404365 1411616 1416652 1420872 1425011 1428500 1430963 1433521 1437685 1443672 1450744 1458697 1467971 1478696 1490654
58306 1490654 1504010 1519117 1535686 1552942 1570464 1588205 1605953 1623564 1641524 1660447 1680140
58295 1680140 1699867 1719353 1738883 1758689 1778958 1800145 1822436 1845134 1867488 1889911 1913545
58284 1913545 1938755 1964960 1991778 2019347 2047603 2076220 2105341 2135546 2167052 2199767 2234101
58273 2234101 2270841 2310163 2351581 2394931 2440589 2488602 2538349 2589217 2641073 2694081 2748647
58262 2748647 2805441 2864885 2926797 2990975 3057617 3126487 3196394 3266604 3338163 3412578 3489763
58251 3489763 3568765 3650042 3735194 3824534 3916877 4012061 4111937 4218229 4330900 4449291 4573634
$$ packed form
58331A231045J6980J7740J8695J8953J8088J6773J5668J4713J3611J2132R967
58320A404365P251N036M220M139L489K463K558M164N987P072P953R274J0725J1958
58306A490654J3356J5107J6569J7256J7522J7741J7748J7611J7960J8923J9693
58295A680140J9727J9486J9530J9806K0269K1187K2291K2698K2354K2423K3634
58284A913545K5210K6205K6818K7569K8256K8617K9121L0205L1506L2715L4334
58273B234101L6740L9322M1418M3350M5658M8013M9747N0868N1856N3008N4566
58262B748647N6794N9444O1912O4178O6642O8870O9907P0210P1559P4415P7185
58251C489763P9002Q1277Q5152Q9340R2343R5184R9876J06292J12671J18391J24343
$$ plain form
58240 4573634 4704701 4843045 4989249 5144117 5308138 5481455 5664519 5858071 6062551
58231 6062551 6278547 6507693 6752110 7013117 7291642 7589535 7909182 8252275 8620551
58222 8620551 9017303 9446384 9910257 10411309 10954748 11547776 12196003 12903314 13675470
58213 13675470 14521490 15451629 16477160 17612773 18876729 20288871 21872143 23657311
58205 23657311 25684202 27999513 30658653 33732149 37309124 41497609 46429495 52269152
58197 52269152 59215102 67494009 77357759 89085950 102986120 119392496 138667831
58190 138667831 161196010 187350326 217436972 251571868 289362350 329338988 368436960
58183 368436960 402135590 425604861 435401106 430667456 413108826 385952126 352730660
$$ packed form
58240D573634J31067J38344J46204J54868J64021J73317J83064J93552K04480
58231F062551K15996K29146K44417K61007K78525K97893L19647L43093L68276
58222H620551L96752M29081M63873N01052N43439N93028O48227P07311P72156
58213A3675470Q46020R30139J025531J135613J263956J412142J583272J785168
58205B3657311K026891K315311K659140L073496L576975M188485M931886N839657
58197E2269152O945950Q278907R863750J1728191J3900170J6406376J9275335
58190A38667831K2528179K6154316L0086646L4134896L7790482L9976638L9097972
58183C68436960L3698630K3469271R796245m733650j7558630k7156700l3221466
$$ plain form
58176 352730660 316541937 279828800 244397975 211473614 181766084 155576008 132909479
58169 132909479 113575023 97260499 83595498 72197210 62700517 54777878 48149545
58162 48149545 42582580 37884409 33898295 30499454 27587599 25078960 22903265 21003768
58154 21003768 19335116 17859788 16546643 15370798 14312200 13354094 12483352 11690650
58146 11690650 10968537 10309721 9707804 9158092 8656222 8196995 7775659 7389082 7034192
58137 7034192 6706124 6399185 6108938 5832509 5568020 5315134 5075363 4850405 4640387
58128 4640387 4444306 4261324 4090755 3931582 3782986 3644675 3515891 3394959 3280682
58119 3280682 3173271 3072897 2978227 2887606 2800959 2719167 2642022 2568072 2496280 2426703 2359662
$$ packed form
58176C52730660l6188723l6713137l5430825l2924361k9707530k6190076k2666529
58169A32909479j9334456j6314524j3665001j1398288r496693p922639o628333
58162D8149545n566965m698171l986114l398841k911855k508639k175695j899497
58154B1003768j668652j475328j313145j175845j058598r58106q70742p92702
58146A1690650p22113o58816o01917n49712n01870m59227m21336l86577l54890
58137G034192l28068l06939k90247k76429k64489k52886k39771k24958k10018
58128D640387j96081j82982j70569j59173j48596j38311j28784j20932j14277
58119C280682j07411j00374r4670r0621q6647q1792p7145p3950p1792o9577o7041
$$ plain form
58108 2359662 2295131 2232883 2172499 2113386 2055395 1999170 1945285 1893314 1842385 1792350 1743869
58097 1743869 1697698 1654490 1614821 1578637 1544892 1512376 1480705 1450054 1420391 1391639 1364182
58086 1364182 1338390 1313806 1289449 1264843 1240207 1215879 1192079 1168978 1146464 1124053 1101518
58075 1101518 1079386 1058272 1038013 1017947 997817 977809 958022 938517 919750 902375 886694
58064 886694 872630 859981 848281 836848 825572 815281 806614 798786 790250 780402 769914 759488
58052 759488 749165 738919 729115 720040 711503 703231 695273 687744 680472 673192 665913 658871 652049 644894
58038 644894 636693 627502 618475 610815 604406 598073 591327 585069 580091 575645 570268 563479 555870 547846
58024 547846 539259 530154 521045 512328 504040 496243 489075 482435 476123 470284 465201 460728 456454 452330
$$ packed form
58108B359662o4531o2248o0384n9113n7991n6225n3885n1971n0929n0035m8481
58097A743869m6171m3208l9669l6184l3745l2516l1671l0651k9663k8752k7457
58086A364182k5792k4584k4357k4606k4636k4328k3800k3101k2514k2411k2535
58075A101518k2132k1114k0259k0066k0130k0008j9787j9505j8767j7375j5681
58064H86694j4064j2649j1700j1433j1276j0291q667p828q536r848j0488j0426
58052G59488j0323j0246r804r075q537q272p958p529p272p280p279p042o822p155
58038F44894q201r191r027p660o409o333o746o258m978m446n377o789p609q024
58024E47846q587r105r109q717q288p797p168o640o312n839n083m473m274m124
$$ plain form
58010 452330 448556 444932 441055 437196 434231 432494 431279 429710 427628 425400 423367 421662 420223 418821
57996 418821 417398 416321 415827 415266 413581 410670 407571 405076 402894 400613 398777 398305 399179 400414 401143
57981 401143 401203 400725 399728 398227 396348 394126 391385 387997 384245 380788 378219 376603 375479 374329 372994
57966 372994 371612 370375 369484 369171 369494 370254 371325 372899 375019 377058 378127 378011 377229 376154 374605 372434
57950 372434 370008 367856 366207 365140 364770 364961 365190 365103 365036 365646 367118 369069 371153 373534 376769 381386
57934 381386 387524 394778 402374 409654 416431 422887 429084 434563 438405 439873 439103 436997 434222 430509
57920 430509 425312 418915 412358 406293 400510 394777 389501 385213 381924 379471 378105 378099 378926 379498 379352 379233
57904 379233 380292 382840 385984 388363 389186 388583 387017 384546 380966 376587 372359 368885 365671 361824 357323
$$ packed form
58010D52330l774l624l877l859k965j737j215j569k082k228k033j705j439j402
57996D18821j423j077m94n61j685k911l099k495k182k281j836m72Q74J235P29
57981D01143O0m78r97j501j879k222k741l388l752l457k569j616j124j150j335
57966C72994j382j237q91l13L23P60J071J574K120K039J069j16p82j075j549k171
57950C72434k426k152j649j067l70J91K29q7o7O10J472J951K084K381L235M617
57934C81386O138P254P596P280O777O456O197N479L842J468p70k106k775l713
57920D30509n197o397o557o065n783n733n276m288l289k453j366oQ27N72j46j19
57904C79233J059K548L144K379Q23o03j566k471l580m379m228l474l214l847m501
$$ plain form
57889 357323 353174 350293 348622 347415 346062 344540 343301 342841 343182 343657 343331 341776 339330 336643 334166
57874 334166 332112 330629 329707 329024 328164 327097 326282 326246 327099 328492 329938 331133 332085 333115 334698 337118
57858 337118 340177 343373 346439 349564 352976 356445 359424 361638 363253 364464 365135 365003 364103 362793 361391
57843 361391 359876 357930 355252 351845 348042 344281 340833 337723 334759 331566 327709 323029 317890 313034
57829 313034 309171 306746 305930 306572 308106 309755 310989 311739 312118 312126 311795 311505 311884 313191 314862 315912 315931
57812 315931 315456 315060 314252 311840 307473 302228 297283 292509 286957 280379 273558 267311 261939 257676 254848
57797 254848 253333 252478 251859 251705 252345 253826 256259 259893 264392 268703 272216 275540 279457 283638 287208
57782 287208 290275 293868 298448 303349 307872 312043 316007 319359 321626 322932 323780 324516 325351 326506 327857
$$ packed form
57889C57323m149k881j671j207j353j522j239m60L41M75l26j555k446k687k477
57874C34166k054j483r22o83q60j067q15l6Q53J393J446J195R52J030J583K420
57858C37118L059L196L066L125L412L469K979K214J615J211O71j32r00j310j402
57843C61391j515j946k678l407l803l761l448l110k964l193l857m680n139m856
57829C13034l863k425q16O42J534J649J234P50L79Ql31k90L79J307J671J050J9
57812C15931m75l96q08k412m367n245m945m774n552o578o821o247n372m263k828
57797B54848j515q55o19j54O40J481K433L634M499M311L513L324L917M181L570
57782B87208L067L593M580M901M523M171L964L352K267J306Q48P36Q35J155J351
$$ plain form
57767 327857 328642 327965 325552 321810 317404 313063 309470 306754 304165 300785 296644 292679 289545 287025 284810
57752 284810 283246 282755 282882 282667 281955 281674 282611 284457 286390 288136 289937 291750 293153 294044 294888 296024
57736 296024 297148 297697 297522 296944 296335 295853 295457 295010 294511 294275 294696 295655 296436 296466 295931 295398 295018 294467 293560
57717 293560 292468 291253 289593 287159 284008 280370 276255 271595 266708 262282 258670 255357 251432 246678
57703 246678 241931 238194 235556 233318 231013 228861 227152 225681 224099 222480 221119 220005 218839 217526
57689 217526 216237 215106 214174 213615 213689 214451 215743 217465 219613 222136 225138 229185 235058 243125 253307
57674 253307 265762 281226 300554 324181 352232 384940 422839 466602 516513 571413 627612
57663 627612 678929 718235 739497 739316 717882 679264 630270 577814 526512 478381 434310 395260
$$ packed form
57767C27857P85o77k413l742m406m341l593k716k589l380m141l965l134k520k215
57752B84810j564m91J27k15p12k81R37J846J933J746J801J813J403Q91Q44J136
57736B96024J124N49j75n78o09m82l96m47m99k36M21R59P81L0n35n33l80n51r07
57717B93560j092j215j660k434l151l638m115m660m887m426l612l313l925m754
57703B46678m747l737k638k238k305k152j709j471j582j619j361j114j166j313
57689B17526j289j131r32n59P4P62J292J722K148K523L002M047N873Q067J0182
57674B53307J2455J5464J9328K3627K8051L2708L7899M3763M9911N4900N6199
57663F27612N1317L9306K1262j81k1434l8618m8994n2456n1302m8131m4071l9050
$$ plain form
57651 395260 362039 334532 311649 292143 275338 261123 249447 239990 232311 226096 221124 217150
57639 217150 214025 211828 210590 209955 209500 209333 209907 211126 212139 212341 212129 212267 212843 213280 213117 212303 210964
57622 210964 209371 207992 206996 205832 203828 201161 198658 196639 194613 192240 189958 188386 187626 187376 187244
57607 187244 186681 185241 183347 182290 182857 184272 185045 184601 183534 182527 181681 180821 179828 178539 176803 174726
57591 174726 172555 170325 167927 165441 163008 160499 157844 155598 154549 154657 155072 155308 155742 156638 157390 157266
57575 157266 156399 155402 154429 153273 152102 151368 150971 150208 148690 146800 145109 143748 142610 141742 141261 141048
57559 141048 140833 140498 140146 139895 139716 139498 139283 139436 140443 142439 145038 147757 150446 153100 155435 157038
57543 157038 157967 158810 160068 161719 163453 165038 166322 167173 167695 168329 169510 171253 173132 174615 175346 175287
$$ packed form
57651C95260l3221k7507k2883j9506j6805j4215j1676r457p679o215m972l974
57639B17150l125k197j238o35m55j67N74J219J013K02k12J38N76M37j63q14j339
57622B10964j593j379r96j164k004k667k503k019k026k373k282j572p60k50j32
57607A87244n63j440j894j057N67J415P73m44j067j007q46q60r93j289j736k077
57591A74726k171k230k398k486k433k509k655k246j049J08M15K36M34Q96P52j24
57575A57266q67r97r73j156j171p34l97p63j518j890j691j361j138q68m81k13
57559A41048k15l35l52k51j79k18k15J53J007J996K599K719K689K654K335J603
57543A57038R29Q43J258J651J734J585J284Q51N22O34J181J743J879J483P31n9
$$ plain form
57527 175287 174696 173908 173084 172224 171400 170772 170332 169856 169184 168341 167301 165900 164113 162202 160406 158716 157149
57510 157149 155930 155084 154137 152691 151180 150536 151049 152006 152554 152424 151669 150225 148236 146447 145619 145557 145153
57493 145153 143489 140607 137182 133880 131134 129103 127529 125899 124083 122550 121715 121314 120821 120234 119929
57478 119929 119922 119867 119770 120030 120632 120965 120748 120511 120701 120933 120694 120247 120033 119581 117984 115460 113506 113297 114570
57459 114570 116335 117947 119158 119741 119658 119289 119009 118727 118196 117534 117091 116917 116692 116130 115317 114731 114963 116163
57441 116163 117697 118640 118743 118529 118379 118086 117639 117771 119039 120721 121384 120461 118678 116999 115809 115170 115186
57424 115186 115785 116586 117288 117988 118936 120195 121608 122845 123447 123169 122401 121889 121858 121746 121074 120231 119991 120444
57406 120444 120898 120835 120545 120604 121015 121199 120756 119968 119398 119190 118985 118508 118032 118138 119100 120589 121936 122724 123223
$$ packed form
57527A75287n91p88q24q60q24o28m40m76o72q43j040j401j787j911j796j690j567
57510A57149j219q46r47j446j511o44N13R57N48j30p55j444j989j789q28o2m04
57493A45153j664k882l425l302k746k031j574j630j816j533q35m01m93n87l05
57478A19929pn5r7K60O02L33k17k37J90K32k39m47k14m52j597k524j954k09J273
57459A14570J765J612J211N83q3l69k80k82n31o62m43j74k25n62q13n86K32J200
57441A16163J534R43J03k14j50k93m47J32J268J682O63r23j783j679j190o39J6
57424A15186N99Q01P02P00R48J259J413J237O02k78p68n12l1j12o72q43k40M53
57406A20444M54o3k90N9M11J84m43p88n70k08k05m77m76J06R62J489J347P88M99
$$ plain form
57387 123223 124249 126363 129123 131330 132179 132021 131911 132618 134276 136591 138920 140279 139923 138175 136376
57372 136376 135773 136585 138167 139777 140965 141503 141330 140600 139653 138860 138480 138545 138797 138834 138485 137999 137758 137875
57354 137875 138200 138705 139603 140996 142568 143876 144863 145784 146612 146849 146155 144871 143623 142617 141684 140856 140409
57337 140409 140406 140714 141450 142780 144133 144332 142929 140883 139466 138922 138751 138751 138986 139036 138245 136792 135738 135719
57319 135719 136176 136161 135539 135074 135610 137370 139801 141947 143169 143631 143935 144376 144819 145271 146127 147650 149487
57302 149487 150912 151425 151050 150233 149478 148931 148387 147835 147782 148671 150162 151544 152861 154999 158462 162589 166352
57285 166352 169610 173212 178038 184152 190768 196924 202327 207594 213518 220128 226731 232721 237954 242384
57271 242384 245965 249038 252203 255483 258052 259173 259011 258254 257282 256055 254451 252253 249127 245038 240654
$$ packed form
57387A23223J026K114K760K207Q49j58j10P07J658K315K329J359l56j748j799
57372A36376o03Q12J582J610J188N38j73p30r47p93l80O5K52L7l49m86k41J17
57354A37875L25N05Q98J393J572J308R87R21Q28K37o94j284j248j006r33q28m47
57337A40409lL08P36J330J353J99j403k046j417n44j71%K35N0p91j453j054j9
57319A35719M57j5o22m65N36J760K431K146J222M62L04M41M43M52Q56J523J837
57302A49487J425N13l75q17p55n47n44n52n3Q89J491J382J317K138L463M127L763
57285A66352L258L602M826O114O616O156N403N267N924O610O603N990N233M430
57271B42384L581L073L165L280K569J121j62p57r72j227j604k198l126m089m384
$$ plain form
57256 240654 236987 234672 233703 233673 234197 235355 237828 242178 247860 253436 258050 262229 266886 272131 277598
57241 277598 283387 289862 296700 302959 308146 312680 317289 322455 328483 335596 343749 352640 361954 371468
57227 371468 381002 390522 400135 409739 418908 427503 436220 446016 457111 469043 481545 494798 508859
57214 508859 523502 538746 554944 572114 589627 606853 623751 640630 657663 674881 692343
57203 692343 709987 727470 744372 760486 775865 790786 805823 821684 838694 856385 873667
57192 873667 889523 903743 917191 931153 946169 961550 976282 990148 1003605 1016794 1029371
57181 1029371 1041406 1053756 1067224 1081753 1096840 1112368 1128586 1145465 1162556 1179422 1195941
57170 1195941 1212125 1227924 1243302 1258372 1273375 1288560 1304136 1320269 1337018 1354115 1370916
$$ packed form
57256B40654l667k315r69l0N24J158K473M350N682N576M614M179M657N245N467
57241B77598N789O475O838O259N187M534M609N166O028P113Q153Q891R314R514
57227C71468R534R520R613R604R169Q595Q717R796J1095J1932J2502J3253J4061
57214E08859J4643J5244J6198J7170J7513J7226J6898J6879J7033J7218J7462
57203F92343J7644J7483J6902J6114J5379J4921J5037J5861J7010J7691J7282
57192H73667J5856J4220J3448J3962J5016J5381J4732J3866J3457J3189J2577
57181A029371J2035J2350J3468J4529J5087J5528J6218J6879J7091J6866J6519
57170A195941J6184J5799J5378J5070J5003J5185J5576J6133J6749J7097J6801
$$ plain form
57159 1370916 1386836 1402002 1417211 1433023 1449117 1464827 1480075 1495369 1510993 1526740 1542433
57148 1542433 1558217 1574208 1590300 1606543 1623333 1640939 1659044 1676980 1694317 1711130 1727864
57137 1727864 1744980 1762491 1779857 1796566 1812836 1829423 1846723 1864443 1882187 1899942 1917812
57126 1917812 1935757 1953846 1972489 1992117 2012923 2035102 2059071 2085224 2113829 2145438 2181116
57115 2181116 2221901 2268158 2319687 2376347 2438476 2506979 2583254 2668935 2765701 2875767 3002820
57104 3002820 3152310 3330881 3545926 3805759 4119629 4497391 4949864 5489967 6132967
57095 6132967 6895010 7791391 8835798 10039437 11409193 12946327 14647031 16503219
57087 16503219 18501375 20620308 22829786 25089910 27350806 29554988 31643976 33565092
$$ packed form
57159A370916J5920J5166J5209J5812J6094J5710J5248J5294J5624J5747J5693
57148A542433J5784J5991J6092J6243J6790J7606J8105J7936J7337J6813J6734
57137A727864J7116J7511J7366J6709J6270J6587J7300J7720J7744J7755J7870
57126A917812J7945J8089J8643J9628K0806K2179K3969K6153K8605L1609L5678
57115B181116M0785M6257N1529N6660O2129O8503P6275Q5681R6766J10066J27053
57104C002820J49490J78571K15045K59833L13870L77762M52473N40103O43000
57095F132967P62043Q96381J044407J203639J369756J537134J700704J856188
57087A6503219J998156K118933K209478K260124K260896K204182K088988J921116
$$ plain form
57079 33565092 35272572 36724023 37878998 38701887 39163792 39240482 38912005 38169505 37024687
57070 37024687 35512332 33683688 31597955 29318325 26911779 24448408 21998282 19626476
57062 19626476 17387511 15320977 13450201 11784022 10319836 9046522 7947483 7003872
57054 7003872 6196877 5508460 4921486 4420248 3991035 3622108 3303408 3026580 2785068
57045 2785068 2573765 2388411 2225201 2080665 1951741 1836060 1732162 1639160 1556075 1481719
57035 1481719 1415284 1356655 1305953 1263121 1228253 1201946 1184878 1177251 1179237 1191905 1216967 1254668
57023 1254668 1301194 1347735 1382418 1394569 1378920 1337030 1275168 1200867 1120835 1040583 964288
57012 964288 894298 831144 774491 724055 679650 640803 606730 576615 549797 525813 504455
$$ packed form
57079C3565092J707480J451451J154975Q22889M61905P6690l28477p42500j144818
57070C7024687j512355j828644k085733k279630k406546k463371k450126k371806
57062A9626476k238965k066534j870776j666179j464186j273314j099039r43611
57054G003872q06995o88417n86974n01238m29213l68927l18700k76828k41512
57045B785068k11303j85354j63210j44536j28924j15681j03898r3002q3085p4356
57035A481719o6435n8629n0702m2832l4868k6307j7068p627J986J2668K5062L7701
57023A254668M6526M6541L4683J2151j5649m1890o1862p4301q0032q0252p6295
57012I64288o9990o3154n6653n0436m4405l8847l4073l0115k6818k3984k1358
$$ plain form
57001 504455 485648 469111 454189 440175 426762 414157 402792 392951 384605 377564 371844 367791
56989 367791 365691 365373 366533 369445 375000 383850 395725 409619 424174 437639 447896 453231 453214 448652
56975 448652 440698 430201 417769 404050 389806 375871 363122 352334 343998 338293 335185 334519 336105
56962 336105 339851 345741 353623 363225 374586 388206 404361 422131 439254 452964 460945 461880 455701
56949 455701 443584 427450 409187 390280 372001 355496 341447 329848 320381 313040 308301 306801
56937 306801 308956 314821 324139 336535 351843 370314 392312 417530 444334 469927 491251 505737
56925 505737 511433 507077 492831 470944 445008 417999 391160 364873 340021 317915 299130 283209
56913 283209 269570 258128 248845 241171 234347 228041 222407 217685 213928 211037 208815 207039 205493 204019
$$ packed form
57001E04455j8807j6537j4922j4014j3413j2605j1365r841q346p041n720m053
56989C67791k100l18J160K912N555Q850J1875J3894J4555J3465J0257N335j7m562
56975D48652p954j0497j2432j3719j4244j3935j2749j0788q336n705l108o66J586
56962C36105L746N890P882R602J1361J3620J6155J7770J7123J3710P981R35o179
56949D55701j2117j6134j8263j8907j8279j6505j4049j1599r467p341m739j500
56937C06801K155N865R318J2396J5308J8471K1998K5218K6804K5593K1324J4486
56925E05737N696m356j4246k1887k5936k7009k6839k6287k4852k2106j8785j5921
56913B83209j3639j1442r283p674o824o306n634m722l757k891k222j776j546j474
$$ plain form
56899 204019 202641 201813 202381 204845 208690 212871 217176 222689 230642 241121 253328 266861 282204 299947
56885 299947 319899 341076 362130 381476 397210 407396 410835 407726 399589 388456 376042 363601
56873 363601 352363 343726 338786 337779 340301 346114 355516 368859 386077 407100 432595 463793 501434
56860 501434 545232 594398 647797 702652 753350 792755 815483 819953 807731 781980 746895 707300
56848 707300 667318 629341 594902 566158 545595 534406 532178 538300 552839 575860 606892 645736
56836 645736 693184 750372 817678 894445 978816 1066545 1149793 1217889 1260395 1270766 1248583
56825 1248583 1199241 1131286 1053171 971680 892360 819965 757587 705796 663591 630404 606777
56814 606777 593262 589449 594505 608321 631671 665247 708751 760874 819620 881904 942464 993569
$$ packed form
56899B04019j378q28N68K464L845M181M305N513P953J0479J2207J3533J5343J7743
56885B99947J9952K1177K1054J9346J5734J0186L439l109q137j1133j2414j2441
56873C63601j1238q637m940j007K522N813R402J3343J7218K1023K5495L1198L7641
56860E01434M3798M9166N3399N4855N0698L9405K2728M470j2222k5751l5085l9595
56848G07300l9982l7977l4439k8744k0563j1189k228O122J4539K3021L1032L8844
56836F45736M7448N7188O7306P6767Q4371Q7729Q3248O8096M2506J0371k2183
56825A248583m9342o7955p8115q1491p9320p2395o2378n1791m2205l3187k3627
56814F06777j3515l813N056J3816K3350L3576M3504N2123N8746O2284O0560N1105
$$ plain form
56802 993569 1026865 1036431 1020800 982801 928134 863793 796497 731326 671299 617995 572139 533717
56790 533717 502282 477758 460544 450552 446723 448073 454796 467579 486174 509412 536372 566343
56778 566343 597171 624381 642621 648030 639381 617807 586069 547758 506364 464591 424388 387332
56766 387332 354622 326656 302874 282276 264157 248321 234748 223338 214040 206909 201639 197213
56754 197213 192523 187378 182423 177961 173349 167979 162435 158126 155894 155307 155175 154436 152733 150543 148716
56739 148716 147702 147249 146942 146733 146711 146761 146834 147244 148176 149198 149841 150466 151845 153935 155715 156443 156477 156694
56721 156694 157529 158817 160190 161368 162272 163065 163952 164936 165929 166974 168049 168774 168758 168176 167508 166770 165598
56704 165598 164219 163635 164433 165909 166831 166786 166340 166096 166100 166083 165869 165436 164838 164209 163754 163631 163860 164342 164904
$$ packed form
56802I93569L3296R566j5631l7999n4667o4341o7296o5171o0027n3304m5856l8422
56790E33717l1435k4524j7214r992l829J350O723J2783J8595K3238K6960K9971
56778E66343L0828K7210J8240N409q649k1574l1738l8311m1394m1773m0203l7056
56766C87332l2710k7966k3782k0598j8119j5836j3573j1410r298p131n270m426
56754A97213m690n145m955m462m612n370n544m309k232n87j32p39j703k190j827
56739A48716j014m53l07k09k2N0P3M10R32J022O43O25J379K090J780P28L4K17
56721A56694Q35J288J373J178R04P93Q87R84R93J045J075P25j6n82o68p38j172
56704A65598j379n84P98J476R22m5m46k44Mj7k14m33n98o29m55j23K29M82N62
$$ plain form
56685 164904 165370 165632 165716 165814 166191 166942 167822 168461 168801 169093 169406 169442 169013 168419 168077 168073 168399 169344 171134 173344
56665 173344 175155 176186 176721 177183 177784 178682 180045 181852 183807 185452 186268 186017 185279 185244 186441 187957
56649 187957 188513 188015 187411 187314 187625 188283 189364 190365 190409 189398 188069 186737 185000 182985 181728 181648 181651 180608
56631 180608 179023 178310 178973 180332 181622 182447 182499 181794 181051 181078 181802 182521 182970 183399 183712 183361 182255 181049
56613 181049 180282 179784 179253 178978 179550 180932 182165 182088 180347 177705 175302 173627 172355 171082 169903 169135
56597 169135 168892 169142 169895 171040 172283 173501 174837 176141 176718 176113 174854 173931 173729 173932 174306 174997 176025
56580 176025 176992 177479 177540 177695 178468 179809 180954 181178 180851 181305 183344 186323 189117 191592 194526 198367
56564 198367 202795 207388 212135 217274 223186 230418 239331 249600 260307 270383 278698 284138 286340
$$ packed form
56685A64904M66K62Q4R8L77P51Q80O39L40K92L13L6m29n94l42mL26R45J790K210
56665A73344J811J031N35M62O01Q98J363J807J955J645Q16k51p38l5J197J516
56649A87957N56m98o04r7L11O58J081J001M4j011j329j332j737k015j257q0Lj043
56631A80608j585p13O63J359J290Q25N2p05p43K7P24P19M49M29L13l51j106j206
56613A81049p67m98n31k75N72J382J233p7j741k642k403j675j272j273j179p68
56597A69135k43K50P53J145J243J218J336J304N77o05j259r23k02K03L74O91J028
56580A76025R67M87O1J55P73J341J145K24l27M54K039K979K794K475K934L841
56564A98367M428M593M747N139N912P232Q913J0269J0707J0076Q315N440K202
$$ plain form
56551 286340 286297 285624 285170 284790 284266 283695 282974 281658 279589 277084 274361 271380 268397 266003 264243 262265
56535 262265 259319 255703 252340 249771 247904 246407 244934 243247 241552 240517 240532 241055 241079 240260 239233 238711
56519 238711 238500 237664 235620 232852 230340 228367 226252 223347 219920 216725 214069 211796 209892 208493 207341
56504 207341 205838 203766 201471 199323 197497 196339 196335 197457 199019 200377 201340 201749 201321 200253 199421 199479
56488 199479 200119 200643 200907 201214 201626 201910 202019 202150 202426 202858 203508 204333 204991 205182 205106 205277 205984 207177 208703
56469 208703 210308 211572 212304 212966 214279 216306 218261 219353 219619 219856 220848 222617 224244 224543 223192 221203
56453 221203 220039 220258 221255 222200 222853 223390 223857 224117 224177 224345 225055 226604 228882 231279 233032 233874 234258
56436 234258 234758 235346 235497 235012 234436 234482 235216 236083 236628 236890 237082 237262 237473 237833 238199 237982 236840 235469
$$ packed form
56551B86340m3o73m54l80n24n71p21j316k069k505k723k981k983k394j760j978
56535B62265k946l616l363k569j867j497j473j687j695j035J5N23K4q19j027n22
56519B38711k11q36k044k768k512j973k115k905l427l195k656k273j904j399j152
56504B07341j503k072k295k148j826j158mJ122J562J358R63M09m28j068q32N8
56488A99479O40N24K64L07M12K84J09J31K76M32O50Q25O58J91p6J71P07J193J526
56469B08703J605J264P32O62J313K027J955J092K66K37R92J769J627K99j351j989
56453B21203j164K19R97R45O53N37M67K60O0J68P10J549K278K397J753Q42L84
56436B34258N00N88J51m85n76M6P34Q67N45K62J92J80K11L60L66k17j142j371
$$ plain form
56418 235469 235158 236361 238179 239495 240254 241183 242549 243684 243753 242600 240800 239225 238621 239244 240663 242149
56402 242149 243450 244973 247063 249306 250933 251777 252448 253478 254645 255308 255095 254047 252362 250337 248442
56387 248442 247057 246131 245357 244646 244143 243850 243710 244085 245655 248540 251872 254592 256439 257863 259223 260463
56371 260463 261451 262240 262955 263682 264500 265489 266672 267996 269235 269914 269687 268932 268646 269420 270833 272163 273401
56354 273401 275069 277308 279688 281852 283831 285697 287342 288600 289326 289487 289531 290406 292633 295474 297673
56339 297673 298949 300106 301642 303053 303774 304120 304883 306453 308688 311255 313671 315424 316477 317473 319211
56324 319211 322047 325900 330434 335008 338844 341537 343179 343865 343500 342330 341136 340539 340465 340601 340980 341681
56308 341681 342397 342899 343725 345766 349222 353397 357538 361500 365556 369856 374211 378229 381654 384688 387865
$$ packed form
56418B35469l11J203J818J316P59R29J366J135O9j153j800j575o04O23J419J486
56402B42149J301J523K090K243J627Q44O71J030J167O63k13j048j685k025j895
56387B48442j385r26p74p11n03k93j40L75J570K885L332K720J847J424J360J240
56371B60463R88P89P15P27Q18R89J183J324J239O79k27p55k86P74J413J330J238
56354B73401J668K239K380K164J979J866J645J258P26J61M4Q75K227K841K199
56339B97673J276J157J536J411P21L46P63J570K235K567K416J753J053R96J738
56324C19211K836L853M534M574L836K693J642O86l65j170j194n97p4J36L79P01
56308C41681P16N02Q26K041L456M175M141L962M056M300M355M018L425L034L177
$$ plain form
56293 387865 391547 395680 400117 404908 410050 415256 420252 425155 430256 435568 440889 446242 451995 458552
56279 458552 466061 474359 483085 491941 500890 510038 519353 528754 538451 548862 560181 572438 586014
56266 586014 601579 619325 638762 659551 682020 706557 733092 761649 792867 827356 865076
56255 865076 906083 951525 1003063 1061467 1126555 1198391 1277735 1365226 1460847 1564308 1675216
56244 1675216 1792643 1915072 2041033 2169236 2297816 2423988 2544808 2657886 2760967
56235 2760967 2851232 2925601 2981650 3017909 3033395 3027397 2999930 2952272 2886976 2807337 2716661
56224 2716661 2617630 2512046 2401214 2286746 2171075 2057021 1946672 1840804 1739448 1642834
56214 1642834 1551464 1465583 1385206 1310755 1242977 1181908 1126325 1074724 1026532 982029 941459
$$ packed form
56293C87865L682M133M437M791N142N206M996M903N101N312N321N353N753O557
56279D58552P509Q298Q726Q856Q949R148R315R401R697J0411J1319J2257J3576
56266E86014J5565J7746J9437K0789K2469K4537K6535K8557L1218L4489L7720
56255H65076M1007M5442N1538N8404O5088P1836P9344Q7491R5621J03461J10908
56244A675216J17427J22429J25961J28203J28580J26172J20820J13078J03081
56235B760967R0265P4369N6049L6259J5486n998k7467m7658o5296p9639r0676
56224B716661r9031j05584j10832j14468j15671j14054j10349j05868j01356r6614
56214A642834r1370q5881q0377p4451o7778o1069n5583n1601m8192m4503m0570
$$ plain form
56203 941459 904666 871367 841195 813623 788261 765173 744547 726218 709942 695912 684430
56192 684430 675114 666997 659480 652691 646793 641401 635968 630452 625390 621387 618575 616472 614439 612390
56178 612390 610835 610033 609453 608513 607584 607563 608562 609734 610515 611389 613151 615994 619674 624078 629102 634292
56162 634292 639204 644110 649859 656959 665080 673639 682654 692726 704207 716726 729754 743477 758683
56149 758683 775818 794685 815370 839002 867036 899995 937459 979247 1026026 1078589 1137017
56138 1137017 1200717 1268903 1340599 1414263 1487716 1558640 1625161 1686087 1740768 1789008 1831286
56127 1831286 1868847 1903009 1934015 1960669 1981296 1994892 2001339 2000928 1994169 1981885 1965017 1944018
56115 1944018 1918410 1886859 1847792 1800343 1745013 1683419 1617574 1549723 1482608 1418952 1360221
$$ packed form
56203I41459l6793l3299l0172k7572k5362k3088k0626j8329j6276j4030j1482
56192F84430r316q117p517o789n898n392n433n516n062m003k812k103k033k049
56178F12390j555q02n80r40r29k1R99J172P81Q74J762K843L680M404N024N190
56162F34292M912M906N749P100Q121Q559R015J0072J1481J2519J3028J3723J5206
56149G58683J7135J8867K0685K3632K8034L2959L7464M1788M6779N2563N8428
56138A137017O3700O8186P1696P3664P3453P0924O6521O0926N4681M8240M2278
56127A831286L7561L4162L1006K6654K0627J3596O447m11o759j2284j6868k0999
56115A944018k5608l1551l9067m7449n5330o1594o5845o7851o7115o3656n8731
$$ plain form
56104 1360221 1306403 1257298 1213473 1175583 1143513 1116769 1095081 1077909 1063989 1052309 1043113
56093 1043113 1037079 1033897 1032587 1032853 1034947 1038431 1042295 1046400 1051631 1058351 1065738 1073028 1080465 1088581
56079 1088581 1097307 1106352 1115817 1125883 1136256 1146370 1155937 1165198 1174887 1185897 1198446 1211640
56067 1211640 1224495 1237349 1251526 1267525 1284410 1301251 1318265 1336057 1354514 1373101 1391759
56056 1391759 1410900 1430715 1450865 1470669 1489442 1507012 1524099 1541792 1560470 1579636 1598872
56045 1598872 1618410 1638532 1658968 1679276 1699483 1720038 1741425 1763987 1787894 1813153 1839963
56034 1839963 1868968 1900782 1935239 1971623 2009576 2049322 2090997 2134343 2179092 2225068 2271912
56023 2271912 2319277 2367295 2416327 2466399 2517588 2570804 2627246 2687005 2749077 2812906 2879141
$$ packed form
56104A360221n3818m9105m3825l7890l2070k6744k1688j7172j3920j1680r196
56093A043113o034l182j310K66K094L484L864M105N231O720P387P290P437Q116
56079A088581Q726R045R465J0066J0373J0114R567R261R689J1010J2549J3194
56067A211640J2855J2854J4177J5999J6885J6841J7014J7792J8457J8587J8658
56056A391759J9141J9815K0150J9804J8773J7570J7087J7693J8678J9166J9236
56045A598872J9538K0122K0436K0308K0207K0555K1387K2562K3907K5259K6810
56034A839963K9005L1814L4457L6384L7953L9746M1675M3346M4749M5976M6844
56023B271912M7365M8018M9032N0072N1189N3216N6442N9759O2072O3829O6235
$$ plain form
56012 2879141 2948734 3022149 3099610 3181303 3267088 3356697 3450327 3548414 3650921 3757753 3869773
56001 3869773 3988364 4113937 4245972 4384548 4530626 4684648 4846091 5014777 5191527
55992 5191527 5377310 5572867 5779425 5998735 6232227 6481262 6748154 7035537 7344683
55983 7344683 7676004 8031430 8414735 8829451 9278348 9765267 10295480 10873688 11503640
55974 11503640 12190495 12941985 13766944 14674905 15677978 16791523 18032959 19422678 20987351
55965 20987351 22761166 24784890 27108141 29794993 32926978 36603241 40944138 46097496
55957 46097496 52239256 59568264 68304285 78690460 90993109 105500760 122528321
55950 122528321 142414470 165494347 192048689 222206727 255696564 291360528 326635079
$$ packed form
56012B879141O9593P3415P7461Q1693Q5785Q9609R3630R8087J02507J06832J12020
56001C869773J18591J25573J32035J38576J46078J54022J61443J68686J76750
55992E191527J85783J95557K06558K19310K33492K49035K66892K87383L09146
55983G344683L31321L55426L83305M14716M48897M86919N30213N78208O29952
55974A1503640O86855P51490Q24959R07961J003073J113545J241436J389719J564673
55965B0987351J773815K023724K323251K686852L131985L676263M340897N153358
55957D6097496O141760P329008Q736021J0386175J2302649J4507651J7027561
55950A22528321J9886149K3079877K6554342L0158038L3489837L5663964L5274551
$$ plain form
55943 326635079 357518778 379442967 388806776 384306107 367250082 340793187 308705999
55936 308705999 274385358 240389498 208387233 179305509 153534567 131120905 111910589
55929 111910589 95636844 81971964 70563937 61064877 53152243 46543136 41000019
55922 41000019 36327786 32367399 28990961 26097072 23604270 21445178 19564324 17917429
55914 17917429 16468954 15189159 14053129 13040679 12135184 11322307 10589928 9927981 9327235
55905 9327235 8778803 8275366 7811979 7384851 6989964 6623468 6282648 5965709 5670966
55896 5670966 5396593 5140675 4901238 4676835 4467210 4272560 4092018 3923738 3766629
55887 3766629 3620932 3486822 3363545 3250370 3147307 3054125 2969441 2891279 2817712 2746493
$$ packed form
55943C26635079L0883699K1924189R363809m500669j7056025k6456895l2087188
55936C08705999l4320641l3995860l2002265k9081724k5770942k2413662j9210316
55929A11910589j6273745j3664880j1408027r499060p912634o609107n543117
55922D1000019m672233l960387l376438k893889k492802k159092j880854j646895
55914A7917429j448475j279795j136030j012450r05495q12877p32379o61947o00746
55905I327235n48432n03437m63387m27128l94887l66496l40820l16939k94743
55896E670966k74373k55918k39437k24403k09625j94650j80542j68280j57109
55887C766629j45697j34110j23277j13175j03063r3182q4684p8162p3567p1219
$$ plain form
55877 2746493 2675106 2602107 2527937 2453778 2380129 2306912 2234224 2162264 2090965 2020355 1950962
55866 1950962 1883386 1817843 1754502 1693889 1636592 1582924 1533066 1487057 1444405 1404303 1366599
55855 1366599 1331966 1300758 1272266 1245511 1220124 1195869 1171856 1146958 1120787 1093741 1066256
55844 1066256 1038493 1010608 982928 955907 930082 905862 883230 861875 841724 823057 805970
55833 805970 790108 775099 760880 747429 734547 722095 710114 698600 687523 677125 667713 658997
55821 658997 650124 640543 630378 619831 608835 597575 586720 576695 567180 557791 548872 541202 535176
55808 535176 530561 526774 523141 519305 515688 513269 512601 513379 515131 517814 521431 525601 529963 534582 539428
55793 539428 543761 546539 547262 546117 543567 540142 536290 532013 526945 521191 515691 511113 506522 499818
$$ packed form
55877B746493p1387p2999p4170p4159p3649p3217p2688p1960p1299p0610o9393
55866A950962o7576o5543o3341o0613n7297n3668m9858m6009m2652m0102l7704
55855A366599l4633l1208k8492k6755k5387k4255k4013k4898k6171k7046k7485
55844A066256k7763k7885k7680k7021k5825k4220k2632k1355k0151j8667j7087
55833H05970j5862j5009j4219j3451j2882j2452j1981j1514j1077j0398r412q716
55821F58997q873r581j0165j0547j0996j1260j0855j0025r515r389q919p670o026
55808E35176m615l787l633l836l617k419o68P78J752K683L617M170M362M619M846
55793E39428M333K778P23j145k550l425l852m277n068n754n500m578m591o704
$$ plain form
55779 499818 489590 476210 461231 446218 432240 419955 409718 401674 395902 392611 392056 394076 397486
55766 397486 400145 400112 396956 391755 385882 380081 374609 369482 364267 358225 351158 343768 336739 329791 322149
55751 322149 313676 305005 296739 289018 281839 275238 269160 263558 258702 255029 252574 250851 249422 248299
55737 248299 247615 247077 246062 244297 242313 241033 240850 241263 241505 241384 241207 241003 240197 238139 234727 230450
55721 230450 226101 222425 219698 217581 215657 214109 213439 213532 213625 213373 213365 214258 215984 218214 221018 224434 227790
55704 227790 230189 231526 232373 232984 232990 232037 230106 227097 222686 216872 210383 204229 198980 194525 190424 186394
55688 186394 182595 179533 177669 177115 177674 179006 180721 182473 184134 185828 187797 190369 193940 198537 203251
55673 203251 206589 207775 207442 206698 205792 204114 201286 197764 194384 191709 189855 188638 187835 187487 187890 189151
$$ packed form
55779D99818j0228j3380j4979j5013j3978j2285j0237q044n772l291n55K020L410
55766C97486K659l3l156n201n873n801n472n127n215o042p067p390p029o948p642
55751C22149q473q671q266p721p179o601o078n602m856l673k455j723j429j123
55737B48299o84n38j015j765j984j280j83M13K42j21j77k04q06k058l412m277
55721B30450m349l676k727k117j924j548o70R3R3k52qQ93J726K230K804L416L356
55704B27790K399J337Q47O11Or53j931l009m411n814o489o154n249m455m101m030
55688A86394l799l062j864n54N59J332J715J752J661J694J969K572L571M597M714
55673B03251L338J186l33p44r06j678k828l522l380k675j854j217q03l48M03J261
$$ plain form
55657 189151 190895 192653 194397 196365 198506 200465 202141 203922 206248 209089 211869 213735 214021 212730
55643 212730 210622 208597 206947 205262 202978 199833 195841 191092 185673 179700 173418 167243 161603 156651
55629 156651 152270 148471 145569 143775 142784 142054 141456 141365 142011 142866 142839 141173 138281 135538 134082 133813 133774
55612 133774 133341 132580 131520 129790 127335 124889 123170 121973 120611 119031 117845 117305 116835 115755 114113
55597 114113 112599 111775 111517 111185 110354 109331 108717 108506 108002 106817 105492 104813 104899 105355 105978 106792 107600 108090
55579 108090 108248 108221 107901 107121 106186 105749 106172 107404 109319 111661 113710 114648 114434 113906 113877 114427 115091 115391
55561 115391 115140 114540 114037 113783 113315 112062 110116 108117 106535 105470 104999 105060 105107 104586 103831 103730 104304 104368
55543 104368 103057 101038 99741 99903 101398 103932 107063 109752 110868 110363 109414 109119 109457 109767 109861 110260
$$ packed form
55657A89151J744J758J744J968K141J959J676J781K326K841K780J866K86j291
55643B12730k108k025j650j685k284l145l992m749n419n973o282o175n640m952
55629A56651m381l799k902j794r91p30n98r1O46Q55k7j666k892k743j456k69l9
55612A33774m33p61j060j730k455k446j719j197j362j580j186n40m70j080j642
55597A14113j514q24k58l32q31j023o14k11n04j185j325o79Q6M56O23Q14Q08M90
55579A08090J58k7l20p80r35m37M23J232J915K342K049R38k14n28k9N50O64L00
55561A15391k51o00n03k54m68j253j946j999j582j065m71O1M7n21p55j01N74O4
55543A04368j311k019j297J62J495K534L131K689J116n05r49k95L38L10R4L99
$$ plain form
55527 110260 111393 112984 114248 114456 113275 110858 107835 104964 102484 99957 97092 94560 93441 93852 94708
55512 94708 95065 95116 95562 96559 97762 98899 99732 99866 99236 98406 97735 96578 94157 90954 88291 86593 85024
55495 85024 82901 80467 78035 75324 72124 68863 66028 63619 61641 60543 60682 61837 63676 66156 69021
55480 69021 71462 72908 73689 74415 75117 75625 76325 77702 79356 80264 80009 79089 78038 76893 75722 74987 75081
55463 75081 75780 76464 76727 76661 76690 77207 78220 79255 79675 79199 78178 77431 77698 79005 80476 81031 80417 79369
55445 79369 78692 78521 78613 78885 79235 79139 78060 76245 74664 74045 74253 74688 75016 75345 75865 76491 76927 77040 77071
55426 77071 77340 77810 78165 78305 78414 78521 78448 78398 79101 80960 83334 85146 86020 86399 86733 87045 87297 87645 88181
55407 88181 88729 89039 88976 88480 87547 86302 84944 83559 82122 80721 79635 79194 79558 80549 81625 82210 82201 81958
$$ packed form
55527A10260J133J591J264K08j181k417l023k871k480k527k865k532j119M11Q56
55512I4708L57N1M46R97J203J137Q33J34o30q30o71j157k421l203k663j698j569
55495H5024k123k434k432k711l200l261k835k409j978j098J39J155J839K480K865
55480F9021K441J446P81P26P02N08P00J377J654R08k55r20j051j145j171p35R4
55463G5081O99O84K63o6K9N17J013J035M20m76j021p47K67J307J471N55o14j048
55445G9369o77j71R2K72L50r6j079j815j581o19K08M35L28L29N20O26M36J13L1
55426G7071K69M70L55J40J09J07p3n0P03J859K374J812Q74L79L34L12K52L48N36
55407H8181N48L10o3m96r33j245j358j385j437j401j086m41L64R91J076N85rk43
$$ plain form
55389 81958 81661 80939 79444 77553 76107 75526 75581 75962 76668 77737 78997 80195 81144 81649 81549 80959 80256
55372 80256 79706 79271 78868 78614 78664 78939 79167 79186 79149 79469 80522 82232 83884 84522 83738 82103 80732 80351
55354 80351 80808 81476 82039 82728 83785 84945 85630 85543 84811 83665 82313 81093 80369 80125 79994 79771 79579 79441
55336 79441 79053 78241 77262 76428 75778 75426 75823 77184 78923 80167 80688 80927 81286 81887 82878 84340 85862
55319 85862 86692 86492 85635 84657 83778 82983 82310 81924 82099 83027 84394 85318 85196 84566 84573 85532 86554 86780 86418
55300 86418 86172 86120 85723 84737 83585 82782 82377 82061 81605 81028 80463 80036 79909 80322 81413 82929 84253 84896
55282 84896 84974 85121 85952 87523 89141 89673 88430 86031 84133 83912 84942 85881 86062 85949 86218 86976 87981
55265 87981 89026 89856 90179 90052 89913 90002 90046 89743 89286 89098 89286 89612 89779 89518 88649 87394 86448 86328 86704
$$ packed form
55389H1958k97p22j495j891j446n81N5L81P06J069J260J198R49N05j00n90p03
55372H0256n50m35m03k54N0K75K28J9l7L20J053J710J652O38p84j635j371l81
55354H0351M57O68N63O89J057J160O85q7p32j146j352j220p24k44j31k23j92j38
55336G9441l88q12r79q34o50l52L97J361J739J244N21K39L59O01R91J462J522
55319H5862Q30k00q57r78q79p95o73l86J75R28J367R24j22o30PR59J022K26l62
55300H6418k46n2l97r86j152q03m05l16m56n77n65m27j27M13J091J516J324O43
55282H4896P8J47Q31J571J618N32j243k399j898k21J030R39J81j13K69P58J005
55265H7981J045Q30L23j27j39Q9M4l03m57j88J88L26J67k61q69j255r46j20L76
$$ plain form
55246 86704 86679 85801 84515 83596 83332 83387 83334 83114 82940 82883 82766 82577 82696 83432 84464 85161 85440 85840 86548 86845
55226 86845 85925 84003 82179 81363 81697 82845 84356 85720 86582 87124 87914 89126 90171 90344 89646 88684 87903
55209 87903 87279 86730 86453 86643 87083 87269 86860 85950 84997 84633 85347 86996 88653 89237 88437 86894 85496 84694
55191 84694 84549 85015 85966 87071 87945 88385 88457 88469 88857 89783 90814 91279 91062 90650 90281 89638 88724 88384 89249
55172 89249 90580 91025 90360 89591 89334 89042 88133 87043 86601 86927 87535 88220 89265 90876 92835 94678 95970
55155 95970 96452 96077 94948 93201 91106 89212 88046 87620 87525 87602 88096 89038 89894 90140 89857 89456 89086 88630
55137 88630 88045 87399 86715 86129 86029 86733 88108 89674 91048 92106 92868 93379 93598 93306 92383 91281 90868
55120 90868 91510 92594 93248 93291 93189 93306 93651 94158 94792 95449 96094 96915 97986 98902 99168 98865 98504 98276 97912
$$ packed form
55246H6704k5q78j286r19k64N5n3k20j74n7j17j89J19P36J032O97K79M00P08K97
55226H6845r20j922j824q16L34J148J511J364Q62N42P90J212J045J73o98r62p81
55209H7903o24n49k77J90M40J86m09r10r53l64P14J649J657N84q00j543j398q02
55191H4694j45M66R51J105Q74M40P2J2L88R26J031M65k17m12l69o43r14l40Q65
55172H9249J331M45o65p69k57k92r09j090m42L26O08O85J045J611J959J843J292
55155I5970M82l75j129j747k095j894j166m26r5P7M94R42Q56K46k83m01l70m56
55137H8630n85o46o84n86j00P04J375J566J374J058P62N11K19k92r23j102m13
55120I0868O42J084O54M3j02J17L45N07O34O57O45Q21J071R16K66l03l61k28l64
$$ plain form
55101 97912 97321 96807 96425 95635 94069 92415 92024 93561 96299 98834 100269 100645 100481 100271 100443 101353 102912
55084 102912 104331 104657 103722 102355 101533 101498 101785 101853 101547 101165 101273 102259 103914 105550 106640 107119 107017 106192
55066 106192 104736 103318 102699 102988 103686 104297 104639 104731 104764 105097 105861 106641 106848 106409 105749 105229 104961 105128 105975
55047 105975 107381 108812 109814 110284 110215 109580 108626 107919 107788 107923 107733 107014 106097 105525 105651 106384 107173 107438
55029 107438 107209 107155 107717 108382 108175 106893 105491 105028 105495 105992 105921 105589 105532 105668 105474 104789 103997 103424 103005
55010 103005 102639 102515 102839 103481 104132 104678 105240 106001 107101 108532 109983 110991 111426 111639 111984 112411 112670
54993 112670 112646 112269 111404 110077 108630 107389 106400 105746 105794 106748 108177 109438 110403 111383 112503 113535 114217
54976 114217 114357 113821 112806 111950 111701 111724 111407 110784 110444 110650 111132 111656 112169 112445 112229 111778 111624 111755 111685
$$ packed form
55101I7912n91n14l82p90j566j654l91J537K738K535J435L76j64k10J72R10J559
55084A02912J419L26r35j367q22l5K87O8l06l82J08R86J655J636J090M79j02q25
55066A06192j456j418o19K89O98O11L42R2L3L33P64P80K07m39o60n20k68J67Q47
55047A05975J406J431J002M70o9o35r54p07j31J35j90p19r17n72J26P33P89K65
55029A07438k29n4N62O65k07j282j402m63M67M97p1l32n7J36j94o85p92n73m19
55010A03005l66j24L24O42O51N46N62P61J100J431J451J008M35K13L45M27K59
54993A12670k4l77q65j327j447j241r89o54M8R54J429J261R65R80J120J032O82
54976A14217J40n36j015q56k49K3l17o23l40K06M82N24N13K76k16m51j54J31p0
$$ plain form
54957 111685 111400 111511 112297 113305 114112 114740 115063 114647 113604 112825 112774 112800 112349 112126 113125 114979 116374 116880
54939 116880 117288 118059 118512 117957 116849 116224 116420 116955 117505 118446 120284 122782 124997 126262 127012 128359 130816
54922 130816 133710 136050 137713 139502 142233 146093 150788 155922 161154 166190 170718 174247 176122 175901
54908 175901 173732 170219 165951 161245 156282 151276 146496 142224 138617 135579 132870 130383 128195 126244
54894 126244 124252 122145 120341 119362 119282 119744 120336 120806 121143 121707 123059 125314 127835 129870 131402 133059
54878 133059 135359 138365 141954 145969 150141 154269 158514 163211 168353 173437 177744 180525 181204 179855
54864 179855 177349 174493 171046 166133 159695 152916 147019 142213 138112 134675 132209 130795 130152 129940 129811
54849 129811 129264 127826 125397 122275 118983 116167 114415 113816 113732 113306 112229 110948 110204 110465 111654 113199
$$ packed form
54957A11685k85J11P86J008Q07O28L23m16j043p79n1K6m51k23R99J854J395N06
54939A16880M08P71M53n55j108o25J96N35N50R41J838K498K215J265P50J347K457
54922A30816K894K340J663J789K731L860M695N134N232N036M528L529J875k21
54908A75901k169l513m268m706m963n006m780m272l607l038k709k487k188j951
54894A26244j992k107j804r79q0M62N92M70L37N64J352K255K521K035J532J657
54878A33059K300L006L589M015M172M128M245M697N142N084M307K781O79j349
54864A79855k506k856l447m913o438o779n897m806m101l437k466j414o43k12j29
54849A29811n47j438k429l122l292k816j752n99q4m26j077j281p44K61J189J545
$$ plain form
54833 113199 114438 115094 115327 115367 115296 115268 115531 115977 115968 115014 113474 112231 111753 111852 112233 112803 113403 113720 113666 113498
54813 113498 113359 113056 112539 112327 113048 114599 116107 116784 116608 116153 115893 115858 115837 115772 115812 116078 116489 116922 117422
54794 117422 118115 118928 119551 119671 119181 118182 116961 115924 115341 115060 114687 114135 113786 113968 114487 114922 115269 116006
54776 116006 117530 119702 122001 123992 125680 127507 129928 132871 135685 137879 139864 142716 147120 152749
54762 152749 158707 164367 169686 174885 179965 184430 187440 188409 187550 185624 183077 179617 174806 168882 162750
54747 162750 157287 152810 149100 145704 142296 138997 136324 134648 133732 132975 132039 131048 130228 129663 129441 129729
54731 129729 130556 131660 132732 133758 135078 137104 139956 143239 146284 148783 151271 154775 159838 165936
54717 165936 171883 176738 180293 182807 184434 184944 184019 181758 178742 175491 172032 168184 164105 160243 156732
$$ packed form
54833A13199J239O56K33M0p1k8K63M46rr54j540j243m78R9L81N70O00L17n4j68
54813A13498j39l03n17k12P21J551J508O77j76m55k60l5k1o5M0K66M11M33N00
54794A17422O93Q13O23J20m90r99j221j037n83k81l73n52l49J82N19M35L47P37
54776A16006J524K172K299J991J688J827K421K943K814K194J985K852M404N629
54762A52749N958N660N319N199N080M465L010R69q59j926k547l460m811n924o132
54747A62750n463m477l710l396l408l299k673j676r16p57r36r91q20n65k22K88
54731A29729Q27J104J072J026J320K026K852L283L045K499K488L504N063O098
54717A65936N947M855L555K514J627N10r25k261l016l251l459l848m079l862l511
$$ plain form
54702 156732 153188 149241 145081 141321 138484 136676 135627 134929 134351 133959 133823 133630 132849 131336 129578 128199
54686 128199 127401 127004 126768 126477 125929 125140 124512 124515 125141 125845 126069 125737 125185 124748 124500 124351 124278 124317 124405 124360 124051
54665 124051 123463 122538 121183 119576 118214 117397 116908 116532 116643 117701 119324 120524 120986 121432 122411 123357 123356
54648 123356 122410 121301 120503 119851 119212 118884 119134 119706 119966 119459 118368 117541 117924 119722 122129 124034 124872
54631 124872 124694 123801 122649 121867 121777 121981 121871 121543 121698 122609 123691 124357 124777 125423 126137 126121 124852 122715
54613 122715 120702 119667 119858 120946 122320 123373 123687 123218 122400 121970 122458 123704 124895 125155 124203 122574
54597 122574 121228 120837 121429 122654 124221 125859 127072 127415 127044 126536 126030 125047 123434 121932 121281 121189 120825
54580 120825 120108 119742 120039 120442 120369 119948 119640 119639 119919 120525 121424 122326 122953 123376 123841 124344 124535 124086 123139 122403
$$ packed form
54702A56732l544l947m160l760k837j808j049o98n78l92j36j93p81j513j758j379
54686A28199p98l97k36k91n48p89o28LO26P04K24l32n52m37k48j49p3L9Q8m5l09
54665A24051n88r25j355j607j362q17m89l76J11J058J623J200M62M46R79R46j
54648A23356r46j109p98o52o39l28K50N72K60n07j091q27L83J798K407J905Q38
54631A24872j78q93j152p82r0K04j10l28J55R11J082O66M20O46P14j6j269k137
54613A22715k013j035J91J088J374J053L14m69q18m30M88J246J191K60r52j629
54597A22574j346l91N92J225J567J638J213L43l71n08n06r83j613j502o51r2l64
54580A20825p17l66K97M03p3m21l08jK80O06Q99R02O27M23M65N03J91m49r47p36
$$ plain form
54560 122403 122628 123790 124931 125055 124156 123090 122590 122739 123284 123925 124281 124053 123455 123078 123202 123557 123897 124348
54542 124348 125070 126071 127567 129939 132952 135519 136807 137233 137814 138805 139626 139963 140157 140395 140192 139049
54526 139049 137222 135444 134177 133500 133497 134269 135467 136248 135981 134888 133738 132981 132443 131849 131294 130997 130860
54509 130860 130584 130096 129639 129501 129850 130664 131533 131740 130984 129907 129416 129492 129216 128071 126631 125748 125625 126032
54491 126032 126902 128176 129399 130091 130415 130989 132061 133222 133902 133865 133254 132475 132004 132088 132555 133087 133586 134132
54473 134132 134755 135438 136263 137310 138480 139602 140575 141264 141466 141218 140906 140695 140106 138655 136857 136024 136900
54456 136900 138825 140460 141018 140656 139983 139479 139313 139371 139374 139084 138546 138183 138488 139492 140517 140697 139793 138320
54438 138320 136863 135585 134494 133787 133601 133745 134025 134580 135472 136179 136056 135243 134545 134413 134533 134501 134419 134609
$$ packed form
54560A22403K25J162J141J24q99j066n00J49N45O41L56k28n98l77J24L55L40M51
54542A24348P22J001J496K372L013K567J288M26N81R91Q21L37J94K38k03j143
54526A39049j827j778j267o77lP72J198P81k67j093j150p57n38n94n55k97j37
54509A30860k76m88m57j38L49Q14Q69K07p56j077m91P6k76j145j440q83j23M07
54491A26032Q70J274J223O92L24N74J072J161O80l7o11p79m71Q4M67N32M99N46
54473A34132O23O83Q25J047J170J122R73O89K02k48l12k11n89j451j798q33Q76
54456A36900J925J635N58l62o73n04j66N8Lk90n38l63L05J004J025J80r04j473
54438A38320j457j278j091p07j86J44K80N55Q92P07j23q13o98j32J20l2q2J90
$$ plain form
54420 134609 135196 136202 137714 139640 141582 143161 144285 144915 144884 144239 143518 143326 143679 144026 143917 143505 143355
54403 143355 143876 144926 145987 146729 147319 148022 148629 148640 148076 147682 148141 149327 150543 151249 151271 150651 149669 148928
54385 148928 148975 149773 150730 151236 151061 150376 149650 149391 149709 150161 150301 150342 150942 152412 154460 156696 158927 160875
54367 160875 162126 162649 162976 163485 163831 163530 162901 162911 164102 166119 168296 170278 171968 173346 174678 176564
54351 176564 179413 182891 186089 188170 188755 187906 186030 183717 181369 178884 175843 172081 168030 164432 161732
54336 161732 159734 157892 155987 154391 153507 153061 152343 151165 150146 149834 150002 150132 150213 150544 151033 151252 151094
54319 151094 150769 150222 149179 147869 147054 147057 147285 147056 146494 146216 146436 146837 147109 147223 147210 147022 146681 146389 146412
54300 146412 146849 147455 147723 147319 146445 145619 145124 144865 144735 144765 144861 144765 144428 144142 144158 144405 144670 144806 144735 144598
$$ packed form
54420A34609N87J006J512J926J942J579J124O30l1o45p21j92L53L47j09m12j50
54403A43355N21J050J061P42N90P03O07J1n64l94M59J186J216P06K2o20r82p41
54385A48928M7P98R57N06j75o85p26k59L18M52J40M1O00J470K048K236K231J948
54367A60875J251N23L27N09L46l01o29J0J191K017K177J982J690J378J332J886
54351A76564K849L478L198K081N85q49j876k313k348k485l041l762m051l598k700
54336A61732j998j842j905j596q84m46p18j178j019l12J68J30Q1L31M89K19j58
54319A51094l25n47j043j310q15LK28k29n62k78K20M01K72J14j3j88l41k92K3
54300A46412M37O06K68m04q74q26m95k59j30L0R6r6l37k86J6K47K65J36p1j37
$$ plain form
54280 144598 144891 146004 147553 148663 149060 149323 149919 150626 151227 152042 153239 154216 154363 154022 153974 154329 154593 154630
54262 154630 154874 155696 157060 158675 160037 160547 160076 159193 158442 157775 157191 157351 158738 160612 161750 161980 162023
54245 162023 162019 161348 159950 158723 158313 158441 158656 158885 158913 158263 157012 156000 155765 155964 156160 156422 156698 156462
54227 156462 155580 154806 154744 154918 154596 154037 154158 155284 156895 158368 159373 159786 159740 159569 159310 158527 157008 155233
54209 155233 153741 152484 151374 150898 151423 152237 152162 151033 149831 149372 149496 149587 149262 148503 147626 147198 147543 148305
54191 148305 148896 149314 150057 151245 152417 153183 153573 153605 153055 151901 150587 149662 149377 149733 150611 151677 152468
54174 152468 152731 152613 152474 152694 153539 154928 156340 157245 157644 157917 158170 158053 157228 155711 153723 151526 149525
54157 149525 148226 147897 148386 149293 150183 150723 150861 150870 151026 151285 151480 151703 152160 152711 152961 152851 152812 153180 153779
$$ packed form
54280A44598K93J113J549J110L97K63N96P07O01Q15J197R77J47l41m8L55K64L7
54262A54630K44Q22J364J615J362N10m71q83p51o67n84J60J387J874J138K30M3
54245A62023mo71j398j227m10J28K15K29K8o50j251j012k35J99J96K62K76k36
54227A56462q82p74o2J74l22n59J21J126J611J473J005M13m6j71k59p83j519j775
54209A55233j492j257j110m76N25Q14p5j129j202m59J24R1l25p59q77m28L45P62
54191A48305N91M18P43J188J172P66L90L2n50j154j314r25k85L56Q78J066P91
54174A52468K63j18j39K20Q45J389J412R05L99K73K53j17q25j517j988k197k001
54157A49525j299l29M89R07Q90N40J38RJ56K59J95K23M57N51K50j10l9L68N99
$$ plain form
54138 153779 154271 154689 155378 156458 157523 157916 157337 156173 155218 155065 155820 157226 158728 159465 158824 157332 156597
54121 156597 157819 160579 163393 165193 165872 165852 165751 166212 167323 168279 168232 167400 166748 166705 166907 167081 167337 167569
54103 167569 167464 167284 167749 168823 169492 169145 168399 168046 167967 167739 167577 167901 168507 169027 169813 171510 173961 176343
54085 176343 178229 179815 181175 182120 182880 184211 186579 189709 193143 196797 200830 205319 210151 214862 218487
54070 218487 220068 219588 218121 216860 216121 215346 213775 211007 207188 202907 198811 195244 192321 190227 189125
54055 189125 188765 188607 188494 188861 190037 191649 193042 194114 195327 196980 198842 200526 201943 203232 204527
54040 204527 206021 208124 211263 215473 220292 225208 230128 235326 240942 246659 251960 256688 261256 266267
54026 266267 271910 277782 283274 288001 291788 294446 295929 296744 297857 299879 302464 304680 305819 305634 304120
$$ packed form
54138A53779M92M18O89J080J065L93n79j164r55j53P55J406J502P37o41j492p35
54121A56597J222K760K814J800O79k0j01M61J111R56m7q32o52m3K02J74K56K32
54103A67569j05j80M65J074O69l47p46l53p9k28j62L24O06N20P86J697K451K382
54085A76343J886J586J360R45P60J331K368L130L434L654M033M489M832M711L625
54070B18487J581m80j467j261p39p75j571k768l819m281m096l567k923k094j102
54055A89125l60j58j13L67J176J612J393J072J213J653J862J684J417J289J295
54040B04527J494K103L139M210M819M916M920N198N616N717N301M728M568N011
54026B66267N643N872N492M727L787K658J483Q15J113K022K585K216J139j85j514
$$ plain form
54011 304120 301569 298798 296710 295349 293707 290672 286001 280254 274130 268090 262345 256898 251705 246961
53997 246961 243070 240164 237896 235914 234254 232970 231641 229671 226993 224087 221362 218881 216657 214826
53983 214826 213401 212139 210735 209050 207117 205145 203497 202436 201881 201626 201683 202089 202434 202077 200999 200079
53967 200079 200195 201259 202413 202989 202970 202656 202306 202199 202722 204021 205632 206751 207063 207225 208295 210659 213659
53950 213659 216345 218380 220107 222016 224440 227607 231544 235895 240224 244712 250222 257440 266122 275452
53936 275452 284978 294851 305212 315730 325870 335377 344150 351775 357540 361052 362671 363093 362613 361044
53922 361044 358374 355160 352132 349633 347715 346589 346667 348171 351020 355062 360085 365552 370718 375271 379603
53907 379603 384118 388412 391465 392670 392394 391501 390569 389680 388723 387562 385916 383348 379618 374968 369905
$$ packed form
54011C04120k551k771k088j361j642l035m671n747o124o040n745n447n193m744
53997B46961l891k906k268j982j660j284j329j970k678k906k725k481k224j831
53983B14826j425j262j404j685j933j972j648j061n55k55N7M06L45l57j078r20
53967B00079J16J064J154N76j9l14l50j07N23J299J611J119L12J62J070K364L000
53950B13659K686K035J727J909K424L167L937M351M329M488N510P218Q682R330
53936B75452R526R873J0361J0518J0140R507Q773P625N765L512J619M22m80j569
53922C61044k670l214l028k499j918j126P8J504K849M042N023N467N166M553M332
53907C79603M515M294L053J205k76q93r32q89r57j161j646k568l730m650n063
$$ plain form
53892 369905 364682 359115 352905 346001 338581 330883 323238 316147 310037 304884 300266 295812 291473 287306
53878 287306 283194 278941 274518 270091 265901 262202 259204 256867 254739 252196 248927 245188 241521 238344
53864 238344 235785 233782 232130 230472 228462 226156 224126 222969 222621 222388 221748 220919 220427 220319 220167 219758
53848 219758 219348 219049 218378 216817 214674 212945 212230 212031 211326 209661 207546 205774 204560 203435 201931 200224
53832 200224 199008 198819 199621 200998 202469 203517 203672 202979 202305 202686 204217 205873 206686 206828 207267 208575
53816 208575 210472 212468 214425 216371 218179 219809 221648 224219 227563 231141 234314 236765 238530 239902
53802 239902 241369 243452 246418 250200 254552 259213 263927 268508 272898 277138 281221 285024 288348 290949
53788 290949 292693 293820 294940 296489 298215 299403 299578 298757 297178 295167 293149 291218 288638 284412 278653
$$ packed form
53892C69905n223n567o210o904p420p698p645p091o110n153m618m454m339m167
53878B87306m112m253m423m427m190l699k998k337k128k543l269l739l667l177
53864B38344k559k003j652j658k010k306k030j157l48k33o40q29m92j08j52m09
53848B19758m10k99o71j561k143j729p15j99p05j665k115j772j214j125j504j707
53832B00224j216j89Q02J377J471J048J55o93o74L81J531J656Q13J42M39J308
53816B08575J897J996J957J946J808J630J839K571L344L578L173K451J765J372
53802B39902J467K083K966L782M352M661M714M581M390M240M083L803L324K601
53788B90949J744J127J120J549J726J188J75q21j579k011k018j931k580m226n759
$$ plain form
53773 278653 272783 267941 263649 258613 252493 246200 240724 236367 233080 230776 229129 227608 225966 224307
53759 224307 222629 220828 219238 218571 218935 219384 218877 217353 215497 213746 212012 210202 208546 207392 206919
53744 206919 207005 207253 207344 207521 208451 210293 212221 213278 213478 213529 213624 213153 211754 210074 209181 209549 210922 212888
53726 212888 215223 217739 220100 221905 222951 223436 223870 224677 225863 227213 228660 230226 231680 232680 233297
53711 233297 233998 234952 235807 236425 237412 239394 242052 244453 246258 248009 250169 252472 254490 256370 258600
53696 258600 261319 264267 267316 270671 274512 278696 282858 286666 289906 292398 293914 294209 293221 291270 288886
53681 288886 286351 283581 280632 278121 276826 276865 277503 277869 277711 277443 277593 278241 278860 278753 277786 276599 275898
53664 275898 275594 274990 273770 272447 271729 271783 272309 272956 273434 273535 273402 273564 274315 275199 275405 274593 273101 271569
$$ packed form
53773B78653n870m842m292n036o120o293n476m357l287k304j647j521j642j659
53759B24307j678j801j590o67L64M49n07j524j856j751j734j810j656j154m73
53744B06919Q6K48R1J77R30J842J928J057K00N1R5m71j399j680q93L68J373J966
53726B12888K335K516K361J805J046M85M34Q07J186J350J447J566J454J000O17
53711B33297P01R54Q55O18R87J982K658K401J805J751K160K303K018J880K230
53696B58600K719K948L049L355L841M184M162L808L240K492J516K95r88j951k384
53681B88886k535k770k949k511j295L9O38L66j58k68J50O48O19j07r67j187p01
53664B75898l04o04j220j323p18N4N26O47M78J01j33J62P51Q84K06q12j492j532
$$ plain form
53646 271569 270651 270866 272184 273755 274542 274285 273589 273095 273016 273492 274806 276983 279569 282092 284459 286652
53630 286652 288393 289502 290419 291982 294672 298189 301685 304301 305748 306636 308145 311127 315499 320527 325505
53615 325505 330099 334380 338795 343850 349470 354856 359275 362858 366325 370099 374104 378252 382552 386722
53601 386722 390205 392765 394675 396165 397074 397296 397154 397000 396674 395799 394530 393546 393210 393000 391996 389859
53585 389859 387131 384605 382560 380746 378973 377429 376318 375454 374464 373237 371852 370204 368094 365757 363852
53570 363852 362745 362156 361714 361504 361692 361915 361584 360762 360227 360566 361565 362656 363606 364499 365327 366015 366772 368021
53552 368021 369846 371854 373713 375591 377793 380146 382148 383686 385193 386898 388324 388941 389154 390179 392896
53537 392896 397132 402152 407436 412822 418253 423826 429954 437046 444973 453191 461537 470642 481303 493543
$$ packed form
53646B71569r18K15J318J571P87k57o96m94p9M76J314K177K586K523K367K193
53630B86652J741J109R17J563K690L517L496K616J447Q88J509K982M372N028M978
53615C25505M594M281M415N055N620N386M419L583L467L774M005M148M300M170
53601C86722L483K560J910J490R09K22j42j54l26q75j269r84l36k10j004k137
53585C89859k728k526k045j814j773j544j111q64r90j227j385j648k110k337j905
53570C63852j107n89m42k10J88K23l31q22n35L39R99J091R50Q93Q28O88P57J249
53552C68021J825K008J859J878K202K353K002J538J507J705J426O17K13J025K717
53537C92896M236N020N284N386N431N573O128P092P927Q218Q346R105J0661J2240
$$ plain form
53523 493543 506550 519509 532255 545094 558287 571995 586522 602165 618798 636016 653910
53512 653910 673292 694680 717313 739814 761869 784655 809263 835105 860403 884082 906746
53501 906746 929816 954019 978822 1003010 1025643 1046612 1066474 1085853 1104991 1123816 1142253
53490 1142253 1160370 1178293 1196100 1213807 1231369 1248711 1265827 1282806 1299755 1316758 1333831
53479 1333831 1350785 1367148 1382511 1396982 1410934 1424137 1435476 1443888 1449330 1452465 1453654 1452693
53467 1452693 1449363 1443631 1435333 1424235 1410633 1395519 1379970 1364633 1349730 1335088 1320022 1303692
53455 1303692 1285880 1267069 1247605 1227254 1205881 1184080 1162664 1141848 1121426 1101420 1082077
53444 1082077 1063453 1045583 1028901 1013921 1000583 988482 977710 968883 962264 957469 954160 952368
$$ packed form
53523D93543J3007J2959J2746J2839J3193J3708J4527J5643J6633J7218J7894
53512F53910J9382K1388K2633K2501K2055K2786K4608K5842K5298K3679K2664
53501I06746K3070K4203K4803K4188K2633K0969J9862J9379J9138J8825J8437
53490A142253J8117J7923J7807J7707J7562J7342J7116J6979J6949J7003J7073
53479A333831J6954J6363J5363J4471J3952J3203J1339Q412N442L135J189r61
53467A452693l330n732q298j1098j3602j5114j5549j5337j4903j4642j5066j6330
53455A303692j7812j8811j9464k0351k1373k1801k1416k0816k0422k0006j9343
53444A082077j8624j7870j6682j4980j3338j2101j0772q827o619m795l309j792
$$ plain form
53432 952368 951833 951685 951380 951588 953604 958002 964302 971800 980186 989358 999163 1009607 1021103 1034273
53418 1034273 1049484 1066640 1085284 1104881 1125102 1145986 1167888 1191326 1216781 1244539 1274548
53407 1274548 1306421 1339628 1373787 1408924 1445591 1484610 1526462 1570871 1617141 1664897 1714223
53396 1714223 1765073 1816931 1869351 1922582 1977245 2033443 2090468 2147365 2203539 2258825 2313246
53385 2313246 2366788 2419137 2469565 2517303 2562134 2604464 2644592 2682050 2715802 2745028 2769505
53374 2769505 2789327 2804549 2815229 2821546 2823514 2820577 2811716 2796181 2774000 2745700 2711711 2672311
53362 2672311 2628057 2579908 2528755 2475082 2419256 2361996 2304300 2247032 2190742 2135795 2082440
53351 2082440 2030812 1981109 1933719 1888953 1846551 1805690 1765551 1725783 1686336 1647133 1608111
$$ packed form
53432I52368n35j48l05K08K016M398O300P498Q386R172R805J0444J1496J3170
53418A034273J5211J7156J8644J9597K0221K0884K1902K3438K5455K7758L0009
53407A274548L1873L3207L4159L5137L6667L9019M1852M4409M6270M7756M9326
53396A714223N0850N1858N2420N3231N4663N6198N7025N6897N6174N5286N4421
53385B313246N3542N2349N0428M7738M4831M2330M0128L7458L3752K9226K4477
53374B769505J9822J5222J0680O317J968k937q861j5535k2181k8300l3989l9400
53362B672311m4254m8149n1153n3673n5826n7260n7696n7268n6290n4947n3355
53351B082440n1628m9703m7390m4766m2402m0861m0139l9768l9447l9203l9022
$$ plain form
53340 1608111 1569534 1532045 1496303 1462636 1431092 1401804 1375214 1351816 1331690 1314381 1299275
53329 1299275 1285938 1273947 1262550 1250820 1238287 1225263 1212438 1200273 1188803 1177844 1167234
53318 1167234 1156960 1147269 1138565 1131047 1124439 1118294 1112601 1107989 1105267 1104855 1106626 1110031 1114237 1118449
53304 1118449 1122566 1127491 1134450 1143853 1155118 1167706 1181914 1198372 1217151 1237832 1260198 1284247
53292 1284247 1309601 1335568 1362003 1389478 1418252 1447433 1475533 1501588 1525478 1547482 1567945
53281 1567945 1587116 1604841 1620458 1633288 1643089 1649718 1652658 1651379 1646100 1637774 1627302 1615104
53269 1615104 1601258 1585556 1567455 1546580 1523381 1498877 1473674 1447646 1420636 1392857 1364445
53258 1364445 1335180 1304977 1274223 1243310 1212282 1181335 1151235 1122687 1095487 1068772 1042020
$$ packed form
53340A608111l8577l7489l5742l3667l1544k9288k6590k3398k0126j7309j5106
53329A299275j3337j1991j1397j1730j2533j3024j2825j2165j1470j0959j0610
53318A167234j0274r691q704p518o608o145n693m612k722m12J771L405M206M212
53304A118449M117M925O959R403J1265J2588J4208J6458J8779K0681K2366K4049
53292A284247K5354K5967K6435K7475K8774K9181K8100K6055K3890K2004K0463
53281A567945J9171J7725J5617J2830R801O629K940j279n279q326j0472j2198
53269A615104j3846j5702j8101k0875k3199k4504k5203k6028k7010k7779k8412
53258A364445k9265l0203l0754l0913l1028l0947l0100k8548k7200k6715k6752
$$ plain form
53247 1042020 1015456 989605 964785 940938 917611 894161 870279 846270 822666 799747 777637
53236 777637 756618 736962 718697 701979 687497 675937 666930 658989 650651 641493 632094 623341 615729
53223 615729 608868 601584 592848 582707 571968 560974 549199 536195 522374 508488 494810 481328
53211 481328 468461 456939 446987 438160 430070 422815 416441 410397 403985 397273 391139 386239 382142 377722
53197 377722 372324 366283 360285 354477 348465 341982 335267 328767 322773 317415 312805 308977 305784 302940
53183 302940 300131 297060 293583 289951 286767 284495 282986 281641 280042 278318 276825 275584 274219 272419
53169 272419 270365 268524 267107 265919 264775 263795 263122 262537 261670 260540 259554 258900 258271 257302 256020 254684
53153 254684 253423 252241 251221 250438 249827 249423 249602 250656 252083 252724 251880 250093 248547 247820 247465 246763
$$ packed form
53247A042020k6564k5851k4820k3847k3327k3450k3882k4009k3604k2919k2110
53236G77637k1019j9656j8265j6718j4482j1560r007p941q338r158r399q753p612
53223F15729o861p284q736j0141j0739j0994j1775j3004j3821j3886j3678j3482
53211D81328j2867j1522r952q827q090p255o374o044o412o712o134m900m097m420
53197C77722n398o041n998n808o012o483o715o500n994n358m610l828l193k844
53183C02940k809l071l477l632l184k272j509j345j599j724j493j241j365j800
53169B72419k054j841j417j188j144r80o73n85q67j130r86o54o29r69j282j336
53153B54684j261j182j020p83o11m04J79J054J427O41q44j787j546p27l55p02
$$ plain form
53137 246763 245612 244616 244532 245726 247977 250608 252835 254196 254760 254922 255002 255042 254981 254957 255348 256435 257997 259314
53119 259314 259723 259265 258680 258723 259543 260728 261796 262435 262471 261909 261073 260436 260188 260140 260106 260148 260274 260043 258786
53100 258786 256274 253072 250162 248191 247014 245948 244554 243115 242204 241879 241596 241010 240498 240666 241566 242655
53084 242655 243365 243441 242889 241944 241015 240433 240263 240533 241434 242988 244655 245651 245658 244938 243830 242541 241366 240614
53066 240614 240180 239587 238600 237462 236435 235523 234767 234344 234154 233761 233025 232377 232116 231921 231538 231530 232647 234663
53048 234663 236515 237556 237992 238061 237546 236391 235200 234593 234392 233901 232836 231596 230677 230160 229778 229219 228357
53031 228357 227374 226726 226789 227453 228170 228493 228554 228909 229936 231425 232792 233622 233978 234180 234406 234527 234282 233574
53013 233574 232726 232454 233368 235285 237173 238020 237725 236928 236107 235216 234198 233400 233237 233736 234602 235513 236108 236031
$$ packed form
53137B46763j151r96q4J194K251K631K227J361N64J62Q0M0o1k4L91J087J562J317
53119B59314M09m58n85M3Q20J185J068O39L6n62q36o37k48m8l4M2J26k31j257
53100B58786k512l202k910j971j177j066j394j439r11l25k83n86n12J68R00J089
53084B42655P10P6n52r45r29n82j70K70R01J554J667R96Pp20j108j289j175p52
53066B40614m34n93r87j138j027r12p56m23j90l93p36o48k61j95l83qJ117K016
53048B34663J852J041M36O9n15j155j191o07k01m91j065j240r19n17l82n59q62
53031B28357r83o48O3O64P17L23O1L55J027J489J367Q30L56K02K26J21k45p08
53013B33574q48k72R14J917J888Q47k95p97q21q91j018p98j63M99Q66R11N95p7
$$ plain form
52995 236031 235339 234716 234845 235651 236458 236859 237042 237276 237507 237631 237822 238371 239399 240887 242812 245062 247375
52978 247375 249537 251512 253279 254726 255844 256806 257671 258195 258162 257692 257039 256303 255689 255758 256960 258934 260736
52961 260736 261804 262327 262667 262917 263153 263560 263973 263677 262099 259513 256738 254312 252268 250513 249005 247580
52945 247580 245997 244289 242831 241985 241794 242028 242380 242601 242621 242596 242725 242993 243125 242829 242046 240976 239867 238753
52927 238753 237474 236078 235088 235048 235779 236423 236356 235742 235030 234418 234132 234735 236495 238640 239933 239991 239556 239452
52909 239452 239765 240099 240070 239415 238108 236568 235410 234795 234391 234033 233955 234189 234249 233765 233027 232594 232665 233211 234352
52890 234352 236129 238116 239787 241156 242654 244376 245866 246676 246897 246990 247266 247572 247464 246723 245674 244884
52874 244884 244590 244716 245387 246951 249280 251542 253096 254234 255606 257246 258693 259802 260776 261499 261550 260986
$$ packed form
52995B36031o92o23J29Q06Q07M01J83K34K31J24J91N49J028J488J925K250K313
52978B47375K162J975J767J447J118R62Q65N24l3m70o53p36o14O9J202J974J802
52961B60736J068N23L40K50K36M07M13k96j578k586k775k426k044j755j508j425
52945B47580j583j708j458q46j91K34L52K21K0k5J29K68J32k96p83j070j109j114
52927B38753j279j396r90m0P31O44o7o14p12o12k86O03J760K145J293N8m35j04
52909B39452L13L34k9o55j307j540j158o15m04l58p8K34O0m84p38m33P1N46J141
52890B34352J777J987J671J369J498J722J490Q10K21R3K76L06j08p41j049p90
52874B44884k94J26O71J564K329K262J554J138J372J640J447J109R74P23N1n64
$$ plain form
52858 260986 260479 260410 260377 259925 259314 259091 259126 258580 256847 254155 251167 248176 244926 241176 237229 233774 231282
52841 231282 229675 228562 227509 226073 223944 221405 219382 218703 219334 220581 221838 222799 223158 222716 221867 221496
52825 221496 222075 223102 223616 223104 221804 220394 219511 219400 219792 220225 220576 221177 222395 224214 226261 228097
52809 228097 229505 230650 231971 233693 235422 236457 236496 235796 234656 233099 231191 229322 227903 226990 226398
52794 226398 225966 225530 224846 223898 223133 223136 223995 225111 225659 225203 223948 222474 221229 220323 219879 220376 222269 225179
52776 225179 227835 229062 228691 227395 225855 224310 222755 221294 220296 220225 221191 222655 223789 224235 224276 224217 223923
52759 223923 223176 222129 221120 220320 219893 220189 221306 222612 223235 223087 223015 223864 225669 227780 229468 230370 230722
52742 230722 231242 232551 234603 236868 239000 241018 242799 243896 244080 243784 243725 244231 245066 245742 245876 245534 245464
$$ packed form
52858B60986n07o9l3m52o11k23L5n46j733k692k988k991l250l750l947l455k492
52841B31282j607j113j053j436k129k539k023o79O31J247J257R61L59m42q49l71
52825B21496N79J027N14n12j300j410q83j11L92M33L51O01J218J819K047J836
52809B28097J408J145J321J722J729J035L9p00j140j557j908j869j419r13n92
52794B26398m32m36o84r48p65LQ59J116N48m56j255j474j245r06m44M97J893K910
52776B25179K656J227l71j296j540j545j555j461r98p1R66J464J134M46M1n9k94
52759B23923p47j047j009q00m27K96J117J306O23j48p2Q49J805K111J688R02L52
52742B30722N20J309K052K265K132K018J781J097J84k96n9N06Q35O76J34l42p0
$$ plain form
52725 245464 246668 249358 252411 254219 254086 252573 250616 248721 247039 245719 244819 244122 243376 242608 241941 241144
52709 241144 239711 237500 235059 233139 232056 231644 231652 231893 232072 231826 231125 230445 230338 230866 231673 232532 233576
52692 233576 234889 236094 236605 236324 235899 236161 237338 238935 240295 241116 241404 241236 240769 240359 240316 240522 240513 240051
52674 240051 239408 238924 238492 237700 236437 235155 234502 234810 235954 237484 238858 239662 239851 239854 240350 241747 243763
52657 243763 245571 246526 246770 247101 248247 250374 253179 256206 259035 261359 263025 263855 263419 261317 257893
52642 257893 254401 252066 251062 250623 250034 249211 248405 247836 247673 247969 248423 248473 247907 247192 247026 247657 248839 250265
52624 250265 251846 253624 255615 257637 259189 259622 258688 256874 254942 253179 251308 249132 246996 245516 245021
52609 245021 245320 245856 246015 245521 244723 244372 244915 246086 247314 248438 249794 251651 253789 255682 256981 257750
$$ packed form
52725B45464J204K690L053J808j33j513j957j895j682j320r00o97p46p68o67p97
52709B41144j433k211k441j920j083m12QK41J79k46p01o80j07N28Q07Q59J044
52692B33576J313J205N11k81m25K62J177J597J360Q21K88j68m67m10m3K06rm62
52674B40051o43m84m32p92j263j282o53L08J144J530J374Q04J89LM96J397K016
52657B43763J808R55K44L31J146K127K805L027K829K324J666Q30m36k102l424
52642B57893l492k335j004m39n89q23q06n69j63K96M54N0n66p15j66O31J182J426
52624B50265J581J778J991K022J552M33r34j814j932j763j871k176k136j480m95
52609B45021K99N36J59m94p98l51N43J171J228J124J356J857K138J893J299P69
$$ plain form
52593 257750 258358 259139 260044 260630 260554 260041 259647 259527 259201 258210 256730 255353 254487 254246 254730 255992 257732 259348
52575 259348 260405 260884 261012 261099 261533 262578 264063 265478 266410 266663 265963 264100 261561 259548 258870 259019 258792
52558 258792 257710 256313 255132 254017 252748 251810 251970 253170 254318 254376 253467 252660 252795 253692 254541 254822 254639
52541 254639 254303 253918 253464 253016 252665 252324 251881 251498 251601 252452 253803 255031 255672 255820 256027 256812 258315 260406
52523 260406 262872 265282 266942 267433 267246 267397 268231 268998 268937 268353 268251 269158 270770 272597 274427 276272 278249
52506 278249 280524 283011 285161 286508 287311 288140 288790 288243 285925 282496 279054 276010 273121 270267 267732
52491 267732 265898 265019 265138 265853 266330 265903 264705 263474 262822 262858 263367 264066 264758 265478 266408 267499 268372 268851
52473 268851 269354 270394 271838 273115 274045 274941 275882 276491 276646 276941 278087 280201 282949 286092 289513 292907
$$ packed form
52593B57750O08P81R05N86p6n13l94j20l26r91j480j377q66k41M84J262J740J616
52575B59348J057M79J28Q7M34J045J485J415R32K53p00j863k539k013o78J49k27
52558B58792j082j397j181j115j269r38J60J200J148N8r09q07J35Q97Q49K81j83
52541B54639l36l85m54m48l51l41m43l83J03Q51J351J228O41J48K07P85J503K091
52523B60406K466K410J660M91j87J51Q34P67o1n84j02R07J612J827J830J845J977
52506B78249K275K487K150J347Q03Q29O50n47k318l429l442l044k889k854k535
52491B67732j834q79J19P15M77m27j198j231o52L6N09O99O92P20R30J091Q73M79
52473B68851N03J040J444J277R30Q96R41O09J55K95J146K114K748L143L421L394
$$ plain form
52457 292907 295796 297740 298312 297110 294189 290397 286810 283782 280828 277510 274057 271062 268867 267431
52443 267431 266505 265699 264620 263204 261801 260744 259912 258928 257646 256202 254757 253477 252694 252679 253202 253673
52427 253673 253850 254082 254723 255639 256548 257460 258469 259369 259976 260600 261667 262884 263485 263463 263953 265993 269305
52410 269305 272800 275988 279327 283400 288405 294518 302167 311589 322392 333691 344361 352999 358125
52397 358125 358958 355911 350048 342202 332991 323464 315088 308854 304712 302034 300245 298876 297458 295878
52383 295878 294668 294451 295138 296032 296770 297733 299403 301630 303795 305549 307168 309264 312171 315523 318466
52368 318466 320522 322307 324990 328889 332966 336007 337961 339607 341167 341945 341437 340225 339389 339337 339577 339557
52352 339557 339449 339973 341480 343272 344070 343330 341919 341240 341843 343347 345522 348698 352911 357366 361322 365041
$$ packed form
52457B92907K889J944N72j202k921l792l587l028k954l318l453k995k195j436
52443B67431r26q06j079j416j403j057q32r84j282j444j445j280p83j5N23M71
52427B53673J77K32O41R16R09R12J009R00O07O24J067J217O01k2M90K040L312
52410B69305L495L188L339M073N005O113P649R422J0803J1299J0670Q638N126
52397C58125Q33l047n863p846r211r527q376o234m142k678j789j369j418j580
52383B95878j210k17O87Q94P38R63J670K227K165J754J619K096K907L352K943
52368C18466K056J785K683L899M077L041J954J646J560P78n08j212q36n2K40k0
52352C39557j08N24J507J792P98p40j411o79O03J504K175L176M213M455L956L719
$$ plain form
52336 365041 369270 374122 379152 384406 390581 397980 406007 414108 422783 433183 445829 460102 474934
52323 474934 489711 504446 519355 534542 550131 566466 583839 601897 619619 636175 651732
52312 651732 667194 683185 699579 715945 732069 747948 763641 779348 795326 811493 827226
52301 827226 841754 854690 866149 876547 886436 896241 905856 914508 921191 925212 926376 924961 921637
52288 921637 917120 911622 904923 897226 889507 882582 876166 869482 862633 856580 851751 847570 843717 841146
52274 841146 841180 843993 848593 854060 860197 867158 875078 884162 894555 905940 917571 928912 939959
52261 939959 950892 961779 972785 984278 996384 1008641 1020503 1032090 1044019 1056358 1068098
52250 1068098 1078019 1086060 1093449 1101239 1108844 1114399 1116561 1115586 1112473 1107554 1100480 1091372 1081260 1071197
$$ packed form
52336C65041M229M852N030N254O175P399Q027Q101Q675J0400J2646J4273J4832
52323D74934J4777J4735J4909J5187J5589J6335J7373J8058J7722J6556J5557
52312F51732J5462J5991J6394J6366J6124J5879J5693J5707J5978J6167J5733
52301H27226J4528J2936J1459J0398R889R805R615Q652O683M021J164j415l324
52288I21637m517n498o699p697p719o925o416o684o849o053m829m181l853k571
52274H41146L4K813M600N467O137O961P920R084J0393J1385J1631J1341J1047
52261I39959J0933J0887J1006J1493J2106J2257J1862J1587J1929J2339J1740
52250A068098R921Q041P389P790P605N555K162r75l113m919p074r108j0112j0063
$$ plain form
52236 1071197 1061385 1051371 1040716 1029219 1016919 1004297 992268 981575 972238 963793 955904 948507
52224 948507 941635 935463 930379 926580 923647 920961 918491 916791 916117 916004 915911 915950 916685 918485 921350 925241
52208 925241 930184 935915 941653 946489 950078 952839 955372 957799 959907 961838 964220 967430 971168 975095
52194 975095 979438 984435 989535 993906 997634 1001600 1006063 1010202 1013321 1015667 1017542 1018327 1017209 1014413
52180 1014413 1010876 1006870 1001720 994859 986530 977446 968366 960038 952949 946907 941354 936221 931969 928654
52166 928654 925608 922470 920043 919533 921181 924125 927490 931092 935029 939036 942523 945088 946828 948110
52152 948110 949096 949512 949006 947758 946593 946373 947350 949201 951482 953852 955964 957518 958559 959541 960905 962669
52136 962669 964505 966211 967964 970091 972698 975709 979301 984157 991144 1000752 1012931 1027411 1044012
$$ packed form
52236A071197r812j0014j0655j1497j2300j2622j2029j0693r337q445p889p397
52224I48507o872o172n084l799k933k686k470j700o74j13r3L9P35J800K865L891
52208I25241M943N731N738M836L589K761K533K427K108J931K382L210L738L927
52194I75095M343M997N100M371L728L966M463M139L119K346J875P85j118k796
52180A014413l537m006n150o861q329r084r080q328p089o042n553n133m252l315
52166I28654l046l138k427n10J648K944L365L602L937M007L487K565J740J282
52152I48110R86M16n06j248j165k20R77J851K281K370K112J554J041R82J364J764
52136I62669J836J706J753K127K607L011L592M856O987R608J2179J4480J6601
$$ plain form
52123 1044012 1062571 1082761 1104146 1126520 1150158 1175620 1203113 1231934 1260679 1288139 1313945
52112 1313945 1338243 1361038 1382170 1401667 1419550 1435248 1447902 1457527 1465359 1472616 1479305 1484692
52100 1484692 1488594 1491529 1493813 1495254 1495787 1495708 1494942 1492584 1487615 1479836 1469852 1458344 1445584 1431477
52086 1431477 1415819 1398727 1380992 1363832 1348086 1333787 1320717 1309131 1299641 1292558 1287711 1284783
52074 1284783 1283452 1283290 1283979 1285779 1289506 1295888 1305018 1316411 1329291 1342752 1355990 1368620 1380734
52061 1380734 1392597 1404388 1416201 1428002 1439416 1449775 1458619 1466076 1472647 1478683 1484126 1488575
52049 1488575 1491434 1492117 1490292 1485929 1479124 1470035 1459023 1446574 1432892 1417826 1401389 1384127 1366697
52036 1366697 1349273 1331785 1314593 1298463 1283824 1270393 1257642 1245228 1232929 1220496 1207864
$$ packed form
52123A044012J8559K0190K1385K2374K3638K5462K7493K8821K8745K7460K5806
52112A313945K4298K2795K1132J9497J7883J5698J2654R625P832P257O689N387
52100A484692L902K935K284J441N33p9p66k358m969p779r984j1508j2760j4107
52086A431477j5658j7092j7735j7160j5746j4299j3070j1586r490p083m847k928
52074A284783j331j62O89J800L727O382R130J1393J2880J3461J3238J2630J2114
52061A380734J1863J1791J1813J1801J1414J0359Q844P457O571O036N443M449
52049A488575K859O83j825m363o805r089j1012j2449j3682j5066j6437j7262j7430
52036A366697j7424j7488j7192j6130j4639j3431j2751j2414j2299j2433j2632
$$ [...]
##END NTUPLES=NMR SPECTRUM
##END=
