
##TITLE=UV1251_M10_1340-1211_20_7409529_2z6uBc3Oqe
##JCAMPDX= 6.0         $$ Bruker NMR JCAMP-DX V2.0
##DATA TYPE= NMR SPECTRUM
##DATA CLASS= NTUPLES
##ORIGIN= BRUKER
##OWNER= Administrator
$$ 1.72 TOPSPIN		Version 2.1
$$ 2013-01-24 18:40:59.495 -0500  Administrator@X
$$ Compression mode = diff/dup
##.OBSERVE FREQUENCY= 400.02188249412
##.OBSERVE NUCLEUS= ^1H
##.ACQUISITION MODE= SIMULTANEOUS (DQD)
##.ACQUISITION SCHEME= undefined
##.AVERAGES= 8
##.DIGITISER RES= 22
##SPECTROMETER/DATA SYSTEM= spect
##.PULSE SEQUENCE= zg30
##.SOLVENT NAME= COFFEE_meoh
##.SHIFT REFERENCE= INTERNAL, COFFEE_meoh, 1, 14.98509
##AUDIT TRAIL= $$ (NUMBER, WHEN, WHO, WHERE, PROCESS, VERSION, WHAT)
$$ ##TITLE= Audit trail, TOPSPIN		Version 2.1
$$ ##JCAMPDX= 5.01
$$ ##ORIGIN= Bruker BioSpin GmbH
$$ ##OWNER= Administrator
$$ $$ E:\/data/COFFEE/nmr/UV1251_M10_1340-1211_20_7409529_2z6uBc3Oqe/10/pdata/1/auditp.txt
$$ ##AUDIT TRAIL=  $$ (NUMBER, WHEN, WHO, WHERE, PROCESS, VERSION, WHAT)
(   1,<2013-01-24 18:40:51.432 -0500>,<Administrator>,<X>,<go>,<TOPSPIN 2.1>,
      <created by zg
	started at 2013-01-24 18:39:44.979 -0500,
	POWCHK enabled, PULCHK disabled,
       configuration hash MD5:
       86 BA 57 50 F2 9D 5C 9B 26 00 A9 28 5F 66 2E 89
       data hash MD5: 64K
       A8 51 2E DA E7 B5 F3 A6 DE 92 CE 3B E2 A8 E7 AB>)
(   2,<2013-01-24 18:40:54.510 -0500>,<Administrator>,<X>,<proc1d>,<TOPSPIN 2.1>,
      <Start of raw data processing
       efp LB = 0 FT_mod = 6 PKNL = 1 PHC0 = 0 PHC1 = 0 SI = 32K 
       data hash MD5: 32K
       A6 D0 58 66 40 B4 64 74 04 E3 69 AB D3 DD 27 A0>)
(   3,<2013-01-24 18:40:54.995 -0500>,<Administrator>,<X>,<proc1d>,<TOPSPIN 2.1>,
      <pk PHC0 = 98.82202 PHC1 = 0 
       data hash MD5: 32K
       27 AC D6 F9 80 68 24 52 F8 8B F4 3F 99 3F C9 E1>)
(   4,<2013-01-24 18:40:55.214 -0500>,<Administrator>,<X>,<proc1d>,<TOPSPIN 2.1>,
      <abs ABSG = 1 
       data hash MD5: 32K
       3D 3C C7 64 F0 51 C9 D6 DE 79 4C EC 13 D4 6D C1>)
(   5,<2013-01-24 18:40:55.370 -0500>,<Administrator>,<X>,<proc1d>,<TOPSPIN 2.1>,
      <abs ABSG = 2 
       data hash MD5: 32K
       61 9C ED 3A 5F 32 5B F6 95 F2 78 DF 62 AF 03 0B>)
(   6,<2013-01-24 18:40:55.526 -0500>,<Administrator>,<X>,<proc1d>,<TOPSPIN 2.1>,
      <abs ABSG = 3 
       data hash MD5: 32K
       CC B9 E6 01 55 4F 5B 63 94 F6 35 93 96 72 99 EE>)
(   7,<2013-01-24 18:40:55.667 -0500>,<Administrator>,<X>,<proc1d>,<TOPSPIN 2.1>,
      <abs ABSG = 4 
       data hash MD5: 32K
       C5 EF 5D E2 21 44 82 98 AC 2E 2C 9E 7F C2 24 75>)
(   8,<2013-01-24 18:40:55.807 -0500>,<Administrator>,<X>,<proc1d>,<TOPSPIN 2.1>,
      <abs ABSG = 5 
       data hash MD5: 32K
       21 1E 5D B8 DA DD F0 66 BF F6 22 B4 A6 D0 9B 71>)
$$ ##END=
$$ 
$$ $$ hash MD5
$$ $$ F2 F8 F0 AF 90 12 54 90 76 6C CD 28 D1 0F EA 8C
##$RELAX= 
##$RELAX= 
##$RELAX= 
##$RELAX= 
##$RELAX= 
##$RELAX= 
##$RELAX= 
$$ Bruker specific parameters
$$ --------------------------
##$DU= <E:\>
##$EXPNO= 10
$$ [...]
150 150 150 150 150 150 150 150
##$TP07= 0
##$TPNAME0= <>
##$TPNAME1= <>
##$TPNAME2= <>
##$TPNAME3= <>
##$TPNAME4= <>
##$TPNAME5= <>
##$TPNAME6= <>
##$TPNAME7= <>
##$TPOAL= (0..7)
0.5 0.5 0.5 0.5 0.5 0.5 0.5 0.5
##$TPOFFS= (0..7)
0 0 0 0 0 0 0 0
##$TUNHIN= 0
##$TUNHOUT= 0
##$TUNXOUT= 0
##$USERA1= <user>
##$USERA2= <user>
##$USERA3= <user>
##$USERA4= <user>
##$USERA5= <user>
##$V9= 5
##$VALIST= <valist>
##$VCLIST= <CCCCCCCCCCCCCCC>
##$VD= 0
##$VDLIST= <DDDDDDDDDDDDDDD>
##$VPLIST= <PPPPPPPPPPPPPPP>
##$VTLIST= <TTTTTTTTTTTTTTT>
##$WBST= 1024
##$WBSW= 4
##$XGAIN= (0..3)
0 0 0 0
##$XL= 0
##$YL= 0
##$YMAX_a= 629553
##$YMIN_a= -537537
##$ZGOPTNS= <>
##$ZL1= 120
##$ZL2= 120
##$ZL3= 120
##$ZL4= 120
##$ABSF1= 14.98509
##$ABSF2= -5.573092
##$ABSG= 5
##$ABSL= 3
##$ALPHA= 0
##$AQORDER= 0
##$ASSFAC= 0
##$ASSFACI= 0
##$ASSFACX= 0
##$ASSWID= 0
##$AUNMP= <proc_prof1d_extract_pilot.lims>
##$AXLEFT= 0
##$AXNAME= <>
##$AXNUC= <1H>
##$AXRIGHT= 0
##$AXTYPE= 0
##$AXUNIT= <>
##$AZFE= 0.1
##$AZFW= 0.1
##$BCFW= 0
##$BC_mod= 0
##$BYTORDP= 0
##$COROFFS= 0
##$CY= 15
##$DATMOD= 1
##$DC= 0
##$DFILT= <>
##$DTYPP= 0
##$F1P= 0
##$F2P= 0
##$FCOR= 0.5
##$FTSIZE= 32768
##$FT_mod= 6
##$GAMMA= 0
##$GB= 0
##$INTBC= 1
##$INTSCL= 1
##$ISEN= 128
##$LB= 0
##$LEV0= 0
##$LPBIN= 0
##$MAXI= 10000
##$MC2= 0
##$MEAN= 0
##$ME_mod= 0
##$MI= 0
##$NCOEF= 0
##$NC_proc= -8
##$NLEV= 6
##$NOISF1= 0
##$NOISF2= 0
##$NSP= 0
##$NTH_PI= 0
##$NZP= 0
##$OFFSET= 14.98509
##$PC= 1
##$PHC0= 98.82202
##$PHC1= 0
##$PH_mod= 1
##$PKNL= yes
##$PPARMOD= 0
##$PPDIAG= 0
##$PPIPTYP= 0
##$PPMPNUM= 2147483647
##$PPRESOL= 1
##$PSCAL= 4
##$PSIGN= 0
##$PYNMP= <proc.py>
##$REVERSE= no
##$SF= 400.02
##$SI= 32768
##$SIGF1= 0
##$SIGF2= 0
##$SINO= 400
##$SIOLD= 32768
##$SPECTYP= <>
##$SREGLST= <1H.CDCl3>
##$SSB= 0
##$STSI= 32768
##$STSR= 0
##$SW_p= 8223.68421052631
##$SYMM= 0
##$S_DEV= 0
##$TDeff= 65536
##$TDoff= 0
##$TI= <>
##$TILT= no
##$TM1= 0
##$TM2= 0
##$TOPLEV= 0
##$USERP1= <user>
##$USERP2= <user>
##$USERP3= <user>
##$USERP4= <user>
##$USERP5= <user>
##$WDW= 1
##$XDIM= 32768
##$YMAX_p= 475072114
##$YMIN_p= -818190
##$CURPLOT= <Network HP LaserJet P1505>
##$CURPRIN= <$Network HP LaserJet P1505>
##$DFORMAT= <normdp>
##$LAYOUT= <+/1D_H.xwp>
##$LFORMAT= <normlp>
##$PFORMAT= <normpl>
##$SURQMSG= 1
$$ End of Bruker specific parameters
$$ ---------------------------------
##NTUPLES= NMR SPECTRUM
##VAR_NAME=  FREQUENCY,     SPECTRUM/REAL,   SPECTRUM/IMAG
##SYMBOL=    X,             R,               I
##VAR_TYPE=  INDEPENDENT,   DEPENDENT,       DEPENDENT
##VAR_FORM=  AFFN,          ASDF,            ASDF
##VAR_DIM=   32768,         32768,           32768
##UNITS=     HZ,            ARBITRARY UNITS, ARBITRARY UNITS
##FACTOR=    0.250966925370066, 1,           1
##FIRST=     8223.43324360094, -92240,       -62326
##LAST=      0,             -37496,          -155909
##MIN=       0,             -818190,         0
##MAX=       8223.43324360094, 475072114,    0
$$ Real data points
##PAGE= N=1
##DATA TABLE= (X++(R..R)), XYDATA
$$ [...]
$$ plain form
19564 -96329 -81122 18805 44265 -171810 -126129 -30622 -31769 254240 -192990 94990 -159314
19552 49668 -25723 -47896 146769 -29763 -106480 -13034 -99917 -32394 -47024 -293801 -89051
19540 -151655 -6677 6801 -6957 -83517 212767 -122808 80662 -7603 -114784 69629 114229 63447
19528 63447 -20871 -27825 -221346 -166408 175681 56354 -159798 77113 -168513 -51435 -203814
19517 -203814 -134632 13927 -79981 170374 194276 24531 -226372 -181469 -397379 108598 59832
19506 59832 -95043 -62718 -86573 -143450 -161169 -349127 -30914 -175949 -178619 42945 -95701
19494 159097 -272651 89701 -83233 101428 -342691 -23381 -100130 199400 174481 -151795
19483 -68053 83256 -296845 13781 219398 18311 -18524 -121937 145983 -118174 169494
$$ packed form
19564i6329J5207A8805K5460a71810M5681c0622j147B54240a92990I4990a59314
19552D9668b5723k2173A46769b9763p6717a3034q6883c2394j4630k46777h9051
19540a51655f677F801f957p6560B12767a22808H0662g603j07181F9629M4600n0782
19528F3447b0871o954j93521N4938A75681E6354a59798G7113a68513e1435j52379
19517b03814O9182A3927g9981A70374K3902B4531b26372M4903k15910A08598m8766
19506E9832i5043L2325k3855n6877j7719j87958c0914j45035k670D2945i5701
19494A59097b72651H9701h3233A01428c42691b3381p6749A99400k4919a51795
19483f8053H3256b96845A3781K05617A8311a8524j03413A45983a18174A69494
$$ plain form
19472 -69509 93158 217468 30349 -133500 95663 -155137 -79529 80066 -266700 710 227918
19461 227918 72678 47151 110661 -237172 109818 119902 85437 119783 -92817 -147653 -104151
19450 -104151 9823 104427 -96502 -17366 -407927 213419 39590 190865 93389 256746 169042
19439 169042 -30163 68123 -68084 -122415 -52100 22266 -23280 -185140 153062 279358 -295189
19427 -220042 211948 -341292 -192225 -90932 -64455 -27577 -47677 -17255 -173761 -118446 15731
19415 -270656 255651 124413 328431 -136476 160427 -2807 22014 -355238 -60933 -78611
19405 -78611 -30827 6864 -91195 -52629 134770 -84420 -13581 203042 -93291 285846 30586
19393 -466669 57381 -218892 -180756 46770 198743 -32425 -92481 -32827 -303837 -17788 66456
$$ packed form
19472f9509I3158J24310C0349a33500I5663a55137P5608H0066b66700G10K27208
19461B27918G2678k5527O3510b37172A09818J0084l4465L4346i2817n4836M3502
19450a04151I823R4604i6502a7366l90561B13419C9590J51275I3389J63357q7704
19439A69042c0163F8123f8084n4331e2100B2266b3280j61860A53062J26296b95189
19427b20042B11948c41292J49067i0932K6477b7577k0100a7255j56506N5315A5731
19415b70656B55651A24413K04018a36476A60427b807B2014c55238f0933j7678
19405g8611c0827F864i1195L8566A34770h4420a3581B03042i3291B85846C0586
19393d66669E7381b18892L8136D6770J51973c2425o0056c2827k71010a7788F6456
$$ plain form
19381 -5753 -369815 47215 -164446 -562071 -22868 -26900 81051 22567 -202653 -192333 -363387
19370 -363387 -118323 -110208 -386000 -139929 320245 -181552 -177371 -250575 42096 -659930 46030
19358 199893 -239008 189884 183522 263631 -209332 -432983 -251173 -12534 -188894 -230819
19348 -230819 -1791 -136031 -226201 22028 31025 -46728 -109509 -284025 -144266 -168312 -307497
19337 -307497 -164526 -448366 271606 252742 -185938 -276748 -46151 41046 28157 -138479
19326 -359250 -224440 299096 76242 -196858 107953 116320 -56986 -70062 -85424 83936 -247275
19314 298702 -3891 -108144 244753 274964 137354 -74242 86533 124889 -111703 127601 -109820
19302 -290483 -155777 -173605 86828 -188396 148187 -335703 -355836 169245 254268 -354790
$$ packed form
19381e753l64062D7215a64446l97625b2868m032H1051B2567b02653J0320j71054
19370c63387a18323Q115k75792a39929C20245a81552M181p3204D2096f59930D6030
19358A99893b39008A89884o362Q0109b09332k23651J81810a2534j76360m1925
19348b30819a791j34240r0170B2028Q997d6728o2781j74516J39759k4046j39185
19337c07497J42971k83840B71606j8864a85938r0810d6151D1046j2889a38479
19326c59250J34810B99096G6242a96858A07953Q367e6986j3076j5362H3936b47275
19314B98702c891j04253B44753L0211A37354g4242H6533L8356a11703A27601a09820
19302b90483J34706j7828H6828a88396A48187c35703k0133A69245Q5023c54790
$$ plain form
19291 -302866 55711 137965 84056 -345898 -236616 -218297 -109722 -34626 260095 161370 -270137
19279 71801 -354169 -154290 -93318 -343551 -6303 -166430 41610 -334052 314837 -109600
19268 -153267 53477 18687 -196711 -196292 -101516 -215756 16383 343577 -38552 50700 -204467
19256 18672 -277119 -63921 370648 -172535 -252875 -182189 -295831 132390 -87872 124153
19245 182445 -18229 360300 -402414 -93103 -197492 -425146 -372309 -116557 77597 2756 28341
19234 28341 17964 -210426 29057 -174942 -3965 88725 -114118 74746 40325 2460 -347485
19222 171930 -212395 -29048 -39819 -216010 -13860 -127363 -156746 237623 24952 102402 1782
19210 -110500 -137393 -131764 51482 207048 -29110 -79960 36805 135868 -556391 -202742 -30788
$$ packed form
19291c02866E5711Q2254n3909c45898J09282J8319J08575c4626B60095r8725b70137
19279G1801c54169a54290O0972k50233f303j60127D1610c34052C14837a09600
19268a53267E3477A8687a96711M19R4776j14240A6383L27194c8552E0700b04467
19256A8672b77119f3921C70648a72535q0340P0686j13642A32390h7872A24153
19245A82445a8229C60300d02414i3103j04389k27654N2837a16557G7597B756K5585
19234B8341j0377b10426B9057a74942c965H8725a14118G4746l4421B460c47485
19222A71930b12395b9048j0771j76191a3860j13503k9383B37623B4952P7450A782
19210a10500k6893N629E1482J55566b9110n0850C6805R9063e56391b02742c0788
$$ plain form
19198 -336540 192594 219613 -184425 -112957 -304252 156206 -355268 -100564 -276129 -354954
19188 -354954 -156857 -5099 136774 101192 -2145 -50654 -64329 -175907 -206443 -103269 -201353
19177 -201353 147997 -237273 162129 -94972 -183129 233628 62366 74460 -184530 -113283
19167 -113283 116246 -24742 65163 113565 -47415 448101 -212115 258688 -377234 -6549 163869
19155 200833 246756 124434 188815 -28038 -328922 41142 -346678 -180140 -320047 78217
19144 115654 66755 -52455 67417 -471530 -385223 -140442 -114277 -374400 195044 44587 34676
19133 34676 -106355 -262895 -133775 -370152 12684 -57507 -40971 80576 -211651 -9663 -24229
19122 -24229 -224805 -76224 -363259 140361 -110581 -253884 -152105 -155904 -53806 15348 -446143
$$ packed form
19198c36540A92594K7019a84425P1468j91295A56206c55268a00564j75565p8825
19188c54954a56857e099A36774l5582b145m8509j3675j11578l0536J03174r8084
19177b01353A47997b37273A62129i4972q8157B33628F2366J2094a84530P1247
19167a13283A16246b4742F5163M8402d7415D48101b12115B58688c77234f549A63869
19155B00833M5923j22322O4381b8038l00884D1142c46678J66538j39907G8217
19144A15654m8899e2455F7417d71530Q6307a40442K6165k60123A95044D4587r911
19133C4676a06355j56540J29120k36377A2684e7507J6536H0576b11651i663j4566
19122b4229k00576g6224k87035A40361a10581j43303J01779l799e3806A5348d46143
$$ plain form
19110 2847 -171699 -175177 -154993 80492 110514 21040 31775 -191331 151813 -63351 -46667
19099 -46667 99694 -63957 -236435 65686 193871 -42126 -153931 173418 67028 -153227 33702
19087 -237286 81960 -442374 27649 -272264 -154882 -94878 -53315 -295880 207023 245568
19077 245568 -224062 -70103 -81969 111573 -133155 -197940 82145 106310 26003 57185 -138096
19065 -132452 49893 113508 -71114 -134736 -156193 30760 -175452 258954 39981 -6367 -195753
19054 -195753 -374786 -127516 33615 82026 174697 125344 -43578 912 -220721 17798 124588
19043 124588 -414716 -53914 -80838 -108854 286890 -174710 -229430 60733 -18067 -194305 -87929
19031 34830 206530 142641 -100126 445266 182513 -35847 324328 -165378 164387 -374664
$$ packed form
19110B847a71699l478K0184H0492L0022B1040J0735a91331A51813f3351J6684
19099d6667I9694f3957j72478F5686J28185d2126j11805A73418F7028a53227C3702
19087b37286H1960d42374B7649b72264J17382O0004M1563k42565B07023L8545
19077B45568b24062g0103j1866A11573a33155o4785H2145K4165B6003L1182a38096
19065a32452D9893O3615g1114o3622k1457C0760a75452B58954C9981f367j89386
19054a95753j79033a27516C3615M8411R2671m9353d3578I12b20721A7798J06790
19043A24588d14716e3914k6924k8016B86890a74710n4720F0733a8067j76238h7929
19031C4830J71700o3889a00126D45266A82513c5847C24328a65378A64387c74664
$$ plain form
19020 -46276 -44904 354763 -7536 -135907 -47731 -84248 -156288 29901 -276179 380575 136727
19008 274811 -199403 9648 -236368 158017 -163175 -180270 -234442 256947 -42700 -300532
18998 -300532 -127059 -393881 48116 37600 -167405 89531 2263 -132801 -161378 34765 -117095
18986 -131258 -204294 -148368 -222713 15906 23719 -27221 53847 -37556 -186333 106253 -98027
18974 53039 -500413 -166764 -143752 249908 163321 -181128 291148 239987 -54228 -237747
18964 -237747 -137394 -148324 358934 48039 -115409 -126412 -41015 -178867 -159613 -8348 -40645
18953 -40645 142016 -136736 -188812 -55093 14516 -40637 -224964 -63403 -76946 -94590 -201087
18942 -201087 -58753 3971 -389488 129581 369061 246307 -477963 -344144 -96120 43899
$$ packed form
19020d6276J372C54763g536j28371d7731l6517p2040B9901b76179C80575A36727
19008B74811a99403I648b36368A58017a63175j7095n4172B56947d2700k57832
18998c00532a27059k66822D8116j0516a67405H9531B263a32801k8577C4765a17095
18986a31258p3036N5926p4345A5906P813b7221E3847c7556j48777A06253i8027
18974E3039e00413a66764K3012B49908q6587a81128B91148n1161e4228j83519
18964b37747J00353j0930C58934D8039a15409j1003d1015j37852J9254h348l2297
18953d0645A42016a36736n2076e5093A4516d0637j84327f3403j3543j7644j06497
18942b01087e8753C971c89488A29581K39480j22754d77963J33819i6120D3899
$$ plain form
18931 220126 62750 -124245 174646 50988 -22219 14149 78069 53317 -222554 159853 1019
18919 -338420 152845 -39944 159188 77625 -43168 -168639 58014 -13312 -37517 -5385 6122
18907 -83332 -3391 -25614 120386 121687 -532039 48798 123251 -99565 162443 -14356 374445
18895 279752 91834 -97458 -271497 419131 664 146104 -168636 -196901 -59074 -484145 47042
18883 16987 -151341 72113 163294 85227 -126102 -151893 36425 -56302 -338636 26297 102199
18872 102199 137325 200539 -132503 -74533 62670 105637 -281800 93552 -311082 124959 -302985
18860 -200260 48135 -225611 108682 -147975 -32701 -367410 -347322 -455679 -152867 357132
18849 -226997 45242 236683 202671 202653 -45394 132679 -197379 235222 -226097 54921 -151333
$$ packed form
18931B20126F2750a24245A74646E0988b2219A4149O3920k4752b22554A59853A019
18919c38420A52845c9944A59188G7625d3168j25471E8014a3312k4205e385F122
18907h3332c391k2223A20386J301e32039D8798P4453i9565A62443a4356C74445
18895B79752I1834i7458j74039D19131F64J45440a68636k8265e9074m25071D7042
18883A6987a51341G2113R1181p8067a26102k5791C6425e6302k82334B6297P5902
18872A02199L5126O3214a32503N7970F2670M2967b81800I3552c11082A24959c02985
18860b00260D8135b25611A08682a47975c2701l34709K0088j08357a52867C57132
18849b26997D5242J91441l4012j8d5394A32679a97379B35222b26097E4921a51333
$$ plain form
18837 67736 -305393 10839 -229313 60793 99019 -260874 -44156 184512 24358 -257881 81020
18825 -191048 -409336 93921 257956 -35028 -68418 331838 237499 185615 233352 -25353 108709
18813 69895 -79847 499517 139487 -98920 82723 164704 -166348 -74449 -257849 -187981 -40998
18801 -194645 -291254 93157 22757 30331 60896 -65754 -80852 -193489 82178 -113820 221277
18789 -140720 -79429 250831 54044 -265508 -60941 126258 -235559 -97135 131443 -90940
18778 -183653 -110301 -364447 -84264 -105846 -134351 -153122 -284056 -295005 -76633 361234 -381644
18766 -127559 105153 105936 -152309 99510 75991 51048 -214592 -47802 -149242 -436756 -311472
18755 -311472 -173531 -241964 -66383 -94983 -226742 -151867 64426 92952 -219146 129584 446310
$$ packed form
18837F7736c05393A0839b29313F0793L8226b60874d4156A84512B4358b57881H1020
18825a91048k18288I3921J64035c5028l3390C31838r4339n1884M7737b5353A08709
18813F9895g9847D99517A39487i8920H2723Q1981a66348g4449j83400O9868d0998
18801a94645r6609I3157B2757P574L0565f5754j5098j12637H2178a13820B21277
18789a40720O1291B50831E4044b65508f0941A26258b35559i7135A31443i0940
18778a83653P3352k54146h4264k1582k8505j8771j30934j0949g6633C61234c81644
18766a27559A05153P83a52309I9510k3519k4943b14592d7802j01440k87514J25284
18755c11472J37941o8433f6383k8600j31759P4875F4426K8526b19146A29584L16726
$$ plain form
18744 446310 -159878 -174932 -25609 -288700 45750 -74645 36718 128585 -188158 -163743 -206003
18733 -206003 37122 163158 121787 165778 24306 -54557 -12403 -52714 -313326 224006 149656
18722 149656 -138979 -144231 -70228 37730 140451 -44954 -261347 5347 -36552 39245 -62034
18710 -55214 -201661 85623 -317294 66296 -384812 107715 -346797 -218402 -64125 216447
18699 -180351 -55668 -267442 -202058 -99465 -120905 122114 179638 -237163 -247835 -72954 -115959
18688 -115959 168382 -351580 14666 -142 147786 39552 -376948 113331 -36052 -262074 -279445
18677 -279445 -162707 -63801 -84287 18681 -201636 -202971 -131039 -23823 75337 137199 194065
18666 194065 -293373 773 3151 -34296 147816 -111522 -165797 -13073 129764 324549 -117778
$$ packed form
18744D46310a59878j5054b5609k63091D5750g4645C6718R1867a88158K4415m2260
18733b06003C7122J26036m1371M3991B4306e4557a2403m0311k60612B24006p4350
18722A49656a38979n252g0228C7730J02721d4954k16393E347c6552C9245f2034
18710e5214j46447H5623c17294F6296c84812A07715c46797J28395f4125B16447
18699a80351e5668k11774O5384i9465k1440A22114N7524b37163j0672g2954m3005
18688a15959A68382c51580A4666a42A47786C9552c76948A13331c6052k26022j7371
18677b79445J16738f3801k0486A8681b01636j335P1932b3823G5337O1862N6866
18666A94065b93373G73K378c4296A47816a11522n4275a3073A29764J94785a17778
$$ plain form
18654 -157230 -342444 -257808 -14066 79735 243726 -69911 243457 148698 -154080 44458 15159
18642 285621 -180700 -382061 -29977 45124 -14884 -295429 319726 -425775 -173238 244166
18631 -273970 160885 -170761 -107718 22164 -203146 109496 178251 13596 104290 39491 -9578
18619 -207537 -256345 110648 -78455 182604 25631 135401 -233703 343852 -283487 43668
18608 51494 265894 167433 50604 -124705 -212078 -213492 -290316 240790 -39125 -273014 -400414
18597 -400414 40580 164894 -154124 397671 43410 105217 -171770 226629 -144376 128119
18586 -180537 -133413 136642 -54205 -453769 -152675 278044 -126495 -422363 -116594 15420
18575 -80879 60384 -138889 132162 -107297 227206 -364109 155798 -329861 -160439 -52372
$$ packed form
18654a57230j85214Q4636a4066G9735J63991f9911B43457r4759a54080D4458A5159
18642B85621a80700k01361b9977D5124a4884k80545C19726d25775a73238B44166
18631b73970A60885a70761O3043B2164b03146A09496O8755A3596R0694C9491i578
18619b07537m8808A10648g8455A82604B5631J09770b33703C43852b83487D3668
18608E1494K14400r8461E0604a24705q7373j414p6824B40790c9125k33889j27400
18597d00414D0580J24314a54124C97671D3410O1807a71770B26629a44376A28119
18586a80537M7124A36642e4205l99564a52675B78044a26495k95868a16594A5420
18575h0879F0384a38889A32162a07297B27206c64109A55798c29861a60439e2372
$$ plain form
18564 -202513 -111068 -59826 -180964 -29016 -102916 -175685 8462 264532 -154432 -30901 190852
18552 126954 67456 21453 -154898 -26982 36324 14354 161315 -144844 54954 61789 22017
18540 -98242 -118669 60278 -179812 194510 156882 78389 112256 -1589 -41818 -28601 -10956
18528 97307 -112655 101743 89444 -187571 169087 -205005 -14789 -170111 217203 -241744
18517 -47937 -51717 244108 -71371 -20800 415961 -102177 -199177 -317599 -160097 155836 -143657
18505 -151964 -365150 187814 -165002 -320150 58108 -280316 212317 -236635 3192 -15031
18494 232266 -270798 -139649 -382946 -122900 -228239 155477 123954 160937 107330 -74321
18483 -121184 112838 -65766 -153769 -22176 -20488 -198502 -156504 303079 -279690 -70990 97845
$$ packed form
18564b02513R1445N1242j21138b9016p3900p2769H462K56070a54432c0901A90852
18552A26954n9498B1453a54898b6982C6324A4354J46961a44844E4954O835B2017
18540i8242k0427F0278a79812A94510l7628G8389L3867a589m0229J3217a0956
18528I7307a12655A01743j2299a87571A69087b05005a4789j55322B17203b41744
18517d7937l780B44108g1371b0800D15961a02177r7000j18422J57502A55836a43657
18505a51964k13186A87814a65002j55148E8108b80316B12317b36635C192a5031
18494B32266b70798J31149k43297a22900j05339A55477l1523L6983n3607g4321
18483a21184A12838f5766q8003b2176J688j78014M1998C03079b79690g0990I7845
$$ plain form
18471 129887 -23197 -118691 -77062 -229333 168305 -292029 176098 -127525 -343849 71420
18460 -67425 -68998 70267 -78875 -74990 -88016 -165713 -236698 -235623 -247624 -388101 -148293 -235071
18448 -235071 -243010 -176795 -34030 35209 359054 206730 -175424 -150199 84267 113858 -17790
18436 -220640 -291175 -36169 45161 185245 -199182 37407 -477769 -104782 98059 214505
18426 214505 55534 140027 148345 -122669 -309100 -240217 207459 104620 188505 53935 -13205
18414 110550 -217450 -186228 -248933 158606 -76484 97341 -155822 -252944 -188712 210229 -55432
18402 -183059 -96507 -243564 217744 -155104 -99117 218826 -174723 -174366 -99060 -17380 118927
18390 -112702 -118712 -97569 77464 -155259 13555 146021 -230472 -50534 -165445 -239092 -22512
$$ packed form
18471A29887b3197r5494M1629j52271A68305b92029A76098a27525k16324G1420
18460f7425j573G0267g8875L885j3026p7697p0985J075j2001j40477a48293q6778
18448b35071p939O6215c4030C5209L23845j52324a75424K5225H4267K9591a7790
18436b20640p0535c6169D5161J40084a99182C7407d77769a04782I8059J16446
18426B14505E5534Q4493Q318a22669j86431O8883B07459j02839Q3885E3935a3205
18414A10550b17450L1222o2705A58606g6484I7341a55822r7122O4232B10229e5432
18402a83059Q6552j47057B17744a55104N5987B18826a74723L57P5306a7380A18927
18390a12702o010K1143G7464a55259A3555J32466b30472e0534j14911p3647b2512
$$ plain form
18378 -332637 -202860 -53984 80725 47582 -95515 -118207 -165371 53889 -259585 -195022 140377
18366 212134 -289688 3534 92063 243528 36255 116448 62400 64675 -64720 93683 32952
18354 -97529 -7255 59994 87528 42599 44415 -91667 -354146 -21352 10357 -432693 271994
18342 -39267 -21217 -61627 -124146 32276 41880 -40424 30834 -73784 185564 178689 -83654 49573
18329 11165 130046 20882 -118247 6107 60073 -68816 240412 -20044 -146941 -38454 -290787
18318 -290787 173121 -34003 -325854 208267 -87492 152802 -179999 -91420 30896 -32471
18307 264212 -222808 278533 -136932 -103020 -189842 -471879 47186 -333383 51414 140492
18297 140492 -190812 100725 -185694 113083 -74977 -362732 -117058 -116431 -355555 40755
$$ packed form
18378c32637J29777e3984H0725l3143i5515k2692m7164E3889b59585O4563A40377
18366B12134b89688C534Q8529J51465C6255Q0193n4048K275f4720I3683C2952
18354i7529g255E9994K7534D2599J816i1667k62479b1352A0357d32693B71994
18342c9267J8050m0410o2519C2276R604d0424C0834g3784A85564o875h3654D9573
18329A1165J18881B0882a18247F107N3966f8816B40412b0044j26897c8454k52333
18318b90787A73121c4003k91851B08267h7492A52802a79999Q8579C0896c2471
18307B64212b22808B78533a36932L3912q6822k82037D7186c33383E1414Q9078
18297A40492a90812A00725a85694A13083g4977k87755a17058O27k39124D0755
$$ plain form
18286 182449 -54266 -188808 57507 -17320 -11078 33311 184020 -129231 1477 120965 236142
18275 236142 92489 183111 -109458 102055 -19442 -200358 57081 172915 -39854 86696 -60990
18263 -136242 -187520 -12480 115456 -123269 -53390 -16766 189739 -85247 -80783 -7578 -40482
18252 -40482 -8760 23942 -2268 -158384 -6454 -277723 -128477 -80815 -56211 136079 -238276
18240 54168 41920 -27962 201710 203658 -84746 -90105 16965 -194571 -2575 30108 71094 -17773
18227 -130917 -297483 -85029 -274328 146547 -271672 310591 115759 -137700 175381 -195128
18216 -201714 -158738 -47403 204128 99418 -347686 1098 -13133 157918 -135873 122817 -355242
18204 -148241 107787 108732 89349 153221 199113 137655 -201657 -179616 -178016 -76122 -168525 235870
$$ packed form
18286A82449e4266j34542E7507a7320O242C3311J50709a29231A477J19488J15177
18275B36142I2489R0622a09458A02055a9442j80916E7081J15834c9854H6696f0990
18263a36242n1278a2480A15456a23269e3390a6766A89739h5247M464g578l2904
18252d0482h760B3942b268j56116f454k71269a28477M7662K4604A36079b38276
18240E4168j2248b7962B01710J948h4746n359A6965a94571b575C0108M0986a7773
18227a30917j66566h5029j89299A46547b71672C10591A15759a37700A75381a95128
18216b01714M2976d7403B04128I9418c47686A098a3133A57918a35873A22817c55242
18204a48241A07787R45j9383O3872M5892o1458b01657K2041J600g6122r2403B35870
$$ plain form
18191 15038 -157489 21346 -21947 -130656 -314644 365582 -80316 -321131 25714 165249
18181 165249 -157818 -21653 -241713 -28138 -186235 -114023 -79206 278444 -32441 118419
18170 159226 108723 459432 -26084 -303251 -117336 -297940 -120637 -69105 365231 43360
18159 -108350 -61784 -252809 2488 235928 200514 138799 -487127 -9401 -7978 3754 57609 -184604
18146 147109 -12525 125318 128139 107216 -364849 -222193 132122 -201414 -88455 189815
18135 -111709 -133544 -99590 -85053 -239846 -106388 -56644 -200802 -11189 252710 -268851
18124 -50639 -393656 61967 41323 -176211 26523 -200314 -226547 130123 -319341 444337
18113 -362367 -267188 -255492 133661 114766 -117186 -225346 149047 19229 -185993 -190241 174569
$$ packed form
18191A5038a57489B1346b1947j08709j83988C65582h0316k40815B5714J39535
18181A65249a57818b1653k20060b8138j58097P2212L4817B78444c2441A18419
18170A59226n0503L50709b6084k77167a17336j80604a20637N1532C65231D3360
18159a08350M6566j91025B488K33440l5414o1715d87127i401J423C754N3855a84604
18146A47109a2525A25318K821k0923c64849J42656A32122b01414h8455A89815
18135a11709k1835L3954J4537j54793a06388M9744j44158a1189B52710b68851
18124e0639l43017F1967k0644a76211B6523b00314k6233A30123c19341D44337
18113c62367R5179J1696A33661j8895a17186j08160A49047A9229a85993m248A74569
$$ plain form
18101 -89199 -105275 -36042 422610 -134795 126467 -78990 33298 -167312 109616 145641 137527
18090 137527 -55143 -104918 -113943 -36719 -255419 -65223 -134590 -102690 60634 159456 112820
18079 112820 -207725 230786 -172785 512258 -91243 65078 -121743 -66292 -58134 347571
18068 32852 67314 -210532 85535 -292656 275786 -140908 -33105 96864 -38383 82047 161423
18057 161423 86425 -243035 479914 197459 222809 254068 -365900 79663 -39751 -195330
18047 -195330 -452823 213344 104216 -84139 -214431 -296122 -152958 165276 154091 -27357
18036 -222852 32956 -150404 -63559 124244 -254644 -135791 -116842 -303168 -467206 -219015
18025 -237223 -179556 157947 -106246 -307644 10957 -205615 46657 -11004 113446 206827
$$ packed form
18101h9199j6076c6042D22610a34795A26467g8990C3298a67312A09616L6025q114
18090A37527e5143m9775r025c6719k18700f5223o9367L1900F0634R8822m6636
18079A12820b07725B30786a72785E12258i1243F5078a21743N5451Q158C47571
18068C2852L4462b10532H5535b92656B75786a40908c3105I6864c8383H2047P9376
18057A61423p4998b43035D79914A97459K5350L1259c65900G9663c9751j55579
18047a95330k57493B13344A04216h4139j30292q1691J43164A65276j1185b7357
18036b22852C2956a50404f3559A24244b54644J18853J8949j86326j64038b19015
18025b37223N7667A57947a06246k01398A0957b05615D6657a1004A13446R3381
$$ plain form
18015 206827 185478 -59366 -203011 -109363 -86639 -284868 322377 -79519 117298 176166 -448682
18003 -123472 -161718 185900 -42997 -267522 83388 -420227 -171493 -87743 259225 96479
17992 -61314 -86303 153873 -164964 67062 240224 253417 -289355 169235 132729 -63757 96310
17980 -486612 28889 -7431 74237 -258210 -39173 -264876 -248440 -357400 -67949 110710 -195363
17968 142267 78440 92728 18866 -250243 159087 -201062 -94168 -134876 -217969 -199262 -256566
17957 -256566 -238261 -111284 -8904 -56008 140804 -201134 -167278 83341 -127020 119448 121186
17946 121186 48027 -177576 209579 105547 -129654 139276 11257 -114999 -174701 -53541
17935 -43671 196859 52908 -259377 -63575 126704 143421 10846 164677 -163475 -114095 40805
$$ packed form
18015B06827k1349e9366j43645R3648K2724j98229C22377g9519A17298N8868d48682
18003a23472l8246A85900d2997k24525H3388d20227a71493Q3750B59225I6479
17992f1314k4989A53873a64964F7062J73162J3193b89355A69235l6506f3757I6310
17980d86612B8889g431G4237b58210c9173k25703J6436j08960f7949A10710a95363
17968A42267o3827J4288A8866b50243A59087b01062i4168m0708q3093J8707n7304
17957b56566J8305a11284h904m7104A40804b01134L3856H3341a27020A19448J738
17946A21186D8027a77576B09579j04032a29654A39276A1257a14999n9702e3541
17935d3671A96859E2908b59377f3575A26704J6717A0846J53831a63475M9380D0805
$$ plain form
17923 146696 -55648 59034 -43507 -24212 271402 49789 -63127 -59383 -117474 36310 -64881
17911 -97790 215213 40360 77771 31624 -19910 37687 -24896 -119332 73107 -174295 -232975
17900 -232975 -272608 -58297 144733 -269137 -48339 -345111 115777 79168 -105360 -167335
17890 -167335 206724 144020 23215 -148698 131534 -308155 47515 47937 -145123 89045 -268843
17878 111448 -44569 86446 -173484 -164141 208759 7094 -289163 -140457 74066 -3458 -111596
17867 -111596 -188780 44958 7595 96467 91438 -219504 11884 -8255 98507 98383 7955 -346782
17854 -364248 114975 178439 -37328 176747 115882 -383066 46754 -46733 -113082 182114 267881
17843 267881 -141529 -36425 -12260 -98078 39493 176865 -217117 339468 39028 234607
$$ packed form
17923A46696e5648E9034d3507J9295B71402D9789f3127L744n8091C6310f4881
17911i7790B15213D0360L7411C1624a9910C7687b4896r4436G3107a74295n8680
17900b32975l9633e8297A44733b69137d8339k96772A15777l6609a05360o1975
17890a67335B06724o2704B3215a48698A31534c08155D7515M22a45123H9045b68843
17878A11448d4569H6446a73484R343B08759G094b89163a40457G4066c458j08138
17867a11596p7184D4958G595Q8872n029b19504A1884h255I8507j24G955c46782
17854c64248A14975O3464c7328A76747o0865c83066D6754d6733o6349A82114Q5767
17843B67881a41529c6425a2260q5818C9493J37372b17117C39468C9028J95579
$$ plain form
17833 234607 -262192 249238 -189893 -88100 -29186 66930 -4570 -83341 -78406 184025 148861
17822 148861 -15223 -89430 293094 -211902 156833 131494 -128239 188983 -219692 280180
17811 -107259 265198 -258198 63324 30109 88468 -31964 35014 123459 118514 -132987 -13233
17799 -158288 35453 2377 -141545 125375 64308 332432 307293 -62980 228582 -112024 -120764
17788 -120764 -38307 260914 -154802 -68531 -15410 -592410 233315 184270 -60493 144297
17777 256959 -311018 143724 -242976 -157094 38085 -178136 52628 -151643 73049 -151093
17766 73264 190696 -111820 36036 97899 63725 -73959 -80140 -107602 -211224 -189262 -238963
17755 -238963 182196 -216495 287420 -145651 -217558 -28729 178180 156766 -5898 14299 -100222
$$ packed form
17833B34607b62192B49238a89893h8100b9186F6930d570p8771M935A84025l5164
17822A48861a5223p4207B93094b11902A56833k5339a28239A88983b19692B80180
17811a07259B65198b58198F3324C0109N8359c1964C5014Q8445m945a32987a3233
17799a58288C5453B377a41545A25375o1067K68124k5139f2980B28582a12024q740
17788a20764c8307B60914a54802f8531a5410n77000B33315m9045f0493A44297
17777B56959c11018A43724b42976Q5882C8085a78136E2628a51643G3049a51093
17766G3264J17432a11820C6036O1863l4174g3959o181k7462j03622K1962m9701
17755b38963A82196b16495B87420a45651p1907b8729A78180k1414e898A4299a00222
$$ plain form
17743 -289209 -122224 48859 58686 -19279 173776 -136726 -150481 -45462 86839 213006 -105380
17731 103607 176905 288815 167273 243478 -165123 30761 -31469 265573 106978 -105695
17720 -273810 336320 39735 194427 133904 -30677 78870 98198 -10055 -76583 -117702 47125
17708 -157459 -163651 64026 31095 19070 12239 -3608 -6398 -210023 -149028 151626 78359 102751
17696 102751 65932 35386 205086 137632 60336 -83516 -126392 -164623 61802 908 -105949
17684 134060 67452 16372 -228554 -4824 -215073 129055 18696 -88683 294107 11272 -54099
17672 45255 45826 443502 294878 6294 -252278 172782 -21349 -210262 43627 166678 -93599
17660 -171889 -109916 -146664 -64401 -55072 -116339 82886 38594 -91773 -167344 158691 -1145 -92169
$$ packed form
17743b89209a22224D8859R827a9279A73776a36726j3755d5462H6839J26167a05380
17731A03607P3298J11910j21542P6205a65123C0761c1469B65573A06978a05695
17720b73810C36320C9735J54692o0523c0677G8870J9328a0055o6528m1119D7125
17708a57459o192F4026C1095j2025o831c608k790k03625O0995A51626p3267K4392
17696A02751l6819l0546J69700o7454F0336h3516m2876l8231F1802I08a05949
17684A34060o6608A6372b28554d824k10249A29055A8696h8683B94107A1272e4099
17672D5255N71L97676j48624F294b52278A72782b1349j88913D3627J23051i3599
17660a71889O1973l6748f4401R329o1267H2886C8594i1773p5571A58691a145r1024
$$ plain form
17648 -92169 -7712 -39757 -28353 -410637 60452 -7479 -65485 219652 -46484 -181884 394773
17636 395002 71922 -99898 114798 272256 -103680 131910 -24246 -11329 156833 -31747
17625 -21548 135493 -136717 198778 49284 233443 113586 283556 322071 -74515 -45181
17615 -45181 354593 -47311 220706 -34670 -291337 -7998 215875 -250243 -92465 28164 -43870
17603 97881 169839 85957 469407 99860 44043 170942 -196646 -50967 174413 -69411 47742
17591 233366 235571 59812 -50900 22263 -170651 126229 156315 231084 141513 255843 2542
17579 -112563 -17728 -129583 306914 150921 -127151 -21505 88441 -315534 -239778 65123
17568 51397 165720 -91487 19772 57581 -88070 -70646 -101598 64440 130397 148538 -352633
$$ packed form
17648i2169g712l2045J1404l82284F0452g479n8006B19652d6484j35400C94773
17636C95002G1922i9898A14798J57458a03680A31910b4246a1329A56833c1747
17625b1548A35493a36717A98778D9284J84159A13586J69970L8515g4515K9334
17615d5181C54593d7311B20706c4670k56667g998B15875b50243i2465B8164d3870
17603I7881P1958q3882L83450I9860D4043J26899a96646e0967A74413f9411D7742
17591B33366K205E9812e0900B2263a70651A26229L0086P4769q9571J14330B542
17579a12563a7728j11855C06914A50921a27151b1505H8441c15534P5756F5123
17568E1397J14323i1487A9772L7809h8070J7424l0952F4440O5957J8141c52633
$$ plain form
17556 -32869 233901 -137359 -169844 154638 115790 240156 75059 142997 -34406 20464 349070
17545 349070 -13978 -124994 -365668 -371050 298688 -115798 261653 -26041 -41744 -74372 59180
17533 48834 129112 80421 -211425 -319378 36203 249303 -68293 9557 198005 -71200 430998
17521 -5395 119040 155934 162791 158729 -149863 87607 19162 133501 125914 -3520 24681 305034
17509 305034 18087 -42026 51365 -116571 160195 242334 150703 -191381 264226 94022 40500
17497 163826 242369 61631 11448 265413 188479 -37420 291300 105070 -53119 -364298 5596
17485 167166 -88589 487103 216562 181359 205200 93203 63131 181847 5749 49280 126633
17474 126633 -110601 -81381 164480 196723 11968 20858 -283476 -70734 275266 352401 134083
$$ packed form
17556c2869B33901a37359l2485A54638l8848J24366G5059O7938c4406B0464L28606
17545C49070a3978j11016k40674n382B98688a15798B61653b6041j5703l2628E9180
17533D8834Q0278m8691b11425j07953C6203K13100f8293I557J88448g1200D30998
17521e395A19040L6894O857m062a49863H7607A9162J14339p587c520B4681K80353
17509C05034A8087d2026E1365a16571A60195Q2139r1631a91381B64226I4022D0500
17497A63826P8543F1631A1448K53965p6934c7420B91300A05070e3119l11179E596
17485A67166h8589D87103B16562l5203K3841I3203l0072J18716E749M3531P7353
17474A26633a10601K9220A64480L2243A1968Q890b83476g0734B75266P7135A34083
$$ plain form
17462 -76902 -83729 128331 229052 35830 96123 267754 -150654 425987 183832 376507
17452 376507 382343 425762 391729 377651 205202 476416 411870 -7313 172740 95417 154986
17441 154986 102807 162515 349938 64181 146350 190743 -161806 366584 408929 465909 232758
17429 285706 168396 400333 226355 65277 306648 4085 6254 78327 146815 10055 170075
17418 170075 108174 437438 65450 558576 154662 441993 397245 203842 72662 267142
17408 267142 218573 -41834 200142 242499 233858 242925 66429 25696 154686 77491 -77421
17396 379145 273139 154894 86224 145276 358589 61809 -151011 42674 338106 -63540
17385 -75412 7978 -56651 -140646 111060 222001 253290 107227 -109118 277774 167913 155536
$$ packed form
17462g6902o827A28331J00721C5830O0293J71631a50654D25987A83832J92675
17452C76507N836M3419l4033j4078j72449K71214o4546g313A72740p7323N9569
17441A54986n2179N9708J87423F4181Q2169M4393a61806C66584M2345N6980B32758
17429B85706j17310K31937j73978F5277K41371D085K169P2073O8488A0055J60020
17418A70075o1901L29264F5450M93126A54662K87331m4748j93403G2662J94480
17408B67142m8569d1834B00142M2357q641R067F6429B5696J28990p7195g7421
17396C79145j06006j18245o8670N9052K13313F1809a51011D2674K95432f3540
17385g5412G978e6651q3995A11060J10941L1289A07227a09118B77774j09861j2377
$$ plain form
17374 155536 35239 136826 -95702 288296 -34583 324817 162516 181017 27369 208078
17364 208078 157038 -10658 179599 111920 171937 -51604 92494 -27557 145465 149656 328495
17353 328495 136963 184418 32214 316657 61467 148130 180430 205587 188329 261692 451323
17342 451323 427306 120646 102386 288701 394000 19360 332394 86616 -12941 -474536
17332 -474536 -424529 19968 20310 -178301 303905 220879 159389 240469 162561 177018 -28952
17320 250471 54670 -55308 33279 87382 99359 342426 361674 76012 195613 326260 239353
17309 239353 295706 -15043 279655 -177966 -184844 54986 8749 204057 -67795 136670 -13292
17297 161628 9201 -24402 41643 246521 257733 318674 390059 -46910 412911 146375 334004
$$ packed form
17374A55536C5239J01587i5702B88296c4583C24817j62301J8501B7369J80709
17364B08078n1040a0658A79599o7679O0017e1604I2494b7557A45465M191J78839
17353C28495A36963M7455C2214K84443F1467Q6663L2300K5157j7258P3363J89631
17342D51323k4017A20646j8260J86315J05299A9360L13034H6616a2941m61595
17332d74536N0007A9968L42a78301C03905q3026o1490Q1080p7908J4457b8952
17320B50471E4670e5308C3279N4103J1977K43067J9248G6012J19601J30647q6907
17309B39353N6353a5043B79655a77966o878E4986H749J95308f7795A36670a3292
17297A61628I201b4402D1643K04878J1212O0941P1385d6910D12911A46375J87629
$$ plain form
17286 334004 6187 14261 198640 99242 131239 342439 224180 52763 -124867 532791 232082
17274 -38735 141589 200777 338104 76148 8146 219244 -110659 230040 -285778 20956 390180
17263 390180 112736 119100 -141092 229783 -165558 384754 -15060 121736 390237 225761
17253 225761 -23564 67542 111374 257236 210138 343536 27310 34893 251003 -237803 201567
17241 176382 93891 167706 38674 -74389 222054 131616 43981 442424 118158 125960 -79916
17229 75680 101194 247382 117642 229729 461044 209479 281049 205129 493135 147287
17218 434796 53355 201839 480550 196076 149430 151945 206964 -49292 -162446 426477 197960
17206 -1429 259531 374912 178867 379391 -360340 -29759 300125 301228 312225 -86215 269682
$$ packed form
17286C34004F187Q074J84379I9242L1997K11200j18259E2763a24867E32791B32082
17274c8735A41589N9188J37327G6148H146K11098a10659B30040b85778B0956L69224
17263C90180A12736O364a41092B29783a65558C84754a5060A21736K68501j64476
17253B25761b3564F7542M3832J45862m7098J33398B7310P583K16110b37803B01567
17241A76382q2491P3815C8674g4389B22054r0438D3981L98443A18158P802g9916
17229G5680K5514J46188A17642J12087K31315B09479P1570p5920K88006A47287
17218D34796E3355J48484K78711A96076m6646K515N5019d9292j13154D26477A97960
17206a429B59531J15381A78867K00524c60340b9759C00125J103J0997h6215B69682
$$ plain form
17194 292598 152428 514602 357404 133704 430431 318344 369181 454263 582773 121430
17183 16317 168314 428810 199865 577644 154115 7431 188875 366842 230416 291712
17173 291712 499766 358274 238594 502943 -55495 295140 160972 101359 256281 -214261
17162 358157 575893 399014 124624 -158577 314912 568035 402654 57403 140208 159319
17152 159319 72878 375611 -23995 331558 118183 344633 202731 400953 339466 438783
17142 438783 -13702 258673 307272 197405 44373 355153 -5768 263539 178918 141487 189218
17131 189218 122350 220231 238895 349810 51546 303637 336654 194940 374855 326614 152048
17119 503038 639841 333111 465290 203001 483182 185674 95238 308327 377934 362506
$$ packed form
17194B92598j40170L62174j57198A33704K96727j12087N0837Q5082J28510A21430
17183A6317J51997K60496A99865L77779A54115G431J81444J77967j36426O1296
17173B91712K08054j41492j19680K64349e5495B95140j34168n9613J54922b14261
17162C58157K17736j76879A24624a58577C14912K53123j65381E7403Q2805J9111
17152A59319G2878L02733b3995C31558A18183K26450j41902J98222o1487R9317
17142D38783a3702B58673M8599j09867D4373L10780e768B63539q4621l7431M7731
17131A89218o6868R7881J8664J10915E1546K52091L3017j41714J79915m8241A52048
17119E03038J36803l06730J32179B03001K80181A85674r0436K13089O9607j5428
$$ plain form
17109 362506 332782 533445 768320 340706 217576 264382 612650 62107 191058 274398
17099 274398 462915 26950 211205 374568 474663 468610 373326 547650 179404 390337
17089 390337 491834 564611 475011 140695 350688 427167 421771 257631 501100 438021 -95980
17077 343002 318223 469025 699292 601167 630694 347236 261922 139753 601675 543142
17067 543142 607879 310095 349220 441049 747658 -157162 351639 260407 339984 317508 271046
17056 271046 506156 481144 317262 488305 293794 703314 334068 371509 327531 720358
17046 720358 533636 459704 513276 469325 619262 589540 612471 698233 559093 543053 713430
17035 713430 482992 616070 416552 415926 371902 693964 522831 406298 340438 494046
$$ packed form
17109C62506k9724K00663K34875C40706j23130M6806L48268F2107J28951Q3340
17099B74398J88517B6950J84255J63363J00095o053r5284J74324A79404K10933
17089C90337J01497P2777q9600A40695K09993P6479n396j64140K43469o3079i5980
17077C43002k4779J50802K30267r8125K9527k83458q5314j22169M61922n8533
17067E43142O4737k97784L9125R1829L06609a57162C51639r1232P9577k2476m6462
17056B71046K35110k5012j63882J71043j94511M09520C34068L7441m3978L92827
17046G20358j86722p3932N3572m3951J49937k9722K2931Q5762j39140j6040J70377
17035G13430k30438J33078j99518o26m4024L22062j71133j16533o5860J53608
$$ plain form
17025 494046 764543 554870 323983 741244 731248 455748 439236 229630 355938 518107
17015 518107 850117 502783 354161 610142 453997 916460 752885 539411 530211 485880
17005 485880 535095 415187 587294 711183 524114 438697 408853 818585 114238 562807
16995 562807 664887 978737 703315 686376 505742 685903 506100 725945 794624 782298
16985 782298 1004259 885862 772134 800126 827146 656412 719159 634012 674403 622078 526999
16974 526999 1056705 1064265 920241 678731 520506 950474 786556 1007777 921484 1289483
16964 1289483 790242 801231 877355 540318 634855 802545 1173343 887818 677048 558778
16954 558778 690206 860061 1125248 939728 1321579 865494 622594 1133293 962487 1041557
$$ packed form
17025D94046K70497k09673k30887M17261r996k75500j6512k09606J26308J62169
17015E18107L32010l47334j48622K55981j56145M62463j63575k13474r200m4331
17005D85880M9215j19908J72107J23889j87069q5417k9844M09732A14238M48569
16995E62807J02080L13850k75422j6939j80634J80161j79803K19845O8679j2326
16985G82298K21961j18397j13728K7992K7020j70734O2747q5147M0391n2325r5079
16974E26999N29706P560j44024k41510j58225M29968j63918K21221q6293L67999
16964A289483m99241J0989P6124l37037R4537J67690L70798k85525k10770j18270
16954E58778J31428J69855K65187j85520L81851m56085k42900N10699j70806P9070
$$ plain form
16944 1041557 1080641 739986 1166072 1062784 569418 957032 1085906 889032 654019 1202240
16934 1202240 996857 896364 1291549 1132142 1353710 1335134 905767 1092370 1424530 751462
16924 751462 1354904 1022601 1429317 1191714 1337792 1252429 1098168 1458782 1456401 1442780
16914 1442780 1486432 1379136 1380034 1284473 1394324 1222507 1473625 1365209 1174893 1373667
16904 1373667 1737098 1611160 1377577 1455946 1195389 1780379 1635289 1622397 2032484 1775963
16894 1775963 1629922 1810487 1842351 2263110 1623639 1253043 1615842 1830517 2125189 1792003
16884 1792003 1666720 1708880 1794806 1823825 1911737 1630026 1874477 1700783 2409394 2046748
16874 2046748 2166248 2005376 2065145 2001117 2235880 2141667 2109195 2328358 2486392 2564393
$$ packed form
16944A041557L9084l40655M26086j03288m93366L87614J28874j96874k35013N48221
16934A202240k05383j00493L95185j59407K21568j8576m29367J86603L32160o73068
16924G51462O03442l32303M06716k37603J46078q5363j54261L60614k381j3621
16914A442780M3652j07296Q98r5561J09851j71817K51118j08416j90316J98774
16904A373667L63431j25938k33583P8369k60557N84990j45090j2892M10087k56521
16894A775963j46041J80565L1864M20759o39471l70596L62799K14675K94672l33186
16884A792003j25283M2160Q5926K9019Q7912k81711K44451j73694P08611l62646
16874B046748J19500j60872N9769o4028K34763r4213l2472K19163J58034P8001
$$ plain form
16864 2564393 2507120 2514116 2500976 2482675 2746536 2460099 2637546 2622319 2502211 2665623
16854 2665623 2933936 2977377 2770818 2920248 2882982 2952602 2845480 2993517 2921034 2992091
16844 2992091 3311257 3371443 3616827 3531362 3168644 3323263 3403955 3782922 3880248 3699612
16834 3699612 3618840 3917332 3994219 4042423 4024912 4182314 4286251 4163880 4628800 4202074
16824 4202074 4270764 4362059 4907439 4823549 5081503 4879296 5357488 5090681 5135763 5485841
16814 5485841 5268659 5760795 5586552 5776142 5965618 6135199 6305866 5941242 6145169
16805 6145169 6541788 6508979 6875452 6989891 6757142 7025262 7335608 7472119 7680086 8273249
16795 8273249 7715294 8427836 8782638 8528722 8870427 9159427 9832549 9580091 10096635
$$ packed form
16864B564393n7273O996j3140j8301K63861k86437J77447j5227j20108J63412
16854B665623K68313M3441k06559J49430l7266O9620j07122J48037p2483P1057
16844B992091L19166O0186K45384q5465l62718J54619Q0692L78967R7326j80636
16834C699612q0772K98492P6887M8204j7511J57402J03937j22371M64920m26726
16824D202074O8690R1295N45380q3890K57954k02207M78192k66807M5082L50078
16814E485841k17182M92136j74243J89590J89476J69581J70667l64624K03927
16805F145169L96619l2809L66473J14439k32749K68120L10346J36511K07967N93163
16795H273249n57955P12542L54802k53916L41705K89000O73122k52458N16544
$$ plain form
16786 10096635 10168108 10642216 10685181 11405607 11510572 11505227 12281737 12441453 13011952 13169629
16776 13169629 13910606 14223080 14637090 15124290 15563749 16204571 16633768 17264732 17740831
16767 17740831 18573914 19516599 20058749 20588397 21470971 22525837 23314070 24145755 25569176
16758 25569176 26369978 27108400 28795075 29713342 31152318 32505052 34406102 36038352
16750 36038352 37404494 39274417 41382221 43793141 46098859 48236481 50956208 53633608
16742 53633608 56747775 60073525 63525404 67228008 71039346 75185678 79921062 84833457
16734 84833457 90295317 95679574 101662057 107865035 114248665 121226770 128369312 135924556
16726 135924556 143391241 151081257 158377619 165546623 172136710 178049126 182772236 186794444
$$ packed form
16786A0096635P1473M74108M2965P20426J04965n345P76510J59716N70499J57677
16776A3169629P40977L12474M14010M87200M39459O40822M29197O30964M76099
16767A7740831Q33083R42685N42150N29648Q82574J054866P88233Q31685J423421
16758B5569176Q00802P38422J686675R18267J438976J352734J901050J632250
16750C6038352J366142J869923K107804K410920K305718K137622K719727K677400
16742E3633608L114167L325750L451879L702604L811338M146332M735384M912395
16734H4833457N461860N384257N982483O202978O383630O978105P142542P555244
16726A35924556P466685P690016P296362P169004O590087N912416M723110M022208
$$ plain form
16718 186794444 189878334 191287288 191804866 190781345 187933458 184710233 179694028 174363067
16710 174363067 167547842 161024526 153503937 146318724 138616084 131037427 123945619 116638108
16702 116638108 109966106 103323271 97088668 91479723 86214258 81045581 76197645 71339644
16694 71339644 67325514 63880881 60141121 56922165 53842065 50754773 48201805 46105127
16686 46105127 43513773 41366814 39308307 37354250 35929061 33991031 31955441 31097639
16678 31097639 29451196 28159692 26984616 26092417 24836507 23995682 22776043 22189508
16670 22189508 21387256 20624924 19385034 18748489 17885683 17685789 16985708 16589401 15985563
16661 15985563 15355922 14729859 14185227 13750924 13229579 13072785 12825530 12170186 12104159
$$ packed form
16718A86794444L083890J408954N17578j023521k847887l223225n016205n330961
16710A74363067o815225o523316p520589p185213p702640p578657p091808p307511
16702A16638108o672002o642835o234603n608945n265465n168677m847936m858001
16694G1339644m014130l444633l739760l218956l080100l087292k552968k096678
16686D6105127k591354k146959k058507j954057j425189j938030k035590q57802
16678C1097639j646443j291504j175076q92199j255910q40825j219639n86535
16670B2189508q02252p62332j239890o36545q62806j99894p00081l96307o03838
16661A5985563o29641o26063n44632m34303n21345j56794k47255o55344o6027
$$ plain form
16652 12104159 11606556 11276041 10856856 10819781 10096885 10113584 9629539 9176717 9077599 8952355
16642 8952355 8731168 8145725 7815147 8079603 7923538 7596327 7580862 7235204 7403415 7134662
16632 7134662 6712353 6563909 6447425 6255624 6179873 6112634 5673500 5713278 5536946 5344878
16622 5344878 5419668 5138785 4847858 4856557 5245394 4899247 4570643 4581052 4586043 4583475 4287032
16611 4287032 4246347 4561427 4061528 4019292 3579705 4002777 3891887 3634070 3536182 3525854
16601 3525854 3561833 3096172 3506673 3266709 3345206 2797482 2924894 3122480 3046996 3132239
16591 3132239 2827330 2821243 2971036 2721417 3082916 2867579 2682448 2702245 2642614 2626379
16581 2626379 2235072 2364155 2307838 2257926 2194563 2353062 2507643 2209140 2219137 2065196
$$ packed form
16652A2104159m97603l30515m19185l7075p22896J6699m84045m52822r9118j25244
16642H952355k21187n85443l30578K64456j56065l27211j5465l45658J68211k68753
16632G134662m22309j48444j16484j91801p5751o7239m39134L9778j76332j92068
16622E344878P4790k80883k90927Q699L88837l46147l28604J0409M991k568k96443
16611D287032m0685L15080m99899m2236m39587M23072j10890k57817r7888j0328
16601C525854L5979m65661M10501k39964P8497n47724J27412J97586p5484Q5243
16591C132239l04909o087J49793k49619L61499k15337j85131J9797n9631j6235
16581B626379l91307J29083n6317m9912o3363J58499J54581k98503R997j53941
$$ plain form
16571 2065196 2164268 1993422 2033385 2184511 2225199 1892229 2184175 1611441 2155758 1758482
16561 1758482 1954487 2150256 1780297 1758488 1749122 1494219 1642489 1803317 1667075 1626873
16551 1626873 1565896 1578834 1556801 1945085 1570131 1419074 1592776 1773111 1405574 1423916
16541 1423916 1599161 1372406 1696272 1335934 1375441 1395268 1547703 1262995 1290337 1494495
16531 1494495 1154888 1594497 1398208 1259786 1588822 1430538 1302823 1277542 881924 1391679
16521 1391679 1174568 978610 1098087 1173492 1032766 1113379 1183876 1346094 996892 1262931
16511 1262931 980714 1016795 950366 1082656 1093060 1021296 1087403 562439 817931 669295
16501 669295 933186 876266 1040472 1239752 1128280 971275 463894 672872 901124 811636
$$ packed form
16571B065196R9072j70846L9963J51126M0688l32970K91946n72734N44317l97276
16561A758482J96005J95769l69959k1809r366k54903J48270J60828j36242m0202
16551A626873o0977J2938k2033L88284l74954j51057J73702J80335l67537J8342
16541A423916J75245k26755L23866l60338L9507J9827J52435k84708K7342K04158
16531A494495l39607M39609j96289j38422L29036j58284j27715k5281l95618N09755
16521A391679k17111j95958J19477P5405j40726Q0613P0497J62218l49202K66039
16511A262931k82217L6081o6429J32290J0404p1764O6107n24964K55492j48636
16501F69295K63891n6920J64206J99280j11472j57005D63894K08978K28252q9488
$$ plain form
16491 811636 919417 553945 1021082 711931 761600 1158297 1014447 680123 965765 867240
16481 867240 822185 690968 919533 870862 659965 713148 501679 651362 834591 648531
16471 648531 663577 789017 840108 659321 636983 368833 499423 719568 733260 888574
16461 888574 842189 779115 767137 602928 474854 419417 583486 750716 451279 398365
16451 398365 607267 421668 363044 408912 484216 674425 629450 530910 410496 406765 364758
16440 364758 847386 282384 357685 -17665 632427 287024 771858 365074 436791 514735
16430 514735 238183 328284 742587 224574 738905 446588 415501 604303 354061 -27516
16419 306088 650139 714356 288484 688390 633131 557003 465737 512213 504312 469861 517025
$$ packed form
16491H11636J07781l65472M67137l09151M9669L96697j43850l34324K85642r8525
16481H67240m5055j31217K28565m8671k10897N3183k11469J49683J83229j86060
16471F48531J5046J25440N1091j80787k2338k68150J30590K20145J3692J55314
16461H88574m6385o3074j1978j64209j28074n5437J64069J67230k99437n2914
16451C98365K08902j85599n8624M5868P5304J90209m4975r8540j20414l731m2007
16440C64758M82628B82384P5301a7665F32427B87024M84834C65074P1717P7944
16430E14735B38183R0101M14303B24574N14331k92317l1087J88802k50242b7516
16419C06088L44051O4217B88484L99906n5259p6128r1266M6476p901l4451M7164
$$ plain form
16408 517025 517081 426832 328703 576092 837094 418736 279213 359143 289216 507796 222951
16396 693404 246871 441642 314712 248550 564290 388535 505381 489256 274363 353799
16386 353799 376762 178988 552094 350144 421585 417745 646411 243149 140759 25003
16375 540700 81954 135181 79302 53975 383981 304659 226620 155184 290303 603674 305693
16364 305693 608852 197393 382866 118091 300218 416279 191609 388496 228138 407279
16354 407279 347186 371856 301196 541709 36002 369691 293766 274359 354099 -23033 392347
16342 391632 512660 52249 451848 361976 617858 161635 456394 144956 87858 1941
16331 437138 48898 -50037 54439 571827 379150 130939 213531 -5032 523745 110684 288037
$$ packed form
16408E17025N6r0249r8129K47389K61002m18358j39523P9930o9927K18580B22951
16396F93404B46871J94771j26930o6162L15740j75755J16846j6125k14893P9436
16386C53799K2963A78988L73106k01950P1441l840K28666B43149j02390B5003
16375E40700H1954N3227n5879k5327L30006p9322p8039p1436J35119L13371k97981
16364C05693L03159A97393J85473A18091J82127J16061A91609J96887j60358J79141
16354D07279o0093K4670p0660K40513C6002L33689p5925j9407P9740b3033C92347
16342C91632J21028E2249L99599q9872K55882A61635K94759A44956n7098A941
16331D37138D8898e0037E4439N17388j92677A30939Q2592e032E23745A10684J77353
$$ plain form
16320 288037 73852 294413 463321 192439 564837 520695 153946 272921 358494 -7892
16309 328645 268021 118786 -24844 297922 75445 51778 -90477 107652 59769 487576 145842
16297 153709 146640 277176 286439 54616 -287943 354707 191563 239288 105040 233584 385649
16286 385649 362411 -131593 228050 423143 254370 254231 -57307 33974 227859 358931 124913
16274 -228094 387197 165903 67986 212800 266045 65095 405611 339623 36790 171415
16264 171415 387445 39851 227740 298292 182803 48214 80470 71185 23809 -121366 314939
16252 -128204 23184 177675 -265046 99084 80921 157226 79930 64887 -86091 290692 -89143
16240 -60353 -21393 -125139 36338 251056 24864 87839 235445 306272 221606 -133850 58544
$$ packed form
16320B88037G3852K20561J68908A92439L72398m4142A53946J18975Q5573g892
16309C28645o0624A18786b4844B97922G5445k3667i0477A07652m7883M27807A45842
16297A53709p069J30536R263E4616b87943C54707j63144M7725A05040J28544J52065
16286C85649k3238a31593B28050J95093j68773j39e7307C3974J93885J31072A24913
16274b28094C87197A65903F7986J44814N3245F5095L40516o5988C6790J34625
16264A71415K16030C9851J87889P0552j15489D8214L2256r285B3809a21366C14939
16252a28204B3184J54491b65046I9084j8163P6305p7296j5043h6091B90692h9143
16240f0353b1393j03746C6338K14718B4864O2975J47606P0827q4666a33850E8544
$$ plain form
16228 378168 90506 152385 -70158 11917 -119341 -6951 327839 -130660 285509 251494 125727
16216 -94554 404064 -200794 8482 115834 211964 110247 -15109 52280 97968 -9134 273308
16204 -170080 102554 114136 249373 215050 -30018 -307748 26521 233715 218223 84609 518110
16193 518110 285009 160107 231480 58475 233018 114198 429202 256526 21615 -47524
16182 220644 -337251 223679 -115848 113335 -41244 68406 121249 -127725 -50297 157592
16171 -5029 -103809 -99500 -95270 -124263 78187 32678 20120 94605 -228324 197178 161590 173703
16159 173703 162578 -122966 -82440 240988 -141638 -108110 59117 244705 8723 -11505 -38689
16148 -38689 -46558 95567 116988 129754 -10378 81579 -174016 75236 140458 -11644 99610 -44412
$$ packed form
16228C78168I0506O1879g0158A1917a19341f951C27839a30660B85509l4015A25727
16216i4554D04064b00794H482J07352R6130j01717a5109E2280M5688i134B73308
16204a70080A02554J1582J35237l4323c0018k77730B6521K07194j5492H4609M33501
16193E18110k33101j24902P1373E8475J74543A14198L15004j72676B1615d7524
16182B20644c37251B23679a15848A13335d1244F8406N2843a27725e0297A57592
16171e029r8780M309M230k8993G8187C2678j2558P4485b28324A97178l5588J2113
16159A73703j1125a22966M0526B40988a41638L3528E9117J85588H723a1505k7184
16148c8689p869I5567K1421J2766a0378H1579a74016G5236O5222a1644I9610d4412
$$ plain form
16135 -69024 -3245 -93534 131365 -66617 205654 -257428 -227712 125367 -56240 -23604 -52943
16124 -52943 182550 165465 653453 234248 164105 206026 -17832 9129 199236 -138549 211680
16112 213759 18232 97982 120313 131478 -73467 -191427 252343 237529 26397 23481 243832
16101 243832 53591 -36116 -43157 -216126 -140587 -94324 168464 -300429 -76649 75842 23631
16089 129945 -67545 -464068 183629 377570 -103471 -111444 200992 -197349 -57898 142292
16078 212872 -8080 189732 194486 223512 -168174 3475 -105259 -158081 -58150 -32010 192387
16066 264576 -2533 -40033 -238159 134492 260263 22384 13423 48723 -26811 -114929 97321
16054 -60414 118355 -74181 316215 182732 -99807 143684 -115501 -27929 -274115 6154 56929
$$ packed form
16135f9024c245r0289A31365f6617B05654b57428K9716A25367e6240b3604k9339
16124e2943A82550j7085M87988B34248p0143M1921a7832I129J90107a38549B11680
16112B13759A8232P9750K2331J1165g3467j17960B52343j4814B6397k916K20351
16101B43832E3591c6116p041j72969P5539M6263A68464c00429g6649G5842B3631
16089A29945f7545l96523A83629J93941a03471p973B00992a97349e7898A42292
16078B12872h080A89732M754K9026a68174C475a05259n2822e8150K6140A92387
16066B64576b533l7500j98126A34492J25771B2384q961L5300b6811q8118I7321
16054f0414A18355g4181C16215j33483i9807A43684a15501b7929k46186F154N0775
$$ plain form
16043 56929 -88768 41847 133106 -156953 -271862 -71278 47940 -38251 -16481 -335664 29883
16031 145370 252247 134931 -119596 -79338 -211738 246041 13926 -43077 -20363 -86878
16021 -86878 -194701 185615 -211596 -34662 -76378 -68118 -514816 -282694 -174946 154271
16010 46587 -76541 84484 -127276 -90291 -69100 -139164 102914 213406 -39256 -47655 82764
15998 189616 -57714 7984 -479622 -32410 14228 -125066 208196 154179 49702 -51503 -306635
15987 -306635 114134 -92991 -331264 364388 178801 362976 371083 13223 269115 224680
15977 224680 223136 71559 108063 -160155 83582 -195714 -170536 150209 -265412 -27952 -25768
15966 -25768 -140267 74931 -17819 -169318 -37247 -257752 92179 26237 121894 -89066 -22500
$$ packed form
16043E6929h8768D1847R1259a56953j14909g1278D7940c8251a6481l19183B9883
16031A45370J06877j17316a19596M0258j32400B46041A3926d3077b0363o6515
16021h6878j07823A85615b11596c4662m1716Q260m46698K32122J07748A54271
16010D6587g6541H4484a27276L6985K1191p0064A02914J10492c9256q399H2764
15998A89616e7714G984d79622c2410A4228a25066B08196n4017D9702e1503k55132
15987c06635A14134i2991k38273C64388A78801J84175Q107A3223K55892m4435
15977B24680j544G1559L6504a60155H3582a95714K5178A50209b65412b7952K184
15966b5768j14499G4931a7819j51499c7247k20505I2179B6237R5657h9066b2500
$$ plain form
15954 163077 240679 -72011 -300523 129715 102014 -200057 60106 258820 -255758 -39832
15943 -120866 44355 -22692 24910 172951 19433 -25601 -248294 9878 64406 -355327 -488864
15932 -488864 -253087 220634 -263566 124805 16037 -141379 -171685 -41122 -136597 -155052
15922 -155052 153771 166386 30970 156107 -29347 -76324 -267568 297614 128474 -212521
15911 228991 -142128 -159044 295670 -216046 -175036 143312 -139151 2404 -128315 -92359
15901 -92359 -119346 248572 -134718 -139743 -297428 21151 -421124 -31587 -212759 -37438 453600
15889 -397863 156403 301580 -214776 42456 -231256 295319 59663 -36019 18609 152734
15879 152734 -52221 -47360 40441 246792 167120 32449 -95374 -32340 -314946 -354041 301884
$$ packed form
15954A63077P7602g2011k28512A29715k7701b00057F0106J98714b55758c9832
15943a20866D4355b2692B4910J48041A9433b5601k22693I878N4528c55327j33537
15932d88864K35777B20634b63566A24805A6037a41379l0306d1122r5475j8455
15922a55052A53771J2615C0970J25137b9347m6977j91244B97614A28474b12521
15911B28991a42128j6916B95670b16046M1010A43312a39151B404a28315L5956
15901i2359k6987B48572a34718n025j57685B1151d21124c1587j81172c7438D53600
15889c97863A56403J45177b14776D2456b31256B95319E9663c6019A8609J34125
15879A52734e2221M861D0441K06351p9672C2449i5374c2340k82606l9095C01884
$$ plain form
15867 217860 -99409 -202250 -92132 290150 154466 81362 -184193 33494 -78390 -112804 -135618
15856 -135618 6353 47462 14629 -75203 -101186 -279029 -162026 201982 76288 -51725 148401
15844 265374 273706 38285 -655776 -167869 -183772 47800 -239634 -150316 199659 -73121 -154154
15833 -154154 61103 -243392 34016 22279 -41811 -317690 -188805 -266644 -170839 129548 88095
15822 88095 86781 104467 -107370 -515629 -239640 372120 177921 -292935 -280411 35569 88074
15811 88074 -57403 -351227 5990 307471 170772 97933 111366 -186513 -140326 -243928 -13338
15799 -319431 -101313 116624 80502 -89054 -106694 101465 -143243 356416 -54852 240426
15788 -124545 30108 -38025 109469 183599 -135217 290017 -54671 -81067 -60358 107559 -229666
$$ packed form
15867B17860i9409j02841i2132B90150j35684p3104a84193C3494g8390l4414k2814
15856a35618F353M1109A4629g5203k5983j77843J17003B01982G6288e1725A48401
15844B65374Q332C8285f55776a67869j5903D7800b39634Q9318A99659g3121q1033
15833a54154F1103b43392C4016j1737d1811k75879J28885p7839R5805A29548m1453
15822H8095j314J7686a07370m08259b39640C72120A77921b92935J2524C5569N2505
15811H8074e7403k93824E990L01481j36699p2839J3433a86513M6187j03602a3338
15799c19431a01313A16624l6122h9054j7640A01465a43243C56416e4852B40426
15788a24545C0108c8025A09469P4130a35217B90017e4671k6396K0709A07559b29666
$$ plain form
15776 -34893 327829 -630162 -54810 -109444 -140753 -13555 -8771 70291 111403 -13094 46075
15764 235796 -62416 -23667 -186580 228111 -239633 -282457 -147709 -13678 -303711 78940
15753 -63656 63281 308353 256037 -100142 108941 -112655 -60755 243437 -249775 -49319
15742 125602 257112 302945 233655 205939 39879 -323713 411084 -193285 -51145 -291485
15732 -291485 -223298 -125823 136527 -197565 163853 -97728 -61672 -246392 -199070 41455 -25673
15720 6460 -154910 -4215 17649 40661 45767 216897 -185966 13118 -168823 -209488 -162170
15709 -162170 40855 -119707 -141761 -98498 70069 -129168 -103239 -177739 -69006 -25962 192013
15697 -264856 -105381 -51028 -179879 -241287 -359961 -43178 286870 397481 58017 29902
$$ packed form
15776c4893C27829f30162e4810n4634l1309a3555M784G0291M1112a3094D6075
15764B35796f2416b3667j62913B28111b39633m2824J34748a3678k90033G8940
15753f3656F3281K45072n2316a00142A08941a12655N1900B43437b49775d9319
15742A25602J31510M5833o9290k7716C9879c23713D11084a93285e1145k40340
15732b91485O8187R7475A36527a97565A63853i7728L6056j84720M7322D1455b5673
15720F460a54910d215A7649K3012N106J71130a85966A3118a68823m0665M7318
15709a62170D0855a19707k2054M3263G0069a29168K5929p4500f9006b5962A92013
15697b64856a05381e1028j28851o1408j18674d3178B86870J10611E8017k8115
$$ plain form
15687 29902 248740 -107553 86309 -169396 124169 -252449 41633 385509 136587 -59936
15676 287012 166084 41760 155370 254939 -155205 210367 42306 217880 -50574 57188
15665 13389 -305993 -348216 -60692 48768 165021 -39647 -38001 -263580 -27921 382652 202498
15654 202498 194138 -338590 -112648 76663 -294229 -98959 161018 292207 302952 -59141 -197390
15643 -197390 215499 18430 -278462 -252261 -341673 -49752 -417124 95391 200928 -81822 247034
15631 -295933 -458422 -79437 -74969 123787 -416379 226992 57386 23802 -217890 75049 -196310
15619 55243 70846 -78836 50607 91215 -104736 105808 -513462 -13221 26445 -376299 -752
15607 -138435 -48566 -104542 -327872 74014 -89381 -244198 -116789 -222621 58159 -34422 -49352
$$ packed form
15687B9902K18838a07553H6309a69396A24169b52449D1633L43876A36587e9936
15676B87012j20928D1760J13610R9569a55205B10367D2306J75574e0574E7188
15665A3389c05993m2223f0692D8768J16253c9647J646k25579b7921C82652j80154
15654B02498q360c38590a12648G6663b94229i8959A61018J31189J0745e9141j38249
15643a97390B15499A8430b78462K6201q9412d9752l67372I5391J05537h1822B47034
15631b95933j62489g9437M468A23787d16379B26992E7386B3802b17890G5049a96310
15619E5243J5603g8836E0607M0608a04736A05808e13462a3221B6445c76299g52
15607a38435d8566n5976k23330G4014h9381j54817a16789j05832E8159c4422j4930
$$ plain form
15596 -49352 -4472 54976 179738 234631 -6990 -15863 -139757 -125350 82852 206040 -176205
15584 -74027 128712 161799 281947 -238112 179437 9510 -147798 181400 167571 -442876
15573 -240250 26632 98227 101675 -287719 -160624 238593 -187766 -88566 95080 9814 135599
15562 135599 24772 -197270 -78647 174641 -28158 250052 178517 179509 52877 119829 33976
15550 -330019 224526 163793 -99437 -28374 63297 97059 12536 -111947 -28696 -235815 -108877
15538 -146987 -144260 264667 -107967 325290 192526 -59967 -238819 -29075 183734 692 -82216
15526 223275 196155 -74539 -5551 -345261 74157 -75239 601543 -168971 398766 5812 -268091
15514 131560 279697 382783 -53492 -423988 -127832 404130 170823 -73452 -67705 -86059
$$ packed form
15596d9352d472E4976J24762N4893f990q873j23894J4407H2852J23188a76205
15584g4027A28712L3087J20148b38112A79437I510a47798A81400j3829d42876
15573b40250B6632P1595L448b87719J27095B38593a87766h8566I5080I814J25785
15562A35599B4772a97270g8647A74641b8158B50052p1535R92E2877O6952C3976
15550c30019B24526o0733i9437b8374F3297L3762A2536a11947b8696k07119a08877
15538a46987K727B64667a07967C25290j32764e9967j78852b9075A83734F92h2216
15526B23275k7120g4539e551l39710G4157g5239F01543a68971C98766E812b68091
15514A31560J48137J03086e3492l70496a27832D04130A70823g3452N747j8354
$$ plain form
15504 -86059 -51378 12095 -112052 -121032 17625 -192931 607349 -96760 -154399 -7875 -75167
15493 -75167 -142337 82536 100890 -116823 -32596 -378507 159113 -163903 276695 -100544
15482 -60418 -17024 101680 -283319 -34147 72046 111270 -53078 294739 -190621 68637 -70398
15470 143803 76996 72922 20347 -112403 -35945 -36025 -86353 111268 189292 92236 134309 -272752
15457 -114335 -265881 275765 99131 -88224 -48265 -230759 -200815 -159340 -157896 200751 61607
15445 305733 193040 -310232 67871 -105572 -73789 -274790 -231678 116705 -377778 -39049
15434 -165841 -88396 163189 197491 -21668 325533 155868 145327 -91882 -141076 -213346 50072
15422 -119797 -11344 -68476 -10222 81786 -35670 139980 39420 -3911 6985 -427569 -13779
$$ packed form
15504h6059L4681A2095a12052q980A7625a92931F07349i6760n7639g875o7292
15493g5167o7170H2536J8354a16823c2596l45911A59113a63903B76695a00544
15482f0418a7024A01680b83319c4147G2046L9224e3078B94739a90621F8637g0398
15470A43803o6807m074B0347a12403c5945q0n0328A11268P8024I2236M2073b72752
15457a14335j51546B75765I9131h8224L9959j82494K9944M1475J444B00751F1607
15445C05733j12693c10232F7871a05572L1783k01001M3112A16705c77778c9049
15434a65841P7445A63189L4302b1668C25533A55868j0541i1882m9194p2270E0072
15422a19797a1344n7132a0222H1786c5670A39980C9420c911F985d27569a3779
$$ plain form
15410 121019 -89166 130975 252906 74707 -340886 247603 160468 -75628 -206211 -213766 -181091
15399 -181091 70179 278998 -72915 23366 -35866 83401 190388 455393 208989 103122
15388 91412 296904 47063 -208443 -101031 -299922 -49781 228889 -415607 16517 -138228
15377 140046 39533 -91865 101833 -172655 251644 1823 -68059 -15864 73251 -227332 -66225
15365 -244116 -161737 -397596 127235 14354 304156 5400 221259 -254034 -217147 -55640 -60345
15354 -60345 -235710 48476 -40888 -131504 -195493 -82810 -49069 -69218 205577 33284 -36057
15342 41540 -133768 -141626 41465 4108 165914 208074 -144116 -35243 -44751 40791 -149627
15330 -49846 226185 -413603 10587 -152413 -212827 -88818 184991 -238738 308970 234972
$$ packed form
15410A21019h9166A30975J21931G4707c40886B47603q7135g5628j30583p555L2675
15399a81091G0179K08819g2915B3366c5866H3401J06987K65005B08989A03122
15388I1412K05492D7063b08443a01031j98891d9781B28889d15607A6517a38228
15377A40046C9533i1865A01833a72655B51644A823f8059a5864G3251b27332f6225
15365b44116Q2379k35859A27235A4354K89802E400K15859b54034L6887e5640m705
15354f0345j75365D8476d0888r0616o3989h2810L3741k0149B05577C3284c6057
15342D1540a33768p858D1465D108J61806M2160a44116c5243r508D0791a49627
15330d9846B26185d13603A0587a52413o0414h8818A84991b38738C08970p3998
$$ plain form
15320 234972 -66612 -213811 -106641 17078 5864 43842 15636 419013 204202 78528 8103
15308 -217415 -137939 61891 -41348 67982 -98610 -48293 -149670 -61355 -80189 -168583 47805
15296 -209217 -16694 12169 126661 217096 403980 -87965 -36842 21635 -60196 -245733 -128155
15285 -128155 -127150 159854 47345 -304268 98269 -58421 -76875 63681 -268 -102139 151400
15273 -83791 185058 -224276 322573 37925 28493 143034 220347 15144 71904 9786 201039
15262 201039 206395 -232899 392290 157453 48567 169523 226858 328469 -7479 204745 179328
15251 179328 325478 565122 650383 1526538 1404665 1140102 1432108 805588 115825 -6225
15240 288988 -93282 553621 469556 -175050 171376 -84094 -50809 102631 204528 265365
$$ packed form
15320B34972f6612j47199a06641A7078E864L7978A5636M03377B04202G8528H103
15308b17415P9476F1891d1348F7982i8610d8293j01377f1355j8834q8394D7805
15296b09217a6694A2169J14492R0435J86884h7965c6842B1635f0196j85537J17578
15285a28155J005A59854D7345c04268I8269e8421j8454F3681b68j01871A51400
15273h3791A85058b24276C22573C7925r432J14541P7313A5144N6760I786J91253
15262B01039N356b32899C92290A57453D8567J20956N7335J01611g479B04745k5417
15251A79328J46150K39644Q5261Q76155j21873k64563K92006o26520A15825f225
15240B88988i3282E53621q4065a75050A71376h4094L3285A02631J01897O0837
$$ plain form
15230 265365 148646 38584 362645 -74183 305026 186503 -79508 175427 158080 259715
15220 259715 74028 169272 195857 82157 56609 59038 163021 109665 47722 -57681 45579
15208 68887 98569 -2489 7347 -42538 -68367 80071 71962 347888 206776 267051 -8690 -94672
15196 -94672 236961 22464 116522 -55687 2420 -46217 26622 89306 53617 -98400 168775
15184 -4358 -198953 39832 -43394 87587 -119143 22683 109928 223760 160883 134174 -37751
15172 331577 -157717 -74845 -128322 -188320 290372 38797 -37634 -149513 50557 -98690 316467
15160 247144 503909 -14152 -239805 119742 109730 53734 379886 151700 332198 -42008
15149 88271 37580 374762 10389 -32517 -90226 -180404 24446 19889 -337958 297384 284933
$$ packed form
15230B65365j16719C8584L24061g4183C05026j18523g9508A75427j7347J01635
15220B59715G4028R5244K6585H2157k5548K429J03983n3356D7722e7681D5579
15208F8887K9682b489G347d2538k5829H0071q109K75926j41112O0275h690q5982
15196i4672B36961B2464R4058e5687B420d6217B6622O2684l5689i8400A68775
15184d358j94595C9832d3394H7587a19143B2683Q7245J13832o2877k6709c7751
15172C31577a57717g4845n3477n9998B90372C8797c7634j11879E0557i8690C16467
15160B47144K56765a4152k25653A19742j0012E3734L26152A51700J80498d2008
15149H8271C7580L37182A0389c2517n7709r0178B4446m557c37958B97384j2451
$$ plain form
15138 284933 78471 -83742 -166024 261091 36765 50476 123220 294011 -273156 256272 -60746
15126 -80817 -160264 116777 81439 -28225 -66949 158787 233833 -139922 203194 -106425 -80195
15115 -80195 241178 209827 43255 540372 175731 225738 24547 -149819 208072 -242159
15104 -9415 109747 351506 199549 97823 89341 -40919 -325722 80398 188282 161223 414340
15093 414340 148376 160473 161091 135570 270294 52204 325814 92885 -18108 -311877 -220156
15082 -220156 338627 240193 376988 192893 128578 300397 -133968 32775 219665 19303
15071 116556 404054 93666 332890 145157 -133539 365649 72055 251331 -76678 -36658
15060 -50205 -78275 -55980 365282 -102544 302235 206544 176711 107621 269055 203676 167934
$$ packed form
15138B84933G8471h3742q2282B61091C6765J3711P2744J70791b73156B56272f0746
15126h0817p9447A16777l5338b8225l8724A58787P5046a39922B03194a06425K6230
15115h0195B41178l1351D3255M97117A75731N0007B4547a49819B08072b42159
15104i415A09747K41759j51957I7823q482d0919k84803H0398J07884k7059K53117
15093D14340A48376J2097O18k5521J34724E2204K73610I2885a8108k93769R1721
15082b20156C38627r8434J36795j84095o4315J71819a33968C2775J86890A9303
15071A16556K87498I3666K39224A45157a33539C65649G2055J79276g6678c6658
15060e0205k8070K2295C65282a02544C02235r5691k9833o9090J61434o5379l5742
$$ plain form
15049 167934 35624 152232 170775 104772 19060 -92032 -73308 120598 -22782 3149 65161
15038 65161 29989 -303905 138058 394215 87235 273702 241004 83986 11052 124079 -79043
15026 53059 365754 207001 129072 -101455 228817 419464 232583 36610 451785 -15762
15015 173123 313752 245356 6411 106853 -213805 450781 169775 25535 202077 2948 310523
15004 310523 307076 397735 226626 159593 58895 232989 -46786 436669 342887 15822 417487
14993 417487 382190 392090 151306 -106738 201623 311466 390395 -33075 168747 402286
14983 402286 386269 -147441 -7327 373093 371219 179265 237012 380332 9341 82362 79607
14972 79607 -84233 -41921 169225 118507 318358 64122 236941 150032 -51365 259659 111174
$$ packed form
15049A67934C5624J16608J8543o6003A9060i2032J8724A20598b2782C149O2012
15038F5161B9989c03905A38058K56157H7235J86467l2698H3986A1052J13027g9043
15026E3059L12695j58753p7929a01455B28817J90647j86881C6610M15175a5762
15015A73123J40629o8396F411J00442b13805D50781A69775B5535J76542B948L07575
15004C10523l447R0659j71109o7033E8895J74094d6786D36669r3782A5822M01665
14993D17487l5297R900A51306a06738B01623J09843P8929c3075A68747K33539
14983D02286j6017a47441g327C73093j874A79265N7747J43320I341P3021k755
14972G9607h4233d1921A69225n0718J99851F4122J72819q6909e1365B59659A11174
$$ plain form
14960 490544 430481 141491 96602 369110 363904 402196 343500 21246 209851 21768 150988
14949 150988 37849 321671 55487 539132 225531 -68594 398429 -182119 396586 447188
14939 447188 -12127 325574 -45758 -24149 503820 160803 376783 410335 336020 297889 63418
14927 81252 390536 342563 105048 88277 884821 503488 271965 332963 268286 70059 583145
14916 583145 130436 334908 275572 370470 233960 214829 246883 410141 116508 305893
14906 305893 445748 563257 336669 427670 215041 515338 98422 443838 192597 299278
14896 299278 132624 487257 91500 612730 178200 -5746 184104 487535 447324 387046
14886 387046 160058 -83229 581061 495545 226982 251877 -30923 231403 230056 425738 485309
$$ packed form
14960D90544o0063A41491m4889K72508n206L8292n8696B1246J88605B1768J29220
14949A50988C7849K83822E5487M83645B25531f8594C98429a82119C96586N0602
14939D47188a2127C25574d5758K1609E03820A60803K15980L3552p4315l8131F3418
14927H1252L09284m7973A05048j6771P96544l81333k31523O0998o4677G0059N13086
14916E83145A30436K04472n9336R4898j36510j9131L2054J63258A16508J89385
14906C05893J39855J17509k26588R1001k12629L00297I8422L45416A92597J06681
14896B99278A32624L54633I1500N21230A78200e746A84104L03431m0211o0278
14886C87046A60058h3229E81061q5516B26982K4895c0923B31403j347J95682N9571
$$ plain form
14875 485309 428298 430827 528156 370226 116684 532385 338431 262903 374727 272767
14865 272767 408518 273309 253097 415986 417773 355981 217082 595539 560376 396903
14855 396903 602544 411650 364648 262083 228619 410343 277127 526426 167854 207631
14845 207631 346843 405351 219983 491945 339461 381269 258610 315553 266088 253559
14835 253559 289363 413539 427163 440023 358820 704837 571152 578462 567632 516317 206398
14823 -28399 4135 -6397 596219 600628 253543 434068 672430 273250 476151 662111 625602
14812 625602 224639 129980 220095 437626 393276 414688 286774 322203 619619 298823
14801 141606 398033 699618 339942 435220 550511 451199 638395 418787 270577 5079
$$ packed form
14875D85309n7011K529R7329j57930A16684M15701j93954p5528J11824j01960
14865B72767J35751j35209k0212J62889J787o1792j38899L78457l5163j63473
14855C96903K05641j90894m7002j02565l3464J81724j33216K49299A67854L9777
14845B07631J39212N8508j85368K71962j52484M1808j22659N6943m9465j2529
14835B53559L5804J24176J3624J2860q1203L46017j33685P310j0830n1315B06398
14823b8399D135f397E96219M409B53543J80525K38362B73250K02901J85960l6509
14812F25602B24639r4659R0115K17531m4350K1412j27914L5429K97416B98823
14801A41606K56427L01585C39942R5278J15291r9312J87196k19608j48210E079
$$ plain form
14790 745561 495946 246242 628652 343146 355781 360161 790749 587629 433039 642813
14780 642813 365684 399011 311507 406983 422353 603636 402326 570379 307022 632951
14770 632951 176649 665767 635311 431312 378310 691123 366664 537685 677859 526783
14760 526783 513239 184428 391109 452663 427928 443093 636214 637354 352727 607996 760556
14749 760556 302036 454702 559988 770791 582807 864846 374367 406845 611235 528485
14739 528485 513901 612163 665510 384529 762480 532908 519399 846307 879472 769745
14729 769745 430559 385474 744119 321631 575858 538176 631090 491592 507997 384762
14719 384762 469526 568588 674415 1131769 874186 878833 776392 567567 740607 914866
$$ packed form
14790G45561k49615B46242L82410k85506J2635M380M30588k03120j54590K09774
14780F42813k77129L3327q7504R5476J5370J81283k01310J68053k63357L25929
14770F32951A76649M89118l0456k03999n3002L12813l24459J71021J40174j51076
14760E26783j3544A84428K06681O1554k4735J5165J93121J140k84627K55269J52560
14749G60556C02036J52666J05286K10803j87984K82039C74367L2478K04390q2750
14739E28485j4584R8262N3347k80981L77951k29572j3509L26908L3165j09727
14729G69745l39186m5085L58645C21631K54227l7682R2914j39498J6405j23235
14719C84762Q4764R9062J05827M57354k57583M647j02441k08825J73040J74259
$$ plain form
14709 914866 526034 934161 939770 754874 641243 782022 385421 779013 861496 778419
14699 778419 1010657 564099 631346 1063551 600681 528856 624589 599924 606800 911717 857344
14688 857344 696865 1061823 816174 974898 1082038 744459 698364 918645 1149202 725098
14678 725098 478732 917069 804253 642719 1095240 899372 843630 937782 942607 865429
14668 865429 794039 1040067 931090 1095327 842558 574349 1127593 1175417 794218 885948
14658 885948 1010373 1115310 881415 1076904 916421 1118120 1117025 1279702 998566 915950
14648 915950 1207412 1261793 1108240 1021598 971340 1374065 1210625 1125366 1354111 1436031
14638 1436031 1182315 1579631 1437717 735805 1084647 1318358 834212 1267657 1450359
$$ packed form
14709I14866l88832M08127N609j84896j13631J40779C85421L93592Q2483q3077
14699G78419K32238m46558O7247M32205m62870p1825R5733k4665O876L04917n4373
14688H57344j60479L64958k45649J58724J07140l37579m6095K20281K30557m24104
14678G25098k46366M38337j12816j61534M52521j95868n5742R4152M825p7178
14668H65429p1390K46028j08977J64237k52769k68209N53244M7824l81199R1730
14658H85948J24425J04937k33895J95489j60483K01699j095J62677k81136q2616
14648I15950K91462N4381j53553q6642n0258M02725j63440q5259K28745Q1920
14638A436031k53716L97316j41914p01912L48842K33711m84146M33445J82702
$$ plain form
14629 1450359 992713 1298429 906274 1146609 961116 1235540 1319059 885645 1200607 1451014
14619 1451014 1590679 1101871 996962 909463 1082180 1467511 1325565 1363167 1506207 1587202
14609 1587202 1308542 1149200 1507102 1326867 1244335 1671220 1589337 1509375 1232087 1515675
14599 1515675 1274417 1374070 1289544 1598587 1464861 1467243 1610368 1692011 1571342 1478356
14589 1478356 1579644 1950460 1803229 1480651 1463791 1718919 1624184 1975963 1572586 1635789
14579 1635789 2289881 2082545 1652837 1731731 2048605 1930767 1600948 2041984 2164110 1882359
14569 1882359 2131454 2308785 2171950 1870789 2330262 2279132 2695638 2275333 2399695 2659072
14559 2659072 2464508 2307204 2511382 2789768 2822909 3060257 3222237 3673492 3907979 5128661
$$ packed form
14629A450359m57646L05716l92155K40335j85493K74424Q3519m33414L14962K50407
14619A451014J39665m88808j04909q7499J72717L85331j41946L7602J43040Q0995
14609A587202k78660j59342L57902j80235q2532M26885q1883p9962k77288K83588
14599A515675k41258R9653q4526L09043j33726K382J43125Q1643j20669r2986
14589A478356J01288L70816j47231l22578j6860K55128r4735L51779m03377O3203
14579A635789O54092k07336m29708P8894L16874j17838l29819M41036J22126k81751
14569A882359K49095J77331j36835l01161M59473n1130M16506m20305J24362K59377
14559B659072j94564j57304K04178K78386L3141K37348J61980M51255K34487J220682
$$ plain form
14549 5128661 7032161 11213970 21585971 43698167 42897583 18424255 7527793 3777511
14541 3777511 3007456 2153486 1957650 2018132 1905173 1877258 2092474 1849370 2038178 2081946
14531 2081946 1737253 1920201 2239890 1969931 2198570 2049484 2098182 2129274 2392177 2463710
14521 2463710 2528179 2224389 2111522 2346829 2239297 2355628 2649803 2886367 2641838 2589781
14511 2589781 2500097 2412668 2616428 2745626 2685629 2722000 2487868 2444864 2550149 2695000
14501 2695000 2492899 2826418 2822129 3057081 3275334 2798840 3097474 3419758 2983749 3050839
14491 3050839 2764831 3231621 3073948 3226645 3174775 3572301 3625258 3094513 3554397 3395616
14481 3395616 3673397 3486600 3427791 3387349 3487996 3286400 3713215 4003892 3686887 3887104
$$ packed form
14549E128661J903500M181809J0372001K2112196q00584A8424255G527793l750282
14541C777511p70055q53970j95836O0482j12959k7915K15216k43104J88808M3768
14531B081946l44693J82948L19689k69959K28639j49086M8698L1092K62903P1533
14521B463710O4469l03790j12867K35307j07532J16331K94175K36564k44529n2057
14511B589781q9684q7429K03760J29198n9997L6371k34132m3004J05285J44851
14501B695000k02101L33519m289K34952K18253m76494K98634L22284m36009O7090
14491C050839k86008M66790j57673J52697n1870L97526N2957n30745M59884j58781
14481C395616K77781j86797n8809m0442J00647k01596M26815K90677l17005K00217
$$ plain form
14471 3887104 3852132 3911891 3956361 4115949 3988708 4149210 4038714 4258832 3899180 3955320
14461 3955320 4287084 4188885 4587962 4618077 4460810 4859230 4723754 4555016 4747423 4633280
14451 4633280 4816993 4751714 4954662 4995243 5006194 5015298 5444592 5252591 5472819 5589886
14441 5589886 5010811 5379032 5387858 5620155 5902513 6035706 5850749 6038810 6180775 6104821
14431 6104821 6170356 6335836 6586427 6590513 6492232 6193452 6761186 6817889 6641166 7181442
14421 7181442 7116325 7372949 7456973 7753894 8070390 7801985 7886020 7779098 8029347 7993790
14411 7993790 8341981 8589469 8857022 8292512 8905843 8878351 8585542 8880373 9188350 9381836
14401 9381836 9452200 9847680 9555199 9900813 10217946 10146553 10755307 10839859 10925218 11141408
$$ packed form
14471C887104l4972N9759M4470J59588j27241J60502j10496K20118l59652N6140
14461C955320L31764r8199L99077L0115j57267L98420j35476j68738J92407j14143
14451D633280J83713o5279K02948M0581J0951R104M29294j92001K20228J17067
14441E589886n79075L68221Q826K32297K82358J33193j84957J88061J41965p5954
14431F104821O5535J65480K50591M086r8281k98780N67734N6703j76723N40276
14421G181442o5117K56624Q4024K96921L16496k68405Q4035j06922K50249l5557
14411G993790L48191K47488K67553n64510O13331k7492k92809K94831L07977J93486
14401I381836P0364L95480k92481L45614L17133p1393O08754Q4552Q5359K16190
$$ plain form
14391 11141408 11173303 11372123 11666408 12076324 12025543 11856083 12378018 12590474 12846274 13035862
14381 13035862 13544628 13424893 13598486 14019390 14469884 14477992 14817289 15312974 15290360 15667688
14371 15667688 15459396 16060682 16545657 16794069 17068862 17720322 18117754 18021542 18681649
14362 18681649 19006225 19327522 20176263 20737792 21152921 21157265 21957823 22376747 22898404 23356282
14352 23356282 23917198 24390847 25274045 25622099 26377120 27094719 27549448 28155600 29248526
14343 29248526 29876386 30513413 31410357 32144292 33251940 34464725 34727413 36004518 37212594
14334 37212594 38501962 39293749 40515728 41784386 43141245 44637640 45489874 47436043
14326 47436043 48723818 50480193 52472925 54247211 55999047 58318547 60305087 62535737
$$ packed form
14391A1141408L1895J98820K94285M09916n0781j69460N21935K12456K55800J89588
14381A3035862N08766j19735J73593M20904M50494Q108L39297M95685k2614L77328
14371A5667688k08292O01286M84975K48412K74793O51460L97432r6212O60107
14362A8681649L24576L21297Q48741N61529M15129M344Q00558M18924N21657M57878
14352B3356282N60916M73649Q83198L48054P55021P17599M54729O06152J092926
14343B9248526O27860O37027Q96944P33935J107648J212785K62688J277105J208076
14334C7212594J289368P91787J221979J268658J356859J496395Q52234J946169
14326D7436043J287775J756375J992732J774286J751836K319500J986540K230650
$$ plain form
14318 62535737 64541931 66938945 69743237 72466966 75461176 78482394 81718172 85282269
14310 85282269 88318821 92780605 96543788 100886800 105247369 110207699 115263451 120619134
14302 120619134 126077507 132500359 138766682 145827873 153703569 161258049 169418412 178725477
14294 178725477 188226205 198144864 208630984 219897939 232039977 244581592 257592697
14287 257592697 271509331 286387722 301310110 317213832 333311102 349810787 366403221
14280 366403221 382842506 399146958 414952492 429973588 443487832 455651923 465500412
14273 465500412 471619391 474274633 475072114 474665310 473905293 470424255 464602488 456164702
14265 456164702 445569486 433245001 419595141 404080565 387807130 371452494 354717669
$$ packed form
14318F2535737K006194K397014K804292K723729K994210L021218L235778L564097
14310H5282269L036552M461784L763183M343012M360569M960330N055752N355683
14302A20619134N458373O422852O266323P061191P875696P554480Q160363R307065
14294A78725477R500728R918659J0486120J1266955J2142038J2541615J3011105
14287B57592697J3916634J4878391J4922388J5903722J6097270J6499685J6592434
14280C66403221J6439285J6304452J5805534J5021096J3514244J2164091R848489
14273D65500412O118979K655242P97481m06804p60017l481038n821767q437786
14265D56164702j0595216j2324485j3649860j5514576j6273435j6354636j6734825
$$ plain form
14258 354717669 338063545 321549699 305403236 290428151 276490731 261976084 248508278
14251 248508278 235131963 223118164 211551001 200445833 190264878 180716790 171790467
14244 171790467 163454854 155356256 147579955 140733652 133953169 127585775 122274711 116787715
14236 116787715 111575968 106697582 101796676 97649338 93533576 90333662 86597961 82902812
14228 82902812 79701418 76674430 73428519 70793467 68106113 65676804 63654572 61116838
14220 61116838 59611641 57052830 55077962 53356520 51684675 50038290 48820270 47530874
14212 47530874 45655530 44157138 42902091 41533771 40491620 40059944 38622163 37086355
14204 37086355 36116157 35441900 34080429 33558493 33131386 31797049 30792570 30042517 29621693
$$ packed form
14258C54717669j6654124j6513846j6146463j4975085j3937420j4514647j3467806
14251B48508278j3376315j2013799j1567163j1105168j0180955r548088q926323
14244A71790467q335613q098598p776301o846303o780483o367394n311064n486996
14236A16787715n211747m878386m900906m147338m115762l199914l735701l695149
14228H2902812l201394l026988l245911k635052k687354k429309k022232k537734
14220F1116838j505197k558811j974868j721442j671845j646385j218020j289396
14212D7530874j875344j498392j255047j368320j042151m31676j437781j535808
14204C7086355r70198o74257j361471n21936m27107j334337j004479p50053m20824
$$ plain form
14195 29621693 28825712 28242035 27038116 26713579 25879750 25285610 24585433 23951963 23384341
14186 23384341 22872818 22258693 21717276 21150321 20799401 20523296 20093765 19461743 19495437
14177 19495437 18701868 18433633 18006763 17485072 17355621 16733272 16487440 16138563 15750648
14168 15750648 15696161 15260515 14970403 14948764 14212428 14591440 13895434 13572687 13158716 13093475
14158 13093475 12865084 12753002 12509691 12107462 12299992 12052808 11529671 11382768 11324311
14149 11324311 10551538 11290492 10881013 10649780 10486501 10241475 10236939 9816239 9465181 9494369
14139 9494369 9349761 9184667 9080089 8807805 8851604 8777522 8524760 8267813 8723202 8339678
14129 8339678 8140194 7953440 8142116 7786195 7768600 7365832 7290337 7390612 7335765 7645139
$$ packed form
14195B9621693p95981n83677j203919l24537q33829n94140p00177o33470n67622
14186B3384341n11523o14125n41417n66955l50920k76105m29531o32022L3694
14177A9495437p93569k68235m26870n21691j29451o22349k45832l48877l87915
14168A5750648n4487m35646k90112k1639p36336L79012o96006l22747m13971o5241
14158A3093475k28391j12082k43311m02229J92530k47184n23137j46903n8457
14149A1324311p72773P38954m09479k31233j63279k45026m536m20700l51058K9188
14139I494369j44608j65094j04578k72284M3799p4082k52762k56947M55389l83524
14129H339678j99484j86754J88676l55921j7595m02768p5495J00275n4847L09374
$$ plain form
14119 7645139 7277809 7264377 7090513 6643833 7043158 6887299 6471417 6529564 6414324 6319926
14109 6319926 6205594 6319345 5881394 6345235 5983036 6005775 5672495 5809972 5600085 5540292
14099 5540292 5738985 5598422 5502626 5222657 5201226 5459281 5220173 5228745 4904189 4675389
14089 4675389 4985790 4828515 4790397 4796928 5015782 4715755 4656484 4717350 4558981 4714793
14079 4714793 4591218 4121763 4309285 4350113 4314054 4269158 3902714 4120224 4094581 4175132
14069 4175132 4091108 4162884 4192737 4175697 4134687 4083738 3973541 3649264 3790462 4066802
14059 4066802 3895048 3883305 3453833 3557828 3822699 3426896 3174830 3191366 3375206 3485530
14049 3485530 3287637 3317508 3328033 3516360 3357888 3065920 3522603 3009780 2810768 3131222
$$ packed form
14119G645139l67330j3432j73864m46680L99325j55859m15882N8147j15240r4398
14109F319926j14332J13751m37951M63841l62199K2739l33280J37477k09887n9793
14099E540292J98693j40563r5796k79969k1431K58055k39108Q572l24556k28800
14089D675389L10401j57275l8118O531K18854l00027n9271O0866j58369J55812
14079D714793j23575m69455J87522M0828l6059m4896l66444K17510k5643Q0551
14069D175132q4024P1776K9853j7040m1010n0949j10197l24277J41198K76340
14059D066802j71754j1743m29472J03995K64871l95803k52066J6536J83840J10324
14049C485530j97893K9871J0525J88327j58472k91968M56683n12823j99012L20454
$$ plain form
14039 3131222 3033886 2684467 2904769 2980966 3017342 2759188 3044024 2908227 2722040 2849388
14029 2849388 2780594 2940497 2492172 2661119 3242479 2450131 2743548 2510103 2680362 2318324
14019 2318324 2520891 2707777 2534397 2676768 2499213 2310107 2434192 2157790 2292475
14010 2292475 2360905 2257622 1892718 2269477 2552461 2193574 2048015 2209044 2479613 1820872
14000 1820872 2192986 2172917 1952171 1943999 1924626 1796935 2358998 1735458 2269710 2341408
13990 2341408 2420394 3301697 6290478 14354491 36769930 46542874 21837426 10934461
13982 10934461 6981053 4969300 4599897 3572941 3559412 3130256 3308940 2768620 2365888
13973 2365888 2685235 2637394 2249261 2105503 2248953 2300325 2519612 1995679 2166328 2187664
$$ packed form
14039C131222r7336l49419K20302P6197L6376k58154K84836j35797j86187J27348
14029B849388o8794J59903m48325J68947N81360p92348K93417k33445J70259l62038
14019B318324K02567J86886j73380J42371j77555j89106J24085k76402J34685
14010B292475O8430j03283l64904L76759K82984l58887j45559J61029K70569o58741
14000A820872L72114k0069k20746q172j9373j27691N62063o23540N34252P1698
13990B341408P8986Q81303K988781Q064013K2415439R772944B1837426j0902965
13982A0934461l953408k011753l69403j026956j3529m29156J78684n40320m02732
13973B365888L19347m7841l88133j43758J43450N1372K19287n23933J70649K1336
$$ plain form
13963 2187664 1873703 2103638 1895439 1785525 1655575 1830764 2039468 1559682 1967612
13954 1967612 1514074 1904659 1942617 1653186 1937748 1902349 1847511 2003744 1562791 1557039
13944 1557039 1844549 1897063 1813755 1632452 1686822 1722158 1620596 1366675 1879590 1760050
13934 1760050 1871045 1718732 1602935 1589482 1620824 1613306 1238433 1486404 1656576 1366788
13924 1366788 1496105 1476210 1256135 1279186 1372973 1444848 1552321 1214377 1574884 1015156
13914 1015156 1471224 1652477 1223686 1378476 1432458 1422080 1439170 1409008 1448728 1228740
13904 1228740 1070350 1251701 1361763 1443312 1118187 1039099 1307444 1253954 1231306 1413463
13894 1413463 1340706 1047615 1399778 1402431 961212 1477804 1378065 1164361 1306946 1193118
$$ packed form
13963B187664l13961K29935k08199j09914j29950J75189K08704m79786M07930
13954A967612m53538L90585L7958k89431K84562l5399n4838J56233m40953n752
13944A557039K87510N2514q3308j81303N4370L5336j01562k53921N12915j19540
13934A760050J10995j52313j15797j3453L1342p518l74873K47971J70172k89788
13924A366788J29317j9895k20075K3051R3787P1875J07473l37944L60507n59728
13914A015156M56068J81253m28791J54790N3982j0378J7090l0162L9720k19988
13904A228740j58390J81351J10062Q1549l25125p9088K68345n3490k2648J82157
13894A413463p2757k93091L52163K653m41219N16592r9739k13704J42585j13828
$$ plain form
13884 1193118 1217557 1016482 1004785 1431262 1005789 1397465 1260639 1113584 1223682 839031
13874 839031 627983 1091380 1018267 1276841 1146475 820305 1074042 1046109 845657 1093850
13864 1093850 980921 1084173 1205153 975911 730712 852016 1043622 1003535 870923 1346765
13854 1346765 1175880 900649 1021215 871119 700278 1157127 780332 916737 859907 1113011
13844 1113011 1063051 743057 1080552 994807 766797 776221 691233 956791 1173282 723721
13834 723721 745654 1021310 1072877 788552 1114886 845837 964720 518883 632318 1185140
13824 1185140 950767 794053 454301 818363 779255 793628 732312 887122 962422 969461
13814 969461 808274 827961 693802 696784 760788 962693 780890 1085718 890894 1030280
$$ packed form
13884A193118K4439k01075j1697M26477m25473L91676j36826j47055J10098l84651
13874H39031k11048M63397p3113K58574j30366l26170K53737k7933k00452K48193
13864A093850j12929J03252J20980k29242k45199J21304J91606m0087j32612M75842
13854A346765j70885k75231J20566j50096j70841M56849l76795J36405n6830K53104
13844A113011m9960l19994L37495q5745k28010R424q4988K65558K16491m49561
13834G23721K1933K75656N1567k84325L26334k69049J18883m45837J13435N52822
13824A185140k34373j56714l39752L64062l9108J4373o1316J54810P5300P039
13814I69461j61187J9687j34159K982O4004K01905j81803L04828j94824J39386
$$ plain form
13804 1030280 720123 773787 840763 599422 642039 673976 672658 749530 494731 755666 872066
13793 872066 744136 515398 614329 789751 580481 426898 817875 581533 821686 582294
13783 582294 586201 646660 721194 583758 673626 747816 592025 906419 1038518 668328 301270
13771 747325 496479 802128 816309 631727 731950 540816 744293 1215598 506368 909215
13761 909215 345940 395243 680087 832509 754670 313011 607387 519490 515855 681992
13751 681992 918342 576566 454442 509729 948370 530694 627278 685735 697650 573103
13741 573103 587177 533166 405302 461984 852567 579109 840900 465358 637124 750488
13731 750488 870729 494137 436117 679691 753880 574690 766514 729372 126556 824779
$$ packed form
13804A030280l10157N3664O6976k41341M2617L1937j318P6872k54799K60935J16400
13793H72066j27930k28738R8931J75422k09270j53583L90977k36342K40153k39392
13783E82294L907O0459P4534j37436Q9868P4190j55791L14394J32099l70190C01270
13771G47325k50846L05649J4181j84582J00223j91134K03477M71305E06368M02847
13761I09215C45940M9303K84844J52422p7839C13011K94376q7897l635J66137
13751F81992K36350l41776j22124N5287M38641m17676R6584N8457J1915j24547
13741E73103J4074n4011j27864N6682L90583k73458K61791l75542J71766J13364
13731G50488J20241l76592n8020K43574P4189j79190J91824l7142A26556O98223
$$ plain form
13721 824779 528968 241586 396489 645057 544926 340138 649072 507118 637890 207703
13710 588341 288149 292560 672045 603983 786376 499249 280880 565141 533815 123865
13699 493538 635929 522001 137340 516963 593738 822716 758694 280163 338384 616321
13689 616321 694425 657190 422325 404829 494386 316603 474587 529865 574488 559677 550138
13678 550138 633111 563801 422909 651183 605150 227917 696268 206228 369961 604834
13668 604834 583388 598238 449436 353400 509574 238558 613675 150587 416543 540807
13658 540807 385086 494022 513684 378248 458515 172561 330572 536523 437572 394623
13648 394623 164934 355857 774060 537707 444939 241830 308796 342586 380645 166017
$$ packed form
13721H24779k95811B41586J54903K48568j00131k04788L08934j41954J30772B07703
13710E88341B88149M411L79485o8062J82393k87127k18369K84261l1326A23865
13699D93538J42391j13928A37340L79623P6775K28978o4022B80163N8221K77937
13689F16321P8104l7235k34865j7496Q9557j77783J57984N5278M4623j4811r539
13678E50138Q2973o9310j40892K28274m6033B27917M68351B06228J63733K34873
13668F04834k1446J4850j48802r6036J56174B38558L75117A50587K65956J24264
13658E40807j55721J08936J9662j35436Q0267A72561J58011K05951r8951m2949
13648C94623A64934J90923M18203k36353r2768k03109O6966L3790L8059A66017
$$ plain form
13637 452132 580265 340674 616446 103326 268123 512934 543583 334814 453701 505551
13627 505551 321060 354576 480163 151749 272932 87288 452769 769311 306684 335972
13617 335972 426515 407571 269965 105053 135719 330642 387686 458832 429484 218753 341749
13606 341749 293610 814436 499444 685026 456835 -135914 341221 48398 431038 543646
13596 543646 782616 374054 93233 139420 463826 -47186 358572 252710 560591 295810
13586 295810 263996 530188 171333 247673 360266 378780 375895 57149 610151 42072 189306
13575 189306 177466 460595 532969 6222 243173 -22026 276870 179983 300733 203409 445644
13564 445644 52871 400151 286460 231331 48224 -82558 215061 459253 206348 97499
$$ packed form
13637D52132J28133k39591K75772A03326J64797K44811L0649k08769J18887N1850
13627E05551j84491L3516J25587A51749J21183H7288L65481L16542C06684K9288
13617C35972R0543j8944j37606A05053L0666J94923N7044P1146k9348k10731J22996
13606C41749m8139N20826l14992J85582k28191a35914C41221D8398L82640J12608
13596E43646K38970C74054I3233M6187L24406d7186C58572j05862L07881k64781
13586B95810l1814K66192A71333P6340J12593J8514k885E7149N53002D2072J47234
13575A89306j1840K83129P2374F222K36951b2026B76870r6887J20750r7324K42235
13564D45644E2871L47280j13691n5129D8224h2558B15061K44192B06348I7499
$$ plain form
13553 347915 64734 229902 112505 263039 173849 375642 359339 191878 21054 226120
13543 226120 144091 156321 547806 365937 153494 195801 94190 144515 85475 78666 -83925
13531 664948 469939 287944 345830 309563 359082 197932 59835 408642 418385 157536 295389
13520 295389 54869 -138932 -17578 434575 428929 471633 323072 411867 258019 348350 182358
13509 182358 295382 265413 365943 -71299 113494 90000 203518 175375 426694 154543
13498 283157 458529 366805 187180 720517 161969 325415 46083 162288 201924 309414
13488 309414 243097 -73057 208561 -136742 422046 -124820 -1208 422531 59023 344782
13478 344782 227958 246067 180148 281176 332690 57070 275066 428032 227193 49747
$$ packed form
13553C47915F4734J65168A12505J50534q9190K01793j6303j67461B1054K05066
13543B26120q2029J2230L91485j81869A53494M2307I4190N0325n9040o809h3925
13531F64948j95009j81995N7886l6267M9519j61150E9835L48807R743A57536J37853
13520B95389E4869a38932a7578D34575n646M2704j48561Q8795j53848R0331j65992
13509A82358J13024k9969J00530g1299A13494k3494J13518k8143K51319A54543
13498B83157J75372r1724j79625N33337A61969J63446D6083J16205L9636J07490
13488C09414o6317g3057B08561a36742D22046a24820a208D22531E9023K85759
13478C44782j16824J8109o5919J01028N1514E7070K17996J52966k00839D9747
$$ plain form
13467 186070 42070 211226 371649 15169 504630 145135 286987 -74729 614609 86649
13456 80262 239968 188974 -181 522768 44065 212535 43014 -162036 -55414 170074 279683
13445 279683 88183 330178 -123535 173266 150991 188702 -62540 209551 72708 23079 465457
13434 465457 481100 -61241 463957 291989 13865 83279 -44275 297447 -13316 -211544 115482
13422 -78449 164301 41247 207149 197417 207730 307769 477413 280111 -54393 181285 205528
13411 205528 145183 269751 202902 232728 441036 417416 -112635 288704 148930 298035
13401 298035 -214883 383598 255607 86334 15409 495726 391996 237206 120153 43515
13390 274445 230518 267376 355403 573731 360729 114046 111494 102447 223078 282994 137876
$$ packed form
13467A86070D2070J69156J60423A5169M89461A45135J41852g4729F14609H6649
13456H0262J59706n0994a81E22768D4065J68470D3014a62036e5414A70074J09609
13445B79683H8183K41995a23535A73266k2275L7711f2540B09551G2708B3079M42378
13434D65457J5643f1241D63957j71968A3865O9414d4275B97447a3316j98228A15482
13422g8449A64301D1247J65902r732J0313J00039J69644j97302e4393A81285K4243
13411B05528o0345J24568o6849K9826K08308k3620a12635B88704j39774J49105
13401B98035b14883C83598j27991H6334A5409M80317j03730j54790j17053D3515
13390B74445m3927L6858Q8027K18328k13002A14046k552r047J20631N9916A37876
$$ plain form
13378 278314 90135 330737 6102 136417 299729 153703 -153178 185559 562919 198363
13367 22362 296350 309474 172854 360464 192173 353319 166536 28963 65699 61908 19701
13355 82384 131779 413119 4927 359354 248138 -102512 454086 187961 609763 -60614
13344 400177 513482 4774 248911 277401 218842 296647 379467 14720 412048 385984 588053
13333 588053 270355 331694 367000 -20284 110376 137163 -59384 200207 103917 436566 121404
13321 -179 76550 304018 -45613 625780 -153285 478241 44470 260885 210712 -347177 -207413
13310 -207413 152018 -102254 275683 132734 105630 104426 210245 141022 -104463 360420
13299 -4581 -17519 35729 27547 52600 388981 -231572 231108 279935 151347 359370 42269
$$ packed form
13378B78314I0135K40602F102J30315J63312j46026a53178A85559L77360A98363
13367B2362K73988J3124j36620J87610j68291J61146A66536B8963L6736l791A9701
13355H2384M9395K81340D927L54427j11216a02512D54086A87961M21802f0614
13344D00177J13305D774K44137K8490n8559P7805Q2820A4720L97328k6064K02069
13333E88053B70355O1339L5306b0284A10376K6787e9384B00207r6290L32649A21404
13321a79G6550K27468d5613F25780a53285D78241D4470K16415n0173c47177J39764
13310b07413A52018a02254B75683A32734k7104j204J05819o9223a04463C60420
13299d581j2938C5729q182K5053L36381b31572B31108M8827j28588K08023D2269
$$ plain form
13287 256770 -31616 31453 238976 -74957 238500 97659 232436 154901 120931 -28546 165211
13275 134172 247176 -117960 187622 482518 -65162 119072 314678 35793 -1431 374272
13264 93070 329407 419290 147847 115641 199874 -212406 71562 -83224 400725 139248 229070
13253 229070 -81676 -146579 -27672 -19354 15062 61003 51030 -216694 239438 330705 10070
13241 455152 -103109 10469 -74689 -32108 -343338 421929 61199 38047 -151876 270756
13230 106942 343616 -7459 -9505 -15839 -258669 149029 140696 -57282 -32773 425520 389808
13219 389808 -67157 188289 -115332 93280 211604 171865 308060 292756 161816 -53380
13208 77323 169722 -151846 100844 287227 577616 420838 202864 416559 88449 36262
$$ packed form
13287B56770c1616C1453K07523g4957B38500I7659J34777p7535l3970b8546A65211
13275A34172J13004a17960A87622K94896f5162A19072J95606C5793a431C74272
13264I3070K36337Q9883A47847l2206Q4233b12406G1562h3224D00725A39248Q9822
13253B29070h1676o4903b7672Q318A5062M5941r973b16694B39438R1267A0070
13241D55152a03109A0469g4689c2108l11230D21929F1199k3152a51876B70756
13230A06942K36674g459k046o334k42830A49029q333e7282K4509D25520l5712
13219C89808f7157A88289a15332I3280J18324l9739J36195j5304j30940e3380
13208G7323R2399a51846A00844J86383K90389j56778B02864K13695H8449C6262
$$ plain form
13197 121590 14005 67409 -7699 -57292 156517 136740 56368 240970 323530 184244 74558
13185 19799 94375 133614 98484 -73136 77068 44709 -121001 323650 -32184 318942 -111034
13173 179518 308464 38010 269574 -268407 168633 121101 109933 23293 291644 -28735
13162 279941 170789 -79002 90502 186541 206436 94631 151418 73439 50597 -231836 228230
13150 281640 -171689 -3742 328768 -261030 61600 278677 222231 106513 96690 86077 -12953
13138 -254618 356154 141756 -96582 108724 -96002 399052 319287 2945 128368 -191316
13127 30793 133916 -40950 301592 -16670 124075 -2213 -7728 -77613 48760 68459 -104547
13115 -148263 225833 71364 44961 193313 -51835 267761 -63517 160304 230133 -74168 411534
$$ packed form
13197A21590A4005N3404g699m9593A56517j9777E6368J84602Q2560j39286G4558
13185A9799P4576L9239l5130g3136G7068l2359a21001C23650c2184C18942a11034
13173A79518J28946C8010K31564b68407A68633m7532j1168B3293K68351b8735
13162B79941j09152g9002I0502R6039J9895I4631N6787G3439k2842b31836B28230
13150B81640a71689c742C28768b61030F1600K17077n6446A06513r823j0613a2953
13138b54618C56154A41756i6582A08724i6002C99052p9765B945J25423a91316
13127C0793J03123d0950C01592a6670A24075b213n515o9885D8760J9699a04547
13115a48263B25833G1364k6403J48352e1835B67761f3517A60304O9829g4168D11534
$$ plain form
13103 -174634 182918 170819 117722 -13964 45324 108774 -8604 294786 -59172 136796 27575
13091 -75782 -91728 13309 -9798 -44206 4540 253753 62024 -71568 -26471 5068 -7788 -232948
13079 -232948 -55352 -95740 89711 152842 -56917 -40098 140981 186513 492285 -42741 362273
13067 -49102 1663 174828 214298 -58061 99244 37019 2963 -287863 161564 -74954 -161073
13056 -161073 377614 188278 250392 348609 288730 -34217 147043 63408 67005 -343806 -25235
13044 186348 417400 226498 -199126 -99319 128839 272437 4601 -187986 72070 -36594
13033 -60950 -97951 250677 -155295 147720 18099 -5845 -110227 201679 -106876 -51849 78137
13021 91880 20352 454078 -225136 22484 235135 210598 -58986 -69620 54415 78654 -121896
$$ packed form
13103a74634A82918j2099n3097a3964D5324O3450h604B94786e9172A36796B7575
13091g5782j5946A3309i798l4408D540K49213F2024g1568b6471E068g788k25160
13079b32948e5352m0388H9711O3131e6917J6819A40981M5532L05772d2741C62273
13067d9102A663J73165L9470e8061I9244C7019B963b87863A61564g4954q6119
13056a61073C77614A88278O2114R8217n9879c4217A47043F3408L597c43806b5235
13044A86348K31052j90902a99126i9319A28839J43598D601a87986G2070c6594
13033f0950l7001B50677a55295A47720A8099e845j04382B01679a06876e1849G8137
13021I1880B0352M33726b25136B2484K12651k4537e8986j0634E4415K4239a21896
$$ plain form
13009 196209 375182 291223 -81410 37646 82105 319614 116443 217170 129913 -63449 42314
12997 214876 16878 22072 238162 175069 -192618 227619 -212351 476237 53187 -31506 278386
12985 251879 -209384 213436 -88142 -89626 255638 79482 60230 180406 -77101 638 93237
12974 93237 136382 45717 -196185 -122159 85374 69981 218555 208597 -233147 -275888 66797
12962 21361 15761 243151 197001 49215 -75666 175578 17674 207924 -88444 -247213 -218584
12951 -218584 -103829 244228 254176 -113695 242040 195986 45944 295163 -84197 -381201
12941 -381201 94490 264993 -136428 170145 -2295 132380 57249 -230887 -65727 372213
12930 65995 195725 -247476 -35334 244517 40055 -29341 -64775 -75460 -458670 265933 -146923
$$ packed form
13009A96209J78973q3959h1410C7646M4459K37509A16443J00727q7257f3449D2314
12997B14876A6878N194K16090o3093a92618B27619b12351D76237E3187c1506B78386
12985B51879b09384B13436h8142j484B55638G9482j9252J20176g7101F38R2599
12974I3237M3145D5717a96185P4026H5374j5393J48574r958b33147m2741F6797
12962B1361n600K27390m6150D9215g5666A75578A7674J90250h8444j58769K8629
12951b18584a03829B44228R948a13695B42040m6054D5944K49219h4197k97004
12941c81201I4490J70503a36428A70145b295A32380E7249b30887f5727C72213
12930F5995J29730b47476c5334B44517D0055b9341l5434j0685l83210B65933a46923
$$ plain form
12918 -28978 59519 159151 -102711 -234888 291496 -159675 -230608 25971 133576 109617 57171
12907 57171 96773 33574 292986 103748 145275 -211593 351323 134155 82567 -21748 164267
12895 69887 127467 869 -249595 -183890 389967 -25155 5849 24834 357734 183841 344329
12884 344329 157843 -201978 85546 -62504 -267069 188305 33105 -177647 -185232 94254 148065
12873 148065 86325 190431 84142 78969 -26155 -167288 470799 -75930 180818 61352 187518
12862 187518 90395 -361582 191656 124450 -177935 19849 -111185 96813 20080 64441 -112885
12850 -188924 -145905 -33112 286202 -54783 132679 347148 407413 -115914 -219818 76511
12839 162149 -2998 -4451 -108829 -15582 -369141 99626 -90916 38233 212677 -71522 18549
$$ packed form
12918b8978E9519R9632a02711j32177B91496a59675p0933B5971J07605k3959n2446
12907E7171L9602C3574K59412A03748M1527b11593C51323A34155n1588b1748A64267
12895F9887N7580H69b49595O5705C89967b5155E849J8985L32900j73893J60488
12884C44329A57843b01978H5546f2504k04565A88305C3105a77647p585I4254N3811
12873A48065o1740J04106H4142n173b6155j41133D70799g5930A80818F1352J26166
12862A87518I0395c61582A91656o7206a77935A9849a11185I6813B0080M4361a12885
12850a88924M3019c3112B86202e4783A32679K14469O0265a15914j03904G6511
12839A62149b998j453j04378a5582l53559I9626i0916C8233J74444g1522A8549
$$ plain form
12827 -138902 64282 32192 70857 199527 250579 103434 268126 -74151 -34523 -221466 -135441
12816 -135441 11230 189220 -55536 -56456 120700 -20398 -163169 181546 187465 15867 274591
12805 274591 188154 176555 -113641 188776 -71240 85471 293980 -94702 -85543 79176 -121579
12793 17880 -197006 -31118 91657 42533 293157 136278 222554 -56181 -263368 -65272 -334328
12782 -334328 69688 131731 -145600 -64712 -82715 238225 289604 309595 -67660 -173313 -81863
12770 -67833 78181 -138800 -124623 108383 360428 -73918 104293 156374 295624 -97770 73155
12758 -144248 -50939 151013 -100454 263623 34754 -28929 -196633 100460 -221804 -218697
12748 -218697 -42502 27854 29170 147961 99124 -197490 -70690 -54244 154535 69828 -289154
$$ packed form
12827a38902F4282l2090L8665J28670N1052A03434J64692g4151c4523j86943Q6025
12816a35441A1230J77990e5536r20A20700b0398j42771A81546N919A5867K58724
12805B74591q6437j1599a13641A88776g1240H5471K08509i4702R159G9176a21579
12793A7880a97006c1118I1657D2533K50624A36278Q6276e6181k07187f5272k69056
12782c34328F9688O2043a45600f4712j8003B38225N1379J9991f7660j05653h1863
12770f7833G8181a38800J4177A08383K52045g3918A04293N2081J39250i7770G3155
12758a44248e0939A51013a00454B63623C4754b8929j67704A00460b21804L107
12748b18697d2502B7854J316J18791m8837a97490g0690J6446A54535F9828b89154
$$ plain form
12736 -89076 -182527 160029 -128519 109298 -294790 -112541 245202 -102713 -89725 -13797
12725 166832 -164232 25605 43199 308972 186508 -240001 75292 -63124 -96935 -344182
12715 -344182 86548 -134775 303727 -57559 157064 287775 -117095 -189290 -59138 210999
12704 295652 273884 111683 234362 82011 11197 115320 30781 121997 315760 105765
12693 112490 218643 400347 -64747 26552 -107308 148006 107335 -33562 137420 -106079
12682 343589 167722 -205147 31736 -35985 489424 303543 -27154 260956 240250 7717 -2112
12670 320307 -119872 -76979 166877 -234626 157001 -38075 281105 -299514 66963 156471
12660 156471 172163 235321 -112094 177832 -11983 412935 186167 130189 248406 141467
$$ packed form
12736h9076r3451A60029a28519A09298b94790a12541B45202a02713J2988a3797
12725A66832a64232B5605J7594K65773j22464b40001G5292f3124l3811k47247
12715c44182H6548a34775C03727e7559A57064J30711a17095p2195e9138B10999
12704B95652k1768A11683J22679H2011A1197J04123C0781R1216J93763A05765
12693A12490J06153J81704f4747B6552a07308A48006m0671c3562A37420a06079
12682C43589A67722b05147C1736c5985D89424j85881b7154B60956k0706G717b112
12670C20307a19872M2893A66877b34626A57001c8075B81105b99514F6963Q9508
12660A56471J5692O3158a12094A77832a1983D12935A86167n5978J18217j06939
$$ plain form
12650 141467 208594 429804 170411 128747 -149488 -28274 190650 -22451 -181508 -323623
12640 -323623 126079 218814 547917 176419 6432 126358 325489 255030 324743 411937 57994
12628 506281 -87772 -24251 410056 208147 307058 156665 342977 43884 119951 189356 356375
12617 356375 229665 246784 395052 83138 -13855 -123405 -200856 -150125 -81443 28211 15673
12606 15673 133441 107125 -158184 24661 103595 -104724 444396 137461 275365 118434
12595 -117523 313603 62072 -29324 82170 15482 -15397 218845 195667 263285 -221579 -14097
12583 -14505 -90002 32449 -131136 -121267 -20943 -99778 208213 -106201 -74592 167022 105478
12572 105478 -206932 76111 -168535 105251 -70284 -6681 46 40668 99698 -81753 212731
$$ packed form
12650A41467O7127K21210A70411m1664a49488b8274A90650b2451j59057j42115
12640c23623A26079R2735L29103A76419F432J19926J99131p0459O9713Q7194E7994
12628E06281h7772b4251D10056k01909R8911j50393J86312D3884P6067O9405J67019
12617C56375j26710J7119J48268H3138a3855j09550p7451N0731O8682B8211j2538
12606A5673J17768k6316a58184B4661P8934a04724D44396A37461J37904A18434
12595a17523C13603F2072b9324H2170A5482a5397B18845k3178O7618b21579a4097
12583a4505p5497C2449a31136R869b0943p8835B08213a06201L1609A67022o1544
12572A05478b06932G6111a68535A05251g0284f681D6M0622N9030h1753B12731
$$ plain form
12560 115012 65930 -401210 -153783 -191906 -124868 190171 -120720 110578 133898 80998
12550 80998 -20973 78235 -34096 134591 -130630 -253898 -92598 59707 -49397 186099 -301987
12538 -197668 -163724 44526 -65338 -29115 61017 -201899 45961 31717 -151935 187788 191566
12527 191566 28797 -236060 55692 144755 6736 -8808 -98880 -279103 -313940 -288101 -157120
12516 -157120 375840 271861 -202201 -55186 -167721 -57252 125942 92213 43669 -81300
12505 73212 -224506 -197625 43158 152798 -68092 171053 150192 314469 -54381 -12341 -187638
12494 -187638 3777 18528 21619 -100478 -73317 69289 81047 225245 -396813 -172655 -60407
12482 41315 -279600 170646 -62270 -133603 400052 196707 -99237 -116107 87910 -281115 75579
$$ packed form
12560A15012m9082d01210a53783l8123O7038A90171a20720A10578K3320n2900
12550H0998b0973G8235c4096A34591a30630j23268i2598E9707d9397A86099c01987
12538a97668L3944D4526f5338b9115F1017b01899D5961j4244a51935A87788L778
12527A91566B8797b36060E5692Q9063F736h808r0072j80223l4837K5839J30981
12516a57120C75840j03979b02201e5186j12535e7252A25942l3729D3669h1300
12505G3212b24506K6881D3158J09640f8092A71053k0861J64277e4381a2341j75297
12494a87638C777J4751L091a00478K7161F9289J1758J44198c96813a72655f0407
12482D1315b79600A70646f2270p1333D00052A96707i9237j6870H7910b81115G5579
$$ plain form
12470 407842 -220412 -78279 222426 159183 130920 -40958 57265 6335 -165731 -34997 -208050
12459 -208050 33861 -88025 136598 -73184 -137311 -165553 -440003 -95173 -92885 161791 79571
12447 44328 163276 542102 -268283 321065 -90443 267515 -226859 100192 -227691 149878
12436 30856 22913 218541 -5772 -112059 -30213 7085 -121799 15512 -448199 -90954 248830
12424 96040 150316 39743 -130877 145048 -216309 -123986 -99980 -3514 246343 -164560 -48840
12412 310035 49819 41169 66037 143977 89651 -92486 -7764 215107 -171332 -98089 79845
12400 155071 -27989 -344179 -314160 -311857 -11482 -201776 47949 155676 -105684 -146214 -46663
12388 80064 -98254 -158249 -217927 -167837 59454 -19773 138955 -59350 196847 -234272 -117030
$$ packed form
12470D07842b20412g8279B22426o3243k8263d0958E7265F335a65731c4997j73053
12459b08050C3861h8025A36598g3184o4127k8242k74450i5173K288A61791G9571
12447D4328J18948L78826b68283C21065i0443B67515b26859A00192b27691A49878
12436C0856p943J95628e772j06287c0213G085a21799A5512d48199i0954B48830
12424I6040N4276C9743a30877A45048b16309R2323K4006c514B46343a64560d8840
12412C10035D9819q650K4868P7940n4326i2486g764B15107a71332P3243G9845
12400A55071b7989l16190L0019K303a1482j90294D7949J07727a05684m0530d6663
12388H0064i8254n9995n9678N0090E9454a9773A38955e9350A96847b34272a17030
$$ plain form
12376 -207142 222679 43716 158087 -202312 234471 -61832 152336 -220663 -88375 65721
12365 -112990 49130 307016 -246307 263163 188391 -23225 51639 -66141 206550 151371 -184778
12353 236375 -158 217057 111867 -70430 171637 -169538 -105425 66857 -83178 331300 -165340
12341 217911 274406 -66237 -58336 -61652 -109760 -251326 142936 -228792 -349043 -90626 -12993
12329 -61617 126667 -266677 -76582 -201322 -29034 -61412 -81204 172088 65131 209403 213119
12318 213119 -49441 -335264 46890 -108097 140877 214334 -276489 353655 -216745 298818
12307 25384 18658 -173870 347148 -92231 -269698 215813 -227433 -163558 134412 -214435
12296 -123810 253355 -500104 168688 147009 65260 348933 176659 -294650 -188506 -17620
$$ packed form
12376b07142B22679D3716J14371b02312B34471f1832A52336b20663h8375F5721
12365a12990D9130K57886b46307B63163p4772b3225E1639f6141B06550n5179a84778
12353B36375a58B17057j05190g0430A71637a69538O4113F6857h3178C31300a65340
12341B17911N6495f6237P901l316m8108j41566A42936b28792j20251i0626a2993
12329f1617A26667b66677g6582j24740b9034l2378j9792A72088F5131J44272L716
12318B13119d9441k85823D6890a08097A40877P3457b76489C53655b16745B98818
12307B5384o726a73870C47148i2231j77467B15813b27433O3875A34412b14435
12296a23810B53355e00104A68688k1679F5260K83673j72274b94650J06144a7620
$$ plain form
12285 -185599 -168860 -123431 57193 43096 15561 59555 7993 21834 44220 289688 218025
12274 218025 86746 240833 -28188 -72940 255303 -66382 -17849 -287340 59863 52824 170048
12263 170048 142908 371376 255086 -97749 -170976 -233229 139312 242291 -316744 181587
12252 208952 273630 -167686 205351 156005 -182310 -39766 -115867 -15378 -64772 -9745 158674
12240 31400 -89464 414748 -199366 68752 311830 322326 -131006 -17968 182499 189257 92840
12228 -40986 114453 -383145 57522 164073 102303 87341 484513 52174 344669 176922
12218 176922 134257 311996 418525 360611 39556 -226730 -320892 245306 160138 2761 -31668
12206 70713 42452 388282 143202 91269 -23908 220547 -43439 335274 135698 225301 98552
$$ packed form
12285a85599J6739M5429E7193j4097A5561M3994G993J3841K2386K45468p1663
12274B18025H6746J54087b8188m4752B55303f6382a7849k69491E9863p039J17224
12263A70048k7140K28468j16290i7749p3227o2253A39312J02979c16744A81587
12252B08952O4678a67686B05351m9346a82310c9766p6101a5378m9394i745A58674
12240C1400h9464D14748a99366F8752K43078J0496a31006a7968A82499O758I2840
12228d0986A14453c83145E7522J06551o1770j4962L97172E2174K92495j67747
12218A76922m2665J77739J06529n7914C9556b26730r4162B45306q5168B761c1668
12206G0713k8261L45830A43202n1933b3908B20547d3439C35274A35698Q9603I8552
$$ plain form
12194 336956 401073 269315 336432 -60904 99741 72311 229101 -89348 -74068 -170206 197735
12182 56596 452123 148237 142696 353420 89130 476793 209722 131999 226473 172323 18036
12170 557318 32303 212749 258677 -123796 92108 180986 -73463 162846 131386 158645 75426
12158 -222032 127501 32495 178360 20725 367854 148603 -44928 -62757 192434 -389597
12147 14048 11350 141469 81862 -16654 -63110 -16210 -101968 85960 -275437 -198117 -601319
12136 -601319 166343 -58714 -371767 -329443 -179046 69114 -159542 4754 222571 69133 -199324
12124 88745 107027 -86735 -59606 199678 131006 -451487 -329952 -299950 100372 98549 -155138
12112 -101779 130321 25882 78838 28563 -49769 465418 120819 113009 -254412 260116 -117381
$$ packed form
12194C36956O4117j31758O7117f0904I9741k7430J56790h9348J5280r6138A97735
12182E6596L95527A48237n541K10724H9130L87663B09722p7723R4474n4150A8036
12170E57318C2303J80446M5928a23796I2108Q8878g3463A62846l1460K7259G5426
12158b22032A27501C2495J45865B0725L47129A48603d4928j7829A92434c89597
12147A4048k698J30119n9607a6654m6456a6210q5758H5960b75437P7320m03202
12136f01319A66343e8714l13053M2324J50397F9114a59542D754K17817F9133a99324
12124H8745J8282h6735K7129A99678o8672d51487J21535L0002A00372j823a55138
12112a01779A30321B5882N2956B8563d9769D65418A20819p810b54412B60116a17381
$$ plain form
12100 -260316 165802 206590 108182 1052 -2019 120654 30190 -137077 -69099 -24785 392340
12088 299629 307646 -57612 128063 -151096 256130 -317442 87889 -467913 -236747 -208447
12078 -208447 -181744 -137213 -209248 -230140 -294181 -7505 471213 289793 979135 2084145 812285
12066 72618 424767 34836 20358 209880 198517 225539 53693 -98227 45279 26282 -152119
12054 77115 -27076 -71332 -166951 57046 -33220 175264 60420 -419620 -68776 -71944 57148
12042 84457 138759 -198976 -30881 157122 114664 318272 -188700 261 231909 -160430 86282
12030 -90367 106543 -118233 -19120 -127360 -130090 -289811 19820 -40885 3606 -393201 -195955
12018 -287875 556937 -44749 -19329 -213272 -14305 42225 -155718 55214 -60657 -119305 148226
$$ packed form
12100b60316A65802M0788r8408A052b019A20654C0190a37077O7978b4785C92340
12088B99629Q017e7612A28063a51096B56130c17442H7889d67913K31166K8300
12078b08447K6703M4531p2035k0892o4041g505D71213j81420O89342J105010H12285
12066G2618L52149C4836j4478J89522j1363K7022E3693i8227D5279j8997a52119
12054G7115b7076m4256r5619E7046c3220A75264F0420d19620f8776l168E7148
12042H4457N4302a98976c0881A57122m2458K03608a88700B61K31648a60430H6282
12030i0367A06543a18233a9120j08240k730j59721A9820d0885C606c93201a95955
12018b87875E56937d4749a9329j93943a4305D2225a55718E5214f0657n8648A48226
$$ plain form
12006 217497 -329657 -187493 -236399 -235027 -17397 -11113 38486 177114 57580 14809 -68056
11994 -90707 -9987 -78874 -38789 242729 -207910 139700 -218438 -171290 -138141 24734 49580
11983 49580 113028 -50700 -236956 -66681 -229702 -197717 -75912 -45660 72824 21157 54849
11972 54849 86303 -29635 -76675 235729 -54122 -215512 -108791 -302155 176117 155896 -114969
11960 -61939 -301928 22524 -232520 -118928 -166202 -17769 1382 216501 -109391 172404 374124
11949 374124 -82783 -86158 356891 -51432 134686 -184482 -268669 187791 38313 237896 -88768
11937 2135 -58638 -2539 39391 -108191 80397 18909 199413 -184399 390199 60147 -192864
11925 74431 341429 -75858 301881 54565 -113942 -3653 66580 -286919 -129858 -85290 338157
$$ packed form
12006B17497c29657J42164m8906J372a7397O284C8486J38628E7580A4809f8056
11994i0707i987o8887c8789B42729b07910A39700b18438M7148L3149B4734K4846
11983D9580O3448e0700j86256f6681j63021L1985g5912L0252G2824B1157L3692
11972E4849L1454b9635m7040B35729e4122j61390J06721j93364A76117k0221a14969
11960f1939k39989B2524b32520J13592m7274a7769A382K15119a09391A72404K01720
11949C74124h2783l375C56891e1432A34686a84482q4187A87791C8313J99583h8768
11937B135e8638b539C9391a08191H0397A8909J80504a84399C90199F0147a92864
11925G4431K66998g5858C01881E4565a13942c653F6580b86919a29858M4568C38157
$$ plain form
11913 267601 -334005 -108620 -24166 43173 -24862 58942 -320917 43369 47910 -218783 316409
11901 339857 127275 -49561 -82578 -63860 647 -102204 -137914 240535 -346701 -189536 2646
11889 46458 -127415 -38893 85242 125925 -58266 166372 146910 -296161 22601 -289714 -11956
11877 -101561 -69583 134989 30906 -27459 -372569 -254778 -102892 -243480 -223124 -72577
11866 -205037 34265 -123505 108999 -505865 223726 -109018 37445 -143962 -245665 -310233
11856 -310233 -225798 8441 -85671 275033 171583 -330162 -295359 60555 135337 -215167 -295220
11845 -295220 211154 254540 -114506 -247021 -104495 116625 -103619 342855 -211306 -10535
11834 -189391 -70131 178311 -95507 534925 -66999 -260965 153296 132874 186582 -195755
$$ packed form
11913B67601c34005a08620b4166D3173b4862E8942c20917D3369M541b18783C16409
11901C39857A27275d9561l3017J8718F47a02204l5710B40535c46701J57165B646
11889D6458a27415c8893H5242M0683e8266A66372j9462b96161B2601b89714a1956
11877a01561L1978A34989C0906b7459l45110J17791a02892j40588K0356g2577
11866b05037C4265a23505A08999e05865B23726a09018C7445a43962j01703o4568
11856c10233Q4435H441h5671B75033j03450c30162L4803F0555P4782b15167q0053
11845b95220B11154M3386a14506j32515a04495A16625a03619C42855b11306a0535
11834a89391g0131A78311i5507E34925f6999j93966A53296k0422N3708a95755
$$ plain form
11823 114233 -19880 281083 -22675 200561 432625 -179654 -129755 -123186 27445 -167330 -60565
11811 -148605 141119 374516 -344276 59409 180625 -40109 -10071 -263832 37774 -44519
11800 -364491 52187 -15247 -5089 19483 129017 3057 -249447 175191 196930 -218915 -93146
11788 -114916 -22014 -25928 -140905 50549 422744 -175822 359951 293927 -254785 148676
11777 -412791 85765 122532 -84021 -16603 -22346 -274730 177684 -360502 32158 -102076 -381831
11766 -381831 134596 246585 81794 257520 -361292 23776 235238 10016 163447 87384
11756 87384 -6006 75064 227598 -61842 213173 -16790 95712 -125053 88792 -259977 117836
11744 241427 -193579 243361 -187792 -146328 -37496 312797 -98086 -459271 -90896 -232418
$$ packed form
11823A14233a9880B81083b2675B00561K32064a79654M9899O569B7445a67330f0565
11811a48605A41119K33397c44276E9409J21216d0109a0071k53761C7774d4519
11800c64491E2187a5247e089A9483J09534C057b49447A75191K1739b18915i3146
11788a14916b2014l914j14977E0549L72195a75822C59951o6024b54785A48676
11777d12791H5765L6767h4021a6603n743k52384A77684c60502C2158a02076k79755
11766c81831A34596J11989H1794J75726c61292B3776K11462A0016J53431p6063
11756H7384f006G5064J52534f1842B13173a6790I5712a25053H8792b59977A17836
11744B41427a93579B43361a87792M1464c7496C12797i8086l61185i0896j41522
$$ plain form
11734 -232418 78300 65679 83784 -121054 -228684 126164 79396 -76230 -76931 136732 -29837
11722 109759 -228156 -83168 -23159 -326739 -81147 182836 164390 35094 158218 -18678 -136436
11711 -136436 398921 -409943 -123114 -110812 92650 123071 39366 -88729 158811 -115723
11700 -241786 147127 199986 137069 -277046 -111394 -86584 152008 373429 5106 -55335 -150894
11689 -150894 -145098 66601 319715 141359 -81616 153789 -258410 -62711 -287972 51744 27533
11678 27533 -188348 71271 206909 34086 -153792 -84481 -44462 99820 279438 204380 264322
11667 264322 124409 -267510 -93397 120990 398413 10406 -80869 243187 284100 59418
11656 247950 -228721 93696 -328352 174003 -151750 -39935 231674 177513 -311397 -146182
$$ packed form
11734b32418G8300j2621J8105a21054j07630A26164m6768g6230p01A36732b9837
11722A09759b28156h3168b3159l03580h1147A82836j8446C5094J23124a8678j17758
11711a36436C98921d09943a23114J2302I2650L0421C9366h8729A58811a15723
11700b41786A47127N2859o2917b77046a11394K4810A52008K21421E106e5335r5559
11689a50894N796F6601K53114A41359h1616A53789b58410f2711k25261E1744k4211
11678B7533a88348G1271J35638C4086a53792O9311M0019I9820J79618p5058N9942
11667B64322A24409b67510i3397A20990K77423A0406h0869B43187M0913E9418
11656B47950b28721I3696c28352A74003a51750c9935B31674n4161c11397a46182
$$ plain form
11645 169700 55996 48819 -341310 -31360 -48219 -81148 -158933 -76265 73831 -141232 51260
11633 -22607 33958 201229 -109898 -83483 145618 121490 -353973 -161768 315263 -123003
11622 -121153 -137636 -31959 299336 -896 -36760 -176049 252688 122056 81985 101747 210084
11611 210084 27526 -65702 -20085 74448 -14688 49632 52176 92041 249402 14195 91799
11600 91799 -247323 250575 119706 105395 12252 32301 -265072 32719 -35854 84485 -243748
11588 151401 -255828 49147 -272601 317160 89138 85078 -39147 -225578 157034 -346193
11577 227378 48583 226246 117418 183833 250852 415945 -190446 -25567 188732 52462
11566 -197328 108219 156617 180129 158061 -71244 2461 -174761 282110 -117472 178386 328764
$$ packed form
11645A69700E5996p177c41310c1360j6859l2929p7785g6265G3831a41232E1260
11633b2607C3958J67271a09898K6415A45618k4128c53973a61768C15263a23003
11622a21153j6483c1959B99336h96l5864j39289B52688A22056m0071J9762J08337
11611B10084B7526f5702b0085G4448a4688D9632K544L9865J57361A4195P7604
11600I1799b47323B50575A19706j4311A2252K0049b65072C2719c5854H4485b43748
11588A51401b55828D9147b72601C17160H9138m060c9147j86431A57034c46193
11577B27378D8583J77663j08828O6415O7019J65093a90446b5567A88732E2462
11566a97328A08219M8398K3512k2068g1244B461a74761B82110a17472A78386J50378
$$ plain form
11555 328764 -88022 -38417 78059 221498 90885 280226 231376 -18709 -50110 135736 214315
11544 214315 26470 222500 -62747 -16021 95523 59746 -160624 -64808 -373208 20044 -69740
11532 190434 135565 -38975 269883 298246 -43360 136606 -150777 -61188 4372 -128451 -151082
11521 -151082 -410873 -213146 275387 27603 23858 48091 59289 88463 244874 226408 269085
11510 269085 69396 19776 -101498 11201 29898 180935 -5474 -20116 74531 29726 -33052
11498 113591 -140682 -50831 -90645 97608 93531 269203 -190145 -1031 -77507 -19455 152274
11486 -215270 13928 188580 107706 231395 13069 37860 22939 123893 68304 -132839 277714
11474 -106580 17016 376100 208623 24720 134932 -82141 294446 185673 304783 110024
$$ packed form
11555C28764h8022c8417G8059J43439I0885J89341m8850a8709l1401A35736P8579
11544B14315B6470J96030f2747a6021I5523l5777a60624f4808l08400B0044f9740
11532A90434n4869c8975B69883K8363d3360A36606a50777f1188D372a28451k2631
11521a51082k59791J97727B75387B7603l745K4233J1198K9174J56411j8466M2677
11510B69085F9396A9776a01498A1201J8697J51037e474j4642G4531B9726c3052
11498A13591a40682e0831l9814I7608m077J75672a90145a031p6476a9455A52274
11486b15270A3928J74652q0874J23689A3069K4791j4921J00954n5589a32839B77714
11474a06580A7016L59084j67477B4720J10212h2141B94446j08773J19110A10024
$$ plain form
11463 -80659 114216 -6918 35883 119236 468346 174215 297066 521902 376503 100559
11452 14050 457519 34265 297088 -78386 87659 -93452 -63641 275028 198471 95298 270207
11441 270207 -110405 -51368 164228 10605 145808 -34397 -20854 172294 -132839 78118
11430 59313 -39444 -88916 265007 158040 58924 -79177 6585 -420122 -72562 98892 309577
11419 309577 6255 -154987 99771 -130984 193336 -155177 78061 464003 173796 124290
11409 124290 -21409 66616 94302 406335 509801 -63943 -148081 113353 211920 27077 -7013
11397 82630 67010 157389 18783 -66294 42513 -41348 -5837 -92571 -102370 -110640 91726 -184806
11384 245548 40831 50638 8572 -421051 232615 -117503 -258016 209782 -3345 -428545 -75724
$$ packed form
11463h0659A14216f918C5883Q3353L49110A74215J22851K24836j45399A00559
11452A4050M43469C4265K62823g8386H7659i3452K9811B75028p6557I5298J74909
11441B70207a10405e1368A64228A0605J35203c4397J3543A72294a32839G8118
11430E9313c9444m9472B65007j06967E8924g9177F585d20122g2562I8892K10685
11419C09577F255a54987I9771a30984A93336a55177G8061L85942A73796m9506
11409A24290b1409F6616K7686L12033J03466f3943q4138A13353R8567B7077g013
11397H2630j5620R0379A8783f6294D2513d1348e837q6734r799q270I1726a84806
11384B45548D0831R807H572d21051B32615a17503j40513B09782c345m25200g5724
$$ plain form
11372 106945 198945 72214 205689 -80604 -120112 -311045 89530 102504 70556 32218 -88092
11360 -260925 -177678 -56050 54020 77296 25448 -56011 156920 -38457 43688 -95212 -105605
11349 -105605 10384 -216472 51003 43961 -30704 194223 433695 434 -191623 16751 81433
11338 81433 120086 211352 -254808 39408 -116414 56034 -339554 15866 224172 -54241 -87081
11327 -87081 362794 -86819 5338 -229533 73657 -238727 -82903 411677 129213 43514 270393
11316 270393 299788 40876 -76660 165965 -156681 275182 123064 -251482 -10264 256659
11305 -117105 -276368 -58305 -87393 -28055 -225914 -42355 164936 -99632 -265568 -34220 -360330
11294 -360330 -66870 -232089 -99659 -293947 96313 -1734 145926 103268 -293610 50220 3390
$$ packed form
11372A06945R2000G2214J33475h0604l9508j90933H9530J2974l1948C2218h8092
11360b60925Q3247e6050E4020K3276B5448e6011A56920c8457D3688i5212j0393
11349a05605A0384b16472E1003p042c0704A94223K39472D34a91623A6751O4682
11338H1433L8653R1266b54808C9408a16414E6034c39554A5866K08306e4241l2840
11327h7081C62794h6819E338b29533G3657b38727h2903D11677A29213D3514K26879
11316B70393K9395D0876g6660A65965a56681B75182A23064b51482a0264B56659
11305a17105j59263e8305k9088b8055j97859d2355A64936i9632j65936c4220l26110
11294c60330f6870j65219i9659j94288I6313a734A45926m2658b93610E0220C390
$$ plain form
11282 -156417 60041 134249 141465 -79553 -149065 -72902 -124961 68743 171428 -185369 -23965
11270 -275919 -285784 -149352 46630 192799 -94927 -58576 143472 -336663 -421983 45603 -78847
11258 -222717 -87339 187786 -21700 91475 89570 142500 78197 -270642 -185519 -21650 -232603
11247 -232603 -264334 196944 -16495 135801 -24426 -79224 215309 2100 -29713 -10629 76004
11235 -41363 -5620 -59746 226719 8710 174739 19997 151834 -274456 119803 -421904 -29237
11223 -174631 -164986 327094 -111822 -79993 -49708 310428 -110560 -76805 -39410 -110346 -165520
11212 -165520 -139786 -25799 -12050 -21132 208157 103188 41560 -119240 24606 -183184 -234879
11201 -234879 -63382 -290377 -276632 79422 -331714 -119910 -491075 -287892 67848 -87108
$$ packed form
11282a56417F0041P4208P216g9553o9512g2902n2059F8743J02685a85369b3965
11270b75919r865J36432D6630J46169i4927L6351A43472c36663q5320D5603g8847
11258b22717h7339A87786b1700I1475j905N2930o4303b70642Q5123b1650k10953
11247b32603l1731A96944a6495A35801b4426n4798B15309B100b9713a0629G6004
11235d1363e620n4126B26719H710J66029A9997J31837b74456A19803d21904b9237
11223a74631R645C27094a11822L1829L0285C10428a10560L3755L7395p0936n5174
11212a65520K5734b5799a2050r082B08157A03188D1560a19240B4606a83184n1695
11201b34879f3382k26995J3745G9422c31714a19910l71165K03183F7848h7108
$$ plain form
11190 -84347 352566 -95789 55034 119125 -181013 -28569 71796 81355 208818 185333 33637
11178 -132782 295370 -314655 -242086 -17843 -13807 -270972 193915 112538 -93611 -297423 193589
11166 189605 -177566 6889 -25212 -156629 -23914 268405 99916 42502 -410354 27621 71511
11155 71511 -70509 -71787 26444 257849 -133038 -284081 -270459 -13574 239688 -13041 197247
11143 -124696 -127125 -117526 -136647 252297 38678 275999 152093 -178974 85346 -171782 99568
11131 -58095 117535 -412554 233547 -4024 301621 25332 -118444 -299608 -96400 56706 258233
11120 258233 58698 -186850 -2958 -68111 -110244 261749 -21950 -55694 203179 -16837 40663
11108 130864 145557 47247 126695 -154474 16834 75860 -117590 107336 140193 294750 -91829
$$ packed form
11190h4347C52566i5789E5034O4091a81013b8569G1796R559J27463k3485C3637
11178a32782B95370c14655P2569a7843M036k57165A93915q1377i3611k03812A93589
11166A89605a77566F889b5212j31417b3914B68405I9916D2502d10354B7621M3890
11155G1511g0509j278B6444K31405a33038j51043J3622a3574B39688a3041A97247
11143a24696k429R599j9121B52297C8678K37321j23906a78974H5346a71782I9568
11131e8095A17535d12554B33547d024C01621B5332a18444j81164i6400E6706K01527
11120B58233E8698a86850b958o5153m2133B61749b1950l3744B03179a6837D0663
11108A30864J4693D7247P9448a54474A6834N9026a17590A07336L2857J54557i1829
$$ plain form
11096 255662 -10933 199646 617429 -49067 205910 317882 317297 81020 142259 115831 132990
11085 132990 154442 51956 47230 625580 249636 65586 128041 203753 232982 29770 -63578
11073 378858 61565 305442 51062 227459 479429 500637 376794 327457 193115 176888
11063 176888 527511 586600 441182 529002 325493 471643 256018 655423 643117 498917
11053 498917 598307 612704 606761 871408 627633 377911 473224 780858 381531 797914
11043 797914 661201 570323 520972 666135 648101 950832 565159 646204 405731 758940
11033 758940 687786 689285 520686 257745 800904 279387 554780 666967 501963 361255
11023 361255 591468 722843 689029 512302 363182 541734 392485 473013 567103 429815
$$ packed form
11096B55662a0933A99646M17783d9067B05910J11972n85H1020O1239k6428J7159
11085A32990K1452E1956m726N78350B49636F5586O2455P5712K9229B9770f3578
11073C78858F1565K43877E1062J76397K51970K1208j23843m9337j34342j6227
11063A76888L50623N9089j45418Q7820k03509J46150k15625L99405j2306j44200
11053D98917R9390J4397n943K64647k43775k49722R5313L07634C81531M16383
11043G97914j36713r0878m9351J45163j8034L02731l85673Q1045k40473L53209
11033G58940p1154J499j68599B57745N43159B79387K75393J12187j65004j40708
11023C61255K30213J31375l3814j76727j49120J78552j49249Q0528R4090j37288
$$ plain form
11013 429815 428838 568075 344954 728096 599251 452123 283245 638861 806697 475032
11003 475032 395073 718040 670356 847696 852983 502847 759139 427482 150875 407054
10993 407054 458171 304793 544233 950870 404062 983016 537111 750826 675863 601131
10983 601131 858270 1006635 727473 1055495 807273 1193833 1458592 1849889 1776623 1958802
10973 1958802 2106587 2604635 2280172 2478674 2387363 2098542 1700286 1627803 1541165 1198953
10963 1198953 1422639 1319038 1533708 1381544 1453469 1599661 1446405 1402351 1228230 1147511
10953 1147511 1140580 903679 677081 450118 352162 112467 396506 357630 550310 183551
10942 -35718 84483 529827 243553 372468 480608 91504 311780 -14230 205570 510892
$$ packed form
11013D29815r77J39237k23121L83142j28845j47128j68878L55616J67836l31665
11003D75032p9959L22967m7684J77340N287l50136K56292l31657A50875K56179
10993D07054N1117j53378K39440M06637D04062N78954m45905K13715p4963p4732
10983F01131K57139J48365k79162L28022k48222L86560K64759L91297p3266J82179
10973A958802J47785M98048l24463J98502r1311k88821l98256p2483q6638l42212
10963A198953K23686j03601K14670j52164P1925J46192j53256m4054j74121q0719
10953A147511o931k36901k26598k26963r7956A12467K84039l8876J92680A83551
10942c5718H4483M45344B43553J28915J08140I1504K20276a4230B05570L05322
$$ plain form
10932 510892 -197670 -183231 -209049 -430239 110519 251249 129898 460599 -174586 80303
10921 11938 -59870 205931 46155 9684 186810 252870 114999 -145289 -175364 33601 55938
10910 55938 266324 -31272 -68544 -219424 -104671 -132473 15289 -68004 -75745 181376 203053
10899 203053 169160 -9330 12124 308113 326741 -84464 -148500 12997 509688 80811 119543
10888 119543 80690 131594 -170293 -212097 260265 -61048 13298 237366 -290707 -224347 271058
10876 -212307 -188941 65002 55729 165603 -175109 -65574 38320 -134947 338505 -8530 -65080
10865 -65080 21842 -119592 -172198 -49153 -351918 -209413 -164099 66304 70200 486268 -52504
10853 336761 43180 150943 -19742 -347089 126903 10027 176854 -28048 97792 -182077
$$ packed form
10932E10892a97670J4439k5818k21190A10519J40730j21351L30701a74586H0303
10921A1938e9870B05931D6155I684J77126O6060A14999a45289l0075C3601K2337
10910E5938K10386c1272l7272j50880a04671k7802A5289f8004p741A81376K1677
10899B03053l3893i330A2124K95989J8628h4464o4036A2997M96691H0811L8732
10888A19543l8853N0904a70293m1804B60265f1048A3298K24068b90707O6360B71058
10876b12307K3366F5002r273J09874a75109f5574C8320a34947C38505h530n6550
10865f5080B1842a19592n2606d9153l02765J42505M5314F6304L896M16068e2504
10853C36761D3180J07763a9742l27347A26903A0027J66827b8048I7792a82077
$$ plain form
10842 -118078 -127511 24794 -74591 81608 140272 -30563 -199318 -192083 -10511 -158723 9919 123422
10830 123422 98310 -16680 102396 137106 221034 129201 -328953 -149042 -223638 117713 -68847
10818 -25237 46051 -47966 7311 -204743 -20806 94191 -3821 120267 -59106 284939 166110
10807 166110 -105061 -42180 243664 192567 148341 -152449 16416 -490184 69511 -92154 -96924
10796 -96924 124201 502125 163031 -51414 -81789 -328056 144712 165358 157586 75098 -220156
10784 -196418 35594 -128180 -271129 176159 -399737 -82265 92527 -76761 71331 -221358
10773 -112086 280420 152725 -222585 241871 62598 -55726 45129 -24782 -82457 127120
10762 -55353 -46789 29020 -156739 -243372 112298 284145 -324530 -304004 138 -233268 30278
$$ packed form
10842a18078r433B4794g4591H1608N8664c0563j68755P235a0511j48212I919J13503
10830A23422k5112a6680A02396L4710Q3928r1833c28953a49042p4596A17713f8847
10818b5237D6051d7966G311b04743b0806I4191c821A20267e9106B84939j18829
10807A66110a05061d2180B43664n1097m4226a52449A6416d90184F9511i2154m770
10796i6924A24201L77924A63031e1414l0375k46267A44712K0646p772G5098b20156
10784a96418C5594a28180j42949A76159c99737h2265I2527g6761G1331b21358
10773a12086B80420j27695b22585B41871F2598e5726D5129b4782n7675A27120
10762e5353Q564B9020a56739q6633A12298J71847c24530K0526A38b33268C0278
$$ plain form
10750 10281 -21404 171142 -335416 -46401 114280 44561 183912 -220094 -292449 417402
10739 -219778 -105748 -29103 -82461 47432 19485 131563 309414 -384485 31984 125935 -574409
10727 -122512 -136968 -84163 -60874 66310 95099 2688 -80046 33521 108698 -17649 40720 -49901
10714 -277165 -195283 -186815 157183 -208795 83721 39003 -40175 67532 130805 -98979 -32255
10702 149910 232711 -69002 85946 -91988 -377069 -335228 -3562 -44842 -190897 -79146 200352
10690 28776 72342 -268617 -245653 -355209 250753 -70636 149435 151709 -130372 -171212 76346
10678 373867 -120824 -126024 -188790 5306 100342 -57604 119974 -276819 -88078 47325 -50310
10666 237304 160145 -120021 156285 -318034 -216581 102669 -380838 -218271 -147138 -66808
$$ packed form
10750A0281b1404A71142c35416d6401A14280D4561J39351b20094p2355D17402
10739b19778a05748b9103n3358D7432A9485J12078J77851c84485C1984R3951e74409
10727a22512j4456N2805K3289F6310K8789B688h0046C3521P5177a7649D0720d9901
10714b77165Q1882Q468A57183b08795H3721C9003d0175F7532O3273i8979c2255
10702A49910Q2801f9002H5946i1988k85081M1841c562m1280j46055g9146B00352
10690B8776M3566b68617K2964j09556B50753g0636A49435K274a30372m0840G6346
10678C73867a20824n200o2766E306R5036e7604A19974b76819h8078D7325e0310
10666B37304p7159a20021A56285c18034J01453A02669c80838J62567P1133f6808
$$ plain form
10655 92022 -7136 -61559 -87015 72102 19428 -184224 49292 -111591 52999 -201328 -363489
10644 -363489 -289837 -65677 81528 -51789 -99151 -164022 -84785 161829 -138382 -317098 15704
10632 25547 -135047 229373 -29854 -235046 28996 -157313 -187424 -363510 142886 -4614 102369
10620 40887 -39772 310763 231619 -200650 24783 -188733 -17773 16871 -161552 217753 -280089
10608 89986 165651 -88645 -25253 121989 87894 -481551 -139215 -63250 9001 -182759 -34583
10596 103575 57524 112736 -21953 116325 72774 42535 -275078 43817 -80252 -274464 -101129
10584 -77953 -160363 18223 74743 -198575 -26764 -155832 -153714 41746 -398433 -235890 -16889
10572 -196154 -244396 97551 22711 385817 2978 8373 43874 216981 165279 161289 -26758 45648
$$ packed form
10655I2022g136n4423k5456G2102A9428a84224D9292a11591E2999b01328j62161
10644c63489P3652f5677H1528e1789m7362o4871P9237A61829a38382j78716A5704
10632B5547a35047B29373b9854k05192B8996a57313l0111j76086A42886d614A02369
10620D0887c9772C10763p9144b00650B4783a88733a7773A6871a61552B17753b80089
10608H9986P5665h8645b5253A21989l4095d81551a39215f3250I001a82759c4583
10596A03575m6051N5212b1953A16325m3551l0239b75078D3817h0252j94212a01129
10584g7953q2410A8223N6520a98575b6764j29068K118D1746c98433J62543a6889
10572a96154m8242I7551B2711L63106B978N395L5501J73107n1702l990b6758D5648
$$ plain form
10559 -185827 21952 145321 -47534 281639 -80795 100902 -323801 321529 209788 96575
10548 181553 -34887 -142423 -2302 60569 -22814 134192 196057 89120 -44259 24219 87740
10537 87740 55716 -212712 -135065 -306604 -354816 -199450 136928 49781 -147854 -393957
10527 -393957 16711 -237444 -103532 -64469 -94794 -25195 -321937 -128372 -58695 -134436 -309902
10516 -309902 -169478 226683 -232465 -403065 -144130 14939 23452 14460 -160475 50056 125717
10505 125717 109219 44282 -235810 121117 195258 32999 -98529 -243227 245197 -217567
10494 294324 -72281 14624 -110921 -121461 -389668 -220031 292633 -52933 21248 4141 191934
10483 191934 43500 279680 507391 19943 291557 206086 194712 50348 -108626 -246613
$$ packed form
10559a85827B1952J23369d7534B81639h0795A00902c23801C21529j11741I6575
10548A81553c4887j07536b302F0569b2814A34192O1865H9120d4259B4219O3521
10537H7740l2024b12712P7647j71539m8212J55366A36928D9781a47854k46103
10527c93957A6711b37444a03532L9063l0325b5195k96742a28372e8695p5741j75466
10516c09902J40424B26683b32465j70600a44130A4939Q513q992a60475E0056P5661
10505A25717j6498D4282b35810A21117P4141C2999i8529j44698B45197b17567
10494B94324g2281A4624a10921j0540k68207J69637B92633e2933B1248D141J87793
10483A91934D3500K36180K27711A9943K71614q5471j1374E0348a08626j37987
$$ plain form
10473 -246613 158434 -293589 30135 -27586 272108 83405 -184974 -216749 7090 219572 -262304
10461 34703 -8814 -198373 -76817 174767 -321391 -360215 259890 136195 -38271 58690 247589
10450 247589 74355 -124707 589 -44610 -128870 336099 -5704 -28424 24427 -343964 94766
10438 -282920 111998 112047 188388 -66720 146258 134815 -207521 22996 -240726 -119971 293036
10426 -42453 111113 314760 140544 587 -49050 41859 -133101 47125 -225388 -222438 82764
10414 -31398 -192970 -100835 150836 -187191 223802 -42697 -231224 180257 220321 142224
10404 142224 -329519 47420 220910 140859 218736 -9754 -96563 -31780 -309599 59068 -106520
10392 168052 283709 -140185 -218405 241498 256010 20115 47050 100763 -104516 60907 46192
$$ packed form
10473b46613A58434b93589C0135b7586B72108H3405a84974l1775G090K12482b62304
10461C4703h814j89559g6817A74767c21391l8824B59890j23695c8271E8690J88899
10450B47589G4355a24707E89d4610q4260C36099e704k2720B4427c43964I4766
10438b82920A11998M9P6341f6720A46258j1443b07521B2996b40726a19971B93036
10426d2453A11113K03647A40544E87d9050D1859a33101D7125b25388K950H2764
10414c1398j61572R2135A50836a87191B23802d2697j88527A80257M0064p8097
10404A42224c29519D7420J73490q0051P7877i754q6809c1780k77819E9068a06520
10392A68052J15657a40185p8220B41498J4512B0115K6935N3713a04516F0907j4715
$$ plain form
10381 46192 -40965 -4785 37183 38421 230842 172609 48023 260960 430172 51032 336591
10370 336591 59880 278102 48107 341688 574426 400857 313941 94138 211857 401833
10360 401833 119858 255578 163943 -50168 213081 -60766 315186 259276 375141 419045
10350 419045 613920 110696 161348 26898 390657 430582 420332 276034 216707 161451 33432
10338 113771 114692 93243 409843 115847 216782 87548 51435 -126761 113594 127907 249096
10327 249096 367077 227349 -44682 332218 -221059 -12 218819 197261 219411 144307 -535616
10315 34075 -88549 135752 -133801 10917 64937 -64101 -61533 147118 -44211 95765 -26371
10303 -182424 128837 77522 -18662 170690 121877 -308666 -61667 117781 3092 -278831 -22643
$$ packed form
10381D6192d0965d785C7183J238J92421n8233D8023K12937J69212E1032K85559
10370C36591E9880K18222D8107K93581K32738j73569q6916I4138J17719J89976
10360D01833A19858J35720r1635e0168B13081f0766C15186n5910J15865M3904
10350D19045J94875A10696N0652B6898L63759L9925j0250j44298n9327n5256C3432
10338A13771R21k1449L16600A15847J00935H7548l6113a26761A13594J4313J21189
10327B49096J17981j39728d4682C32218b21059a2B18819k1558K2150p5104e35616
10315C4075h8549A35752a33801A0917N4020f4101K568A47118d4211I5765b6371
10303a82424A28837n1315a8662A70690m8813c08666f1667A17781C092b78831b2643
$$ plain form
10291 80780 -19936 116836 -272499 -63134 -156592 54223 -109617 -367349 153693 -196058
10280 -83937 31966 -75678 13477 22849 -8652 -68819 -338205 -14800 -127702 133654 16846
10268 173329 317203 157164 43118 19657 -135786 70592 140708 226869 203546 326109 472240
10257 472240 196262 245590 42296 211835 123608 58528 -264962 -189701 -413336 -23098 289224
10245 -314294 -4007 -135668 -108193 -7570 -101597 196638 40762 -300393 -196061 -20728 93446
10233 16976 -41093 -111956 -328850 -120456 159145 -197526 -74707 -144337 115508 -7492 127486
10221 147842 163415 -173807 -200006 -240622 -244323 292876 -32102 -91081 -208160 -93648 34329
10209 -27721 6148 139233 81221 -42662 -228306 -112056 -379607 64849 -1042 301744 -255952
$$ packed form
10291H0780a9936A16836b72499f3134r3458E4223a09617k57732A53693a96058
10280h3937C1966g5678A3477R372h652o0167k69386a4800j12902A33654A6846
10268A73329J43874A57164D3118A9657a35786G0592P0116Q6161k3323J22563J46131
10257D72240A96262M9328D2296J69539q8227E8528b64962P5261k23635b3098B89224
10245c14294d007j31661K7475g570r4027A96638D0762c00393J04332b0728I3446
10233A6976d1093p0863k16894a20456A59145a97526g4707o9630A15508g492A27486
10221A47842J5573a73807k6199m0616l701B92876c2102n8979j17079i3648C4329
10209b7721F148J33085n8012d2662j85644a12056k67551F4849a042C01744b55952
$$ plain form
10197 -117760 -36523 4114 -299220 -105082 137433 208510 -178476 118225 142963 -48552 102605
10185 -37502 -239418 189405 -265151 -148429 -213681 103053 -180438 135691 177740 54429
10174 -5358 -292448 -47168 -38219 -207708 83658 -429619 6711 -174547 345983 -2641 257222
10162 75807 -39315 74951 -203991 -204169 29968 -192823 -203108 278305 -124166 -149236 154536
10150 -23402 -222828 -212705 -446920 -92 44100 201972 45754 -21045 -19947 -13414 -312410 -319128
10138 -319128 168004 -51197 -39684 206728 -172925 100183 -210280 -97711 9559 -471212
10127 109921 -22263 -250751 190464 -186734 178493 295524 -220274 127511 -133493 -91457
10117 -91457 -146650 39383 180239 241115 83017 78348 -10353 -262587 -119282 26354 51339
$$ packed form
10197a17760c6523D114b99220a05082A37433P1077a78476A18225K4738d8552A02605
10185c7502k01916A89405b65151J16722o5252A03053a80438A35691M2049E4429
10174e358k87090d7168Q949j69489H3658d29619F711a74547C45983b641B57222
10162G5807c9315G4951b03991j78B9968a92823j0285B78305a24166k5070A54536
10150b3402j99426J0123k34215i2D4100J57872D5754b1045J098O533k98996o718
10138c19128A68004e1197J1513B06728a72925A00183b10280i7711I559d71212
10127A09921b2263k28488A90464a86734A78493J17031b20274A27511a33493M2036
10117i1457n5193C9383J40856O0876H3017m669a0353k52234a19282B6354K4985
$$ plain form
10106 51339 111180 53597 89987 -165097 -236741 -144055 -162440 -69162 -278271 -25912 316159
10094 188705 -94679 -144238 43185 39010 -281794 144446 23470 -18508 -150844 -172109 -160587
10083 -160587 119599 11002 178340 175504 -121831 -293111 -129679 144886 -11275 66510
10072 262225 155666 -99920 -110218 -117288 106764 -11170 65815 221194 509322 -41182 -258462
10061 -258462 10922 -171097 -45667 -162214 -62149 -384571 -247987 204802 -269307 36739
10050 -197121 -310545 -68825 213009 51141 -243268 303118 -103212 -210126 -202857 -507021
10040 -507021 231184 -123398 -336250 -185681 -239862 -62421 -98528 220493 -56436 -19125
10029 -201927 476775 167286 82883 -155154 -250497 -195799 -45491 -66058 92769 -385314 -109857
$$ packed form
10106E1339N9841E3597L6390a65097p1644R2686j8385f9162k09109b5912C16159
10094A88705i4679m9559D3185m175b81794A44446B3470a8508j32336k1265J1522
10083a60587A19599A1002J67338k836a21831j71280a29679A44886a1275F6510
10072B62225j06559i9920j0298p070A06764a1170F5815J55379K88128d1182k17280
10061b58462A0922a71097d5667j16547f2149l22422J36584B04802b69307C6739
10050a97121j13424f8825B13009E1141b43268C03118a03212j06914P269l04164
10040e07021B31184a23398k12852J50569n4181f2421l6107B20493e6436a9125
10029b01927D76775A67286H2883a55154r5343N4698d5491k0567I2769c85314a09857
$$ plain form
10017 156432 -388521 -100265 338531 -157041 -441125 -110720 134200 22553 -172603 -41494
10006 -298486 218804 -163094 179487 37877 110782 -466787 161459 -2923 37280 -100170
9995 78197 -49358 -178900 -118949 -356506 57403 -45653 -228066 -42174 -191837 -25656 139723
9983 -336409 -62462 23843 294289 57039 -346895 42871 -179553 -111231 -140870 34975 -184926
9971 -178276 89496 104227 86758 19243 -28905 -133571 -90622 -175100 75587 -57307 -122337
9960 -122337 55766 45038 22290 -86918 75354 -109341 -219391 135832 186422 -213698 -388118
9949 -388118 -251433 -94815 -358735 -195183 -138306 -139622 -178853 101100 105294 -31691 -205083
9938 -205083 50439 369945 -95484 40350 118435 -10779 30599 71347 -6986 -81763 -78690 -95541
$$ packed form
10017A56432c88521a00265C38531a57041k84084a10720A34200B2553a72603d1494
10006b98486B18804a63094A79487C7877P2905d66787A61459b923C7280a00170
9995G8197d9358j29542N9951k37557E7403d5653j82413d2174j49663b5656A39723
9983c36409f2462B3843K70446E7039c46895D2871a79553O8322k9639C4975a84926
9971a78276H9496J4731j7469A9243b8905j04666M2949q4478G5587e7307o5030
9960a22337E5766j0728B2290h6918G5354a09341j10050A35832N0590b13698j74420
9949c88118J36685i4815k63920J63552N6877j316l9231A01100M194c1691j73392
9938b05083E0439L19506i5484D0350P8085a0779C0599M0748f986p4777L073j6851
$$ plain form
9926 -95541 -220990 -461322 -20454 -130525 -567549 -69414 -121732 -91152 -62263 43610 -51146
9914 -383311 24495 -263701 198547 -76889 -164692 -129278 237354 85670 199569 -335304 35772
9902 382776 -118246 -272622 234850 -320766 -233186 239250 -337894 -239153 140336 -275947
9891 -249103 -72647 47541 -178138 136241 -45007 362303 -149188 -86463 33891 -16689 -226297
9880 -226297 -16974 -42774 -253065 -136491 -313342 -153404 -122163 -312037 -198896 -174772
9870 -174772 21102 -65936 46543 19673 -176791 -114186 -53750 -238385 -264437 140295 -78300
9858 -160394 131104 -291405 -206404 -169574 465762 -121002 -170053 -301671 -174654 128082
9847 -99122 -23892 -241507 -233645 -126058 121301 -284480 -333592 202579 -306819 64265 -74963
$$ packed form
9926i5541j25449k40332b0454j10071m37024f9414n2318L0580K8889D3610e1146
9914c83311B4495b63701A98547g6889q7803L5414B37354H5670J13899c35304C5772
9902C82776a18246j54376B34850c20766Q7580B39250c37894R8741A40336b75947
9891b49103g2647D7541a78138A36241d5007C62303a49188O2725C3891a6689k09608
9880b26297a6974k5800k10291J16574j76851a53404L1241j89874J13141K4124
9870a74772B1102f5936D6543A9673a76791O2605e3750j84635k6052A40295g8300
9858a60394A31104b91405Q5001L6830D65762a21002m9051j31618J27017A28082
9847i9122b3892k17615P862J07587A21301b84480m9112B02579c06819F4265g4963
$$ plain form
9835 63502 -237773 -75587 69210 179133 252730 -40390 -164890 -192322 -153896 157993 91535
9824 91535 -272413 -210064 95126 83048 147864 -516325 145451 -83963 -227088 47771 -6322
9812 381822 -44243 2616 6731 -246189 -111969 -524940 74026 157623 -34527 178869 274539
9801 274539 -3412 -202926 219952 12983 116767 -50659 -8665 -146941 88555 -155156 -51385
9789 172426 15965 -193052 135025 112663 44141 227504 146129 -125396 9166 26844 -201354
9777 65556 17825 22542 -118603 89139 -73280 221849 -17135 -18022 -108932 93295 -85855 -73046
9765 -73046 12741 -173271 150520 -297595 -33368 -388287 -192993 192671 -81369 48686 247833
9754 247833 -364185 -134833 201852 218325 293650 48063 -189914 2573 -52557 -326924 67985
$$ packed form
9835F3502b37773g5587F9210J09923P3597d0390j24500k7432L8426A57993o6458
9824I1535b72413O2349I5126j2078O4816e16325A45451h3963j43125D7771f322
9812C81822d4243B616M115b46189a11969m12971G4026Q3597c4527A78869R5670
9801B74539c412j99514B19952A2983J03784e0659h665j38276H8555a55156e1385
9789A72426A5965a93052A35025k2362D4141J83363q1375a25396I166J7678b01354
9777F5556A7825M717a18603H9139g3280B21849a7135q87r0910I3295h5855J2809
9765g3046A2741a73271A50520b97595c3368l54919a92993A92671h1369D8686J99147
9754B47833c64185a34833B01852J6473P5325D8063a89914B573e2557k74367F7985
$$ plain form
9742 -141938 -23460 278350 -280258 -50418 -231864 -223342 -9986 -171307 -356545 -144433 2111
9730 -155443 13638 -24507 -112049 -64427 -350181 275311 -259866 428399 -170117 327717
9719 -37850 140604 -23589 91569 52999 -323112 136371 -37276 -354225 238209 227001 -68115
9707 -295184 -79336 -98829 -100524 70696 -31911 11216 58628 -256353 -346565 17589 49084 85790
9695 85790 291162 85122 -3957 105421 39309 -93506 -234803 -115191 -50589 -233824 -133330
9684 -133330 -161782 -77297 107466 -8897 -74434 -168501 -128629 -332699 268371 -190615 -281853
9673 -281853 -236866 74452 -95656 16199 322437 -138221 160844 -457097 -58648 -5598 18033
9661 30975 93550 -69016 -94137 -197414 160282 83957 140767 -66529 -163679 -561076 -79980
$$ packed form
9742a41938b3460B78350b80258e0418j81446Q522i986j61321j85238a44433B111
9730a55443A3638b4507q7542M7622k85754B75311b59866D28399a70117C27717
9719c7850A40604b3589I1569l8570c23112A36371c7276l16949B38209j1208f8115
9707b95184g9336j9493j695G0696c1911A1216M7412b56353r0212A7589L1495L6706
9695H5790K05372H5122c957A05421C9309i3506j41297a15191e0589j83235J00494
9684a33330k8452g7297A07466h897o5537r4067L9872k04070B68371a90615r1238
9673b81853M4987G4452i5656A6199L06238a38221A60844d57097e8648e598A8033
9661C0975O2575f9016k5121j03277A60282p6325N6810f6529r7150l97397g9980
$$ plain form
9649 -11841 -14850 -43860 -111581 -382138 13758 -115717 -417655 -362105 -220626 289126 32423
9637 -260579 111615 -68002 -43985 14815 53962 -125263 -407293 -158359 -198499 -194529 -13598
9625 -270569 -172853 -437561 113445 95230 -63194 -278459 232632 -3807 -235701 -131997 -197787
9614 -197787 254412 -94004 265518 -74000 -26005 -160152 267780 -475287 -3262 -31186 -118144
9603 -118144 -258532 36816 -176578 -149037 -314781 37608 -181 -97964 -274515 61356 76721
9592 76721 -290216 -139063 -49743 -31593 -232907 -252043 -89280 -247521 -29362 280485 -60606
9580 -69672 -70022 -364869 159920 -22702 -79382 78504 123941 -210664 -62490 107055 -29164
9568 89911 -69180 -378115 23182 -60717 -136575 126226 157349 -45325 -189816 23306 -331545
$$ packed form
9649a1841l009k9010o7721k70557A3758a15717l01938N5550J41479B89126C2423
9637b60579A11615f8002K4017A4815L9147a25263k82030a58359m0140L970a3598
9625b70569R7716k64708A13445j8215f3194k15265B32632c807k31894J03704o5790
9614a97787B54412i4004B65518g4000b6005j34147B67780d75287c262k7924q6958
9603a18144j40388C6816a76578K7541j65744C7608a81r7783j76551F1356J5365
9592G6721b90216a39063d9743J8150k01314j9136h9280j58241b9362B80485f0606
9580f9672l50k94847A59920b2702n6680G8504M5437b10664f2490A07055b9164
9568H9911f9180l08935B3182f0717p5858A26226L1123d5325j44491B3306c31545
$$ plain form
9556 -162140 -135889 -123126 -86961 -83605 228836 -308314 139154 123559 -197786 -277687 218780
9544 129142 146770 34570 91698 -312112 66410 -92779 -31223 -160802 -121771 -289479 152095
9532 15715 99515 67237 -74581 15918 94229 114339 49259 -53395 -65222 192966 230829 -204484
9519 -43103 114789 -211877 -252730 99695 103074 -143302 31843 -293399 71885 -332939 -251581
9508 -251581 -247675 -138850 -166488 -114387 -215119 -124112 10750 144402 -89097 -113102 -76124
9497 -76124 325842 55209 9612 279307 -197610 -41086 4285 45793 -180735 186950 61583
9485 -7617 69520 68845 -20117 -310254 31744 -50998 50090 -309538 -187977 -228035 -90180 -1341
9472 -27579 155337 -150722 -46700 -520101 -124488 -175338 96214 -296354 -385351 -178461 -54112
$$ packed form
9556a62140K6251J2763L6165L356B28836c08314A39154j5595a97786p9901B18780
9544A29142J7628C4570N7128c12112F6410i2779c1223j29579L9031j67708A52095
9532A5715Q3800l2278g4581A5918P8311K0110D9259e3395j1827A92966L7863b04484
9519d3103A14789b11877m0853I9695L379a43302C1843b93399G1885c32939Q1358
9508b51581L906J08825k7638N2101j00732R1007A0750J33652h9097k4005L6978
9497g6124C25842E5209I612K69695a97610d1086D285M1508a80735A86950F1583
9485g617F9520o75b0117k90137C1744e0998E0090c09538J21561m0058i0180a341
9472b7579A55337a50722d6700m73401a24488n0850I6214b96354q8997a78461e4112
$$ plain form
9460 -32234 -38152 279208 -223029 -258289 -243080 337022 -195861 -97949 -73793 -8278 51773
9448 -5552 -137267 -141401 -28843 -35280 -244447 -141678 -242081 286806 199044 -93517 -208240
9437 -208240 333073 -413427 158282 -59767 162828 -173686 -24331 -202254 137562 -46530
9426 66977 9111 -297612 -164760 -336525 -62609 -68232 -46973 -211824 -117420 5358 -84116 46866
9413 -107415 -76013 -222961 -197374 -155895 50770 145221 95022 39742 -15375 -323286 -119466
9401 20717 -378977 -118285 -260810 19026 20080 -230476 80971 -329108 -53777 -229937 190992
9389 18875 51725 -70416 -78475 57 -135921 -380917 230325 161033 -102464 -356722 158995
9377 175156 -427353 33162 73670 121045 -57826 113106 327412 222286 73753 -83530 221148
$$ packed form
9460c2234n918B79208b23029l5260J5209C37022a95861R7912K4156h278E1773
9448e552j31715m134b8843o437k09167J02769j00403B86806q7762i3517j14723
9437b08240C33073d13427A58282e9767A62828a73686b4331j77923A37562d6530
9426F6977I111b97612J32852j71765f2609n623K1259j64851R4404E358h4116D6866
9413a07415L1402j46948K5587M1479E0770R4451n0199C9742a5375l07911a19466
9401B0717c78977a18285j42525A9026J054b30476H0971c29108e3777j76160A90992
9389A8875L2850g0416q059E7a35921k44996B30325o9292a02464k54258A58995
9377A75156d27353C3162M0508M7375e7826A13106K14306j05126G3753h3530B21148
$$ plain form
9365 -335691 -14733 -264282 -103141 363239 -48407 -310635 -104392 -168458 122467 -454713
9354 -83783 -304772 44808 -153546 -323130 -50322 46329 -147169 -15340 115997 -256116 -117700
9342 -344772 8162 56764 -261621 -72487 -33883 14725 291981 -538852 172318 -36973 -142008
9331 -142008 -76142 -15400 -181725 112078 -314858 92013 -207347 -201614 -130947 45185 46374
9320 46374 -210586 87803 -229073 46146 -160220 -381994 -52026 -151097 192289 -8640 -193811
9309 -193811 320964 -211301 -1767 -247526 -48774 -76287 -225390 101216 169601 101266 -146355
9297 -68839 95977 -119127 -170109 40835 223580 172422 -224343 -103147 -203067 -2049 -99985
9286 -99985 33381 -58560 88008 -35159 -162853 -273991 -160967 -110590 -213680 -209230 -331702
$$ packed form
9365c35691a4733k49549a03141C63239d8407k62228a04392o4066A22467d54713
9354h3783k20989D4808a53546j69584e0322D6329a47169a5340A15997b56116a17700
9342c44772H162M8602b61621g2487c3883A4725K77256e38852A72318c6973j05035
9331a42008O5866a5400j66325A12078c14858I2013b07347N733P0667D5185J189
9320D6374b10586H7803b29073D6146a60220k21774e2026r9071A92289h640j85171
9309a93811C20964b11301a767k45759d8774k7513j49103A01216O8385o8335a46355
9297f8839I5977a19127n0982D0835J82745n1158b24343a03147r9920b049r7936
9286i9985C3381e8560H8008c5159j27694j11138J13024N0377j03090M450j22472
$$ plain form
9275 -331702 323189 -47950 89543 -92281 -161878 -96653 48694 -41635 -173603 213292 -100672
9263 -274731 21477 -390768 -77671 181923 41584 -96587 -92422 99465 -5887 -28240 -290429
9252 -290429 68880 -210847 60940 -380352 -283035 171389 -160410 41253 -27045 -207426 126002
9240 -249435 16257 -66452 -1803 31887 336992 353205 17407 112210 -39534 126458 -225142
9228 -153262 -32624 109449 31863 -142816 -230436 -236612 -68999 145044 -268994 -42901 -205222
9217 -205222 -150923 116688 -91503 -72371 89356 -140265 111540 -205798 -175489 29091 138480
9206 138480 389134 -400485 145056 9149 -99063 -8980 -156432 -152318 -204616 -347975 -16817
9194 300023 102420 -178883 -146590 74298 -66938 -13239 -264244 -117181 -61424 -137342 82795
$$ packed form
9275c31702C23189d7950H9543i2281o9597O5225D8694d1635j31968B13292a00672
9263b74731B1477c90768g7671A81923D1584i6587M165I9465e887k2353k62189
9252b90429F8880b10847F0940c80352R7317A71389a60410D1253b7045j80381A26002
9240b49435A6257f6452a803C1887L05105J6213A7407R4803c9534A26458b25142
9228a53262c2624A09449C1863a42816q7620o176f8999A45044b68994d2901j62321
9217b05222N4299A16688i1503J9132H9356a40265A11540b05798L0309B9091J09389
9206A38480K50654d00485A45056I149i9063h980j47452M114n2298j43359a6817
9194C00023A02420a78883L2293G4298f6938a3239k51005a17181N5757p5918H2795
$$ plain form
9182 38992 -41787 -191404 -162566 -96490 -156318 85054 -367044 -413726 15520 360303 -110772
9170 118696 40965 -108539 -103297 -17773 120632 397973 240535 -73792 -493341 -177798 68400
9158 -36387 417792 -124782 -71073 -15996 -68460 -29229 67330 -322820 162469 167074 178191
9147 178191 137414 -78667 -228120 83025 -482028 -224862 -51047 42685 -85296 -287632 73012
9135 -147016 17599 -73359 115226 145241 -36912 79015 -82917 33331 -57012 -184826 118090
9123 -253120 -515950 -90009 172642 -428442 -242650 -52992 318320 -214397 -268740 129133
9112 -248142 4053 -42076 -116458 13871 -115628 -151823 -36933 -42449 -387957 -61574 154605
9100 -267731 -232639 292252 -128456 -123723 83210 -487793 -511264 -222632 189316 -96722 -222495
$$ packed form
9182C8992d1787j49617K8838O6076n9828H5054c67044m6682A5520L44783a10772
9170A18696D0965a08539N242a7773A20632K77341j57438g3792m19549a77798F8400
9158c6387D17792a24782N3709a5996n2464b9229F7330c22820A62469M605J1117
9147A78191m0777g8667j49453H3025d82028b24862e1047D2685h5296k02336G3012
9135a47016A7599g3359A15226L0015c6912G9015h2917C3331e7012j27814A18090
9123b53120k62830i0009A72642d28442J85792e2992C18320b14397n4343A29133
9112b48142D053d2076p4382A3871a15628l6195c6933n516l45508f1574A54605
9100b67731L5092B92252a28456M733H3210d87793k3471b22632A89316i6722j25773
$$ plain form
9089 -222495 -125416 -255080 127724 -182080 46683 -33672 141099 19972 -184042 50558 -126537
9077 -228790 -402754 475654 94148 167143 -78877 5037 71485 241504 -254920 -137388 -54076
9065 116867 13109 156216 -163139 59629 -310820 44194 -4468 -255232 140505 -116298 -9321
9053 -97993 178471 203396 -299913 -298537 -128921 145192 -312881 -4468 -13740 81022 -353407
9041 -449941 -215629 160798 149598 19092 148403 -64988 340746 -192331 167724 -222159
9030 -215589 -165478 -183164 -130558 84940 -308777 -17708 -404328 -170850 -3951 -202672 88257
9018 118966 86727 109485 252964 -32681 -137795 32336 104240 196377 -36640 77159 -176926
9006 -258090 -71804 -250518 -464188 173157 -38750 -280844 70121 -90519 114409 -253452
$$ packed form
9089b22495R7079j29664A27724a82080D6683c3672A41099A9972a84042E0558a26537
9077b28790j73964D75654I4148P2995g8877E037O6448J70019b54920J17532e4076
9065A16867A3109J43107a63139E9629c10820D4194d468k50764A40505a16298i321
9053i7993A78471K4925b99913J376a28921A45192c12881d468r272H1022c53407
9041d49941b15629A60798j1200A9092J29311f4988C40746a92331A67724b22159
9030b15589N0111j7686N2606H4940c08777a7708l86620a70850c951j98721H8257
9018A18966l2239K2758J43479c2681j05114C2336P1904R2137c6640G7159a76926
9006b58090g1804j78714k13670A73157c8750k42094G0121i0519A14409b53452
$$ plain form
8995 -188853 116599 -100649 -385550 151149 -177622 78709 -180826 -77410 102929 -29848
8984 -150320 -56495 -136573 -261569 272191 143361 199489 -294182 -205484 45685 25047 106521
8973 106521 -40670 -75893 -148139 82143 -252913 105332 78417 -75059 -448740 -206296 -234092
8962 -234092 258315 -188279 203318 45390 -274411 -14175 206191 252450 47100 13652 -284467
8950 44987 116842 44105 -244785 -109367 -24993 -27416 -281969 155358 21641 197880 -28271
8938 -458194 247016 138486 63554 417037 -11233 -229266 -63818 -30503 -62541 250934 232116
8927 232116 30739 376660 886799 1730912 6741971 20221141 9376342 2133910 561293
8917 602174 399965 401523 65557 -92680 -105258 225663 150439 -265102 231403 71551 140409
$$ packed form
8995a88853A16599a00649k84901A51149a77622G8709a80826g7410A02929b9848
8984a50320e6495q0078j24996B72191j28830N6128b94182Q8698D5685k0638Q1474
8973A06521d0670l5223p2246H2143b52913A05332k6915g5059l73681b06296k7796
8962b34092B58315a88279B03318D5390b74411a4175B06191M6259D7100A3652b84467
8950D4987P1855D4105b44785a09367b4993k423k54553A55358B1641J76239b8271
8938d58194B47016j08530F3554L53483a1233k18033f3818c0503l2038B50934j8818
8927B32116C0739L45921N10139Q44113N011059J3479170I376342B133910E61293
8917F02174k02209J558F5557i2680j2578B25663p5224b65102B31403G1551O8858
$$ plain form
8906 140409 140046 -37775 -114342 103225 -160926 -336030 41882 12428 373548 -295889 -45878
8894 118091 170500 -163711 89915 212510 14304 200965 -24355 -269365 -306324 -103457 -230297
8883 -230297 -243957 -274556 -298470 -50423 -15326 -248673 14168 24330 52221 132774 134153 -62722
8870 -215608 301722 120771 -140738 116284 -2556 -1380 -117609 -206368 -166654 -163825 144654
8858 63411 242074 -210075 154188 -59367 -14543 63695 -76850 177547 207066 138901 59358
8846 -89936 -35653 -207504 -174188 28938 -126658 -51447 85671 -511 11752 -240503 -205240 302502
$$ packed form
8906A40409l63c7775p6567A03225a60926j75104D1882A2428L61120b95889d5878
8894A18091N2409a63711H9915J22595A4304J86661b4355k45010l6959a03457j26840
8883b30297j3660l0599k3914e0423a5326k33347A4168J0162K7891Q0553J379f2722
8870b15608C01722A20771a40738A16284b556J176j16229q8759L9714K829A44654
8858F3411J78663b10075A54188e9367a4543F3695g6850A77547K9519o8165E9358
8846h9936c5653j71851L3316B8938a26658e1447H5671e11A1752b40503L5263C02502
$$ [...]
##END NTUPLES=NMR SPECTRUM
##END=
