
##TITLE=UV1251_M10_1340-1211_20_7409529_2z6uBc3Oqe
##JCAMPDX= 6.0         $$ Bruker NMR JCAMP-DX V2.0
##DATA TYPE= NMR SPECTRUM
##DATA CLASS= NTUPLES
##ORIGIN= BRUKER
##OWNER= Administrator
$$ 1.72 TOPSPIN		Version 2.1
$$ 2013-01-31 10:23:01.888 -0500  Administrator@X
$$ Compression mode = diff/dup
##.OBSERVE FREQUENCY= 400.02188249412
##.OBSERVE NUCLEUS= ^1H
##.ACQUISITION MODE= SIMULTANEOUS (DQD)
##.ACQUISITION SCHEME= undefined
##.AVERAGES= 64
##.DIGITISER RES= 22
##SPECTROMETER/DATA SYSTEM= spect
##.PULSE SEQUENCE= noesygpps1d.comp
##.SOLVENT NAME= COFFEE_meoh
##.SHIFT REFERENCE= INTERNAL, COFFEE_meoh, 1, 14.96069
##AUDIT TRAIL= $$ (NUMBER, WHEN, WHO, WHERE, PROCESS, VERSION, WHAT)
$$ ##TITLE= Audit trail, TOPSPIN		Version 2.1
$$ ##JCAMPDX= 5.01
$$ ##ORIGIN= Bruker BioSpin GmbH
$$ ##OWNER= Administrator
$$ $$ E:\/data/COFFEE/nmr/UV1251_M10_1340-1211_20_7409529_2z6uBc3Oqe/12/pdata/1/auditp.txt
$$ ##AUDIT TRAIL=  $$ (NUMBER, WHEN, WHO, WHERE, PROCESS, VERSION, WHAT)
(   1,<2013-01-24 18:53:55.903 -0500>,<Administrator>,<X>,<go>,<TOPSPIN 2.1>,
      <created by zg
	started at 2013-01-24 18:42:25.667 -0500,
	POWCHK enabled, PULCHK disabled,
       configuration hash MD5:
       86 BA 57 50 F2 9D 5C 9B 26 00 A9 28 5F 66 2E 89
       data hash MD5: 64K
       BE EC 87 90 70 FB F8 D4 B9 68 E1 07 3D E7 FD AA>)
(   2,<2013-01-24 18:53:58.903 -0500>,<Administrator>,<X>,<proc1d>,<TOPSPIN 2.1>,
      <Start of raw data processing
       efp LB = 0.3 FT_mod = 6 PKNL = 1 PHC0 = 0 PHC1 = 0 SI = 128K 
       data hash MD5: 128K
       F0 7E C9 52 F5 6F 1C 24 2D 1F F5 47 44 E1 32 22>)
(   3,<2013-01-24 18:53:59.981 -0500>,<Administrator>,<X>,<proc1d>,<TOPSPIN 2.1>,
      <pk PHC0 = -78.77197 PHC1 = 0 
       data hash MD5: 128K
       C5 82 F3 84 21 43 DA BD 88 49 0C 83 95 FF C0 4F>)
(   4,<2013-01-24 18:54:00.637 -0500>,<Administrator>,<X>,<proc1d>,<TOPSPIN 2.1>,
      <abs ABSG = 1 
       data hash MD5: 128K
       3E DE EF 6B 3D 8D 7C B1 84 F6 F4 0F 6D EB 38 81>)
(   5,<2013-01-24 18:54:00.809 -0500>,<Administrator>,<X>,<proc1d>,<TOPSPIN 2.1>,
      <abs ABSG = 2 
       data hash MD5: 128K
       38 50 17 77 8F 02 C2 25 82 F6 85 39 63 FC ED 43>)
(   6,<2013-01-24 18:54:00.981 -0500>,<Administrator>,<X>,<proc1d>,<TOPSPIN 2.1>,
      <abs ABSG = 3 
       data hash MD5: 128K
       37 92 71 0C 0D 36 D1 70 32 11 F8 0D D6 E1 4B 09>)
(   7,<2013-01-24 18:54:01.153 -0500>,<Administrator>,<X>,<proc1d>,<TOPSPIN 2.1>,
      <abs ABSG = 4 
       data hash MD5: 128K
       B1 F1 4B 97 20 8C 6C 62 79 47 D6 91 80 68 C7 89>)
(   8,<2013-01-24 18:54:01.325 -0500>,<Administrator>,<X>,<proc1d>,<TOPSPIN 2.1>,
      <abs ABSG = 5 
       data hash MD5: 128K
       B1 A3 A7 C5 D0 B6 37 DD 74 22 8C 3A FE D8 33 83>)
(   9,<2013-01-24 18:54:07.465 -0500>,<Administrator>,<X>,<audit>,<TOPSPIN 2.1>,
      <user comment:
       ICON-NMR User ID: COFFEE
       data hash MD5: 128K
       B1 A3 A7 C5 D0 B6 37 DD 74 22 8C 3A FE D8 33 83>)
$$ ##END=
$$ 
$$ $$ hash MD5
$$ [...]
##$TP07= 0
##$TPNAME0= <>
##$TPNAME1= <>
##$TPNAME2= <>
##$TPNAME3= <>
##$TPNAME4= <>
##$TPNAME5= <>
##$TPNAME6= <>
##$TPNAME7= <>
##$TPOAL= (0..7)
0.5 0.5 0.5 0.5 0.5 0.5 0.5 0.5
##$TPOFFS= (0..7)
0 0 0 0 0 0 0 0
##$TUNHIN= 0
##$TUNHOUT= 0
##$TUNXOUT= 0
##$USERA1= <user>
##$USERA2= <user>
##$USERA3= <user>
##$USERA4= <user>
##$USERA5= <user>
##$V9= 5
##$VALIST= <valist>
##$VCLIST= <CCCCCCCCCCCCCCC>
##$VD= 0
##$VDLIST= <DDDDDDDDDDDDDDD>
##$VPLIST= <PPPPPPPPPPPPPPP>
##$VTLIST= <TTTTTTTTTTTTTTT>
##$WBST= 1024
##$WBSW= 4
##$XGAIN= (0..3)
0 0 0 0
##$XL= 0
##$YL= 0
##$YMAX_a= 6062858
##$YMIN_a= -11755447
##$ZGOPTNS= <>
##$ZL1= 120
##$ZL2= 120
##$ZL3= 120
##$ZL4= 120
##$ABSF1= 14.96069
##$ABSF2= -5.597492
##$ABSG= 5
##$ABSL= 3
##$ALPHA= 0
##$AQORDER= 0
##$ASSFAC= 0
##$ASSFACI= 0
##$ASSFACX= 0
##$ASSWID= 0
##$AUNMP= <proc_prof1d_extract.lims>
##$AXLEFT= 0
##$AXNAME= <>
##$AXNUC= <1H>
##$AXRIGHT= 0
##$AXTYPE= 0
##$AXUNIT= <>
##$AZFE= 0.1
##$AZFW= 0.1
##$BCFW= 0
##$BC_mod= 0
##$BYTORDP= 0
##$COROFFS= 0
##$CY= 15
##$DATMOD= 1
##$DC= 0
##$DFILT= <>
##$DTYPP= 0
##$F1P= 0
##$F2P= 0
##$FCOR= 0.5
##$FTSIZE= 131072
##$FT_mod= 6
##$GAMMA= 0
##$GB= 0
##$INTBC= 1
##$INTSCL= 1
##$ISEN= 128
##$LB= 0.3
##$LEV0= 0
##$LPBIN= 0
##$MAXI= 10000
##$MC2= 0
##$MEAN= 0
##$ME_mod= 0
##$MI= 0
##$NCOEF= 0
##$NC_proc= -2
##$NLEV= 6
##$NOISF1= 0
##$NOISF2= 0
##$NSP= 0
##$NTH_PI= 0
##$NZP= 0
##$OFFSET= 14.96069
##$PC= 1
##$PHC0= -78.77197
##$PHC1= 0
##$PH_mod= 1
##$PKNL= yes
##$PPARMOD= 0
##$PPDIAG= 0
##$PPIPTYP= 0
##$PPMPNUM= 2147483647
##$PPRESOL= 1
##$PSCAL= 4
##$PSIGN= 0
##$PYNMP= <proc.py>
##$REVERSE= no
##$SF= 400.020009761727
##$SI= 131072
##$SIGF1= 0
##$SIGF2= 0
##$SINO= 400
##$SIOLD= 131072
##$SPECTYP= <>
##$SREGLST= <1H.CDCl3>
##$SSB= 0
##$STSI= 131072
##$STSR= 0
##$SW_p= 8223.68421052631
##$SYMM= 0
##$S_DEV= 0
##$TDeff= 65536
##$TDoff= 0
##$TI= <>
##$TILT= no
##$TM1= 0
##$TM2= 0
##$TOPLEV= 0
##$USERP1= <user>
##$USERP2= <user>
##$USERP3= <user>
##$USERP4= <user>
##$USERP5= <user>
##$WDW= 1
##$XDIM= 131072
##$YMAX_p= 456864736
##$YMIN_p= -31469
##$CURPLOT= <Network HP LaserJet P1505>
##$CURPRIN= <$Network HP LaserJet P1505>
##$DFORMAT= <normdp>
##$LAYOUT= <+/1D_H.xwp>
##$LFORMAT= <normlp>
##$PFORMAT= <normpl>
##$SURQMSG= 1
$$ End of Bruker specific parameters
$$ ---------------------------------
##NTUPLES= NMR SPECTRUM
##VAR_NAME=  FREQUENCY,     SPECTRUM/REAL,   SPECTRUM/IMAG
##SYMBOL=    X,             R,               I
##VAR_TYPE=  INDEPENDENT,   DEPENDENT,       DEPENDENT
##VAR_FORM=  AFFN,          ASDF,            ASDF
##VAR_DIM=   131072,        131072,          131072
##UNITS=     HZ,            ARBITRARY UNITS, ARBITRARY UNITS
##FACTOR=    0.0627417313425164, 1,          1
##FIRST=     8223.62146879497, 2775,         -57547
##LAST=      0,             4150,            -57030
##MIN=       0,             -31469,          0
##MAX=       8223.62146879497, 456864736,    0
$$ Real data points
##PAGE= N=1
##DATA TABLE= (X++(R..R)), XYDATA
$$ [...]
67934 76520 76382 76625 77028 77402 77672 77813 77742 77371 76822 76522 76810 77527 78277 79087 80289 81642 82222 81628 80768
67915 80768 80868 82063 83558 84776 85539 85350 83548 80359 77001 74453 72730 71572 71100 71420 72196 73062
67899 73062 73979 74823 75141 74788 74335 74277 74247 73606 72559 72053 72604 73641 74056 73195 71459 70065 69928 70628
67881 70628 70878 70173 69462 69839 71148 72427 73176 73532 73663 73764 74326 75588 76872 77293 77003 76966 77527 78017
67863 78017 77861 77273 76713 76308 76038 75904 75721 75291 74879 74970 75444 75616 75163 74331 73116 71175 68890 67591
67845 67591 67999 69107 69371 68592 67827 67751 67959 67840 67364 66771 66038 65030 63991 63582 64317 66003 67855 69340
67827 69340 70825 73137 76486 80139 83166 85187 86308 86816 87245 88303 90324 92804 94690 95022 93437
67812 93437 90478 87572 86121 86255 86742 86339 84866 82758 80201 77244 74313 71910 70000 68257 66772
67797 66772 65912 65590 65268 64692 64064 63414 62337 60634 58805 57675 57655 58529 59739 60792 61525 62074 62564
67780 62564 62875 62837 62559 62407 62695 63509 64718 65985 66929 67447 67810 68278 68834 69478 70491 72045 73742 75000
67762 75000 75783 76532 77451 78291 78817 79056 79023 78653 78065 77514 76972 76189 75277 74732 74656 74414 73463 72199 71545
67743 71545 71843 72610 73308 73949 74820 75900 76724 76720 75590 73469 70871 68433 66545 65089 63612 61899 60408
67726 60408 59935 60715 62003 62736 62489 61597 60452 59112 57641 56441 55914 55923 55903 55517 55040 55027 55691 56702
67708 56702 57517 57839 57787 57722 57936 58410 58799 58744 58285 57819 57487 56820 55329 53397 52143 52293 53545 55147
67690 55147 56643 57839 58525 58699 58761 59011 59174 58865 58293 58027 58229 58661 59254 60001 60367 59604 57892 56514
67672 56514 56584 58058 60215 62527 64639 66041 66399 66005 65503 65298 65553 66482 68183 70297 72240 73679
67656 73679 74557 74874 74824 74950 75610 76321 76124 74694 72733 71150 70215 69610 68967 68127 67082 65905 64702
67639 64702 63594 62824 62793 63690 65037 65903 65709 64685 63464 62541 62181 62506 63382 64426 65447 66678 68252
67622 68252 69587 69787 68712 67252 66370 66171 66145 66089 66404 67494 69149 70671 71497 71627 71534 71771 72613 73944
67604 73944 75306 76122 76024 75130 74015 73317 73288 73666 73844 73180 71377 68827 66526 65354 65342 65757 65883 65538
67586 65538 64881 64090 63355 62812 62246 61171 59534 58074 57569 57873 58138 57849 57160 56323 55406 54701 54765 55690
67568 55690 56805 57477 57822 58246 58678 58851 59070 59977 61532 62827 63132 62641 61913 61006 59570 57635 55875
67551 55875 55035 55304 56247 57147 57350 56595 55272 54323 54570 55947 57522 58376 58321 57677 56670 55476 54694 55131
67533 55131 56839 58819 60004 60233 59976 59499 58815 58190 58063 58434 58812 58845 58567 57924 56609 54659 52886
67516 52886 52294 53158 54854 56455 57360 57497 57218 56947 56787 56457 55716 54763 54054 53759 53528 52922 52019 51499
67498 51499 51996 53387 54798 55369 54873 53565 51788 50000 48894 48887 49452 49470 48511 47377 47153 48053 49505
67481 49505 50998 52332 53236 53379 52932 52658 53151 54171 54922 54857 54053 52978 52097 51648 51597 51732 51864 51995
67463 51995 52276 52831 53642 54529 55206 55472 55455 55566 56045 56624 56846 56714 56755 57323 58107 58536 58416 57945 57310 56656
67443 56656 56370 56871 58034 59147 59589 59307 58573 57750 57401 58114 59743 61235 61709 61474 61424 61633 61224 59684
67425 59684 57640 56052 55152 54520 53859 53276 52973 52961 53055 52932 52326 51378 50636 50497 50692 50543 49673 48308 46971
67406 46971 46114 45995 46610 47600 48429 48826 49034 49513 50436 51538 52415 52816 52689 52109 51263 50458 49993 49985 50302
67387 50302 50649 50756 50632 50681 51331 52396 52992 52441 51152 50179 49952 49938 49682 49607 50345 51715 52895 53455 53716
67368 53716 54180 55030 56165 57302 58024 58099 57778 57508 57370 57142 56798 56524 56226 55500 54256 52941 51998 51454
67350 51454 51227 51405 51958 52532 52863 53176 53855 54857 55760 56247 56342 56227 56088 56068 56230 56554 57036 57715 58616
67331 58616 59754 61193 62900 64572 65902 67066 68581 70588 72556 73885 74473 74441 73696 72196 70454
67316 70454 69328 69206 69646 69839 69318 68241 67140 66398 65924 65385 64724 64276 64392 65199 66664 68542 70163
67299 70163 70793 70468 70071 70232 70532 70206 69318 68643 68591 68802 68802 68498 67947 67122 66118 65313 65161 65903 67382
67280 67382 68910 69492 68665 67117 66073 65976 66215 66181 66089 66483 67364 68258 68894 69427 70067 70828 71639 72424 73038
67261 73038 73320 73296 73217 73314 73544 73600 73182 72269 71145 70173 69593 69516 69949 70655 71129 70950 70232 69512 69161 69095 69110
67240 69110 69291 69854 70730 71484 71665 71159 70238 69387 69020 69216 69623 69653 68904 67486 65978 64996 64728 64937 65416
67221 65416 66199 67222 68009 68128 67905 68226 69500 71216 72768 74244 75891 77153 77008 75353 73397 72338
67205 72338 72163 72114 71870 71673 71561 71236 70741 70640 71307 72516 73922 75418 76670 76871 75586 73603 72346
67188 72346 72490 73562 74725 75415 75348 74625 74008 74459 76088 77969 79243 79952 80540 81029 81142 80840 80254 79336
67170 79336 78077 76923 76455 76739 77432 78421 79919 81904 83919 85491 86366 86329 85265 83577 82120 81352
67154 81352 80796 79629 77692 75691 74492 74499 75625 77549 79811 81819 83051 83418 83406 83725 84748 86232
67138 86232 87547 88139 87884 87174 86648 86665 87046 87464 88026 89091 90488 91372 91163 90268 89476 88964 88417 87926
67120 87926 88085 89130 90536 91702 92594 93475 94356 95077 95672 96299 96886 97164 97119 97146 97640 98537 99363 99744 99768
67101 99768 99757 99769 99562 99110 98907 99494 100852 102510 104110 105515 106483 106739 106484 106404 106914 107681 108183 108501 109225
67082 109225 110691 112622 114519 116181 117679 119001 119872 120035 119661 119352 119607 120389 121384 122519 123919 125366
67066 125366 126261 126372 126296 126838 128061 129269 129863 129933 130017 130589 131841 133747 136043 138259 139915 140814 141175
67049 141175 141506 142283 143615 145206 146716 148111 149593 151162 152523 153528 154539 156086 158215 160459 162479
67034 162479 164402 166376 168129 169343 170284 171551 173253 174910 176303 177893 180006 182047 183137 183434 184208
67019 184208 186411 189597 192559 194841 197226 200673 204958 208618 210336 210346 210292 211672 214603 218121 221376
67004 221376 224217 226860 229494 232311 235541 239192 242911 246290 249288 252217 255378 258786 262239 265571
66990 265571 268807 272055 275345 278642 281997 285496 289077 292587 296087 299858 303999 308314 312675 317197
66976 317197 321785 325972 329598 333357 338077 343650 349224 354350 359305 364323 369208 373947 379023 384782
66962 384782 390992 397363 404053 411279 418797 426246 433698 441390 449112 456350 462978 469443 476297 483858
66948 483858 492184 501034 509925 518564 527263 536637 546900 557726 568758 579902 591110 602198 613133
66935 613133 624282 636195 649228 663404 678491 694023 709375 724070 738194 752426 767500
66924 767500 783586 800258 817095 834140 851634 869540 887682 906240 925630 945769 965998
66913 965998 986042 1006667 1028912 1052868 1077695 1102706 1127879 1153301 1178724 1204070 1229993
66902 1229993 1257436 1286628 1316779 1346868 1376606 1406594 1437594 1469726 1502393 1534937 1567292
66891 1567292 1599964 1633512 1668069 1703202 1738107 1772036 1804826 1837029 1869411 1902258 1935250
66880 1935250 1967884 1999851 2030988 2061164 2090352 2118680 2146185 2172465 2196648 2217885 2236018
66869 2236018 2251854 2266619 2280977 2294537 2306397 2316024 2323461 2328761 2331590 2331473 2328266 2322320 2314326
66856 2314326 2304987 2294503 2282249 2267239 2249190 2228934 2207609 2185625 2162663 2138413 2112863
66845 2112863 2086025 2057920 2028884 1999387 1969391 1938330 1905951 1872757 1839323 1805664 1771688
66834 1771688 1737811 1704428 1671086 1636996 1602409 1568630 1536381 1504806 1472568 1439471 1406522
66823 1406522 1374748 1344453 1315418 1287234 1259483 1231970 1204841 1178252 1152037 1125971 1100191
66812 1100191 1075057 1050682 1026948 1003855 981458 959558 937926 916840 896887 878108 859751
66801 859751 841087 822178 803638 785913 769015 752752 736995 721783 707253 693410 680020
66790 680020 666909 654287 642417 630970 619151 606683 594265 582779 572312 562208 551881
66779 551881 541256 530606 520297 510589 501418 492429 483403 474565 466219 458253 450277 442210 434415
66766 434415 427260 420788 414867 409372 404118 398770 393017 386784 380233 373599 367031 360545 354085 347728
66752 347728 341829 336824 332812 329343 325704 321484 316870 312430 308607 305366 302243 298705 294467 289598
66738 289598 284415 279314 274639 270591 267178 264191 261335 258478 255768 253419 251398 249464 247481 245495
66724 245495 243490 241307 238904 236456 234057 231530 228695 225647 222595 219640 216892 214562 212692 210999
66710 210999 209200 207221 204894 201882 198291 194947 192530 190754 188989 187354 186382 185785 184500 182055 179116
66695 179116 176488 174351 172649 171406 170266 168480 165799 162816 160092 157661 155800 155357 156568 158220
66681 158220 158959 158908 159069 159496 159167 157621 155632 154024 152673 151040 149012 146808 144504 142127 139984 138551
66665 138551 138111 138611 139655 140576 140752 140066 138906 137606 136102 134250 132255 130564 129400 128586 127829 127013
66649 127013 126184 125341 124426 123475 122610 121788 120729 119340 118012 117207 116841 116448 115978 115950 116671 117730 118455 118526
66631 118526 117918 116641 114910 113275 112193 111553 110898 109928 108609 107075 105721 105140 105649 106954 108443 109589
66615 109589 109967 109292 107819 106323 105267 104271 102791 101052 99764 99168 98865 98484 97974 97257 96129 94619
66599 94619 93135 92118 91737 91901 92383 92953 93510 93968 93986 93192 91847 90875 90843 91226 91104 90232 88977 87498
66581 87498 85610 83417 81512 80526 80684 81691 82772 83085 82432 81323 80130 78671 76968 75832 75963 76946
66565 76946 77852 78431 78932 79154 78662 77749 77149 76866 76292 75430 75003 75209 75451 75531 76100 77474 78872 79330 78711
66546 78711 77429 75864 74462 73756 73799 74067 74279 74735 75527 76023 75641 74642 73738 73334 73501 74181 75019 75433
66528 75433 75243 74798 74277 73429 72361 71853 72323 73008 72845 71793 70675 70026 69672 69230 68468 67340 66122
66511 66122 65411 65624 66566 67683 68561 69002 68979 68701 68373 67704 66137 63885 62154 61935 62980 64334 65321
66494 65321 65614 64969 63657 62719 63009 64163 65094 65262 64862 64058 62773 61195 59881 59268 59448 60248 61197
66477 61197 61736 61908 62577 64378 66699 68323 68811 68591 67923 66653 64955 63461 62472 61660 60812 60236 60244 60686
66459 60686 61279 61954 62684 63318 63776 64062 63971 63143 61557 59733 58300 57635 57823 58574 59127 58740 57540 56479
66441 56479 56244 56499 56490 56083 55885 56415 57486 58451 58929 59156 59609 60392 61211 61983 63069 64619 65983 66264
66423 66264 65370 64145 63481 63648 64429 65410 66032 65770 64525 62714 60946 59738 59377 59686 59981 59695 59097
66406 59097 58984 59608 60380 60709 60668 60534 60158 59191 57682 56053 54632 53524 52834 52668 52931 53366 53852 54475
66388 54475 55315 56282 57177 57847 58263 58499 58654 58775 58858 58904 58975 59219 59892 61184 62869 64230 64650 64310 64044
66369 64044 64335 64730 64502 63691 63103 63248 63671 63562 62760 61779 61002 60350 59838 59923 60871 62090 62646 62336 61794
66350 61794 61557 61515 61370 61114 60855 60573 60304 60190 60171 60018 59877 60341 61651 63273 64662 65961 67397 68409
66332 68409 68127 66614 64923 63885 63375 62806 61843 60554 59315 58656 58812 59359 59703 59915 60620 61940 63126
66315 63126 63473 63121 62680 62460 62482 62883 63775 64800 65364 65389 65530 66417 67875 69054 69238 68377 66887 65251
66297 65251 63948 63460 63944 64923 65667 65962 66189 66565 66740 66390 65799 65456 65387 65347 65418 65866 66485 66633 66033 65105
66277 65105 64410 64122 64206 64732 65761 67098 68384 69350 69850 69750 68961 67598 66064 64849 64185 63953 63982 64342
66259 64342 65139 66169 67135 68092 69240 70252 70495 70047 69765 69974 69875 68845 67644 67411 67968 68176 67733 67514
66241 67514 68100 69040 69810 70560 71478 72187 72308 72097 72060 72301 72636 72969 73268 73418 73408 73352 73188 72652 71749 70852
66221 70852 70165 69465 68638 68028 67908 67946 67603 66820 65974 65327 64853 64488 64292 64418 65152 66812 69363 72081
66203 72081 73835 73852 72335 70335 68908 68298 68046 67897 68215 69266 70535 71270 71461 71687 72140 72451 72412 72201
66185 72201 71878 71377 71081 71595 72748 73595 73745 73888 74564 75190 75035 74540 74798 76008 77231 77584 77045 76175
66167 76175 75610 75796 76696 77694 78183 78251 78445 78867 78977 78378 77463 77055 77595 78815 80037 80686 80602 80071 79696
66148 79696 80153 81761 84015 85658 85588 83833 81514 79813 79142 79186 79361 79169 78483 77680 77323 77629 78387 79351
66130 79351 80387 81236 81582 81488 81409 81603 81852 81915 81934 82229 82926 83887 84770 85122 84746 83994 83383 82968 82509 82162
66110 82162 82363 83025 83565 83893 84614 85966 87280 87933 88139 88354 88521 88510 88692 89410 90282 90722 90790 90835 90642
66091 90642 89710 88309 87562 88342 90480 92975 94734 95265 94991 94822 95239 96034 96949 98007 98905 98792 97254
66074 97254 95043 93228 92040 91166 90658 90769 91269 91770 92493 93783 95088 95330 94355 93171 92612 92537 92509 92543
66056 92543 92896 93599 94526 95535 96359 96656 96252 95181 93606 92024 91286 91887 93375 94908 96204 97388
66040 97388 98177 97969 96759 95229 93899 92820 92142 92252 93177 94440 95715 97153 98908 100817 102571 103818
66024 103818 104205 103891 103849 104904 106569 107690 108225 109271 111159 112738 113071 112749 112803 113253 113657 114313 115776
66007 115776 117619 118821 119261 119924 121611 124168 127015 129732 132092 134132 136353 139350 143083 146929 150561
65992 150561 154330 158582 163032 167041 170275 172847 175009 176888 178370 179035 178338 176117 172946 169803 167234
65977 167234 164944 162242 158766 154665 150237 145778 141791 138869 137078 135737 134156 132351 130705 129246
65963 129246 127822 126812 126844 127711 128246 127570 125975 124307 122998 122070 121636 121860 122675 123939 125717 128048
65947 128048 130670 133308 136039 139003 141996 144749 147451 150495 153715 156425 158298 159779 161362 162837
65933 162837 163633 163768 164001 164919 166175 166917 166910 166911 167830 169778 172139 174393 176557 178881 181489 184358 187446
65916 187446 190723 194190 197864 201585 204963 207811 210593 214115 218650 223566 227858 230807 232244 232517
65902 232517 232257 231868 231202 230081 228988 228685 229056 228968 227540 225030 222153 219109 215735 212149 208585 204840
65886 204840 200455 195362 189908 184381 178904 173720 169087 164885 160694 156281 151779 147502 143840 141174
65872 141174 139526 138425 137446 136771 136727 136965 136699 135811 135107 135218 135798 136123 136067 136027 136194 136348 136281 136034 135698
65853 135698 135333 135067 135045 135302 135962 137460 140111 143319 145712 146464 146211 146218 146822 147285 147137 146969 147553 148713
65835 148713 149595 149751 149400 148802 147997 147236 147130 148159 150346 153543 157710 162697 168089 173529 179016 184674
65819 184674 190368 195731 200450 204372 207504 210050 212319 214408 215974 216458 215499 213145 209758 205732 201249
65804 201249 196332 191234 186639 183174 180764 178710 176458 174047 171784 169788 167939 166076 164205 162728
65790 162728 162358 163424 165259 166718 167443 168169 169700 172126 175279 179316 184357 189979 195687 201716 208843
65775 208843 217453 227168 237282 247146 256096 263322 267960 269373 267519 263135 257274 250483 242651 233777
65761 233777 224463 215363 206626 198389 191437 186706 184244 183279 183301 184559 187442 191948 197985 205773 215623
65746 215623 227432 240633 254648 269395 285238 302271 319596 335637 349283 360372 368840 373978
65734 373978 375130 372751 368007 361390 352363 340444 326059 310247 293973 277826 261948 246167
65722 246167 230593 216033 203327 192314 182125 172565 164485 158488 154021 150117 146452 143125 139972
65709 139972 136796 133943 131931 130630 129431 128253 127801 128640 130372 131909 132430 132040 131562 131627 131909 131508
65693 131508 130195 128908 128685 129448 130328 130880 131367 131943 132387 132784 133782 135777 138325 140813 143288 146188
65677 146188 149577 153305 157729 163629 171261 180016 189288 199330 210986 224796 240620 257959 276313
65664 276313 295276 314577 334055 353401 371832 388263 401925 412708 420805 426216 428864 429177
65652 429177 428251 427237 426616 426147 425425 424430 423669 423952 425856 429113 432484 434528 434605 432943 429614 423814
65636 423814 414422 401083 384453 365605 345579 325328 305519 286206 267119 248455 231068 215728
65624 215728 202525 191120 181215 172533 164781 157983 152564 148684 145719 142804 139688 136695 134034 131587
65610 131587 129260 127115 125200 123581 122446 121806 121270 120537 119971 120164 121036 121917 122460 122834 123055 122869 122514
65593 122514 122836 124239 126034 127247 127667 127735 127824 128115 128872 130374 132660 135620 139173 143233 147747 152965
65577 152965 159346 166993 175545 184929 195876 209262 225118 242554 260444 277942 294680 310776
65565 310776 326422 341140 353709 363142 369447 373096 374077 371871 366098 356752 344034 328490 311204
65552 311204 293409 275888 258933 242680 227154 212272 198197 185514 174760 166028 159299 154676
65540 154676 151782 149400 146427 143033 140183 138283 136993 136211 136282 137174 138290 139340 140661 142349 143724
65525 143724 144053 143355 142110 140573 138737 136627 134257 131529 128439 125215 122087 119126 116471 114457 113309
65510 113309 112928 113133 113887 115080 116316 117197 117720 118217 118915 119700 120294 120636 121010 121704 122541 122947 122577 121717
65492 121717 120996 120915 121771 123593 125958 128267 130576 133704 138048 142763 146718 149883 153006 156237 158922
65477 158922 160595 161247 160788 159269 157618 156961 156942 155814 152652 148473 144648 141259 137796 134512 132014
65462 132014 130060 127851 125267 122911 121028 119218 117264 115612 114898 115356 116666 118087 118828 118690 118321
65447 118321 118604 119853 121699 123481 124612 124965 125153 126033 127734 129640 131504 133830 136708 139177 140560
65432 140560 141705 143791 146395 147975 148066 147726 147710 147492 146422 144754 142914 140629 137530 134076 131245 129615
65416 129615 129181 129710 130812 131973 132924 133776 134556 134941 134767 134433 134392 134537 134500 134354 134604 135579 137122 138777
65398 138777 140108 141032 142055 143936 146843 150112 153084 155826 158667 161359 163267 164154 164236 163649 162462
65383 162462 161196 160572 160609 160496 159596 158116 156601 155270 154126 153279 152778 152416 152075 152013 152498 153366 154281 155175
65365 155175 156176 157357 158931 161371 164877 168915 172799 176632 181172 186825 193306 200292 207832 215982
65351 215982 224536 233250 241897 249917 256482 261134 263986 265101 264177 261110 256451 250970 245137 239325
65337 239325 234065 229630 225616 221333 216363 210470 203432 195522 187892 181849 177758 175000 172794 170699
65323 170699 168567 166544 164984 163912 162782 161209 159625 158600 157802 156419 154480 152842 151801 150587
65309 150587 148498 145781 143023 140363 137810 135829 135027 135451 136501 137425 137758 137591 137572 138441 140452 143418
65293 143418 147113 151195 154903 157514 159188 160703 162241 163087 162684 161239 159097 156384 153674 152145 152284
65278 152284 153045 153015 152022 150944 150353 150050 149655 148945 147811 146471 145619 145816 146823 147905 148645 149036 149068 148688
65260 148688 147968 146949 145591 144296 144039 145367 147598 149663 151397 153294 155258 156495 156596 155921 154836
65245 154836 153282 151274 149157 147186 145362 143826 142839 142237 141413 140064 138561 137503 137320 138258 140168
65230 140168 142157 143084 142634 141533 140555 139854 139380 139252 139340 139027 137921 136405 135012 133607 131706 129443
65214 129443 127671 127082 127545 128341 128804 128704 128260 127870 127832 128268 129188 130469 131796 132822 133395 133454 132891 131877
65196 131877 131235 131906 133793 135593 136135 135582 134969 134882 135107 135399 136004 137192 138730 140128 141267 142433 143746
65179 143746 144834 145251 145093 144987 145465 146488 147596 148312 148378 147833 146998 146197 145388 144255 142825 141665 141256
65162 141256 141450 141847 142435 143462 144937 146768 149179 152341 155624 157972 159245 160623 163250 166961 170779
65147 170779 174423 178814 185050 193270 202703 212728 223621 236082 250036 264227 277190 288438
65135 288438 298473 307965 317347 326961 336918 346685 355307 362227 367501 371154 372785 372123 369587 366024
65121 366024 362124 358258 354569 350881 346668 341344 334532 326092 316159 305275 294224 283555 273400
65108 273400 263673 254118 244195 233483 222407 212111 203314 195648 188409 181588 175794 171419 168266
65095 168266 165771 163259 160237 156805 153663 151404 149964 148996 148515 148794 149814 151209 152648 153916 154732
65080 154732 154906 154643 154340 154105 153724 153115 152496 152185 152425 153327 154645 155722 156008 155665 155280 155025 154468 153301
65062 153301 151854 150740 150285 150495 151312 152686 154496 156534 158458 159714 159807 158826 157506 156530 155916 155293
65046 155293 154650 154467 155075 156060 156489 155699 153897 152003 150825 150278 149463 147604 144854 142134 140279 139475
65030 139475 139372 139391 138872 137297 134683 131629 128815 126527 124811 123866 123927 124852 126175 127603 129179 130911
65014 130911 132515 133662 134246 134371 134333 134696 136047 138494 141655 145222 149121 153008 156113 158051 159367
64999 159367 160803 162359 163625 164769 166388 168443 170072 170598 170157 169152 167714 166113 165195 165848 168143
64984 168143 171297 174459 177357 180243 183361 186486 189060 190800 192005 193015 193585 193120 191355 188403 184345
64969 184345 179425 174571 170948 168716 166882 164627 162196 160102 158139 155772 153066 150572 148576 147058
64955 147058 146191 146242 146980 147737 148123 148257 148276 148026 147383 146557 145866 145358 144782 143911 142836 141938 141473 141207 140667
64936 140667 139831 139300 139571 140412 141217 141805 142505 143573 144849 146011 146814 147063 146640 145725 144812 144294 144066 143656
64918 143656 142813 141867 141403 141553 141798 141589 140957 140332 139946 139786 139960 140670 141784 142912 143980 145354 147342
64901 147342 150023 153593 158294 163830 169502 175235 181834 189741 198080 205531 211756 217400 223059 228903
64887 228903 235036 241505 248004 254150 259950 265444 269999 272581 272795 271223 268687 265648 262228 258308
64873 258308 253527 247693 241298 235267 230149 225931 222546 220004 217971 215857 213626 212067 211874 212712 213405
64858 213405 212860 210665 207098 202767 198116 193209 188076 183161 179034 175612 172155 168223 164262 160931
64844 160931 158205 155557 152855 150648 149543 149605 150458 151723 153160 154431 155064 154847 154181 153718 153609 153429
64828 153429 152997 152867 153640 155061 156296 156958 157343 157801 158444 159585 161781 165153 169054 172777 176231 179676
64812 179676 183143 186598 190387 195011 200447 206161 211907 218054 224859 231723 237608 242139 245776 248731
64798 248731 250145 248887 245019 239931 234945 230281 225520 220485 215309 210097 205097 200891 197905 195914
64784 195914 194494 193706 193756 194187 194200 193826 194039 195448 197491 199190 200241 200958 201599 202307 203537 205970 209797
64767 209797 214340 218624 222400 226448 231699 238148 244917 251348 257512 263459 268723 273112 277447 282719
64753 282719 288810 294878 300666 306462 311901 316074 319033 321990 325466 328239 328773 326878 323222 318017
64739 318017 311142 303050 294470 285450 275619 265380 256060 248732 243444 239625 236756 234599 233231 232945
64725 232945 233730 234881 235469 235186 234425 233614 232877 232291 232057 232348 233353 235456 239059 244160 250342 257090
64709 257090 263837 269788 274149 276613 277362 276615 274481 271168 266911 261639 255124 247564 239695 232202 225299
64694 225299 218918 212984 207380 201994 196961 192620 189129 186429 184667 184178 184778 185491 185462 184959 185025 186282
64678 186282 188488 191252 194594 198615 202989 207241 211378 215877 221101 227035 233661 241190 249541 257790
64664 257790 264518 268752 270372 269635 266706 261810 255544 248816 242531 237416 233817 231408 229313 226883
64650 226883 224312 222245 220909 219971 219176 218789 219330 221172 224423 228891 234024 239207 244329 249861 256209
64635 256209 263242 270721 278973 288651 299758 311249 321808 330823 338400 344639 349210 351635 351631 349038
64621 349038 343694 335617 325280 313523 301212 289074 277687 267415 258406 250850 245097 241147 238090
64608 238090 234498 229635 224070 218968 215036 212288 210404 208935 207369 205419 203316 201626 200778 200926 202141
64593 202141 204475 207829 211944 216501 221151 225566 229699 233921 238701 244149 250058 256313 263051 270428
64579 270428 278386 286663 294898 302835 310545 318323 326120 333225 338814 342717 345278 346485 345717 342479
64565 342479 336996 329828 321194 311008 299446 287186 275099 263850 253735 244728 236687 229648 223855
64552 223855 219368 215685 211944 207657 203206 199573 197543 197116 197626 198402 199341 200952 203868 208206 213205
64537 213205 217507 220040 220824 220848 221021 221281 220787 218843 215505 211479 207664 204708 202660 200998 199227 197516
64521 197516 196565 196811 197943 199206 200016 200272 200368 200922 202160 203418 203600 202403 200832 200181 200726 201798 202935
64504 202935 204406 206581 209395 212754 217044 222770 229835 237589 245554 253711 262010 269938 276750 281943
64490 281943 285323 286807 286465 284719 282285 279820 277654 275856 274457 273604 273520 274277 275499 276370 276134 274611
64474 274611 272151 269116 265592 261619 257502 253774 250887 248914 247459 245940 244265 243225 243899 246542
64460 246542 250299 254153 257795 261252 264025 265188 264351 262118 259492 257160 255444 254487 254140 253900 253348
64445 253348 252677 252646 253975 256873 260993 265680 270300 274602 278887 283742 289517 296146 303510 311887 321968
64430 321968 334458 349793 368134 389450 413583 440425 470195 503591 541707 586031 638520
64419 638520 701293 775717 861655 957641 1061521 1170512 1280801 1387954 1488431 1580686
64409 1580686 1664560 1739665 1804462 1856548 1893361 1912763 1913668 1896679 1864139 1819267 1764751 1701572
64397 1701572 1628791 1544706 1448928 1343834 1234120 1124864 1019814 921056 829754 746987
64387 746987 674016 611825 560299 517895 482369 451993 426037 404244 386206 371337 359068
64376 359068 348777 339732 331415 323851 317412 312288 308222 304591 300571 295404 288868 281530 274257 267386
64362 267386 260593 253590 246668 240382 234962 230281 226243 222872 220125 217965 216627 216493 217588 219495
64348 219495 221926 225067 229121 233731 238166 241914 244820 246797 247773 247846 247089 245231 241987 237734 233393
64333 233393 229529 226058 223028 221074 220652 221244 221923 222442 223206 224370 225595 226670 227675 228473 228692 228478
64317 228478 228699 230015 232126 234314 236364 238504 240748 242784 244365 245309 245168 243393 239986 235646 231133
64302 231133 226738 222373 217874 213076 207943 202775 198099 194192 190987 188534 187169 186887 186890 186305 185231
64287 185231 184641 185241 186874 189040 191429 193789 195825 197687 200145 203793 208289 212847 217322 222340 228384
64272 228384 235236 242288 248964 254786 259483 263184 266107 267970 268186 266828 264924 263410 262253 261072
64258 261072 260235 260649 262454 264540 265543 264941 263016 260136 256418 251892 246618 240654 234134 227450 221181
64243 221181 215692 210868 206419 202454 199566 198213 198178 198785 199542 200336 201106 201706 202163 202762 203672 204673 205381
64226 205381 205596 205377 204995 204926 205603 206941 208288 209078 209396 209700 210124 210297 209784 208495 206707 204827 203084
64209 203084 201413 199728 198316 197676 197861 198278 198379 198289 198463 198934 199271 199168 198742 198281 197976 197898 198113 198880
64191 198880 200823 204673 210575 217791 225399 233228 241886 252015 263702 276409 289051 300217 308641
64178 308641 313601 314878 312556 307052 299052 289153 277824 265979 255152 246529 239933 234204 228432
64165 228432 222438 216334 210374 205177 201387 198889 196838 194601 192324 190550 189689 189861 190776 191748 192276
64150 192276 192635 193418 194627 195848 197321 199948 204052 208827 213373 217571 221520 224799 226923 228056 228669
64135 228669 228797 228166 226746 224726 222135 218942 215373 211767 208372 205563 203930 203700 204355 205229 206276
64120 206276 207898 210309 213548 217788 223088 229022 235137 241647 249113 257523 266228 274740 283032 291055
64106 291055 298502 305093 310597 314517 316380 316557 316334 316919 318792 322156 327366 334448 342553 350488 357664
64091 357664 364025 369172 372154 372359 370250 366861 362718 357559 351061 343483 335451 327423 319618 312223
64077 312223 305246 298238 290714 283002 276210 271032 266992 263231 259587 256395 253640 251102 249227 248851
64063 248851 249868 250974 251219 251146 251801 253125 254171 254635 255269 256689 258586 260469 262542 265310 268744 272439
64047 272439 276401 281033 286386 292037 297917 304750 313280 323353 334092 344783 355173 364993 373613
64034 373613 380359 384970 387612 388503 387586 384579 379374 372431 364690 357038 350015 344038 339655 337256 336689
64019 336689 337366 338631 339844 340355 339820 338437 336518 333866 329976 324831 319102 313531 308456 303929 299856
64004 299856 295947 292011 288398 285741 284089 282757 281207 279678 278721 278526 278979 279976 281346 282805 284315
63989 284315 286230 288897 292368 296645 301715 307051 311680 315256 318678 323121 328808 335271 342403 350473
63975 350473 359268 367990 376084 383580 390651 397455 404496 412497 421685 431728 442546 454668 468463
63962 468463 483507 499118 515316 532835 552329 573939 597640 623785 653191 686837 725575
63951 725575 770183 821604 881090 950092 1030151 1122863 1229736 1351889 1489896 1643804 1813002
63940 1813002 1996046 2191022 2396282 2610416 2831184 3054808 3276691 3492361 3697133
63931 3697133 3885294 4050754 4188916 4297498 4375440 4421574 4434605 4413817 4359304 4271790
63921 4271790 4152748 4004857 3832264 3640405 3435380 3222998 3007951 2793712 2583127
63912 2583127 2378999 2184121 2000978 1831414 1676412 1536109 1410140 1298024 1199276 1113321
63902 1113321 1039398 976419 922817 876847 837318 803826 775957 752470 731735 712870 696004
63891 696004 681430 668952 658059 648322 639506 631577 624608 618359 611959 604420 595578 586299 577837
63878 577837 571261 567264 565934 566722 569226 574059 582381 594462 609320 625980 644427 665012 687553
63865 687553 711540 736764 763210 790606 818511 846598 874480 901454 926837 950367 971973
63854 971973 991297 1007686 1020491 1029237 1033777 1034497 1031972 1026140 1016185 1001597 982912 961000 936104
63841 936104 908164 877716 845697 812547 778316 743600 709544 676747 644883 613708 583760
63830 583760 555613 529006 503363 478931 456730 437305 420001 403656 387759 372730 359182
63819 359182 347185 336297 326159 316800 308385 300886 294209 288479 283865 280050 276164 271544 266602
63806 266602 262694 260881 260739 260521 258664 255153 251302 248309 246243 244408 242287 239824 237100 234195 231397
63791 231397 229165 227652 226425 224828 222596 220006 217460 215092 212825 210773 209341 208821 208954 209036 208450
63776 208450 207068 205271 203762 203213 203737 204645 205005 204565 203896 203610 203805 204348 205285 206586 207795 208340 208054
63759 208054 207129 205777 204308 203290 203083 203261 202978 201986 200823 199963 199345 198934 199130 200178 201616 202917
63743 202917 204389 206762 209927 212838 214801 216279 218039 220123 222215 224546 227612 231071 233807 235343
63729 235343 236471 238080 239988 241579 243124 245616 249411 253883 258524 263573 269183 274643 279071 282514
63715 282514 285704 288822 291105 291740 290703 288516 285526 281759 277326 272671 268320 264563 261507 259310
63701 259310 258135 257816 257810 257651 257399 257497 258311 259955 262382 265349 268390 271191 273973 277136 280550 283644
63685 283644 286264 288972 292200 295496 297890 298767 298194 296778 295501 295278 296096 296809 296288 294761 293592 293807
63669 293807 295250 297172 299112 301029 302905 304468 305206 304690 303098 301359 300368 299924 298772 295891 291503
63654 291503 286628 281984 277649 273585 269987 266980 264335 261714 259141 257046 255887 255780 256439 257326 257926
63639 257926 258098 258290 259310 261706 265354 269655 274026 278170 282107 286155 290801 296283 302285 308309 314352
63624 314352 320928 328372 336401 344511 352629 361244 371067 382635 396050 410986 427149 444788 464548
63611 464548 486734 510982 536819 564293 593820 625565 659082 693303 726584 756969 782702
63600 782702 802581 815881 822358 822607 818181 811031 802800 794612 787057 780002 772625 764032 753720 741266
63586 741266 725921 706985 684481 659113 631768 603495 575731 549938 526896 506731 489523
63575 489523 475398 464010 454545 446479 439996 435511 433124 432680 433998 436821 440747 445423 450699 456591
63561 456591 463298 471160 480248 489961 499475 508694 518431 529547 542371 557123 574424 595002 619269
63548 619269 647581 680624 718970 762272 809043 856862 902301 940920 968372 982336 983545 974977
63536 974977 960178 942254 923773 906837 892852 882283 874708 869075 863859 857237 847461 833317
63524 833317 814217 789955 760682 727321 691752 656105 621748 589081 558261 529738 503942
63513 503942 480751 459625 440137 422224 405982 391490 378811 367955 358752 350911 344268 338822
63501 338822 334401 330459 326469 322494 319094 316519 314329 312113 310301 309688 310114 310252 309055 306983 305391
63486 305391 305017 305574 306615 308096 310059 312297 314604 316984 319484 322122 325187 329205 334255 339495 343704
63471 343704 346217 347196 347061 345940 343722 340468 336654 332933 329602 326363 322697 318474 314096 310113 306885
63456 306885 304544 303047 302174 301734 301899 303157 305787 309489 313644 317909 322476 327831 334341 341999 350590
63441 350590 360088 370839 383296 397737 414487 434246 457890 485902 518183 554115 592128 629054
63429 629054 660604 683322 696301 701125 700507 697192 693683 692207 694564 701984 715095 733936 758214
63416 758214 787715 822261 861001 901890 942190 979392 1011395 1036085 1051600 1057517 1055436 1047992
63404 1047992 1037388 1025115 1012653 1001577 992514 984338 974820 962016 944871 922867 895793 864090
63392 864090 829026 792182 754853 718002 682447 648825 617559 589091 563863 541785 522053
63381 522053 503982 487883 474614 464405 456693 451078 447780 446923 448029 450584 454668 460594 468228
63368 468228 477102 487010 498113 510659 524967 541550 560846 582893 607515 634682 664352 696074
63356 696074 729249 763888 800668 839930 880645 920382 956196 985622 1007153 1020236 1025116 1022863
63344 1022863 1015430 1005220 994165 983133 972242 961487 950709 939055 925003 907223 885384
63333 885384 859996 831693 800901 768109 734213 700395 667741 637113 609394 585624 566613
63322 566613 552480 542884 537785 537488 541427 546905 549532 545380 533010 513755 490455 466019 442653
63309 442653 421645 403355 387449 373448 361231 351005 342783 336087 330314 325262 321102 317897 315370
63296 315370 313156 311046 308922 306661 304172 301487 298762 296284 294329 292763 290848 287886 284237 281292
63282 281292 280106 280280 280463 279793 278516 277398 276924 277057 277435 277646 277514 277173 276881 276810 277108 277951 279272 280617
63264 280617 281577 282304 283305 284812 286737 289173 292376 296100 299459 301868 303801 306163 309120 312054 314605
63249 314605 317249 320630 324753 329138 333563 338304 343715 349960 357247 366040 376712 389057 402402
63236 402402 416333 431138 447369 465035 483460 502042 520897 540563 561097 581728 601450
63225 601450 619791 636942 653392 669596 685840 702163 718478 734946 752106 770341 789292
63214 789292 808130 826292 843463 858715 870235 876358 876623 871578 861833 847753 829817 808770
63202 808770 785433 760712 735713 711448 688397 666664 646537 628586 613251 600702 591117 584688
63190 584688 581303 580598 582413 586892 594051 603543 614929 627851 641853 656453 671545 687419 704132
63177 704132 721166 737899 754234 770622 787584 805202 822803 839177 853431 865652 876314
63166 876314 885129 891034 893425 892638 888887 881436 869347 852567 831767 807531 780377 751220 721124
63153 721124 690780 660779 632162 605981 582338 560546 540309 522209 506871 494174 483444
63142 483444 473952 465023 456110 447208 439033 432501 427957 424928 422581 420438 418686 417734 417446 417102 416323
63127 416323 415735 416337 418353 421094 423929 426956 430728 435678 441850 448832 455776 461769 466344 469574 471741
63112 471741 473182 474392 475896 477839 479896 481688 483207 484777 486726 489097 491593 493856 495863 497844
63098 497844 499725 500944 501109 500610 500209 500195 500361 500623 501121 501768 502188 502210 502006 501680 501112 500289 499418 498659 498127
63079 498127 498204 499391 501696 504564 507535 510636 514034 517739 521858 526777 532858 540214 548897 558908
63065 558908 569899 581283 592953 605514 619549 635014 651666 669756 689925 712662 738229
63054 738229 766858 798655 833434 870987 911393 954747 1000628 1048087 1096052 1143603 1190102
63043 1190102 1235484 1280341 1325395 1370824 1416233 1461110 1505072 1547861 1589505 1630483 1671362
63032 1671362 1712080 1751769 1789213 1823096 1851614 1872233 1882460 1881131 1868790 1846599 1815012
63021 1815012 1773838 1723645 1666651 1605934 1543977 1482279 1421998 1364307 1310180 1260473 1216374
63010 1216374 1179171 1149332 1126357 1109739 1099534 1095648 1097281 1103638 1114651 1130327 1149852 1172196
62998 1172196 1197260 1225424 1256034 1287365 1318280 1349029 1380077 1411017 1441215 1470815 1500288
62987 1500288 1529271 1556557 1581064 1602298 1619890 1633156 1641046 1642154 1634998 1618835 1594241 1562368
62975 1562368 1523662 1477930 1425879 1369887 1312748 1255999 1200014 1145367 1093272 1044639 999464
62964 999464 957557 919327 885300 855193 828088 803510 781654 762359 744445 726557 708396
62953 708396 690644 673831 657836 642519 628196 615070 602591 589904 576794 563743 551113
62942 551113 538852 527037 516150 506419 497307 488168 479181 471168 464584 459129 454273 449666 445050
62929 445050 440404 436291 433484 431912 430554 428774 427223 426836 427323 427431 426565 425363 424606 424235 423717 422854
62913 422854 421865 421003 420391 420053 419890 419771 419694 419586 418890 416845 413428 409692 406816 405020 403743 402608 401813
62896 401813 401716 402453 403985 406094 408255 409831 410593 410874 411081 411148 410624 409192 407018 404705 402995 402403 402915
62879 402915 403965 404886 405457 405976 406691 407349 407434 406742 405390 403368 400606 397657 395774 395773 396956 397692 397046
62862 397046 395453 393843 392630 391711 390955 390283 389512 388489 387368 386552 386296 386477 386745 386942 387374 388545 390476
62845 390476 392450 393680 394140 394396 394703 394703 394102 393146 392192 391111 389469 387167 384680 382732 381796 381760 382020
62828 382020 382062 381956 382052 382270 382157 381770 381964 383470 386050 388926 391726 394575 397520 400372 403099 405936
62812 405936 409116 412749 416974 421913 427442 433198 438797 443912 448289 451982 455582 459974 465793 473158
62798 473158 481808 491262 500925 510369 519698 529575 540829 553966 568967 585518 603519 623457 646181
62785 646181 672343 702222 736062 774274 817177 864893 917683 976051 1040172 1109441 1182860
62774 1182860 1259607 1338823 1418932 1497615 1572378 1640823 1700468 1748936 1784722 1807601 1818079
62763 1818079 1816436 1802392 1775639 1736635 1686922 1628720 1564264 1495495 1424127 1351666 1279353
62752 1279353 1208367 1140029 1075360 1014338 956141 900486 848369 801074 758863 721085 687208
62741 687208 657058 630228 606031 584234 565256 549377 536000 523972 512493 501631 492065 484335
62729 484335 478264 473191 468781 465287 462871 461166 459975 459960 461866 465188 468403 470678 472688 475651 480169
62714 480169 486297 494029 503256 513628 525005 537856 552898 570516 590771 613742 639597 668556
62702 668556 701066 737748 778811 823704 871673 922582 976913 1035060 1096905 1161978 1229614
62691 1229614 1298772 1367800 1434460 1496189 1550555 1595729 1630629 1654510 1666465 1665470 1651001 1623547
62679 1623547 1584493 1535605 1478659 1415424 1347762 1277511 1206279 1135479 1066555 1000900 939440
62668 939440 882455 830031 782455 739921 702027 668025 637524 610575 586974 565889 546408
62657 546408 528251 511816 497641 485923 476282 467816 459553 450963 442034 433008 424305 416643 410660
62644 410660 406121 401844 396820 391280 386370 382943 380980 380096 380092 380854 382008 382972 383255 382590 380921 378510
62628 378510 376064 374440 373969 374098 373902 372930 371429 369839 368406 367329 366923 367381 368613 370555 373366 377034
62612 377034 381039 384854 388614 392843 397612 402527 407597 413562 421058 429852 439192 448818 459381 471983
62598 471983 487413 505767 526769 550440 577243 607433 640554 675962 713474 752837 792659
62587 792659 830708 865504 896885 924644 947368 963255 971606 972819 967250 954859 935915 911364
62575 911364 882382 850061 815684 780789 746567 713365 680990 649508 619616 592269 567947
62564 567947 546284 526452 507981 491128 476392 463826 452939 443221 434634 427555 422201 418032
62552 418032 413875 408888 403414 398546 394765 391368 387482 383287 379884 378124 377904 378537 379499 380792 382701
62537 382701 385182 387501 388751 388828 388582 388839 389604 390512 391675 393598 396534 400456 405523 411998 419754 428434
62521 428434 438227 450017 464577 482016 502053 524438 548902 575190 603446 634269 668057 704493
62509 704493 742851 782496 822729 862408 900140 934860 965868 992335 1013072 1026936 1033378 1032628
62497 1032628 1025461 1012784 995354 973973 950030 925546 902391 881536 863361 848516 837875
62486 837875 831656 829285 830550 836359 847765 864557 885427 909376 936271 966034 997880 1030398
62474 1030398 1061584 1088596 1108478 1119984 1124340 1123514 1117898 1106104 1086523 1058464 1022255 979447
62462 979447 932985 886121 840563 796124 752328 709728 669430 632172 598429 568815 543623
62451 543623 522251 503737 487757 474651 464634 457376 452230 448425 445189 442196 439933 439294 440748
62438 440748 444066 448709 454140 459868 465513 470821 475391 478492 479445 478162 475059 470528 464757 457984
62424 457984 450557 442732 434651 426536 418699 411389 404750 398800 393256 387602 381693 376197 372035 369316
62410 369316 367112 364398 360992 357615 355187 354050 353700 353257 352265 350985 349905 349294 349388 350491 352494 354642
62394 354642 356392 358249 361059 364574 367452 368821 369228 369833 371218 373247 375571 377904 380136 382558 385800
62379 385800 390296 395990 402634 410131 418435 427379 436694 445985 454796 463142 472006 482680 495415 509245
62365 509245 523422 538466 555514 575253 598028 624393 654856 689472 728396 772445 822192
62354 822192 876656 933788 992220 1051524 1110384 1165519 1213185 1251399 1280196 1300182 1311608
62343 1311608 1314739 1310344 1299441 1282663 1259989 1230991 1195464 1154141 1108914 1062250 1016258 972259
62331 972259 931029 893100 858701 827685 799810 775128 753850 735726 719687 704347 688913
62320 688913 673431 658090 642549 626163 608713 590617 572438 554518 537118 520587 505223
62309 505223 491189 478675 467892 458688 450473 442883 436347 431616 428810 427315 426527 426210 426015 425203
62295 425203 423291 420809 419051 419081 420997 423950 426721 428585 429923 431847 434995 438857 442572 446078 449987
62280 449987 454510 459184 463785 468804 474555 480298 484886 488205 491444 495853 501593 507959 514478 521540
62266 521540 530017 540565 553403 568637 586572 607633 632169 660489 693027 730264 772514 819910
62254 819910 872481 929937 991261 1054702 1118123 1179078 1234604 1281594 1317977 1343566 1359506
62243 1359506 1366931 1366314 1357917 1342317 1320112 1291194 1254624 1209602 1156753 1098492 1038070 978246
62231 978246 920792 866797 816937 771434 730250 693514 661458 633785 609497 587678 568255
62220 568255 551697 538152 527149 517970 510043 503019 496712 490991 485666 480647 476247 473047 471295
62207 471295 470672 470837 471915 474227 477891 482952 489533 497453 506031 514802 524163 534792 546568 558690
62193 558690 570675 582578 594200 604895 614397 623263 632144 641002 649342 656853 663531 669419 674503
62180 674503 678669 681606 682967 682797 681580 679751 677482 675128 673640 674252 677928 685261 696704 712661
62166 712661 733464 759417 790695 827058 867784 912000 958755 1006412 1052138 1092466 1124683
62155 1124683 1147783 1162305 1169479 1170516 1166339 1157526 1144231 1126193 1103041 1074774 1041951 1005546
62143 1005546 966819 927343 888815 852538 819214 789244 762910 740055 720150 703130 689755
62132 689755 680473 674234 669231 664669 660975 658318 655984 653518 651529 650786 651276 652784 655766 660879 668098
62117 668098 677009 687538 699459 711297 720662 725948 727336 726130 723644 720787 718154 716053 714411
62104 714411 712647 709635 704166 695927 685886 675374 665009 655002 646218 640022 636883 635801 635526
62091 635526 635892 637581 641019 645986 652026 658727 665697 672752 680234 688852 699080 710852 723837 737809
62077 737809 752749 768850 786554 806330 828082 850836 873319 895053 916731 939393 963368
62066 963368 988241 1013726 1040172 1068139 1097775 1128828 1160942 1193477 1225027 1253517 1277038
62055 1277038 1294645 1306330 1312461 1313391 1309539 1301493 1289749 1274260 1254458 1229821 1200346 1166390
62043 1166390 1128372 1087000 1043656 1000052 957278 915517 874773 835501 798236 763053 729881
62032 729881 699206 671992 648832 629444 612933 598299 584729 571828 559656 548373 537787
62021 537787 527457 517205 507248 497781 488729 480001 471705 463906 456400 449013 441986 435847 430920 427166
62007 427166 424487 422947 422592 423202 424427 426200 428874 432791 437685 442646 446811 450035 452709 454955 456251
61992 456251 456080 454772 453321 452232 450838 448007 443326 437304 430576 423429 416180 409410 403461 398039
61978 398039 392793 387991 384111 380942 377802 374724 372723 372587 373898 375623 377283 379129 381404 383875
61964 383875 386003 387317 387779 388018 389031 391321 394400 397333 399620 401362 402820 404177 405593 407130 408725
61949 408725 410528 413119 416962 421785 426924 432289 438535 446270 455626 466703 479873 495303 512516
61936 512516 530730 549318 567704 585229 601570 617013 631802 645400 657011 666766 675693 684284
61924 684284 691661 696607 698929 699267 697812 694019 687607 679280 670213 661377 653612 647851 644672 643859 644932
61909 644932 648011 653764 662563 674139 687935 703274 719045 733751 746109 755377 761051 762780 760777
61896 760777 755777 748171 737530 723503 706986 689872 673553 657965 642203 625839 609562 594613
61884 594613 581743 570751 561008 552200 544296 536936 529321 520838 511469 501436 490843 479967 469603
61871 469603 460724 453857 448973 445750 443762 442673 442532 443700 446257 449714 453590 458050 463634 470575
61857 470575 478775 488344 499822 513878 531025 551425 574731 600202 627220 655533 684855 714601
61845 714601 744330 774025 803407 831245 855923 876521 892781 904252 910241 910671 906335 898225
61833 898225 887260 874836 862981 853485 847180 844330 845294 850440 859649 872225 887207 903633 920682
61820 920682 937642 953508 966577 974779 976720 972307 962273 947306 927753 903879 876238 845810
61808 845810 813905 781786 750374 720349 692323 666610 642943 620892 600647 582998 568367
61797 568367 556197 545519 535832 527218 519797 513327 507215 500828 493934 486952 480656 475587 471845 469349
61783 469349 467936 467223 466735 466328 466146 465980 465060 462820 459737 457040 455575 455089 454640 453575 452061 450691
61767 450691 449673 448643 447414 446587 446997 448655 450672 452266 453439 454593 455930 457469 459255 461180 462823
61752 462823 463786 464136 464270 464407 464371 463858 462811 461478 460107 458622 456723 454341 451790 449306 446792 444327
61736 444327 442633 442487 443761 445567 447321 449132 451147 453083 454612 455779 456908 458467 461051 464909
61722 464909 469346 473169 475956 478372 481038 483749 486129 488337 490584 492477 493550 494113 494944 496296 497659
61707 497659 498301 497590 495049 490722 485525 480791 477359 475178 473602 471783 469026 465171 460685 456208 452137
61692 452137 448703 446031 443888 441771 439581 437822 436734 435630 433653 430865 427997 425381 422836 420487
61678 420487 418905 418242 417776 416553 414246 411298 408497 406395 404884 403377 401643 400254 399857 400228 400519
61663 400519 400304 399805 399123 397928 396081 394060 392462 391388 390547 389754 389197 389341 390532 392476 394239 395092
61647 395092 395316 395802 396940 398402 399997 402153 405266 409039 412704 415631 417514 418260 417986 416979 415510
61632 415510 413797 412077 410417 408475 405874 402909 400388 398580 396688 393716 389599 385264 381826 379913
61618 379913 379409 379458 379019 377810 376635 376434 377088 377483 376614 374318 370989 367017 362632 358024 353332 348583
61602 348583 343736 338780 333839 329260 325529 322888 320941 318808 315861 312274 308778 305925 303713 301852
61588 301852 300121 298383 296543 294749 293459 292941 292680 291688 289536 286803 284323 282311 280465 278633 277006
61573 277006 275834 275243 275233 275463 275263 274296 273171 272931 273831 275045 275684 275673 275437 275133 274619 273944 273433 273265
61555 273265 273296 273346 273455 273717 274087 274526 275267 276617 278435 280029 280931 281604 282988 285298 287735 289580 291024
61538 291024 292527 293814 294233 293924 293867 294607 295616 296248 296812 298176 300537 303033 304580 304757 303842 302245
61522 302245 300132 297595 294948 292628 290766 289071 287297 285605 284252 283152 282048 281017 280458 280608 281409
61507 281409 282817 284824 287065 288753 289195 288234 286251 283988 282334 281819 282126 282382 282077 281466 281024 280870
61491 280870 280929 281305 282151 283338 284534 285512 286221 286676 286883 286827 286474 285992 285942 286943 288987 291360 293408 295110
61473 295110 296745 298307 299553 300494 301475 302823 304553 306340 307621 307836 306791 304800 302430 300188 298459
61458 298459 297526 297493 298244 299511 300877 301854 302271 302560 303271 304250 304817 304899 305379 306966 309209 311207 312864
61441 312864 314782 317105 319233 320716 321853 323228 325124 327532 330263 332846 334728 335899 337066 338949
61427 338949 341531 344171 346279 347724 348751 349714 350819 351965 352881 353590 354535 356112 358162 360115 361601
61412 361601 362661 363412 363796 363797 363656 363620 363574 363192 362393 361400 360298 358869 357074 355423 354481 354145 353777 353088
61394 353088 352472 352338 352470 352306 351627 350640 349574 348567 347921 348053 349016 350289 351235 351628 351663 351617 351734 352268
61376 352268 353278 354354 354850 354663 354506 355135 356439 357710 358743 360161 362424 364978 366774 367381 367228 366949
61360 366949 366939 367419 368475 370011 371984 374602 377938 381532 384901 388392 392887 398632 405081 412055 420169
61345 420169 429612 439205 447446 454063 459829 465169 469807 473670 477250 480909 484491 487827 490985 493726
61331 493726 495295 495264 494168 492827 491301 489015 485827 482419 479543 477333 475549 474134 473156 472430 471576
61316 471576 470545 469805 469902 471041 473154 476178 480019 484467 489429 495296 502867 512789 525147 539467
61302 539467 554953 570735 586021 600032 611758 620083 624535 625813 625205 623449 620496 616228 610917
61289 610917 604855 598120 590926 583692 576437 568560 559654 550201 541053 532546 524616 517499 511682 507251
61275 507251 503868 501430 500254 500503 501809 503624 505617 507645 509644 511713 514095 516929 520088 523336
61261 523336 526564 529948 534003 539394 546431 554723 563479 572080 580177 587398 593370 598057 601758 604620
61247 604620 606393 606755 605715 603603 600854 597885 594984 592164 589206 585983 582682 579691 577338 575729
61233 575729 574793 574433 574601 575225 576182 577545 579830 583616 588718 594075 598809 603130 607859 613302 619166
61218 619166 625455 632729 641206 650104 658247 665092 670866 675940 680390 684103 686909 688547 688706 687354
61204 687354 685044 682744 681245 680782 681284 682911 686023 690674 696611 703997 713758 726735 742628 760138
61190 760138 778003 795461 811804 826114 837656 846249 852098 855534 857030 857223 856688 855741 854470 852819
61176 852819 850657 847932 844725 841027 836573 831113 824717 817553 809511 800331 789993 778662 766419
61163 766419 753425 740155 726891 713159 698354 682940 668286 655103 642774 630580 618900
61152 618900 608674 600239 593351 588071 584922 584244 585798 588912 592557 595302 595729 593195 588175 581846
61138 581846 575345 569255 563567 558093 552938 548546 545406 543826 543871 545232 547341 550033 554054 560331 568765
61123 568765 578428 589104 601794 617244 634698 652859 671567 691765 714098 738312 763905 790555
61111 790555 817814 845016 871698 897776 923199 947769 971251 993320 1013393 1030869 1045618
61100 1045618 1057912 1067845 1075028 1078798 1078513 1073763 1064670 1051935 1036267 1017826 996488 972515 946660
61087 946660 919745 892573 866100 841119 817642 795040 772954 751792 732150 714064 697017
61076 697017 680623 665193 651582 640379 631234 623238 616018 610009 605486 601921 598768 596301 594965
61063 594965 594374 593888 593921 595601 599048 603003 606436 609692 613735 619095 625995 634802 645680 658165 671527
61048 671527 685291 699242 713396 728386 745452 765588 788777 814180 840775 867809 895129
61037 895129 923313 953121 984706 1017721 1052134 1088332 1126471 1166500 1208909 1254505 1303079
61026 1303079 1353133 1403286 1453180 1502737 1551727 1600818 1652212 1708527 1771711 1843457 1925485
61015 1925485 2018463 2121647 2234666 2359109 2498132 2656300 2841190 3063665 3335207 3666727
61005 3666727 4071911 4569777 5181875 5930522 6845004 7967307 9344126 11010721 12982951
60996 12982951 15249793 17737546 20253508 22480618 24084987 24889363 24975079 24625893 24173700
60987 24173700 23877631 23888730 24241016 24815341 25322220 25386493 24721777 23271983 21213432
60978 21213432 18836100 16411665 14127731 12085527 10320841 8826200 7572745 6527972
60970 6527972 5662516 4948864 4360988 3876765 3478283 3149413 2874991 2642434 2442327
60961 2442327 2267244 2111497 1971971 1847456 1736658 1637933 1550634 1474945 1409992 1353614
60951 1353614 1304410 1262439 1227163 1195892 1165228 1133361 1100411 1067401 1035636 1006365 980130
60940 980130 956564 935109 915502 897342 879818 862369 845164 828560 812572 797160 782561
60929 782561 768979 756321 744470 733392 722762 712057 701338 691376 682723 675153 668299 662204
60917 662204 656892 652004 647412 643662 641346 640461 640813 642536 645672 649739 654353 659837 666586 674212 682083
60902 682083 690512 700647 713205 727893 744033 761159 778944 797086 815563 834720 854950 876377
60890 876377 898789 921806 945151 968780 992544 1015664 1036907 1055458 1071197 1083932 1092876 1097396
60878 1097396 1097876 1095287 1090104 1082127 1071149 1057233 1040514 1021376 1000862 980280 960208 940240
60866 940240 919854 899163 878672 858673 839241 820761 804069 789728 777067 764287 749942
60855 749942 734238 718447 703158 687822 672220 657508 645092 634935 625661 616138 606275 596452
60843 596452 586811 577174 567232 556734 545729 534517 523151 511318 499050 487172 476474 466755
60831 466755 457337 448323 440616 434683 429984 425758 421819 418411 415700 413606 411847 410110 408466 407532
60817 407532 407854 409191 410796 412290 413823 415460 416966 418234 419476 420983 423043 425940 429508 432786
60803 432786 434795 435666 436428 437648 438942 439880 440621 441445 442355 443424 444818 446081 446055 444136 441195 438723
60787 438723 437324 436474 435434 433850 431632 428785 425413 421654 417585 413330 409162 405318 401812 398474
60773 398474 395013 391038 386352 381355 376867 373375 370709 368594 367166 366598 366509 366180 365334 364397 363905 363865
60757 363865 363821 363513 363280 363642 364487 365053 364938 364832 365881 368463 371996 375816 379740 383862 388315 393286
60741 393286 398704 403816 407532 409375 409685 408823 406727 403439 399507 395505 391519 387491 383728 380644 378089
60726 378089 375296 371494 366567 361178 356166 351737 347391 342922 339115 336881 335884 334760 332627 329686
60712 329686 326349 322699 319088 316342 314859 314076 313251 312192 310872 309071 306927 305251 304655 304816 305104
60697 305104 305447 306031 306647 306977 307179 307641 308536 310046 312505 315750 318817 320959 322556 324398 326575 328839
60681 328839 331515 335082 339158 342914 346373 350346 355119 360116 364902 369698 374745 379945 385242 390653
60667 390653 395761 399845 402760 405087 407219 408844 409517 409245 408343 407207 406323 405998 405915 405451 404544 403779 403551
60650 403551 403711 404058 404563 404979 404921 404585 404628 404970 404403 401926 397903 393335 388485 382967 376864 370972 365882
60633 365882 361408 357069 352806 349123 346680 345760 345896 346104 345681 344803 344227 344457 345323 346242 346731 346735 346564 346524
60615 346524 346568 346393 345901 345388 345246 345621 346415 347444 348545 349702 351102 352791 354279 354875 354593 354333 354851
60598 354851 355884 356742 357509 358980 361414 363960 365607 366279 366612 366943 367004 366495 365541 364531 363867 363897 364696
60581 364696 365684 365890 364977 363819 363669 364931 367099 369774 373152 377460 382448 387780 393654 400797 409954
60566 409954 421419 434802 449129 463392 477022 489583 500116 507328 510582 510256 506997 501201 493454
60553 493454 484905 476711 469510 463714 459789 457741 456891 456796 458029 461422 466897 473702 481540 490698 501295
60538 501295 513233 526888 542976 561420 580816 599159 614842 627063 635784 641320 643622 642042
60526 642042 636220 627057 616368 605703 595952 587679 581005 575249 569518 563795 558862 555192 552617 551122
60512 551122 551091 552577 554988 557750 560685 563679 566677 570241 575397 582745 592397 604970 621823 643934
60498 643934 671243 703403 740404 781965 827049 874548 923834 974026 1023255 1069161 1109632
60487 1109632 1142577 1165696 1177302 1177048 1165323 1142445 1109177 1067548 1020309 969751 917664 866021
60475 866021 816651 770292 726846 686656 650823 620092 594080 571885 552894 536686 522594
60464 522594 509847 498073 487410 478076 469918 462373 454921 447550 440705 434781 429821 425682 422189
60451 422189 419077 416082 413240 410784 408632 406353 403808 401387 399376 397604 395980 394934 394792 395166 395444
60436 395444 395569 395809 396108 396203 396103 395883 395315 394325 393567 393749 394530 394815 394159 393162 392452 392007 391647 391493 391579
60417 391579 391593 391394 391483 392570 394873 397972 401135 403658 405179 405847 406034 405891 405450 405072 405292 406086 406712
60400 406712 406584 405991 405718 406212 407324 408702 410148 411715 413618 415988 418642 421193 423393 425218 426691
60385 426691 427932 429360 431443 434059 436529 438540 440688 443693 447302 450498 452736 454480 456367 458288
60371 458288 459621 460132 460221 460319 460423 460368 460270 460435 460998 461943 463375 465430 467921 470416 472861 475819 479879
60354 479879 484964 490456 495955 501753 508621 517206 527524 538901 550417 561403 571361 579494 584668
60341 584668 586094 583862 578654 571190 562125 552268 542536 533681 526142 519945 514688 509842 505305 501424
60327 501424 498287 495353 492113 488825 486163 484283 482700 480970 479074 477157 475349 473901 473146 473233 474114
60312 474114 475795 478379 481896 486386 492102 499437 508782 520746 536335 556410 580829 608272 636716
60299 636716 663793 687024 704427 715009 718223 713189 699301 677798 651911 624985 598947 574844
60287 574844 553899 537041 523824 512863 503438 495976 490860 487506 484900 482479 480052 477284 473833
60274 473833 469842 465842 462136 458589 455023 451490 448084 444786 441675 439072 437220 435981 435034 434262 433724
60259 433724 433318 432793 432112 431560 431404 431621 432002 432350 432585 432876 433696 435393 437592 439314 439964 439967 440239 441189
60241 441189 442455 443428 443768 443564 443248 443295 443843 444685 445747 447284 449365 451424 452800 453643 454832 456878
60225 456878 459282 461149 462161 462726 463337 464115 465037 466400 468758 472318 476558 480632 484117 487237 490450
60210 490450 494118 498477 503571 509145 514975 521299 528459 536053 543000 548734 553780 558781 563499 567388
60196 567388 570670 574094 577807 581140 583419 584410 584091 582652 580757 579148 577790 575818 572490 567863 562558
60181 562558 557264 552498 548325 544207 539511 534257 529052 524296 519981 516291 513732 512394 511611 510738 509871
60166 509871 509352 508940 507988 506316 504448 502882 501466 499680 497392 495202 493977 494152 495571 497938 501051
60151 501051 504490 507482 509512 510960 512709 515179 518060 520877 523421 525721 528082 531147 535371 540324
60137 540324 545057 549318 553904 559519 565772 571723 577042 582097 586972 590930 592981 592810 591033 588629
60123 588629 586198 583863 581772 580456 580429 581603 583428 585619 588408 592007 596137 600225 603927 607312 610620
60108 610620 613844 616486 617806 617445 615726 613274 610541 607795 605182 602443 598982 594745 590744 588040
60094 588040 586378 584587 582277 580353 579705 580200 581249 582636 584367 586321 588563 591497 595184 598856 601620
60079 601620 603336 604341 604662 604051 602609 600743 598449 595111 590194 583888 576941 569971 563033 555865 548445
60064 548445 541206 534550 528360 522240 516131 510293 504701 498939 492841 486881 481768 477908 475304 473643
60050 473643 472367 471103 470164 470272 471633 473704 475942 478342 481081 484170 487728 492032 496904 501557 505476
60035 505476 509052 512876 516810 520276 523140 525713 527990 529395 529225 527028 522741 516852 510306 503868
60021 503868 497661 491461 485145 478549 471295 463289 455202 447924 441716 436414 432241 429740 428885 428756 428283
60006 428283 426895 424467 421209 417858 415504 414769 415257 415997 416380 416533 416940 417887 419281 420876 422524 424139
59990 424139 425487 426264 426513 426827 428013 430581 434530 439373 444266 448324 451046 452426 452642 451851 450318
59975 450318 448406 446225 443572 440431 437288 434640 432416 430166 427767 425700 424727 425420 427782 431057 434066
59960 434066 436092 437375 438621 440135 441667 442914 443846 444579 445225 445866 446518 447113 447654 448366 449535 451272
59944 451272 453465 455904 458355 460605 462450 463590 463703 462942 462243 462610 463935 465015 465023 464487 464403 464824 464882
59927 464882 463982 462425 460838 459576 458778 458624 459225 460402 461808 463291 465004 467075 469280 471341 473602
59912 473602 476992 481961 487825 493605 499173 504796 509783 512637 512759 511109 508888 506449 503924 501978
59898 501978 501132 500936 500615 500120 499932 500301 501328 503365 506562 510331 513995 517682 521918 526631 531279 535729
59882 535729 540310 545125 550003 554953 560056 565080 569759 574184 578239 581026 581685 580561 578697 576335
59868 576335 572831 567929 562113 555660 548383 540571 533260 527237 522468 518762 516195 514591 513394 512510
59854 512510 512639 514384 517603 522014 527815 535273 544249 554651 566779 580575 594704 606879 615114
59841 615114 618669 618281 615813 613268 611676 611001 611106 612273 614452 616535 616937 614740 609955 603074 594821
59826 594821 586142 577874 570331 563389 556848 550456 543817 536710 529501 522946 517503 513021 509120 505737
59812 505737 503204 501786 501260 501003 500601 500222 500214 500381 499931 498255 495597 492824 490591 488779 486742 484104
59796 484104 481258 478947 477393 476119 474711 473404 472664 472557 472867 473558 474636 475720 476201 475822 474794 473441
59780 473441 472039 470802 469682 468324 466509 464489 462567 460690 458847 457477 456907 456755 456513 456310 456400 456298
59764 456298 455456 454522 454717 455987 456937 456806 456337 456371 456783 457455 459188 462686 467319 471723 475241 478107 480714
59747 480714 483380 486516 490369 494768 499499 504534 509495 513418 515696 516936 518272 520067 521837 523236
59733 523236 524470 525812 527217 528440 529247 529573 529691 530023 530627 531113 531292 531545 532293 533449 534691 535840
59717 535840 536591 536375 535066 533441 532358 531689 530684 529159 527738 527038 527226 528269 530007 531929 533421
59702 533421 534403 535312 536397 537383 537929 538058 538033 538082 538347 538831 539338 539637 539697 539568 539132 538251 537206 536608 536798
59683 536798 537521 538328 539117 540052 541064 541606 541046 539283 536878 534472 532153 529513 526207 522175 517384 511825
59667 511825 505981 500905 497431 495398 493937 492440 490987 489908 489257 488856 488700 489136 490521 492668 494828
59652 494828 496432 497845 500103 503842 508624 513355 517198 519994 521944 522994 522626 520427 516851 513037
59638 513037 509607 506055 501760 497216 493560 491119 489229 487427 485993 485173 484751 484610 484962 485635 485883 485298
59622 485298 484247 482988 481041 478015 474400 470859 467266 463133 458655 454620 451568 449628 448881 449264 450341
59607 450341 451760 453761 456663 460076 463190 465727 468000 470121 471707 472356 472008 470917 469636 468813 468602
59592 468602 468409 467683 466724 466229 466274 466364 466337 466549 467193 468007 468708 469160 469127 468392 467234 466195 465225 463594 460888
59573 460888 457631 454664 452278 450285 448570 447180 446026 444902 443814 443044 442802 442971 443318 443827 444586 445339
59557 445339 445464 444698 443706 443473 444163 445064 445744 446707 448590 451211 453909 456521 459488 463108 467163 471375
59541 471375 476014 481986 490434 502233 517867 537634 561291 586608 608562 621378 622486 614217
59529 614217 601392 587872 575732 566339 560478 557542 556061 555485 556630 560098 565103 570293 575014 579170
59515 579170 582234 583110 581017 576171 569473 561691 553006 543320 532918 522663 513471 505717 499186 493418
59501 493418 488025 482921 478346 474500 471100 467588 463916 460697 458441 457025 456146 455776 455756 455404 454088
59486 454088 452012 450067 449121 449708 451949 455263 458514 461076 463527 466805 470916 475074 478934 482995 487815
59471 487815 493363 499170 504659 509281 512713 514992 516292 516727 516555 516357 516698 517807 519760 522653 526350
59456 526350 530522 535266 541162 548325 556059 563969 572736 582883 593350 602360 609453 615586 621244 625392
59442 625392 626468 623701 617386 608602 598751 588812 578861 568702 558819 550157 543087 537188 531961 527211
59428 527211 522905 519327 517275 517434 519675 523550 529309 537641 548555 561269 575186 590341 607008
59415 607008 625577 646641 670494 696778 725254 756067 787632 814484 829233 827800 812263 788679
59403 788679 763255 740533 723187 712113 707378 709602 719212 733318 744504 744635 730400 704913
59391 704913 674507 644636 618109 595541 576641 561215 549272 540413 533649 528117 523729 520812
59379 520812 519343 518846 518831 519070 519555 520391 521691 523564 526333 530546 536356 542963 549156 554442 559265 564188
59363 564188 569401 575016 581179 587776 594524 601457 608813 616492 624194 632089 640707 650126 660012 670508
59349 670508 682271 695472 709547 724116 739342 755155 770960 786425 801727 816644 830166
59338 830166 841453 850401 856885 860287 860265 857264 851724 843505 832618 819756 805487 789644 772189
59325 772189 754035 736333 719539 703861 689965 678397 668764 660260 652633 645982 640040 634430 629253
59312 629253 624726 620612 616706 613589 612124 612488 614325 617540 622275 628443 636085 645976 658982 674833
59298 674833 692242 710085 727567 743002 753277 755247 747733 732217 711885 689991 668689 648966
59286 648966 631330 616263 603966 594009 585539 577830 570764 565075 562009 562215 564831 568256 571980 577059
59272 577059 584545 594105 604592 615384 626658 638798 651983 665922 679519 691215 700066 706048
59260 706048 709042 708262 703318 695223 685578 675177 664086 652663 641610 631198 621191 611540 602623
59247 602623 594928 588883 584746 582183 580268 578425 577099 577006 578095 579859 582277 585727 590141 594964 599909
59232 599909 605147 610871 617141 623925 630623 635746 637874 637024 634506 631392 627723 623195 617883 612045
59218 612045 605769 599264 593183 588284 584787 582244 580062 578073 576562 575773 575528 575433 575240 574707 573416 571265
59202 571265 569052 567912 568061 568752 569483 570526 572036 573520 574516 575027 574834 573247 570167 566754 564339 563252
59186 563252 563182 563976 565318 566363 566595 566663 567574 569473 571840 574368 576853 578764 579872 580978 583155 586517
59170 586517 590475 594826 599795 605448 611953 620039 630176 641500 652546 662865 672960 682736 691007
59157 691007 696667 699579 700275 699438 697594 694666 689977 683301 675620 668137 660880 653140 644901 636805 628943
59142 628943 620892 612910 605908 600010 594166 587456 579944 572131 564474 557682 552491 548676 544987 540503
59128 540503 535578 531236 528169 526515 526025 526218 526813 528107 530536 534005 538257 543716 551111 560276 570149
59113 570149 580080 590264 600691 610570 619211 626760 633683 640058 645756 650791 655164 658760 661687 664237
59099 664237 666306 667261 666612 664518 661568 658442 655775 653760 651807 649136 645884 643114 641572 640927 640352
59084 640352 639362 637858 635774 632950 629133 624071 617842 610984 603927 596494 588449 580354 573249 567506
59070 567506 562637 558174 554100 550415 546980 543917 541525 539696 537986 536319 535005 533995 532817 531356
59056 531356 530033 528962 527648 525905 524449 524109 524800 525690 526151 526178 525990 525519 524436 522695 520907 519797
59040 519797 519227 518254 516459 514633 513688 513444 513166 512814 512922 513570 514368 515268 516555 518253 520407 523755 529154
59023 529154 536365 544288 552425 561266 571194 581899 592896 603744 613623 621570 627357 631450 633995
59010 633995 634527 632814 629300 624678 619728 615570 613254 612915 613978 616223 620013 625501 632288 639807 647397
58995 647397 654182 659698 664438 668980 672896 675575 677720 680665 684219 686616 686762 685165 682409 678172
58981 678172 672384 666179 660939 657219 655036 654358 654798 655758 657411 660836 666778 674897 684473 695030 706074
58966 706074 717110 728261 740118 752763 765669 778567 791453 803709 814335 823192 830779 836626
58954 836626 839199 837749 832906 825058 813579 798331 780624 761950 742905 724071 706613 691098
58942 691098 676753 662879 650097 639424 630975 624375 619511 616067 613161 610292 607894 606309 605012
58929 605012 603496 602037 600969 600115 599522 599665 600203 599717 597558 594870 592849 591185 589275 587758 587443 587599
58913 587599 586828 585053 583412 582717 583231 585395 589447 594630 599960 605609 612639 621667 632635 645408
58899 645408 659601 674106 687729 700163 711687 722374 732371 742567 754177 767883 783932 802489
58887 802489 823295 845583 869084 894401 921493 948374 972300 991822 1006931 1017802 1024414 1026943
58875 1026943 1025490 1019679 1009301 995055 977939 958425 937033 915219 894711 876213 859568 844742
58863 844742 831829 820394 809707 799451 789610 780002 770483 761131 751669 741297 729746 717843
58851 717843 706301 694691 682490 670433 659725 650440 641757 633376 625688 618836 612574 606876 601886
58838 601886 597482 593429 589615 585577 580476 574201 567882 562530 557813 552954 548076 543711 539742 535983
58824 535983 533257 532697 534249 536835 539722 542892 546452 550530 555347 560706 565833 570336 574637 578839
58810 578839 582113 584106 585987 588932 592376 594949 596364 597115 597060 595701 593344 590655 587584 583869 579996
58795 579996 576364 572180 566604 560413 555053 550613 546280 542327 539935 539301 539512 540169 541648 543876 546294
58780 546294 548992 552571 556930 561389 565841 570532 574976 578291 580293 581010 579658 575622 570059 564810
58766 564810 560010 554477 548214 542599 538033 533338 527851 522415 517868 514113 511118 509341 508650 508139 507557
58751 507557 507725 509130 511268 513802 517196 521741 526922 532153 537271 542082 546355 550465 555143 560455
58737 560455 565916 571567 577890 584700 591201 597183 603083 608864 614026 618726 623659 628786 633415 637621
58723 637621 642245 647292 651607 654509 656721 659378 663183 668675 676198 685265 694783 704071 712950 721049
58709 721049 728046 734352 740313 744883 746432 744750 740886 735061 726282 714184 699739 683820 666415
58696 666415 647619 628165 608622 589211 570684 554211 540168 528063 517753 509513 502864 496689
58684 496689 490696 485497 481005 476076 470093 463798 458266 454066 451437 450167 449219 447667 446014 445453 446005
58669 446005 446750 447731 450110 454481 460545 468401 478439 489841 500792 510280 518085 523094 523594 519595
58655 519595 513007 505159 495929 485717 476329 469230 464560 462435 463495 467611 473746 481715 492367 505292
58641 505292 517994 528201 535604 540844 544387 547069 550041 553302 555631 556632 557411 558660 559683 559953
58627 559953 559992 559944 558872 556294 552989 549599 545907 542106 539230 537672 536831 536807 538760 542947 548219 554159
58611 554159 561773 571134 580217 587210 592242 595794 597249 596336 594344 592473 590376 587539 584641 582305
58597 582305 579821 576380 572370 568409 564362 560400 557683 556937 557578 559225 562663 568285 574970 581631 588604
58582 588604 596555 605348 614912 625728 637353 647964 656450 663685 670726 677177 682331 686474 689998
58569 689998 692793 695656 700820 709838 722166 736771 753690 773007 793932 816013 839773 865004
58557 865004 889849 912540 932560 949299 961392 968430 971492 971042 966311 957843 948403 939939 931778
58544 931778 923283 915931 910858 906389 900066 891368 880561 866777 849400 829829 809835 789655 769472
58531 769472 751022 735726 722828 711414 702612 697662 695396 693892 693229 694395 696841 699336 702054
58518 702054 705616 709209 711634 713074 713960 713446 710922 707584 704546 700967 696153 691858 690011 689622 688380
58503 688380 686003 683564 680856 677111 673237 670741 669273 667563 665760 664528 662996 660094 656900 655199
58489 655199 654730 654275 654357 656276 659439 662346 665332 669718 675181 680626 686859 695629 706723 718698 731705
58474 731705 746715 762453 776006 786222 793891 798845 799596 795806 788745 779424 768412 757228 747663
58461 747663 739880 733133 727933 725478 725533 727015 730149 735969 744312 754318 766057 779431 792309 802149
58447 802149 808804 813416 815424 813175 806867 798358 788720 778396 769094 762788 759180 756427 753938 752352
58433 752352 751564 751182 752121 755308 759549 763132 766674 771914 778727 786042 794716 806485 820636 834495
58419 834495 846625 856963 864644 868509 869134 867766 864134 857886 850904 845172 839519 831671 822347 813947
58405 813947 806319 797605 788407 781239 776311 771671 767199 764730 764501 765080 766653 770709 776604 781990 786592
58390 786592 792069 798222 802867 805429 807268 808576 808431 807807 808916 811543 813421 814154 815411 817468 819089
58375 819089 820587 823442 827132 829959 832726 837850 845171 852434 859554 868314 878203 886872 894600 904034
58361 904034 915452 926659 937636 950766 966120 980936 994219 1007456 1020335 1030242 1036681 1041932
58349 1041932 1046687 1049282 1049888 1051157 1053968 1056622 1058936 1063036 1069538 1076950 1085300 1096183 1108911 1120874
58335 1120874 1132072 1144995 1159853 1174416 1188650 1204731 1222364 1239010 1254872 1272360 1290290
58324 1290290 1304205 1313167 1320744 1328502 1334116 1336909 1339603 1343281 1346103 1348235 1352657 1359767 1366612 1372700
58310 1372700 1381139 1392817 1404977 1416760 1430479 1446180 1460708 1473529 1487730 1504049 1519822
58299 1519822 1534876 1552131 1571124 1587592 1601052 1616128 1634659 1653297 1670702 1690065 1712341
58288 1712341 1733971 1753771 1775227 1799577 1823453 1845683 1869523 1895930 1921882 1947637 1978116
58277 1978116 2014500 2052063 2088945 2129143 2174035 2219107 2262379 2307926 2357690 2407936 2457237
58266 2457237 2509641 2566348 2622750 2677482 2735781 2800048 2865893 2931348 3000761 3075305 3149077
58255 3149077 3219176 3290285 3364676 3437458 3506606 3577757 3653995 3731064 3807984 3891843 3986415
58244 3986415 4086639 4190101 4302887 4428052 4559737 4695183 4840827 4999846 5165781
58235 5165781 5335646 5516866 5713807 5920268 6133159 6360276 6606294 6864820 7132987
58226 7132987 7419789 7731102 8061377 8409502 8787187 9201793 9647369 10123187 10643664
58217 10643664 11218860 11843767 12518942 13262112 14086729 14990440 15979135 17080297 18317908
58208 18317908 19698960 21242057 22993894 25000203 27290438 29913409 32959405 36527342
58200 36527342 40707473 45624890 51465588 58437400 66759054 76734237 88801943 103493300
58192 103493300 121415844 143332072 170156176 202736964 241553844 286333181 335262233
58185 335262233 383917404 425137816 451097734 456864736 442781980 413717319 376057690
58178 376057690 335053963 294043948 254990475 219100990 187074704 159195687 135427593
58171 135427593 115479114 98873008 85075478 73611068 64075675 56106886 49399758
58164 49399758 43731228 38930185 34837519 31317519 28280612 25661079 23386300 21389277
58156 21389277 19630815 18083679 16709666 15472759 14358474 13359064 12453552 11621050
58148 11621050 10859389 10171641 9546711 8970431 8443114 7968780 7538193 7138889 6771486
58139 6771486 6440314 6137533 5851333 5580814 5328831 5089090 4854189 4628455 4419708
58130 4419708 4225716 4040652 3867144 3709884 3564538 3424646 3292727 3173587 3063327
58121 3063327 2955533 2851860 2756295 2665513 2575015 2488329 2410215 2337017 2263482 2192823 2130152
58110 2130152 2072022 2012411 1953454 1900346 1850903 1799948 1749192 1703207 1660166 1615915 1572939
58099 1572939 1536071 1503249 1469350 1435447 1405711 1378818 1350929 1323723 1301063 1280854 1258279
58088 1258279 1234180 1212448 1192038 1169244 1145033 1122647 1100635 1075607 1049400 1026336 1005759
58077 1005759 984133 962100 942689 924902 905678 885947 868336 851313 831975 812263 796023
58066 796023 782182 767080 751329 738155 727265 716509 707272 701857 697616 689986 679529 669936
58054 669936 661061 650110 637868 627565 619074 610134 601713 596259 592193 586037 578596 573307 569863
58041 569863 565232 559593 555462 552147 546791 539894 534204 529153 521973 513325 506268 500459 492848 483424
58027 483424 474889 467297 458314 448261 439723 432669 425026 417598 413275 411694 409663 406623 404814 404236
58013 404236 402260 398251 394095 390263 385644 380982 378204 376656 374168 371307 370264 370203 368315 365002 363353
57998 363353 363733 363498 361972 361094 361176 360486 359162 359125 359901 358783 355507 352711 351462 350188 348251 346725
57982 346725 345496 343302 340800 339892 340029 338845 336287 334362 333026 330339 326620 324329 323726 322668 320851
57967 320851 320189 320713 320164 318111 316605 316327 315881 315326 316504 319244 321004 320918 320660 320752 319687 317339 315581
57950 315581 314765 313115 310404 308780 309062 309461 308860 308319 308637 309529 311750 316870 324261 331418 337854 345676
57934 345676 355844 366997 378463 391109 404478 416222 425157 432046 436939 438825 438362 437666 436834
57921 436834 433867 428539 422983 417755 410831 401445 391613 382738 373865 364414 355573 347832 340052 332057
57907 332057 325381 320461 315843 311031 307284 304702 301459 296841 292199 288000 282910 276779 271597 268407
57893 268407 266136 264448 264668 266781 268548 268957 269669 271778 274032 275691 278207 282455 286997 290697 294489
57878 294489 298955 302636 304332 304799 304698 303221 300255 297587 296364 295425 293530 291093 288426 284530 279064
57863 279064 273434 268608 263934 259277 256018 254586 253345 251427 250438 251756 254246 256273 258083 260631
57849 260631 263858 267540 271965 276396 278717 278062 276121 274604 273131 270804 267934 264914 261169 256553
57835 256553 252149 248584 245250 242094 240256 239912 239529 238379 237701 238231 238677 238011 237288 237837 239539 242138
57819 242138 246227 251621 256621 260330 263860 268065 271962 274591 276395 277436 276344 272491 267263 261825
57805 261825 255668 248807 243193 240177 238472 236321 233951 232278 231012 229729 229094 229390 229437 228475 227384
57790 227384 226647 225054 222043 219344 218463 218373 217564 216638 216834 217619 217828 217870 218776 220226 221376 222629 224940
57773 224940 228303 232313 237111 242513 247416 251207 254448 257168 258124 256878 254762 252573 249290 244482
57759 244482 239926 237081 235017 232633 230955 231174 232290 232886 233522 235125 236582 236264 234560 232677 230225
57744 230225 226235 221376 216933 212692 207883 203081 199072 194910 189308 183012 177766 173800 170284 167255
57730 167255 165161 163473 161750 161137 162861 166153 169562 173320 178467 184696 191057 197799 205414 212765
57716 212765 218242 221919 224584 225564 223693 219641 215113 210453 205121 199781 195687 192587 189368 186299
57702 186299 184531 183743 182341 179765 176873 174451 172946 172992 174420 175363 174205 171828 170226 169637 168938 168018
57686 168018 167627 167441 166548 165524 165953 168135 171154 174916 180270 187482 196463 208176 223973 243906
57672 243906 267570 296292 332554 377538 431055 493292 563867 638236 706442 756222 777664
57661 777664 766899 727908 670722 606025 540866 479357 425065 380201 343665 312738 286514
57650 286514 265660 249586 236463 225709 217861 212065 206237 199914 194598 191004 188130 185353 183282
57637 183282 182072 180873 179421 178455 178232 178287 178788 180313 182075 182269 180528 178280 176395 174242 171439 168708
57621 168708 166516 164521 162795 162030 162044 161580 160069 158208 156500 154658 152700 151112 149578 147148 144079
57606 144079 141998 141704 142178 142276 142085 142076 142132 141986 141593 140690 138950 136754 134835 133037 130544 127377 124458
57589 124458 122059 119432 116215 113056 110546 108532 106685 104892 102989 100919 99033 97465 95606 93078
57575 93078 90684 89196 87887 85664 83008 81157 79864 77810 74890 72244 70137 67697 64683 61722
57561 61722 58849 55630 52709 51311 51103 50450 48943 47739 47188 46205 44437 43102 43055 43800 45008 47250
57545 47250 50470 53370 55155 56558 58501 61094 64535 69595 76463 84100 91281 97329 101700 104103
57531 104103 105243 106208 106912 106388 104658 102882 101586 100256 98788 97689 96712 95040 93129 92599 93824
57516 93824 95316 95938 96060 96057 95421 94075 92984 92707 92682 92511 92553 92798 92607 92029 91842 91853 90793 88462 86332
57497 86332 85438 85175 84801 84445 83964 82464 79868 77479 76181 75410 74569 73970 73682 72957 71613 70581 70347
57480 70347 70238 69945 70271 71606 73050 73818 74072 73696 71800 68323 64656 61803 59292 56650 54483 53246
57464 53246 52406 51720 51837 52770 53210 52318 50827 49557 48349 47316 47421 48688 49391 48307 46401 45164
57448 45164 44649 44330 44419 44960 44892 43438 41454 40234 39965 40258 40954 41437 40585 38606 37528 38566 40321
57431 40321 40957 40826 41385 42683 43627 43881 43893 43725 43266 42993 43265 43401 42578 41042 39486 37993 36507 35556
57413 35556 35496 35813 36021 36390 37034 37339 37229 37798 39666 41765 42775 42649 41765 39942 37542 36203 36927
57396 36927 38451 38977 38557 38370 38577 38455 37914 37457 37299 37783 39862 43826 48224 51355 53232 54924 56750
57379 56750 58310 59529 60356 60125 58449 56113 54046 52123 49906 47668 45621 43283 40789 39625 40564
57364 40564 41932 41581 39696 38045 37304 36857 36585 37039 38134 39186 39972 40551 40588 40023 39793 40610 41701
57347 41701 42028 42027 42752 44068 45125 45933 46892 47462 46884 45722 45151 45166 44922 44254 43418 41987 39660 37589
57329 37589 37257 38367 39427 39926 40371 40605 39837 38132 36335 34683 32861 31097 29811 28569 26825 25244
57313 25244 24842 25272 25479 25495 25944 26309 25581 24233 23658 23848 23513 22387 21495 21152 20626 19910 19952 20782 21085
57294 21085 20031 18148 16130 14183 12734 12299 12386 11836 10399 8730 6892 4352 1475 -587 -1707 -2904
57278 -2904 -4403 -5171 -4750 -4031 -3638 -2937 -1319 772 2823 5213 8532 12621 16834 20740 24264 27627
57262 27627 31167 34711 37363 38602 39217 40308 41782 42801 43225 43437 43234 42257 41165 40946 41298 41154
57246 41154 40554 40428 40707 40312 39025 37738 36705 35160 32901 30747 29157 27798 26716 26456 26835 26991
57230 26991 26904 27421 28602 29547 30123 31219 32912 33959 33710 33078 32924 32886 32512 32336 33036 34484 36210 37867
57212 37867 38832 38374 36761 35295 34850 35213 36012 37212 38483 39303 40109 42309 46724 52867 59927 67451
57196 67451 74977 82141 89340 97198 105314 112772 119887 127996 137330 146666 155454 164729 175368 186858
57182 186858 198397 209916 221426 232703 244242 257277 272134 287689 302961 318059 333042
57171 333042 347236 360381 373216 386176 398727 410649 422765 435546 448205 460111 472015
57160 472015 484880 498375 511562 524390 537600 551674 566511 581655 596304 609636 621497
57149 621497 632309 642192 651000 659289 668248 678410 689341 700744 712812 725327 737696 750172
57137 750172 763852 779119 795242 811774 828982 846639 863878 880778 898627 917987 937904
57126 937904 957607 977543 998058 1018642 1039406 1061804 1086831 1113780 1141826 1171639 1204402
57115 1204402 1240450 1279942 1323884 1373502 1429623 1493506 1567175 1652093 1748800 1858883 1986145
57104 1986145 2134963 2309110 2513671 2756966 3049291 3401078 3824044 4333284 4946632
57095 4946632 5682377 6558496 7592483 8799420 10189817 11769732 13541262 15500316
57087 15500316 17633301 19915984 22313134 24776602 27245656 29655014 31945864 34066686
57079 34066686 35958837 37540046 38705432 39352132 39413155 38878242 37790465 36226224 34275577
57070 34275577 32032901 29594932 27058562 24515525 22046100 19714006 17563405 15618728
57062 15618728 13887199 12362611 11029434 9867529 8856591 7978137 7214978 6551046
57054 6551046 5972822 5470074 5034331 4657211 4330562 4047065 3799829 3582257 3389124
57045 3389124 3217010 3062928 2923408 2795690 2678860 2572756 2476565 2389280 2310592 2240168
57035 2240168 2176788 2119351 2068026 2023468 1985700 1955081 1933696 1924438 1929349 1950161 1989303 2047046
57023 2047046 2115773 2178051 2212674 2204921 2153301 2068357 1965543 1858058 1754151 1658220 1572142
57012 1572142 1495545 1426754 1364781 1309922 1262114 1219822 1181240 1145719 1113312 1083752 1056656
57001 1056656 1031962 1009366 987976 967196 947315 928683 911130 894790 880607 869229 860124
56990 860124 852366 845519 839282 833409 828698 826971 829082 833754 838987 843384 845323 842319 832741 817387
56976 817387 798244 776609 753467 730556 709475 690385 672816 657047 643509 631658 620857
56965 620857 611760 605548 602434 602109 604990 611693 621935 635197 651707 671070 690176 703945 708253
56952 708253 701666 685242 661964 635744 609443 583814 558972 536073 516514 500378 486978 476262
56940 476262 468490 463367 460898 462317 468679 479323 493260 511256 534648 562528 591710 618801
56928 618801 640394 651973 649494 632881 606408 575175 542396 509940 479478 452145 428066 406844
56916 406844 388012 371127 356194 343851 334359 326762 319971 314063 309419 305197 300142 294521 289780
56903 289780 286544 284386 283261 283587 285049 286912 289485 293817 300003 307276 315775 326619 340145 355620
56889 355620 372991 393474 418001 446103 476285 506089 531609 548531 554566 550377 538329 521271
56877 521271 502297 484044 467636 453118 440954 432144 426921 424545 424540 427259 433336 443641 459701
56864 459701 483003 513851 551883 597491 651323 711925 774307 830502 871193 888455 879544 848707
56852 848707 804286 753997 703316 656656 617301 585955 561389 543025 531651 527772 531047 541628
56840 541628 560500 588408 626002 675120 738238 816296 908140 1011197 1119663 1221262 1298633
56829 1298633 1336788 1330106 1283166 1207026 1115042 1019431 928721 847401 777442 719321 672057
56818 672057 634186 605517 586918 578245 577888 584924 600502 626627 664561 714682 776482 847715
56806 847715 923648 996691 1056099 1089648 1088935 1054584 995455 922594 844751 768397 698513 637660
56794 637660 585908 542820 508499 482333 462581 448160 439589 437433 441230 450702 466707 490121
56782 490121 520781 557723 598790 639134 671627 690021 691364 675658 645073 604173 558976 514178
56770 514178 471801 432710 398002 368339 343410 322858 306489 293126 280840 269125 259350 252279
56758 252279 246692 241297 236371 232451 228875 224839 220669 216924 213392 209947 207185 205225 203011 199861
56744 199861 196633 194382 192899 191427 189790 188040 186135 184671 184748 186311 187847 188388 188477 188504 187768 186119
56728 186119 184888 184999 185598 185706 185772 186418 187107 187376 187912 189071 189758 189260 188839 189921 191875 193137 193407
56711 193407 193258 192665 191489 190383 189727 188712 186965 185906 186859 188836 189972 190155 190372 190377 189155 187136
56695 187136 185869 185661 185388 184638 184358 185218 186690 187935 188570 188520 187972 187441 187243 187103 186779 186491 186217 185384
56677 185384 184000 183108 183289 183688 183483 183272 183791 184344 183850 182630 181784 181540 181558 182044 183140 183936 183578 182835
56659 182835 183199 184921 187194 189650 192276 194437 195526 196241 197829 200345 202811 204738 206264 207215 207286
56644 207286 206866 206536 206106 205177 204267 204298 205377 207029 209038 211076 212145 211552 209916 208126 205945 202764
56628 202764 198984 195429 191952 187887 183287 178509 173206 167055 160971 156315 153358 151606 150976 151460 152312
56613 152312 152844 153430 154568 155749 156546 157954 161101 165390 169385 172795 176035 178613 179806 180325 181470
56598 181470 183049 183938 184307 185375 187173 188453 188769 188929 189369 189690 189913 190681 192047 193343 194295 195140 195737
56581 195737 195795 195794 196481 197656 198615 199460 200753 202268 203419 204504 206158 207996 209241 210318 212338 215344
56565 215344 218588 222147 226676 231924 237219 243273 251765 263034 275492 287183 296594 302423 304324
56552 304324 303898 303399 303470 303343 302805 302330 301631 299927 297594 295878 294961 293857 292102 289994 287363 283862
56536 283862 280353 278239 277338 276077 273773 271135 268543 265572 262268 259286 256670 254073 252054 251523 251970
56521 251970 251915 251002 249900 248356 245402 241472 238214 235984 233517 230351 227518 225421 223072 220052 217367
56506 217367 215775 214919 214616 215324 216763 217745 217928 218201 218906 219272 219042 218980 219327 219425 219326 220037 221608 222693
56488 222693 222629 222267 222120 221419 219784 218241 217669 217658 217654 217850 218210 217996 217040 216267 216290 216679 217157 218249 220182
56469 220182 222381 224515 226744 228586 228988 228055 227313 227672 228418 228654 228372 227726 226661 225735 225861 226790 227312
56452 227312 227260 227701 228751 229042 227994 226821 226484 226343 225735 225220 225287 225273 224629 223990 224009 224352 224710 225601 227217
56433 227217 228578 228741 227976 227081 226422 226090 226035 225699 224517 223029 222306 222152 221230 219127 216763 214606 212138
56416 212138 209409 207338 206042 204650 203341 203732 206571 210743 215273 220648 227398 235050 243220 252081
56402 252081 260974 268191 273015 276549 279872 282861 285405 288033 290609 292038 291978 291331 290524 289011 286930
56387 286930 285374 284481 283198 281471 280428 279796 277593 273396 269538 267862 267563 267470 268056 269640 270886 270876
56371 270876 270742 271556 272471 272565 272634 273496 274389 274830 276136 279148 282190 283406 283554 284440 285958 286805 286899 286995
56353 286995 286922 286198 285533 285910 286932 287648 288185 289090 289980 290346 290866 292504 295004 297457 299528 301144 301979
56336 301979 302276 303135 305107 307659 310629 314598 319073 322196 323457 324700 327204 329805 331445 333448 337218
56321 337218 341523 344245 345345 345996 346123 344986 343134 341745 340837 339801 338821 338341 338163 338415 340137 343527
56305 343527 346981 349226 350960 353038 354850 356089 358206 362141 366313 368928 370678 373089 375859 378114
56291 378114 380700 384736 389181 392403 395064 398987 404062 408742 412929 418024 424570 431812 439144 446303
56277 446303 452767 458560 464909 472683 481107 489334 498046 508067 518772 529523 541246 554850 569486
56264 569486 584148 599591 616897 635737 655799 678337 704343 732953 763707 798621 839736
56253 839736 886410 937459 994295 1059338 1132851 1213948 1303204 1401514 1507658 1619685 1737361
56242 1737361 1860664 1987205 2113843 2239343 2362489 2478845 2582542 2670281 2740773 2791454
56232 2791454 2819142 2823395 2806344 2769735 2714735 2643770 2559801 2464437 2359263 2248128 2135512
56221 2135512 2023497 1912741 1805159 1702858 1605655 1512618 1424975 1344604 1270792 1201600
56211 1201600 1137386 1079766 1028099 980241 935998 896572 861389 828671 798399 771565 747275
56200 747275 723837 702024 683995 669622 656959 645571 636154 627726 618589 609410 602040 595985 589338
56187 589338 582426 577162 573585 570400 568043 567595 567567 565581 562464 560922 560961 560585 560147 561651 564288 565162
56171 565162 564313 564695 567204 569959 572534 576572 581934 586390 589559 593290 597878 601798 605362 610652 617612
56156 617612 624164 630392 638607 649030 659525 669907 682363 697244 712600 728405 747177 769914
56144 769914 795503 824632 860137 902845 951152 1005326 1068171 1140676 1220853 1307127 1398540
56133 1398540 1490894 1577045 1652282 1716152 1769129 1811932 1848493 1884652 1922348 1958473 1989692
56122 1989692 2014331 2029674 2032689 2024709 2011103 1995367 1977337 1957001 1934728 1906983 1867183 1812491
56110 1812491 1745706 1670055 1587208 1501209 1418707 1343433 1274922 1213654 1162381 1121186 1086532
56099 1086532 1056794 1033767 1017321 1003878 991883 983605 979719 977211 974546 973916 976485 980260 984360
56086 984360 990430 998168 1004577 1009313 1015612 1024337 1032436 1038887 1046528 1056137 1064504 1070488 1077342 1086828
56072 1086828 1096631 1105720 1116601 1130058 1143338 1155690 1169855 1186028 1200465 1212329 1225647 1242118
56060 1242118 1258425 1273171 1289781 1309670 1329165 1346209 1363551 1382313 1399162 1413056 1427878
56049 1427878 1445050 1460449 1472159 1484297 1499485 1514604 1527866 1542967 1562240 1582718 1602943
56038 1602943 1626548 1655111 1684809 1714269 1748100 1788271 1829703 1868925 1909274 1952931 1995945
56027 1995945 2036180 2078062 2124172 2170266 2213843 2259362 2309548 2360107 2408709 2460456 2518526
56016 2518526 2578218 2636295 2697146 2763496 2830522 2895838 2965696 3044270 3126536 3208832 3296343
56005 3296343 3392677 3492523 3592634 3699353 3816900 3939212 4062245 4193035 4337188 4488821
55995 4488821 4642833 4805450 4982282 5167812 5357652 5559160 5778637 6010331 6249766
55986 6249766 6505151 6783546 7079167 7388215 7721474 8088880 8486117 8910383 9374016
55977 9374016 9887580 10445585 11044913 11700688 12427542 13223711 14091856 15056330 16140698
55968 16140698 17349607 18694709 20216628 21959195 23948212 26223696 28868977 31981760
55960 31981760 35647891 39977875 45139555 51323082 58718344 67581099 78295243 91338539
55952 91338539 107252498 126713045 150556937 179602394 214360346 254697271 299172837
55945 299172837 344034406 382867017 408171519 414568247 401386596 372609279 334485497
55938 334485497 292914298 252152721 214749330 181899473 153838396 130261560 110668936
55931 110668936 94504847 81185548 70166605 61015284 53392689 46999821 41585017
55924 41585017 36973749 33040940 29664933 26736518 24187740 21973437 20037330 18323732
55916 18323732 16805005 15467502 14282986 13218992 12263654 11414893 10656147 9965399 9337130
55907 9337130 8773309 8262324 7787221 7345730 6942809 6571791 6221164 5891973 5590961
55898 5590961 5313716 5051089 4805094 4582396 4378574 4184161 4000156 3832922 3679599
55889 3679599 3532856 3394693 3271783 3162005 3058513 2962434 2879096 2806115 2736936 2671494
55879 2671494 2611858 2552045 2483942 2409493 2336246 2264778 2190910 2115935 2043923 1972711 1898212
55868 1898212 1824191 1757543 1697155 1637189 1578073 1524568 1476157 1429062 1384882 1347765 1315584
55857 1315584 1283070 1251163 1224539 1202468 1180801 1160355 1144402 1130171 1111641 1088888 1066396
55846 1066396 1044113 1018549 990830 965364 941973 917266 892322 871213 853311 834767 816285
55835 816285 801746 790244 777040 761598 747508 735305 722360 709177 698879 690944 681912 671619
55823 671619 662493 653618 641865 628141 616175 605817 593717 579897 567566 557138 546465 536224
55811 536224 528966 523482 516259 508026 502847 501157 499624 497564 497585 500090 502907 506296 512692 521454 529194
55796 529194 535159 541083 546118 547481 545944 545162 545521 543969 539944 536096 533087 528938 523708 519477 515379
55781 515379 507788 495883 482226 467669 450792 432686 417135 405262 394760 384967 378096 374913
55769 374913 373709 373947 376272 378573 376932 371312 365844 362774 360511 358102 356891 356877 355941 353657 351620
55754 351620 349247 343702 334940 326449 319918 313349 305535 298145 292070 285767 278673 272522 267962 263435
55740 263435 258597 255291 254010 252845 251033 250062 250281 249918 248528 247939 248688 248919 247861 246958 246510 244609
55724 244609 240595 236300 232738 228776 224124 220389 218035 215458 212195 209926 209277 208755 207919 208471 211127
55709 211127 214430 217589 221454 225820 229057 231334 234818 239504 242228 241052 237436 232839 226556 218442
55695 218442 210509 204061 198141 192334 188199 186397 185247 183690 182880 183363 183546 182676 182631 184984 188672 192151
55679 192151 195588 199498 203491 207578 212358 216783 218261 216146 212663 209387 205576 201016 197393 195335
55665 195335 193128 190032 187988 188245 189088 188835 188431 189061 189787 189732 190253 192688 195943 198382 200225 202181
55649 202181 203631 204070 204535 205767 206588 205768 203879 201818 199223 195769 192249 188968 184877 179678 174843
55634 174843 171216 167581 162996 158511 155126 152157 149128 147161 146814 146612 145399 144145 143761 143205 141561
55619 141561 140016 139820 140133 139704 138912 138298 136956 134331 131926 131158 131077 130084 128419 127097 125851 124044
55603 124044 122265 121264 120507 119346 118239 117449 116134 114207 113346 114467 115912 115828 114649 113501 111960
55588 111960 109456 107179 106443 106530 106161 105714 106015 106349 105749 104984 105214 105938 106286 107103 109637 113243 116377
55571 116377 118814 120987 122277 122026 121305 121621 122689 123286 123363 123499 123251 121912 120034 118441 116693 114155
55555 114155 111543 109647 107702 104913 102419 101687 101997 101654 100756 100591 101107 101230 101076 101679 102978 104070
55539 104070 105030 106602 108522 109943 111047 112474 113700 113831 113459 113921 115140 115977 116274 116765 117362 117337 116885
55522 116885 116806 116931 116505 115732 115289 114702 112973 110554 108956 108493 107999 106724 105044 103321 101318 98738
55506 98738 95263 90406 84317 78304 73466 69395 65233 61209 57831 54478 50332 46061 42981 41132
55492 41132 39662 38509 38198 38600 39464 41594 45879 51716 58025 65228 74450 85260 95937 105658 114690
55477 114690 122735 128874 133050 136005 137813 137887 136285 133710 130437 126535 122747 119836 117453 114888 112353
55462 112353 110205 107714 104274 101163 100213 101164 102085 102060 101684 101298 100618 99936 99916 100280 100253 100047 100316 100601
55444 100601 100120 99700 100868 103153 104350 103544 101974 100724 99467 97832 96296 95269 94666 94622 95321 96008
55428 96008 95578 94197 93049 92564 92237 91990 92163 92350 91867 91191 91289 91734 91323 90430 90731 92443 93877 94050
55410 94050 93859 94201 94735 95051 95393 95679 95323 94558 94458 95139 95406 94648 93668 93144 92706 92077 91776 92077 92437
55391 92437 92482 92473 92467 92132 91675 91793 92457 92892 92881 92884 92792 92024 90931 90604 91024 90940 89893 88811 88253 87607 86546
55370 86546 85735 85492 85091 84031 82789 81866 81289 81403 82784 84949 86492 86947 87194 87710 87899 87584 87555 88027
55352 88027 88106 87440 86960 87232 87548 87466 87783 89015 90189 90198 89302 88367 87660 87223 87464 88445 89378 89619 89431 89235
55332 89235 88986 88766 89053 89858 90475 90597 90731 91169 91533 91692 92005 92299 91872 90919 90602 91145 91263 90198 88991
55313 88991 88923 89852 90924 91755 92110 91554 90282 89299 89033 88773 88128 87856 88495 89420 90041 90770 91922 92816
55295 92816 92888 92584 92304 91636 90586 90283 91361 92783 93410 93641 94251 94762 94318 93296 92614 92183 91378 90435
55277 90435 90029 90029 89856 89617 89749 90033 90111 90457 91693 93401 94719 95721 97016 98356 98823 98264 97483 97032
55259 97032 96695 96172 95556 95118 95115 95648 96362 96616 96274 95829 95435 94588 93260 92474 92949 93945 94331 94136 94078 94165
55239 94165 93816 93023 92362 91998 91530 90765 89996 89592 89728 90268 90611 90070 88737 87497 86920 86787 86998 87987
55221 87987 89735 91285 91944 92132 92347 92189 91287 90335 90158 90479 90598 90667 91232 92097 92731 93286 94175 95069 95371
55202 95371 95277 95361 95478 95101 94413 93980 93629 92722 91398 90553 90593 91095 91672 92343 93034 93446 93485 93293 92941 92528
55182 92528 92380 92663 93030 93144 93234 93696 94476 95325 96211 96989 97214 96872 96732 97355 98297 98976 99679 100866 102062
55163 102062 102462 102258 102418 103392 104809 106196 107181 107308 106463 105258 104311 103421 102183 101014 100751 101478 102505
55146 102505 103222 103324 102575 101163 99954 99598 99659 99304 98481 97675 97018 96528 96780 98286 100452 102084 102782
55129 102782 102978 102937 102640 102431 102775 103437 103733 103472 102834 101589 99395 96729 94620 93460 92888 92678 92877
55112 92877 93158 92988 92487 92289 92577 93027 93621 94646 95888 96702 97054 97673 98959 100379 101206 101349 101335 101777
55094 101777 102855 104019 104393 103847 103343 103784 104924 105969 106743 107533 108187 108226 107584 106508 104999 103189 101921
55077 101921 102048 103339 104910 106444 108058 109284 109318 108333 107496 107544 108074 108317 107897 106873 105808 105670 106928
55060 106928 108810 110165 110808 111193 111127 110003 108160 106788 106291 105858 104945 104188 104430 105665 107333 108951
55044 108951 110138 110633 110609 110495 110314 109671 108435 106926 105453 104223 103648 104055 105087 106007 106581 107045 107322
55027 107322 107027 106200 105324 104588 103840 103212 103057 103286 103457 103497 103606 103555 102904 101905 101349 101523 102134 103255 105381
55008 105381 108410 111405 113547 114595 114342 112580 109790 107068 105072 103737 103112 103695 105609 108189 110640
54993 110640 112595 113888 114408 114296 113782 112767 111174 109571 108769 108916 109675 111049 113067 114844 115165 114135
54977 114135 113166 113131 113576 113967 114576 115687 116912 117826 118521 119125 119507 119809 120525 121688 122676 123064 122996 122561
54959 122561 121680 120822 120843 121760 122548 122542 122186 122026 121897 121550 121198 120882 120149 118915 117856 117414 117222 117086 117649
54940 117649 119292 121089 121748 121090 119881 118689 117683 117206 117730 119276 121341 123277 124549 124999 125166 125966
54924 125966 127796 130265 132979 136053 139663 143729 148351 153939 160443 167003 172825 177870 182241 185353
54910 185353 186274 184604 180651 175072 168713 162412 156549 150902 145141 139281 133655 128807 125403 123723
54896 123723 123201 122996 123044 123865 125256 126049 125479 124174 123400 123784 124957 126003 126209 125908 126512 128994 132474
54879 132474 135218 136954 139068 142484 146711 151250 156484 162499 168351 173379 178061 182594 185651 185673 182645
54864 182645 177641 171442 164719 158764 154591 151592 148267 144176 140144 136745 133650 130547 127835 126078
54850 126078 125260 124789 124024 122879 122006 122116 122935 123294 122500 121080 119889 119110 118573 118397 118677 119045 119174 119315
54832 119315 119755 120163 120026 119329 118344 117232 116403 116631 118088 119660 119974 118890 117429 116564 116622 117504 118786
54815 118786 119763 119917 119244 117920 116077 114237 113386 114056 115675 117211 118091 118212 117684 116994 116820 117164 117250
54798 117250 116698 116105 115998 116021 115766 115583 115888 116438 117104 118442 120600 122499 123176 123226 123760 124566 124609 123811 123050
54779 123050 122782 122945 123845 125747 127843 129000 129473 130524 132404 134122 135348 137060 139898 143213 146371
54764 146371 149919 154751 160918 167882 175272 182706 189322 194073 196362 196222 194186 190983 186953 181755
54750 181755 175152 168010 161824 157152 153208 149139 145089 141756 139531 138388 138073 138000 137386 135922 134169
54735 134169 132996 132686 132720 132413 131741 131452 132217 133712 135011 135973 137561 140413 143821 146821 149763 153890
54719 153890 159650 166311 173060 179515 185183 189271 191284 191265 189420 185993 181445 176248 170599 164781 159458
54704 159458 154969 150686 145960 141401 138241 136604 135464 134313 133675 133801 134005 133688 133041 132234 130812 128506
54688 128506 125959 124018 122781 121821 120929 120263 120133 120902 122650 124671 125839 125824 125521 125939 127030 127915 127865
54671 127865 126803 125240 124016 123752 124281 124813 124791 124310 123694 123119 122741 122674 122684 122417 122065 122301 123294 124280 124390
54652 124390 123487 122020 120559 119749 120142 121589 123124 123867 123807 123429 122958 122352 121792 121733 122488 123971 125725
54635 125725 127117 127664 127377 126680 125939 125251 124639 124188 123927 123864 124132 124759 125327 125294 124719 124189 123953 123650 123123
54616 123123 122863 123186 123460 122776 121201 119790 119363 119731 120242 120623 121050 121621 122178 122628 123138 123812 124372 124468
54598 124468 124234 124202 124626 125232 125737 126292 127145 128161 128885 128900 128017 126429 124907 124414 125167 126309 126801 126326
54580 126326 125192 123820 122723 122473 123103 123850 123963 123487 122835 122088 121250 120730 120838 121177 121207 121084 121195 121266
54562 121266 120812 120202 120358 121525 123197 125052 127042 128675 129249 128867 128342 128061 127854 127888 128688 130104 131308
54545 131308 132003 132685 133469 133705 133161 132602 132676 133086 133367 133711 134401 135143 135607 136130 137257 138977 140826 142384
54527 142384 143261 142982 141352 138779 136060 133996 133095 133168 133282 132746 132076 132301 133372 134227 134460 134805 135702
54510 135702 136487 136566 136320 136125 135451 133831 132037 131239 131420 131481 130706 129402 128286 127850 128197 129022 129845 130515
54492 130515 131264 132081 132471 132116 131290 130338 129274 128265 127943 128757 130386 132169 133698 134693 134925 134695 134794
54475 134794 135492 136110 136105 135946 136298 136944 137280 137381 137776 138514 139235 139945 140968 142292 143613 144852 146000 146615
54457 146615 146188 144987 143971 143750 144011 143962 143049 141335 139477 138231 137758 137487 136819 135702 134449 133376
54441 133376 132795 132868 133215 133205 132853 132823 133215 133168 132251 131466 132006 133594 134972 135663 136228 136969 137395 137086 136378
54422 136378 136041 136737 138721 141541 144120 145646 146315 146783 147130 146959 146304 145680 145242 144599 143577 142596 142123
54405 142123 142137 142274 142184 141747 141225 141152 141833 142994 144177 145237 146183 146871 147288 147798 148630 149395 149704 149951 150770
54386 150770 151925 152523 152286 151873 151854 152126 152471 152964 153513 153600 152953 152117 151930 152616 153644 154356 154536 154443 154467
54367 154467 154754 155153 155485 155718 155870 155973 156281 157211 158850 160818 162832 165074 167605 169805 170973 171250
54351 171250 171357 171549 171458 171012 170883 171759 173561 175599 177209 178076 178188 177737 177037 176435 176148 176012 175408 173694
54333 173694 170889 167701 164796 162281 159987 157831 155709 153526 151631 150779 151216 152229 153005 153480 153836
54318 153836 153702 152709 151480 151146 151880 152667 152575 151602 150280 149139 148691 149204 150196 150664 150132 149116 148318 147686
54300 147686 146592 144756 142727 141433 141273 141715 141899 141612 141345 141346 141173 140487 139800 139930 141096 143058 145685
54283 145685 148669 151051 151944 151686 151474 151851 152280 152215 151844 151576 151552 151833 152480 153145 153229 152728 152402 152760 153402
54264 153402 153755 153992 154760 156213 157783 158824 159181 159194 159361 159965 160839 161491 161483 160776 159788 159167 159300 159898 160187
54245 160187 159683 158644 157630 156883 156395 156227 156350 156347 155755 154675 153648 152997 152582 152178 151771 151553 151704 152014
54227 152014 151596 149564 146337 143745 143219 144274 145419 146047 146513 146715 145926 144204 142917 143343 145397 148027
54211 148027 150296 151788 152595 153320 154655 156562 158176 158723 158263 157379 156574 156056 155748 155235 154026 151997
54195 151997 149408 146531 143687 141531 140747 141287 142380 143430 144509 145920 147677 149513 151026 151798 151790 151560
54179 151560 151604 151637 151136 150476 150647 151794 152995 153691 154346 155269 155757 155163 154071 153567 153791 154000 153736 153196
54161 153196 152626 152023 151371 150633 149612 148266 147088 146715 147203 148060 148855 149414 149559 149161 148498 148085 148094 148278
54143 148278 148598 149440 150940 152397 152842 152157 151284 151197 151979 153064 154112 155219 156346 157047 156955 156204 155207
54126 155207 154316 153838 153955 154329 154213 153402 152717 153060 154293 155518 156205 156455 156433 156236 156164 156449 156820 156999 157487
54107 157487 159034 161321 162988 163170 162299 161219 160280 159584 159395 159899 160984 162520 164319 165729 165940 164953
54091 164953 163620 162442 161103 159519 158500 158665 159367 159503 158992 158673 159004 159624 160095 160404 160681 161012 161661
54074 161661 163022 165128 167428 169247 170414 171380 172699 174438 176128 177348 178230 179243 180693 182698 185447
54059 185447 189088 193439 198266 203768 210328 217843 225749 233568 240774 246184 248339 246821 242636 237128
54045 237128 231160 225525 221300 219158 218736 219182 220005 221130 222599 224615 227527 231409 235926 240794 245952
54030 245952 251115 255756 259811 263780 267716 270759 272234 272705 273365 274703 276385 278032 279518 280681 281373
54015 281373 281677 281638 280855 278755 275197 270591 265523 260518 255916 251701 247566 243296 238927 234533 230223
54000 230223 226418 223587 221550 219571 217391 215543 214316 213066 211067 208509 206072 203995 202184 200783
53986 200783 199942 199268 198181 196679 195197 193881 192475 190827 189112 187682 186943 187091 187664 187755 187083 186490
53970 186490 186949 188459 190402 192530 194975 197611 200143 202665 205483 208439 210982 212928 214750 217128
53956 217128 220473 224635 228761 231689 232934 233061 232786 232089 230651 228741 227030 225773 224806 224159 224113 224785
53940 224785 226182 228504 231873 235855 239726 243084 245929 248420 250908 253834 257164 260351 263309 266811
53926 266811 271291 275905 279683 283054 287167 292109 297041 301909 307676 314765 322416 329814 336840 343557
53912 343557 350115 357473 367004 378777 391260 403348 415704 429270 443285 455786 465466 471993
53900 471993 474854 473089 466376 455705 442747 428985 415383 402370 389935 378030 366893 356743
53888 356743 347305 338063 329008 320681 313359 306614 299957 293571 288004 283280 278759 273978 269301 265551
53874 265551 263169 261866 260891 259410 256846 253284 249538 246516 244411 242689 240776 238470 235816 233010
53860 233010 230448 228343 226233 223424 220096 217374 215936 215120 213787 211659 209257 206945 204633 202290
53846 202290 200179 198616 197731 197391 197187 196767 196396 196784 198102 199605 200604 201260 201981 202521 202338 201475 200467
53829 200467 199653 199170 199239 199741 199828 198757 197011 195884 196021 197004 198194 199296 200218 201123 202596 205059 208025
53812 208025 210553 212324 213602 214364 214484 214850 217169 222180 228748 235127 240549 245199 249329 253016 256512
53797 256512 260299 264738 269737 274598 278331 280534 281939 283691 286117 288641 290818 292787 294631 295937
53783 295937 296236 295397 293408 290265 286304 282136 278040 273796 269279 264776 260527 256452 252509 248870 245481
53768 245481 241921 237968 233956 230287 226927 223682 220644 218074 216034 214363 212840 211244 209472 207681
53754 207681 206114 204794 203632 202788 202530 202718 202826 202536 201956 201223 200356 199591 199373 199831 200598 201311 201932 202478
53736 202478 202816 202961 203215 203798 204602 205400 206072 206529 206685 206597 206471 206534 207056 208352 210384 212504 213974 214700
53718 214700 215141 215674 216486 217862 219949 222320 224411 226332 228622 231246 233545 235216 236604 237928 238946
53703 238946 239594 240296 241419 243039 245350 248592 252379 255882 258957 262325 266253 269868 272389 274312 276690
53688 276690 279633 282195 283508 283550 282965 282475 282252 281696 280132 277849 275975 275145 274858 274401 273739 273046 272025
53671 272025 270415 268773 267984 268153 268510 268341 267536 266266 264593 262561 260464 258867 258266 258603 259223 259534
53655 259534 259675 260220 261305 262449 263133 263089 262136 260381 258589 257677 257677 257810 257694 257787 258464 259473 260616 262132
53637 262132 263978 265488 266324 267086 268381 269844 270755 271160 271789 273192 275414 278181 280924 283069 284772
53622 284772 286971 290284 294325 298491 302842 307592 312317 316420 320018 323697 327634 331603 335579 339705
53608 339705 343842 347702 351263 354573 357407 359615 361552 363631 365671 367185 368108 368826 369723 371134 373371
53593 373371 376244 378881 380579 381622 382726 383965 384797 384869 384115 382267 378986 374458 369303 363983 358759
53578 358759 354070 350325 347364 344663 342098 340051 338727 337794 336734 335317 333769 332685 332536 333012 333117
53563 333117 332250 330892 329946 329812 330540 332298 334955 337578 339180 339826 340309 340915 341368 341940 343613 346796
53547 346796 350559 353597 355500 356762 357929 359225 360837 363105 366245 369993 373838 377731 382401 388587
53533 388587 396073 403934 411752 420042 429365 439679 450807 462828 475574 488430 501126 514115
53521 514115 527599 540932 553742 566949 581665 597598 613673 629904 647449 666860 687422
53510 687422 708424 730103 753050 777424 803008 829337 855515 880487 903828 925840 946813
53499 946813 966675 985460 1003539 1021183 1038312 1054835 1070866 1086559 1102095 1117849 1134135
53488 1134135 1150768 1167226 1183280 1199104 1214931 1231017 1247785 1265402 1283207 1300078 1315351
53477 1315351 1328970 1340889 1350907 1359018 1365273 1369292 1370490 1368845 1364927 1359153 1351543 1342097 1330823
53464 1330823 1317451 1301893 1285097 1268682 1253455 1238815 1223736 1207732 1190666 1172310 1152559
53453 1152559 1131710 1110203 1088357 1066501 1045013 1024129 1003985 984919 967360 951417 936938
53442 936938 923944 912548 902530 893508 885583 879250 874678 871590 869889 869769 871097 873254 875819 878875
53428 878875 882546 886808 891957 898668 907352 917804 929677 942853 957265 972867 989936 1008868
53416 1008868 1029498 1051101 1073254 1096259 1120556 1146282 1173536 1202536 1233211 1265092 1297878
53405 1297878 1331767 1367093 1404118 1443261 1484991 1529234 1575348 1622926 1672123 1722980 1774959
53394 1774959 1827453 1880309 1933552 1986975 2040320 2093508 2146388 2198496 2249217 2297866 2343653
53383 2343653 2386110 2425676 2463359 2499528 2533396 2563766 2589756 2610780 2626572 2637594 2644791
53372 2644791 2648516 2647994 2642078 2629987 2611182 2585178 2552000 2512421 2467534 2418579 2367304 2315559
53360 2315559 2263942 2211481 2157329 2102280 2048058 1995631 1944939 1895848 1848554 1803148 1759452
53349 1759452 1717258 1676327 1636290 1596890 1558121 1519883 1481878 1444263 1407951 1373711 1341379
53338 1341379 1310552 1281711 1255795 1232879 1212148 1193262 1176874 1163479 1152355 1142075 1131599
53327 1131599 1120517 1108651 1095998 1082984 1070278 1058224 1046732 1035824 1025959 1017571 1010482 1004221
53315 1004221 998848 994975 992800 991662 990986 991268 993473 997689 1002979 1008536 1014377 1020968 1028841 1038769
53301 1038769 1051644 1067762 1086476 1106723 1127677 1149037 1171159 1194905 1220743 1247953 1275251
53290 1275251 1302192 1329255 1356511 1383061 1408057 1431392 1453009 1472387 1489289 1504224 1517447
53279 1517447 1528134 1535271 1538801 1539138 1536113 1529357 1519444 1507675 1494730 1480277 1463917 1445838 1426423
53266 1426423 1405772 1383770 1360243 1335055 1308407 1281032 1253736 1226670 1199330 1171250 1142434
53255 1142434 1113214 1084038 1055392 1027645 1000928 975245 950554 926620 903029 879546 856279
53244 856279 833303 810413 787578 765355 744453 724972 706412 688422 671217 655329 641141
53233 641141 628710 617896 608560 600519 593270 585978 578132 570064 562359 554846 546716 537604 527877 517731
53219 517731 506786 494899 482661 470704 459099 447863 437391 427877 418904 410182 402102 395016
53207 395016 388559 382327 376619 371727 367019 361628 355643 349702 343750 337241 330409 324275 319273 314767
53193 314767 310125 305495 301270 297406 293606 289731 285816 282006 278574 275719 273372 271436 270047 269172
53179 269172 268201 266511 264338 262516 261404 260625 259790 258880 257866 256616 255277 254183 253246 251949 250133
53164 250133 248311 247012 246186 245430 244490 243360 242216 241335 240758 240023 238609 236694 235076 234180 233555 232581
53148 232581 231387 230771 231274 232487 233255 232610 230591 228157 226264 225202 224817 225022 225853 227326 229502 232357
53132 232357 235305 237250 237585 236788 235617 234162 232338 230831 230622 231665 232947 233883 234820 236078 237358
53117 237358 238432 239656 241354 243196 244669 245731 246602 247200 247193 246531 245638 245087 245052 245010 244115 242111 239722
53100 239722 237842 236531 235234 233760 232374 231054 229412 227520 226135 225772 226079 226415 226605 226813 227071 227272
53084 227272 227341 227233 226992 226910 227269 227840 228011 227535 226696 225685 224413 223127 222548 222929 223498 223427 223011 223275 224599
53065 224599 226266 227323 227452 226911 226061 225061 223888 222495 220979 219550 218341 217322 216479 215931 215779 215974
53049 215974 216420 217099 217995 218980 219838 220321 220214 219487 218370 217143 215856 214399 212788 211206 209809 208768
53033 208768 208400 208864 209684 210017 209597 209150 209589 210983 212541 213525 213954 214454 215517 216989 218205 218599 218109
53016 218109 217046 215848 215025 215043 215913 217087 218049 218906 220053 221402 222380 222709 222736 222882 223082 222956 222317 221373
52998 221373 220534 220099 220042 220139 220280 220482 220532 220005 218972 218364 219125 221161 223509 225368 226514 226938 226774 226586
52980 226586 227081 228397 230074 231734 233304 234581 235239 235410 235712 236518 237689 239163 241145 243486 245442
52965 245442 246489 246920 247253 247459 247212 246594 246114 246133 246561 246953 246714 245438 243297 240961 239014 237535 236274
52948 236274 234907 233144 230972 228934 227740 227448 227376 226998 226478 226118 225799 225278 224610 223902 223006 221875 220823
52931 220823 220022 219088 217709 216378 215890 216225 216534 216226 215526 214875 214393 214145 214452 215494 216810 217637 217695 217336
52913 217336 216893 216305 215541 215051 215374 216348 217147 217200 216678 215968 215101 214059 213213 212935 212939 212558 211617 210593 209926
52894 209926 209685 209920 210906 212817 215497 218567 221498 223574 224177 223311 221680 220284 220013 221219 223216 224496
52878 224496 224161 223045 222704 223392 223902 223493 222930 223224 224248 225307 226371 227945 230154 232754 235770 239330
52862 239330 242901 245411 246251 245793 244820 243821 242913 242083 241328 240642 239987 239227 238140 236493 234135 231058 227494
52845 227494 223878 220520 217334 214147 211225 209169 208247 208073 208018 207685 206942 205840 204641 203761 203602 204508
52829 204508 206623 209477 211941 213119 213204 212979 212636 211733 210222 208748 207794 207287 207205 207769 208717 209186 208799
52812 208799 208236 208253 208737 209261 209983 211372 213435 215780 218098 220033 220863 219880 217041 212978 208667 205189
52796 205189 203237 202475 201858 200999 200630 201256 202114 202222 201875 202159 203274 204327 204657 204429 203957 203289 202650 202569
52778 202569 203313 204685 206456 208435 210020 210328 209179 207538 206609 206626 206813 206373 205333 204484 204593 205670
52762 205670 206972 207707 207699 207380 207288 207596 207998 208021 207587 207246 207591 208533 209502 210256 210943 211402 211143 210250 209596 209762
52742 209762 210457 211378 212880 215131 217328 218699 219736 221482 223907 226035 227435 228554 229586 230108 230070
52727 230070 230232 231205 232698 234085 235104 235668 235521 234604 233394 232437 231699 230673 228960 226598 223991 221741
52711 221741 220320 219624 218939 217544 215397 213143 211453 210445 209762 209141 208748 208848 209339 209882 210393 211057 211821
52694 211821 212354 212672 213297 214534 215965 217037 217796 218641 219683 220779 221933 223217 224429 225269 225728 225974
52678 225974 226032 225912 225854 226034 226210 226031 225579 225232 225139 225141 225069 224826 224354 223849 223701 223961 224155 224000 223936 224510 225585
52657 225585 226727 228000 229772 231984 234298 236762 239656 242750 245365 247110 247931 247541 245514 242035 237997
52642 237997 234264 231232 229065 227756 226945 226234 225749 225896 226607 227349 227907 228561 229451 230398 231522 233402 236256
52625 236256 239353 241668 242831 243249 243411 243287 242346 240213 237319 234731 233158 232351 231675 230916 230228 229692
52609 229692 229434 229823 230941 232139 232721 232866 233209 233763 233954 233603 233080 232545 231844 231194 231232 232228 233807 235477
52591 235477 236868 237521 237147 236163 235351 235031 235086 235560 236419 236961 236502 235629 235676 236826 237907 238269 238636 239653
52573 239653 240740 241119 240954 240715 240265 239458 238894 239157 239844 240196 240211 240275 240148 239274 237907 237045 237175 237732 237813
52554 237813 236981 235474 234044 233470 233783 234141 233838 233226 233137 233649 234035 233875 233571 233684 234274 235133 236220 237557
52536 237557 238834 239470 239143 238120 236955 235916 234912 234053 233877 234687 235894 236514 236259 235648 235118 234656 234386
52519 234386 234786 235985 237335 238144 238554 239336 241065 243695 246710 249521 251961 254512 257790 261716 265523
52504 265523 268512 270381 270824 269488 266532 262736 258804 255065 251910 249733 248180 246261 243707 241568
52490 241568 240890 241385 241984 242147 241993 241677 241375 241521 242341 243350 243896 243965 243915 243783 243538 243707 244964 247173
52472 247173 249429 251021 251927 252554 253515 255368 257946 260137 261010 261050 261614 263303 265603 268010 270598 273285
52456 273285 275383 276346 276391 275996 275170 273618 271284 268351 264881 260790 256165 251497 247633 245316 244470 243999
52440 243999 242764 240817 239282 238881 239069 238858 237970 236774 235483 234137 233211 233437 234744 235949 236029 235450
52424 235450 235708 237584 240303 242485 243509 243730 243824 244309 245501 247452 249877 252373 254721 256898 258994
52409 258994 261412 264895 269994 276635 284527 293735 304290 315332 325182 332256 335508 334273 328590 319820
52395 319820 310178 301232 293273 286191 280230 275597 272082 269538 268163 267898 268093 268276 268741 269891 271508
52380 271508 273186 274963 276900 278500 279253 279474 279977 281169 283112 286123 290513 295787 300853 305063 308505
52365 308505 311341 313455 314824 315680 316192 316346 316198 315831 315118 313917 312549 311633 311403 311561 311827 312260 312947
52348 312947 313723 314378 314955 315744 317116 319330 322280 325462 328364 330912 333401 336129 339331 343379 348731
52333 348731 355581 363619 372147 380485 388542 397052 406967 418441 430709 443171 456223 470668 486566
52320 486566 503108 519415 535128 550298 565089 579619 593870 607818 621680 635820 650264
52309 650264 664611 678560 692196 705553 718396 730735 743121 755917 768686 780746 792010
52298 792010 802711 812546 820712 826715 830713 833192 834604 835065 834011 830531 824537 817307 810292 803706
52284 803706 796869 789585 782409 775776 769734 764550 760785 758637 757881 758516 760817 764609 769157 774019 779532
52269 779532 786242 794325 803665 813999 824792 835417 845683 855803 865734 875084 883945 893408 904775
52256 904775 918308 932866 946738 958812 969168 978601 987593 995870 1003004 1008975 1013716 1016479 1016323
52243 1016323 1013177 1007914 1001372 993831 985402 976338 966826 956950 946995 937409 928392 919828 911638 903792
52229 903792 896062 888275 880845 874539 869530 865109 860506 855689 851274 847927 845894 844834 844159 843790 844431
52214 844431 846681 850117 853784 857376 861277 865557 869779 873876 878362 883347 888081 891865 894883 897690
52200 897690 900418 902873 905103 907399 910032 913250 917299 922167 927499 932879 937959 942357 945897 949032
52186 949032 952483 956196 959122 960247 959385 956703 952089 945493 937466 928830 919985 910981 902130 894075
52172 894075 887264 881608 876657 872021 867745 864376 862497 862142 862824 864212 866475 869835 874068 878607 882923
52157 882923 886681 889745 892152 893885 894649 894152 892672 890984 889615 888417 887000 885323 883786 883020 883608
52142 883608 885651 888502 891226 893341 894798 895390 894821 893449 892333 892238 893123 894914 898215 903869 912219
52127 912219 923146 936419 951672 968464 986832 1007372 1030348 1055086 1080646 1106662 1133012
52116 1133012 1159111 1184264 1208446 1231915 1254155 1273967 1290746 1304993 1317330 1327673 1335776
52105 1335776 1342084 1347520 1352527 1356794 1359873 1361772 1362888 1363617 1364198 1364715 1365042 1364746 1363256 1360193 1355389
52090 1355389 1348500 1338817 1325743 1309543 1291443 1272937 1255056 1238278 1222948 1209615 1198897 1191029
52078 1191029 1185651 1182196 1180430 1180376 1181718 1183712 1185946 1188913 1193503 1200150 1208726 1218990 1230685 1243355
52064 1243355 1256485 1269720 1282648 1294635 1305330 1315125 1324518 1333195 1340373 1346010 1351006 1356065 1360986
52051 1360986 1365236 1368563 1370702 1370893 1368172 1362033 1352763 1341267 1328489 1314676 1299331 1282240 1264355
52038 1264355 1247094 1230885 1215116 1199513 1184797 1171786 1160594 1150952 1142578 1134870 1126836 1117855
52026 1117855 1108138 1098177 1088192 1078340 1068881 1059775 1050593 1041170 1031922 1023161 1014707 1006572 999450 993869
52012 993869 989205 984083 977597 969742 960894 951305 940985 929780 917636 904835 891666 877860 862815
51999 862815 846457 829312 811598 793044 773998 756002 740640 728247 718172 709657 701792 693324
51987 693324 683488 672866 662685 653418 644681 636233 628241 620533 612300 602761 591750 579625 566907
51974 566907 554043 541286 528832 517243 507490 500319 495797 493678 493834 495971 499382 503501 508463
51961 508463 514591 521583 528747 535879 543275 550876 557798 562700 564350 562117 556418 548647 540278 532064
51947 532064 524313 517584 512659 510081 510214 513463 519780 528074 536901 545966 556401 569354 584601 600681
51933 600681 616054 629911 642037 652059 658899 661148 658156 650604 639859 626949 612390 596688
51921 596688 580496 564301 548256 532404 516991 502640 490245 480468 473194 467774 463896 461825
51909 461825 461693 463130 466041 471243 479829 492222 508348 528299 552151 579184 607719 635477 659662
51896 659662 677137 685386 683489 671949 651957 625426 595361 565154 537186 512447 491348 474175
51884 474175 460680 449961 441212 434329 429727 427784 428526 431554 436255 442309 449926 459297 469898 480697
51870 480697 490877 499995 507497 512609 514826 514182 510953 505333 497474 487742 476975 466510 457707 451246
51856 451246 447070 445033 445118 446842 449065 450947 452616 454350 455554 455243 453272 450341 446988 443251 439168
51841 439168 434847 430081 424592 418699 413178 408443 404366 400874 398171 396414 395673 396142 397914 400586 403549
51826 403549 406445 408853 409876 408855 406364 403657 401172 398319 394747 390979 387754 385508 384604 385266 387103
51811 387103 389452 392322 396240 401042 405662 409303 411972 413603 413660 412084 409724 407173 403966 399676 395159
51796 395159 391813 390000 388941 387847 386395 384324 381487 378363 375853 374328 373319 372279 371260 370665
51782 370665 370628 370890 371135 371168 370778 369729 368121 366634 366076 366591 367628 368894 370926 374437 379385 385193
51766 385193 391662 399141 407879 417677 428091 438468 447806 455053 459600 461163 459407 454270 446614 437888
51752 437888 429037 420254 411782 404262 398094 393066 388891 385627 383329 381765 380701 380126 380084 380729 382674
51737 382674 386774 393346 401948 411970 422855 433570 442546 448668 452028 453524 454072 454431 455337 457322
51723 457322 460441 464130 467100 467614 464577 458618 451636 445184 439698 435242 432140 430475 429566 428408 426281
51708 426281 422785 417884 412304 407428 404432 403827 405814 410320 416232 421338 423776 423405 421454 419243 417592
51693 417592 417023 417902 420361 424197 428575 431861 432401 429774 424871 418688 411725 404686 398694 394161 390289
51678 390289 386481 383596 382920 384450 387112 390318 394278 399000 403928 408648 413221 417912 423229 430107
51664 430107 439174 449703 459885 468170 473734 475783 473390 466507 456533 445533 435273 427145 422340
51651 422340 421503 424464 430637 439383 449603 459314 466154 468483 465889 458929 448804 437177 425679
51638 425679 415191 405682 396941 389303 383434 379456 376610 373886 370840 367695 364874 362597 360769 359095
51624 359095 357448 356201 355980 356841 357948 358360 357964 357261 356440 355113 352949 350122 347157 344689 343352 343430
51608 343430 344495 345648 346237 346198 345947 346282 348150 351928 356959 362287 367771 373925 380834 388036 395552
51593 395552 404203 414507 425697 436015 443530 446701 445005 439467 432113 424599 417654 411705 407294
51580 407294 404681 403827 405043 408959 415582 424192 434508 447028 461663 476992 491769 506533 522823
51567 522823 541152 560476 579247 596298 611135 624428 638285 655428 677931 706834 742459
51556 742459 784356 830984 879800 927527 970224 1003880 1025906 1036139 1036026 1026944 1009577 984412
51544 984412 952173 913850 870883 825249 779039 733976 691458 652669 618201 587783 560783
51533 560783 536863 516018 498308 483738 471976 462053 452921 444555 437781 432717 428197 423336 418774
51520 418774 415518 413208 410518 406865 402777 398881 395437 392657 390630 389061 387772 387278 388099 389704 390882
51505 390882 391049 390566 390020 389947 390998 393482 396766 399834 402348 404427 405651 405217 403158 400594 398614 397473
51489 397473 396934 396740 396646 396444 395988 394872 392384 388375 383832 379895 376565 373081 369268 365578 362012 358020
51473 358020 353515 349085 345121 341545 338447 336138 334436 332689 330661 328688 326881 324914 322660 320300
51459 320300 317827 315273 313418 313267 314704 316623 318588 321298 325109 329213 332846 336421 340817 346367
51445 346367 353150 361607 372187 384894 399668 416511 434518 451304 464293 472417 476213 476693 474817
51432 474817 471750 468763 466498 464409 460920 454251 443604 429935 415427 402043 390664 381392 374020
51419 374020 368066 362965 358663 355677 354369 354518 355710 357675 360056 362421 364772 367529 370722 373759
51405 373759 376282 378715 381593 384864 388325 392229 396906 402152 407502 412809 418029 422730 426448 429441
51391 429441 432635 436791 442038 448133 454888 462433 471366 482670 497350 516165 539644 568136 601796
51378 601796 640750 685356 735960 792261 853060 916496 979889 1039304 1090030 1128336 1152859
51367 1152859 1164177 1163278 1150662 1126612 1091960 1048541 998918 945480 889760 832757 775810 720805
51355 720805 669598 623619 583867 550568 522735 498805 478079 461027 447883 437542 428319 419379
51343 419379 410913 403309 396650 390865 385847 381408 377352 373585 370107 367020 364530 362681 361100 359408
51329 359408 357777 356549 355298 352980 349220 344789 340512 336421 332427 329126 327241 326708 326929 327578 328559
51314 328559 329497 329981 330148 330470 331047 331653 332387 333702 335685 337797 339529 341063 343093 346080 349776 353546
51298 353546 357088 360620 364173 367027 368300 367950 366626 364602 361609 357850 354364 351960 350369 348907
51284 348907 347460 346400 345992 346389 347790 350146 353006 355980 358940 361491 362844 362687 361691 360655 359736
51269 359736 359040 359267 360924 363386 365708 367994 370975 374372 376759 377163 375937 373915 371550 369225 367609
51254 367609 367109 367263 367120 366080 364212 361969 359779 357806 355915 353914 351761 349500 347185 345084 343737
51239 343737 343448 343815 344158 344396 345192 347086 349729 352049 353139 352934 352095 351204 350219 348868 347336 346028
51223 346028 344706 342637 339882 337709 337194 337909 338648 338957 339196 339488 339571 339628 340368 342072 344227 346342 348585
51206 348585 351328 354484 357593 360321 362655 364790 367008 369561 372605 376175 380056 383593 385946 386781
51192 386781 386474 385428 383593 381049 378595 376974 375758 373862 371221 369156 368732 369409 369742 368982 367477
51177 367477 365878 364539 363628 363309 363525 363856 363815 363284 362541 361841 361200 360675 360642 361428 362839 364441 366338 369152
51159 369152 373044 377189 380554 382840 384386 385420 385759 385001 382761 379121 375076 372087 370714 370114 369343
51144 369343 368614 368643 369231 369527 369486 370018 371574 373489 374996 376064 376789 376720 375424 373313 371240 369441 367411
51127 367411 364786 361939 359656 358506 358597 359676 361222 362547 363184 363382 364018 365703 368057 370204 371921
51112 371921 373799 376187 378623 380629 382488 384736 387341 390015 392965 396602 400648 404261 407070 409497
51098 409497 412052 414794 417502 419779 421014 420834 419732 418696 418013 416944 414769 411702 408566 405983 404131
51083 404131 402926 402118 401425 400758 400150 399435 398326 396961 395961 395718 395899 395954 395861 396123 397188 399152 401945
51066 401945 405561 410073 415467 421528 427944 434781 442949 453950 468770 486699 505136 520721 531203
51053 531203 536732 539636 543023 549452 560331 575595 593468 611154 626663 640106 652669 664336
51041 664336 673099 676616 674230 667225 657586 646961 636530 627038 618346 608969 596653 580021 559863
51028 559863 538639 518735 501368 486916 475540 467127 461185 457354 455744 456365 458555 461475 464880
51015 464880 468880 473206 477392 481637 486802 493436 501277 509815 518825 528280 538190 548796 560494 573262
51001 573262 586288 598398 608875 617894 626260 634669 643211 651650 660110 669075 678557 687723 695666
50988 695666 702163 707386 711357 714257 716827 719808 723271 727127 731970 738545 746566 754834 762507 769526
50974 769526 775943 781872 788337 797252 810076 827029 847942 873202 903432 938656 978297 1021760
50962 1021760 1068706 1118879 1171820 1226599 1281899 1336620 1390337 1442825 1493207 1540063 1582324
50951 1582324 1619628 1651885 1679026 1701134 1718254 1730149 1736996 1740364 1742866 1746639 1752607 1760917
50939 1760917 1770907 1780325 1785725 1784664 1777368 1765959 1752507 1738030 1722583 1705517 1685823 1662749
50927 1662749 1636109 1606015 1572668 1536432 1497543 1455589 1409930 1360974 1310470 1260184 1210834
50916 1210834 1162732 1116828 1074414 1036136 1001791 970853 942770 917105 893881 873527 856029
50905 856029 840425 825607 811418 798427 786808 775951 765172 754371 743942 734341 725847 718621
50893 718621 712828 708599 705787 703936 702721 702255 702597 703171 703237 702890 702937 703764 705011 706513 708708 711818
50877 711818 715428 719392 724381 730927 738533 746422 754672 763910 774320 785648 797873 811191 825612
50864 825612 841232 858615 878244 899903 923374 949576 980134 1015726 1055615 1098996 1146248
50853 1146248 1198642 1257315 1322816 1395308 1474933 1561997 1656765 1758919 1867291 1980389 2097160
50842 2097160 2217097 2339699 2464017 2588362 2710049 2825479 2930914 3023362 3100721 3161515
50832 3161515 3205023 3231675 3242953 3240828 3227378 3204804 3175549 3142500 3109219 3079569 3056560
50821 3056560 3041494 3034391 3034895 3042174 3054012 3066659 3075851 3077815 3069463 3048378 3013108 2963360 2899607
50808 2899607 2822538 2733005 2632372 2522728 2406728 2287277 2167359 2049889 1937394 1831649
50798 1831649 1733724 1644426 1564483 1494067 1432492 1378935 1333393 1296423 1267860 1246359 1230369
50787 1230369 1219048 1211919 1208120 1206401 1205599 1204812 1203482 1201658 1199831 1198042 1195383 1190760 1183969 1175663
50773 1175663 1166418 1156204 1144680 1131660 1117260 1101817 1085672 1068891 1051251 1032500 1012565
50762 1012565 991620 970265 949565 930522 913481 898396 885530 875254 867213 860550 855195 852144
50750 852144 852082 854522 858794 865047 873649 884372 897042 912401 931373 953856 979169 1007436 1039684
50737 1039684 1076691 1118561 1165184 1216302 1271177 1328999 1389670 1453504 1520118 1588167 1656140
50726 1656140 1722856 1787380 1849179 1908324 1964789 2017570 2065160 2106851 2142649 2171643 2191257
50715 2191257 2198652 2192626 2174207 2146057 2111623 2074296 2036814 2001275 1969540 1943272 1923645 1911303
50703 1911303 1906347 1907947 1914212 1923148 1933573 1944452 1953513 1957448 1953586 1940598 1917525 1883273 1837697
50690 1837697 1782488 1720477 1654554 1587544 1522304 1461062 1404875 1354214 1309732 1272016 1241001
50679 1241001 1216250 1197673 1185470 1179583 1179727 1185890 1198302 1216848 1240822 1269183 1300684 1333749
50667 1333749 1366693 1398308 1428021 1455333 1479343 1499163 1514783 1527292 1538120 1548230 1558160
50656 1558160 1568509 1579891 1592321 1605124 1617659 1629869 1642029 1654465 1667931 1683827 1703402
50645 1703402 1726859 1753720 1783921 1817961 1856078 1897941 1943227 1991865 2043402 2096496 2149308
50634 2149308 2200096 2247337 2289824 2327126 2359859 2389269 2416697 2443610 2471717 2501996 2532495
50623 2532495 2556738 2565149 2549790 2509288 2449808 2381368 2313128 2251265 2199367 2159043 2130139
50612 2130139 2111425 2101632 2099625 2103848 2112268 2122841 2133391 2141004 2142326 2134759 2116938 2088099 2047775
50599 2047775 1996462 1936007 1868939 1797766 1724962 1652865 1583010 1515888 1451824 1391764 1336918
50588 1336918 1287976 1245025 1207935 1176387 1149771 1127405 1108720 1093030 1079332 1066744 1054971
50577 1054971 1044066 1033890 1024155 1014964 1007001 1001056 997427 995792 995623 996829 999962 1005658 1013886 1023907
50563 1023907 1035049 1047408 1061761 1078860 1098739 1120610 1143611 1167899 1194750 1225266 1259157
50552 1259157 1295162 1332273 1369781 1406279 1439783 1469349 1495890 1520808 1544362 1566113 1586661
50541 1586661 1608156 1632965 1662319 1696352 1735030 1778759 1828379 1884824 1948809 2020567 2099756
50530 2099756 2185798 2278555 2378682 2486992 2603345 2726363 2854322 2985887 3119680 3253514
50520 3253514 3384597 3510252 3627962 3734842 3827688 3903550 3959914 3994569 4005991 3993942
50510 3993942 3959252 3903093 3827049 3733769 3626848 3509955 3386744 3261550 3139326 3024570
50500 3024570 2920910 2831840 2760856 2710267 2680425 2670665 2680441 2708994 2754178 2812092 2877509
50489 2877509 2944234 3005402 3054035 3083634 3088723 3065830 3014572 2937600 2839246 2724344 2598062
50478 2598062 2465672 2331660 2199294 2071287 1950233 1837905 1734748 1640609 1555566 1479541
50468 1479541 1411769 1351392 1298142 1251689 1210689 1173451 1139499 1109709 1084888 1064861 1048921
50457 1048921 1036532 1027434 1021601 1019231 1020457 1024919 1031873 1040692 1051072 1062817 1075636 1088899 1101455
50444 1101455 1112121 1120852 1129119 1138536 1149204 1159788 1168937 1176050 1180975 1183788 1185032 1185533 1185826 1186171
50430 1186171 1187130 1189590 1194039 1200286 1208044 1217449 1228863 1242535 1258554 1276886 1297481 1320684 1347445
50417 1347445 1378670 1414374 1453968 1497359 1545133 1597541 1653944 1713569 1776161 1841437 1908359
50406 1908359 1975442 2041412 2105142 2165339 2220895 2271314 2316109 2353899 2382721 2401245 2408973
50395 2408973 2405135 2388176 2356969 2312057 2255217 2188188 2112644 2031341 1948381 1867873 1792596
50384 1792596 1724133 1663777 1612837 1572343 1542973 1525174 1518998 1523792 1538287 1560842 1589288 1620732
50372 1620732 1651970 1680038 1701993 1714454 1714243 1699922 1672424 1634000 1586936 1533345 1475489 1415620
50360 1415620 1355596 1296948 1241079 1188939 1140583 1095383 1052784 1012715 975398 940991 909443
50349 909443 880566 854189 830232 808663 789500 772959 759475 749384 742659 739111 738605 740712
50337 740712 744397 748738 753934 761042 770583 782035 794829 809171 825462 843480 862527 881764
50325 881764 899748 914064 922328 923749 919467 911572 902152 892949 885099 878827 873587 868690 863919 859726
50311 859726 856941 856098 856895 858467 860234 862138 864021 865312 865650 865428 865362 865844 867012 869063 872055 875725
50295 875725 879942 884999 891034 897514 903837 910157 916983 924262 931637 939579 949576 963212 981658 1005826
50281 1005826 1035526 1067342 1093880 1106750 1101671 1081224 1052703 1023248 996775 974618 957484
50270 957484 945688 938138 932726 928326 925468 924487 923915 921733 917718 913449 910168 907620 905052 902389
50256 902389 899972 897735 895167 891953 888404 885320 883463 883052 883799 885484 888355 892910 899575 908795 921041
50241 921041 936343 954077 973558 994550 1016878 1039965 1063259 1086729 1110292 1133004 1153490
50230 1153490 1171009 1185535 1197089 1205896 1213034 1219916 1226734 1232037 1234033 1231711 1224487 1211516 1192011
50217 1192011 1166057 1134817 1100109 1064000 1028591 995886 967657 945101 928362 916555 908602
50206 908602 903835 901340 899002 893871 883667 867686 846549 821888 796282 772537 752356 735760
50194 735760 721841 709716 698767 688547 678851 669619 660644 651683 642885 634816 627932 622236 617364
50181 617364 612704 607614 602013 596667 592351 588775 584970 580726 576982 574691 573949 574373 575564 576926 577759
50166 577759 578033 578535 579842 581591 583162 584573 586304 588683 591916 596335 602073 608766 616016 623951 632973
50151 632973 643201 654392 666050 677264 686883 694312 699835 703711 705418 704364 700991 696378 691026
50138 691026 684948 679001 675152 674894 677969 683137 689796 698276 708799 720848 733781 747733 763708
50125 763708 782959 806380 834257 866348 902211 941580 984295 1029638 1075871 1120903 1163600
50114 1163600 1204154 1243091 1280427 1316153 1351109 1386652 1423382 1460451 1495853 1526807 1550041
50103 1550041 1562604 1563002 1551441 1528986 1496952 1457108 1411710 1362781 1311623 1259387 1207781 1158767
50091 1158767 1113727 1073295 1037880 1007911 983485 964056 948617 936071 925458 916068 907521 899794
50079 899794 893050 887287 882158 877231 872483 868324 865016 862316 859914 857853 856099 853916 850335 845261
50065 845261 839528 833753 827639 820694 813027 805064 796914 788551 780445 773412 767826 763287 759143 755115
50051 755115 751437 748618 747136 747148 748349 750170 752299 755053 759204 765307 773140 781890 790835 799730 808602
50036 808602 817525 826750 836638 847063 857077 865612 872490 878432 884175 889897 895401 900362 904294 906654
50022 906654 907173 905996 903496 900051 895883 890887 884809 877832 870673 863768 856669 848886 841098 834840
50008 834840 831014 829407 829674 832063 836959 844522 855204 870110 890319 916022 946474 980402 1016252
49995 1016252 1052443 1087690 1120938 1151043 1177150 1199562 1219683 1238671 1256429 1271995 1284221
49984 1284221 1291469 1291149 1280440 1257786 1223697 1180447 1131233 1079305 1027275 976959 929704 886577
49972 886577 848176 814602 785766 761465 741104 723736 708627 695512 684132 673940 664499 655836
49960 655836 648225 641897 637202 634616 634265 635717 638576 643058 649749 659003 670724 684429 699265 714199
49946 714199 728426 741382 752275 760075 764317 765632 765214 763965 762235 759926 756495 751153 743387 733116
49932 733116 720255 704623 686589 667346 648164 629703 612427 597125 584417 574046 565375 558444
49920 558444 553904 551896 551600 552095 553179 555085 557693 560396 562715 564732 566776 568895 571005 573580 577749
49905 577749 584331 593048 603103 614278 626931 641225 657031 674399 693111 711619 727401 738875
49893 738875 746381 751009 753258 753268 751499 748337 743467 736329 726847 715263 701716 686593 670803 655006
49879 655006 638906 622038 605028 589387 576163 565361 556520 549198 542906 537179 531939 527543 524480
49866 524480 523131 523538 525190 527398 530193 534411 540449 547400 554083 560629 568362 578267 590263 603822
49852 603822 618548 633994 649474 664255 677621 688814 697299 703174 706987 709115 709592 708407 705555
49839 705555 700778 693546 683430 670503 655625 640467 626837 615597 606356 598458 591936 587184 584116
49826 584116 582183 581009 580512 580632 581482 583641 587807 594091 601982 610917 620696 631501 643737 657549
49812 657549 672207 686280 698706 709337 718271 725277 730385 734307 737475 739120 738115 734368 728509
49799 728509 720590 710278 698261 686318 675581 665471 654682 642658 629898 617410 606124 596413
49787 596413 587887 580001 572925 567468 564095 562394 561518 560746 559596 557891 555902 554173 553134 553032 554046
49772 554046 556209 559412 563856 570194 578743 588780 599185 609513 619807 629562 637687 643571 647622
49759 647622 650728 653731 657244 661253 664763 666383 665229 660816 652409 639562 623396 606384 590525
49746 590525 576405 564189 554475 547525 542467 538110 534252 531551 530304 529897 529434 528539 527539 527102 527703
49731 527703 529292 531491 534037 536883 539924 542889 545588 548114 550828 554328 559356 566536 576149 588151
49717 588151 602210 617615 633434 648909 663257 674908 681734 682822 679708 675078 670342 664998 658038
49704 658038 649204 639013 628417 618526 610088 603106 597325 592852 589728 587188 584119 580151 575682 571098
49690 571098 566773 563550 562238 562658 564166 566981 571882 578592 585732 592692 600415 609877 620863 632767
49676 632767 645731 660356 677055 696017 716816 737374 754171 764510 768335 767490 763864 758796
49664 758796 753511 749119 746333 745653 747554 752019 758113 764176 767987 766710 757824 741048 719050 695596
49650 695596 673196 652738 634529 618791 605420 594085 584648 577131 571483 567738 566114 566578 568527
49637 568527 571227 574234 577077 578996 579488 578880 577857 576586 574613 571414 566745 560705 553818 546852 540305
49622 540305 534242 528763 524208 520697 517878 515452 513572 512423 511772 511284 510981 511113 511940 513822 517035
49607 517035 521171 525137 528117 530217 531903 533300 534375 535310 536206 536778 536809 536602 536619 536943 537420 538018 538791
49590 538791 539789 541203 543181 545327 546957 548154 549948 553042 556863 560325 562938 564764 565879 566567 567575
49575 567575 569546 572450 576009 580221 585003 589912 594856 600659 608170 617194 626917 637006 647509 657960
49561 657960 667442 675492 682295 687886 691671 692785 690660 685380 677824 669304 660858 653125 646933 643264
49547 643264 642170 642340 642488 642745 644019 646392 648917 650806 651998 652640 652676 652128 651437 651514 653498 657978 664238
49530 664238 670788 677153 684537 694246 706158 719578 734853 752906 773396 794380 813806 830451
49518 830451 843537 852533 857637 859775 859889 858708 857209 856656 858067 862078 869102 878858 889690 899051
49504 899051 904890 906185 902362 893000 878411 859954 839513 818825 799186 781298 765310 751301
49492 751301 739550 730014 721884 714334 707564 702404 699064 696967 695731 695465 695973 696462 696359 695918 695761
49477 695761 696237 697361 698870 700178 700725 700551 700216 700123 700326 701027 702755 705874 710216 715276 720464 725167
49461 725167 728973 731935 734356 736262 737344 737412 736646 735396 733821 731562 727742 721727 714118 706499 699846
49446 699846 693665 687152 680473 674228 668336 662497 657316 653838 652201 651784 652504 654797 658370 662201 665973
49431 665973 670421 676060 682657 690259 699621 711198 724671 739921 757384 776871 797189 817769
49419 817769 839619 863164 885410 900627 904496 897398 883789 868849 855720 845303 837917 834528
49407 834528 836148 842559 852401 864631 879290 896601 915806 935214 953165 968865 982557 994999
49395 994999 1006465 1016382 1024305 1030978 1037662 1044404 1049769 1052471 1052417 1049842 1044340 1035450 1023670 1010266
49381 1010266 996352 982608 969506 957323 946074 935799 926809 919525 914370 911803 911996 914349 917923
49368 917923 922547 928841 936831 945207 952405 957804 961342 962669 961479 958322 954261 949843 945012 939811
49354 939811 934453 928804 922514 915846 909816 905274 902112 899600 897318 895681 895518 897090 899453 901061
49340 901061 901167 900409 899731 898997 897057 893056 887290 880775 874398 868573 863399 858869 855002 851933 849839
49325 849839 848702 848189 847848 847487 847307 847628 848577 850103 852266 855290 859294 864169 869785 876102 882930 889814
49309 889814 896323 902335 907991 913629 919860 927247 935677 944429 953168 962434 972793 984009 995650
49296 995650 1008069 1022141 1038302 1056407 1075922 1095260 1111235 1120389 1121257 1114786 1102878 1087516
49284 1087516 1071125 1056242 1044105 1034293 1026081 1019254 1013213 1006461 997997 988643 980069 972858 966295
49271 966295 959860 954124 950118 948306 948347 949601 951708 954709 958600 962921 967003 970583 973990 977854 982936
49256 982936 990103 1000000 1012783 1028338 1046441 1066316 1086597 1106341 1125446 1142909 1155207 1158158
49244 1158158 1150661 1135292 1115010 1090929 1063887 1036360 1011144 988973 968813 950031 933144
49233 933144 918903 907816 900441 897103 897251 899736 903636 908300 912927 916933 920674 925140 930841 937430
49219 937430 944318 951147 957709 963837 969432 974453 978998 983573 988899 995168 1001816 1008373 1015194 1023057
49205 1023057 1032402 1043307 1055778 1069561 1083999 1098548 1113182 1127931 1142329 1155744 1167946
49194 1167946 1178995 1188866 1197572 1205299 1212049 1217485 1221426 1224144 1225915 1226866 1227626 1229459 1233172 1238429
49180 1238429 1244743 1252636 1263132 1276619 1292994 1312584 1336146 1364244 1397388 1436569 1482766 1535578
49168 1535578 1592338 1648026 1695747 1728424 1741877 1737106 1719541 1696163 1673108 1654604 1642425
49157 1642425 1635955 1633443 1633460 1635091 1637373 1639457 1641093 1642186 1642046 1639995 1636719 1634172 1633925 1636113 1640054
49142 1640054 1645276 1651776 1659732 1669140 1679571 1690381 1701403 1713127 1725829 1738918 1751725 1764566
49130 1764566 1778348 1793316 1808834 1824203 1839124 1853607 1868085 1883386 1899916 1917043 1933969
49119 1933969 1950896 1968633 1987400 2007032 2028124 2051904 2078964 2109160 2142964 2182054 2228526
49108 2228526 2284582 2353266 2438103 2540281 2655332 2772740 2880350 2972245 3054505 3141445
49098 3141445 3241511 3343989 3421006 3446047 3413148 3339758 3252234 3167921 3087823 3002511 2903630
49087 2903630 2791413 2674044 2561909 2462545 2379203 2311809 2258378 2216325 2183461 2158087 2138484
49076 2138484 2122986 2110618 2100946 2093175 2086036 2078787 2071551 2064367 2056739 2048634 2041112 2035199 2030661
49063 2030661 2026614 2022944 2020265 2018765 2017908 2017241 2016697 2016064 2014853 2013029 2011415 2011024 2012155 2014254 2016349
49048 2016349 2017451 2016939 2015048 2013023 2012367 2013737 2016723 2020841 2026424 2034199 2044205 2055756 2068490 2082727
49034 2082727 2098338 2113746 2126698 2135930 2141792 2145509 2148284 2150757 2152668 2153068 2151390 2148346 2145364
49021 2145364 2143185 2141482 2139797 2138282 2137431 2137552 2138690 2140793 2143850 2148045 2153697 2160803 2168830 2177296
49007 2177296 2186341 2196318 2206986 2217671 2228021 2237979 2247118 2254678 2260341 2264419 2267295 2269220 2270588
48994 2270588 2271655 2271889 2270275 2266502 2261346 2255767 2250228 2244960 2240147 2235570 2230697 2225503 2220695 2216839
48980 2216839 2213808 2211417 2209991 2209810 2210433 2211114 2211682 2212553 2214031 2215928 2217803 2219299 2220261 2220659 2220456 2219624
48964 2219624 2218353 2217070 2216048 2215215 2214663 2215085 2217190 2220918 2225793 2231866 2239636 2249125 2259816 2271575
48950 2271575 2284903 2300208 2317552 2337190 2359448 2383738 2408511 2432697 2456541 2480690 2505224
48939 2505224 2530178 2556250 2584202 2614025 2645464 2679006 2715535 2755128 2796919 2840215 2885154
48928 2885154 2932144 2981074 3031274 3082050 3133153 3184876 3237704 3291762 3346620 3401722 3456933
48917 3456933 3512443 3568052 3622607 3674426 3722515 3767365 3810330 3852150 3892434 3930615 3966825
48906 3966825 4001473 4034471 4065452 4094422 4121594 4146864 4170073 4191586 4211962 4231198 4248828
48895 4248828 4264561 4278234 4289453 4298062 4304713 4310148 4314073 4315488 4313852 4309005 4300279 4286871 4269082
48882 4269082 4247989 4223955 4196748 4167183 4137110 4107245 4076296 4042744 4006302 3966997 3924235
48871 3924235 3877771 3828620 3778006 3726140 3672856 3618734 3564722 3511316 3458883 3408154 3359593
48860 3359593 3312921 3268052 3225909 3187503 3152755 3121043 3092332 3066924 3044546 3024545 3006660
48849 3006660 2990865 2976844 2964351 2953781 2945770 2940541 2938059 2938286 2940719 2944448 2949354 2956541 2966718
48836 2966718 2978938 2991989 3006328 3023286 3042724 3062901 3082538 3101767 3120946 3139811 3158224
48825 3158224 3176760 3196042 3216059 3236491 3257211 3278233 3299534 3321136 3343033 3365013 3386795
48814 3386795 3408288 3429442 3450032 3470001 3489873 3510429 3532052 3554672 3578110 3602080 3626134
48803 3626134 3650135 3674654 3700525 3728151 3757511 3788503 3820811 3853686 3886316 3918177 3948701
48792 3948701 3976901 4001857 4023389 4041973 4058262 4072959 4086699 4099589 4111094 4120506 4126935 4128658
48780 4128658 4123403 4110018 4089300 4062601 4030377 3992826 3951078 3906556 3859590 3809769 3757404
48769 3757404 3703674 3649496 3595142 3540809 3486674 3432560 3378334 3324516 3271755 3220006 3169085
48758 3169085 3119763 3073386 3030554 2991022 2954655 2921525 2891196 2863003 2837152 2814602 2795662
48747 2795662 2779412 2764647 2750806 2737959 2726572 2717375 2710898 2707129 2706036 2708108 2713657 2721772 2730659
48734 2730659 2738888 2745730 2750651 2753395 2754437 2754552 2754053 2753078 2752319 2752574 2753772 2755316 2757106 2759380 2761786
48719 2761786 2763608 2764658 2764966 2763939 2761076 2757274 2754039 2751387 2747947 2743263 2738527 2734680 2731152 2727181
48705 2727181 2723259 2720469 2719174 2718967 2719331 2719834 2720196 2720577 2721454 2723163 2726009 2730618 2737395 2745670 2754220
48690 2754220 2762612 2771134 2779573 2787140 2793584 2799201 2803644 2806023 2806487 2806531 2807351 2809000 2811413 2814905 2819057
48675 2819057 2822268 2823020 2820713 2814932 2805180 2791999 2777131 2761732 2745438 2727862 2709785 2691827
48663 2691827 2672966 2651587 2627386 2601284 2574077 2546078 2517409 2487652 2455637 2420505 2382735
48652 2382735 2343584 2304193 2265922 2230775 2200258 2174111 2151062 2130541 2112732 2097188 2082438
$$ [...]
##END NTUPLES=NMR SPECTRUM
##END=
