
##TITLE=UV1254_M10_1340-1211_70_7409441_wNitcXuMFv
##JCAMPDX= 6.0         $$ Bruker NMR JCAMP-DX V2.0
##DATA TYPE= NMR SPECTRUM
##DATA CLASS= NTUPLES
##ORIGIN= BRUKER
##OWNER= Administrator
$$ 1.72 TOPSPIN		Version 2.1
$$ 2013-01-24 21:06:18.315 -0500  Administrator@X
$$ Compression mode = diff/dup
##.OBSERVE FREQUENCY= 400.02188249412
##.OBSERVE NUCLEUS= ^1H
##.ACQUISITION MODE= SIMULTANEOUS (DQD)
##.ACQUISITION SCHEME= undefined
##.AVERAGES= 8
##.DIGITISER RES= 22
##SPECTROMETER/DATA SYSTEM= spect
##.PULSE SEQUENCE= zg30
##.SOLVENT NAME= COFFEE_meoh
##.SHIFT REFERENCE= INTERNAL, COFFEE_meoh, 1, 14.98509
##AUDIT TRAIL= $$ (NUMBER, WHEN, WHO, WHERE, PROCESS, VERSION, WHAT)
$$ ##TITLE= Audit trail, TOPSPIN		Version 2.1
$$ ##JCAMPDX= 5.01
$$ ##ORIGIN= Bruker BioSpin GmbH
$$ ##OWNER= Administrator
$$ $$ E:\/data/COFFEE/nmr/UV1254_M10_1340-1211_70_7409441_wNitcXuMFv/10/pdata/1/auditp.txt
$$ ##AUDIT TRAIL=  $$ (NUMBER, WHEN, WHO, WHERE, PROCESS, VERSION, WHAT)
(   1,<2013-01-24 21:06:10.703 -0500>,<Administrator>,<X>,<go>,<TOPSPIN 2.1>,
      <created by zg
	started at 2013-01-24 21:05:03.738 -0500,
	POWCHK enabled, PULCHK disabled,
       configuration hash MD5:
       86 BA 57 50 F2 9D 5C 9B 26 00 A9 28 5F 66 2E 89
       data hash MD5: 64K
       D5 C7 D9 A7 93 10 4B BC 64 83 41 6F 00 C6 B5 A9>)
(   2,<2013-01-24 21:06:13.765 -0500>,<Administrator>,<X>,<proc1d>,<TOPSPIN 2.1>,
      <Start of raw data processing
       efp LB = 0 FT_mod = 6 PKNL = 1 PHC0 = 0 PHC1 = 0 SI = 32K 
       data hash MD5: 32K
       A1 4B 2D 45 8B B4 39 17 27 77 C6 E3 C5 13 7D C7>)
(   3,<2013-01-24 21:06:14.194 -0500>,<Administrator>,<X>,<proc1d>,<TOPSPIN 2.1>,
      <pk PHC0 = 97.30591 PHC1 = 0 
       data hash MD5: 32K
       68 88 8E 4B 00 01 8B 5D 79 62 4A D4 BD 7B 9D EC>)
(   4,<2013-01-24 21:06:14.417 -0500>,<Administrator>,<X>,<proc1d>,<TOPSPIN 2.1>,
      <abs ABSG = 1 
       data hash MD5: 32K
       7A C3 44 05 71 C9 C8 C7 C6 89 2E 12 E8 C7 E6 7C>)
(   5,<2013-01-24 21:06:14.556 -0500>,<Administrator>,<X>,<proc1d>,<TOPSPIN 2.1>,
      <abs ABSG = 2 
       data hash MD5: 32K
       8E 06 50 E4 7F B1 FC 56 91 41 E7 D0 94 80 B5 8F>)
(   6,<2013-01-24 21:06:14.695 -0500>,<Administrator>,<X>,<proc1d>,<TOPSPIN 2.1>,
      <abs ABSG = 3 
       data hash MD5: 32K
       3D EF 17 1B 79 06 D7 18 23 A9 56 02 25 33 BD 5F>)
(   7,<2013-01-24 21:06:14.820 -0500>,<Administrator>,<X>,<proc1d>,<TOPSPIN 2.1>,
      <abs ABSG = 4 
       data hash MD5: 32K
       B6 B1 35 15 CB 8A 72 2B C7 84 E8 68 86 E3 69 D6>)
(   8,<2013-01-24 21:06:14.932 -0500>,<Administrator>,<X>,<proc1d>,<TOPSPIN 2.1>,
      <abs ABSG = 5 
       data hash MD5: 32K
       0A 2E 1F 37 D9 CD 3B A0 AB 6F F3 9A 27 C4 81 9A>)
$$ ##END=
$$ 
$$ $$ hash MD5
$$ $$ 83 DE 0E 92 9A 2C 8E 83 F9 E9 6C 82 CE 50 98 58
##$RELAX= 
##$RELAX= 
##$RELAX= 
##$RELAX= 
##$RELAX= 
##$RELAX= 
##$RELAX= 
$$ Bruker specific parameters
$$ --------------------------
##$DU= <E:\>
##$EXPNO= 10
$$ [...]
150 150 150 150 150 150 150 150
##$TP07= 0
##$TPNAME0= <>
##$TPNAME1= <>
##$TPNAME2= <>
##$TPNAME3= <>
##$TPNAME4= <>
##$TPNAME5= <>
##$TPNAME6= <>
##$TPNAME7= <>
##$TPOAL= (0..7)
0.5 0.5 0.5 0.5 0.5 0.5 0.5 0.5
##$TPOFFS= (0..7)
0 0 0 0 0 0 0 0
##$TUNHIN= 0
##$TUNHOUT= 0
##$TUNXOUT= 0
##$USERA1= <user>
##$USERA2= <user>
##$USERA3= <user>
##$USERA4= <user>
##$USERA5= <user>
##$V9= 5
##$VALIST= <valist>
##$VCLIST= <CCCCCCCCCCCCCCC>
##$VD= 0
##$VDLIST= <DDDDDDDDDDDDDDD>
##$VPLIST= <PPPPPPPPPPPPPPP>
##$VTLIST= <TTTTTTTTTTTTTTT>
##$WBST= 1024
##$WBSW= 4
##$XGAIN= (0..3)
0 0 0 0
##$XL= 0
##$YL= 0
##$YMAX_a= 675982
##$YMIN_a= -574763
##$ZGOPTNS= <>
##$ZL1= 120
##$ZL2= 120
##$ZL3= 120
##$ZL4= 120
##$ABSF1= 14.98509
##$ABSF2= -5.573092
##$ABSG= 5
##$ABSL= 3
##$ALPHA= 0
##$AQORDER= 0
##$ASSFAC= 0
##$ASSFACI= 0
##$ASSFACX= 0
##$ASSWID= 0
##$AUNMP= <proc_prof1d_extract_pilot.lims>
##$AXLEFT= 0
##$AXNAME= <>
##$AXNUC= <1H>
##$AXRIGHT= 0
##$AXTYPE= 0
##$AXUNIT= <>
##$AZFE= 0.1
##$AZFW= 0.1
##$BCFW= 0
##$BC_mod= 0
##$BYTORDP= 0
##$COROFFS= 0
##$CY= 15
##$DATMOD= 1
##$DC= 0
##$DFILT= <>
##$DTYPP= 0
##$F1P= 0
##$F2P= 0
##$FCOR= 0.5
##$FTSIZE= 32768
##$FT_mod= 6
##$GAMMA= 0
##$GB= 0
##$INTBC= 1
##$INTSCL= 1
##$ISEN= 128
##$LB= 0
##$LEV0= 0
##$LPBIN= 0
##$MAXI= 10000
##$MC2= 0
##$MEAN= 0
##$ME_mod= 0
##$MI= 0
##$NCOEF= 0
##$NC_proc= -8
##$NLEV= 6
##$NOISF1= 0
##$NOISF2= 0
##$NSP= 0
##$NTH_PI= 0
##$NZP= 0
##$OFFSET= 14.98509
##$PC= 1
##$PHC0= 97.30591
##$PHC1= 0
##$PH_mod= 1
##$PKNL= yes
##$PPARMOD= 0
##$PPDIAG= 0
##$PPIPTYP= 0
##$PPMPNUM= 2147483647
##$PPRESOL= 1
##$PSCAL= 4
##$PSIGN= 0
##$PYNMP= <proc.py>
##$REVERSE= no
##$SF= 400.02
##$SI= 32768
##$SIGF1= 0
##$SIGF2= 0
##$SINO= 400
##$SIOLD= 32768
##$SPECTYP= <>
##$SREGLST= <1H.CDCl3>
##$SSB= 0
##$STSI= 32768
##$STSR= 0
##$SW_p= 8223.68421052631
##$SYMM= 0
##$S_DEV= 0
##$TDeff= 65536
##$TDoff= 0
##$TI= <>
##$TILT= no
##$TM1= 0
##$TM2= 0
##$TOPLEV= 0
##$USERP1= <user>
##$USERP2= <user>
##$USERP3= <user>
##$USERP4= <user>
##$USERP5= <user>
##$WDW= 1
##$XDIM= 32768
##$YMAX_p= 460568689
##$YMIN_p= -666170
##$CURPLOT= <Network HP LaserJet P1505>
##$CURPRIN= <$Network HP LaserJet P1505>
##$DFORMAT= <normdp>
##$LAYOUT= <+/1D_H.xwp>
##$LFORMAT= <normlp>
##$PFORMAT= <normpl>
##$SURQMSG= 1
$$ End of Bruker specific parameters
$$ ---------------------------------
##NTUPLES= NMR SPECTRUM
##VAR_NAME=  FREQUENCY,     SPECTRUM/REAL,   SPECTRUM/IMAG
##SYMBOL=    X,             R,               I
##VAR_TYPE=  INDEPENDENT,   DEPENDENT,       DEPENDENT
##VAR_FORM=  AFFN,          ASDF,            ASDF
##VAR_DIM=   32768,         32768,           32768
##UNITS=     HZ,            ARBITRARY UNITS, ARBITRARY UNITS
##FACTOR=    0.250966925370066, 1,           1
##FIRST=     8223.43324360094, -372115,      -47674
##LAST=      0,             -154066,         -183345
##MIN=       0,             -666170,         0
##MAX=       8223.43324360094, 460568689,    0
$$ Real data points
##PAGE= N=1
##DATA TABLE= (X++(R..R)), XYDATA
$$ [...]
23825 -86459 101349 76475 -65395 -41182 -132685 -47802 -47393 -454670 -136186 46456 -182408
23813 241009 -94058 -430800 53700 -250338 -116043 39847 -325839 -37100 23900 91053 -121797
23801 230895 -155526 -246369 174717 136063 202219 6512 -11668 175928 -21480 13332 -21243
23789 -131107 -8707 -5711 -45446 52108 -164541 73604 -332695 -20278 -98352 139188 5707
23777 -139762 -10669 -261505 86282 -54644 95567 -34673 115646 -147948 -43701 -154482 242384
23765 -59859 -138801 -49774 -4712 15312 162128 -27659 387708 -49839 20443 89469 83208 -31267
23752 -79189 -232742 -186398 -73397 201815 -5367 -152200 -131557 -188924 -156691 48840 -119505
23740 -153364 238007 26912 -155268 -119385 -23319 -170746 -86452 205032 -295687 -39218
23729 -335762 82333 -113170 -7757 -67510 -46178 2979 40837 35428 -107416 -99227 -19972 38927
23716 13690 -38817 -147361 38917 -73379 84825 -157156 -382999 171219 -232190 229325
23705 32324 127711 30532 -63406 60831 -49082 24080 -144156 175000 -136987 53760 48569
23694 48569 -45363 303842 -258712 135385 -310787 -113143 108403 51763 111626 -201015
23683 -225716 -18314 93498 -112209 162683 89650 -44578 -325443 42152 -70533 80800 -149142
23671 -69572 41512 -32364 -231680 58769 160909 294048 97119 40527 -89856 -866 -53046
23660 -53046 -495673 -393283 118035 12178 289045 -229646 71785 -121094 149338 27290
23649 -93991 330395 -133942 -346195 139948 -107490 -149259 3665 93327 212469 252046 -253666
23637 -73337 299014 162745 184880 60358 -46900 34747 -53000 160330 -49489 275594 62942
23625 -59300 -120129 -241057 297986 -32383 -17874 -298628 68550 14689 -166928 271646 -46027
23613 322367 -62111 112764 -397231 220316 21880 263397 -98787 100452 148725 52290
23602 -54667 159324 -22817 -65905 73552 25566 165222 54831 210235 212052 -144184 -9387
23590 -182578 264543 356390 31329 -247865 -35867 -144819 36308 -16843 411546 268290
23580 268290 103488 -133634 -102374 77215 -94103 -83676 15455 342663 -315978 -42863 -625541
23569 -625541 -65543 -151686 -57436 217463 12522 -131037 -108463 -67097 14699 161466 -69054
23557 59650 201878 -488921 176303 -49861 91120 327841 -231850 93038 -22437 35292 -77012
23545 99772 90692 -297600 -24908 -38891 163389 44492 129143 130514 -118141 70382 -114101
23533 168942 -409024 12677 -60316 -51820 137534 -20356 -138625 -68534 37128 268649 -205180
23521 2203 151581 140723 -166034 -186322 22681 -88904 119752 255371 -227383 255806 66036
23509 15670 81633 68506 -177998 26153 -229449 -346798 196362 -190803 97933 -89428 -100998
23498 -100998 -48125 -205855 -50857 -129087 -40173 114156 -10405 87329 146241 -176476 12391
23486 113433 156588 95632 101846 -91619 -278037 -32972 152006 85122 122330 -214914 18672
23474 -307803 235684 -124193 140527 150467 -3202 204247 -386538 -145006 95904 243888
23464 243888 -289498 -380399 105875 -238435 208370 175139 -103025 75723 158469 29166
23453 36946 70330 346369 -323806 131744 290941 -199190 75040 -140251 12273 -60323
23442 119335 70309 -234119 -476921 267501 -191214 271995 -517366 -59821 -171535 -201794
23432 -201794 -400915 49506 -166471 178330 29870 -156210 -318169 -4274 171415 146519
23422 146519 -340140 120188 325888 -50737 208865 -98418 345033 -121984 -179987 151020
23411 -212459 -272119 -329809 31883 -123830 -41233 141822 -264916 123473 1379 -269897 379939
23399 145041 23644 -519555 40206 209752 64363 59523 270157 -209345 -381968 -22497 115215
23387 51662 -311513 14848 -60472 -126324 -102114 -226754 -302676 334117 174139 -168903 169507
23375 164856 3360 99456 238963 -288572 402161 16169 -59358 -20797 59028 -281004 18479
23363 200731 301628 44414 41879 147796 158613 224194 97855 -79947 -17866 63325 141881
23352 141881 -54371 -75219 -273137 -174340 -40410 221312 -341437 148158 -5242 -59334 -198936
23341 -198936 29803 -277258 -2055 221080 28893 126400 -81317 -42636 224909 -69706 -382087
23330 -382087 -120459 -49349 -115253 130074 83056 92390 -27054 63878 -171801 401 -171633
23318 63827 101580 -120730 -264840 22244 -199388 199919 170270 -22928 -212099 -48805 -22533
23306 -310549 196849 76684 23159 28753 130590 334852 -60379 -325589 88832 -310067 242519
23294 -245754 212827 -118493 -73198 -268589 5765 -48085 65206 -76914 -13320 -152567 -276807
23283 -276807 -433319 -443494 352 15862 -120004 -18255 254634 39941 -23685 65633 74962
23272 74962 148446 -23162 -64485 -179527 -80480 -172080 49463 230363 464383 51668 137388
23261 137388 274489 -88481 -41411 -21409 146711 -331440 -119365 119210 -113620 -91848
23251 -91848 333713 -76744 -47206 292701 479548 42825 -251902 -131317 83921 -37772 -9393
23239 226067 20057 -72286 -106401 -77896 23732 -579343 734 219978 58478 -197515 -79171
23227 -42633 -415704 -137546 -54959 362055 72028 91945 190558 161650 92916 -217786 18593
23215 12451 48738 214490 -35667 -299540 75270 -110210 331327 -71701 -203556 -222375 212595
23203 -136540 62058 -180808 -248404 -123913 114177 314127 27509 -151605 170632 39754
23192 405014 -153435 632372 93825 -216873 78163 32730 -91263 -113539 -278143 35370 166609
23181 166609 -35415 101244 -61781 56405 -232178 50168 32150 -160985 -245590 90027 -67650
23169 234579 -35701 -142371 -227234 377392 198685 161777 118454 94283 13026 -136800 -8199
23157 -259251 -157827 -100013 -619347 146997 18523 325698 16317 -241718 -56346 -261441
23147 -261441 -124717 -37323 -173619 174538 -252569 144778 -158058 -179910 69517 294650
23137 294650 17215 -72344 -121801 -38443 -45416 -76229 104565 378251 -230299 -2727 43389
23125 41262 -22562 -55514 179209 134875 192610 -269381 324438 -29251 168178 101610 -296387
23113 -6137 -234132 -223734 200063 34441 -143343 -147692 368511 -151431 -125590 90847 102247
23102 102247 -163683 -107543 -228741 -270037 27883 118016 -74154 144275 117653 35024 169165
23091 169165 146495 -378344 -77657 117977 -185553 -329671 27290 -250167 177402 -248219
23080 73045 -14915 -59102 14960 -141775 2277 -177553 -104344 -178553 -231456 212 -173686 -176737
23068 -176737 -129917 -103295 -18763 304112 -160921 -345767 39692 202891 -331700 153348
23057 196924 215765 -166681 35816 20900 80138 179921 -11673 -24101 281026 115659 -245973
23045 -80961 -30851 24751 59394 198181 29442 -76116 -144514 -161017 -36376 -180906 -88574
23033 -16220 88609 -47271 -11941 -205746 -154877 -172699 -319332 -245040 62180 95224 -52183
23021 7049 -132617 -181059 -384119 -121628 -262519 143919 -51424 38564 280208 -208531
23010 -96200 159465 -202969 470901 -141943 -4068 -138958 218435 -75319 -61361 -289478
23000 -289478 203824 146884 -12755 55976 -37890 247568 100001 207879 -210554 -156777
22990 -156777 239112 -193458 22232 -6884 -173134 -43994 70938 -59449 -107680 63215 136815
22979 136815 318524 -11590 23246 32779 -167103 430599 47567 -7342 -125715 -188263 -150871
22968 -150871 59293 19845 59130 312830 -113611 -144559 156304 -406823 -389969 -35833 83887
22956 268303 45119 191574 -95761 68002 87918 -95972 -37470 239359 -290890 81822 153847
22945 153847 7487 -5738 -63598 -182200 -122817 -17245 92557 104269 -102002 -247472 441275
22933 -294843 18198 144056 56484 -75691 -58775 -180163 -142904 -313014 85254 -194025 75333
22921 152097 78873 423832 17898 -160404 -36306 -168569 -53286 -168725 -133640 79142 242554
22910 242554 111557 -20120 -54655 -302794 156685 43833 51217 100652 -81711 243310 119863
22898 120252 236742 22284 195488 -121689 -97827 -154730 -55845 -347867 134879 -93150
22887 -572005 -104565 -230628 -107290 -215016 335464 -31568 -334947 -319200 -194096 192443
22876 -138211 149140 -52322 -141644 -312217 -230452 27541 53000 -27275 -171585 28117 -27390
22864 162101 -199353 1683 134551 -71630 -117388 -82285 -249308 -153996 -122381 -35407 174892
22852 -106981 -210513 -145796 14911 -187308 -59770 -130579 372059 -112555 -18801 -316790
22842 -316790 -104840 -149134 -253494 72912 -290076 6492 -108116 66208 -79903 203604 39202
22830 -90447 -67742 460932 -201090 -291872 -81394 -38397 68653 -54819 593114 -161069 -140535
22819 -140535 90521 392861 134296 77231 84291 38135 117935 178291 -55303 -231973 77701
22807 11411 110434 -40413 -38657 -326514 140393 -93206 111966 202722 48301 -90043 94828
22795 103640 -183409 -73181 113388 88895 204055 -171905 5921 -254445 -220390 155415
22784 -319198 16236 -188074 -101448 -27399 -206827 -142371 -3696 167129 75822 -174821 259042
22772 165759 79174 14976 -11623 -218525 19039 249584 80711 375495 -143399 -48860 214648
22760 -50313 -145914 -92162 132668 299513 -131378 191408 -276310 41516 -363594 -162347
22749 23165 -99189 -90312 95488 -410584 238731 38537 57828 -18299 36152 -218315 -358165
22738 -358165 -102980 -261232 166939 -129830 -43387 -120441 131507 8786 -178871 41148
22727 -452618 115740 -169062 92146 134870 77550 288222 70704 -393358 76075 -150465
22716 -189993 -173841 8086 -181974 272521 200309 -120639 -50162 -31685 -296581 162058 169515
22705 169515 213865 -80405 -291197 -9714 -178319 -45064 -42786 -131522 -83421 -210237 90963
22693 197239 -46091 85867 -228265 -62108 140595 -44681 33072 -34429 80542 -182380 -6220
22681 36298 133747 18179 -260789 20831 -206046 164448 -318125 -212206 -24208 -251623
22671 -251623 68578 -87491 -151801 47662 -91807 156050 115113 6852 -123072 -275573 50732
22659 8711 -198354 -155384 -193418 -286133 -196815 49908 209865 50553 89573 244327 229093
22648 229093 -157646 -142295 118469 67763 -213726 -142581 -485255 245719 167834 209764
22638 209764 83880 -85144 -49768 -259392 -275067 -209451 -38612 63406 -163244 -236681 84685
22626 -38500 -399551 -117835 -55819 -54371 78425 -69798 134419 102197 -120949 -68456 -277457
22615 -277457 -84334 -117346 -110284 -260628 -44869 -25302 253925 170149 94726 -46498 -128369
22604 -128369 136610 -110485 -164652 201220 -278618 150145 12589 330761 -167594 -170621
22594 -170621 -47239 38822 -204796 196486 -379683 -352248 159569 85304 -274407 32572
22583 116826 285115 -76279 346308 117560 212770 -410681 -173811 -133663 144299 -94308
22572 -59198 -186468 -58409 -40470 252128 -269734 -13509 255981 177482 34555 -197301 10054
22560 106916 22515 14080 14636 -136514 76423 84614 204165 -236921 -61196 -257134 95262
22548 -196803 -1283 151435 23000 -166958 -379405 -208864 -311908 -203803 112814 -2977
22537 -162897 149081 -2686 -210373 176148 -49291 -110030 157825 41862 -279750 279011
22526 28379 -172566 -90812 123372 -261693 -231330 258510 269388 -205603 244857 10078
22515 -54781 -265417 -41434 -22050 -217204 -102745 -18557 109220 392708 -80246 128306
22504 -44286 -25452 -190294 -285441 -157532 330968 154937 -249053 -81984 -133799 -57925 -232039
22493 -232039 128738 216889 171595 -12714 123310 171206 47168 101706 299286 -10998 -117595
22482 -117595 -52288 -173619 -134828 -55947 20737 631 -45155 170719 -157876 10489 -35803
22470 15369 122943 -149207 -95569 86314 -102396 -139701 -45102 -45289 10731 32830 78092
22459 78092 2462 -51753 -49254 67990 109972 -153477 110802 72062 -7974 69041 64445 103236
22447 103236 81771 -9121 10360 -82194 103677 17389 -241226 -166333 72786 -297995 -231815
22436 -231815 11166 111136 -120083 -261326 125343 -66008 33166 -27781 -113484 -71282 1935
22424 35776 -40717 -66362 -238922 -26741 32374 70336 48245 -159253 -207293 -86905 64984
22412 46 -267011 -111778 236550 171454 -206528 -219295 306033 135155 -374282 -438101 -92005
22400 201616 -308415 -104804 -214369 -26265 49471 196920 94836 -174149 -182827 -153624 110085
22388 -228096 122043 147309 38130 276344 102259 -99119 213503 263690 104912 -138866
22377 60780 107826 -471087 18361 -159574 -99762 144186 106308 -107532 19841 -73769 51439
22365 161489 187111 62654 -400399 11463 -156811 -133427 -133892 25848 6167 -174106 99579
22353 122097 205660 5380 -173685 98306 -28544 -53531 -166409 -250821 -187499 -123134 -114304
22342 -114304 5620 -56198 82952 -129531 -201921 -115100 33340 -165021 239508 -63874 -52173
22331 -52173 81826 118955 -125820 -181286 121590 -353746 -320116 20980 132581 145882 348175
22320 348175 233481 244942 -30004 -108558 242211 -454756 -457190 -156082 -130379 212670 -222008
22308 -145579 55817 341885 -295505 -99799 -18867 238072 141839 -35428 31958 139152 -146165
22296 -110642 43587 29566 -70144 -209860 70973 -112740 120356 165444 90514 -299719 -150556
22285 -150556 -33796 -391942 -25395 -305655 -36663 297022 -307728 -333392 -34380 -31869 30485
22273 86974 129284 24905 -3446 12275 -99645 -374 565699 133027 24838 -228841 -264210 -4494
22260 -147857 119122 68961 -181542 -218149 52056 -168235 -28323 -39085 -111913 -13451 66525
22248 182093 101810 -160182 -139875 140476 -273489 -85220 -121779 -60774 -22823 -380468 -102695
22236 -53977 9022 -231535 -333951 -145889 29813 -119747 -154179 54293 -329974 -158640 120152
22224 452053 164511 -148686 -10731 43614 -40840 -12506 -192953 56232 -273288 -87381 -127252
22213 -127252 127006 33684 234822 42764 -227342 406763 -99499 174675 97759 208318
22203 208318 29040 -348376 60974 -405216 -95133 -329480 79023 -245580 -88755 -239 -257463
22192 -257463 -155895 502284 -229637 7557 -137526 -345539 -182303 -64870 -180488 4180
22181 119775 -178637 38275 -90422 -151185 263785 -79199 -37778 152150 -33570 -25739 -12193
22169 -47456 -100152 -324316 -117358 -120346 -38530 -324221 -168102 -97658 178529 187054 -233949
22157 -35852 -283592 -27430 -5757 -69732 -191410 269851 119297 112715 -10490 129247 -31894
22145 67254 12954 158330 -249509 31534 1565 182701 -254639 -208504 234684 -6628 96367
22133 -105686 -135616 -15085 6479 174322 -13567 13617 244961 -304866 114893 -111840 -136026
22122 -136026 192464 -99960 -232324 -178673 -334912 -29981 -143912 -28268 -147990 357426
22111 -43949 -217405 153746 163814 176926 -10740 -3608 -174136 123063 185660 -168173 -91066
22100 -91066 199657 12921 -82166 -41209 -19245 126216 -59869 93859 160012 -259712 -159168
22089 -159168 -156396 99032 57544 107587 -137269 -3176 66270 48867 164897 122709 -142800
22077 168624 -343307 -41930 -20584 113804 -118981 19338 308734 85245 6853 -342155 -1141
22065 427038 255242 90688 -190349 -23343 -308211 -230506 -2372 110480 -163002 115109
22054 -94560 52658 9056 -223822 9997 34894 -212693 47172 -30333 -58380 -245655 -3187 -11180
22042 -11180 -254557 117254 123732 -26050 76388 199303 127195 191856 84662 -103084 454464
22030 -236024 170918 -99150 -106514 -201529 8885 108057 37999 97493 -288772 -63664 -24091
22018 -300335 39890 -91575 -112065 -113621 1191 -99703 108180 -61288 -417161 6007 143245
22007 143245 44334 125993 219862 30265 -126882 -110224 56483 -389845 -49599 23592 -188304
21995 5204 33497 152396 -89187 107777 -40855 4266 -253901 -92275 -4192 16738 97308 99908
21983 99908 398993 104914 -170973 1732 563 -101868 236239 -511167 -121930 -281765 106702
21971 -123844 35190 61002 56221 -32110 -252622 -133182 -97988 -364798 -70363 -272638 212735
21959 -88730 -156476 -287578 -42689 -72846 -30416 89710 14870 -3747 6739 222402 204715 -110337
21946 82420 -119384 28458 220428 -146377 -49826 -203272 -470591 -101882 -117215 -69868
21936 -69868 443274 -28643 -286264 -183711 31340 129018 -15828 333017 118397 -168552
21925 -463830 -233205 -219811 -274989 -199478 -41268 177874 -213265 90646 54585 309410 -353883
21913 -141851 490194 3068 16627 -266676 -34458 160704 79332 166095 -116008 55227 8408
21901 -320478 -77559 -172151 -191333 -33939 -200804 -233852 -116183 -135420 19641 -31543 -322546
21890 -322546 56229 -121242 -32596 146238 -49580 -62844 108458 209597 -5543 -5856 -412927
21879 -412927 91392 -243368 -152143 -238444 -70021 -108014 23491 -425584 21035 26241 -246205
21867 105710 -187411 -87416 22066 93881 25806 -30898 -290418 -11089 -6599 294453 -191061
21855 -160432 123329 199083 -231123 -4474 354427 -45107 -126284 -124959 88526 98459 -186587
21843 -179300 14737 -115490 -61765 -208785 235877 -37663 -385536 -37234 -123998 -330127
21833 -330127 191591 73094 107551 -184773 3641 -1655 388815 -75295 -254461 -206396 -67602
21821 -25901 -247644 134658 -57085 59401 286120 -65959 -127353 122834 9879 291450 -245717
21809 128283 -274243 92196 14540 29796 -482777 -94781 -44582 105843 90520 102502 16666
21797 -44359 -281046 5635 -100793 -86428 -203609 -208899 -157813 -190164 -216092 182224 158895
21786 158895 -41671 251406 -86016 313361 -174913 28515 48244 102286 113589 -3195 5530
21774 111791 -103179 99100 -52786 62070 88319 -116511 51562 47525 76033 -297764 -111975
21762 -15799 18979 -307271 61289 181487 444290 -59340 -122261 74519 -215996 -23316 -84476
21751 -84476 -231 -196924 93337 293839 -196278 -48867 51380 95112 -343080 -181510 93553
21739 367630 210581 -18897 255264 240180 -276871 31675 100725 117867 -156429 143795
21728 110352 -370273 -46053 80233 32190 -54242 -136576 -367199 -90609 98400 -165261 -35095
21716 -103608 -192747 -361597 -139327 -240914 9720 224878 51432 377131 -42407 -69009 -109909
21705 -109909 90290 -397361 -243125 -125698 324003 -336255 112688 -138999 367137 -135232
21694 20008 311648 -338081 -66280 -332905 -446818 -146156 234892 296039 -20669 28708
21683 -327548 -117014 172612 105134 299060 -189828 -84742 -20082 -52287 97783 -137164
21672 -279019 -217122 -247561 -162660 -114349 242720 -333754 157073 22720 -24042 -251256 127878
21660 -96617 123701 -133473 251165 25546 130222 -461897 51385 -169291 90391 175246
21650 175246 -252907 -110325 -205267 -20516 -158520 -156978 6475 -82935 50554 105627 127278
21639 127278 6255 178750 -17941 -272913 69109 -93990 -260252 -309193 -89854 -170718 131212
21627 167578 -218341 117733 -27490 103352 159797 -74128 53482 -78390 -307839 167860
21616 23988 -302144 -303005 -141624 -353916 -292718 -366059 -23423 141720 -78751 -230398 138659
21604 -124634 -10732 -157583 142036 36575 126139 202720 -87678 -54231 69854 88594 -238723
21592 62452 43235 -25809 -31873 35765 54423 -15672 -139659 -310562 -127719 -285962 -166170
21581 -166170 -65867 -272856 -217591 92146 -236304 -134398 -259020 137367 -154861 13585
21570 -246307 -42968 -84407 -30030 316276 74080 125055 -97978 -403284 133313 -284944 214168
21558 -215238 -9681 215531 -89368 16877 -90123 37662 -136487 -45995 5317 -200911 54109
21546 39064 -53478 97404 -445907 -495497 -278337 -69205 94123 66657 -124715 66811 159051
21535 159051 -22638 -77549 -36652 647176 38674 -176761 35637 61889 -203917 36031 -133996
21523 125019 -93321 56136 36393 75493 118790 -414930 -100115 35876 7831 -71628 -64923
21512 -64923 -336624 -246946 -92916 70105 -87427 -5349 114729 151134 -479587 42607 -370419
21500 113664 67088 259533 284128 35787 258119 92957 -7126 69650 236152 10093 199885
21489 199885 26096 -188683 -60674 -206889 1547 -316575 -56164 130216 -88244 220611 -5387
21477 -33330 -25320 115641 -81328 -428606 -117718 86257 -36905 -95740 -578649 -134876 145276
21465 -134479 -185364 -36472 -218218 164003 122633 -143142 20452 40898 291946 -77811 46097
21453 -38662 222260 18911 -47370 36807 140781 -280793 227325 -169364 -2428 -206060 78180
21441 132577 137422 488940 496660 90165 210385 -31607 300607 410315 347176 -115830 298012
21429 87886 -91511 382232 95895 -25750 67371 -14932 -63528 56754 -113070 -417647 -101720
21417 31686 -65916 -88780 4869 -107373 -128807 133045 1436 -203324 72095 104066 -183930
21405 379687 -98163 -28809 -176868 36743 -139728 -89878 -218936 -230415 -42186 52165 68018
21394 68018 -58336 83932 -115104 27793 1243 -26722 -343848 -61592 -103308 42293 164207
21383 164207 -94369 -93746 142134 34070 -110154 -240584 57647 -163201 261353 -65293 -141331
21372 -141331 -12919 -315086 -327141 -196790 -82534 87097 150142 39657 -88523 104187 -139991
21360 132325 28458 133605 323505 -65651 -87949 -32084 1840 18193 43301 302397 85878
21348 3124 -36398 -103137 78758 -487006 84121 -244681 53833 491647 -201534 136700 243825
21337 243825 204724 153299 -302064 -221310 -10166 -106078 -69362 -366301 -550418 161578 141957
21326 141957 -153931 -350754 71108 63805 41384 217171 -61978 -395260 97274 -65398 -108515
21315 -108515 -65214 116868 -135778 -155132 -209009 -388140 -39879 260712 -165050 75285
21304 -439657 -165946 -125174 -220562 8139 -2077 77435 150762 337559 -200902 44271 -37733
21292 -143773 221670 -188298 -116131 -23908 -81857 -193511 10258 82686 -53566 262249 -17204
21280 -115195 -99626 -217408 -270620 47519 140553 19051 -209543 -207650 -5422 -278549 -70136
21268 -241004 33899 -169092 71304 -214573 -226054 -23878 104542 195981 -188722 76541 -92030
21256 51883 58679 -149819 -156744 -181105 -45531 -277613 -121199 346997 -193289 -18993 -182672
21245 -182672 184478 -158219 14266 -195623 71461 -129024 283290 -3081 -67503 -419414
21235 -419414 -76796 324828 -194416 83862 -232602 -200187 -54271 100511 6520 -290635 -40836
21223 -229648 -128206 89354 123694 -280204 145759 71324 43264 94884 145669 -219936 -159869
21212 -159869 -114224 -362133 88944 -120601 -370510 161102 81404 56594 -45548 37957 -237020
21200 242141 183357 -254432 -176133 -125406 116701 -224951 -78924 -132631 256001 -14180 -196516
21189 -196516 -81984 -253379 -80232 -302515 -351763 -403350 -147335 -162693 -211858 308288 147702
21177 -56992 -221446 -311989 100184 -179811 -304736 79761 -101628 88043 315366 214383
21167 214383 -126016 27740 -514138 -223953 182017 24080 -158389 -91303 -13853 -30659
21157 -30659 172738 108331 23944 251276 58002 -61923 -101517 -50523 -30084 21096 -81339
21145 -22782 -59622 -66893 343468 -57535 78861 44275 -27000 122033 15066 -155815 -208792
21134 -208792 -116731 23292 -243304 -463647 -222893 -221966 -35916 -6463 -366008 15101 57129
21123 57129 -197585 -147544 -3323 69258 -11364 95678 -321912 -101377 -168434 109229 63401
21112 63401 -141942 -258484 235858 -279682 -223113 -87790 -205799 137867 -177834 -142213
21102 -142213 136658 -103369 -165273 46103 -140791 -152642 741 -119 -53931 -272385 -39625
21090 45406 -96647 7811 -117035 54214 61111 121762 142401 19544 -17826 53489 24571 -285984
21077 47179 -61961 -297355 -104423 -442636 392251 -93652 360948 -115794 10314 -176910
21066 -205075 37438 95254 -213884 -277986 374061 -293666 16829 251088 -115389 4042 187938
21055 187938 180985 -147980 -643110 -252753 -118384 15179 102429 -44065 56374 1922 113526
21044 113526 -70928 -159036 -109499 -184533 34382 -45415 27438 76619 -15576 -317876 230555
21032 23106 -100785 -253220 -64698 -312111 184640 121719 286947 -289239 -101633 42461
21021 -209660 -133518 -239833 56128 -226763 42420 74896 -17832 84666 123626 12601 -155108
21009 22051 -153941 136677 -196175 -308747 -44131 -38430 -70747 157923 44569 346297 70021
20997 45992 -102769 196213 270591 -578342 44128 -190565 -271802 -39967 -40231 -120907 -77606
20986 -77606 197572 -73346 -172510 -118163 -35880 -196647 -341114 218489 -130314 -14307 -1754
20974 -77667 -187514 -390521 131018 281432 -215367 -233369 -327263 -169543 20659 -104624
20963 -54254 -237321 14499 30539 -6371 -166682 -30952 15573 115522 33937 -375263 -305044
20952 -305044 264016 -44678 -109540 -212118 -82902 -41707 -163834 -296460 -103723 236848
20941 40950 166586 50010 -174217 -18239 -142195 62382 -20694 -4721 -157895 181080 -186941
20929 -18343 -490374 261101 220403 -159704 -56248 -167766 -140812 91678 -55738 74895 -276157
20917 1731 -150801 -323480 138589 -17657 83085 -303167 -46673 -311537 96868 72514 200013
20906 200013 257999 -113421 181754 310381 -55490 -378653 -408623 62445 65480 117977 -25818
20894 -381557 2168 -370035 70730 245501 103636 -62834 69925 -114523 -31321 -45875 -180714
20883 -180714 -245689 -29232 -228913 176963 -202472 39920 -15387 -167930 -142123 -189043 -98944
20872 -98944 -34148 -42044 -1786 62645 -24032 -36589 -189153 -109806 70757 -313712 8258 -75785
20859 -243369 -93682 132127 213199 -164994 -372673 -127425 -257875 201853 38964 -205830
20848 92447 -268909 169843 -262409 47673 -133644 -77481 -158079 81826 -164398 -70739 -130385
20837 -130385 -48718 169830 89469 -79886 -112947 -356228 -169258 71194 -155826 -232021 -483969
20826 -483969 -136980 -73382 -61413 -33485 -7051 92251 -205516 -84600 257470 16230 97515
20815 97515 -5281 -121059 64181 -62894 226540 -50098 -226334 -84293 -13954 -13951 -70064 57296
20802 70550 -205988 -216211 195193 -162066 3530 -197859 -123332 -323220 130981 42837 -175279
20790 -235138 -32957 5057 -305716 -22243 93077 234223 -367125 84275 49063 -73219 -308931
20779 -308931 9547 -64932 86325 -218528 77292 -2215 -218579 177337 -264396 -21711 8427
20767 -136198 -187343 -154329 -354228 -64328 -67645 371486 -185059 -319422 -265655 145481 -154409
20755 -107065 135461 -179525 -76499 -144527 -96633 163160 294391 -164954 -185402 -51827
20744 -135914 -180539 -207427 17991 -84011 -284479 -147141 -86554 56016 129350 -205995 -170457
20733 -170457 -25053 -244036 211292 -288186 -243746 -360533 54120 -139651 59188 -219234
20722 -245718 66340 61069 -389498 -63948 -184904 -246224 79856 -123323 567389 323460 217402
20711 217402 141141 -150447 -214117 -78359 -2978 -18020 -142012 44712 -259342 209692 52316
20699 97575 -140857 -192550 14058 -44481 194953 -213811 -92231 241746 43787 -28874 -91735
20688 -91735 -193635 26668 169035 257091 218581 -68117 -320909 113095 -225618 -290971 131508
20676 288594 69712 -91745 -86613 61994 83082 219768 73291 -155734 -152821 -315068 -339859
20665 -339859 144774 174376 -286442 121951 -164719 171345 151109 104342 14244 18539 -106252
20653 -183940 -12359 420 -284564 -164356 13529 -113538 13681 1921 322783 -261993 -246607
20642 -246607 -60264 -157560 -169050 292004 -105851 73417 -165466 -66433 -49238 -196695 267043
20630 182012 203316 -69043 -183620 -61442 -96670 275346 -60131 24322 -6639 -294412 331640
20618 -125393 175528 178751 340560 -349373 -187176 122836 195978 386155 -125364 -236688
20608 -236688 84597 -246672 -220114 36300 -185469 -67993 254263 -75784 144231 208205 -240080
20596 -109451 -67333 -181248 65865 -46286 52779 276756 136043 -360912 108499 8585 -274011
20584 -327084 -52980 -308627 -184712 -67149 -162310 100049 213498 102992 -181305 -37727
20573 -129812 343653 35934 -299826 151145 -192629 -61407 -156174 -453014 -92253 -195066
20563 -195066 220772 202660 -130721 -137435 -87998 -41907 -584340 -28027 -59838 -22374 -172832
20552 -172832 -62181 -52399 -146969 8435 49557 -43111 -52655 206826 -418927 -294187 -132089
20540 -160033 -107627 356589 -75984 -45510 67530 238627 58714 29549 151887 161532 -111607
20528 99969 -284977 -202223 -125772 24589 180861 -319277 -93214 -11301 -191119 120060 62337
20517 62337 294061 -47581 -118335 -105729 -430794 -122654 -228404 -30588 122969 5869 31133
20506 31133 -157045 -626177 -77267 151890 400037 22596 -41919 -328109 73429 -212296
20495 93917 -163318 102978 -208977 101724 -76122 -14913 -56593 -147218 201964 -204373
20484 -82406 126003 168893 -96245 -1995 4512 13719 144400 -34691 -204919 -500736 10740
20472 -15890 -120559 -33623 -98114 6234 86476 51187 19036 19064 15542 -239156 26194 -65559
20459 164735 27600 197573 -118638 72731 -6000 -65476 215167 -77972 -58812 172330 225705
20448 225705 -192407 -187144 124948 -331787 37968 -68148 48429 -603481 -68055 -406112 137435
20436 -88987 36701 220456 -15529 327479 -98183 -299531 -48350 -175155 -127587 31253 -404584
20424 -76404 -60232 269361 34709 -155915 -251903 250153 -68109 226803 -234017 -218100 60611
20412 119907 -199544 19430 -167652 43772 208319 -18255 36857 -87272 161107 38471 -223762
20400 101313 -40060 88724 -228800 -370147 271180 -173194 -10687 -64401 116458 -307750
20389 21366 -190000 -262902 22267 -181209 285801 29746 22217 84887 -242520 -39428 -119213
20378 -119213 -75679 -47992 -381865 -75791 -255680 179044 11733 -131528 421429 -178929
20367 62468 -4072 95017 90259 -38123 265884 267483 -244181 165529 -279938 128288 -229711
20355 -18223 105172 -250681 -101783 571 177756 138661 -305568 161429 -142115 -56280 322563
20343 -160391 -85874 -178898 -73389 314924 -227934 -39690 -125804 168685 -274408 -175474 -122101
20332 -122101 21127 -164843 -94015 -100621 -228325 -125460 79289 284869 -28967 4462 -91423
20320 -35550 144469 -215518 -126822 -101198 2409 7729 -12763 -269857 87665 28485 137804
20309 137804 20675 26262 -49832 17439 174764 217508 131140 -70797 -180289 -164447 -317166
20298 -317166 212828 123384 401100 -59380 -84617 -281191 -173559 -201018 47936 -38577 -117232
20287 -117232 -35133 31101 -311944 27181 139599 21249 64679 -197425 -259088 -417089 38054
20275 -132358 57614 -218883 138671 -150457 81535 -235341 -165910 257405 301742 164295
20265 164295 -30948 -113791 -129685 160718 110625 -90902 -133566 -45904 19035 -104040 -50557
20253 147469 -126675 -167847 -84768 101612 -71412 -416504 185999 15901 -80667 -496223
20243 -496223 -180293 -385235 78924 145868 232093 -9134 -12488 -73479 -44059 62348 -17687
20231 -483682 43334 -285790 -26753 168767 91071 179445 5562 -192853 53327 162698 -173692
20219 162052 -316106 122003 -251583 -125351 -165979 76961 197842 -68706 -312076 -264629
20209 -264629 -118770 -156901 -226102 -19674 127530 -107330 440238 81205 -153396 125621
20198 175773 -15486 -341789 -250204 -358724 -429492 -7479 -108693 -295838 -23229 -173387 -192706
20187 -192706 -144095 -260865 -131274 -136064 -47041 34677 226859 -75822 -41082 50034 -390976
20175 -185884 -326432 -281307 -118564 -218448 -242224 -122360 157448 165475 -190535 92290 -480601
20163 -132518 -216079 -397869 -60123 178638 -69816 -198690 -108113 -167552 -158637 -405695 -49177
20151 -54192 282062 -76089 55250 -43845 129503 33860 320502 146431 123980 -48321 -331494
20140 -331494 -269074 299190 -172602 10225 -188796 65152 -206383 60764 -24797 -539854
20130 -539854 -26133 -179174 23830 52378 217627 -230534 55919 -85765 -42848 -167440 62053
20118 58977 -268796 -237351 -218619 -216101 10314 -368869 26989 26613 -31188 297418 -478664
20106 -62488 -44479 -19809 -174728 10342 85382 -11643 -26451 -174856 -53502 40632 -203224
20094 -261164 127035 -71000 -87158 -19473 -263210 10470 -252900 -475764 -199160 -121402
20084 -121402 -149731 -352944 -296976 247014 65889 -35870 -92814 -38292 112828 -367476 144713
20072 28150 38366 69800 73593 -199940 21993 -167973 174584 149402 -68625 -87568 20832
20060 151701 -56681 -59684 152101 3828 -68060 -17358 140532 -51861 -236538 79162 83005
20049 83005 173968 199338 44615 -114980 -109266 -252375 62158 88383 -106452 -276132 -9538
20037 138250 -30333 278765 -87608 96963 -87214 -54714 -106230 40775 -74026 69246 -6490
20025 7959 -173725 92056 -214930 -12225 31449 -504101 -117677 258971 226719 11952 -484324
20013 -846 9764 181040 230525 116690 194446 -127102 59288 27631 -222619 -149482 -135923
20002 -135923 -68684 -14456 96636 -31617 -247603 -177910 -117459 187053 -31989 -289625 30908
19990 331152 -642951 203112 -161997 249989 -304333 222906 -157020 110749 -29413 -40198
19980 -40198 100851 -226928 -194068 69959 -442234 -9004 -212693 -145952 206299 192220 64778
19968 -319589 -7720 -111326 28159 -262098 -324551 331202 -159604 460155 -34535 273545
19957 108083 178071 70045 -235296 109851 -264637 344333 76772 -386561 150010 49517
19946 -143965 -183568 -50964 86946 101335 50062 105457 -97582 168072 -356381 -58897 -25453
19934 -457411 -76750 -4399 42031 9150 -303843 -140188 -279755 -124404 219176 -264473 -8246
19922 -86274 -76225 13831 -62690 5649 -216916 -4520 39634 -225369 -204896 30759 -195667
19910 -487563 259594 -192990 26134 -51228 -258350 -203362 -200467 87214 -121850 -191626 152756
19898 3183 -73911 -82996 -147360 -298203 338785 -404110 114433 93332 153902 -76044 48079
19886 128278 28378 -377440 -30425 -149722 33274 -172515 127335 -176187 -93966 289185
19875 85941 -68765 -57317 -26651 -152540 21676 16501 -72570 121979 -369291 -214344 -24457
19863 -73787 -47378 -204743 58136 54968 -279494 -286722 -214885 -102450 124830 75435 394525
19852 394525 -95557 -69471 1976 -45196 -144432 -71144 -128278 -160293 -336847 -177043 -300869
19841 -300869 -258323 39178 -134919 -33008 93394 180839 -89811 -25147 207786 56824 -39740
19829 -240974 -18735 -389327 1546 -236099 136588 -245208 9974 -15744 39829 138894 -167414
19817 32416 78603 39338 -68950 -237221 458555 -19173 -229147 111965 -96428 -133640 -225320
19806 -225320 -152680 -274332 -283601 -61373 -108594 -109315 -63598 43231 -179771 -313612 -518137
19795 -518137 -159121 -60196 -35935 -16767 -33770 -273294 -272307 -92195 -199244 117998 -42316
19783 211430 -155399 -91353 -151638 -308580 154107 -133232 -10910 -100096 -169811 402138
19772 -27433 -86447 -116444 21067 -411676 -20168 -72913 -217664 -22045 -190266 -141832 181333
19760 320939 30351 -137658 245790 95571 349470 144071 89200 -58347 149028 11588
19749 -154622 -80377 -23768 12337 -123341 176104 170312 -168197 -188173 -363214 -191483 291178
19737 -238247 -30606 -14876 -3711 -45551 -476199 -357590 150743 -96107 -168074 134909 217907
19726 217907 201908 53953 -212336 18718 -95895 16478 25619 97425 -37940 -327003 -6575
19714 -29001 -271391 188183 -69507 84894 -113981 -197301 -297414 -30226 23709 52287 270570
19703 270570 -432699 -188564 90882 -88164 182006 -192960 -260158 -116728 1213 137137
19693 137137 56313 -35400 -244801 50644 -181455 -185107 -64758 58220 -25606 -113353 32594
19681 28328 -380889 95811 315399 -275010 -131524 45895 -60096 355930 91355 51276 347861
19670 347861 -169547 368773 70088 -503076 -62389 -56764 -145184 29421 70883 -148540 81724
19658 -97452 130344 -54316 -199495 -398576 -58220 -76071 233865 149818 -119440 -89470 -10191
19646 -251173 386582 22287 33143 -55190 -355844 -13537 149347 40587 36850 304637 -78713
19634 -39354 -349018 -145415 -211394 -111829 43081 -135049 -389527 32144 -26239 -249293 -73815
19622 184434 -298759 366297 -174611 -77839 -204777 65246 -186245 -297181 -167387 -181486
19612 -181486 56905 -162300 -175736 34109 -215967 -246359 -109830 -155270 -198956 -55863 45373
19600 72087 -244863 -344452 -137933 -105876 148873 -227914 95477 -31268 -121100 17078 -79121
19588 -160223 409499 -127299 325177 -124596 33997 -41167 -174972 -58534 -213660 134546
19577 -123551 -158075 -184004 -134933 29249 277960 -351117 165271 -57791 -141518 31820 -120532
19565 54377 234079 97083 -157339 -43220 -169444 -302547 105941 -183314 7834 36834 -166495
19553 -240334 17268 -198040 -303078 -32883 -956 264320 64090 -40327 -132940 116977 -105305
19541 -6456 117638 -26627 -170438 -81004 -197624 88193 -191452 -62218 -82462 -51656 69457
19529 47851 265735 -87429 256555 -239777 144703 60816 -173162 -89867 28391 -364201
19518 157832 -131600 252862 -334238 26625 -306518 -205115 -12145 185718 -162549 -267607
19508 -267607 176648 58658 -274797 144218 -271826 -39104 215898 -199990 -38024 123499
19497 -439194 26287 -199536 -177399 -313771 -169242 -100178 -143960 -257794 331774 -73302
19486 -66100 -96122 -179607 -296321 -71396 24747 -181315 -10596 215828 -432508 -273436 -30650
19474 -132938 -316153 15882 -293000 -58312 173389 172750 -121218 -144750 102970 35147 -22436
19462 108016 -63897 -187317 5229 -372560 68509 -85663 -65557 -27321 179346 154180 -113434
19450 48685 -405582 -218308 -21538 -282847 -105003 -157251 -32658 -158367 46779 -35423 -261559
19439 -261559 52051 -111925 -283323 -179604 75416 -232976 -163240 -212920 -182155 33740 -58854
19427 -17032 -128560 -367539 121269 -35793 124028 240826 81512 160587 179233 -103451
19416 -77234 -115510 -17096 32526 -181028 -197094 -95919 -111655 -23269 21375 41347 -85859
19404 -4931 -203803 -247975 -50383 -242298 -114931 -64996 191680 -90168 -104607 42666 -249324
19392 191392 154334 -255301 46478 -167487 -10749 -226518 -123550 -301065 -350138 1057 -85362
19380 99805 -254487 34696 -4709 -210210 -129852 56059 177375 60355 100995 -17058 -208446
19369 -208446 -136085 -327582 -234556 -357385 -91737 -119368 -23971 150995 -181911 -205262 142413
19357 10683 -411395 -152614 163131 29282 53563 472544 11882 -85185 164760 -44580 -247053
19346 -247053 -190630 -155657 -46699 182926 -233430 -128445 -163471 -79735 372895 20859 46518
19335 46518 173085 -25325 -168604 14390 8810 -36003 -267296 185262 -221886 160266 -16301
19323 156328 -368572 66749 -127823 -7002 146131 -263978 132001 -54639 -26242 -181284
19313 -181284 -224162 -145001 75177 -101552 -308386 -87539 -79829 -159005 -98296 31314 -49153
19301 -258004 -31021 -454304 51457 -308415 265628 106245 -370387 -101079 -41663 104650
19290 -253882 -389676 341629 135214 170894 -123445 -35117 -17358 -131767 208151 81097
19279 59736 311118 -452704 90975 76785 19664 -85582 -71595 -112985 -14754 -245740 -201304
19268 -201304 -223949 94550 -89602 85148 409383 -134419 -281257 16609 156555 116116 60260
19257 60260 283736 -149062 -14887 -183566 105678 -138289 -211628 266995 -57262 -231990
19247 -231990 70803 25114 76099 -159628 139929 -63446 -171159 -3947 106958 -93319 -185221
19236 -185221 37577 -456594 132750 -113538 -52404 194445 -244854 537 -122235 -334628
19226 -334628 46073 -55696 19359 -21175 -71211 -331979 -38025 284740 280528 78015 -304620
19214 -258049 152534 55500 147397 -23070 -5996 57632 -165258 -29078 -255560 42677 -45057
19202 -38380 -83121 165137 -200046 -327017 8987 54830 -171274 -17709 -19506 -302360 -39898
19190 -97599 -11289 -229542 -172865 -262542 -171951 -278523 -102318 -177727 -254519 -220727 118620
19178 -178871 38726 -240060 -219744 154391 -104593 158196 -68626 -272674 -248316 31799
19167 36172 50158 29421 21803 289022 -245477 -12524 161040 105433 -201486 17274 27552
19156 27552 -360722 -19035 108087 14062 -86870 -166359 212108 -226699 -211016 -215258 -264716
19145 -264716 178664 402896 -100563 -181850 -42014 234041 -46455 156020 25201 94353
19135 94353 27809 60895 -430402 -286285 -118643 -175041 -60493 -13875 -232671 -333424 -143400
19123 -245817 -102015 -126951 -69885 -253909 -151937 -142458 -169568 18434 65544 93210 -21157
19111 -93001 142172 -9501 -107248 -215616 -331816 139433 -7657 -670 -93840 8010 48487 -122030
19098 -250580 94591 -223791 -323644 -168212 -103676 217136 166025 202824 -347644 -35490 -256895
19087 -256895 -38813 124647 127825 -64161 275929 338283 -278673 46231 -208435 276371 61084
19075 -250835 -203667 225124 -196396 -16527 -211147 -281189 -35665 -132038 35926 -103087 135491
19063 -178435 161268 -210401 146517 -1183 -244405 -31852 -222194 -292951 -307635 141991
19052 97611 -58155 194485 271447 -361103 -54678 -64904 -150801 -209016 304627 -124657 -126365
19041 -126365 -181189 59728 146054 -209724 45280 165502 286867 -18287 -73540 276459 -124308
19029 -178296 311393 -141568 -164762 -8592 285515 23668 -209185 127996 283537 -363816
19018 64150 154707 -138063 60067 -55254 98354 -82759 19973 134475 117286 -35041 171603
19006 45632 155097 -190270 71155 -76664 104569 -332911 -165479 -88209 -74941 11687 40083
18995 40083 118487 55312 -78660 -340128 164243 -78252 141399 -330498 -37356 -42526 -80018
18984 -80018 -148311 -52165 -371240 66738 40415 49747 -73708 12022 -62279 -73378 -211366
18973 -211366 455455 -120712 72972 -416891 -66503 -137893 -6664 106615 -85284 -33436 -77325
18962 -77325 -157429 -117270 -209927 -240755 97693 -165 -58546 -147928 61705 308599 -44629 -214276
18950 -214276 143618 175427 168931 -263645 96839 -84679 -185197 -203476 -186785 -183709 112075
18938 15032 -162917 -375 -25675 -11404 16976 -282514 -297546 -405189 -82527 -77193 -17881 -40974
18926 -40974 182046 -256674 -280845 63669 -219226 170457 -61971 -144246 -211616 -36524 -51475
18915 -51475 -139659 12360 191832 175766 -186126 -216320 80311 -186031 -224946 26308 -124803
18903 29200 145543 192390 -375805 -99679 287023 -63909 -113780 179906 -62132 -116862 102485
18891 -252889 -113053 -464983 102928 325393 -475242 -119621 -23099 -175607 44459 -153985
18880 -47695 -50195 -434504 -225290 149698 138926 -10184 -71333 47589 -142034 -105463 -23996
18868 126086 227206 -123360 217558 -216540 -118394 -117821 -165128 -224586 96828 283814 -236492
18856 218623 -45756 -25047 -65176 -25812 148546 254625 67431 -31310 -23033 131505 -180733
18844 10016 161371 -37673 367884 -392382 -12145 -307590 -195964 -139290 34217 29446 -279727
18832 25909 139191 -82009 134568 24317 -146486 101550 -52052 18717 -81846 -38521 -293793
18821 -293793 -173029 487303 -158712 3959 18591 -341569 51843 59626 -42166 83005 -94352
18809 -282413 80449 -82406 -62977 10439 -148350 41273 -420222 -336160 -85420 94740 -14829
18797 -212761 -44256 193552 -200619 242545 -217260 30519 -152940 91301 -55144 -132216
18787 -132216 -51791 -303629 -28251 -328076 -17020 191923 -161129 30032 -34777 161130
18776 11117 312885 152276 216982 51444 -330546 -120409 -219613 38783 -70838 290 -220134
18764 -242564 17590 -74208 -164168 -162847 67984 -192858 176409 -51003 -75751 -252844 76785
18752 -53157 179866 -27609 189677 -48840 77337 -298339 225060 24610 171203 256728 99414
18740 -126071 -110126 14547 346453 300388 -72015 -8411 -286482 -218133 -215343 -49088 -229532
18729 -229532 293463 268054 -50982 137549 -49708 1308 -70581 -226366 -179051 93882 -162956
18717 86306 285282 -189035 -271847 -131644 56315 -53835 -92374 -25360 -260786 134485 -321552
18705 -91521 659 197908 -300880 122610 -156938 -179196 65910 -2217 159911 174194 -59100
18693 55804 264242 45387 -30308 -310212 -196819 239561 -163359 -55128 -11538 -97104 18636
18681 -304489 132621 -226789 -235361 32369 -54858 -210896 -403372 -134212 -413823 -269102
18671 -269102 147465 48359 -203031 144767 -166099 17862 -249322 -242380 -140720 177024
18660 -442590 -260802 -74901 -84284 -29739 -173293 -164069 -294439 -272884 169768 -2121 -80136
18649 -80136 -15086 -100611 147542 59020 -67029 88449 -327793 -166871 -206238 50590 -129013
18637 3801 -89703 124079 -105523 202637 -266804 -194687 -55964 229455 188211 174733 23703
18625 -6370 -232550 -154459 48245 304474 -56046 -199364 -295050 -198190 72412 -105931 -112204
18614 -112204 107870 -101716 -53258 11042 -125319 -137063 -136439 -194435 -126270 58904 183122
18603 183122 -149681 108506 76543 -40460 -280915 85319 55012 -57966 11520 -306944 -45140
18591 -108314 -55612 -321366 99478 98869 320621 -76183 -170329 65260 -52732 174144 -232631
18579 72856 69891 -189117 183979 12796 -39839 -91862 -45039 -258545 -195368 -304551 108631
18567 -127420 198915 -260460 242136 102098 80261 122683 221550 230583 -125786 -142745 145135
18555 -4445 10212 -200189 -72287 -8551 -227358 17371 -84376 -161353 -111831 208591 82281
18543 -259737 -232123 125509 -1964 246071 -313314 -225591 -81770 64165 -68752 -87287 274565
18531 -75704 -277904 -160098 -118424 -79305 -87512 51877 -166768 242067 -36486 67067 -233973
18519 94337 -100690 -159845 217717 -494478 20692 -380576 -50568 -180222 232237 -10731
18508 -49929 -26755 -365552 117728 26332 -392505 -202914 12362 -65027 198406 -104199
18497 -164443 71657 190269 255246 40487 -46005 -260925 316073 -88752 -1220 -343014 180244
18485 -33498 113760 -261493 -71735 29914 73199 -39651 -444243 -96338 10249 -208450 3869
18473 -19781 65527 -301617 33159 -271056 -91265 -175947 412860 -73951 -105150 -267786 -431479
18462 -431479 163213 -144780 -535 -279930 -233836 -6932 27469 -331302 225354 87923 -512790
18450 206652 12840 -33860 55398 -247227 209350 -3058 -160934 -32868 163540 -85883 -100531
18439 -100531 16654 -338963 62396 -24598 -116653 -257028 341099 -249393 59051 -28192 -255125
18428 -255125 343251 -39692 147997 68487 69525 151111 180702 -410553 -55022 -182906 -46359
18416 -147061 317334 -274590 -300264 -136256 -227342 -130613 -267271 -73567 -239348 179550
18405 229626 -120175 -31382 -54731 114884 -186203 85120 101066 -264207 106341 -151171
18394 -80425 -168115 -118805 -202800 -48293 -30283 -48972 -78993 113289 -227751 -22878 -142115
18383 -142115 -77262 65715 -94317 -132995 -261194 13662 11983 73862 -226444 88771 222629
18372 222629 104255 -90776 -385801 23203 198150 -291598 -217893 -226650 -133906 394193 -159410
18360 286816 213148 -467625 87743 375158 -82851 55154 176594 -160288 -298028 86330
18349 149621 -93463 46708 -219360 -206147 -139515 69127 142486 164188 -204105 298456 -38760
18337 198297 -46470 137403 26098 27757 208134 -193039 41961 -106838 -355954 -226993
18327 -226993 -57803 -168011 -75732 -148927 -68680 -30535 297226 492086 39808 -133462 -120257
18316 -120257 -542087 -301132 41338 30113 -178590 -404958 -103977 56086 178178 -182850
18305 132302 -188950 -677 -107400 94433 10482 -47155 101258 54666 -228677 -92309 -223642
18294 -223642 129940 -60254 122084 -44646 -28229 -157850 -71055 -328565 -69226 -146941 -50138
18282 -114032 -9874 242178 104136 143456 75050 -105236 -98051 95912 -291966 85166 80730
18271 80730 -13783 -99385 -213744 305310 -142355 163051 -190445 76789 -336384 148027
18260 101772 249546 17262 -87413 -406208 -171837 -208863 -127252 -95658 -217954 192701
18249 -68338 -102942 195889 169559 -123990 -97757 -230377 41703 -39568 -279248 -100466 -106886
18238 -106886 -353199 422943 59366 -266052 251766 -735 -89928 -52533 -189675 301192 175841
18227 175841 184545 -117622 -17698 -299837 -32447 43415 -152134 117091 246981 -105571
18216 92357 210268 -267927 -125773 2874 -3114 -355299 132204 -8244 141249 25342 -39055
18204 98361 -78226 -242721 105337 -59166 163795 257596 -90160 -58373 94017 -333926 63739
18192 -8990 -84126 -154012 -362391 66955 -4511 -35368 91868 -156470 -104158 -62702 281815
18180 -245716 -125932 -166383 -56396 -162190 -243180 -17587 -258699 -112875 11274 199458
18170 199458 -770 221746 -144279 1832 -104768 -19114 87728 -100380 136871 -159447 -461555
18159 -461555 215383 187945 110377 -38827 172091 109872 200138 -12664 -39212 -339470 -149708
18147 -272651 103103 50942 -253753 368009 50180 -161151 62204 126707 298816 -170867
18136 287519 14106 233511 11957 -46328 -149128 38231 67467 -424160 202818 74523 286465
18125 286465 67864 -79661 -265738 -28620 44474 -234784 -352445 221228 48142 96909 -275375
18113 -58905 130425 -578333 255159 153158 -255298 -248117 -79547 2979 86724 -169676 443308
18101 -465924 -276279 93105 136935 -49047 224131 116657 -306491 -63209 -229124 207457
18090 90133 -12111 27103 -112284 -190016 -213171 -49654 -7723 -193011 -19620 -275531 -82779
18078 -348465 96870 -91511 179749 -80709 -133851 -154672 -311720 -37978 63056 56915 -257316
18066 225489 152702 338620 8381 -220471 -12573 214092 -110818 -148797 -166000 -105340 36634
18054 -212685 -137587 -17461 -100287 57461 -224732 159078 56281 15600 -274952 133671 75039
18043 75039 -13674 -319016 -437514 117500 -169408 -251111 -224432 257749 -312256 -66893
18032 -43493 260743 3061 178214 554 5464 -214184 18819 496635 1306 55765 123994 236820
18020 236820 -250 -166098 10915 -460218 11553 -85836 -101665 183780 -96107 -109464 -303527
18009 -303527 -59646 -293990 -81322 184545 16579 -170393 -269773 55080 196069 62652 -12456
17997 145873 3274 75469 -128021 -134910 175985 126477 -55755 106463 -65921 240631 -14281
17985 -40750 -62429 -114526 375689 -210970 -2312 46958 238197 93543 -243789 139525 102396
17974 102396 131259 -304142 -150079 -8036 -17711 257717 93246 -4716 -93288 438190 -241716
17962 -213177 38792 92750 109030 215666 -192040 36724 -110034 98298 -39752 214272 100922
17950 -200629 -80827 -106693 316911 -59685 -303937 -108037 116314 -239400 -122174 169464
17939 -236132 -176664 -131257 30843 -242661 14862 103051 -18860 151894 -25527 -111538 149744
17927 -115486 133864 -152533 161398 241768 -44876 99320 -90213 -386098 -66931 -216493
17917 -216493 103144 -219093 107839 -69680 177111 -110461 36164 241939 165117 -80057
17906 12664 -164342 -202693 -36015 180530 5872 -123948 -166374 213014 114123 -28090 24658
17894 -391269 -113581 -102584 7904 169226 201855 -82694 -42469 195278 -229780 307089 -194732
17882 85768 -114127 -148665 186429 -129811 -36223 385574 37907 164528 180048 -9316 88625
17870 273316 218441 -118696 -154566 -159631 -114905 173424 -10549 -373132 -18381 -331676 -133790
17858 -3047 71887 -157932 -68872 -13852 -88853 80324 72175 -90308 -193823 -109544 56846 28612
17846 28612 120113 -307825 193918 -113091 -44225 102876 447501 -234598 240474 169278
17836 169278 89128 -91625 95246 25422 241734 252491 240608 -160684 -53319 354163 -35236
17824 -78164 220835 43810 397391 50842 79486 22238 -20786 -31278 33799 -341832 -146345
17812 -88480 -161928 161157 -44876 26453 -42822 -99268 187904 64973 84261 73944 192650
17801 192650 -37816 143799 30958 -1408 108858 156704 115365 -320955 185435 228496 63855
17789 120743 -129168 -108739 -16642 -168644 168301 -5186 -94369 4982 -97048 53506 410484
17778 410484 -63317 -126536 3582 114102 -45873 -175821 -120302 -167192 119751 -34473 111604
17766 -26851 41305 91410 -52689 66780 -116423 -173375 40776 -90593 75757 -255453 -186846
17755 -186846 -142173 -53417 51717 360085 -288271 203788 -165361 -586123 183324 14180
17744 -316248 125492 159899 -78450 -58623 21300 -303623 166170 -48810 -20842 36980 44993
17733 44993 -103677 290517 42119 -224247 -15577 -18135 3015 -146978 -90160 -39682 -205039
17722 -205039 -239478 5055 19323 41155 18325 103775 -156702 -143040 -180446 -56932 -50459 132923
17709 159570 -99269 58662 -57697 5659 -44944 74965 369038 -130140 217468 160184 159827
17698 159827 46805 -210394 -328284 -6149 33983 -207611 34861 175259 -3886 67518 499179
17687 499179 -20174 145411 -19018 -38443 109401 -45456 220481 57591 -14048 -109338 46787
17675 -158077 -23303 -75945 236399 -255469 -39178 96697 159373 -302332 165733 12847 -125495
17663 -36514 59381 33032 118852 -155314 252945 -91795 281260 -262745 81067 422620 104824
17651 283459 162600 -150599 9081 364202 183466 244903 44229 112456 -57433 -276766 -172919
17640 -172919 224527 137091 163313 -65843 21512 48844 102482 376854 261847 -338646 -398350
17629 -398350 90602 -82612 -32949 -101579 135248 151352 -99334 250446 253053 -193286 16670
17617 -115192 222380 -281278 292667 192459 70826 -249744 131822 -16080 262844 226656
17607 226656 374688 -549399 -68914 -53001 87099 129819 183885 76271 7179 159633 357635
17596 357635 74124 239129 -100010 179563 95833 61105 15482 226511 -122181 -78683
17586 -78683 -110769 20153 385434 46119 -183060 -247304 -153204 314630 358251 276286 -44957
17574 -78813 39431 454144 252287 -323848 -108021 96287 -65147 -17654 76309 -13493 412918
17562 72423 -19878 87401 -131501 7967 -76315 -320340 -77422 -89795 214801 120144 311441
17551 311441 -131088 209933 34695 -14328 415570 42918 -24066 128784 169923 30038 5123
17539 -6413 68138 198009 34057 182771 199548 204533 341843 -202215 252583 270358 -59753
17527 117754 -16210 -253033 -72621 -136216 175302 77327 60752 137381 -15234 -146655 381738
17515 117556 217286 13515 64015 -35125 256316 264983 -35612 444649 -5524 -248280 -286043
17504 -286043 92031 69345 -20385 38340 -40980 -152709 -4111 365627 -56141 -154075 77137
17492 153154 464511 162222 181587 -238748 44212 -121605 475307 -6373 31462 54992 -257749
17480 115409 267043 178151 69603 219780 106379 58577 -99047 300376 24184 63696 154920
17469 154920 -80704 450024 148403 -192551 382608 217718 47567 122980 -121387 211087
17458 588204 332546 133721 26588 137421 -174400 141160 195253 169400 269857 -127037
17447 425972 217733 531585 357005 95754 91432 367733 216888 98747 134926 266160
17437 266160 -22980 54927 417766 328727 289120 419631 90546 109902 511083 217176 192150
17426 192150 340085 315259 1123 267635 600933 21503 328979 165122 9851 115611 128805
17415 128805 138583 494417 496310 -28732 175381 58877 346202 177723 26020 263653 144816
17404 144816 -30380 258269 14164 149277 110389 251691 159564 52896 286597 261499 70914
17392 112574 415986 225439 181789 324982 13969 -117901 147602 -165577 86318 322477
17382 322477 10942 22166 -59632 358073 91543 47980 234541 155342 -258939 149284 -24093
17370 91823 255089 343968 40567 -91974 115658 61012 -396785 396992 337191 123109 530030
17359 530030 111390 -256813 -234896 147895 250667 -132067 206446 -29577 184400 -129719
17348 -133616 228055 109873 288916 331722 29680 -183476 -126385 256169 167959 305412
17338 305412 245786 275708 132418 177669 218812 44117 331343 298444 227194 520768 413359
17327 413359 188776 235541 429933 42938 444062 316607 253248 -28605 74000 213824
17317 213824 67862 60828 248794 -139366 349105 359730 233685 33725 331902 97149 39338
17305 150314 301715 170425 470132 6406 195657 272391 -312729 196644 368103 32823
17294 -218163 -24111 321053 529247 -32894 225804 321635 51061 606313 127388 442242
17284 442242 64675 -227523 94495 -149312 379414 -251461 340041 276816 -98278 170101
17273 -27328 3026 29733 466212 187770 157549 -194904 11392 257187 207727 -104866 127526
17261 -132083 226462 212582 382348 -244315 120386 149266 101592 437786 108971 148632
17251 148632 358269 236293 338951 14277 272963 -41115 225184 210553 -7848 283636
17240 104588 260637 226836 190688 238363 398982 96187 56549 -16867 374399 294322 155169
17229 155169 181843 -204555 121572 207672 339348 -100473 161866 134904 237410 128248
17219 128248 -37481 106253 179297 348369 266300 253395 358622 338994 353332 450829 538803
17208 538803 366706 188821 55976 224572 201644 8968 161206 -106751 519358 114934
17197 -51952 178472 336715 328829 117684 236497 343664 376927 379556 304681 406216 540217
17186 540217 402489 366808 364358 331975 45996 233574 220911 376228 224614 369359 643064
17175 643064 684923 483348 460622 182347 205962 319777 249113 398922 11916 -45154 341553
17163 421257 212733 394843 294574 116764 301000 120353 385580 340265 339316 -54340
17152 384807 -5605 33886 266610 591663 204690 205934 580806 254283 168998 102346 282848
17141 282848 459580 313083 228683 116946 222306 94071 325972 218473 673913 273438
17130 621664 185954 630275 -7491 402402 488257 259519 113609 345403 420403 94474
17119 373054 282254 112167 398587 237140 185200 389210 519370 566844 434308 442133
17109 442133 594581 254145 705505 380365 462593 31745 437723 212035 674199 576791
17099 576791 350967 783190 221175 438358 380453 560456 420264 359040 450329 361828
17089 361828 496975 526764 425118 324274 172576 401000 488798 412291 731517 264921
17078 159888 478201 375860 95314 272053 583544 478054 389330 653402 778197 69079
17067 357113 473247 575571 368003 851857 502485 793020 496529 553715 693503 476236
17057 476236 371488 386101 448849 739444 471933 656124 449492 700581 551665 710037
17047 710037 539767 730360 591327 546022 430177 636782 304855 967526 566355 397150
17037 397150 692400 645293 667367 630507 794358 358830 274288 365818 695410 735105 545222
17026 545222 962833 647755 874782 998978 547121 604388 854573 842871 903911 647549
17016 647549 645858 732216 880576 1038309 746883 457120 875457 664686 728006 590831
17006 590831 854595 706785 847398 831209 588668 732462 657507 800698 707063 1174579
16996 1174579 839166 655127 818518 939916 838963 757274 662990 936399 654307 489595
16986 489595 724770 713870 1022727 829975 885770 911151 583016 866347 930661 853322
16976 853322 902702 969537 1148976 931764 1116472 1253410 1124747 647360 1196188 846607
16966 846607 835808 946036 1033254 1424344 1146962 1112299 870173 1119782 1313709 811177
16956 811177 1003761 1299512 1132622 1128916 1226116 1352699 1072635 1244973 1124509 1351107
16946 1351107 1155617 1152270 1050503 1293475 1101914 1223216 1352935 1279665 1083061 1359150
16936 1359150 868405 1118315 1501281 1259910 1351401 1140224 1706200 1574912 1583537 1314112
16926 1314112 1198893 1565416 1440261 1224628 1386134 1742121 1421790 1435770 1612657 1049439
16916 1049439 1620046 1933511 1446162 1564102 1767731 1876401 1596334 1749696 1816992 1235020
16906 1235020 1802274 1884127 1826990 1720411 2055821 1713292 1842590 1937779 1885752 2089249
16896 2089249 1925336 2305527 2260716 2081119 2190826 2174164 2219591 2191214 2361956 2304625
16886 2304625 2460832 2052138 2249916 2307337 2291174 2442499 2483105 2383310 2450364 2755913
16876 2755913 2494552 2650894 2532129 2407170 2861846 2583184 2749817 2938206 2700677
16867 2700677 2846446 2649613 2820300 2919109 3234972 3224905 3047958 3164663 3417138 2891586
16857 2891586 3416532 3240239 3283138 3260638 3685895 3621292 3778263 3708769 3498608 3392272
16847 3392272 3789133 3983008 3789074 3869235 4140092 4297002 4377136 4445675 4175253 4292795
16837 4292795 4505456 4507245 4959564 4704714 4691692 4992820 4959098 4634180 4911543 5375007
16827 5375007 5203710 5544684 5785612 5537882 5973590 5503501 5844247 6058951 5714700
16818 5714700 6663700 6322585 6739034 6896411 6810887 6984321 7175769 7244317 7303222 7755486
16808 7755486 7589851 7751607 8014850 8326004 8326543 8938534 8701212 9247725 9304679 9519295
16798 9519295 9665240 9422811 10099406 10235262 10741901 10675986 11068502 11484299 11907230 12339690
16788 12339690 12522112 12660121 13314231 13623740 14101295 14138635 14526500 15353873 15483090
16779 15483090 15849116 16592979 17116563 17338718 18353227 18768157 19242036 19835368 20787922
16770 20787922 21559146 22296975 22944114 23871024 25188704 25782157 26447865 27786459 28918948
16761 28918948 29820435 31406949 32428805 33688342 35067866 36797911 38454994 39911806
16753 39911806 41455855 43721053 45880860 47831278 50325330 52910729 55103710 58057586
16745 58057586 61474950 64149585 67254390 70989518 75237078 78933467 83207353 87469908
16737 87469908 92633507 97051025 102573083 108050814 113586297 119403546 125568389 131752579
16729 131752579 137965280 144022937 150020659 155969362 161668782 166614919 170905659 174956485
16721 174956485 177882715 180233645 181331781 181721181 180866615 179429719 176636125 172764283
16713 172764283 168721074 163795119 158536172 152337370 146408413 140246985 134023253 127708863
16705 127708863 121366412 115429424 109182104 103733186 98311505 93512343 88505877 84080432
16697 84080432 79767569 75607002 71469923 67872384 64601499 61132811 58447142 55059717
16689 55059717 53032596 50247283 47711151 45633803 43669467 41745189 39600500 37795753
16681 37795753 36362087 34856543 33269269 32343171 30961970 29481186 28335600 27163922
16673 27163922 26358884 25306960 23994008 23476218 22955324 21864569 20737117 20345772 19920808
16664 19920808 19056549 18727138 17914162 17450606 16581710 16347888 15775589 15294890 14664074
16655 14664074 14465215 13998788 13700446 13052310 12949094 12372745 11866469 11961037 11213270
16646 11213270 11356440 10609421 10562993 10297282 9847487 9645017 9373701 9705085 9141200
16637 9141200 8717265 8714163 8315715 8256747 8276892 8193044 7662284 7503324 7331167 7235066
16627 7235066 7322656 7131080 7141136 6838349 6484703 6630502 6150873 6317679 6003678 5820903
16617 5820903 5391007 5569645 5638970 5714038 5656622 5147251 5007803 5155682 4976839 4957516
16607 4957516 4713638 4952205 4660183 4681578 4501351 4500051 4528047 4375760 4484438 3827408
16597 3827408 3984885 3992381 4120589 3638588 3953095 3679810 3805065 3418426 3426286 3272461
16587 3272461 3517039 2971189 3444558 3294701 3128426 3102105 3522897 2958830 3001728 3101998
16577 3101998 3220282 2830848 2713565 2533220 2639662 2758681 2921325 2732398 3014327
16568 3014327 2793780 2805327 2357861 2417830 2536705 2570446 2355156 2442946 2166043 2526488
16558 2526488 2139504 2485020 2549811 1962696 1853108 2283605 2070151 2267863 2344409 2239424
16548 2239424 2068933 1973792 1923565 1898993 2100713 1859947 1856954 1605596 1642918 2035598
16538 2035598 1707564 1944053 1748218 2072241 1745237 1808677 1641984 1635446 1480140 1619881
16528 1619881 1728843 1741762 1445345 1848767 1725292 1561152 1640051 1440265 1631674 1641050
16518 1641050 1474255 1463046 1463096 1300801 1368218 1257414 1061725 1172613 1416223 1307490
16508 1307490 1391917 1146087 1495737 1360307 1320616 1187474 1425168 1179051 1385512 1033326
16498 1033326 1281113 1271642 1358694 1455633 1158422 990160 832060 894558 1284621 945453
16488 945453 1196098 1493767 985519 1132656 1099203 1281355 943366 1024800 728997 929064
16478 929064 1019463 710805 1123405 983770 1204139 1198759 1078807 965335 1102566 1011702
16468 1011702 1243371 1087443 956584 1210850 863021 955799 900646 670070 679628 658741
16458 658741 565056 931290 1133132 978029 700993 1157152 796394 1011058 726846 547717
16448 547717 776049 1015247 931690 818725 663972 841919 942953 742098 937401 905294
16438 905294 1060493 961221 915002 677243 728200 688543 197053 668491 621437 751985
16428 751985 693090 586454 773150 1086941 709341 480401 574325 648491 415975 638463
16418 638463 715554 525342 685349 659730 630085 635491 556584 864676 530941 709987 783094
16407 783094 434720 573515 824578 392746 658038 639933 525236 373656 672371 302312
16396 926045 696965 488160 338282 461578 703870 835563 495789 494580 869233 795636
16386 795636 762171 612723 567930 679892 900523 412749 780928 612072 482158 772484
16376 772484 471373 24906 541223 827878 477122 771314 651949 295198 565946 294386
16366 294386 399997 405758 817831 452749 390809 648907 1041420 537606 280319 605876
16356 605876 317999 395299 473513 195762 282822 646752 550285 515358 660886 451035
16346 451035 253635 359309 21036 508631 456473 386719 249833 522554 246261 541450
16336 541450 331674 128227 559385 777836 228285 141006 718696 518253 941658 139182
16325 165307 536718 529817 52920 387245 72342 25079 515614 348064 221650 414402
16315 414402 414426 627692 560307 305610 428268 207806 412636 389238 208621 364536 522673
16304 522673 452556 291207 920867 331180 371376 844187 443186 307331 284598 440000
16294 440000 280220 504109 277015 109301 408848 366403 329401 276281 151876 314107
16284 314107 421897 297647 69747 154245 205975 479570 517955 441038 -87250 167628 453942
16273 453942 180805 -146149 317477 231625 465518 208500 95409 114819 184240 267396
16263 267396 -87959 559764 344071 4403 451903 -16317 345645 252301 255576 257539 285059
16252 285059 144972 515331 237033 29172 334120 411322 -64829 155941 416923 191714
16241 5093 193780 458331 161633 107395 151275 -37500 572793 138858 349069 298388 113200
16229 246480 102853 334807 287381 220192 431239 5103 405532 230760 67337 110092 324734
16218 324734 208079 198717 369874 423625 59710 313175 326064 201910 281818 48576 348127
16207 348127 105327 466 -66911 285611 175127 -281204 183881 439751 362617 12223 266180
16196 266180 471087 220838 162779 77608 263446 462027 40198 -28351 208217 182029
16186 182029 367036 253679 -97386 177702 -117548 371439 -29690 -130637 60507 272396
16176 272396 -83626 142011 87753 15870 374560 366331 174731 306972 18188 43988 509352
16165 509352 460526 136233 419358 66967 109177 241312 371212 232901 320529 177564
16155 177564 -76211 246483 -8930 -78323 -61810 192733 -100219 532538 160174 265642
16145 265642 -214986 464132 309418 183090 241407 260811 -14119 -117597 61292 -264292
16134 292684 337973 429453 169277 82774 40459 410072 -71855 26485 -144547 351659 249535
16123 249535 -122741 -181796 150596 8265 -57851 126047 -67571 -33868 133808 -62896 334437
16111 41141 406817 -113627 -139045 45210 -198758 -92291 -187833 -40742 -17756 141748 191475
16100 191475 341572 299904 -87506 59659 215458 94775 203268 372541 151698 -126540
16089 331900 29602 259446 166213 -25812 -169514 -192020 -130043 -60416 -166557 -81731 -210034
16078 -210034 193981 281541 -82826 -85781 -21640 157465 123711 220583 -42452 261245 -398463
16066 -93147 21351 -36513 123053 457113 -207356 -178769 45978 191941 -15434 22674 -134961
16054 -350583 -202183 -344001 -47192 -58692 430682 50491 74228 61409 42546 -19555 115622
16042 -278322 56913 63521 -130487 74410 16203 376675 -130463 -110699 -159191 32897 403699
16031 403699 -293754 74299 -111434 138582 101074 75254 12703 -106976 -292889 -336017
16021 -336017 363686 148783 -3123 -19482 235366 -12801 -43025 -296348 -84531 590107 -255398
16009 21904 186060 -437189 142929 -89394 -124313 -43510 -37897 331616 -65327 101655 -228190
15997 -136555 158324 -46838 -102950 281179 -110353 412694 -155996 30612 -134123 -145101
15987 -145101 167783 53267 -234025 272715 -123476 209132 129906 83808 348035 -56211
15976 225825 21871 14379 247997 -104539 18718 -44201 234032 88634 55730 -446246 -26936
15964 67233 48809 -55979 242385 -111492 -222260 152567 -5431 -198119 19829 123766 -13474
15952 317817 -108835 -115834 122417 2669 -249718 2996 -176785 284606 28402 73769 -14253
15940 52079 -194097 85779 68577 174420 -27918 61066 -8104 -217957 39277 -149485 151355
15928 9127 59946 64043 -197667 -130328 -269495 -57366 96574 -213827 -321746 -7761 -133135
15917 -133135 -67948 38324 -162718 -42344 126941 -140681 -242527 -283951 -479420 -268847
15907 -268847 15028 -44861 -23895 -100353 60034 -20877 -120210 222462 77384 211692 -128296
15895 283267 226508 303286 -98226 -3766 113230 -12005 -246116 96525 -2835 216998 13285
15883 31322 89175 382730 -65713 -169685 165159 -254666 69297 -263424 87036 15966 -134674
15871 -50790 -318833 139952 -38265 -99805 72672 -151758 -84262 -268933 -41327 66972 -460313
15859 2110 -247715 207790 48453 192004 -60237 -197912 124808 163531 65097 39053 -111209
15847 152681 -3298 228597 362601 65280 -257431 -24878 -231762 -399750 333329 -153288
15836 77867 -188072 -200589 -99861 -27191 250733 51965 148035 -55220 275792 -78210 -156381
15825 -156381 106606 135874 21792 5635 176560 27002 13290 -122994 -251503 -176489 -53580
15813 -300989 164844 45181 -121639 142648 -92973 -222304 -99096 -18086 -149686 159050
15802 -65000 310446 -154643 229336 -152722 -249549 -68247 -213991 -3725 -238201 164169
15791 -120829 -237110 -126326 -106581 -187267 -59696 -190748 222851 -114054 -264085 16323
15780 133313 -167548 -11307 58701 -61951 -95779 230108 250932 -126913 -224997 63466 -217832
15768 -58825 -327444 -58888 179458 62202 76751 145476 -507273 -20789 -112449 -5781 -219586
15757 -219586 -180927 31818 131061 -271564 -15410 470260 382963 134383 47734 -357210 268599
15745 182166 -344196 188628 -183097 28607 18067 -89328 -121111 -172221 67295 -29466 -170297
15734 -170297 73551 265784 -18992 -28668 -11061 244694 347123 -108828 -139011 206215 -400570
15722 -90482 168246 -286701 -124106 223021 84615 -44269 86002 -250092 146137 -141139
15711 315896 -115249 116749 -1371 371739 125126 -100182 -82096 -196031 -187391 139411
15700 -275580 286446 -47415 -227468 82885 -176744 -62119 -19395 366211 -332317 -132223
15689 34563 3306 -50264 -249393 107905 -29473 -97828 -65866 68383 142084 -186886 102435
15677 -94659 -92427 -270258 -40509 124255 -337590 313252 -189363 -25661 -18150 89959 62502
15666 62502 76370 -9908 392611 83483 -4821 -324919 282078 -291161 -119918 134125 44176
15654 23716 -78599 147708 -267184 237436 -236906 59355 -240007 41698 -232723 -198677
15644 -198677 -223548 -201407 -60111 -368744 272551 84297 -61494 -193449 24170 216135 224553
15633 224553 228172 60995 85922 162546 -254613 -68282 -524232 -52737 64443 220649 281826
15622 281826 136386 59395 -51650 40897 -223284 159253 -107641 -151815 102079 37835
15611 -33995 287006 -260076 -35669 -44533 -22909 70549 -249982 -304387 -158552 -311026 -6133
15599 -133666 45484 -304486 118457 -172566 -91998 35209 -63271 -48945 153521 -251855
15588 -149381 235040 -167448 -57704 -69554 -36209 -9201 415406 -62918 480226 -270294 50720
15576 -277762 -306275 -203097 -150808 -31126 -119164 -139881 261963 -260365 -249704 75141 -160145
15564 117351 -213043 32987 -167990 50917 38715 55389 73551 63544 -27723 -309659 -5051
15552 303135 37715 -60850 -71282 59260 -301646 53056 -39840 -23392 -26034 234276 -85347
15540 -44438 -320880 -105761 214067 95612 -54884 26095 242844 104117 93030 -36079 27949
15528 -5503 -326552 170763 -6511 253442 -153735 30398 -46694 209169 -73841 247981 16960
15516 -119421 138837 -23448 35741 425415 -359919 13363 205190 -278099 97918 245431
15506 245431 -368390 49638 -316880 236555 34302 -80237 -108186 -152711 10679 203120 -254008
15494 213282 46266 -27201 -84511 -150633 -61038 1695 273065 245823 170966 129678 99198
15483 99198 54246 39631 -81472 -180761 161295 14904 19033 -137073 -30208 135914 59216
15471 -78994 -148251 257366 -73863 -65359 -206359 100794 424988 23578 98225 -72406 216240
15459 -227843 47417 -51796 476312 95749 486201 -182962 -221565 -194437 80747 -238815 -185677
15448 -185677 -158868 -86730 41645 234864 -109428 -116259 -261200 -213322 -112035 -22388 -42396
15437 -42396 -242822 -75677 235310 -272704 -206283 -61880 -111918 61440 132387 -87648 236224
15425 160163 152826 12682 48152 12855 -497284 218918 -89974 11623 59598 340291 -176712
15413 -43309 116605 171578 -148532 -145079 188353 -305715 181410 -85857 29618 187739 -160142
15401 -61258 -138318 88900 83782 324269 -71811 -69773 -36135 -321511 284940 -195890 78677
15389 328306 14589 21006 -159725 -143967 159657 427856 40709 136472 -246966 -59245 207108
15377 183026 -156862 248148 211419 -124331 80664 216484 -154896 134287 236867 73888
15366 27240 -177711 145865 26666 132216 -53295 -182613 304456 -57654 -284364 134754
15355 -177218 113850 -61946 78101 24346 119231 177979 131419 -79020 -60002 -4383 -337435
15344 -337435 230955 -137088 56428 -188 -311461 -184111 -212509 60588 -91284 17592 -174812
15332 -92697 -49509 13447 -79898 97600 326407 -28951 11872 26002 -144145 69536 -154753
15320 -191229 151865 -4676 -23741 270875 -106884 -108309 12452 -196380 -46607 -358177 -45119
15308 -266354 216979 -173770 -258347 146127 73252 55969 23055 -297143 121409 693 10928
15297 10928 12860 -438397 144634 -78083 19546 133011 43687 176629 290997 -153098 6445
15285 50148 337001 -110780 445472 -83300 -100250 78216 433043 191320 73703 184655
15275 184655 284150 -54650 74125 10818 39654 -249718 -17532 3498 310746 187923 282266
15264 282266 1162 295062 -170218 139375 73965 148092 463719 305034 -16117 -29197 373103
15252 379204 175667 86338 135832 511696 477101 1089753 1929020 1530741 1470656 1277273
15242 1277273 1001176 629442 558283 368143 280349 372569 41454 548527 62081 -368877
15231 78245 241672 335656 -37955 68130 -41787 247783 -6539 201957 179807 -157284 65789
15219 5524 -64575 80137 94047 150451 -110799 -99685 78245 -23392 -42193 50690 -298609
15207 200291 95229 196695 -202038 -141776 46863 10219 353306 358679 39626 142881 44175
15195 211933 -42474 105815 164235 4968 -58307 40067 75669 474745 32274 145749 158029
15184 158029 -160104 -50108 -122690 121620 21390 -132131 170137 18560 -114491 135484
15173 178227 238795 54036 142404 236815 141797 269445 -127832 244363 288006 302192 21269
15161 -114569 529857 -56125 76834 -10766 -96618 -41162 108096 234858 -67408 243370 -221657
15149 439578 153247 480851 124306 -250685 193758 175498 181203 236629 200340 192988 220804
15138 220804 -11810 54415 92848 403524 12581 78635 73898 457588 320021 414767 306104
15127 306104 -3844 113010 5815 392960 2211 213684 90064 639371 -62837 408424 143112
15115 30606 -68950 376303 226999 448946 25250 41417 14487 462099 81797 258643 197985
15104 197985 326681 220119 270125 14954 47236 34904 59441 -164614 -240240 233083 248684
15093 248684 105874 237614 -261483 140054 74174 8485 272565 96060 513417 338261
15083 338261 -81650 339063 149736 -3237 636025 114552 -63032 324168 110603 515469
15073 515469 326375 213016 191798 298443 28758 281207 60251 100519 159999 140480 -126416
15061 117025 156141 -241029 -198118 240742 331287 -61356 81664 198972 19853 52160 196854
15050 196854 -37035 56153 207800 132712 -141725 315646 52030 264117 257465 227887 119192
15039 119192 472839 91489 75480 -297883 136009 158974 247567 238446 22235 281119 212173
15028 212173 478718 381805 493533 250313 -5331 141308 147611 129615 234382 215017 188300
15017 188300 97302 263635 128848 186411 222975 102910 213424 300406 190989 136591
15007 136591 7766 -110451 14080 8216 267100 502906 370631 344836 53465 -208688 362536
14995 327460 363687 181369 536498 503053 346345 -55965 14704 366553 152459 141550
14985 141550 206451 64246 551659 396513 388485 138940 385073 8926 321381 197229 236838
14974 236838 372497 253462 264600 121472 47710 309672 416506 256861 470543 349515
14964 349515 -133172 476197 54057 -85300 -301071 142369 71554 111333 592699 230427
14953 261535 359353 437823 302510 397657 376098 -33739 406375 290189 298292 77376 441137
14942 441137 412966 629501 242500 124832 424285 117311 353765 -95224 736428 108592
14931 251539 97829 233171 268474 300847 426336 2537 198514 130645 232500 210677 667
14919 397484 62958 226339 237302 375151 541348 437719 31247 353844 230662 872958
14909 872958 665996 668673 476960 600423 402608 537383 385043 586312 426392 297646
14899 297646 339727 119009 451533 320454 346242 278858 119017 416397 337136 250406
14889 250406 337545 332396 226929 724926 388946 469776 569875 574666 181131 201780 611639
14878 611639 453071 252326 242967 211488 401873 530153 249457 245589 408395 341461 356082
14867 356082 514669 506245 453030 303973 267692 545714 291633 510890 375166 466552
14857 466552 405785 339287 391972 214570 587864 691952 335534 306911 337675 400280 627377
14846 627377 470806 731019 649793 426119 502900 549940 811560 332296 346378 428063
14836 428063 35543 549609 929281 336693 497733 448026 718902 592609 414058 558780
14826 558780 536749 400435 757704 546100 206806 304824 685184 465464 263579 429835
14816 429835 414462 224785 850737 608705 799722 570014 299126 466904 566349 618479
14806 618479 437954 415637 670958 317959 367650 859564 640067 613350 482116 803652
14796 803652 369832 334044 262859 360073 878762 659423 597727 712109 416599 768433
14786 768433 645991 1000914 830549 539018 593906 363626 738223 692843 543716 482275
14776 482275 449665 509178 570301 525387 561287 455174 781194 631583 602325 860731 629594
14765 629594 728423 534846 449058 618105 752036 936601 833643 1012922 679619 493155
14755 493155 831449 498584 828240 540631 504620 495552 970144 456198 622461 870699
14745 870699 710369 769750 460828 684286 449422 848831 658479 720997 983487 770627
14735 770627 810913 635409 1034354 831699 763289 579038 749803 921048 941409 428288
14724 1125246 851285 1015343 848820 812504 608126 1022199 878444 766244 782371 888922
14714 888922 1018004 681303 967565 782364 827218 518414 649178 868017 819086 1052598
14704 1052598 726030 1172803 993529 766225 877427 1046116 1014025 1101179 1019292 601062
14694 601062 925813 588039 1063802 788816 1206495 1287217 1093849 1128341 775384 674378
14684 674378 731250 1012880 1020821 1335976 1033539 1023451 1234498 1224571 1011407 1135663 928010
14673 928010 1034121 1000200 1307950 1398759 1383943 1278273 357848 922023 1151038 1023416
14663 1023416 1113987 1087178 1133605 1085289 1097859 1422757 1161791 1134546 1420433 1400952 1019677
14652 1019677 1290277 1024152 1071219 1231708 1487324 1069878 915492 1561252 1325421 1553527
14642 1553527 1499255 1038022 1511270 1116309 1658958 1182850 1226150 1392182 1270995 1439742
14632 1439742 1247212 1463733 1469878 1522993 1264265 1435384 1368720 1591997 1259463 1749574
14622 1749574 1267315 1377518 1440795 1426932 1488996 1633606 1305249 1851803 1662720 2031797
14612 2031797 1670833 1741585 1547862 1746281 1666896 1583887 1784603 1890555 1789761 1502890
14602 1502890 1596976 1679470 2005172 1743557 1812867 1740497 1831907 1844387 1874192 2097751 2034185
14591 2034185 1727047 2131022 2115790 1742653 2061520 1884711 1943781 2295462 2272015 2221842
14581 2221842 2038815 2263569 2221899 2276416 2037050 1786608 2454330 2634374 2268778 2407452
14571 2407452 2508743 2347212 2497676 2209658 2706134 2512716 2588779 2475167 2917726 2942737
14561 2942737 2909336 2965190 3323123 3416215 3695132 3906363 4135289 4076225 4828488 5052191
14551 5052191 5771891 7325755 9319353 12806746 19982753 29241818 33521729 23707022
14543 23707022 14050393 9812387 7055157 4902141 3860237 2815798 2960590 2411250
14535 2411250 2597510 2483833 2583366 2362935 2174251 2442988 2462372 2228617 2588924 2959801
14525 2959801 2354244 2384985 2574109 2606264 2742681 2845808 2470485 2822651 3124247 3140030
14515 3140030 2476215 2911170 2879092 2640924 2654658 3238414 2899513 3418925 3385179 3121887
14505 3121887 3429383 3411425 3149808 3441944 3493916 3394706 3314414 3658802 3439899 3774920
14495 3774920 3680272 3417741 3739682 3729043 4234156 3805040 4059527 4114519 3941223 3874994
14485 3874994 4036353 4121262 3941620 4319779 4031358 4093977 4179254 4303995 4065569 4602802
14475 4602802 4350530 4228738 4139941 4558121 4498017 4535414 4692216 5071452 4709722 4923240
14465 4923240 4944337 4741805 4844622 5119764 5159577 5105109 5928111 5281288 5429577 5659706
14455 5659706 5612188 5556398 5698962 5892757 5668863 5853455 5978855 5617231 6207925 6142327
14445 6142327 6214504 6208371 6591105 6335737 6394406 6887936 6810206 6767718 6975739 7214399
14435 7214399 7048214 7095916 7241568 7441376 7293018 7272208 7674833 7794054 7995699 8318806
14425 8318806 8100179 8213696 8269124 8786144 8578313 8577435 8537899 8910099 9137975 8823072
14415 8823072 9433922 9693550 9338821 9706765 9895068 10182894 10173550 10168022 10654320 10691023
14405 10691023 10708338 11056708 11375462 11899184 11678466 11864618 12017759 11849797 12334654
14396 12334654 12575011 12776504 12730841 13108165 13085480 13684605 13874562 13961723 14051002 14571950
14386 14571950 14949671 14959877 15131869 15178736 15851504 16196886 16464733 16925245 16758880 17325960
14376 17325960 17537516 17829174 17926235 18687704 18695314 19482694 19544879 19667747 20423277 20803372
14366 20803372 21419232 21417687 22034190 22843410 22878557 23900147 24142454 24524012 25255755 25774103
14356 25774103 26748045 27075618 27361816 28049012 28774550 29766802 30218970 31088857 31907823
14347 31907823 32956038 33337390 34213000 34779879 36012764 37511905 38125988 39228846 39995834
14338 39995834 41203912 42556032 43619828 44827486 46031371 47314311 48705183 50187004
14330 50187004 51956686 53469990 55353897 56938525 58607957 60582927 62432280 64739261
14322 64739261 66744271 69175493 71692016 74445919 77009391 79780541 82643823 85900817
14314 85900817 89370942 92622862 96024660 100281047 103959201 108352426 112872225 117789058
14306 117789058 122554060 128009247 133669097 139340804 145741752 152598238 159411486 166650464
14298 166650464 174783271 182669053 191581219 200507758 209983891 220452610 231222525 242187011
14290 242187011 253710712 265838049 278571719 291413921 304660720 317966147 331732830
14283 331732830 345572301 359466492 373346939 386968568 399905342 412438813 423943946
14276 423943946 434166023 443223830 450721555 456509793 459976042 460568689 459773903 458356356
14268 458356356 455404263 450396991 443454326 435058953 425363680 413636214 400774221 387288706
14260 387288706 372993879 358721245 344003932 329514381 314948217 301097674 287164429
14253 287164429 274212337 262110037 249773608 238246820 226982397 216270398 206010053
14246 206010053 196512686 187564692 179048633 171125120 163185119 156065159 149443502 142601024
14238 142601024 136780601 130942670 125592859 120096019 115191645 110737251 106141885 102631457
14230 102631457 98672556 94994567 90992723 87611691 84426390 81286689 78526371 75772356
14222 75772356 73001447 70808921 68066600 65847856 63839629 61756705 59651223 58027958
14214 58027958 56257799 54788750 53048144 51242132 49835033 48328207 47232428 46006902
14206 46006902 45050852 43162611 42068761 40759876 39733292 39168731 38322405 36806232
14198 36806232 35920854 34836193 34073489 33319702 32690291 32000149 31238853 30136651 29693236
14189 29693236 28715761 27891552 27620743 26994902 26334225 25908215 25204190 24754653 23510424
14180 23510424 23361582 22864527 22847180 22329718 21954910 21057034 20878041 20060474 19885442
14171 19885442 19598719 19125036 18951316 18339548 18183280 17657681 17295885 17324681 16787903
14162 16787903 16716494 16196727 16078044 15588653 15345246 15178710 14844381 14400056 14131892
14153 14131892 14207400 13394866 13626009 13604602 12923241 12902014 12681424 12648015 12679848 12034120
14143 12034120 12148494 11975511 11588647 11542574 11088245 11096964 10679713 10754822 10557164 10493437
14133 10493437 10529377 10261595 9878409 9955088 9619554 9788605 9509261 9435389 9331106 9153957
14123 9153957 8997023 8449054 8673634 8567053 8528938 8529721 8333298 8223085 7971945 8198347
14113 8198347 7816467 8020102 7907503 7748382 7284031 7552646 7354250 6893384 7063472
14104 7063472 7278933 7142721 6833805 7113594 6456237 6725753 6747992 6497586 6429712 6240500
14094 6240500 6138785 6277455 6228438 5951957 6019936 5736844 6123081 5716142 5782271 5801984
14084 5801984 5957183 5890605 5527589 5651882 5246295 5173322 5459148 5428779 5134312 5402412
14074 5402412 5010789 5104640 5189156 4833795 4966275 4736614 5026685 4835751 4619041 4701213
14064 4701213 4759766 4508300 4521043 4444373 4675083 4422709 4454080 4271939 4312484 4055205
14054 4055205 4479053 4082862 3939156 3884029 4001147 3825497 4176728 3728978 4011678 3978990
14044 3978990 3722097 3640316 3673879 3731141 3534876 3767967 3567161 3659540 3558153 3306285
14034 3306285 3403612 3534412 3141395 3699520 3505696 3684756 3207936 3339326 3191775 3526592
14024 3526592 3350938 3443788 3157907 3364076 3306785 3180150 3119390 3094331 2686219 2948059
14014 2948059 2781682 2815226 2819213 2903946 2708737 2858169 2795772 2714638 2661385 2455966 2544684
14003 2544684 2624467 2771283 2626935 2707383 2448117 2874618 2708820 2884755 2621096 2938615
13993 2938615 3052338 3310712 3522284 4349699 5685473 8584602 14565163 24810232 32966166
13984 32966166 27120990 16908359 11223720 8117047 6641100 5414282 4905879 4289831
13976 4289831 3554873 3856880 3249198 3414958 3517476 3270951 2620042 2690677 2941898 2761020
13966 2761020 2846075 2850955 2600923 2459553 2553915 2367635 2700621 2517125 2456609 2528251
13956 2528251 2386325 2367888 2032491 2358092 2241323 2189829 1949078 2331110 2462498 2243141
13946 2243141 2090260 1913790 1739846 2076853 1948322 2083773 2186098 2212612 1789869 2063248
13936 2063248 1644127 2021242 1946710 2135163 1585024 1791422 1759858 1835692 2087556 1827096
13926 1827096 1656151 1903876 1554533 1708059 1992139 1935229 1626130 1873265 1908736 1585342
13916 1585342 1638079 1784415 1715170 1476126 1638950 1483611 1525971 1583941 1503656 1750871
13906 1750871 1589425 1760730 1631125 1459545 1474113 1554039 1503859 1540043 1343754 1498600
13896 1498600 1442775 1391741 1566910 1604737 1505748 1722521 1400126 1200100 1412529 1405469
13886 1405469 1140467 1547456 1495512 1316949 1337830 1286770 1452709 1110393 1674660 1411837
13876 1411837 1031271 1495062 1417985 1493977 1174684 1077769 1334320 1185755 1298560 1152739
13866 1152739 1245226 1078484 1328318 1200180 1105093 1419653 1589039 1061843 1049717 1301545
13856 1301545 1456516 1334875 984593 1080288 1172680 1436239 1179772 1179754 1217211 1434691 1293834
13845 1293834 935780 1340663 1024246 960481 1209496 906603 1136624 1025637 1076951 949092
13835 949092 1201834 1090419 801325 822637 874555 1032142 780770 940289 606096 1137859
13825 1137859 1092141 966660 834990 801341 971824 1190812 1058134 919206 1091980 815971
13815 815971 765008 851732 1082973 1117647 1088967 872119 1091267 920693 1246699 1023232
13805 1023232 828257 934926 833952 1130631 1059091 1049577 1126260 871174 1066599 859563
13795 859563 890263 960086 626025 721965 649823 1012203 749488 1167511 759605 516179
13785 516179 908858 762714 767789 1057751 642019 557877 868264 638709 817926 800761
13775 800761 566602 622040 726899 728558 1044438 1031206 931112 887632 389739 680907
13765 680907 1128311 659455 1041098 852451 471496 264499 1017756 797436 665992 770299
13755 770299 748263 404703 693178 658926 473506 613359 841173 567674 794952 677526
13745 677526 646116 749385 786033 1024883 732439 595542 754388 766643 867878 631610
13735 631610 915648 859995 672901 510402 553222 626571 649470 827751 726498 622107
13725 622107 553347 669342 698345 599382 504810 608749 830165 593696 990517 628754
13715 628754 1030775 812725 969147 356195 294213 722539 863999 746260 685376 805565
13705 805565 665862 807453 810489 659500 584462 706290 579154 762663 474171 613567
13695 613567 665539 811877 549925 601141 474565 589813 653640 619318 223766 620902
13685 620902 492210 877178 712517 654077 499522 577647 628057 220080 418631 457340
13675 457340 374774 604863 717302 640450 505995 -4515 455557 656636 458224 403186
13665 403186 378667 623719 861432 605001 695445 405329 506704 369319 173190 444252
13655 444252 737756 434756 540966 447389 697461 595191 620735 691829 527678 791127
13645 791127 313180 456708 802420 493542 334686 554751 223977 618729 323559 658947
13635 658947 306977 434905 433507 372442 241579 837303 535619 604217 663814 365505
13625 365505 662655 237161 373208 557539 687993 390664 181600 249734 833868 595103
13615 595103 623733 244619 459438 323159 247264 410760 721687 642234 517851 808619
13605 808619 501568 417123 425999 363930 227983 289595 367970 611173 296800 590499 573088
13594 573088 411174 326790 526046 385223 492417 285422 369814 627650 385959 220356
13584 220356 447480 341633 296743 285994 305509 443996 221782 516124 466265 6653 651991
13573 651991 338013 602862 304814 597570 485661 642536 129243 523214 226340 360105
13563 360105 172019 309175 236349 343136 386009 370571 103121 357128 171898 858884
13553 858884 313742 477968 508852 511547 336470 772332 315876 251633 341326 634699
13543 634699 515622 396899 16018 511268 108823 -47996 90037 282310 542626 494082
13533 494082 211419 430956 626150 195065 302746 418565 228139 443666 85415 520472
13523 520472 275057 251575 580261 227665 332442 502542 179319 118728 481717 275274
13513 275274 529768 367459 442977 40923 308442 319199 451348 217689 636604 358179
13503 358179 203494 313295 203311 287218 138598 276528 506905 459320 220005 232409
13493 232409 287800 460943 333917 626293 326376 224960 289005 275548 131836 367792
13483 367792 333381 283932 295967 167972 474763 -79797 -190107 443215 210929 453508
13473 453508 155793 111831 127773 91366 119722 -34300 -18421 340471 391174 -13828 336728
13461 225662 403006 243963 254012 -21604 -134308 324616 76833 178971 68097 -96559
13450 119126 213674 389352 46208 187321 50424 319970 415841 331653 517837 251202
13439 330206 306581 140072 243235 -26683 200677 311600 194565 253478 588697 443151
13429 443151 -206172 232911 102022 579970 145645 168903 18496 93120 87531 128811 228306
13418 228306 348455 337295 -203694 128869 328141 -4037 536828 377918 140085 16128
13407 126925 292036 116331 425847 418044 392145 114121 87080 -84757 196364 64211 -10077
13395 243216 -52465 135181 168956 112676 170507 57821 132702 353608 524179 526936 311427
13384 311427 -76816 25294 314654 134070 -23567 147476 491047 16077 152815 232975
13374 232975 340892 421348 306172 130807 -106379 638668 377930 489739 636379 128608
13363 75226 332967 179829 244748 462552 210215 364638 297802 -15100 173823 184920
13353 184920 184244 412272 287532 243492 200888 173484 111469 20804 292815 -12132 489179
13341 -159452 475318 187018 382341 498253 427192 371889 259089 417725 381156 30069
13330 52817 73341 361788 172124 256045 229583 148336 196004 176107 582957 356027 280908
13319 280908 -5242 300732 430272 157072 221167 174224 413121 292645 38740 268726
13309 268726 325647 -27557 207093 -37768 279182 122366 4028 -67961 -49398 158260 67829
13297 381611 -176988 117334 225485 282008 -21268 430239 150167 188535 465070 99065
13286 128795 -17861 -47827 170604 351123 284997 195478 429231 184942 114456 300194
13276 300194 25050 91123 -43927 -31558 353517 83378 83516 -156883 212638 296174 98464
13264 171799 170299 111367 84134 86813 120329 -16544 77770 531246 113847 -118071 41016
13252 -38053 71032 225436 -61249 112118 -104631 97119 -27844 124005 202007 284849 26377
13240 26532 -82447 -16528 5214 398057 337659 307153 -152567 -34240 84680 214140 89296
13228 336225 334253 30063 201514 -67810 419820 -93590 222327 374728 206851 31394 147579
13217 147579 -12809 87301 80008 202298 71308 -168329 226185 -277290 49776 380575 413712
13206 413712 550944 208641 80235 577202 -66697 19343 412266 134657 275388 257095
13196 257095 179126 219417 158594 -179981 -166905 -45089 146341 110215 237728 132731 235312
13185 235312 130884 -106786 71896 64252 103499 37332 81578 314509 179845 -46727 52553
13173 79622 -123668 -124191 178054 -31933 167132 57989 344877 441013 111678 334027 -313274
13161 304472 -57272 67609 54417 220593 -91590 558704 106677 96448 26986 117636 2470
13149 -193856 592804 217959 29504 152693 114764 -60655 322599 191019 -184291 -71648
13138 324137 -147386 -92659 313336 324165 35922 -82425 -183895 237995 66290 -131857
13127 -159548 80009 -118888 12600 244923 42158 122904 -241602 9800 155501 -120792 98804
13115 366062 -29230 179282 331460 272278 333174 170578 -202624 356008 -15506 169534
13104 112759 113731 -225742 -16808 333128 133179 -48953 76963 285361 -77659 -25376 74211
13092 136084 193786 -362485 38317 302288 330935 -11934 316846 -39546 -52493 238814 150797
13081 150797 -133893 -232441 -214727 107658 265701 6833 6186 97439 114713 -88633 114389
13069 247218 146179 80118 224863 197301 11650 59445 280271 -14512 173135 124014 473399
13058 473399 104992 -479533 17849 59040 277984 -100684 60685 -76755 193320 -93029
13047 -32405 430791 164468 269782 26333 94679 380587 -9619 -201082 119277 71411 201559
13036 201559 59905 -562135 282501 -139321 -337374 102712 121015 36733 115511 -2560 235677
13024 62490 324660 357671 -52814 295798 62733 62034 260868 -20562 248527 73711 347656
13013 347656 41118 22820 22581 -11613 190283 365645 207088 -25846 228842 234465 34100
13001 222727 176795 118188 -39290 269127 -42862 357839 -64374 310332 -163441 333481
12990 -42919 152079 52166 50041 -156667 154255 -1773 -123539 146688 271294 3552 -182400
12978 33645 67151 34909 65803 -154156 -102206 279752 407702 -97138 140760 51878 31999
12967 31999 -192608 3705 325848 243762 -127948 274941 186625 123844 236767 187716 359226
12956 359226 151216 164101 -1915 -102428 -156307 167103 -108585 127808 -122801 251948
12945 -207905 133276 -48354 122130 160278 146211 -112927 537962 97609 -70819 70758 -297219
12933 20765 -164491 328714 307513 58109 -4137 162067 -75314 79407 148281 40140 228627
12922 228627 208642 157537 114285 -146551 -177136 -186685 163616 291037 70021 -89825 9119
12910 -114247 275921 239561 63745 4586 -216340 35347 -109768 -40612 111280 123591 -214425
12898 309402 193346 -284019 -71991 -5562 -138271 263005 -104118 137849 131553 -10737 231306
12886 -4276 11994 -56745 203313 233771 358593 -89127 348390 170893 350295 376200 -90214
12874 -16695 -46002 -252285 28776 -4509 -17125 217819 513735 148409 -67224 -5597 308402
12862 -148445 27634 121763 173448 -276434 208232 -66589 124572 318062 21246 134642
12852 134642 -256581 1522 -5620 46250 294799 -168982 160332 -58041 -28035 -4140 105835
12840 -11175 150649 363791 275302 152599 -169580 233258 137594 -184981 -289133 67902
12829 270380 36691 -78134 283054 -181197 230929 -35678 246640 208361 -46430 73262 -122552
12817 -58850 -220152 -234013 -280412 -17232 411625 -158638 -7839 155896 -80422 -270608 10994
12805 -222119 -73546 169346 -218345 -106244 219206 207508 -5286 29559 -7613 -197566 -123444
12794 -123444 162667 54310 -43312 181096 -340610 255230 153152 146336 79661 18275 205567
12783 205567 -21451 -88122 20774 276606 342386 -54386 14497 266799 176984 55333 -48235
12771 -138323 -171318 -165940 108419 133565 65423 -351188 -163494 35709 272247 187121 -182324
12759 199545 -292911 243773 263448 142728 372040 -13736 -2280 9972 13276 64190 239658
12748 239658 40203 92745 -115569 45510 75817 2541 84133 -77462 287854 -117128 112010
12736 189854 103309 165663 38500 61270 -65735 285415 71553 238222 56319 114356 135989
12725 135989 -185255 81198 145274 74256 238693 -122347 9496 231822 281215 211928 276176
12714 276176 361450 -62084 434304 -375878 -205532 309807 -50201 180435 -111535 200339
12703 367167 -44735 139684 179549 -186891 349529 -16334 255349 -71809 137652 -185782
12692 150558 312040 -16109 -112638 42457 -72791 84792 313609 -8372 128681 36614 256494
12681 256494 143882 341451 378626 -72079 101080 197120 30605 405502 -102671 121783
12670 -24580 334052 -93579 146730 -133822 398698 177062 -38405 46330 91524 222488
12660 222488 182566 356555 -60107 170892 -29714 351921 -67058 -108325 -85869 180516 94041
12649 94041 -172587 70663 121016 232202 -50036 -270555 -102467 250842 -26184 151257
12638 205823 42545 18825 -10457 71142 -75043 191992 -313058 -64578 164588 147471 10507
12626 -52013 272760 385664 244483 497178 369609 133991 205508 145678 265289 -69257
12615 -89973 142443 58449 20987 29693 -90347 -185662 338389 -7015 326228 -223027 270060
12603 57804 264227 93966 142130 18539 6122 359865 300087 -370469 76682 114307 -61785
12591 268583 -169509 -41811 305 132904 -11313 -104528 -388008 110542 70722 50418 173150
12580 173150 82774 -70750 -143587 -105111 14878 62247 223567 81307 -193648 -215446 336545
12568 -67714 178252 -355153 216652 139441 297005 41692 -266065 33893 100179 66290 125021
12557 125021 113745 275179 300352 -4201 259484 -98601 -254345 -220460 -275220 -222847 59137
12545 158669 -26448 77346 -63147 -134392 -47608 79148 223067 -216402 -13701 228446 -62646
12533 -110942 328530 -40665 -223712 -139342 -293908 -90212 -173645 -135754 -36016 -9681 -271095
12522 -271095 21491 -142491 -16337 431074 116319 -341406 -103306 152481 44324 179769
12512 179769 388573 119081 133012 -308823 -125420 256002 -34465 108634 202085 121707
12502 121707 372128 350489 155007 67667 6462 -37147 -40198 -473891 147542 6959 -98420
12490 -59066 95265 445798 -112278 307216 -158026 78752 -175846 141983 430084 -358948
12479 -151483 38433 -356365 -269696 341302 79581 -154549 272164 -240536 75690 163599
12469 163599 -76210 9906 -379802 88287 466987 17108 99579 -117485 -13213 60272 -246297
12457 -356980 -5018 -295654 216578 234909 49887 -60665 -80159 -178939 99145 -241286 10160
12445 -89956 156566 -61797 159156 341029 92043 -423863 -133759 59212 -212437 70155
12434 -132564 -52839 -96720 67556 29745 206392 176885 275217 -132517 149308 498393 39347
12422 -35211 215735 -140039 294703 -214278 285839 -113019 22546 24160 -173088 44038
12411 187201 -89301 -141147 237107 199508 110696 54219 -80478 -451553 393053 2935 -181125
12399 -170191 -121586 31777 -13196 -141430 -224785 73505 -41345 -69047 275053 204195 114621
12388 114621 58690 -77016 92816 -216535 -189592 -116036 -23045 211187 -201264 369196 172337
12376 -11876 -163124 -324587 -160454 81649 188075 72224 193265 66008 141439 200966 213984
12365 213984 -276724 -294780 33674 20087 264379 307727 -193514 121230 -17448 57300 215088
12354 215088 -97711 -101236 194040 94435 -90394 73561 -88600 202376 13580 -239229 -272067
12343 -272067 327552 -139526 -71876 47232 -8317 424519 -117802 126699 -36181 466503
12332 88987 356925 -253541 17285 -1829 147328 32456 104067 134557 133697 -68182 10829 -75941
12319 -53937 -19726 -202360 252202 64963 161100 -226347 -87402 140135 54634 -76891 149817
12307 -465152 -60967 153461 146336 -133656 -198352 -372085 90411 234245 48683 64001 -257454
12295 -17451 -296678 257464 158787 288792 -173729 246957 64753 148877 -172146 -282263
12285 -282263 84340 -58525 108364 -136143 105491 243460 -56353 185596 232609 -74553
12274 147116 70613 164686 31925 377336 -44910 150037 27140 70693 64244 -60120 -1209
12262 220065 150600 112057 51364 42970 65663 199245 58091 99131 -154809 -203785 -119314
12251 -119314 119510 210691 -190136 22753 -56214 235733 96423 -99600 344740 211215
12241 211215 87811 59449 -106598 220806 301614 20147 160919 36958 126626 -2374 -205855
12230 -205855 -91395 -24265 29133 205591 163857 -137854 223073 69373 340458 113442
12219 212561 -94927 -58992 -9925 254083 14074 154538 147873 73225 -88154 -157316 -63732
12207 319099 -193462 234905 289941 62080 -110187 429475 220987 104339 -62224 32618
12196 17456 350044 41803 223617 -76988 558477 -53034 257655 350686 243265 351123
12186 351123 -111174 410230 -61459 310147 38366 329945 5864 47581 139235 -250716 225207
12174 60289 247771 -260713 -322771 185226 184858 226372 134360 -57767 -155148 18196 -219402
12162 76335 -50349 122435 63000 242418 -32842 -61606 225626 116933 -81286 50914 45427
12151 45427 -100148 -120365 90151 -37949 98465 -30112 11965 168292 -45676 164246 54193
12139 -54574 277917 120005 -4378 114112 65850 -10900 121846 52771 -217666 167189 385299
12128 385299 54683 107136 71892 199362 72077 233368 -107903 -170878 -244492 321881 -107983
12116 -267051 -5051 -215225 114161 185082 275093 113401 164382 165551 71885 292638 -214400
12104 -342296 -107750 -220867 -251519 -260800 -15134 437423 -427517 259346 44415 119189 -138168
12092 -32133 -9501 -58485 -268607 290991 -72554 11347 -158659 327464 -21407 18270 -182005
12080 89904 14242 -169205 29096 421147 -166340 57717 -104265 218300 -191750 -297276
12070 -297276 -16497 -46649 -231259 -2022 -544704 165883 -296180 199353 650503 242010
12059 -10070 324481 550808 881949 344043 163661 175028 141164 -91338 -141210 14503 -165480
12047 222365 94539 -409304 -109932 -194377 130794 40544 -125013 107248 -224916 31309
12036 -251270 -175303 25718 163334 113759 -87514 -19669 -14449 -48938 -123 27561 -94522 16261
12023 45769 -281521 -201160 -19901 -54406 237409 52412 -126467 272388 36041 185927 -287861
12011 102151 -31510 -106014 -121897 154888 -59655 -56007 47643 256817 222974 -158150 -5425
11999 -44127 -268584 174106 45460 -59168 -107902 162243 552 72970 109295 112199 145482 -249102
11986 33522 -171672 97318 -260230 -63000 -41320 111280 -80111 69492 191903 -199823 -272168
11975 -272168 261744 -202032 86368 -137179 144862 208628 36851 -236212 200363 226515
11965 226515 58372 338030 184973 -115779 -184425 -334802 84500 -164190 -119766 -89963
11955 -89963 -136865 -124315 -370896 220234 90084 38859 179491 -69222 -193052 -301164 431645
11943 32770 -328733 -60749 327088 -114405 -44579 -103715 189537 123255 21621 -56558 -194535
11932 -194535 -126679 -113538 -105837 -89481 -22745 42641 185650 32025 134199 -90673 -88084
11921 -88084 -5907 -25925 -79892 -68383 -54676 7970 -344048 -14499 58405 -144579 71167 128038
11909 128038 -135074 33775 236050 -119515 35329 74207 9319 -257875 -10518 -474977 -32863
11897 -65560 -116070 120195 -221480 275692 -30713 -265646 -241572 -133721 53354 39336 -44367
11885 -64216 -272609 -77768 -67464 -48379 24701 92287 -34727 41684 -345825 127075 182449
11874 182449 -285032 -13409 -715 167453 -59056 20904 -178413 238612 162232 -121933 153850
11862 57793 -66252 -43881 20586 129235 -64665 42504 -246174 351842 -9620 27710 104298
11851 104298 310743 -62261 -27789 -14039 -162093 -248973 -16269 -31299 113925 -108790 -32857
11839 -155603 -181446 -254909 -185819 273270 318149 253112 -402196 243908 -85670 -210652 -98180
11827 33625 7413 -74217 -296703 -152083 -82925 -439599 104569 -322530 104705 -64390 -124735
11816 -124735 -4324 -397970 37672 -22581 -226761 -28573 -135868 -122178 32047 224511 -103459
11804 -50113 68460 135023 43126 -142058 223103 12617 268509 -107228 -90673 -211697 -210019
11793 -210019 -241823 -178047 185914 101497 -29595 295121 -194739 262003 -238735 22447
11782 -158585 87710 89538 59267 207102 -98161 -256851 214944 156546 -110301 -230165 -39125
11770 20424 -158299 -74177 -43740 -270144 -29003 76943 -92903 97962 174264 188047 454619
11759 454619 -143579 75107 21577 -188455 -54826 115477 67946 -74475 -238273 132953
11748 -313480 73424 -58718 65855 168622 -146940 173583 13444 65483 -94437 -141647 -114066
11737 -114066 -148930 -152637 -136818 -53067 73131 -208340 -1404 45682 165079 44611 33404
11726 33404 -160503 2839 68383 -257148 222300 67392 62240 -34409 215549 725 -55831 18208
11713 -136594 -406835 138648 -8571 169441 175312 -64967 31320 76696 -421809 -179519 -237746
11702 -237746 168941 20913 167941 -48714 -213775 2051 178055 93011 97463 -97658 79529
11690 58309 135810 212198 -311775 -88039 -63263 149878 -299716 117678 20114 -85423 140438
11678 207920 143322 -127164 247839 -111104 -46400 193444 -129459 -32221 205646 -100677
11667 47300 -171601 77380 -105942 180647 179278 -25610 41236 -251712 -241974 -20599 -38763
11656 -38763 -266093 -433149 -6804 233241 -1798 -90382 94633 -97912 158365 -327604 308298
11644 68458 -83321 119995 12224 82246 -103915 180652 207812 -177809 120436 203261 -203568
11632 -111740 155764 131774 -41061 -38059 140709 -153597 121173 127953 -99572 385693 -180137
11620 24775 -159951 65163 184181 235363 11343 235406 -99283 -104112 -106746 84186 -200458
11608 5878 2447 275038 22560 -94417 54738 -120081 -219825 -150375 -14623 247958 -93661
11596 -135983 409745 -46882 -188248 6337 31111 -168186 -110869 -185152 -30427 611731 246565
11584 9309 206988 290725 -28006 46724 113525 135784 -81404 -1570 -197914 -167873 325849
11572 148258 178249 52023 230620 -118766 30418 167498 269896 114626 263446 -41123
11561 -113212 166942 245847 24521 114521 -172767 -163114 110331 2309 -183952 42234 -13140
11549 98190 8644 91292 234592 281108 117447 110321 -201219 228403 92811 279716 191547
11538 191547 -158213 -51131 264578 249834 -163120 55473 -140916 -52374 133150 139100 175761
11527 175761 -50923 -52480 6769 167698 -60208 -157974 490010 -168923 113919 -83675 28225
11515 182715 230371 543022 340779 -2603 -67763 -188670 -152739 97733 315010 13211 295966
11504 295966 -252044 235220 -176658 22080 145136 107588 104745 2293 67881 -69759 176177
11492 -184329 259923 -115557 107609 -204252 80417 52535 363516 -274872 327366 21764
11481 265005 -74537 5858 22466 183355 -120907 128120 -134966 -30473 222995 260347 64886
11469 126579 250754 334004 139667 275425 -67606 -189072 89437 217404 3832 79860 301583
11458 301583 -228635 57770 159412 72260 251628 107273 54677 331426 -172198 287905
11447 331436 279032 217752 47304 -20526 226309 -248303 308031 -90866 -112979 274284 193361
11436 193361 -216822 114964 91194 -104250 -273748 278259 201360 -72925 -52998 101874
11425 125192 -182212 5507 -95166 63491 -276659 -26826 -99049 164965 -4996 283718 52991
11413 -112048 -2313 257783 -245729 -237058 -13144 210125 121702 411653 -69044 29590 73887
11402 73887 434967 -22670 503 -28982 69476 -107004 141644 48398 -198720 -176190 163549
11390 -71045 -130930 -224579 -536023 235261 -17239 -50962 -113014 65977 90693 67436 -25169
11378 -125931 -93377 299165 88129 -105030 -257592 265064 -94048 -123728 -226607 -414491
11368 -414491 102950 -52169 219175 -339413 -238513 9136 142230 -351865 295622 -92488
11357 21695 20035 81424 -74707 8826 186766 122797 244259 5388 -55639 110735 394640
11346 394640 -197844 99877 -27060 102551 -419808 29904 97293 366910 -10653 -6264 -158242
11335 -158242 106608 -82309 -38368 -117174 69070 97740 -34312 -144292 -125167 165040 190132
11324 190132 -84612 153687 -92248 28819 38462 148537 292846 -228584 -38442 120964 265868
11313 265868 368906 -42681 107280 -402536 113213 -2615 262799 -103272 -133298 443635
11302 27583 -185538 -404575 -5256 -16555 67179 279037 182151 -110430 -101206 -330290 -53666
11290 4297 6051 -116027 104856 128325 -57078 -17274 241762 -134612 -117989 -219673 -29214
11278 -73650 -14352 -130800 125103 -296211 301581 -150532 -66286 -281119 48384 -98822
11267 -7869 -162685 259471 -214235 15308 -158249 78836 75517 123958 36566 -15833 -293981
11256 -293981 -57902 -30435 -431503 168393 -155910 257211 -95101 30336 28532 24461 108541
11245 108541 57181 -34914 224252 274637 -292689 141477 -280665 -64549 -23169 -33448 -63919
11234 -63919 29537 140907 -27101 -127136 -193165 -634370 113982 -82429 -6140 123232 -145627
11222 -372602 -423078 -132039 -81823 177520 -340396 -57911 -51069 145956 -171506 -8478 282622
11210 -116073 -291252 -166649 162071 -369400 -131225 -59297 223291 -21594 -362979 -222298
11200 -222298 -228863 -154431 5885 146077 -125744 -49977 -205479 -29797 -472053 126782 -152918
11188 278209 -118996 -193621 215179 32270 -123401 -30596 19504 -139610 134790 26003
11177 121716 12038 81024 -86814 -109338 155771 80471 -201878 197266 7520 -247441 7348
11165 -266262 -118200 -156127 9786 -10147 -127350 174605 216996 -73880 -182929 -193397 -367605
11154 -367605 -188620 -279715 79075 -98039 114661 -300279 90175 -262483 42300 449806
11144 449806 76463 -16335 169898 232137 -181727 -146962 -65956 228846 -83566 42158 -123937
11132 101212 -157104 -248220 -71026 -50483 299146 206339 41902 189577 31039 36222 239926
11121 239926 190578 66838 -7660 -142234 176622 280956 54660 167748 -132412 -164632 -127161
11110 -127161 499658 189634 -157779 -36413 192302 242573 229347 130159 244312 11035
11099 291481 -102590 282665 204762 -49198 334519 381025 150813 102389 46360 -103191
11088 -1853 242195 257826 -139648 -47602 80293 380174 282413 138352 178649 258236 130284
11077 130284 89458 162782 152209 237698 329974 -89820 403975 19619 507951 552674 122424
11065 352986 529480 317201 443046 362904 275846 444512 479824 430470 630130 307813
11054 232970 603863 529478 391574 658271 973358 876483 739083 698066 632019 446225
11044 446225 509109 451897 1035744 727169 708377 353662 615495 400132 663332 229226
11033 733876 653757 717134 374192 750172 421374 505313 610279 509840 889411 472641
11023 472641 433113 381387 672228 561367 561284 679751 609144 869505 767790 728051 351375
11011 520936 712187 111063 443347 425304 366217 585738 139871 392190 553431 340486
11001 340486 531589 599715 348053 321807 554477 839154 464599 521830 304697 715147
10991 715147 417721 556663 518000 498574 844502 564578 806109 839503 624160 844307
10981 844307 990925 1214769 1031274 1358662 1190223 1183902 1712045 1631712 2217571 2111028
10971 2111028 2241413 2121022 2232614 2156334 1873336 1652657 1811389 1599687 1453907 1383915
10961 1383915 1312487 1392576 1048421 1356260 1377778 1176479 1246900 1256549 895171 823236 875733
10950 875733 801582 400699 474951 598103 487916 206179 346385 345193 199247 15226
10939 562800 -18925 397099 285278 49494 109957 -41659 -117488 85819 115308 222722 160056
10928 160056 -3838 290310 -79009 283347 78181 92845 133756 153017 264540 -81305 185724
10916 232934 -200344 128870 139137 65362 77005 -30314 187085 81044 -255613 150220
10905 251323 292811 143550 42985 -135285 99070 21512 181647 336078 119055 28831
10894 -28662 -122020 -201836 238973 113697 21341 12374 113195 -124897 -16723 -128314 300050
10882 119716 -266269 -9892 115655 4685 112 -212441 -10546 22094 84493 132543 56476 -188422
10869 -230945 100120 -222532 -102345 -28513 -222086 300580 154205 229133 424660 -149194
10858 73245 -261635 -170819 -54399 -36537 -14639 -264419 -26034 63212 -122954 -169817 -181634
10847 -181634 -220373 -85355 98925 -41465 134643 58890 -76858 -69721 30769 201629 -87760
10835 -277258 9571 253579 31306 -82972 -173349 -147040 268033 149879 75557 -156582 -115408
10824 -115408 141536 -388161 109267 26567 -86968 88261 582 -190021 -268708 394695 -116514
10812 50497 75682 -235230 -74010 179577 -119328 279701 -237574 38526 -213982 35825
10801 -280684 117296 19185 -93659 3050 -374783 32067 -351634 -29511 157606 77748 -274141
10789 253828 237958 140511 130644 89393 94193 -109525 15379 -80756 56248 75078 -197517
10777 25497 -32071 -95897 264334 1858 26954 -14416 -328021 13589 54574 -226624 37544
10765 47308 556662 -213050 -56630 128996 -211078 -173059 142132 -119202 -213667 6368 -81321
10753 -164044 -10410 -75599 218461 155987 -136235 -234490 -136564 -176862 -31466 48606 192259
10742 192259 -269082 -69565 -48117 -108473 18906 86969 -192009 11678 -290048 -186188 -172624
10731 -172624 104092 410644 -89852 55911 -80863 -77235 -197101 -73619 -71786 -72067 -1596 89648
10718 -106803 -89943 15878 -280056 -279118 228686 225714 127721 -24282 -213632 21452 118063
10707 118063 183741 97775 40088 -168496 169072 174008 238491 -14682 153940 55383 29536
10696 29536 -118154 -143799 -86489 -101442 85043 -43803 -23925 126021 -361641 15988 3798
10684 -61555 -152339 -187440 -60511 72285 -103785 33348 -266850 -215880 -234616 -15506 -99998
10673 -99998 -37363 215354 88730 -256291 -59165 -291787 -66249 -264557 116818 -257791
10662 -146582 164166 116413 145441 216680 -394385 -89777 62095 -19205 -172294 85710 -141445
10650 -28598 -219333 -139483 15050 -412315 330154 -25218 -74088 40605 -450554 149025 204210
10639 204210 -298863 53261 -251226 -34243 118382 -261788 -32177 39871 -175592 122304
10628 21790 -3930 72769 44055 22510 -101 -52950 228646 245044 92734 -13502 35680 -142058
10615 155627 -9970 215016 -517781 49332 38309 -88708 -25243 -148631 -322949 -22869 -32176
10604 -32176 -47385 105692 -288521 23800 -84652 -106285 38402 -231598 -156546 -174916 134081
10592 -157502 -235054 -1151 167665 -67680 -62145 -16595 152723 -314230 -155193 -230115 -516314
10581 -516314 140719 -241363 -38655 -63842 57392 156046 -20572 297829 -70656 -170671 -82098
10569 -156049 -241548 -117697 274308 -72985 138262 10287 -201844 51782 -184063 107893
10558 -11394 -214618 -327415 5472 166167 -234680 740 -177072 171678 -326843 -8451 131339
10546 76946 134385 104107 113165 -459585 -91205 -62305 -166187 4926 -75851 111525 -97066
10534 -142625 88790 -101855 182405 -4214 -54357 -258820 73577 -76531 76202 30703 394160
10523 394160 24621 -71764 -189961 114007 -385331 157401 -76521 -176561 120951 -11889
10512 398016 -27004 -71105 -343503 65392 260439 71112 -111603 -284420 -194312 -51639 -266664
10501 -266664 76378 -213376 -280784 -360665 105401 401836 28688 -78292 -18529 91212 -160892
10489 75969 -81357 -237378 -58748 118476 -26120 -65816 217761 186664 107880 -101926 84317
10477 -98513 153166 237619 166648 32873 -513470 -69004 112839 192888 -401610 107345 41798
10465 167594 -167430 -280243 -123626 214442 -67714 44554 -153498 174190 -209395 287829
10454 -152206 25771 35832 -163810 -85974 -232125 -261862 -70709 -13101 -234941 -334414 -293627
10443 -293627 183457 -307070 -233399 -42193 129435 -272974 -110659 281912 144878 -83320
10432 -17884 7775 -130306 112420 28729 -44923 -3759 -405168 188799 62103 -22844 177610
10420 -569072 -33888 -62734 241463 -83730 72260 76931 82413 403324 -176407 -152312 12930
10408 71296 74939 202438 -277285 -219996 -32876 217307 -97279 287699 -84906 194452 -91793
10396 228650 88827 24256 -16512 147473 152151 -118488 42923 -74900 36684 218449 172201
10385 172201 389978 124693 -160096 -93167 270617 150113 147488 242897 82038 386176
10375 386176 230056 421318 163904 56898 181443 -199223 268182 266621 369531 497495
10365 497495 -164783 562941 191389 157598 136956 -18135 376978 412014 96224 25252 -53149
10353 11065 212249 467055 388334 362769 450042 487980 228559 264699 466108 134163 -60286
10341 329746 -78013 -156320 385732 204813 -160391 50836 21035 213823 9398 -67096 -121331
10330 -121331 -72125 207144 -53434 -17723 -7118 451166 140189 169618 532679 193471 263845
10319 263845 110620 -182357 250449 139488 -220885 126760 145525 213546 310273 -88500
10308 68419 128693 -195680 -49897 111301 81152 55811 -26783 -25261 78342 -6966 250381
10296 -329017 -121075 -71039 -195543 110629 110710 -70264 -410242 17526 -12839 197095 -190416
10284 57308 -205101 119433 -216888 -128915 291205 35079 104235 -2254 88124 255505 67521
10272 9661 -3230 -153927 -90535 84346 407898 -79921 -4666 -17204 154456 -225724 186662
10260 -88912 230317 54019 -135726 -55256 478523 187009 375632 218677 -130802 66159
10249 -454351 138747 27028 145377 -116408 -23680 -257708 -27420 -401856 -420301 -264768
10239 -264768 66117 -77560 1382 -177078 -27278 -206695 -36374 180928 166035 -55559 -7754
10227 -229803 -166595 -107335 -214355 -7068 -257594 -375864 -94714 -179972 -194330 270441 -194230
10215 -288260 -203435 17649 -45578 -211862 -356449 156136 -36779 384941 -43976 -22689 61870
10203 -105786 -141434 56073 523851 637 -177598 17913 15581 25432 -272614 -309656 -40129 21169
10190 -36074 94330 32477 -154520 -35003 -198968 -65393 -192100 -243239 -42722 73113 46559
10179 46559 -129390 43072 -218738 2867 221921 -78655 -147277 -286325 -107882 318546 -55466
10167 71749 -23543 14472 3802 143670 -191438 115285 8284 54329 -158939 26533 110070
10156 110070 -215731 61392 -98227 -394256 -26833 -408069 -207138 -105442 244487 159184
10146 159184 246547 -61455 18108 -89652 228890 -116200 24044 -107563 -34470 -239628 -60919
10134 -69553 317428 -21739 -237771 -268030 105604 93002 40216 -159153 16691 -97370 -75062
10123 -75062 -5163 477985 30571 -401705 -189163 143081 200980 222849 -101706 154298 -239188
10111 159931 -43299 -9702 -111447 -13149 -20483 -219129 196040 114011 105907 -79678 -57426
10100 -57426 202712 -454688 -56063 108412 -87893 -53056 156163 74096 -70963 -90901 -140153
10089 -140153 -433651 -79940 -159201 -49037 -58195 -163687 -52018 -174235 -41442 -7042 -30919
10078 -30919 24776 -82135 -167429 -33226 -139397 81646 81135 115383 -9890 -273867 131831 163885
10066 163885 -96096 -247168 -46491 -58323 -216556 62930 -167683 330436 -235120 75789
10055 -324977 -157612 -23663 -138364 -13462 20100 -94848 -15672 -60983 127067 18023 -27490
10043 -133022 62101 -266235 -354940 -35802 -252085 -124308 52794 67228 -423138 -183227
10032 -171701 268085 -209988 -212554 -295002 -311000 -293049 178915 -190782 -308672 43343 94385
10021 94385 251788 45622 -263223 -197171 113267 17121 -68336 145782 -286662 69773 161569
10010 161569 -33976 -91882 -613458 115778 -410762 -9209 -103971 68393 -87452 77395 -243418
9998 -86626 151327 137787 -106268 -105987 -279998 -212382 173510 58827 -202119 -27468 3577
9986 -56724 -28635 -86414 99757 -230674 238842 -184000 102808 -375533 -174993 50198 -249896
9974 -356143 -25110 229464 17698 913 107170 13314 47688 -342216 31567 50927 -178458
9962 176535 167217 -124088 -187195 78034 112529 -82802 -129901 -4068 -427314 84830 -39047 1746
9949 -83707 -60239 -241034 -91595 27789 -31950 -187809 -15231 -189557 127193 76162 64657
9938 64657 -90978 135598 -87419 -18348 139291 276156 -268758 -152995 -86177 -210058 28504
9926 -45790 -135332 250753 -346455 6981 -93082 -122952 202928 -542652 159720 -35074 47816
9914 -245250 61496 221327 -138413 -543104 -69044 66282 -27162 -63425 15942 -238179 -228123
9903 -228123 -167749 281250 -67429 -210039 -381856 -157554 125490 -22395 -38711 -200567
9893 -200567 173390 268109 -48190 82468 -78775 -51933 27443 9881 -17170 -322948 158570
9881 -196930 -21747 161484 -55326 -155115 -120575 5876 -197330 -253421 -212929 45243 25885
9870 25885 87242 80116 -278708 -473033 44132 70638 53866 -97886 -359647 -49525 -472169
9859 -472169 -2869 -295581 -124471 -146064 -247800 -602874 -328015 131547 326354 -133842
9848 -76175 -8372 -102474 89723 -508780 -294173 -343972 -171000 -29373 -180438 -132731 -157095
9837 -157095 192840 67658 16043 -70315 -98690 159046 -247134 -365118 201246 347276
9827 347276 -187435 -5165 -291772 -119745 185660 -42368 127356 -135975 -150509 -244644 -4199
9815 11817 45042 -2353 216026 -171491 -47105 -377885 -81898 -278263 198473 -227141 -241439
9804 -241439 158435 184313 177421 -248146 -291515 -220566 -110279 -17404 -63486 -66925 -300077
9793 -300077 122983 -142193 -215941 18786 -258041 -526252 -31984 -88286 167336 -148674
9782 -489272 27251 -24574 82953 -390337 -49162 -53354 49623 -68276 -122860 55108 -22930 -31170
9770 -31170 -81013 38080 81164 25215 -130827 44203 -273158 -202014 -44678 54338 41493
9759 41493 42523 -141638 -264334 -460050 -23354 -129918 84958 -220293 184295 -60563 29632
9747 266033 206591 -65166 -303000 -288189 74875 45394 -626822 96732 -17871 -362686 140225
9735 -19556 -94187 -157264 -124144 102321 -13335 73352 -172932 -46159 -100414 -230626 30422
9723 73237 -61241 51025 -14095 -26990 103774 -137354 51151 126398 293256 170998 -77678
9711 -20466 -357564 30437 29658 -59663 -136187 -430318 -99482 285642 180804 -200031 38456
9699 32074 25231 -326374 -153054 -165363 -252913 238558 -33314 190928 192081 52092 -278224
9687 -156670 -366840 72760 -107209 47226 -106537 -282621 -252273 97295 -165438 137702
9676 -19959 -348596 -144563 -204474 169361 20713 61114 -349823 -240621 -194096 -163493 650
9664 179820 -204106 -37288 -341478 -289254 155770 38193 -158626 54594 -307889 205630
9653 83521 164000 87002 -68634 3177 -156983 34493 -101853 -169267 -112905 63569 -331325
9641 163762 90639 -35368 70233 -8317 -332074 -58222 60997 -257345 -125762 -40829 -79990
9630 -79990 -18575 9530 -247239 -123735 -25116 -100785 -69734 -370673 -26495 -152046 -106513
9619 -106513 -338870 -170274 -97636 362650 -233643 105838 -88509 46923 201405 -239899
9608 -100996 150365 -25261 -389209 -271921 143922 90928 -184740 127332 81416 20123
9597 82610 263215 60363 8307 8653 -138156 -163641 -159567 -26850 -46999 11915 62488 44339
9585 44339 -236329 -285432 98509 99530 14100 2999 -155920 130034 108972 -317658 100127
9573 88900 347173 4822 48846 48267 -288695 41253 -42515 -401952 28645 180677 -126517
9561 -107264 85150 -95718 -210631 -201143 -26575 -340884 48429 -156901 -261471 -56221 72429
9549 -175427 -281996 -424786 -31142 -148729 82357 -58504 156535 170796 88440 328259 -67060
9537 190653 -258185 -359719 -13529 -165305 -308321 -316120 188649 -960 -249073 235259 17795
9525 -220704 -322083 -198925 -93894 195453 -54214 111745 -37104 139506 426 -27574 -143013
9514 -143013 -19627 108643 -43894 -135123 -157395 46984 9274 -30061 -95170 52644 -19725 -194213
9502 -194213 220258 125770 137782 -376893 -134756 159072 -294123 -152184 -114042 -116233 -53669
9490 202659 58096 -37993 -570434 -302937 505384 207258 177451 33935 -125306 -173621 -414714
9479 -414714 113232 -115466 -320884 15874 70886 19089 -319562 -133421 231938 -173609
9468 -111194 67902 -450791 -428829 -231885 40307 -48885 -241273 -462031 -202603 77975 -361335
9456 -213339 -210678 44845 -156519 7715 -82549 -151127 -180225 -183370 -147187 -275269 -110121 188555
9443 -96401 142712 -342146 -63602 4667 -215905 -182241 -255745 14 -56350 -138867 -95665 -26867
9430 186106 -68555 31508 -190310 -45815 97970 -254877 15788 34973 -187568 -231734 -311542
9419 -311542 -328469 -279151 -241276 374516 108446 -150412 -48651 123796 276635 134780
9408 -12902 38056 35337 77923 242774 -116719 -488479 -83150 29698 28299 -317726 98221
9396 112419 30376 -104026 -328105 72745 -10263 -204866 -6494 -28751 -183238 7168 322582
9385 322582 83877 -236013 -233902 195015 -7448 -310194 64859 -231530 -130742 -95790 -238935
9374 -238935 -75596 -158081 -245303 189050 -97716 -122584 -181739 -18570 78197 -610106 -35995
9362 -321297 3393 17877 77133 -30963 -82318 -319008 145775 131661 -24587 -22191 41582 -190973
9349 -32969 243325 165665 -174612 -156666 -26757 -67204 269985 -910 -29566 -274634 105534
9337 152256 -277803 -194177 110839 90406 253679 207828 65602 -80944 15613 68793 23768
9325 -171930 111070 -62016 45988 92005 -86875 59390 290436 113667 222686 -117763 -75829
9314 -75829 -154549 -61214 3164 -237740 252251 -155078 -49969 -253429 -274564 10470 -127007
9302 -216494 -498973 -43631 -243105 -15462 144220 146648 204846 20866 263571 -287175 -308545
9291 -308545 -81852 -181031 -14018 118888 -92090 224114 229623 11494 -255878 273895 25711
9279 159480 -26688 -272234 -186324 -26699 -122484 -24122 -293676 -165026 45145 -52776 -168118
9268 -168118 77601 -7202 -89486 -149466 -70128 -107055 -187402 -161055 285092 -301740 218465
9256 -88252 -402083 -349877 -166044 -38327 116081 -137363 -122126 -105466 -12513 78351 -132936
9244 47282 -111234 117259 -326772 -375264 81652 -209763 3536 -17435 -310123 -179566 -162191
9233 -162191 1400 -359830 -136548 227132 -224700 -119057 6488 -328856 -115331 -413432
9223 -413432 -64752 42604 -216426 209727 -47698 -4616 101704 209627 -41546 -30580 291073
9211 117654 -188391 110641 -262822 -9209 162969 -177032 -171582 -300803 256479 66396 263761
9200 263761 -300141 -13598 -88502 -145998 -53447 41745 -18255 -115892 -259441 -307757 -79948
9188 -173295 -231391 176783 -103151 -148371 59877 3398 -249293 271579 -72574 -285971 -38277
9176 -60462 43723 -135585 74706 -105859 30835 -183737 -136258 -142533 -201990 75506 -274798
9164 37683 361614 -115457 -14183 45208 -160071 -129251 -29554 178653 -9680 29608 21893
9153 21893 -66482 -74787 65005 83399 -164175 -132521 -38462 45270 -302041 -264655 -184566 13960
9140 -96252 -4391 -113566 92559 -268399 -191863 11514 -488 151775 -136867 -121654 -77344 220708
9127 146708 -153184 76826 -8938 -325473 31322 -97370 17687 -170308 -116519 -120554 -88099
9116 -88099 -200761 -237709 334993 -251182 -182498 -165817 -58871 94100 -453136 -68901 136167
9104 -119676 -362176 -413486 -63782 -5539 -262534 265085 -109989 101336 -143008 -9273 -227351
9093 -227351 -141692 52296 261871 244388 -129078 109998 14609 110541 -464630 15415 -76380
9081 -226529 137394 -214666 -161552 -47892 -245822 -370661 -37239 127675 -275382 65461
9070 143320 -291100 -11869 -332531 -17838 -13644 86196 -240736 -143659 -32863 -442977 178181
9058 114148 223527 128085 -37132 178327 -30561 185536 -141168 -28867 -133028 30838 -423042
9046 208425 -341246 -160269 -161504 -70389 -169048 -376033 -34396 -203283 40436 -177739 140753
9034 309867 -219407 -19628 -135161 -207787 -308065 -35375 235413 -13970 -156536 1888 -180061
9022 158322 -19130 234757 241988 -3108 -238282 31853 216321 188845 -468299 -307714 22503
9010 -19087 -387502 17462 -40452 -67111 6230 -189446 74271 -125680 -237517 -248992 -119575
8998 -31360 -62708 -115057 -26951 19633 -38103 257513 167229 79260 41342 -246030 57607
8986 -80028 -81980 160287 223716 -166197 -213683 -9085 90202 2484 69434 343693 70260 320850
8974 320850 61038 217057 -118428 -41326 331186 -244932 231300 -191791 194412 -115052
8963 366330 2105 -37825 -217698 -229145 38098 -68754 -90540 -467501 -143352 -54850 -136756
8952 -136756 -149732 -124714 -131371 -17480 -213634 63977 -280473 225534 -276654 -87307 65224
8940 15345 -328681 -210434 -198581 -52890 101742 -1587 111982 130615 140714 -50760 112438
8928 466897 494332 134041 453036 651303 1665752 2839960 6606687 10999567 7331449
8919 7331449 3036911 1041616 1125194 463520 484115 177889 -139359 -40830 346942 -181241
8908 287672 383823 150100 369793 36024 -223213 134078 -55209 305116 36442 -10751 287618
8896 -408985 -463103 -193876 122872 156384 -57912 206304 9003 325036 134923 -74732 -16072
8884 289194 -271461 -248668 -49879 27814 251980 -57875 -133375 -208177 -322290 63859 -23781
8872 48398 -130304 27975 -392222 -130929 -243673 120072 -191081 -124592 -229833 -72066
8861 -195076 -270658 31081 -236299 -45446 -310823 70794 -226878 -340835 134806 67731 -46465
8849 -135907 -268026 -191858 -140273 132434 209826 -252856 -202421 -20985 -241752 -90510 161926
8837 -202560 -437829 88300 -77676 35990 101181 -324787 -58754 -236235 -347947 7477 -49132
8825 234801 -34256 125292 97334 -1784 -354752 190635 -254599 -288178 68031 -172372 -245225
8814 -245225 -15148 107990 -17073 300768 -106881 109507 -263282 21878 38704 52517 -38957
8802 -54600 125599 -177346 162395 -153828 -85215 281173 232327 167110 -89191 -78253 -367860
8791 -367860 -109042 -147251 -14234 65459 -62018 105724 150534 -232919 135049 89416 -272111
8779 74252 54203 -218519 249991 -206531 8578 27638 155885 71761 -187634 -255936 11405
8767 -10178 -46915 -317717 -24621 88317 135968 -878 -93980 39739 -196504 -35873 51886 206255
8755 206255 -182136 -154874 29814 -193730 -164283 138640 -219104 -117720 101886 128484
8745 128484 -116495 -64610 -221741 -13575 -219569 -940 -130092 111420 109443 96016 -175853
8733 -104017 91457 95710 -102502 -155454 -18770 47997 -65919 -250303 -108761 65365 -149561
8721 94166 -129401 35572 -50096 -73670 291724 -101946 7192 -29034 -113030 -109932 -254001
8710 -254001 -113590 -174835 -161920 4268 -51741 -18178 -352387 -208994 -249193 -33284 -116089
8699 -116089 242555 39715 -64432 -76056 -220187 -104984 179190 -255953 60370 -35275 -66303
8688 -66303 85064 -233376 -457205 -390121 -172164 -592477 -40210 -96899 341253 -107985 145596
8676 -93112 -18172 332542 34066 -21599 -129875 186764 -280173 97315 -141357 -88757 -68638
8665 -68638 90013 -201163 -60323 -65104 -121045 -118015 9201 101 -204719 -78440 97757 -29329
8652 -224420 -26649 328749 -81424 -367990 -99040 147127 -219318 -58711 -12850 -268960 -125478
8640 -23351 86062 77329 -46724 -86060 -75928 -65396 -195058 -56070 345628 -55183 -241933
8629 -241933 181327 -110225 -47237 -308533 -157893 121111 344848 -126392 -217350 -16466
8618 -159195 -52062 -137414 -249925 -116937 56663 83142 41941 -163388 28117 107767 151297
8607 151297 -614716 179605 -332809 335466 181274 21189 -127642 12702 65082 45758
8597 45758 -350660 260986 -24398 18563 -361228 205814 22303 -10278 13322 -71617 225946
8585 90392 -79069 -146043 68147 -20743 -293234 -55236 -161786 1307 -209010 -271967 -351904
8574 -351904 -237673 -171046 -148644 117915 38733 13293 -151455 5096 -316315 235838 -264469
8562 -50397 -173731 -37376 104003 -160225 -192642 92594 -291953 552912 -35118 -156500 131335
8550 122667 -198508 -259584 -283782 -12776 39812 -170780 124138 -18840 99151 -58934 2953
8538 -81304 172205 -168947 -312002 13878 245621 36965 -110031 17793 -101479 -7704 -35091
8527 -35091 -79766 -82616 118739 198452 -350992 51691 22892 13749 -244080 48247 60889 -11625
8514 -73569 -212292 -164132 -9217 151508 -75289 -166847 -383162 207724 146633 -299006 -287897
8503 -287897 67205 119036 -54041 -42644 215089 -172102 31802 92384 -364119 103211 290793
8492 290793 -81310 59161 -228603 -85944 429274 -83342 -216461 -15304 -31997 153203 -91304
8480 -9679 -171393 77396 13133 237342 -100363 100298 19908 -32204 -5924 -255841 -171940
8469 -171940 281933 90019 -108864 -113248 -70781 -50562 257091 -27442 -14439 85383 -264493
8457 154862 12610 -48286 -98540 -121399 -156413 74672 123266 91525 57899 -401869 -57630
8445 87328 250796 -8680 7193 -71705 -245585 -20084 43411 -120777 122257 -273062 89018
8433 40201 22767 161857 -137000 173487 28045 -485842 102279 -159470 -242978 28472 -50566
8421 5744 -307781 50643 -406558 11864 124704 200414 -220010 -14455 148639 -124985 -12602
8409 -119423 -20272 -42122 -36987 35404 357745 -21921 -58977 169115 142410 11896 113312
8398 113312 24918 27169 -84535 -7056 50954 131255 -68096 43060 -227670 166433 -11873 73812
8385 -224277 40026 -19779 -136818 -342841 -180210 105537 170559 -81029 5788 -192915 159507
8373 213399 -102936 -39504 -128351 -62071 -67265 -17253 184665 -172250 76368 -102058 -255655
8362 -255655 50714 -17961 20335 -108537 113164 -175884 38680 -22072 -127550 -33523 -11131
8350 -164653 -1491 -247681 60913 -55098 -98380 44336 103120 -24162 -271718 -77532 65720
8338 63202 428 -37685 -302992 480229 -59648 123974 138802 -54822 -274646 -13107 -207406
8327 -207406 -278070 -240080 76026 261871 -207047 -112061 -201094 -157592 29987 -55362 226934
8315 -139002 -264349 -468991 -150203 179200 -110657 47776 -217251 47820 -249075 -82519
8304 238614 -302975 -450588 -12061 -28015 129172 23147 -23192 -9136 -5287 -132276 -311745
8293 -311745 41195 19192 -84037 8491 -144960 151020 14455 -238470 -140435 -297863 182925
8281 -201925 350687 -39619 153422 -100726 118058 -366738 -31416 -99339 229137 -2811 -206775
8270 -206775 43414 -315222 -138913 415496 -83046 -59606 -175774 141315 -11723 127615
8259 -196982 275485 -209050 218555 -104915 -137076 -162376 -152022 -346010 171769 7164 -399663
8247 -146186 21778 109258 -155351 185166 -189670 178285 -130802 -75878 61905 45325 9714
8235 132080 -42212 89959 298493 319743 -237383 59861 70031 -172981 118485 -141156 -106825
8224 -106825 -291078 -217688 -20105 15783 38437 -285920 -147258 350602 106488 -297041
8213 -165906 -215246 219854 -99401 -118635 -245701 -2356 177089 -162285 -6347 156957 -49530
8201 -229643 261094 210265 97821 4360 18725 -113211 -125585 -9206 -377987 -32524 -149432
8190 -149432 74824 9654 1382 -81758 -98792 -299843 19440 170687 163641 347571 -44716 -293778
8178 -293778 -31971 33072 -53551 -159973 -114008 -175816 -66495 76635 -56719 64052 -286993
8166 -297349 -146382 145868 -52792 -86213 -81508 -307879 -189130 98261 -3940 142168 -45687
8154 -177406 63467 182277 266480 -132554 202280 -374279 -85302 -517 -174844 -319445 -104212
8142 157583 302392 -8617 -237275 -181059 -28930 -305777 -119521 60789 43794 -173504 -344396
8131 -344396 -22765 -241444 -187274 181068 -37846 -345076 237313 272404 85858 327171 79283
8119 74775 115930 -131100 -387853 -61695 9786 -70455 183124 26692 -207929 -95097 -185979
8108 -185979 -41998 390374 251379 -392506 -233735 -392173 -246024 238516 179525 43398
8097 -291341 228392 -221054 212130 58513 96057 92819 60796 -45914 -67868 -92976 116444
8085 -196313 -238421 -103981 -32305 125454 -114276 -280154 122608 -170629 11913 109567
8075 109567 -176339 183935 -254020 -114162 -219623 25341 -152120 59760 -153749 41134
8064 -201731 90675 -192115 -295780 46112 242857 -43894 109389 -146951 -48505 262320
8053 104370 386138 -50910 47751 -9156 148901 -394377 69813 -159626 162752 -68816 118783
8041 -218463 -20946 -125667 -95776 -291248 -31459 -79177 -99799 106671 70675 -107526 -241812
8030 -241812 -97023 -216488 86213 123146 -169127 -459422 44907 -32082 -83881 -273323 144458
8018 -300371 -171776 -233092 -235851 -88727 144318 -119074 84512 140731 -18073 -269483 14696
8006 56092 17247 91971 216843 -76908 188628 -132499 -77186 -161736 -11224 184190 177576
7995 177576 -170843 -19476 115587 13531 285278 -193594 -211863 -33925 -300221 -46604 137927
7983 -106260 211065 90523 -184219 -48856 -309126 -212637 138441 115303 -98655 -114169 197799
7971 -156879 -357267 40213 273883 -237767 38538 29882 43075 -29126 278737 -218266 -245624
7960 -245624 132266 -146327 -251134 -82344 -63136 -289405 27292 -50190 -48324 -187658 86019
7948 -283835 -206109 155860 -324417 186581 -320394 -65496 258488 65958 -20965 77269 58036
7937 58036 -229755 -261732 354229 -317259 -15711 305841 -339847 -84299 -383615 96964 141521
7926 141521 -239681 -2578 190852 54424 -240454 -188837 -194923 -136472 -52967 105136 -5082
7914 -15489 -328577 -179432 -40882 -145854 5445 61192 -39153 38888 -51997 -79207 26295
7902 -352630 58625 2215 -172594 -1127 -98083 66795 221836 -221803 84483 128746 -51374
7890 -272664 -92163 -303545 54939 -14431 110884 -5022 -373947 -461245 -315757 -139653 -68385
7878 -21255 -275807 216532 -217105 49580 9049 63710 -262966 17250 110954 -20704 -169979
7867 -169979 -42931 -47324 -218123 -98113 -126846 57081 306428 -353998 -36101 213418 138594
7856 138594 -108141 -281933 -94063 216816 -150804 169391 128866 -486929 -240416 -120289
7846 -120289 -139632 -312855 231105 -139520 166035 -169644 442639 -174704 -205428 -348163
7836 -348163 -115662 59158 -253236 231748 -412219 121552 41563 8265 -78806 -112826 134266
7824 -150641 -210449 -228999 -5161 -192495 -95399 -169468 181415 163406 -176581 -72689 -113642
7813 -113642 63392 -47607 236541 273723 -340344 -298976 -198495 125913 -73376 211236 241350
7802 241350 -99201 -102009 -54260 -15664 188979 -2218 -51589 -43831 82417 204072 109241 -238170
7789 45699 215966 -57844 35922 -119108 -133473 -315852 239746 68525 -113948 -187627 20671
7777 -190088 65731 -181899 294554 259045 -141910 66197 165489 200680 115770 159155 299193
7766 299193 37291 8836 110007 292554 181087 90459 -163383 48477 400013 -35958 144947
7754 -129755 159576 -161340 -195629 419759 45850 6895 277027 -113074 250660 -90247 -357461
7743 -357461 119113 -290095 -113622 -241414 -279287 25872 -136563 -17431 -187030 84440
7732 -209920 78391 -205556 167296 -321129 217910 -40516 131237 50513 -191488 -38097
7721 28824 109937 405843 16634 -202400 -94153 -255523 -187938 -128378 42686 24651 36790
7710 36790 84344 94904 -106435 -163086 -139360 115896 -63819 -156380 442593 -81210 -63223
7699 -63223 -18528 211019 -18538 -53292 89715 -131084 9050 85796 -100473 -203606 -156369
7688 -156369 -134686 -88748 180555 211331 -188878 221748 -228606 -45177 267868 68947 -53308
7676 -120705 119992 -90413 -107942 -239145 -136002 -25175 -284544 -278305 454293 64206 -251317
7664 -3407 -36474 -172973 -69494 -296168 -27042 12579 194001 -362336 -186655 131302 142339
7653 142339 -492462 66111 380637 -83981 83146 -268009 86261 -46549 114740 -385198 127170
7641 -65329 -68436 109418 -9416 -216082 297637 -27746 -307347 133498 -64074 226576 104273
7629 -109464 -268336 171842 -36664 3680 -237194 -148994 -32004 43281 -81864 193355 -76233
7617 161959 -149246 70468 144300 -75973 202296 14273 -146874 381270 -63717 -221684 291873
7605 -276956 70842 211585 127536 -136670 10040 40504 -44656 96310 -168016 -226005 -107012
7593 137124 63576 -170128 -115786 -273648 -135983 -186458 40283 45939 -305649 134924 -398302
7581 -14561 100422 -71192 32313 -46598 97875 45526 -59168 -270036 -163575 -134312 -75534
7570 -75534 212718 -71266 -42300 -202184 -199825 65347 -195571 -194577 135719 -23595 -64859 128030
7557 268196 -108196 -169647 -15497 127382 -458433 -265321 -212177 -138326 82225 19284 -332319
7545 63636 -206594 -11837 -187081 -54480 -311040 117841 197615 207547 -98539 78962 -104083
7533 -126817 64952 -167207 -148735 -175368 -103586 -16261 -128807 -154395 -177337 -25882 96457
7521 -196878 42640 -137556 76433 116206 230671 -77970 -176216 -16954 78775 60130 -64999
7509 243431 10646 -9369 71154 -210955 -54633 -160898 -65243 227095 -48388 11463 -160298
7497 181741 -311689 265005 49787 106785 -231815 -155535 139295 368111 -108364 -541148
7487 -541148 62718 -319379 274982 248402 -218587 -199228 -215466 -9130 -230782 68224 -317442
7475 -12832 -259574 186239 45676 107099 367860 -389657 -58801 107181 173900 32681 161065
7464 161065 22334 191386 47126 -22830 86048 254118 -196097 25484 271197 -118154 46156
7452 -215998 -209107 32903 255034 -95657 -333642 -199733 51473 -219086 -73664 -21627 19710
7440 -57595 82956 -75040 -11952 -200459 191304 45468 130759 -150472 -443021 -44896 -164123
7429 -164123 65266 92734 -148621 273804 -77048 -30693 38694 -297283 -61720 -330288 -11175
7417 103318 -283961 427774 -203135 -262438 227305 -120306 153237 -257546 -99944 56386
7406 -120740 97784 -330586 14640 39564 72233 -77768 -366516 -192885 212919 -191708 -142121
7395 -142121 49968 -355824 -108252 260030 -155093 33337 -152540 -255144 -300632 108703
7384 172546 -95922 -16963 -287037 -166441 174700 81238 91992 62516 -167563 -173494 -302704
7373 -302704 -27601 32988 162964 -50096 -150982 193458 27328 -270308 -49244 -59072 236063
7361 -48598 -39480 -57440 -63381 -230225 -115457 27077 118849 310443 217794 -78879 36238 250166
7349 250166 61485 58934 61101 66627 -104756 -425611 134547 10121 49783 165637 -90130
7337 36620 311188 -112093 75226 155529 -51523 188754 41577 8016 250660 -160674 216826
7325 -34821 61721 31470 -3376 -140012 228724 -526060 92164 -37430 51169 -403217 -69264
7313 -230476 145306 -163308 -313945 -330030 65295 -164331 205084 106287 43139 -198350
7302 31200 -274481 -227129 283986 -39932 -23227 -184700 -130613 -333885 85319 -102683 3016
7290 253945 -215139 22844 -64172 100738 148404 97 103566 30387 314452 251160 -224827
7278 -174899 160334 44395 -114807 -124304 383552 -19702 86328 93092 -258077 -388517 -61785
7266 -20872 112655 -71319 -337127 -48770 -84319 117534 214345 36811 -173885 -205880 257115
7254 -46562 14683 190323 -151490 4452 222883 -319175 77855 -177966 -275788 -123290 -129463
7243 -129463 -53794 -195242 -122529 -69834 -279680 -235128 425273 -38282 -112998 -69740 -99285
7232 -99285 311849 105205 21163 210417 35550 39727 187263 213574 33074 129024 95979
7221 95979 -121145 -121932 201479 97504 94043 -148499 -114287 74609 -222322 -299630 25253 -112586
7208 103017 -41938 306724 54649 69116 161788 163897 -60920 67448 -98230 -63442 73789 -389302
7195 -214261 -166167 -154937 -92528 -214861 97308 -132055 -358747 -148007 -125520 -174765 -256390
7184 -256390 -313189 1465 -49729 -203254 32870 -151122 -55206 154675 91151 -23007 -95190
7173 -95190 359376 55486 -291770 -271472 -97865 -85987 165530 74744 190714 191317 26328
7161 -31960 -189901 92461 -378229 206199 -51092 -110601 267759 -72512 -114277 75648 36818
7149 -36439 -400266 -283248 -200965 -300030 -104811 -259932 104456 42054 183255 183145 -186347
7137 -41713 -352776 45710 55776 127140 -31422 -57195 -395351 -315152 -181799 -63455 -138821
7126 -138821 -22330 17433 17785 -161010 -80945 63275 -208052 7193 128027 -218768 39209
7114 -24535 -149615 35433 -153143 -349858 118720 -203070 -210944 -145285 -228012 -206911 192902
7102 57043 84278 -185560 320544 381137 188914 -88932 -110581 116045 -146948 46067 -28224
7090 -70112 -102476 6938 131328 20524 184566 194314 -182095 4993 84070 649 -239171 85432
7077 -88841 -398098 97874 14884 -169991 69913 102666 -228865 -407242 326468 -14362 109667
7065 -169347 15596 265705 128151 96898 53825 -257623 -5719 -274837 128573 484892 -166849
7053 82550 146042 -196291 -181268 -137670 -133309 -48385 -163430 78350 83472 69026 98372 92810
7041 92810 -55648 -15421 126253 62024 192403 -120188 48220 -273204 -36725 -13171 41784
7029 -176154 148015 -47871 -2984 -58612 313112 -134101 29140 35341 -217902 20513 -137674
7017 9479 115776 76553 76073 41023 17196 -252627 -329942 -416276 -82368 89313 -275538 35997
7004 -37623 -21099 -178135 -111628 110508 258332 61395 151883 137103 -16873 -13385 12325
6992 -2938 118775 -76286 -277971 135924 26073 -238140 -164099 222634 -22178 131744 -63970
6980 640355 -312693 -58749 -129445 30570 -34333 43498 -212092 33033 -168941 193019 308977
6969 308977 183512 189763 219478 -201794 51045 208913 -149814 -302205 -200881 -62124 -300659
6958 -300659 128137 128829 157040 93854 179060 -8146 -39948 124491 322064 152991 153276 93224
6946 93224 183520 -257795 -116735 -168648 -65228 -116339 -226063 -49639 51200 28342 -9866
6934 -61390 23757 -53426 -62945 42705 -117226 167412 -165329 85148 -46845 -37621 -130639 -16653
6921 -165026 -76450 -219808 58512 -114982 215417 -127673 -140153 -111405 -179470 -29298 -66317
6910 -66317 208508 127641 -358432 19226 107909 192808 178723 -246161 80953 89474 53092
6899 53092 -29538 63750 -51798 -76976 -202951 -173104 -76788 -260988 -8860 114421 41453
6887 224252 178284 -111898 -75571 60286 -246323 165679 56617 89386 -34414 -153081 103337
6875 108882 331549 206610 -42993 43955 39595 -398795 -286929 -132716 -183718 -581233 124696
6863 -4705 -16227 -102035 -127292 -201177 199567 52856 173420 137151 6723 -94597 -236392 109891
6850 -183065 -309488 136487 67938 -50442 -70842 196098 281872 -134774 420688 -35813 -226502
6839 -226502 149018 146014 175777 36565 559968 -233894 227703 50152 -203572 16329 110496
6828 110496 -172813 349309 -134092 -345616 -191552 -247253 -187271 276042 58973 -102706
6817 -70925 -197142 33845 -76638 110029 13630 130711 170928 -243276 25994 -305662 44270
6805 -110884 169515 -445917 66869 -311289 90034 -55446 -218944 -126277 -96511 -429137 -118460
6793 -97976 346407 56465 119030 76797 -131533 -51664 -93798 -38600 14796 -48328 -252574
6782 -252574 -102248 314300 204646 20259 -22954 -83755 -86602 13514 -291655 -421968 -52106
6770 73517 -4476 466713 230583 -178145 -287717 49019 -262165 83016 -80850 188801 383642
6759 383642 -172451 8372 216753 70414 297788 129700 5262 -33859 -265537 -57482 -312371
6748 -312371 -412124 -250688 63465 261134 -75893 -132869 141993 351630 302151 181900 -75523
6736 309098 -154494 290013 138606 72523 257706 -143897 -470999 100957 145782 -407094
6725 -190999 -103872 -118622 -65049 -41371 -214767 -148399 -319265 209101 170464 271470 366342
6714 366342 375137 11959 -22681 190778 -34761 130526 11176 234787 -15099 384879 8548
6702 130314 -41515 -152480 105293 30911 5475 225005 -88614 78823 -411266 22660 33226
6691 33226 -1725 -107180 58298 108508 -253030 -53499 -218168 -209408 -190827 249522 -194506
6679 93581 79115 -124105 69391 -391019 127805 265208 234107 -81740 -13394 343801 -9663
6667 193941 -181955 -127308 -219742 -6591 166318 29011 -200055 18617 -217674 101012 198480
6656 198480 -73932 -194680 97483 -43205 157306 -218533 -113703 -73078 16639 222327 -49582
6644 -159804 -4343 -285427 57704 -316452 -276110 -119789 -55462 -106931 -36022 -234303 134979
6632 174814 208140 -307406 -208868 -379310 -294956 -46791 207061 35472 187465 -175710 -218998
6621 -218998 46495 70035 -66284 169911 116774 179843 245792 212732 136837 -246714 97639
6609 -83144 -389912 -129624 207626 79704 44251 -29447 -244989 -82035 -175103 -249915 -228107
6598 -228107 -101317 -99009 -153994 -252681 285812 89821 -83652 -161547 23917 -316765 -81332
6586 16009 157129 -174721 149626 48590 -56657 163751 127005 -28869 215833 30266 114093
6575 114093 98213 -110754 111741 214726 152243 -58567 -22912 -218095 19367 -216920 8253
6563 -85247 -256760 179127 218600 -7133 24929 -240285 -38689 59256 -30620 -58244 -47277
6552 -47277 -35178 -55049 -108999 -143981 87578 -73895 -69917 184085 -25719 3316 -177225 71683
6539 190314 490026 32876 -76250 -189360 -499531 -46925 152551 -81191 -443611 -140222
6528 17306 16809 -124106 -41734 176723 131118 -154530 -4976 116175 41642 -33380 -151474
6517 -151474 148364 189467 -84799 -166108 27399 360628 -163320 4447 -74494 168557 29662
6505 40439 -50919 -103324 -86373 218623 29991 -150071 -150914 386770 67370 -307347 -163640
6494 -163640 89690 -27940 63334 143263 -36672 -341425 -42851 36757 -175010 169061 -45112
6482 15508 281654 137493 223165 -85294 83707 97650 -18822 -217132 97955 68761 -40832
6470 -300147 467042 -252599 -101659 -164269 -169511 -16801 80276 95544 -133928 -311251 -27710
6458 352882 -172694 164271 -107634 -84721 -74731 -386222 142 -153117 248087 201706 265110
6447 265110 -164189 112856 149635 -57903 -27951 82582 -46640 176957 -171441 149247 -87471
6435 -222005 -161495 46954 184361 85458 -129531 -190301 -113560 326390 -207079 147891 -286774
6423 -141605 86665 -179078 191990 -131834 -123168 -78203 -261035 -309230 -186340 -119731 10083
6411 140351 142462 -30672 10080 334129 -127597 141770 -22024 -253401 118788 137382 273449
6400 273449 30811 13808 166832 305620 -101743 -180409 -251209 -180369 -114538 -259017 18492
6388 75850 -115135 62990 -13453 -51001 -206794 -292085 -242953 -77800 -161577 -157968 93584 -19594
6375 126627 -170105 33037 -242936 -374150 -204177 57739 435918 104657 -202980 -94990
6364 200432 137314 -217319 -112558 -213502 -165900 164050 42395 152202 25247 -347103
6353 57676 132502 190718 13541 -92758 -187764 -134638 -117864 -281115 -160490 13713 -223626
6341 -188527 -189605 130705 -64342 -181298 1746 285647 239687 15071 -222254 -19426 -65436
6330 -65436 -104357 -134055 -119894 97169 -41163 41396 78169 231002 -100666 9683 -8174 249683
6317 -3367 -62580 -52882 138622 -114870 -209964 161653 72671 65662 -40958 217671 -219560
6305 -149076 -99367 -26845 151313 -148462 -18253 187394 -82145 277409 147966 -288668
6294 76698 -17929 218255 43339 30841 34825 208680 122020 59418 80831 -18503 151491
6282 -136603 284053 -104764 -12613 -19236 -26889 94608 -11775 30788 175114 305346 -57654
6270 -2187 30948 41597 132716 51920 -48614 -162444 62963 -107530 -9826 279016 -33950 -142406
6258 -142406 20048 -202430 -9531 108517 -133853 45684 -225687 -237419 -27648 156036 210765
6247 210765 -120614 106820 120533 -555106 -145377 -123631 28701 210144 -113 -48495 -65967
6236 -65967 -79779 120406 -29112 -9595 -348124 -94749 53942 211457 32404 -191384 -180851
6225 -180851 169521 -36493 -424015 -42635 251873 -48250 -6893 -226030 -123720 -17482 -134601
6214 -134601 -250738 -107688 -52911 -210503 -276340 -157308 69280 -259718 22009 -125913
6203 134180 -371449 137489 81701 -110 -178643 -336123 19873 -31149 -312668 -25916 105001
6191 -52429 140779 -84252 164906 -197071 6855 51763 244039 -345763 42359 -85764 -109959
6180 -109959 -295838 -120213 57476 -25727 23410 -403414 100886 -28259 -267818 345114
6169 135504 147278 148209 -103250 -167716 157064 -119319 -302435 -59671 -238129 172605 -30099
6157 139326 -143816 170750 117451 103429 -62978 -101163 274145 195814 -273531 182187 -356172
6145 -104047 207593 -242339 62472 -272005 -122623 -301897 -389399 -85894 -257954 1776 35692
6134 35692 63785 -27421 -9864 -117845 -327256 -35374 315601 96829 159140 29336 46078
6123 46078 15753 280002 6745 96634 46469 -241910 189725 190065 -112790 -151556 46853 -183858
6110 10880 -87319 -199028 253311 -210876 183798 -139195 -10064 160851 -22743 239062
6099 -153268 -245989 496139 -99381 -348707 -60399 352479 -209811 -1932 17534 -28187 -207453
6088 -207453 63839 213877 -253013 -181840 150053 -110588 -23203 -109445 -207613 243189 84001
6076 269010 -87773 237058 93791 -191993 -132749 -126537 -166493 114332 -265911 37723 68315
6065 68315 180945 54777 39498 -138150 157144 270172 16735 125387 11244 -148243 73174
6053 -353601 34149 300249 131240 171153 -110544 18954 94630 342095 -70637 -5174 -134165
6042 -134165 -111964 107909 133086 151017 333381 17994 -197509 -56989 164807 136243 -394512
6030 222550 121070 -66281 100725 20202 128985 -96140 117943 -10062 -9956 143336 -167087
6018 -576 30612 69886 -44167 69437 -83340 248061 -638 -227489 -143278 -62365 -129804 -157607
6006 -157607 407042 238902 18777 1196 -94578 387846 -114876 -186381 -190021 142290 259065
5995 259065 -43512 -1781 -321090 152146 10864 28660 209663 29910 240055 100466 71748
5984 71748 54374 -38618 -264109 -7636 -65094 59818 14189 48526 119038 -148086 -178791 -22177
5971 -322135 236639 -220566 15453 -86722 232893 26437 306565 215619 210990 433361 46135
5959 -112235 -366242 -237336 303553 24556 -1984 -188967 160731 223709 1980 -54969 -59376
5948 -59376 -24369 -135086 -52588 2038 -134277 91519 20507 -122671 34695 124759 51587
5936 35961 37920 -91087 31548 -126476 1489 -27929 -149278 -87591 68498 -35361 -398669 529960
5923 -87510 -38364 74920 110806 -251977 -320944 -164659 62955 -17295 83086 -93848 -13126
5911 43796 -136482 152984 189676 29842 65103 251476 45663 -146707 16406 28157 -85611
5899 39052 65442 -251870 45797 -127548 -259152 105302 14858 43284 -131127 265631 39851
5887 235807 -23597 126695 -38421 -98782 -171348 67274 -278383 212651 39473 7141 3899
5876 3899 228146 99261 10607 43766 88249 44357 -47913 97790 67066 243444 238745 -5298
5863 44838 -16204 -40693 157971 -28714 -206340 95791 -25699 -81867 370203 -33535 74040
5851 373569 106648 -230835 -240553 -247841 -62522 150240 72222 -72823 158558 -35905 -261119
5840 -261119 -33103 -282291 93715 -76088 -414777 -238986 -114064 -11464 -54956 -85936 -243785
5829 -243785 -153347 340868 -104462 -529 57253 32844 17843 254032 147550 428910 -245115
5817 -173844 89071 -213343 -1935 -379217 -149955 -35319 -311423 97215 73075 -53469 -36530
5806 -36530 -22426 -316331 192993 -186801 144197 -230150 249331 325255 -68082 298698
5795 -43973 -153501 118059 -123042 -65526 -180724 -110058 1513 224320 -128193 -101606 -133364
5784 -133364 -350813 182074 115499 -105457 -36946 194382 161408 34952 -264355 291196
5773 33808 -12981 -23827 256831 -81768 426994 -199901 175948 261038 -135442 135461 58572
5761 -12355 -76366 -360972 54264 -234414 -18730 80815 -5947 50640 -56503 32887 -42081 -211691
5749 -211691 73257 1637 152855 -120918 545489 -209715 172136 -63817 -57902 37917 -107835
5737 -304379 243449 -189130 -96225 -9948 -274731 181583 5221 -150582 329656 23248 116659
5726 116659 203473 14753 160452 54806 -82168 -209579 -377631 66207 298541 72917 -46250
5714 110900 -215570 -124958 31661 253587 -12865 193913 251757 -130302 496471 -37576 -82006
5703 -82006 228227 -99884 -172768 56711 73544 154595 -232526 65100 -191130 236587 148100
5692 148100 137912 83654 -148626 -307280 -317801 -15473 151436 58180 44673 -177486 -187314
5681 -187314 -57599 240442 240487 -267629 -205971 30500 -92902 3663 -31563 25247 -135653 -254631
5669 -254631 -245465 84622 93035 -34528 -94405 -107700 64514 198766 42438 75579 -59786 -107959
5657 -107959 103604 -236024 205791 -165818 3551 135240 -184505 -714 -175753 77515 26286
5645 196625 406529 16817 -111878 98541 -9837 -254018 -125959 -29346 -185463 -5205 -47167
5634 -47167 100197 -368621 127854 164831 -192017 -287942 64177 92467 -42800 -171242 5905
5622 -126673 -165364 139067 152595 229272 -70630 17814 169975 118322 -59914 7615 23854
5611 23854 -70554 179284 -130737 -156968 -114402 358582 -161464 18955 -8848 273287 -133165
5599 376798 38216 134106 95821 210213 93769 123702 51551 -113086 255818 249676 60799
5587 -75195 -168438 61423 241459 215425 18535 144981 -38650 -67500 208401 -30935 -106574
5576 -106574 124696 -108022 -182647 190852 136345 -57757 -166417 121768 -46350 144529
5565 -352308 27038 116171 -39817 -13826 -243004 -6383 -220654 -31578 -7499 -296002 345404
5553 26299 -236145 37479 -196412 71163 38841 211672 -53860 -46397 -201543 -233951 -14964
5541 -7289 55439 -460076 491394 177283 -199378 49675 -75459 129096 152296 207728 239895
5530 239895 149345 -136175 -3886 -245 64961 -255819 4997 -175332 -215701 69518 33893 480087
5518 480087 -274840 -204445 -10950 86288 227211 -29291 269711 45722 132072 60375 -189093
5506 326403 101511 73222 175412 -293990 -43693 -133715 -192805 -64959 162985 -24741 83718
5494 -148773 43954 166359 -61537 160489 -306170 -11208 -8119 -55221 170105 -10676 -8927
5483 -8927 -426641 -79537 -154748 67852 -74258 -372510 255507 -96999 18784 55959 106036
5472 106036 23964 -46731 -35553 199868 -105513 164959 238427 -74556 80374 -308085 -175273
5461 -175273 -158784 173563 -115967 73654 26092 -15976 -252084 -79541 4074 31366 -41113
5449 -142697 460739 79798 -156214 202100 -28747 -147278 -99143 132656 79705 222716
5439 222716 -77742 186694 -171601 177615 195535 -181975 -133811 133133 281922 -67011
5428 -268447 -235971 -196540 80419 179066 72450 277899 -95726 -134616 -195679 -54613 19334
5416 266780 -228837 -467429 -52085 242055 -84772 24919 346478 -88886 -160725 4471 158174
5405 158174 221327 5986 -96436 145969 -278475 260481 -239311 68971 256897 -92326 294503
5393 -269911 142650 76275 -155990 -24221 -108602 -306851 -107991 -403222 158820 166435 -214877
5381 -89079 88710 -48392 51394 -231241 -52904 -90411 122040 168212 -340274 198248 22325
5369 279222 129510 -78553 167661 105793 32888 -215405 -28924 70463 -125187 -14533 -125370
5358 -125370 -375558 -124871 -34020 114189 -355709 -229264 25809 -66474 -125933 -11627 366287
5346 255101 -11996 122806 -149075 32168 -75134 62031 200714 89461 185826 182726 242405
5335 242405 -82862 165992 13229 -66816 191735 33706 41685 216461 193492 62330 134318
5324 134318 -39512 462 3514 108897 85346 171053 240203 86850 21597 -56832 170953 -76110
5311 -45194 -299071 33014 -24638 -354961 402961 -236597 15030 -246208 -221511 -63342 27131
5299 -31472 118299 -195991 -231496 -177751 -179528 -213544 208655 -108420 144540 11697 -15427
5287 58874 -169220 -188189 -62833 -232835 116633 91218 -128173 -183575 22004 263063 137999
5276 137999 274986 -129737 136171 51193 256148 143424 100333 -92969 -221903 126279
5265 -165674 27348 9759 -302941 -21531 -14485 -123612 364780 -290105 -35689 -149746 -203774
5254 -203774 111645 140707 -16118 5172 -106068 -334406 -38942 295768 -3575 231383 -37316
5242 -152120 158622 -25867 77020 -265558 -130081 44495 -161436 -337533 26720 101872 -178532
5230 79683 -92011 -190604 -249969 150074 234900 217034 -233091 66633 -119699 -172343 -102771
5219 -102771 -112088 -215512 -2951 249474 78400 -325063 184601 -73979 -147981 248645 24394
5207 103698 -128565 19333 57714 -84025 6454 -45711 256602 118206 -123637 66266 252726
5196 252726 -69227 -318824 21364 -340307 233270 25214 -73816 -314969 -414480 -101972 227282
5184 372344 122312 104744 -98057 -246907 -121467 62397 -72988 18729 323708 279100 120741
5172 87027 354924 -135451 5155 -71281 -30184 -242176 -75326 -171995 -114830 -270109 7131
5160 211322 156597 96606 163406 83712 130908 474740 -123748 -51256 81418 -300748 60613
5148 -135577 183435 66692 -115871 -313960 24924 -130538 45764 179578 -185318 -357770
5138 -357770 -54040 108954 242899 -140404 15866 -157359 62084 212088 -262161 -42718
5127 -122938 168480 224093 -55985 -207670 -261473 229989 18095 39187 -180306 122243 74178
5116 74178 186001 72501 -211490 125016 -109210 -45521 212386 -23208 54939 -162769 -147038
5105 -147038 -107350 454346 198017 -100084 34467 -133945 184397 191507 76266 -54196 47580
5093 -95767 186899 -17928 12012 208052 -213903 -47580 57828 -215905 -263079 -92951 -56814
5082 -56814 -66459 -153506 19527 -67634 256916 220068 -61116 48820 -148502 -2846 383359 88741
5069 -252225 -57107 -114650 61976 117706 -310349 29683 -176407 30927 -141254 -316229 24158
5057 -132652 318553 174571 206436 103165 -5754 -128327 -524 -202201 -81425 253237 -98209
5045 -13802 -71635 109442 -247715 59054 -85917 186584 273419 84274 118222 101814 -156455
5033 -230401 40673 93323 -58474 -23020 -206820 -89387 -92063 -39763 -65665 -238291 -131388
5022 -131388 165436 168905 -7984 118043 154265 191999 -130483 286767 110887 -75300 -186868
5011 -186868 178155 429348 -276009 -173571 -184204 -117268 -186784 157234 -114858 150214
5000 52144 27107 131395 -20572 -200497 -88618 321398 -144331 -344770 -6427 -202090 -128480
4989 -128480 -99475 202631 199156 178319 151439 -195310 -119823 -291212 -97746 32134 132115
4978 132115 243438 -253424 -161370 -71856 107563 -135177 26334 343452 193480 -144610
4967 192447 -106326 -190223 126442 -85540 -51465 70846 198910 121087 64958 9584 -108809
4955 201307 -45733 -82099 231623 -26638 -332499 -137247 -223724 193399 243302 -2957 -206246
4944 -206246 264436 -215646 271855 -8552 200624 172578 340140 -51943 58775 -22439 177453
4932 -42034 15115 192571 34640 -45408 57401 -108051 170547 -36851 -13051 178646 35445
4920 323911 -101268 -78520 180738 -377442 -116279 -62482 -303396 -11976 -43723 147833
4909 -33142 -130915 -179329 202218 -132624 529 269473 -13715 98876 -40283 192003 -28378
4897 167400 148849 69984 -145192 -151016 155429 -155020 299215 -225413 -77160 -454670 -167153
4885 -907 -60769 -137430 -125994 49234 194508 72114 212158 36672 -59678 -271263 28865 -484027
4872 -155538 160794 -2581 196075 -4673 -244135 -248443 -66667 41340 -58761 -266293 -14119
4860 -878 458410 -150023 52907 -229917 142435 -143125 249682 160805 -296820 259725 393450
4849 393450 -191495 75265 91311 -30760 37741 19436 64130 -183754 77580 56901 -24946
4837 -70060 208184 44174 285020 -257471 -74901 -153776 170824 -414416 195631 -218862
4826 -287003 -97077 -283425 -16767 -134886 126100 -299951 59861 63084 -193041 -176103 -201827
4815 -201827 -56566 -21392 -317429 143375 200997 253667 82518 -396663 423003 -34522 71152
4803 -231 39047 64035 283516 26816 169833 142828 51657 161907 -119384 66784 204308
4792 204308 -115357 39348 -506577 -33247 -134191 -66909 -242091 13081 -156259 207949
4781 167278 373508 145555 -74238 -241787 43771 -161225 31601 -293030 190387 17379
4770 29411 -43532 76917 144548 47952 194613 9350 106129 55991 -7407 -232916 98055 -146271
4757 183024 48643 -147321 -291777 -99807 197397 199905 -74507 -1915 -48794 35483 201682
4746 201682 -98477 302888 10919 104699 271034 46021 -24671 -83381 205678 448733 252423
4735 252423 -300794 8560 91982 -253646 -20871 353509 -314630 332779 -19762 175290 195248
4724 195248 -207118 -207948 -335671 45082 84100 -253886 198613 142368 -363450 82348 70598
4713 70598 -134878 103556 89924 -69928 155692 -289313 -69444 -67592 204574 -157705 8299
4701 16220 126855 38869 -87178 337360 -34633 -45410 -38009 -8677 -15501 -32547 68963 95635
4689 95635 -135226 110677 201006 -19938 184402 205265 50077 -83046 -57322 241156 -133731
4677 -92081 -88575 80303 178316 37658 -95990 127270 77332 306345 -37007 210906 58889
4665 -141606 238780 -118252 -185205 -209866 54221 207047 -385424 2757 -126411 -7675 -235890
4654 -235890 -26473 -141567 -350015 147871 5377 -65077 -201105 -323039 111141 293574
4644 293574 2522 -25214 226036 136282 284742 108574 11990 -67563 -157790 -118988 -379903
4633 -379903 -220450 103828 171869 -92534 -100315 -2995 7977 232364 221633 131892 53001 -309858
4620 100664 18380 -156999 407541 -58210 151811 -163978 -81253 139975 -269983 -42488
4609 18573 307547 -110462 161525 -108739 -186001 259025 377263 -34646 -145794 55939
4598 149562 63400 79485 272791 -11383 -24575 -109939 -245359 -7753 -67663 64848 18221
4586 74675 169824 -120747 -73214 160176 -112090 -30466 208125 332895 -40995 16991 -55950
4574 89544 -300705 -248702 -96486 -116520 102209 139632 -274296 -71884 -43857 132780 365493
4563 365493 -52363 -220889 141102 42370 142204 429742 -174810 187009 -125128 -94095
4553 -94095 155680 162442 -208041 35597 180646 274233 -215196 33308 -186803 26840 -58807
4541 2573 -234872 -86602 57879 -9955 289109 133422 49199 49968 112665 132748 -177462 64510
4528 -595492 -126547 19185 18204 2357 -181392 -159440 239465 199416 -12401 -110676 -134484 48923
4515 26754 -74220 -86215 177898 -55419 172574 -110391 -58750 7358 103072 85799 -285166
4503 -224009 -76786 320885 -84973 -137167 -60466 250891 -274101 -159683 391755 146677
$$ [...]
##END NTUPLES=NMR SPECTRUM
##END=
