
##TITLE=UV1254_M10_1340-1211_70_7409441_wNitcXuMFv
##JCAMPDX= 6.0         $$ Bruker NMR JCAMP-DX V2.0
##DATA TYPE= NMR SPECTRUM
##DATA CLASS= NTUPLES
##ORIGIN= BRUKER
##OWNER= Administrator
$$ 1.72 TOPSPIN		Version 2.1
$$ 2013-01-24 21:19:20.833 -0500  Administrator@X
$$ Compression mode = diff/dup
##.OBSERVE FREQUENCY= 400.02188249412
##.OBSERVE NUCLEUS= ^1H
##.ACQUISITION MODE= SIMULTANEOUS (DQD)
##.ACQUISITION SCHEME= undefined
##.AVERAGES= 64
##.DIGITISER RES= 22
##SPECTROMETER/DATA SYSTEM= spect
##.PULSE SEQUENCE= noesygpps1d.comp
##.SOLVENT NAME= COFFEE_meoh
##.SHIFT REFERENCE= INTERNAL, COFFEE_meoh, 1, 14.96128
##AUDIT TRAIL= $$ (NUMBER, WHEN, WHO, WHERE, PROCESS, VERSION, WHAT)
$$ ##TITLE= Audit trail, TOPSPIN		Version 2.1
$$ ##JCAMPDX= 5.01
$$ ##ORIGIN= Bruker BioSpin GmbH
$$ ##OWNER= Administrator
$$ $$ E:\/data/COFFEE/nmr/UV1254_M10_1340-1211_70_7409441_wNitcXuMFv/12/pdata/1/auditp.txt
$$ ##AUDIT TRAIL=  $$ (NUMBER, WHEN, WHO, WHERE, PROCESS, VERSION, WHAT)
(   1,<2013-01-24 21:19:14.974 -0500>,<Administrator>,<X>,<go>,<TOPSPIN 2.1>,
      <created by zg
	started at 2013-01-24 21:07:44.833 -0500,
	POWCHK enabled, PULCHK disabled,
       configuration hash MD5:
       86 BA 57 50 F2 9D 5C 9B 26 00 A9 28 5F 66 2E 89
       data hash MD5: 64K
       DE 18 08 67 6F 2E A3 CE 68 70 38 F5 A2 EB 92 19>)
(   2,<2013-01-24 21:19:18.099 -0500>,<Administrator>,<X>,<proc1d>,<TOPSPIN 2.1>,
      <Start of raw data processing
       efp LB = 0.3 FT_mod = 6 PKNL = 1 PHC0 = 0 PHC1 = 0 SI = 128K 
       data hash MD5: 128K
       E9 37 99 10 C1 6B 22 AE 11 B1 67 B9 26 B7 D8 00>)
(   3,<2013-01-24 21:19:19.177 -0500>,<Administrator>,<X>,<proc1d>,<TOPSPIN 2.1>,
      <pk PHC0 = -80.68909 PHC1 = 0 
       data hash MD5: 128K
       4D 0E F1 2E FB F0 C6 10 0D 6F 9D AF B4 30 B9 B2>)
(   4,<2013-01-24 21:19:19.833 -0500>,<Administrator>,<X>,<proc1d>,<TOPSPIN 2.1>,
      <abs ABSG = 1 
       data hash MD5: 128K
       8C FF F9 9A D6 2E FF 9A 9F 7C 4E 78 67 48 F7 BC>)
(   5,<2013-01-24 21:19:20.005 -0500>,<Administrator>,<X>,<proc1d>,<TOPSPIN 2.1>,
      <abs ABSG = 2 
       data hash MD5: 128K
       68 46 27 13 AC 78 D8 5A 85 99 34 5B 52 75 14 CD>)
(   6,<2013-01-24 21:19:20.162 -0500>,<Administrator>,<X>,<proc1d>,<TOPSPIN 2.1>,
      <abs ABSG = 3 
       data hash MD5: 128K
       3F 12 20 0C 6B E8 45 0C 2C 28 F2 5D 25 53 8A 92>)
(   7,<2013-01-24 21:19:20.333 -0500>,<Administrator>,<X>,<proc1d>,<TOPSPIN 2.1>,
      <abs ABSG = 4 
       data hash MD5: 128K
       53 77 1B 8E B8 4F E4 22 B1 57 9A 46 FE AC FF 40>)
(   8,<2013-01-24 21:19:20.521 -0500>,<Administrator>,<X>,<proc1d>,<TOPSPIN 2.1>,
      <abs ABSG = 5 
       data hash MD5: 128K
       EC 04 3F C2 E8 7C 42 B6 C2 BE 8A 84 C5 4D 8C B8>)
$$ ##END=
$$ 
$$ $$ hash MD5
$$ $$ 29 47 BD 12 6F F8 AB AA 1B C4 01 CD 6D C9 DD 2B
##$RELAX= 
##$RELAX= 
##$RELAX= 
##$RELAX= 
##$RELAX= 
##$RELAX= 
##$RELAX= 
##$RELAX= 
$$ Bruker specific parameters
$$ --------------------------
##$DU= <E:\>
##$EXPNO= 12
$$ [...]
##$TP07= 0
##$TPNAME0= <>
##$TPNAME1= <>
##$TPNAME2= <>
##$TPNAME3= <>
##$TPNAME4= <>
##$TPNAME5= <>
##$TPNAME6= <>
##$TPNAME7= <>
##$TPOAL= (0..7)
0.5 0.5 0.5 0.5 0.5 0.5 0.5 0.5
##$TPOFFS= (0..7)
0 0 0 0 0 0 0 0
##$TUNHIN= 0
##$TUNHOUT= 0
##$TUNXOUT= 0
##$USERA1= <user>
##$USERA2= <user>
##$USERA3= <user>
##$USERA4= <user>
##$USERA5= <user>
##$V9= 5
##$VALIST= <valist>
##$VCLIST= <CCCCCCCCCCCCCCC>
##$VD= 0
##$VDLIST= <DDDDDDDDDDDDDDD>
##$VPLIST= <PPPPPPPPPPPPPPP>
##$VTLIST= <TTTTTTTTTTTTTTT>
##$WBST= 1024
##$WBSW= 4
##$XGAIN= (0..3)
0 0 0 0
##$XL= 0
##$YL= 0
##$YMAX_a= 5906627
##$YMIN_a= -12021724
##$ZGOPTNS= <>
##$ZL1= 120
##$ZL2= 120
##$ZL3= 120
##$ZL4= 120
##$ABSF1= 14.96128
##$ABSF2= -5.596902
##$ABSG= 5
##$ABSL= 3
##$ALPHA= 0
##$AQORDER= 0
##$ASSFAC= 0
##$ASSFACI= 0
##$ASSFACX= 0
##$ASSWID= 0
##$AUNMP= <proc_prof1d_extract.lims>
##$AXLEFT= 0
##$AXNAME= <>
##$AXNUC= <1H>
##$AXRIGHT= 0
##$AXTYPE= 0
##$AXUNIT= <>
##$AZFE= 0.1
##$AZFW= 0.1
##$BCFW= 0
##$BC_mod= 0
##$BYTORDP= 0
##$COROFFS= 0
##$CY= 15
##$DATMOD= 1
##$DC= 0
##$DFILT= <>
##$DTYPP= 0
##$F1P= 0
##$F2P= 0
##$FCOR= 0.5
##$FTSIZE= 131072
##$FT_mod= 6
##$GAMMA= 0
##$GB= 0
##$INTBC= 1
##$INTSCL= 1
##$ISEN= 128
##$LB= 0.3
##$LEV0= 0
##$LPBIN= 0
##$MAXI= 10000
##$MC2= 0
##$MEAN= 0
##$ME_mod= 0
##$MI= 0
##$NCOEF= 0
##$NC_proc= -2
##$NLEV= 6
##$NOISF1= 0
##$NOISF2= 0
##$NSP= 0
##$NTH_PI= 0
##$NZP= 0
##$OFFSET= 14.96128
##$PC= 1
##$PHC0= -80.68909
##$PHC1= 0
##$PH_mod= 1
##$PKNL= yes
##$PPARMOD= 0
##$PPDIAG= 0
##$PPIPTYP= 0
##$PPMPNUM= 2147483647
##$PPRESOL= 1
##$PSCAL= 4
##$PSIGN= 0
##$PYNMP= <proc.py>
##$REVERSE= no
##$SF= 400.020009526446
##$SI= 131072
##$SIGF1= 0
##$SIGF2= 0
##$SINO= 400
##$SIOLD= 131072
##$SPECTYP= <>
##$SREGLST= <1H.CDCl3>
##$SSB= 0
##$STSI= 131072
##$STSR= 0
##$SW_p= 8223.68421052631
##$SYMM= 0
##$S_DEV= 0
##$TDeff= 65536
##$TDoff= 0
##$TI= <>
##$TILT= no
##$TM1= 0
##$TM2= 0
##$TOPLEV= 0
##$USERP1= <user>
##$USERP2= <user>
##$USERP3= <user>
##$USERP4= <user>
##$USERP5= <user>
##$WDW= 1
##$XDIM= 131072
##$YMAX_p= 297174732
##$YMIN_p= -11225
##$CURPLOT= <Network HP LaserJet P1505>
##$CURPRIN= <$Network HP LaserJet P1505>
##$DFORMAT= <normdp>
##$LAYOUT= <+/1D_H.xwp>
##$LFORMAT= <normlp>
##$PFORMAT= <normpl>
##$SURQMSG= 1
$$ End of Bruker specific parameters
$$ ---------------------------------
##NTUPLES= NMR SPECTRUM
##VAR_NAME=  FREQUENCY,     SPECTRUM/REAL,   SPECTRUM/IMAG
##SYMBOL=    X,             R,               I
##VAR_TYPE=  INDEPENDENT,   DEPENDENT,       DEPENDENT
##VAR_FORM=  AFFN,          ASDF,            ASDF
##VAR_DIM=   131072,        131072,          131072
##UNITS=     HZ,            ARBITRARY UNITS, ARBITRARY UNITS
##FACTOR=    0.0627417313425164, 1,          1
##FIRST=     8223.62146879497, 16,           -60458
##LAST=      0,             2690,            -60971
##MIN=       0,             -11225,          0
##MAX=       8223.62146879497, 297174732,    0
$$ Real data points
##PAGE= N=1
##DATA TABLE= (X++(R..R)), XYDATA
$$ [...]
61678E32257m369m681m683m445m358m373m045l253k457k112k180k280k179k006
61664D84836k018k146j909r94J70P48N07J8k31m12p73j027q62m88j75L40J262
61647D76846J924J542N25R7O07J192J258J248J543J613R43K2m23n70j023j573
61631D85771j455p29m92j495l252m671n092m518l346k210j665j688j673j154l63
61616D51968J49K47J67l8o60j776k846l254l098l090l545l853l317k246j703k133
61600D20972k823k904k441k084k116k274k369k439k425k170j837j914k593l448
61586C87135l840l496k600j564p43k88j20j35l68q04j191j287j200j207j318j394
61570C65580j490j660j444k86J401K231J409k11j145j006n99m83k63M83J300J367
$$ plain form
61678 532257 527888 523207 518524 514079 509721 505348 501303 498050 495593 493481 491301 489021 486842 484836
61664 484836 482818 480672 478763 477769 477939 478687 479194 479212 478981 478569 477796 476769 475907 475419 475244 475584 476846
61647 476846 478770 480312 480837 480934 481541 482733 483991 485239 486782 488395 489338 489360 488937 488367 487344 485771
61631 485771 484316 483587 483095 481600 478348 473677 468585 464067 460721 458511 456846 455158 453485 452331 451968
61616 451968 452117 452364 452531 452493 451833 450057 447211 443957 440859 437769 434224 430371 427054 424808 423105 420972
61600 420972 418149 415245 412804 410720 408604 406330 403961 401522 399097 396927 395090 393176 390583 387135
61586 387135 383295 379799 377199 375635 374892 374604 374484 374349 373981 373177 371986 370699 369499 368292 366974 365580
61570 365580 364090 362430 360986 360700 362101 364332 365741 365530 364385 363379 362780 362297 362034 362517 363817 365184
61554C65184O76N2N0K94J82j64j63K29L94J26J33J013K150K374J565Q17R27J440
61536C77279J517J071O58O67J077J680K111J927J082J18m98r22j454j842j612
61521C82859r13m19m06n13m47m16o94j143j382j194o68j55l3k99m36n3M56L24
61503C74468n37j359j549j340j171r53l01P30J623J956J695J027K27l81o06n61
61487C72968n08n18m45k03P5K16K21K74M55N94N03L32M39Q02Q80L80j57K9Q18
61468C77155J369J313J213J510J710J084j55j015r10k11L43M20K05N7J42L08K74
61451C84812P8J59Q10J666K021J634J020Q05J047J272J120P37N30P01J177J897
61435D01486K845L673L649K482J012M84J061J638J410R45J219K090K490J929J044
$$ plain form
61554 365184 365860 365912 365962 366256 366438 366274 366111 366340 366734 366860 366993 368006 370156 372530 374095 374912 375839 377279
61536 377279 378796 379867 380525 381192 382269 383949 386060 387987 389069 389187 388689 387767 386313 384471 382859
61521 382859 381946 381527 381121 380608 380161 379745 379051 377908 376526 375332 374664 374509 374476 374177 373741 373688 374144 374468
61503 374468 373931 372572 371023 369683 368512 367559 367258 367988 369611 371567 373262 374289 374516 374135 373529 372968
61487 372968 372460 371942 371497 371294 371369 371585 371806 372080 372535 373129 373632 373964 374403 375205 376085 376465 376308 376337 377155
61468 377155 378524 379837 381050 382560 384270 385354 385199 384184 383274 383063 383406 383826 384031 384088 384230 384538 384812
61451 384812 384890 385049 385859 387525 389546 391180 392200 393005 394052 395324 396444 397181 397711 398412 399589 401486
61435 401486 404331 408004 411653 414135 415147 415631 416692 418330 419740 420685 421904 423994 426484 428413 429457
61420D29457N74M56K27j20j52L49J089J616J746J643J549J473J205O23q3n75p11
61403D40366o81q36j371k091k423j941r66m05p81j624k107k053j869j686j122
61388D18410K1J316K105K125J535P38K73N31J283J734J356N13N1L36J002J490
61372D34819J551J212O37J80L24J242K414L004K751K284K327K775K982K857L060
61357D64419L864M480M124L273L057L584L834L349L045L829N163N824N588N337
61343E22770N611N964N861N519N437N568N444M895M284L968L863L675L310K925
61329E89094K543J935R76k4o31q79j148j430j194k84M76J72r11j461p11O87J552
61312E88762J525J235J421K216L175L707L544K974K594K710L096L360L425L470
$$ plain form
61420 429457 430031 430487 430714 430594 430442 430791 431880 433496 435242 436885 438434 439907 441112 441735 441652 441077 440366
61403 440366 439685 438849 437478 435387 432964 431023 430057 429652 428871 427247 425140 423087 421218 419532 418410
61388 418410 418431 419747 421852 423977 425512 426250 426523 427054 428337 430071 431427 431940 431991 432327 433329 434819
61372 434819 436370 437582 438219 438399 438723 439965 442379 445383 448134 450418 452745 455520 458502 461359 464419
61357 464419 468283 472763 476887 480160 483217 486801 490635 493984 497029 500858 506021 511845 517433 522770
61343 522770 528381 534345 540206 545725 551162 556730 562174 567069 571353 575321 579184 582859 586169 589094
61329 589094 591637 593572 594548 594524 593893 593014 591866 590436 589242 588958 589434 589606 588695 587234 586523 587210 588762
61312 588762 590287 591522 592943 595159 598334 602041 605585 608559 611153 613863 616959 620319 623744 627214
61298F27214L564L610L542L380L170L000K951K877K319J017o18j811k194k055
61284F49966j781j477j147r06p63m52K32J093J676J638R29j26p92m30P25J589
61268F49974J500J142J637K975M011M062L726L875M494N012N234N423N695N955
61254G04715O283O858P459P532O816N681M732M335M490M845M800L893K293O77
61240G75409m55j163j744k258k566k619k542k495k607k847k957k647k028j580
61226G44901j532j511j078m38j24q0L92J644L063L870M138M548N276N695N248
61211G74012M173L116K470K329K756L635M427M521L901L185K962L325M044M868
61197H23724N676O511P569Q878J0080J0800J1209J1796J2570J2944J2581J1885
$$ plain form
61298 627214 630778 634388 637930 641310 644480 647480 650431 653308 655627 656644 656026 654215 652021 649966
61284 649966 648185 646708 645561 644655 643892 643440 643672 644765 646441 648079 649008 648882 648090 647660 648385 649974
61268 649974 651474 652616 654253 657228 661239 665301 669027 672902 677396 682408 687642 693065 698760 704715
61254 704715 710998 717856 725315 732847 739663 745344 750076 754411 758901 763746 768546 772439 774732 775409
61240 775409 774954 773791 772047 769789 767223 764604 762062 759567 756960 754113 751156 748509 746481 744901
61226 744901 743369 741858 740780 740342 740218 740138 740530 742174 745237 749107 753245 757793 763069 768764 774012
61211 774012 778185 781301 783771 786100 788856 792491 796918 801439 805340 808525 811487 814812 818856 823724
61197 823724 829400 835911 843480 852358 862438 873238 884447 896243 908813 921757 934338 946223
61185I46223J1375J0979J0356R499Q627P711O592N432M481L551K235P12k79m36
61171A027058m25j166k758m426n404n724o103p114q511r514r766r750j0120j0892
61157I35385j1604j1985j2058j1718j0781r460q302p517o755n718m671m101m067
61144H26648m107l759l078k596k671k881k386j088J2N7m51k93Q66K287L389M313
61128H14262N223N952O632P767R322J0594J1472J2933J5535J8199J9457J9411
61116I56759J9428K0215K1209K1823K2222K2720K3170K3356K3296K2875K1728
61105A198801J9797J7564J5473J3461J1345R277P432N514L057J69k427m225n588
61092A289650p354r831j2404j4264j5343j6217j7130j7600j7232j6477j6187j6553
$$ plain form
61185 946223 957598 968577 978933 988432 997059 1004770 1011362 1016794 1021275 1024826 1027061 1027773 1027494 1027058
61171 1027058 1026633 1025467 1022709 1018283 1012879 1007155 1001052 993938 985427 975913 966147 956397 946277 935385
61157 935385 923781 911796 899738 888020 877239 867779 859477 851960 845205 839487 834816 830715 826648
61144 826648 822541 818782 815704 813108 810437 807556 805170 804082 804094 804151 803700 803407 804273 806560 809949 814262
61128 814262 819485 825437 832069 839836 849158 859752 871224 884157 899692 917891 937348 956759
61116 956759 976187 996402 1017611 1039434 1061656 1084376 1107546 1130902 1154198 1177073 1198801
61105 1198801 1218598 1236162 1251635 1265096 1276441 1285718 1293150 1298664 1301721 1301890 1299463 1295238 1289650
61092 1289650 1282296 1272465 1260061 1245797 1230454 1214237 1197107 1179507 1162275 1145798 1129611 1113058
61080A113058j6940j6671j5627j4151j2591j1066r428p569n820m791m540m255
61068I89609l152j391L69K030L938N903P100P214O939P132P917Q903R880J0973
61054A063364J2460J4586J7198J9475K0527K0517K0668K1876K3765K5507K7018
61043A286961K8822L1082L3352L5214L6633L7860L9345M1563M4427M7039M8585
61032A710883M9407N0611N2627N4772N6440N8082O0519O3754O7097P0320P3933
61021B368445P8278Q2879Q7220R1727R7412J04623J12784J21517J31325J42793
61011C419003J55676J69522J84884K03038K24536K48844K75684L05928L40796
61002E527911L80799M26064M77245N35361O00949O73799P53380Q38829R28514
$$ plain form
61080 1113058 1096118 1079447 1063820 1049669 1037078 1026012 1016584 1009015 1003195 998404 993864 989609
61068 989609 986457 985066 985435 987465 991403 997306 1004406 1011620 1018559 1025691 1033608 1042511 1052391 1063364
61054 1063364 1075824 1090410 1107608 1127083 1147610 1168127 1188795 1210671 1234436 1259943 1286961
61043 1286961 1315783 1346865 1380217 1415431 1452064 1489924 1529269 1570832 1615259 1662298 1710883
61032 1710883 1760290 1810901 1863528 1918300 1974740 2032822 2093341 2157095 2224192 2294512 2368445
61021 2368445 2446723 2529602 2616822 2708549 2805961 2910584 3023368 3144885 3276210 3419003
61011 3419003 3574679 3744201 3929085 4132123 4356659 4605503 4881187 5187115 5527911
61002 5527911 5908710 6334774 6812019 7347380 7948329 8622128 9375508 10214337 11142851
60993A1142851J019717J108690J190535J259092J307153J327052J311582J255767
60985B0922439J159075J026254Q65730O86973M98819L08400J19561o8089k57225
60976B5261937m48851o39782q23207r90314j131416j237506j303003j327731j316226
60967A6043901j275338j212465j134855j048980r59986q71765p87327p08633o36375
60958G408177n70548n11242m58504m11651l69590l31821k98611k69912k44799
60949C941499k22260k02059j84334j68764j54694j41976j31072j22239j14908
60940B499193j08123j01325r4584q8201q2365p7171p2684o8829o5350o1987n8614
60929A619960n5120n1343m7370m3753m1001l8845l6491l3716l1209k9519k8239
$$ plain form
60993 11142851 12162568 13271258 14461793 15720885 17028038 18355090 19666672 20922439
60985 20922439 22081514 23107768 23973498 24660471 25159290 25467690 25587251 25519162 25261937
60976 25261937 24813086 24173304 23350097 22359783 21228367 19990861 18687858 17360127 16043901
60967 16043901 14768563 13556098 12421243 11372263 10412277 9540512 8753185 8044552 7408177
60958 7408177 6837629 6326387 5867883 5456232 5086642 4754821 4456210 4186298 3941499
60949 3941499 3719239 3517180 3332846 3164082 3009388 2867412 2736340 2614101 2499193
60940 2499193 2391070 2289745 2195161 2106960 2024595 1947424 1874740 1805911 1740561 1678574 1619960
60929 1619960 1564840 1513497 1466127 1422374 1381373 1342528 1306037 1272321 1241112 1211593 1183354
60918A183354k6681k4926k3494k2320k0855j9141j7813j6971j5892j4237j2725
60907I68299j2070j1938j1561j0909j0492j0430j0475j0661j1156j1544j1095
60896H45968r846q706q331q489q670q721q666q451q254q472r031r182q394p082
60882G25673n987n226m523m065m403n433o206n967m996m151l884m008m119l947
60868F58758l341k318j207n34n45r27j120q54k62M93J425K441L103K962K091J005
60852F61170K00p9K85J197K072K147J274K05k15P8M49L56k21r83j703k351l027
60835F60854l806m675n626o672p594p795o867n299m235m277m890n157m809m188
60821E84964l617l178k877k665k417k132j963j880j583j026o44o67p08m57l34
$$ plain form
60918 1183354 1156673 1131747 1108253 1085933 1065078 1045937 1028124 1011153 995261 981024 968299
60907 968299 956229 944291 932730 921821 911329 900899 890424 879763 868607 857063 845968
60896 845968 836122 827416 819085 810596 801926 793205 784539 776088 767834 759362 750331 741149 732755 725673
60882 725673 719686 714460 709937 705872 701469 696036 689830 683863 678867 674716 670832 666824 662705 658758
60868 658758 655417 653099 651892 651358 650813 649886 648766 647912 647650 648143 649568 652009 655112 658074 660165 661170
60852 661170 661370 661291 661576 662773 664845 666992 668266 668471 668256 668334 668783 669139 668918 667935 666232 663881 660854
60835 660854 657048 652373 646747 640075 632481 624686 617819 612520 608285 604008 599118 593961 589152 584964
60821 584964 581347 578169 575292 572627 570210 568078 566115 564235 562652 561626 560982 560315 559607 559150 558816
60806E58816p62j196p53M09J247J345J352J783K319K613K936L510L975M036M131
60791E85761M762N607N924N600N210N209N523N824N841N471M920M604M673M820
60777F59749M814M972N656O557O903O376N425M672M365M380M451M373M223M328
60763G31244M808N233N075M420L890L842L987L934L708L504L205K444J182j08
60749G80368q61j028j066j427k140k927l552l936m126m351m972o031p002p371
60735G29578p429p918q852r293q623p503p062p538q223q479q235p599o602n416
60721F20806m365l638l270l390m136n224n926n685m685l655l161l135l143l034
60707E64359l163l791m535m849m916n382o136o204n239m286m325m754m310l019
$$ plain form
60806 558816 558054 556858 556105 556514 557761 559106 560458 562241 564560 567173 570109 573619 577594 581630 585761
60791 585761 590523 596130 602054 607654 612864 618073 623596 629420 635261 640732 645652 650256 654929 659749
60777 659749 664563 669535 675191 681748 688651 695027 700452 705124 709489 713869 718320 722693 726916 731244
60763 731244 736052 741285 746360 750780 754670 758512 762499 766433 770141 773645 776850 779294 780476 780368
60749 780368 779507 778479 777413 775986 773846 770919 767367 763431 759305 754954 749982 743951 736949 729578
60735 729578 722149 714231 705379 696086 687463 679960 672898 665360 657137 648658 640423 632824 626222 620806
60721 620806 616441 612803 609533 606143 602007 596783 590857 585172 580487 576832 573671 570536 567393 564359
60707 564359 561196 557405 552870 548021 543105 537723 531587 525383 520144 515858 511533 506779 502469 499450
60693D99450k139k292k805k938k761k525k137j681j647k146k499k176j542j255
60679D68907j277j072l70N97J401J652J304R08J121J729J769R51K57O01J515J919
60663D81912J642J298J108P76L45K26L47J55m27p89m97L65J699L417M799M851
60647E01227L694K779L048L690L392K229J355J217J073K15j196k578l533l802
60633E12810l251k248j521j411j577j621j607j737j927j967j855j589j032k34
60619D89233L95N71N91P89R03M64l33q09p85p77j077j253q57j35L68M74L47Q5
60601D88194k23l68l02l76q59j404j421q08L8P96J299J264N57k39k70N07J212
60584D87597J300J240J574J945J703J060Q79J444K183K665L160M026N007N598
$$ plain form
60693 499450 497311 495019 492214 489276 486515 483990 481853 480172 478525 476379 473880 471704 470162 468907
60679 468907 467630 466558 466188 466785 468186 469838 471142 472050 473171 474900 476669 477620 477877 478478 479993 481912
60663 481912 483554 484852 485960 486736 487081 487307 487654 487809 487382 486593 486096 486461 488160 491577 496376 501227
60647 501227 504921 507700 510748 514438 517830 520059 521414 522631 523704 523919 522723 520145 516612 512810
60633 512810 509559 507311 505790 504379 502802 501181 499574 497837 495910 493943 492088 490499 489467 489233
60619 489233 489628 490199 490790 491579 492482 492946 492613 491804 491019 490242 489165 487912 487055 486920 487288 487762 488109 488194
60601 488194 487971 487603 487301 486925 486066 484662 483241 482433 482471 483267 484566 485830 486387 486148 485878 486385 487597
60584 487597 488897 490137 491711 493656 495359 496419 497298 498742 500925 503590 506750 510776 515783 521381
60570E21381N764N920O314O806P212P658Q462R745J1201J2260J2597J2391J2005
60557F39716J1453J0413Q784O920N159L438J672J57q17j540k510l513l752k969
60543F72611j806p63N04K290L964M795N235O374Q267R849J0662J1519J3021J4368
60529G60890J4413J3188J1594J0088Q503O808N185L515J608j51j185j649k167
60516H30640k726k663j913j289j209r99K4J453K387K671K889L542M700O271Q004
60501H51782R470J0478J1449J2974J5179J7803K0632K3535K6243K8580L0723L2840
60489A091688L4639L5586L5443L4166L1512K7316K2013J6417J0890N219p25o692
60477A337472j2445j7935k2981k7202l0381l2603l3945l4487l4659l5018l5482
$$ plain form
60570 521381 527145 533065 539379 546185 553397 561055 569517 579262 590463 602723 615320 627711 639716
60557 639716 651169 661582 670366 677286 682445 685883 687555 687712 686895 685355 682845 679332 675580 672611
60543 672611 670805 670042 670546 672836 676800 681595 686830 693204 701471 711320 721982 733501 746522 760890
60529 760890 775303 788491 800085 810173 818676 825484 830669 834184 835792 835641 834456 832807 830640
60516 830640 827914 825251 823338 822049 820840 819841 819865 821318 823705 826376 829265 832807 837507 843778 851782
60501 851782 861252 871730 883179 896153 911332 929135 949767 973302 999545 1028125 1058848 1091688
60489 1091688 1126327 1161913 1197356 1231522 1263034 1290350 1312363 1328780 1339670 1344889 1344164 1337472
60477 1337472 1325027 1307092 1284111 1256909 1226528 1193925 1159980 1125493 1090834 1055816 1020334
60466A020334l5277l3999l2197l0498k8678k6232k3526k1580k0711k0092j8870
60455G28674j7184j5695j4591j3451j1946j0254q773p769p265p058o784o114n081
60442E96709m129l765m097m663m728l935k703j838j641j650j461j430k052k862
60428E55755k731j407n8J69m66r26r19j004j440j812j821j680j530j108l01M84
60412E39205Q83J052J265J404J184N80j76p99r58m95J89L93L7k13J1J82j69n32
60394E43043j79O26J052J002J058J266R97J72l65o5M88M65m4l63k22J30N77J225
60376E50863J917K145J651P96K56L78Q53R94M45l83o77p9R69J788K061J804J079
60359E66860Q3o15m09O80J867K289J767Q82M19P39J579K327K529K267K048K286
$$ plain form
60466 1020334 985057 951058 918861 888363 859685 833453 809927 788347 767636 747544 728674
60455 728674 711490 695795 681204 667753 655807 645553 636780 629011 621746 614688 607904 601790 596709
60442 596709 592580 588815 584718 580055 575327 571392 568689 566851 565210 563560 562099 560669 558617 555755
60428 555755 553024 551617 551559 551728 551262 550336 549417 548413 546973 545161 543340 541660 540130 539022 538721 539205
60412 539205 540088 541140 542405 543809 544993 545573 545397 544598 543640 543145 543334 543727 543764 543551 543562 543744 543575 543043
60394 543043 542864 543490 544542 545544 546602 547868 548865 549037 548672 548607 549095 549560 549516 549153 548931 549061 549638 550863
60376 550863 552780 554925 556576 557372 557628 558006 558859 559853 560298 559915 559238 559159 560128 561916 563977 565781 566860
60359 566860 566943 566328 565919 566599 568466 570755 572522 573404 573823 574562 576141 578468 580997 583264 585312 587598
60343E87598K793K923K291J294P88J243K298L131L109K175Q05l78j122j700k410
60328F04838l004l000k436j825j358p63j04po03j000n19K12K39j15K86J542K513
60311E94896K603K542L100L989M687N447O735Q253R295R791J0285J1103J2150
60298F84876J3323J4562J5486J5475J4175J1630Q080L854n36m565p873j0232j1504
60285G46751j1856j1718j1301j0379q881p398o640o571o560o357o339o804p436
60272F38511p715p474o912o206n336m290l278k698k759l145l238k744j973j396
60258E79347j191j345j830k402k512j867q71j47K57O95J139J167P51N32R55J577
60242E74255J536N98n35r47l57O15J100Q41L94M43J031J693K107K303K340K160
$$ plain form
60343 587598 590391 593314 595605 596899 597687 598930 601228 604359 607468 609643 610448 610070 608948 607248 604838
60328 604838 601834 598834 596398 594573 593215 592452 592348 592341 591738 590738 590219 590431 590670 590555 590841 592383 594896
60311 594896 597499 600041 603141 607130 611817 617264 623999 632252 641547 651338 661623 672726 684876
60298 684876 698199 712761 728247 743722 757897 769527 777607 781461 780925 776360 768487 758255 746751
60285 746751 734895 723177 711876 701497 692616 685218 678578 672007 665447 659090 652751 645947 638511
60272 638511 630796 623322 616410 610204 604868 600578 597300 594602 591843 588698 585460 582716 580743 579347
60258 579347 578156 576811 574981 572579 570067 568200 567329 567182 567439 568134 569273 570440 571191 571723 572678 574255
60242 574255 575791 576389 575854 574907 574550 575165 576265 577106 577500 577943 578974 580667 582774 585077 587417 589577
60226E89577J869J764J953K216K342K343K240J912J369R29R36J387K022K582K888
60211F18329K846K577K421K605K967L159L077K916K868K885K767K419J989J795
60197F55620K008K338K156J070n56j833k092j471p09m25o10q26q17p78j020j523
60181F50532j983k201k176j944j515j089j016j373j722j605j197j151j694k160
60167F27706j768o97ql82j254j544r46j04M61R28J559K030J880J306R86J177J526
60150F32856J774K073K532K861K812K624K690L008L270L385L536L791L982M035
60136F75229M147M519N118N746O198O266N764M771L695K888K223J264j19j468
60122G26241k178k095j618j272j285j455j401r52l79j78n14r88j083p48m18m64
$$ plain form
60226 589577 591446 593210 595163 597379 599721 602064 604304 606216 607585 608514 609450 610837 612859 615441 618329
60211 618329 621175 623752 626173 628778 631745 634904 637981 640897 643765 646650 649417 651836 653825 655620
60197 655620 657628 659966 662122 663192 662636 660803 658711 657240 656531 656106 655496 654670 653853 653075 652055 650532
60181 650532 648549 646348 644172 642228 640713 639624 638608 637235 635513 633908 632711 631560 629866 627706
60167 627706 625938 625241 625233 624851 623597 622053 621107 621003 621464 622392 623951 625981 627861 629167 630153 631330 632856
60150 632856 634630 636703 639235 642096 644908 647532 650222 653230 656500 659885 663421 667212 671194 675229
60136 675229 679376 683895 689013 694759 700957 707223 712987 717758 721453 724341 726564 727828 727709 726241
60122 726241 724063 721968 720350 719078 717793 716338 714937 713985 713606 713428 712914 711926 710843 710095 709677 709213
60106G09213p99j028r00n78m94q33j154p31M74J506J404M02l24p0O63J032R29
60089G08712R57J575K528L071K705J787J361K044L194L582K855J774R64J84q31
60074G36462j645j867k088l150m829o061o367o284o334o357o092n816n964o412
60060F67196o486n648m109k806k606l382m116m107l772l866m283m275l609k809
60046F11322k249j694r20j17M98R52J187R76M17J04M70J226J647J241J34r28j084
60029F13182l08K46n29k166l047k504j633j732k765l853m558m983n138n000m856
60014E70356m972n105m915m531m188l602k396r37o9n9l94n56m24O8J060K424L637
59997E45397M204L933K958J811J361K058L260L753L106K089J622J762J920J730
$$ plain form
60106 709213 708414 707386 706486 705908 705414 704581 703427 702696 703170 704676 706080 706482 706158 706088 706751 707783 708712
60089 708712 709669 711244 713772 716843 719548 721335 722696 724740 727934 731516 734371 736145 737109 737293 736462
60074 736462 734817 732950 730862 727712 722883 716822 710455 704171 697837 691480 685388 679572 673608 667196
60060 667196 660710 655062 650953 648147 645541 642159 638043 633936 630164 626298 622015 617740 614131 611322
60046 611322 609073 607379 606459 606342 606840 607792 608979 609955 610372 610476 610946 612172 613819 615060 615194 614266 613182
60029 613182 612874 613120 612591 610425 607378 604874 603241 601509 598744 594891 590333 585350 580212 575212 570356
60014 570356 565384 560279 555364 550833 546645 543043 540647 539710 539641 539582 539188 538632 538208 538276 539336 541760 545397
59997 545397 549601 553534 556492 558303 559664 561722 564982 568735 571841 573930 575552 577314 579234 580964
59983E80964J347J055Q87O28J03n79j117j357j369j239r56o72p50j234j592j341
59967E72778p55m57m99l12L99J213J564J401J151J290J998K899L256K680J693
59952E90299J159J203J118M44m07q09p69p87j119j558j738j470r06m72n58j110
59936E82520j714k108k391k630k618k232j769j578j605j506j172p80m51j22K37
59921E60081N21P13R35J197J193O64q6k20P82K396L415L227K447K136K553L062
59905E85016L140K994L065L289L170K511J785J670K287L003L131K737K552L001
59891F23351L676L948L784L592L490L240K821K532K455K317K040J963K296K745
59877F64250K945K970L151L520L723L374K345Q65n86j585k059k189k072j756j524
$$ plain form
59983 580964 582311 583366 584253 584881 584984 584405 583288 581931 580562 579323 578367 577695 576945 575711 574119 572778
59967 572778 572023 571566 571067 570755 571154 572367 573931 575332 576483 577773 579771 582670 585926 588606 590299
59952 590299 591458 592661 593779 594223 593816 593007 592238 591451 590332 588774 587036 585566 584660 584188 583630 582520
59936 582520 580806 578698 576307 573677 571059 568827 567058 565480 563875 562369 561197 560417 559966 559844 560081
59921 560081 560602 561315 562250 563447 564640 565304 565218 564998 565780 568176 571591 574818 577265 579401 581954 585016
59905 585016 588156 591150 594215 597504 600674 603185 604970 606640 608927 611930 615061 617798 620350 623351
59891 623351 627027 630975 634759 638351 641841 645081 647902 650434 652889 655206 657246 659209 661505 664250
59877 664250 667195 670165 673316 676836 680559 683933 686278 687143 686557 684972 682913 680724 678652 676896 675372
59862F75372j704k126k290k187k459l345m016l486j924m61K22N39J179K139K837
59847F58290K893K542K358K695L399M071M569N150N970O624O415N155L545K542
59833G16218K385K386J789P01p3j20j6n85j854l178m220n304o686p974q575q448
59817F76446q132q188q689r150q902p755o339n437n046m479l430k466k198k487
59803E93748k748k724k490k087j551j121r84j019j073j307j902k631l044k953
59789E66114k484j864j401j404j777j979j712j415j607k128k452k505k569k545
59775E38272k066j229o05m39l96j93RLq5J4M18J063J725K091K079J984J991J797
59757E46433J154N20N49J103J505J693K275L309L955L676K999K621K403J879J168
$$ plain form
59862 675372 673668 671542 669252 667065 664606 661261 657245 653759 651835 651374 651596 652135 653314 655453 658290
59847 658290 661183 663725 666083 668778 672177 676248 680817 685967 691937 698561 704976 710131 713676 716218
59833 716218 718603 720989 722778 723479 723406 723286 723270 722685 720831 717653 713433 708129 701443 693469 684894 676446
59817 676446 668314 660126 651437 642287 633385 625630 619291 613854 608808 604329 600899 598433 596235 593748
59803 593748 591000 588276 585786 583699 582148 581027 580043 579024 577951 576644 574742 572111 569067 566114
59789 566114 563630 561766 560365 558961 557184 555205 553493 552078 550471 548343 545891 543386 540817 538272
59775 538272 536206 534977 534372 533933 533537 533344 533353 533356 533271 533285 533703 534766 536491 538582 540661 542645 544636 546433
59757 546433 547587 548107 548656 549759 551264 552957 555232 558541 562496 566172 569171 571792 574195 576074 577242
59742E77242P80Q34J079J394J780K058K011J656J106L97k64l95J03N84L47n04
59726E90208j258j453j063k17P14J061N19k68m04N8K96M4q0L37Q41R25P96Q88
59708E91944J082J020Q16Q59J114J209J143J346J908K291K067J577J452J740J900
59693F13468J631J294J436K104K772K776J767k4j757k487j920o70L75P82N76j52
59677F21971j245k238k586k225j575r85n20k62m40j059j822k471k975l229k953
59662E95386k097r94J7Q30J270J107N60L64R52J877K455K621K738K905K919K700
59646F15610K267J499M00o26j291j918k907l848l962l350l001l349l626l029j953
59631E86916j440j764k181k003j411j045j121j218q87k72N2k58r35j430j397q36
$$ plain form
59742 577242 578022 578856 579935 581329 583109 585167 587178 588834 589940 590337 590073 589678 589781 590365 590712 590208
59726 590208 588950 587497 586434 586217 586931 587992 588511 588243 587839 587897 588193 588237 588157 588494 589335 590260 591056 591944
59708 591944 593026 594046 594862 595721 596835 598044 599187 600533 602441 604732 606799 608376 609828 611568 613468
59693 613468 615099 616393 617829 619933 622705 625481 627248 627224 625467 622980 621060 620390 620765 621547 622123 621971
59677 621971 620726 618488 615902 613677 612102 611117 610597 610335 609895 608836 607014 604543 601568 598339 595386
59662 595386 593289 592295 592312 593142 594412 595519 596079 596443 597395 599272 601727 604348 607086 609991 612910 615610
59646 615610 617877 619376 619776 619150 617859 615941 613034 609186 605224 601874 598873 595524 591898 588869 586916
59631 586916 585476 583712 581531 579528 578117 577072 575951 574733 573846 573574 573626 573368 572433 571003 569606 568770
59615E68770n9L75J8q99j530j399r49q30r61q17l05K23O99J288J746J567Q78M52
59597E68267O43Q99O36m4p46j275j444r99j64K71o3n03l21J77J11o49j332j361
59579E62103j001p88q58j039j293j726k294k638k377j557o96k71k32k54l28o75
59563E44076j174j352j049n72p5O40J440J663J056L48L15P40R09P91R65J621K396
59546E52738L079L796M500M865M827M751M976N614O678Q037R332J0423J1746J3549
59532F48911J4839J3992J0582N999J968q98k757l531k991j485P1R75J188J046
59518F87909Q76P93O59K20n96j552k361l000l639m369n089n575n665n476n403
59503F47732n717o143o128n518m744m294m227m283m237l996l584l119k702k344
$$ plain form
59615 568770 568711 569086 569104 568205 566675 565276 564327 563497 562536 561719 561414 561637 562336 563624 565370 566937 567815 568267
59597 568267 568910 569809 570445 570401 569655 568380 566936 565937 565773 566044 565981 565478 565157 565334 565445 564796 563464 562103
59579 562103 561102 560314 559456 558417 557124 555398 553104 550466 548089 546532 545836 545565 545333 545079 544751 544076
59563 544076 542902 541550 540501 539929 539854 540494 541934 543597 544653 545001 545316 546056 546965 547756 548721 550342 552738
59546 552738 555817 559613 564113 568978 573805 578556 583532 589146 595824 603861 613193 623616 635362 648911
59532 648911 663750 677742 688324 694323 696291 695393 692636 689105 686114 684629 684700 685675 686863 687909
59518 687909 688785 689578 690237 690457 689861 688309 685948 682948 679309 674940 669851 664276 658611 653135 647732
59503 647732 642015 635872 629744 624226 619482 615188 610961 606678 602441 598445 594861 591742 589040 586696
59489E86696k059j888j669j014J14J055J192R16J215K328L489M069M266M400M286
59474F07396L799L463L842M658N076M639L569K437J849K166L073L715L646L352
59460F56680L463L831L902L692L769M495N755P273Q665R395R297R012R340J0221
59446G48790J0885J0812R944Q152N332K037p59k790m663o747q558r500r632r318
59432G43985q681p813p008o378n641m624l587k658j458K33J860K776L344M622
59418G08972P008R697J1673J2765J3542J4524J5704J6748J7379J7468J6759J4666
59406H76905J0716N308k36m616p470r156r891r433p652n084k791j625j777l043
59392H30155n423r101j3606j7442j9192j8945j7991j7055j5560j2922r768p207
$$ plain form
59489 586696 584637 582749 581080 580066 580180 581235 582427 583343 584558 586886 590375 594444 598710 603110 607396
59474 607396 611195 614658 618500 623158 628234 632873 636442 638879 640728 642894 645967 649682 653328 656680
59460 656680 660143 663974 667876 671568 675337 679832 685587 692860 701525 710920 720217 729229 738569 748790
59446 748790 759675 770487 780431 788583 793915 795952 795193 792403 787740 780993 772435 762935 753303 743985
59432 743985 735304 727491 720483 714105 708464 703840 700253 697595 696137 696370 698230 701006 704350 708972
59418 708972 715980 725677 737350 750115 763657 778181 793885 810633 828012 845480 862239 876905
59406 876905 887621 892929 892693 888077 880607 871451 861560 852127 844475 839391 836600 834975 833198 830155
59392 830155 824732 815631 802025 784583 765391 746446 728455 711400 695840 682918 673150 665943
59380F65943n560m460l802l680l601k757j103N51J610K190K475K409K179K309
59366F54703K871L214K976K765L311M373N071N081M871M911N229N740O589P916
59352G19621R543J1018J1866J1942J1598J1422J1692J2177J2539J2700J2637J2212
59340H60967J1486J0929J0773J0371Q759N877K754K92j575l345n067o480p701
59327H98040r176j0909j2178j2336j1591j0744j0278r986r518q988q768q895r004
59314G65669q832q461p951p056n633m060k970k569k458k145j481o56O2M94O61
59299G12614Q55J494K769M417N921O982P837Q983J0457J1576J1666J0923J0066
59286H06560R122P202L834r0l251n324o848p982q245p379n689l544j299L66Q73
$$ plain form
59380 665943 660383 655923 652121 648441 644840 642083 640980 641531 643141 645331 647806 650215 652394 654703
59366 654703 657574 660788 663764 666529 669840 674213 679284 684365 689236 694147 699376 705116 711705 719621
59352 719621 729164 740182 752048 763990 775588 787010 798702 810879 823418 836118 848755 860967
59340 860967 872453 883382 894155 904526 913285 919162 921916 922208 920633 917288 912221 905741 898040
59327 898040 888864 877955 865777 853441 841850 831106 820828 810842 801324 792336 783568 774673 765669
59314 765669 756837 748376 740425 733369 727736 723676 720706 718137 715679 713534 712053 711397 711459 711953 712614
59299 712614 713469 714963 717732 722149 728070 735052 742889 751872 762329 773905 785571 796494 806560
59286 806560 815682 822884 826718 826628 823377 818053 811205 803223 794978 787599 781910 778366 777067 777433 778306
59271G78306P86J500L482N549O361N912N112M574M421M588M535L307P46j874l349
59256H23956m215n857q220r738r560q584p892p342o412n469n217n382m930l522
59242G31616k018j368j448j280j84J513L006L966M651N079M760L658K750K834
59228G57535L132K167l3j806k148k019k721m032m844m915m956n356n754n783n437
59213G13030m753l795k955k723l121l747m269m503m265l616l104l147l357k976
59199F62699j887o13N18J524K163J969J099M75P84J734K542K825K776K784L073
59184F84465L530L799L721L604L740L906L677L141K793K814L002L316L881M433
59170G33822M549M533N264O823Q004P746O512N680N977O927P577P220N724L598
$$ plain form
59271 778306 779092 780592 784074 789623 795984 801896 807008 811582 816003 820591 825126 828433 829179 827305 823956
59256 823956 819741 813884 805664 795926 786366 777782 769890 762548 756136 750667 745450 740068 735138 731616
59242 731616 729598 728230 726782 725502 725318 726831 729837 733803 738454 743533 748293 751951 754701 757535
59228 757535 760667 762834 762801 760995 758847 756828 754107 750075 745231 740316 735360 730004 724250 718467 713030
59213 713030 708277 704482 701527 698804 695683 691936 687667 683164 678899 675283 672179 669032 665675 662699
59199 662699 660812 660199 660717 662241 664404 666373 667472 667947 668731 670465 673007 675832 678608 681392 684465
59184 684465 687995 691794 695515 699119 702859 706765 710442 713583 716376 719190 722192 725508 729389 733822
59170 733822 738371 742904 748168 754991 762995 770741 777253 782933 788910 795837 803414 810634 816358 819956
59156H19956J677M35l79j306k671m503o576q290r070r081r063r216q877p754o746
59141G38536o787p432p477o647n767n323m903m104l140k315j627j152j223j814
59127F78825k268j993j037L19J951L567M466M309L800M049N249O569P273P440
59113G22519P492P534P507P612Q046Q462Q126O776N008L666L041K794K485J933
59099H03001J170K99n88j473k305k813k667k077j802k248k792k651k086j981k358
59084G76629k327j742j768l143m853n438m979m643m791m761m452m739o019p316
59070G15658p503o697n864n520n373m915l940k668j671j467j910k240j984j482
59056F62424j244j179q86m97n97j326k067k213j800j215o05P9O52P67L86j40n24
$$ plain form
59156 819956 821633 822068 821689 820383 817712 813209 806633 798343 789273 780192 771129 761913 753036 745282 738536
59141 738536 731749 724317 716840 710193 704426 699103 694200 690096 686956 684641 683014 681862 680639 678825
59127 678825 676557 674564 673527 673846 675797 679364 683830 688139 691939 695988 701237 707806 715079 722519
59113 722519 730011 737545 745052 752664 760710 769172 777298 784074 789082 792748 795789 798583 801068 803001
59099 803001 804171 804470 803882 802409 800104 797291 794624 792547 790745 788497 785705 783054 780968 778987 776629
59084 776629 774302 772560 770792 767649 762796 757358 752379 747736 742945 738184 733732 728993 722974 715658
59070 715658 708155 701458 695594 690074 684701 679786 675846 673178 671507 670040 668130 665890 663906 662424
59056 662424 661180 660001 659115 658618 658021 656695 654628 652415 650615 649400 648795 648874 649526 650293 650679 650539 650015
59039F50015p67p52r3J224K369K503J944J828K482K952K474J675J711K743L971
59024F76279M847N445N837N929N900O114O450O369N735M989M440L927L327K781
59010G48369K281J601Q47N09O97R36R60J153J767K349K432K358K820L877M981
58995G77937N756O232O401O100N357M474L737L222K827K303J375N2j343k507l415
58980H18508m066m303m097l732l410k926k044r90j45N41J478K832M336N671O735
58965H14388P579Q246Q679Q706Q217P457O888O595O045M684K561K59j663k989
58951H85652l925n003o633q533r991j0771j1331j1917j2074j1439j0429r537q495
58938G65574o922n313m510m456m357l972l800m019m174m025l874l813l449k684
$$ plain form
59039 650015 649248 648496 648403 649627 651996 654499 656443 658271 660753 663705 666179 667854 669565 672308 676279
59024 676279 681126 686571 692408 698337 704237 710351 716801 723170 728905 733894 738334 742261 745588 748369
59010 748369 750650 752251 753098 753607 754304 755240 756200 757353 759120 761469 763901 766259 769079 772956 777937
58995 777937 783693 789925 796326 802426 807783 812257 815994 819216 822043 824346 825721 825773 824430 821923 818508
58980 818508 814442 810139 806042 802310 798900 795974 793930 792940 792795 793336 794814 797646 801982 807653 814388
58965 814388 821967 830213 838892 847598 855815 863272 870160 876755 882800 887484 890045 890304 888641 885652
58951 885652 881727 876724 870091 861558 851567 840796 829465 817548 805474 794035 783606 774069 765574
58938 765574 758652 753339 748829 744373 740016 736044 732244 728225 724051 720026 716152 712339 708890 706206
58924G06206k013j649j117j71N23K54o75j338j305p86K5J130K262K900K869K626
58908G09741K816L702N000O174O894P342P963Q940J0008J0894J1649J2388J2923
58895H16434J2940J2456J1952J1967J2608J3478J4123J4580J5327J6530J7612
58884I70007J7898J7467J6867J6140J4770J2616J0220P894N204J745k123n771
58872A082934r077j2168j4729j6292j6965j7334j7665j7698j7227j6380j5336
58861I12063j4225j3318j2909j2860j2667j2077j1391j0971j0809j0695j0581
58850G79560j0453j0090r240q102p302p220p485p445o999o680o723o571n669m406
58836F75175l641l454l121k386j949k333l071l491l602l577k985j538j64j59j354
$$ plain form
58924 706206 704193 702544 701427 701256 701779 702033 701358 700020 698715 697929 697954 699084 701346 704246 707115 709741
58908 709741 712557 716259 721259 727433 734327 741669 749632 758572 768580 779474 791123 803511 816434
58895 816434 829374 841830 853782 865749 878357 891835 905958 920538 935865 952395 970007
58884 970007 987905 1005372 1022239 1038379 1053149 1065765 1075985 1083879 1089083 1090828 1088705 1082934
58872 1082934 1073857 1061689 1046960 1030668 1013703 996369 978704 961006 943779 927399 912063
58861 912063 897838 884520 871611 858751 846084 834007 822616 811645 800836 790141 779560
58850 779560 769107 759017 749777 741675 734373 727153 719668 712223 705224 698544 691821 685250 679581 675175
58836 675175 671534 668080 664959 662573 660624 658291 655220 651729 648127 644550 641565 640027 639863 639704 638350
58821F38350k108j401pP43O08L04L04M35M06K59K65O44J279J685J422O19j65n96
58803F43046p74q16o84n31o05p47n22j19l91j556k524k205r95j38k1K0L97P52
58785F31587Q75J218K145L304M132M504M595M510M385M395M374L826K636J384
58771F77870N75q4j180k646l831m276m003l187k092j211q81q02m17J58J78n79
58755F53592j284j020L7Q68Q83N55P89J875L147L670L194K390K075K379K826L095
58739F79071L300L580L860M190M914O160P410P883P288O058M920M322M163L958
58725G51077L472L128L514M457N011M559L483K510J867J458J380J721K164K384
58711G92185K568K941L050K241O43r49k169l298m415n194n715o617q106r492j0162
$$ plain form
58821 638350 636242 634841 634834 635577 636185 636489 636793 637228 637634 637893 638158 638802 640081 641766 643188 643807 643642 643046
58803 643046 642272 641456 640772 640241 639636 638889 638367 638248 637857 636301 633777 631572 630577 630439 630418 630438 630835 631587
58785 631587 632462 633680 635825 639129 643261 647765 652360 656870 661255 665650 670024 673850 676486 677870
58771 677870 678445 678361 677181 674535 670704 666428 662425 659238 657146 655935 655054 654252 653835 653993 654171 653592
58755 653592 652308 651288 651325 652193 653076 653631 654420 656295 659442 663112 666306 668696 670771 673150 675976 679071
58739 679071 682371 685951 689811 694001 698915 705075 712485 720368 727656 733714 738634 742956 747119 751077
58725 751077 754549 757677 761191 765648 770659 775218 778701 781211 783078 784536 785916 787637 789801 792185
58711 792185 794753 797694 800744 802985 803628 802679 800510 797212 792797 787603 781888 775271 767165 757673 747511
58696G47511j0380j0690j1097j1305j1242j0880r993q692p695p479p540p201o711
58683F26606o715o886o150m373k849k720l561m027l435k177q89K30J255K131K713
58668E89153L095L694M809O156P040P131O778O482O274N835N009L874K521J065
58654F58916k28j209k035k825l361l506l623m034m281l691k517j784j843j908
58640F22071j251j48P56J327J760K036K117K285K690K943K602J779Q52o3q19q76
58624F40061J03J468K124J767J058P28J088K244L992N498N943N598N540O116O494
58609F89822O022N186M601L912K503P59k93m21m12r23j827k753l551m036l849
58594F94740k916j659n61K35P97J230J770K678L836M762N220N520O027O730P445
$$ plain form
58696 747511 737131 726441 715344 704039 692797 681917 671924 663232 655537 648058 640518 633317 626606
58683 626606 619891 613005 606855 602482 599633 596913 593352 589325 585890 583713 582824 583054 584309 586440 589153
58668 589153 592248 595942 600751 606907 613947 621078 627856 634338 640612 646447 651456 655330 657851 658916
58654 658916 658688 657479 655444 652619 649258 645752 642129 638095 633814 630123 627606 625822 623979 622071
58640 622071 620820 620672 621428 622755 624515 626551 628668 630953 633643 636586 639188 640967 641819 641756 640937 640061
58624 640061 640164 641632 643756 645523 646581 647309 648397 650641 654633 660131 666074 671672 677212 683328 689822
58609 689822 695844 701030 705631 709543 712046 712805 712512 712091 711679 710756 708929 706176 702625 698589 694740
58594 694740 691824 690165 689604 689839 690636 691866 693636 696314 700150 704912 710132 715652 721679 728409 735854
58579G35854Q142Q767R077Q937Q483P770O564M930L612L364M028M823N427O186
58565H25964P301Q435R287J0011J0777J1341J1382J1039J0725J0484R803Q143
58553I44692N613L123J623J110N66p71k332k960k637k666l940n758o844p008p124
58538I14687p822q901r871j0407j0287r496q593q310q568q331o826m612k968k411
58524H07284k257j687p48j3M07J009K073L174L727L640L152K375J503J184J894
58509H26717K981L080J768J03q21j219j939l002l577l248k562k275k566l076l304
58494H07060k967k261j782j899k294k317j724p32L68J288J740J827K189L145L957
58479H05598L745L027L314M998O609O658N430M305L892L627K898J787O87k07r40
$$ plain form
58579 735854 743996 752763 761840 770777 779260 787030 793594 798524 802136 805500 809528 814351 819778 825964
58565 825964 833265 841700 850987 860998 871775 883116 894498 905537 916262 926746 936549 944692
58553 944692 950305 953428 955051 956161 956727 955956 953624 950664 948027 945361 941421 935663 928819 921811 914687
58538 914687 906865 897964 888093 877686 867399 857903 849310 841000 832432 824101 817275 812663 809695 807284
58524 807284 805027 803340 802592 802579 802986 803995 806068 809242 812969 816609 819761 822136 823639 824823 826717
58509 826717 829698 832778 834546 834649 833828 832609 830670 827668 824091 820843 818281 816006 813440 810364 807060
58494 807060 804093 801832 800050 798151 795857 793540 791816 791084 791452 792740 794480 796307 798496 801641 805598
58479 805598 809343 812370 815684 820682 827291 833949 839379 843684 847576 851203 854101 855888 856575 856368 855428
58464H55428j586k093k250j881j218p90p81o79J22J537K888L631L745L561L480
58449H63114L760M288M560M122L015J655M11n47j109j196r08m97j78lJ42M67J129
58432H82225K080L076L883M398M688N026N716O603O940O232N162N070O255P494
58418I54848P531O568N677N170M363K807J121K24K13J97p51k639m489n358n278
58403I70204n017m942m637l773k793k282k025j335n4J299K288K918L255L232K933
58388I59271K636K482K396K378K540K826L040L207L553M070M405M335M080M050
58374A005269M473N305O281P013P298P387P725Q439R314J0162J0924J1410J1401
58361A112401J1106J1124J1728J2486J2785J2475J1850J1186J0551R910R218Q540
$$ plain form
58464 855428 853842 851749 849499 847618 846400 845610 844829 844150 844272 845809 848697 852328 856073 859634 863114
58449 863114 866874 871162 875722 879844 882859 884514 884925 884378 883269 882073 881165 880668 880490 880487 880629 881096 882225
58432 882225 884305 887381 891264 895662 900350 905376 911092 917695 924635 930867 936029 941099 947354 954848
58418 954848 962379 968947 974624 979794 984157 986964 988085 988309 988522 988719 987968 985329 980840 975482 970204
58403 970204 965187 960245 955608 951835 949042 946760 944735 943400 943346 944645 946933 949851 953106 956338 959271
58388 959271 961907 964389 966785 969163 971703 974529 977569 980776 984329 988399 992804 997139 1001219 1005269
58374 1005269 1009742 1015047 1021328 1028341 1035639 1043026 1050751 1059190 1068504 1078666 1089590 1101000 1112401
58361 1112401 1123507 1134631 1146359 1158845 1171630 1184105 1195955 1207141 1217692 1227602 1236820 1245360
58349A245360Q107Q132Q463Q698Q708Q822R286R792R842R492R403J0139J1605
58336A365849J3263J4717J5892J6686J6827J6263J5536J5378J5846J6273J6128
58325A538658J5639J5248J4858J4096J3069J2333J2192J2489J3079J3887J4542
58314A690090J4546J4064J3978J4855J6232J7308J7972J8705J9682K0470K0728
58303A878630K0739K1109K2026K3064K3754K4180K4811K5747K6521K6787K6852
58292B144220K7137K7472K7519K7674K8798L0962L3216L4870L6240L7742L9002
58281B494852L9531L9830M0949M3077M5311M6875M8013M9495N1651N4044N5960
58270C009588N7164N8245O0094O2833O5529O7411O9068P1890P6259Q0899Q4268
$$ plain form
58349 1245360 1253467 1261599 1270062 1278760 1287468 1296290 1305576 1315368 1325210 1334702 1344105 1354244 1365849
58336 1365849 1379112 1393829 1409721 1426407 1443234 1459497 1475033 1490411 1506257 1522530 1538658
58325 1538658 1554297 1569545 1584403 1598499 1611568 1623901 1636093 1648582 1661661 1675548 1690090
58314 1690090 1704636 1718700 1732678 1747533 1763765 1781073 1799045 1817750 1837432 1857902 1878630
58303 1878630 1899369 1920478 1942504 1965568 1989322 2013502 2038313 2064060 2090581 2117368 2144220
58292 2144220 2171357 2198829 2226348 2254022 2282820 2313782 2346998 2381868 2418108 2455850 2494852
58281 2494852 2534383 2574213 2615162 2658239 2703550 2750425 2798438 2847933 2899584 2953628 3009588
58270 3009588 3066752 3124997 3185091 3247924 3313453 3380864 3449932 3521822 3598081 3678980 3763248
58259C763248Q6112Q7395Q9085R1463R4381R7666J01149J04636J08083J11711
58249D734929J15862J20674J25986J31522J37268J43628J51077J59612J68663
58240E989221J77686J86797J96607K07500K19324K31862K45241K59671K74987
58231G988896K90907L07688L26104L46686L69290L93610M19774M48247M79401
58222A1370603N13487N50867N91973O37127O86709P41443Q02277Q70015R45215
58213A7709716J028482J120746J223532J339172J470553J620479J791487J986786
58205B9290953K211351K471845K775623L130384L545285M032447M607361N287762
58197E7353011O092000P038028Q142303R416221J0859595J2454493J4162608J5924223
$$ plain form
58259 3763248 3849360 3936755 4025840 4117303 4211684 4309350 4410499 4515135 4623218 4734929
58249 4734929 4850791 4971465 5097451 5228973 5366241 5509869 5660946 5820558 5989221
58240 5989221 6166907 6353704 6550311 6757811 6977135 7208997 7454238 7713909 7988896
58231 7988896 8279803 8587491 8913595 9260281 9629571 10023181 10442955 10891202 11370603
58222 11370603 11884090 12434957 13026930 13664057 14350766 15092209 15894486 16764501 17709716
58213 17709716 18738198 19858944 21082476 22421648 23892201 25512680 27304167 29290953
58205 29290953 31502304 33974149 36749772 39880156 43425441 47457888 52065249 57353011
58197 57353011 63445011 70483039 78625342 88041563 98901158 111355651 125518259 141442482
58189A41442482J7654203J9233082K0491961K1188825K0989057J9495043J6373387
58182B76868040J1558348N409419j315783p693862j2940188j6612432j8638812
58175B36634730j9220552j8700294j7455016j5830506j4113090j2522067j1201903
58168A27591302j0208796r508674r003526q578340q142886p650310p093846o492447
58160F0912477n874883n268144m692401m160696l679793l251172k872898k541737
58152B8570753k253832k004304j787591j598695j433864j290266j165489j057318
58144A5979394r63467q81494q09333p45640o89269o38562n91706n47704n06537
58135I605682m68473m33601m01925l73396l47696l24247l02607k82770k65210
$$ plain form
58189 141442482 159096685 178329767 198821728 220010553 240999610 260494653 276868040
58182 276868040 288426388 293835807 292520024 284826162 271885974 255273542 236634730
58175 236634730 217414178 198713884 181258868 165428362 151315272 138793205 127591302
58168 127591302 117382506 107873832 98870306 90291966 82149080 74498770 67404924 60912477
58160 60912477 55037594 49769450 45077049 40916353 37236560 33985388 31112490 28570753
58152 28570753 26316921 24312617 22525026 20926331 19492467 18202201 17036712 15979394
58144 15979394 15015927 14134433 13325100 12579460 11890191 11251629 10659923 10112219 9605682
58135 9605682 9137209 8703608 8301683 7928287 7580591 7256344 6953737 6670967 6405757
58126F405757k50504k38630k28562k18919k09129j99494j90081j80298j69919
58117D520221j59757j50677j42501j34601j27075j20465j14619j08840j03014
58108C358672r7745r3309q9288q5329q1575p8094p4607p1081o8056o5939o4386
58097B489263o2705o0625n8431n6461n4640n2473m9518m6022m2906m0848l9538
58086A925096l8192l6563l4991l3667l2481l1602l1476l2008l2400l2120l1523
58075A558073l1138l0754k9747k8041k6314k5239k4822k4495k3709k2479k1350
58064A269985k0777k0558k0090j9109j7853j6551j5214j4006j3412j3676j4396
58053A084343j4900j4905j4563j4148j3833j3623j3357j2904j2405j2089j1790
$$ plain form
58126 6405757 6155253 5916623 5688061 5469142 5260013 5060519 4870438 4690140 4520221
58117 4520221 4360464 4209787 4067286 3932685 3805610 3685145 3570526 3461686 3358672
58108 3358672 3260927 3167618 3078330 2993001 2911426 2833332 2758725 2687644 2619588 2553649 2489263
58097 2489263 2426558 2365933 2307502 2251041 2196401 2143928 2094410 2048388 2005482 1964634 1925096
58086 1925096 1886904 1850341 1815350 1781683 1749202 1717600 1686124 1654116 1621716 1589596 1558073
58075 1558073 1526935 1496181 1466434 1438393 1412079 1386840 1362018 1337523 1313814 1291335 1269985
58064 1269985 1249208 1228650 1208560 1189451 1171598 1155047 1139833 1125827 1112415 1098739 1084343
58053 1084343 1069443 1054538 1039975 1025827 1011994 998371 985014 972110 959705 947616 935826
58042I35826j1036r831q893q850r436r896r914r743r621r456r132q753q515q531
58028H04219q804r223r634j0016j0477j0957j1076j0467r237p950p204p210p625
58015F84339p779p294o542o185o218n910m906l849l521l757l832l543l253l059
58001F14691k709k299k320k778k961k367j371o13k01J21M22O64J006J513J764
57986F02562J216m3j266j847j827j643j614j817k151k419k394j998j418j003r95
57971E81343j285j516j490j432j633j896j607n62N96R95M65l87r34j095j115j091
57955E67356q50l16J34j52j404k919l661l415l061l387m027l999l043j865j139
57940E34252q52p20o45n00K2R82J878K217K148K157K355K482K442K363K119J285
$$ plain form
58042 935826 924790 914959 906066 897216 887780 877884 867970 858227 848606 839150 830018 821265 812750 804219
58028 804219 795415 786192 776558 766542 756065 745108 734032 723565 714328 706378 699174 691964 684339
58015 684339 676560 669266 662724 656539 650321 644411 639505 635656 632135 628378 624546 621003 617750 614691
58001 614691 611982 609683 607363 604585 601624 599257 597886 597273 597072 597193 597615 598279 599285 600798 602562
57986 602562 603778 603735 602469 600622 598795 597152 595538 593721 591570 589151 586757 584759 583341 582338 581343
57971 581343 580058 578542 577052 575620 573987 572091 570484 569922 570518 571513 571978 571591 570657 569562 568447 567356
57955 567356 566506 566190 566324 566172 564768 561849 558188 554773 551712 548325 544298 540299 537256 535391 534252
57940 534252 533400 532680 532035 531535 531557 532539 534417 536634 538782 540939 543294 545776 548218 550581 552700 553985
57924E53985k40j900k986l275l062k773k750l185l925m435m206l308k383j986
57910E13571k124k491k971l601m172m295l969l730l886l961l461k928l527n358
57896D63097o981p018n797m780m729n108n109m571l821l198k929l000l039k666
57882D00351k078j804j849j633r74m86o44r93q56l53j35l78o87q56j052j336j468
57865C82769j305r29m03K12O39O17L29J72J67K8k16k45m8R8L32J139K356L020
57847C88732K607J860J776K365K993L428L862M174L958L235K453J800J156O93
57833D25092Q50J564K047J643N21o75j480j770j655j461j531j901k341k752l176
57818D12975l376k886j686m25K74M17K66j78r53j719k023j822j440j127j009j216
$$ plain form
57924 553985 553745 551845 548859 545584 542522 539749 536999 533814 529889 525454 521248 517940 515557 513571
57910 513571 511447 508956 505985 502384 498212 493917 489948 486218 482332 478371 474910 471982 468455 463097
57896 463097 456116 449098 443301 438521 433792 428684 423575 419004 415183 411985 409056 406056 403017 400351
57882 400351 398273 396469 394620 392987 392013 391527 390883 389890 389034 388681 388546 388168 387481 386625 385573 384237 382769
57865 382769 381464 380535 380132 380344 380983 381600 381929 382101 382268 382296 382080 381835 381787 381885 382217 383356 385712 388732
57847 388732 391339 393199 394975 397340 400333 403761 407623 411797 415755 418990 421443 423243 424399 425092
57833 425092 425942 427506 429553 431196 431717 431042 429562 427792 426137 424676 423145 421244 418903 416151 412975
57818 412975 409599 406713 405027 404602 404876 405293 405559 405381 404428 402709 400686 398864 397424 396297 395288 394072
57802C94072j724k173k216k001j953k185k443k506k328j876j223o96n27n18m05
57787C69298m25q99j434j259m75j34p18j273p24N33J086L42q51j403j170q00q37
57770C58857j283j771j888j477p97l96o59j437k121k208j866j780k290k813k523
57755C33548j533q63j077j488j173k88K30p5p86j386j692j584r73k23J9l45o78
57738C19633n62l71o47j254j675j749j680j518j154o65k94r4L0L0j51k32J73R40
57720C08760J434J309R23P49O68J68r33k204k996k929k102j040l87m14p25o85
57704B99596k15K1n66j621k185j865j337j404j878j927j346r39j323j921j631
57689B79459k77J214K002K252K599L237L872M340M774N280N782O320P194Q705
$$ plain form
57802 394072 392348 390175 387959 385958 384005 381820 379377 376871 374543 372667 371444 370748 370221 369703 369298
57787 369298 368873 367974 366540 365281 364806 364672 363954 362681 361957 362490 363576 363918 363067 361664 360494 359694 358857
57770 358857 357574 355803 353915 352438 351641 351245 350586 349149 347028 344820 342954 341174 338884 336071 333548
57755 333548 332015 331152 330075 328587 327414 327126 327356 327281 326495 325109 323417 321833 320860 320637 320656 320311 319633
57738 319633 319071 318700 318053 316799 315124 313375 311695 310177 309023 308358 308064 307970 308000 308030 307879 307647 307820 308760
57720 308760 310194 311503 312426 313175 313843 314011 313078 310874 307878 304949 302847 301807 301420 301006 300281 299596
57704 299596 299381 299402 298836 297215 295030 293165 291828 290424 288546 286619 285273 284334 283011 281090 279459
57689 279459 279182 280396 282398 284650 287249 290486 294358 298698 303472 308752 314534 320854 328048 336753
57675C36753J0911J3699J6892K0196K3315K6263K9360L2684L5715L7807L8786
57664F22381L8680L6937L2450K4517J3572R21j1866k3241l1896l7194l9305l8855
57652E87101l6578l3343l0005k6909k3846k0741j8051j6149j4728j3227j1453
57641C42071r417p016m498k770k431k802k788k407k422k702k205q50m2o92j831
57626B97198j993j200n75o34r01q49m26K24Q16Q57J01j032j922k387k496k203
57610B82578j706j661k298k751k081o76K51L18K28N27J024J434J598J097l91k145
57594B75346k801k065j146j128j684j848j363p80o58j206k224l073l130k501j899
57579B47840j581j083k86M2o75j826k329j972j387j067j004j075j229j401j581
$$ plain form
57675 336753 347664 361363 378255 398451 421766 448029 477389 510073 545788 583595 622381
57664 622381 661061 697998 730448 754965 768537 769458 757592 734351 702455 665261 625956 587101
57652 587101 550523 517180 487175 460266 436420 415679 397628 381479 366751 353524 342071
57641 342071 332654 325638 321140 318370 315939 313137 310349 307942 305520 302818 300613 299763 299721 299029 297198
57626 297198 295205 294005 293430 292796 291895 291046 290620 290844 291660 292517 292618 291586 289664 287277 284781 282578
57610 282578 280872 279211 276913 274162 272081 271405 271656 271974 272202 272729 273753 275187 276785 277882 277491 275346
57594 275346 272545 270480 269334 268206 266522 264674 263311 262531 261873 260667 258443 255370 252240 249739 247840
57579 247840 246259 245176 244890 244932 244257 242431 240102 238130 236743 235676 234672 233597 232368 230967 229386
57564B29386j829k037j965j649j359r54L7J412K096J587Q52J004J692J745J015
57549B31033M69O12Q37N02k13o82m73M90J859K864K972K561K436K726K868K569
57533B53430K135J755J232N58P4j20k84l74l1O30Q78M17j61l15l04m83m53L08
57515B58892J469K164K080J623J177P55L35L6p3l9J46M42O03L93j42p89j394j783
57497B65895j711j228q90j184j846k198k076j966k228k591k540j879q49L6K30
57482B42975m43j502k170k102j522p20K07J001J153M89m39r49r83r24q73n67P
57465B32638M24L99J40m9j97m10m80j19M83P85N05o9n01o14m53j31J35P8k63m15
57445B31886P6J063J854J868J156K57k86k72K19J007J809K161J681O07j86k2Q17
$$ plain form
57564 229386 227557 225520 223555 221906 220547 219593 219630 221042 223138 224725 225577 226581 228273 230018 231033
57549 231033 231502 232114 232951 233453 233240 232558 232085 232575 234434 237298 240270 242831 245267 247993 250861 253430
57533 253430 255565 257320 258552 259110 259184 259064 258780 258406 258375 259005 259883 260300 260139 259824 259520 259037 258584 258892
57515 258892 260361 262525 264605 266228 267405 268160 268495 268531 268458 268419 268565 269007 269610 270003 269861 269072 267678 265895
57497 265895 264184 262956 262066 260882 259036 256838 254762 252796 250568 247977 245437 243558 242709 242745 242975
57482 242975 242532 241030 238860 236758 235236 234516 234723 235724 236877 237366 236927 235978 234995 234071 233198 232631 232638
57465 232638 233062 233461 233601 233552 233355 232945 232465 232346 232829 233614 234119 234050 233549 232935 232482 232351 232486 232564 232301 231886
57445 231886 231962 233025 234879 236747 237903 238160 237874 237602 237821 238828 240637 242798 244479 245086 244900 244878 245695
57428B45695J493J672J707J850J842J528J247J276J341J098P17N02K82k46p63
57413B61241n66M29J483J863J511Q23J64l54q01j206j300o93M56J345J453J272
57397B67120J542K093K152J570R56O05J91l56m63J88J128J739J917J714J018k2
57381B83092o48j79J162K496L149L045K518J893J163J00j140j691r51L61R04N19
57365B95793L63J049J770J660J064O70M18M6r9K99P08O06M82R61J564J530J318
57348C10202J945L126L513K802K145K282K567K312J867J810J956J851J557J379
57334C41314J329J296J211Q70N7q48j032k98P32J567K325K919K699J459J40j29
57318C55611P59K071L075L313K620J459Q02J118J961K793L599M199L910K637J559
$$ plain form
57428 245695 247188 248860 250567 252417 254259 255787 257034 258310 259651 260749 261466 261968 262250 262004 261241
57413 261241 260675 261104 262587 264450 265961 266784 266948 266594 265793 264587 263287 262594 263050 264395 265848 267120
57397 267120 268662 270755 272907 274477 275433 276038 276229 275873 275410 275598 276726 278465 280382 282096 283114 283092
57381 283092 282444 282265 283427 285923 289072 292117 294635 296528 297691 297791 296651 294960 294009 294370 295274 295793
57365 295793 296156 297205 298975 300635 301699 302369 302787 302833 302734 303033 303741 304347 304829 305790 307354 308884 310202
57348 310202 312147 315273 318786 321588 323733 326015 328582 330894 332761 334571 336527 338378 339935 341314
57334 341314 342643 343939 345150 346020 346077 345229 344197 343899 344631 346198 348523 351442 354141 355600 355740 355611
57318 355611 356370 358441 361516 364829 367449 368908 369710 370828 372789 375582 379181 383380 387290 389927 391486
57303C91486J691K357K196J257Q59J526K344K479K264K409K991L646M129M314
57289D25948M110L675L339L223L349L995N315O596O765N771M750M523M703M570
57275D90632M040L249J973K79r26q64r5J03n89j366j716k066k732l089k364q04
57259D83665N91J237J382J424J378J228J318J990K974L566L503L330L702M528
57245E15816N125N144M954N060N442N649N435N044M956N442O390P423Q210Q753
57231E98843R417J0706J2823J5331J7203J7540J6387J4753J3638J3192J2950J2518
57219G65301J1701J0261Q220O372N814O774Q323R442R820R472Q291O542N287N539
57205H77159P117Q890J0072J0802J1579J2685J4229J6251J8594K0981K3273K5486
$$ plain form
57303 391486 393177 395534 397730 398987 399846 401372 403716 406195 408459 410868 413859 417505 421634 425948
57289 425948 430058 433733 437072 440295 443644 447639 452954 459550 466315 472086 476836 481359 486062 490632
57275 490632 494672 497921 499894 500173 499247 498383 498288 498391 497802 496436 494720 492654 489922 486833 484469 483665
57259 483665 484256 485493 486875 488299 489677 490905 492223 494213 497187 500753 504256 507586 511288 515816
57245 515816 520941 526085 531039 536099 541541 547190 552625 557669 562625 568067 574457 581880 590090 598843
57231 598843 608260 618966 631789 647120 664323 681863 698250 713003 726641 739833 752783 765301
57219 765301 777002 787263 795483 801855 807669 814443 822766 832208 842028 851500 859791 866333 871620 877159
57205 877159 884276 893166 903238 914040 925619 938304 952533 968784 987378 1008359 1031632 1057118
57193A057118K7490K9016K9893L0047K9327K7654K5264K2479J9433J6424J4370
57182A328515J4215J5889J8482K1502K5149K9184L2519L4487L5861L7763M0095
57171A633661M1819M2504M2650M2659M2391M1871M1655M2170M3142M3917M3963
57160B102402M2909M0538L7052L3046K9030K5165K1499J8171J5367J3391J2796
57149B391366J3996J6629J9762K2833K5858K8595L0237L0380K9651K8827K7738
57138B665872K5737K2940K0104J7499J4694J1626R178Q365R500J2547J7814K5680
57126B861556L5713M6508N6551O5107P2165P7750Q1554Q3460Q4185Q5053Q6998
57115C636600R0193R4820J01769J12033J25617J41615J59372J79109K01317K26096
$$ plain form
57193 1057118 1084608 1113624 1143517 1173564 1202891 1230545 1255809 1278288 1297721 1314145 1328515
57182 1328515 1342730 1358619 1377101 1398603 1423752 1452936 1485455 1519942 1555803 1593566 1633661
57171 1633661 1675480 1717984 1760634 1803293 1845684 1887555 1929210 1971380 2014522 2058439 2102402
57160 2102402 2145311 2185849 2222901 2255947 2284977 2310142 2331641 2349812 2365179 2378570 2391366
57149 2391366 2405362 2421991 2441753 2464586 2490444 2519039 2549276 2579656 2609307 2638134 2665872
57138 2665872 2691609 2714549 2734653 2752152 2766846 2778472 2787650 2796015 2805515 2818062 2835876 2861556
57126 2861556 2897269 2943777 3000328 3065435 3137600 3215350 3296904 3380364 3464549 3549602 3636600
57115 3636600 3726793 3821613 3923382 4035415 4161032 4302647 4462019 4641128 4842445 5068541
57105E068541K53324K83200L16466L54326L98370M50344N11732N83640O67071
57096H887014P62941Q71687R93062J126366J270508J423331J580800J736988J884767
57087B0537464K016655K125337K203965K246360K247206K202192K107871J961254
57079C7648304J759931J503307J194307Q40126M51826M3670l67706p65018j132872
57070D1175875j459368j735920j956446k117402k218310k261842k253490k201086
57062B4972011k113918k001321j871671j732409j590060j449446j313164j182575
57054A1717447j059298r45216q41335p47497o63343n88813n23540m66368m16011
57045E466026l71714l33028k99274k69658k43633k20775k00522j82369j66188
$$ plain form
57105 5068541 5321865 5605065 5921531 6275857 6674227 7124571 7636303 8219943 8887014
57096 8887014 9649955 10521642 11514704 12641070 13911578 15334909 16915709 18652697 20537464
57087 20537464 22554119 24679456 26883421 29129781 31376987 33579179 35687050 37648304
57079 37648304 39408235 40911542 42105849 42945975 43397801 43441471 43073765 42308747 41175875
57070 41175875 39716507 37980587 36024141 33906739 31688429 29426587 27173097 24972011
57062 24972011 22858093 20856772 18985101 17252692 15662632 14213186 12900022 11717447
57054 11717447 10658149 9712933 8871598 8124101 7460758 6871945 6348405 5882037 5466026
57045 5466026 5094312 4761284 4462010 4192352 3948719 3727944 3527422 3345053 3178865
57036C178865j52037j39690j28568j18152j08266r8993r0414q2436p4804o7325
57026B118180o0001n2861m5633l7792k8997j9427r598j5R002J7211K4136K8623
57014A942828K8745K2611R619q829k9769m9722o5762p6350q1614q2768q1002p7003
57002A450984p1383o5115n9161n3885m9101m4594m0327l6273l2305k8415k4806
56991I45619k1724j9226j7129j5181j3265j1420r663p961o497n748n967o714p322
56978G97802p852r083j1301j3626j4881j4852j4238j3621j2975j2092j1024r979
56966F52278r046q209p357o277m766k802n76J615L483M854N785O408O519N505
56952F47414K923r81n439r709j3221j5435j6030j5275j3905j2500j1145r627p796
$$ plain form
57036 3178865 3026828 2887138 2758570 2640418 2532152 2433159 2342745 2260309 2185505 2118180
57026 2118180 2058179 2005318 1959685 1921893 1892896 1873469 1863871 1863856 1872858 1890069 1914205 1942828
57014 1942828 1971573 1994184 2003803 1994974 1965205 1915483 1849721 1773371 1691757 1608989 1527987 1450984
57002 1450984 1379601 1314486 1255325 1201440 1152339 1107745 1067418 1031145 998840 970425 945619
56991 945619 923895 904669 887540 872359 859094 847674 838011 830050 823553 817805 811838 805124 797802
56978 797802 789950 780867 769566 755940 741059 726207 711969 698348 685373 673281 662257 652278
56966 652278 643232 635023 627666 621389 616623 613821 613245 614860 618343 623197 628982 635390 641909 647414
56952 647414 650337 649356 643917 634208 620987 605552 589522 574247 560342 547842 536697 527070 519274
56939E19274n753l783k016j53K258N067P421Q772R661J0893J2173J2145R883N750
56925E91592P28m451r327j3384j6188j7647j7927j7401j6675j6248j5928j5024
56913D32120j3324j1496j0234r439q654p853p314o990o501n669m622l529k569
56900C33926j981j714j333o12K7K11M45J543L318M668N126N481O569Q130R371
56885C73175J0076J0541J0754J0295Q842O393L141l23k935l943l775l562l655
56872D15024l196j383J377L970N903P630R758J2414J5359J8342K1139K3534K5483
56859E55354K7092K8220K8160K5922K1015J3959O062j369p665j2740j6501j8554
56847F48955j8550j6758j3917j0526o515j785L288Q200J2977J8066K3618K9222
$$ plain form
56939 519274 513521 509738 507722 507569 509827 514894 522315 531087 540748 551641 563814 575959 585842 591592
56925 591592 592320 587869 578542 565158 548970 531323 513396 495995 479320 463072 447144 432120
56913 432120 418796 407300 397066 387627 378973 371120 363806 356816 350315 344646 340024 336495 333926
56900 333926 331945 330231 328898 328286 328313 328524 328969 330512 333830 338498 343624 349105 355674 363804 373175
56885 373175 383251 393792 404546 414841 423683 430076 433217 432894 429959 426016 422241 418679 415024
56872 415024 411828 410445 411822 415792 421695 429325 439083 451497 466856 485198 506337 529871 555354
56859 555354 582446 610666 638826 664748 685763 699722 705784 704415 696750 684010 667509 648955
56847 648955 630405 613647 599730 589204 582689 580904 584192 592392 605369 623435 647053 676275
56835F76275L4371L8802M2216M4037M3593M0253L3318K2322Q007p289k0770l0836
56823I24299l7443m1074m1998m0454l7016l2379k7060k1466j5896j0336m550J467
56811F16094P323J2687J7555K1823K4971K6474K6282K4510K0779J4422N358n454
56799H12824j6323k5443l1478l4171l4502l3761l2345k9761k5814k1292j7179
56788E10755j3634j0142o393k574J127M723Q068J0643J1919J1763J0334P720L891
56775E48200j000o420j1725j6490k0489k3389k4711k4319k2751k0793j8810j6771
56763C40532j4800j3223j2002j0654q974p428o449n809n150m737m999n513n350
56750B35444m417l674l716l926l499k616j952j554r97m39n76j484k256k096j223
$$ plain form
56835 676275 710646 749448 791664 835701 879294 919547 952865 975187 983194 975905 955135 924299
56823 924299 886856 845782 803784 763330 726314 693935 666875 645409 629513 619177 614627 616094
56811 616094 623417 636104 653659 675482 700453 726927 753209 777719 798498 812920 818278 812824
56799 812824 796501 771058 739580 705409 670907 637146 604801 575040 549226 527934 510755
56788 510755 497121 486979 480586 478012 479139 483862 491930 502573 514492 526255 536589 544309 548200
56775 548200 547200 540780 529055 512565 492076 468687 443976 419657 396906 376113 357303 340532
56763 340532 325732 312509 300507 289853 280879 273451 267002 261193 256043 251306 246307 240794 235444
56750 235444 231027 227353 223637 219711 216212 213596 211644 210090 209093 208654 208078 206594 204338 202242 201019
56735B01019m26o9j1j46n80j249j745j721j367j248j595j890j434k99O53Q36O19
56718A89347N86N57l3r59j252n28M52Q16N76K48R9J72N05Q19M67o36j446r17N67
56699A89440J649J794J666J754J505L17j382k562k692j979q41L60J270J631J460
56684A93390R75M12j2k13m04q20j228j025j35O26M79l43r16p74k72K3o1l35n63
56665A88804o50o98p97p37r7J093K058J970Q70m19j165j213p54o9N28R00J262
56648A90886J867K491K557J864Q88L14M26J013J651K082K461L125L936M090L011
56633B22662J234m9k88R7N72J040J419J399R26L79l1n19j038r85j85L94k80j785
56615B24962k580j944p86l55p69j142q43j18L53K29k69p29r67j059j010o80r2
$$ plain form
56735 201019 200593 200524 200513 200367 199787 198538 196793 195072 193705 192457 190862 188972 187538 187239 187892 188728 189347
56718 189347 189933 190490 190457 189498 188246 187718 188170 188986 189562 189810 189909 190081 190586 191405 191872 191236 189790 188873 189440
56699 189440 191089 192883 194549 196303 197808 198125 196743 194181 191489 189510 188669 189029 190299 191930 193390
56684 193390 194365 194777 194765 194552 194148 193328 192100 191075 190940 191566 192045 191702 190786 190012 189740 189763 189702 189367 188804
56665 188804 188154 187456 186659 185922 185825 186918 188976 190946 191816 191397 190232 189019 188265 188196 188724 189624 190886
56648 190886 192753 195244 197801 199665 200553 200867 201293 202306 203957 206039 208500 211625 215561 219651 222662
56633 222662 223896 223847 223559 223656 224228 225268 226687 228086 229012 229391 229360 228841 227803 226818 226633 227027 226747 224962
56615 224962 222382 220438 219652 219297 218528 217386 216543 216425 216778 217007 216738 216009 215042 213983 212973 212293 212201
56598B12201M34O75Q21J077J143N49n03j051m45Q10J510R69l81j526j838j507
56582B12938j105r16p58m17pJ91J54J34L58Q64J535K148K415K279K096K352L119
56565B27380L964M388M198L491K616K137K511L612M757N484N996O620P021O431
56551B90606M675K529R01Ll98l48K17R06J049N47K6j16l18j079j999k249j783
56534B93169j387j483j626j358j018j262k175l186l621l147j946p37k52m93p93
56519B68685p58o91q18p67l09r5q84k349l392l505l121k723k336j916j552j163
56503B42306o17k02m00j014j213o44K1qo14r99n48O33J774J874N98j115j867j361
56485B36604o08m18m52j33K66J85j52j20K28K46j68m03j13L58O36Q18J016R94
$$ plain form
56598 212201 212635 213310 214131 215208 216351 216900 216397 215346 214901 215711 217221 218190 217809 216283 214445 212938
56582 212938 211833 210917 210159 209742 209735 209926 210080 210214 210572 211436 212971 215119 217534 219813 221909 224261 227380
56565 227380 231344 235732 239930 243421 246037 248174 250685 254297 259054 264538 270534 277154 284175 290606
56551 290606 295281 297810 298711 298714 298316 297968 298185 299091 300140 300687 300713 300597 300279 299200 297201 294952 293169
56534 293169 291782 290299 288673 287315 286297 285035 282860 279674 276053 272906 270960 270223 269971 269478 268685
56519 268685 267927 267236 266418 265651 265342 265247 264363 262014 258622 255117 251996 249273 246937 245021 243469 242306
56503 242306 241689 241487 241087 240073 238860 238216 238237 238229 237615 236616 236068 236701 238475 240349 240947 239832 237965 236604
56485 236604 235996 235578 235126 234993 235259 235444 235292 235172 235400 235646 235478 235075 234962 235320 235956 236774 237790 238784
56467B38784O27L39O27J307J674J393R04Q04J087J254J094R42J079J190Q30K08
56451B54143K4M95J055J118P33K10l80r65j102l72R31J922J941J112J36k72N0
56434B60779O11Q14O55O00P53O54J08l48k82j65o88j591j883j134K9P68Q44N74
56416B61098M36P65J421J776J351M49k47n45p03o59k3J031J608J179L49J08O49
56399B70043J289J394J030P40Q66J165J128P04M57P85J240J145O38N16J027J494
56383B85661J324O84j1o70j186j106k33Q48J364J265J100J253J666K139K388K055
56367B98541J102J39j19L58R79J317J393J282R43N04K36J58K9j63o8M82J123J401
56349C09637J290J056Q18N93N55Q99J453J757J620J369J375J588J692J592J504
$$ plain form
56467 238784 239411 239750 240377 241684 243358 244751 245655 246459 247546 248800 249894 250836 251915 253105 253935 254143
56451 254143 254167 254662 255717 256835 257568 257778 257398 256433 255331 254959 255890 257812 259753 260865 261001 260729 260779
56434 260779 261390 262204 262859 263459 264212 264866 264974 264626 264344 264179 263491 261900 260017 258883 258912 259680 260524 261098
56416 261098 261534 262299 263720 265496 266847 267296 267049 266504 265801 265142 265119 266150 267758 268937 269286 269394 270043
56399 270043 271332 272726 273756 274496 275362 276527 277655 278359 278816 279601 280841 281986 282624 283140 284167 285661
56383 285661 286985 287669 287658 286988 285802 284696 284463 285311 286675 287940 289040 290293 291959 294098 296486 298541
56367 298541 299643 299782 299663 300021 301000 302317 303710 304992 305935 306439 306675 306833 306862 306699 306631 307113 308236 309637
56349 309637 310927 311983 312801 313394 313949 314848 316301 318058 319678 321047 322422 324010 325702 327294 328798
56334C28798J607J879K244K652K904K717K116J543J391J576J784J934K118K270
56320C57533K225K037J911J908K024K392K990L230K519J292Q28J666K778K803
56306C88136J750R01J187K212K888K642J885J494J925K749L106K725K233K361
56292D18194L035L569L524L045K547K425K953L936M580M218L273K898L553M521
56278D66271N121N700O802P849P667O246N059N308O578P721Q422R173J0111J0826
56264E68854J1206J1698J2472J3129J3546J4343J6033J8192K0047K1437K2728
56253G43685K4068K5441K7129K9353L1619L3203L4297L5925L8589M1642M4215
56242A109166M6032M7159M7562M7305M6614M5380M3098L9656L5619L1380K6546
$$ plain form
56334 328798 330405 332284 334528 337180 340084 342801 344917 346460 347851 349427 351211 353145 355263 357533
56320 357533 359758 361795 363706 365614 367638 370030 373020 376250 378769 380061 380889 382555 385333 388136
56306 388136 389886 390787 391974 394186 397074 399716 401601 403095 405020 407769 410875 413600 415833 418194
56292 418194 421229 424798 428322 431367 433914 436339 439292 443228 447808 452026 455299 458197 461750 466271
56278 466271 471392 477092 483894 491743 499410 505656 510715 516023 522601 530322 538744 547917 558028 568854
56264 568854 580060 591758 604230 617359 630905 645248 661281 679473 699520 720957 743685
56253 743685 767753 793194 820323 849676 881295 914498 948795 984720 1023309 1064951 1109166
56242 1109166 1155198 1202357 1249919 1297224 1343838 1389218 1432316 1471972 1507591 1538971 1565517
56231A565517K0677J4084P393P93n718j1800j7154k2064k6872l1167l4273l6259
56219A423157l7771l8963l9465l9312l9059l8785l7831l5837l3386l1305k9728
56208A021715k8268k6714k5194k3878k2755k1534j9761j7285j4656j2678j1545
56197G97447j0747r906r102q363p421o274n388m929m311l057j680j087j355j727
56183G22100j698j500j407j205n55M56J391J955K160K204K285K477K657K672K552
56168G36544K512K708L082L508L970M611N616P023Q507R467R587R314R467J0256
56154H26172J1034J1264J1408J2348J4069J5627J6473J7240J8768K0890K2697
56143I97990K3768K4562K5704K7468K9908L2891L5912L8414M0485M2666M4924
$$ plain form
56231 1565517 1586194 1600278 1607671 1608464 1602746 1590946 1573792 1551728 1524856 1493689 1459416 1423157
56219 1423157 1385386 1346423 1306958 1267646 1228587 1189802 1151971 1116134 1082748 1051443 1021715
56208 1021715 993447 966733 941539 917661 894906 873372 853611 836326 821670 808992 797447
56197 797447 786700 776794 767692 759329 751908 745634 740246 735317 731006 727949 726269 725182 723827 722100
56183 722100 720402 718902 717495 716290 715735 716191 717582 719537 721697 723901 726186 728663 731320 733992 736544
56168 736544 739056 741764 744846 748354 752324 756935 762551 769574 778081 787548 797135 806449 815916 826172
56154 826172 837206 848470 859878 872226 886295 901922 918395 935635 954403 975293 997990
56143 997990 1021758 1046320 1072024 1099492 1129400 1162291 1198203 1236617 1277102 1319768 1364692
56132A364692M6433M6722M6441M6361M6115M4654M1734L8268L5185L2516K9755
56121A818876K6680K3520K0516J7490J3908R533M958J154j691m431p724j1101
56109A911688j3789j6060j8886k2445k5802k8166k9622l0469l0537k9558k7694
56098A638660k5336k2855k0706j9327j8526j7427j5389j2656r851p261n031l557
56086A460738l006k646j328J238M098O059O831P054P485Q305R155R742J0248J1105
56072A535078J2402J3740J4719J5402J6163J7219J8449J9622K0659K1645K2647
56061A727745K3508K3891K3663K3150K2943K3406K4379K5292K5531K5004K4426
56050A992938K4750K6080K7470K8113K8356K9054L0330L1704L3195L5329L8012
$$ plain form
56132 1364692 1411125 1457847 1504288 1550649 1596764 1641418 1683152 1721420 1756605 1789121 1818876
56121 1818876 1845556 1869076 1889592 1907082 1920990 1930523 1935481 1936635 1934944 1930513 1922789 1911688
56109 1911688 1897899 1881839 1862953 1840508 1814706 1786540 1756918 1726449 1695912 1666354 1638660
56098 1638660 1613324 1590469 1569763 1550436 1531910 1514483 1499094 1486438 1476587 1469326 1464295 1460738
56086 1460738 1457732 1455086 1453758 1454996 1459094 1465153 1471984 1479038 1486523 1494828 1503983 1513725 1523973 1535078
56072 1535078 1547480 1561220 1575939 1591341 1607504 1624723 1643172 1662794 1683453 1705098 1727745
56061 1727745 1751253 1775144 1798807 1821957 1844900 1868306 1892685 1917977 1943508 1968512 1992938
56050 1992938 2017688 2043768 2071238 2099351 2127707 2156761 2187091 2218795 2251990 2287319 2325331
56039B325331M0281M1499M2072M2681M3520M4703M6625M9339N2095N4160N5724
56028B838030N7431N9438O1498O3654O6137O8756P1112P3371P6171P9668Q3215
56017C598481Q6194Q8747R1509R4932R9032J03518J08006J12269J16529J21413
56007D620630J27387J34209J41072J47463J53753J60811J69039J78063J87395
55998F019822J97054K07259K17980K29156K41212K54780K70037K86702L04470
55989H228472L23086L42308L62469L84845M10633M39656M70830N03886N39797
55980A2005982N79530O23420O71903P25853P85834Q51951R24866J006116J097116
55971A9272571J198856J313009J442317J589501J756968J948326K169160K425674
$$ plain form
56039 2325331 2365612 2407111 2449183 2491864 2535384 2580087 2626712 2676051 2728146 2782306 2838030
56028 2838030 2895461 2954899 3016397 3080051 3146188 3214944 3286056 3359427 3435598 3515266 3598481
56017 3598481 3684675 3773422 3864931 3959863 4058895 4162413 4270419 4382688 4499217 4620630
56007 4620630 4748017 4882226 5023298 5170761 5324514 5485325 5654364 5832427 6019822
55998 6019822 6216876 6424135 6642115 6871271 7112483 7367263 7637300 7924002 8228472
55989 8228472 8551558 8893866 9256335 9641180 10051813 10491469 10962299 11466185 12005982
55980 12005982 12585512 13208932 13880835 14606688 15392522 16244473 17169339 18175455 19272571
55971 19272571 20471427 21784436 23226753 24816254 26573222 28521548 30690708 33116382
55963C3116382K723803L070727L476581L954068M517643N184138N972987O904318
55955F8920647P996079R261214J0702915J2307950J4041954J5847897J7643133
55948A56721789J9311220K0688557K1544047K1556885K0327917J7480037J2852938
55941B90483390O691342l24224p265120j3260341j7742761k0527744k1743164
55934B16311378k1697026k0754625j9255428j7472694j5605337j3786188j2094136
55927I5645944j0566789r214009q030148p002065o113320n346641m685472m114589
55919D0572911l620670l192981k823166k503903k227918j988351j779446j596649
55911B0839827j436458j296333j174192j067591r73645q89895q14852p47688o87745
$$ plain form
55963 33116382 35840185 38910912 42387493 46341561 50859204 56043342 62016329 68920647
55955 68920647 76916726 86177940 96880855 109188805 123230759 139078656 156721789
55948 156721789 176033009 196721566 218265613 239822498 260150415 277630452 290483390
55941 290483390 297174732 296850508 289585388 276325047 258582286 238054542 216311378
55934 216311378 194614352 173859727 154604299 137131605 121526268 107740080 95645944
55927 95645944 85079155 75865146 67834998 60832933 54719613 49372972 44687500 40572911
55919 40572911 36952241 33759260 30936094 28432191 26204273 24215922 22436476 20839827
55911 20839827 19403369 18107036 16932844 15865253 14891608 14001713 13186861 12439173 11751428
55902A1751428o34370n86780n43892n04689m68785m36199m06537l78936l52951
55893G438289l28931l07237k87468k68794k50764k33571k17716k03535j90762
55884E149511j78563j66191j53683j41548j29916j18505j07432r7400q8818q1358
55874C886097p4765o9656o7103o7587p0823p6224q3082r0383r6913j01737j04372
55863B983452j04688j02958r9915r6332r2379q7668q2157p6637p1958o7963o3760
55852B037037n9136n5022n2200n0054m7394m4178m1583m0325l9774l9011l7863
55841A530497l6434l4497l2100l0144k9410k9397k8991k7998k7032k6096k4483
55830A203915k2195k0336j9673j9642j9328j8675j8126j7684j7052j6261j5611
$$ plain form
55902 11751428 11117058 10530278 9986386 9481697 9012912 8576713 8170176 7791240 7438289
55893 7438289 7109358 6802121 6514653 6245859 5995095 5761524 5543808 5340273 5149511
55884 5149511 4970948 4804757 4651074 4509526 4379610 4261105 4153673 4056273 3967455 3886097
55874 3886097 3811332 3741676 3674573 3606986 3536163 3459939 3376857 3286474 3189561 3087824 2983452
55863 2983452 2878764 2775806 2675891 2579559 2487180 2399512 2317355 2240718 2168760 2100797 2037037
55852 2037037 1977901 1922879 1870679 1820625 1773231 1729053 1687470 1647145 1607371 1568360 1530497
55841 1530497 1494063 1459566 1427466 1397322 1367912 1338515 1309524 1281526 1254494 1228398 1203915
55830 1203915 1181720 1161384 1141711 1122069 1102741 1084066 1065940 1048256 1031204 1014943 999332
55819I99332j5180j4889j4836j5102j5403j5369j4975j4389j3556j2358j1035
55808H42240j0023r440r039q565p797o469m623l013k639l595m822n214m790m483
55794G57728m924n813o493o826p210p914q733r367r775r956r618q498o920n709
55780F49972n478o292p847r597j0713j0557r378q149p445o906o025m994m276l786
55766E48529l114k373k207k948m245n536o441o756o504o101n999o088n881n379
55752D78957n176n535n882n669n257n405o138o777o923o804o613o135n349m851
55738C96443n118n660n455m287l171l104l787l983l103j970j758k525l292l404
55724C45826l249l455l955m313m546m949n298m971l962l074k824k746k237j537
$$ plain form
55819 999332 984152 969263 954427 939325 923922 908553 893578 879189 865633 853275 842240
55808 842240 832217 822777 813738 805173 797376 790907 786284 783271 780632 777037 772215 767001 762211 757728
55794 757728 752804 746991 740498 733672 726462 718548 709815 700448 690673 680717 671099 662601 655681 649972
55780 649972 644494 638202 630355 620758 610045 599488 590110 581961 574516 567610 561585 556591 552315 548529
55766 548529 545415 543042 540835 537887 533642 528106 521665 514909 508405 502304 496305 490217 484336 478957
55752 478957 473781 468246 462364 456695 451438 446033 439895 433118 426195 419391 412778 406643 401294 396443
55738 396443 391325 385665 380210 375923 372752 369648 365861 361878 358775 356805 355047 352522 349230 345826
55724 345826 342577 339122 335167 330854 326308 321359 316061 311090 307128 304054 301230 298484 296247 294710
55710B94710j281j425j315o68J71R28J713K458K696K095Q98m08j550k434l064
55695B93524l667m568n732o599o628n769m328k645j073j4L00o4q52j650j880j183
55679B47172K4Q50R72R30J188J415J037J11q15j374j569j602j827k503l235l149
55663B37625k061r81q84j431j579j054m19j1L41O84Q83J129J670K096J741Q23
55647B38572K46J62k55j369k371k567k475k929l692l832l125k297k007k196k458
55632B07407k620k768k899k787k254j605j488k095k727k651k091j756j609j006
55618A77051p5J51o97j669j939j922k225k355j547k99J13n63j248j096m92k96
55602A60892p30j313j437r52l28k42p59j215j150r76j255j744j781j369j096j131
$$ plain form
55710 294710 293429 292004 290689 290021 290192 291120 292833 295291 297987 300082 300980 300572 299022 296588 293524
55695 293524 289857 285289 279557 272958 266330 260561 256233 253588 252515 252501 252801 252737 251885 250235 248355 247172
55679 247172 247196 248046 249018 249948 251136 252551 253588 253699 252884 251510 249941 248339 246512 244009 240774 237625
55663 237625 235564 234583 233699 232268 230689 229635 229216 229205 229546 230230 231113 232242 233912 236008 237749 238572
55647 238572 238818 238980 238725 237356 234985 232418 229943 227014 223322 219490 216365 214068 212061 209865 207407
55632 207407 204787 202019 199120 196333 194079 192474 190986 188891 186164 183513 181422 179666 178057 177051
55618 177051 176976 177127 176430 174761 172822 170900 168675 166320 164773 164474 164587 164024 162776 161680 161188 160892
55602 160892 160162 158849 157412 156460 156132 155890 155131 153916 152766 151790 150535 148791 147010 145641 144545 143414
55586A43414j085q50p79r72j092j054j160j456j591j513j590j796j498n21L21
55571A26778K93j90k13L12O60M24m4k67j26L15R05J242R21J05m84m53k81n98j221
55552A28078j339o40K13M05j04p74j273j610j645j079n8P24P97M71K88L25L63
55535A23142L71L23n3q17j276p15L90P50k1q13n72K38L62n17j489j759j475j148
55517A14921p98j46O91J130Q11L6n96q44r09r27o84J4Q52J169O01n65j637k031
55499A11088j614p65o9J20j05m62q39j252j606j740j645j430j142p61l71j29j03
55482I7175k55n04o12k52N72J284J267O49J44K20P03J220J530J388O09m98j145
55465A03495q30J21R52J216R10K44m32p00m25k1m5n35r44p69o5P07J212J475J585
$$ plain form
55586 143414 142329 141479 140700 139728 138636 137582 136422 134966 133375 131862 130272 128476 126978 126457 126778
55571 126778 127071 126881 126668 126980 127640 128064 128020 127753 127627 127942 128847 130089 131010 131115 130631 130178 129897 129299 128078
55552 128078 126739 126099 126312 126717 126613 125839 124566 122956 121311 120232 120174 120898 121695 122166 122454 122779 123142
55535 123142 123513 123836 123783 122966 121690 120975 121365 122115 122094 121281 120709 120947 121309 120792 119303 117544 116069 114921
55517 114921 114123 113977 114668 115798 116609 116645 116049 115205 114296 113369 112685 112699 113551 114720 115321 114756 113119 111088
55499 111088 109474 108709 108640 108760 108655 108193 107354 106102 104496 102756 101111 99681 98539 97778 97407 97278 97175
55482 97175 96920 96416 95804 95552 96124 97408 98675 99324 99468 99688 100391 101611 103141 104529 105138 104640 103495
55465 103495 102665 102786 103738 104954 105864 106108 105676 104976 104551 104530 104485 103950 103006 102237 102172 102879 104091 105566 107151
55446A07151J338M28r29j929j941j169l16K30N23O00M81M92R74J573J487O36m1
55429A09588J68P26N89m33j582k189k220j947j506q80J0J135K104K318J679R16
55413A08476P79J110J168P49M13N69R28J005P29L01j92p34j170j329j284j264
55397A10254j382j500j396r63l66J6l1k98l42l2L22L68L0n76j306j873j871j169
55379I7885k43J55k95j191j865j988j690j245p49j50M77Q52P69M15K73O14J207
55362I3231J603J597J312R20N19K66L99Q70J190R12K07k78k32l0j73n54o33j56
55344A00970N21Q42N77n2n58n34RN76O43J80l71o37n89l58l8K22J91j33m37m63
55324A00561k93j15Q0L43M34O1n45o90l5Q56J109O12J45L58Q99Q89R1q19j165
$$ plain form
55446 107151 108489 108917 107988 106059 104118 102949 102633 102863 103386 103986 104467 104959 105933 107506 108993 109629 109588
55429 109588 109756 110482 111071 110638 109056 106867 104647 102700 101194 100314 100324 101459 103563 105881 107560 108476
55413 108476 109255 110365 111533 112282 112695 113264 114192 115197 115926 116227 116035 115301 114131 112802 111518 110254
55397 110254 108872 107372 105976 105013 104647 104663 104632 104334 103992 103960 104282 104650 104680 104104 102798 100925 99054 97885
55379 97885 97642 97797 97502 96311 94446 92458 90768 89523 88774 88624 89101 89953 90722 91137 91410 92024 93231
55362 93231 94834 96431 97743 98663 99182 99448 99847 100717 101907 102819 103026 102748 102516 102486 102313 101759 101126 100970
55344 100970 101491 102333 102910 102858 102300 101766 101775 102351 102994 103174 102803 102166 101577 101219 101181 101403 101594 101461 101024 100561
55324 100561 100268 100153 100233 100576 101010 101071 100526 99836 99801 100657 101766 102378 102523 102881 103780 104669 104760 103941 102776
55305A02776j014q02o60m97m48p15j056j028o73m96n92m04M39J450J802J239K09
55288I9530p00j156j083o09K0N70Q70P70K82k32l06O0M50O74R67J382J495J093
55270A04077O66P09R05N74k82r69j081q88p56o75m66o9N09J147J448J075K65k46
55252A05943m5N88J170J502J505R99K2q99j229j022p48o07m20k04l51j035j771
55235A03398j963j664j335r82r6J321K324K086J043L70M70O84M40M0qK09K19j68
55217A06388p35j112j000m20P4o9n75n76R2N54K10l35k63K05L38J21N9J47N1J3
55197A03167N28J208J080O7q27r29o00k99J3K28r2q00r90l34K54ln24l94J48K08
55177A01109k48m35j11K02K65M59R22J207J011O12L23J03J3L97J245J827J498
$$ plain form
55305 102776 101762 100960 100300 99803 99355 98640 97584 96556 95883 95387 94795 94391 94830 96280 98082 99321 99530
55288 99530 98830 97674 96591 95982 96002 96572 97442 98212 98494 98262 97956 98016 98466 99140 100107 101489 102984 104077
55270 104077 104743 105452 106357 106931 106649 105680 104599 103711 102955 102280 101814 101745 102254 103401 104849 105924 106189 105943
55252 105943 105898 106486 107656 109158 110663 111662 111684 110785 109556 108534 107786 107179 106759 106555 106204 105169 103398
55235 103398 101435 99771 98436 97454 97358 98679 101003 103089 104132 104502 104972 105656 106096 106136 106128 106337 106556 106388
55217 106388 105653 104541 103541 103121 103195 103126 102551 101975 102067 102621 102831 102496 102233 102438 102776 102897 102956 103103 103154 103167
55197 103167 103695 104903 105983 106050 105223 104294 103694 103395 103408 103636 103544 102744 101754 101420 101674 101671 101147 100753 100901 101109
55177 101109 100861 100426 100315 100517 100782 101241 102163 103370 104381 104993 105316 105419 105432 105829 107074 108901 110399
55160A10399N79m5k3K41L14K39K01J76Q4L2J10J22j48m72l47K76Q09P32K35r8
55140A13416o8K4j54o34j206j508j175k93M24L50k50n70m34m70j040j579j384
55123A03449n83J28L74L64M68Q85J548K059J952J258N65L41M12L88J89j36p00
55106A12961j435j725j039K61J219J313P79M9n45o18Q4J154J739J498R26O11N56
55089A17788M83L93M62O48P04M86J2n77r80q44j63N27O36J24n08p89o37k05L26
55070A17886P71R64Q87P38P21Q10P58L09n45j425j725j119o6M14k75j555k217
55053A15331j721o51J85O41R81J173R87O24O28J082J394J069L49j23p8J29o7q17
55035A21116j586j577o41M36Q19N88L46J65l11q15m92P10J558J002n01j697j999
$$ plain form
55160 110399 110978 110933 110910 111151 111465 111704 111905 112081 112165 112197 112307 112429 112281 111809 111462 111738 112547 113279 113514 113416
55140 113416 113348 113372 113218 112584 111378 109870 108695 108402 108826 109176 108926 108356 107922 107452 106412 104833 103449
55123 103449 102866 102994 103368 103732 104200 105085 106633 108692 110644 111902 112467 112808 113220 113608 113797 113661 112961
55106 112961 111526 109801 108762 109023 110242 111555 112334 112383 111838 111220 111304 112458 114197 115695 116621 117232 117788
55089 117788 118271 118664 119126 119774 120478 120964 120976 120399 119419 118575 118412 118939 119575 119699 119191 118402 117765 117560 117886
55070 117886 118657 119621 120508 121246 121967 122777 123535 123844 123299 121874 120149 119030 118964 119378 119103 117548 115331
55053 115331 113610 112959 113144 113785 114766 115939 116926 117550 118178 119260 120654 121723 122072 121949 121871 122000 121933 121116
55035 121116 119530 117953 117312 117748 118567 119155 119501 119666 119355 118540 118048 118758 120316 121318 120817 119120 117121
55018A17121j625q79j4N07M29J88L07N34K11o05j174j080o42k55oJ11J48L57Q14
54999A14447R91L85m73m86M29J107P84J10O4N40Q01P45R39J512J794J201M5p54
54981A24181n95K29P96M05p58j777j907j239n28l90o98p36j4J027J408P46k48
54964A19902p05n95m50l68K9P52J235J076M96l4j57L71J481K509K659J942J174
54947A31317Q74P02K13l99o56m63j06R9n8n32q28m51M05J028J229J491J980K175
54929A38020J874J713K142K633K652K664L311M200M559M597N057N692N461M270
54915A88845L265L094K993K074O12o67j737k968m107m486m107l732l873m169l974
54900A67063l210k370j920j897k071k247k341k232j784j040k81K56O14R56J323
$$ plain form
55018 117121 115496 114617 114603 115110 115539 115727 116034 116568 116779 116174 115000 113920 113278 113023 113017 113128 113276 113633 114447
54999 114447 115438 115823 115350 114864 115293 116400 117184 117294 117358 117898 118699 119444 120383 121895 123689 124890 124935 124181
54981 124181 123586 123815 124611 125016 124258 122481 120574 119335 118807 118417 117719 116983 116969 117996 119404 120150 119902
54964 119902 119197 118602 118152 117784 117813 118565 119800 120876 121372 121338 121181 121552 123033 125542 128201 130143 131317
54947 131317 132191 132893 133106 132707 132051 131588 131482 131581 131523 130991 130163 129712 130117 131145 132374 133865 135845 138020
54929 138020 139894 141607 143749 146382 149034 151698 155009 159209 163768 168365 173422 179114 184575 188845
54915 188845 192110 195204 198197 200271 200883 200216 198479 195511 191404 186918 182811 179079 175206 171037 167063
54900 167063 163853 161483 159563 157666 155595 153348 151007 148775 146991 145951 145670 145926 146540 147496 148819
54885A48819J634J864J985J941J875K208L194M426N053M681L806L298L487L849
54871A92120L560K381Q96j53o76j184k001k903l623m240m866n352n541n519n282
54856A57617m560l371k332j908j754j360j017j368k197k557k094j449j154r38
54842A29558m51n9l68j350k304k564k017j078k80K98J010J841J930O01j300j981
54826A21486q24R28J846J823J508J068L34m78r28r52o53Q4J137J745J342M73J41
54809A30080M46O84N99N27M27k08j284j895j573r30o22m61n5L34L43L29Q42J566
54791A29149J668J066N70O71R27Q08N02M96P63Q40N27R6j32q2K30Q15J575K179
54773A42668K349K218K278K828L607M094M176M318M970N982O710O626N624L947
$$ plain form
54885 148819 150453 152317 154302 156243 158118 160326 163520 167946 172999 177680 181486 184784 188271 192120
54871 192120 195680 198061 198957 198804 198128 196944 194943 192040 188417 184177 179311 173959 168418 162899 157617
54856 157617 153057 149686 147354 145446 143692 142332 141315 139947 137750 135193 133099 131650 130496 129558
54842 129558 129107 129048 128680 127330 125026 122462 120445 119367 119087 119385 120395 122236 124166 124767 123467 121486
54826 121486 120662 121590 123436 125259 126767 127835 128169 127691 126763 125811 125158 125242 126379 128124 129466 129939 130080
54809 130080 130526 131210 131809 132336 132763 132555 131271 129376 127803 126873 126251 125790 125735 126069 126412 126741 127583 129149
54791 129149 130817 131883 132453 133124 134051 134859 135361 135857 136620 137460 137987 138083 137951 137869 138099 138914 140489 142668
54773 142668 145017 147235 149513 152341 155948 160042 164218 168536 173506 179488 186198 192824 198448 202395
54759B02395K103P32J69nn71j763l003l739m082m374m516m263l819l593l464k983
54743A65224k226j790j791j620r61m18n74j004q08J34J137J710J946K013J892
54728A62864J740J936K575L288L742M003M237M360M173L706L169K731K388J942
54714B06854J163L8j135k080k836l556m175m615n050n569n719m931l498k472k432
54699A59987k800k660j805p83k09k97p74j046p71l53n73j519k432k680k388j835
54683A37062r42K00R37Q30L41P5k15j015j855j723o49K01J60r6K50R48J221R04
54665A36634M29J7m81j051j368j227p89l50p6K1N2J68M30O74O43K73j53j49N46
54646A34243J603K195J699L38r88j537j275o61j23J27J8l97q66j025o74MN56O61
$$ plain form
54759 202395 204498 205230 205399 205394 204823 203060 200057 196318 192236 187862 183346 179083 175264 171671 168207 165224
54743 165224 162998 161208 159417 157797 156836 156418 155844 154840 154032 154166 155303 157013 158959 160972 162864
54728 162864 164604 166540 169115 172403 176145 180148 184385 188745 192918 196624 199793 202524 204912 206854
54714 206854 208017 208055 206920 204840 202004 198448 194273 189658 184608 179039 173320 168389 164891 162419 159987
54699 159987 157187 154527 152722 151939 151730 151433 150659 149613 148842 148489 147916 146397 143965 141285 138897 137062
54683 137062 136120 136320 137257 138087 138428 138503 138288 137273 135418 133695 133046 133247 133407 133311 133561 134509 135730 136634
54665 136634 137063 137080 136599 135548 134180 132953 132164 131814 131738 131759 131811 131979 132409 133083 133726 133999 133846 133697 134243
54646 134243 135846 138041 139740 140078 139090 137553 136278 135617 135494 135621 135639 135242 134376 133351 132677 132681 133237 133898
54628A33898M22J92J35J15J8m0M6J85K83M40O64O71K73k05k88k9J23j3k18l73
54608A36299n27m58J96J190J608R87M9j79L31O98L66k52m47j23J60j30r02j557
54590A37309j581j010k85K69O50R24J009Q71O91O34N60J85n04j130j327j155j027
54573A35083j167j247p71J38O70L34k81k17N52J124R99O93P68R23N87p1l19J47
54555A37945Q97J377J328O62n18j687k160j788j134p83p23n42n9M59O55M42N5
54538A34426j71l8M34J053J569J803J735J421Q68P5p20j093q84m73l14l49k02
54521A39140K25P29J261J818J962J192j18q47n40K1J2l64n25m86m45q6P32J182
54503A44863M64p03q45J08O64K2p92n43M48R47M96l21q01o46J07J050J508J168
$$ plain form
54628 133898 134320 134512 134647 134762 134780 134740 134786 134971 135254 135694 136358 137029 137302 137097 136809 136780 136903 136890 136672 136299
54608 136299 135772 135314 135510 136700 138308 139295 139344 139165 139496 140194 140560 140308 139861 139738 139898 139768 138866 137309
54590 137309 135728 134718 134433 134702 135352 136276 137285 138156 138847 139481 140041 140226 139722 138592 137265 136110 135083
54573 135083 133916 132669 131898 132036 132706 133040 132759 132542 133094 134218 135217 135910 136678 137601 138188 138117 137798 137945
54555 137945 138842 140219 141547 142209 141691 140004 137844 136056 134922 134139 133416 132874 132815 133274 133929 134371 134426
54538 134426 134255 134217 134651 135704 137273 139076 140811 142232 143100 143175 142455 141362 140478 140005 139691 139342 139140
54521 139140 139365 140094 141355 143173 145135 146327 146209 145362 144822 144843 144855 144491 143966 143480 143035 142949 143681 144863
54503 144863 145327 144624 143779 143887 144551 144573 143781 143238 143686 144633 145129 144808 144007 143361 143468 144518 146026 147194
54485A47194M59r8n99j331k005j937j007J23P23O24J15l95n52k01N20J202J392
54468A44227Q84om97o9Q34J160M96m03n80L5P81J122R80N40J43J52M82M99j82
54449A50598j047j305r59o90p59o84n8Q39J404J327O88j80q04p91j71O08R92O45
54431A49653l60j437j785j151r9O69J068J280J076K01q02r85k93L41M12N29J254
54414A49571K031J875P64l46o88l79o9k26p06q08J8J353J981J270nm84K26J270
54396A56648J658J243O50N57J021J407J022j6q27q04k96K3J38M95J121J481J168
54379A66689K91q20j805k217j794r15l38l06l75j40K51N10O66Q22Q47O42L87K37
54361A62632N5k35k77K30R40J211R68O63L90k54j286j954j650p82k02r7o2l4l57
$$ plain form
54485 147194 147653 147555 146956 145625 143620 141683 140676 140799 141522 142146 142261 141866 141314 141113 141633 142835 144227
54468 144227 145111 145105 144608 144539 145373 146533 147029 146626 146046 146081 146862 147984 148964 149504 149647 149799 150281 150780 150598
54449 150598 149551 148246 147287 146597 145838 145154 145096 145935 147339 148666 149354 149174 148370 147579 147408 148016 149008 149653
54431 149653 149293 147856 146071 144920 144821 145490 146558 147838 148914 149115 148313 147328 147035 147376 147788 148317 149571
54414 149571 151602 153477 154241 153895 153207 152828 152759 152533 151827 151019 151037 152390 154371 155641 155636 155152 155378 156648
54396 156648 158306 159549 160199 160756 161777 163184 164206 164190 163363 162559 162263 162286 162424 162919 164040 165521 166689
54379 166689 166980 166160 164355 162138 160344 159429 159091 158785 158410 158270 158521 159031 159697 160519 161366 162008 162395 162632
54361 162632 162687 162452 162175 162405 163345 164556 165524 166187 166577 166323 165037 163083 161433 160651 160449 160352 160290 160256 159899
54342A59899r20j022m83j05n46j195r32L03J438J664J203O67L24J98K71L23N3
54325A61140l61l76M2J91l27r21q97m91l40l18K10J198J840J760J496J568J757
54308A67171J688J523J597J694J229J13r66j231o79j25l58j252j920j808j346
54293A65330j253j514j547j176p77m89mO58Q85M09q5J61Q63J039L15o98j221j029
54275A59867l58M87J210J488J119K67m85m46M97J497J411O7j416j840j223n49
54259A61593m26n01j79N73J249J420J096O08J97k32q59j434j319k91R58J494J191
54242A65138O95L72j42j185k319k713k075q84J33N54L72j25n17n37l01j86l95
54225A55885o45m13M67J439J653Q32k88o43L1Q28O65m38j355j187l74j02p22j308
$$ plain form
54342 159899 158979 157957 157474 157369 156823 155628 154696 154999 156437 158101 159304 159971 160295 160493 160764 161087 161140
54325 161140 160779 160403 160445 160636 160309 159388 158491 158000 157660 157342 157552 158750 160590 162350 163846 165414 167171
54308 167171 168859 170382 171979 173673 174902 175015 174049 172818 172139 172014 171656 170404 168484 166676 165330
54293 165330 164077 162563 161016 159840 159063 158574 158570 159228 160113 160522 160437 160598 161461 162500 162815 162117 160896 159867
54275 159867 159509 159996 161206 162694 163813 164080 163595 163149 163646 165143 166554 166621 165205 163365 162142 161593
54259 161593 161167 160666 160487 161060 162309 163729 164825 165433 165630 165398 164539 163105 161786 161495 162453 163947 165138
54242 165138 165833 166205 166063 164878 162559 159846 157771 156887 157020 157574 157946 157821 157304 156767 156466 156280 155885
54225 155885 155240 154827 155294 156733 158386 159218 158930 158287 158318 159146 159811 159373 158018 156831 156457 156355 155633 154325
54207A54325r25Q8O43L58j07j53M2J27K25N19P15M63Lj50L6K11L33N98Q15N37
54187A58703n1j34N37J051M74p93j423p92L29P56J75p02j005n35J47L34j06o06
54169A56359n48N0N59M63o3l80j04M63O92K91l81p34n47j73j16m54p07l54M76
54150A54792J005O33l04q81o74j53J20K33N45R60J049P49M39L24K24O0J44O84
54132A59949J377J693J477J052Q01P42M96l09j467k175j823p32J86M93N35P09
54116A63004Q80P73M93K68J8l80o50m10J54L92Q4j83K00J011J426J059M18K14
54098A68771M51M73q2p56q51k88L85P01O77N66N17N47N41L15j03k91P0N64M26
54079A72633l25p52k43O60J081R37P30O41M79K84K83L67K54J92P14J624J920J106
$$ plain form
54207 154325 153400 153488 154131 154489 154382 154229 154271 154398 154623 155142 155857 156320 156323 156173 156209 156420 156753 157351 158166 158703
54187 158703 158652 158518 159055 160106 160580 159787 158364 157572 157901 158657 158832 158130 157125 156590 156737 157071 156965 156359
54169 156359 155811 155861 156420 156883 156820 156440 156336 156799 157491 157782 157401 156667 156120 155947 155831 155377 154670 154316 154792
54150 154792 155797 156430 156126 155245 154571 154418 154538 154771 155316 156276 157325 158074 158513 158837 159061 159121 159265 159949
54132 159949 161326 163019 164496 165548 166349 167091 167587 167278 165811 163636 161813 161081 161267 161760 162295 163004
54116 163004 163884 164657 165150 165418 165436 165056 164406 163996 164150 164542 164626 164443 164643 165654 167080 168139 168557 168771
54098 168771 169222 169695 169613 168857 168006 167718 168103 168804 169481 170047 170564 171111 171652 171967 171864 171573 171643 172207 172633
54079 172633 172308 171556 171313 171973 173054 173991 174721 175362 175841 176125 176408 176775 177029 177221 177935 179559 181479 182585
54061A82585p8n90l40K6J84L82P61J103J340J753K431K917K727K014J367J115
54045A99697J166J392J774K042J797J200J141K174L638M407M318M135M173L917
54031B36971L221K937L715M870N294M953M629M563M340L950L879M087L904L220
54017B94533K761K789K484J340K73M10J338J629Q00k58q17j220j970k733k809
54002B98550k140j402j243j725k322k340j569o20l27p16r64n75j12k95q47q94
53986B80459l81k26r50j866k079j748j699k063k106j506j032j564k788l518l163
53971B53770k363k099k571l217l527l481l269k961k578k268k134j958j286K4J474
53956B21556K310K211J475N49l30r35q69k0J026J529J548J851K668L161K544J325
$$ plain form
54061 182585 182507 181917 181577 181603 181787 182169 182930 184033 185373 187126 189557 192474 195201 197215 198582 199697
54045 199697 200863 202255 204029 206071 207868 209068 210209 212383 216021 220428 224746 228881 233054 236971
54031 236971 240192 243129 246844 251714 257008 261961 266590 271153 275493 279443 283322 287409 291313 294533
54017 294533 297294 300083 302567 303907 304180 304590 305928 307557 308357 308099 307282 306062 304092 301359 298550
54002 298550 296410 295008 293765 292040 289718 287378 285809 285189 284862 284146 283182 282607 282495 282200 281353 280459
53986 280459 280078 279852 278902 277036 274957 273209 271510 269447 267341 265835 264803 263239 260451 256933 253770
53971 253770 251407 249308 246737 243520 239993 236512 233243 230282 227704 225436 223302 221344 220058 220082 221556
53956 221556 223866 226077 227552 228101 227771 226836 225967 225947 226973 228502 230050 231901 234569 237730 240274 241599
53940B41599P75J309K087K312K168K203K380K343K221K478L083L472L455L521
53926B75406L988M365M009L090K452K660L599M856O069O855O899O337N692N361
53912C41638N272N213N174N233N342N437N522N502N144M470L954M008M343M253
53898D10505L436K254J191L58l59j070j895k992m227n057m947m015l069k942l775
53883C83396m978n836o108o016n810n533n211m973m828m577m203m058m322m444
53869C12499l719k416j772k523l953m781m627m135l842l528k795j751r01o04q78
53854B70274j529k264k785k926k661j946p99L75P93O0j226k008j898j428j159
53839B48873j049q37n95m31r3O15J277J381J227J590K440K824K231J398J284J860
$$ plain form
53940 241599 242374 243683 245770 248082 250250 252453 254833 257176 259397 261875 264958 268430 271885 275406
53926 275406 279394 283759 287768 290858 293310 295970 299569 304425 310494 317349 324248 330585 336277 341638
53912 341638 346910 352123 357297 362530 367872 373309 378831 384333 389477 393947 397901 401909 406252 410505
53898 410505 413941 416195 417386 417744 417385 416315 414420 411428 407201 402144 397197 393182 390113 387171 383396
53883 383396 378418 372582 366474 360458 354648 349115 343904 338931 334103 329526 325323 321265 316943 312499
53869 312499 308780 306364 304592 302069 298116 293335 288708 284573 280731 277203 274408 272657 271756 271152 270274
53854 270274 268745 266481 263696 260770 258109 256163 255364 255739 256532 256592 255366 253358 251460 250032 248873
53839 248873 247824 246987 246392 245961 245868 246483 247760 249141 250368 251958 254398 257222 259453 260851 262135 263995
53823B63995K480K864L016K627J414j03r56q73m18m6K62M23J83k02L1J008J784
53806B77489J518N40k33m37k47L23J363K531L219L310L237L351L627L966M320
53791C07877M504M264L631K851J976R34K3j35O09J497J601Q07j92q18j189j678
53775C26562k147k061j362r25j651l243m401m370l801l730m164m274l682k902
53761B83849k506k527k846l513m319m528l627k176j403j854k844l297k854j997
53747B43558j292q55n14k46k43o26j259j901k335k398k026j373p20j68L90R32
53731B28924J155Q70L45kq7j04o4J76M89N14K11L8L72R83J320J148P09M07M91
53712B37895R64J535J758J411Q02N18Q32J505K122K510K691K633K249J674J259
$$ plain form
53823 263995 266475 269339 272355 274982 276396 276293 275337 274464 274046 274000 274262 274685 274868 274666 274697 275705 277489
53806 277489 279007 279547 279314 278877 278630 278953 280316 282847 286066 289376 292613 295964 299591 303557 307877
53791 307877 312381 316645 320276 323127 325103 326037 326060 325925 326534 328031 329632 330439 330247 329429 328240 326562
53775 326562 324415 322354 320992 320067 318416 315173 310772 306402 302601 298871 294707 290433 286751 283849
53761 283849 281343 278816 275970 272457 268138 263610 259983 257807 256404 254550 251706 248409 245555 243558
53747 243558 242266 241411 240897 240651 240408 239782 238523 236622 234287 231889 229863 228490 227770 227602 227992 228924
53731 228924 230079 230949 231294 231292 231205 231101 231037 231213 231702 232216 232427 232465 232837 233820 235140 236288 236997 237404 237895
53712 237895 238859 240394 242152 243563 244365 244883 245715 247220 249342 251852 254543 257176 259425 261099 262358
53697B62358J254J585K053K552K925K852K230J550J432J716J556N85m64p32l90
53682B83062k65n99q36o19l19l69o07o41n28o55j098j438j259o52j73l71j249
53665B71384k133k213j341j84M17K30l20o49m68Q3N42M66j06n56l12M10P58K77
53647B66285m67n91kO31R38J245J691J634O05n97o66M36J348J163N30N03J086
53630B75772J578J748J876K025K014J867J689J304O95M18Q89J581J775J858K695
53615B99784L907M060K820J689J980L119L691L353K896K969L511M056M019L072
53601C44926J707R71J202J622J607J574J944K059J215J72L35J691K737K449J218
53586C67429j52j294j945j847j323j151j485j658j333r81r15p35k51j06p88j677
$$ plain form
53697 262358 263612 265197 267250 269802 272727 275579 277809 279359 280791 282507 284063 284648 284184 283452 283062
53682 283062 282797 282198 281362 280743 280424 280055 279448 278807 278279 277624 276526 275088 273829 273177 273004 272633 271384
53665 271384 269251 267038 265697 265513 265930 266160 265840 265191 264723 264806 265348 265814 265708 265152 264840 265250 266008 266285
53647 266285 265818 265227 265225 265856 266794 268039 269730 271364 271969 271372 270706 271142 272490 273653 274183 274686 275772
53630 275772 277350 279098 280974 282999 285013 286880 288569 289873 290568 290986 291875 293456 295231 297089 299784
53615 299784 303691 307751 310571 312260 314240 317359 321050 324403 327299 330268 333779 337835 341854 344926
53601 344926 346633 347604 348806 350428 352035 353609 355553 357612 358827 358999 359334 361025 363762 366211 367429
53586 367429 367277 365983 364038 362191 360868 359717 358232 356574 355241 354260 353345 352610 352359 352253 351465 349788
53570C49788j849j374j015j046j122j027q62o08k34q0m75r92q26J9O28M65J51
53553C39541N54J590K399K468K035J495R41M81N53J522L059M249M494M064L624
53538C73069L441L354L334L669M521N636O622P212P259O757O146O176P176Q622
53524D52994R684J0036R909R631R467R752J0670J1962J3140J4029J4783J5437
53512E91494J5844J6072J6483J7275J8249J9125J9782K0104J9975J9661J9798
53501G93862K0629K1483K1433K0400J9214J8620J8572J8544J8202J7584J6954
53490A005497J6588J6632J6958J7265J7379J7362J7280J7027J6501J5730J4777
53479A188996J3687J2699J2159J1974J1493J0365R242Q973R172Q373N900K864
$$ plain form
53570 349788 347939 346565 345550 344504 343382 342355 341493 340885 340651 340571 340096 339104 338278 338297 338925 339390 339541
53553 339541 340095 341685 344084 346552 348587 350082 351023 351504 352057 353579 356638 360887 365381 369445 373069
53538 373069 376510 379864 383198 386867 391388 397024 403646 410858 418117 424874 431020 437196 444372 452994
53524 452994 462678 472714 482623 492254 501721 511473 522143 534105 547245 561274 576057 591494
53512 591494 607338 623410 639893 657168 675417 694542 714324 734428 754403 774064 793862
53501 793862 814491 835974 857407 877807 897021 915641 934213 952757 970959 988543 1005497
53490 1005497 1022085 1038717 1055675 1072940 1090319 1107681 1124961 1141988 1158489 1174219 1188996
53479 1188996 1202683 1215382 1227541 1239515 1251008 1261373 1270615 1279588 1288760 1297133 1303033 1305897
53467A305897P64l32j555l517n667p377q802j0374j1930j2884j3060j2978j3273
53454A204912j3992j4573j4605j4478j5042j6413j7625j7785j7269j7077j7285
53443A028768j6939j5628j4150j3288j2710j1768j0682j0068r612q305n955l660
53431H96003k486k248j963j046K94J618K857M266N950P533Q501Q863R303J0422
53417I47867J2106J3846J5431J6963J8384J9541K0569K1775K3157K4478K5736
53406A159853K7027K8078K8561K8995L0421L2982L5439L6680L7012L7505L8621
53395A521174M0149M1975M3993M5595M6135M5903M5905M6506M7056M6914M6210
53384B017515M5320M4229M2822M1300L9818L8030L5451L2129K8640K5520K2821
$$ plain form
53467 1305897 1306661 1306329 1304774 1301257 1295590 1288213 1279411 1269037 1257107 1244223 1231163 1218185 1204912
53454 1204912 1190920 1176347 1161742 1147264 1132222 1115809 1098184 1080399 1063130 1046053 1028768
53443 1028768 1011829 996201 982051 968763 956053 944285 933603 923535 913923 905618 899663 896003
53431 896003 893517 891269 889306 888260 888554 890172 893029 897295 903245 910778 919279 928142 937445 947867
53417 947867 959973 973819 989250 1006213 1024597 1044138 1064707 1086482 1109639 1134117 1159853
53406 1159853 1186880 1214958 1243519 1272514 1302935 1335917 1371356 1408036 1445048 1482553 1521174
53395 1521174 1561323 1603298 1647291 1692886 1739021 1784924 1830829 1877335 1924391 1971305 2017515
53384 2017515 2062835 2107064 2149886 2191186 2231004 2269034 2304485 2336614 2365254 2390774 2413595
53373B413595K0127J6855J2767Q282M039O2m185q756j2846j5919j8709k2414k7165
53360B365733l1995l6126l9492m2036m3431m3882m4363m5529m6844m7359m6962
53349A897714m6264m5558m4542m3006m1210l9516l8125l7240l7037l7308l7490
53338A450418l7184l6398l5177l3409l1170k8943k7123k5552k3828k1953k0315
53327A129366j9074j7897j6418j4710j3121j1811j0666r653r035r000r231r079
53315I79671q272p183o226n265l918k264p86L72J561K947M174N022N918P320Q900
53300I81971R904J0305J1007J2745J5155J7196J8275J8734J9293K0159K0886K1070
53288A176700K1054K1601K2804K3685K3195K1391J9262J7611J6444J5320J3849
$$ plain form
53373 2413595 2433722 2450577 2463344 2471626 2475665 2475727 2471542 2462786 2449940 2434021 2415312 2392898 2365733
53360 2365733 2333738 2297612 2258120 2216084 2172653 2128771 2084408 2038879 1992035 1944676 1897714
53349 1897714 1851450 1805892 1761350 1718344 1677134 1637618 1599493 1562253 1525216 1487908 1450418
53338 1450418 1413234 1376836 1341659 1308250 1277080 1248137 1221014 1195462 1171634 1149681 1129366
53327 1129366 1110292 1092395 1075977 1061267 1048146 1036335 1025669 1016016 1006981 997981 988750 979671
53315 979671 971399 964216 957990 952725 948807 946543 945757 946129 947690 950637 954811 959833 965751 973071 981971
53300 981971 991875 1002180 1013187 1025932 1041087 1058283 1076558 1095292 1114585 1134744 1155630 1176700
53288 1176700 1197754 1219355 1242159 1265844 1289039 1310430 1329692 1347303 1363747 1379067 1392916
53277A392916J1846R398O884M608K474K25k085m310o625r154j1337j2480j2981
53264A369379j4113j6264j8348j9441k0136k1426k3009k3839k3855k4025k4763
53253A140160k5415k5494k5411k5661k6036k6072k5684k5051k4341k3796k3668
53242H63531k3793k3689k3205k2581k1788k0518j9064j8439j9002j9669j9086
53231F32697j7201j5013j3241j1998j1343j1302j1355j0755r482q307p839p949
53219D96912q126q022p587p121p153p850q632q818q464q101p828p376o922o974
53205C87938p336p119o086n150n093n502n519n017m434l975l643l658m116m531
53191C16759m309l574k906k543k341k401k979l841m265l818k751j656j105j456
$$ plain form
53277 1392916 1404762 1414160 1421044 1425652 1428126 1428351 1426266 1421956 1415331 1406177 1394840 1382360 1369379
53264 1369379 1355266 1339002 1320654 1301213 1281077 1259651 1236642 1212803 1188948 1164923 1140160
53253 1140160 1114745 1089251 1063840 1038179 1012143 986071 960387 935336 910995 887199 863531
53242 863531 839738 816049 792844 770263 748475 727957 708893 690454 671452 651783 632697
53231 632697 615496 600483 587242 575244 563901 552599 541244 530489 521007 512700 504861 496912
53219 496912 488786 480764 473177 466056 458903 451053 442421 433603 425139 417038 409210 401834 394912 387938
53205 387938 380602 373483 367397 362247 357154 351652 346133 341116 336682 332707 329064 325406 321290 316759
53191 316759 312450 308876 305970 303427 301086 298685 295706 291865 287600 283782 281031 279375 278270 276814
53177B76814k478l280l137k351j791j645j331n87J18M54P25J116J143M59l44l79
53161B63506L03P48L28n93j259j422j414j537j567j036j8O72L82m22o73j81J00
53144B55917m83j234j135l53K9m14j001j066q35q40j098j200r40m62J8L76N58
53127B45837O08O23N86L17k30p39p56k06M70P18M79J65R4K6m67j252j638j215
53109B43420m12J14K94N03Q03P83K10o41j380j873k082j921j473j074r26q17m19
53092B33109K11O82O71J60o20j315j635j593j477j421j139l61N28O79k62j559
53076B24658k076j469m94l7j64k97j29O9J12L32J009J697J640P39l00q65r86r52
53058B22487q16n50l42l81n31n17k54J39N23P81Q63R42J275J716J704J008J95
$$ plain form
53177 276814 274336 271056 267919 265568 263777 262132 260801 260214 260332 260786 261511 262627 263770 264229 263885 263506
53161 263506 263809 264557 264885 264292 263033 261611 260197 258660 257093 256057 256039 256711 257093 256671 255998 255817 255917
53144 255917 255434 254200 253065 252712 252741 252327 251326 250260 249425 248585 247487 246287 245347 244885 244903 245279 245837
53127 245837 246445 247068 247654 247971 247741 247002 246246 246040 246510 247228 247707 247872 247966 247992 247525 246273 244635 243420
53109 243420 243008 243122 243416 243919 244722 245505 245715 245074 243694 241821 239739 237818 236345 235271 234345 233528 233109
53092 233109 233320 234002 234673 234833 234213 232898 231263 229670 228193 226772 225633 225272 225800 226479 226217 224658
53076 224658 222582 221113 220619 220582 220418 220121 219992 220061 220173 220505 221514 223211 224851 225590 225290 224425 223439 222487
53058 222487 221671 221121 220779 220398 219867 219350 219096 219235 219758 220539 221402 222344 223619 225335 227039 228047 228242
53041B28242l7K05J87m59j363j975k088j750j086l12L28P52R16O57n7q11j084
53024B20265r66r88j323j558j425j104o97N6J177K063K129J454M69n72j454j764
53008B15762j352p04l35j07L47Q78J104J130J288J355Q73R0k23M9K04r3l53k23
52990B19690n1j04n4K90M17m6n88n80k55j68j52K96R29J021N94M53R16J353J233
52971B25194Q42O92P34O29K71k09o56q68o27k6N10O92N70K71j75o05p71p36p48
52952B24984o39J12J332J883R97n79j440j302j125j556k054j850j104o11p04j004
52936B15340j133j202j367j328o53M52J126Q15j9m62k68jj21m05m16j31J66L27
52918B10720L42J14l62p53o58j07M70P11N71J67l24o56o44m00k24k04j15K36O69
$$ plain form
53041 228242 228205 228410 228597 228138 226775 224800 222712 220962 219876 219564 219892 220644 221560 222217 222160 221349 220265
53024 220265 219299 218311 216988 215430 214005 212901 212204 212260 213437 215500 217629 219083 219552 218980 217526 215762
53008 215762 214410 213706 213371 213264 213611 214489 215593 216723 218011 219366 220239 220329 220106 220155 220359 220266 219913 219690
52990 219690 219639 219535 219481 219771 220188 220142 219554 218974 218719 218551 218399 218695 219624 220645 221239 221692 222608 223961 225194
52971 225194 226036 226728 227462 228091 228362 228153 227497 226629 226002 225976 226486 227178 227748 228019 227844 227239 226468 225732 224984
52952 224984 224345 224457 225789 227672 228669 228090 226650 225348 224223 222667 220613 218763 217659 217048 216344 215340
52936 215340 214207 213005 211638 210310 209657 210109 211235 212050 212031 211569 211301 211300 211179 210774 210358 210227 210393 210720
52918 210720 211062 211176 210814 210061 209403 209296 209766 210477 211048 211215 210891 210235 209591 209191 208967 208763 208648 208884 209553
52899B09553Q00N17J63K09O98J188J318J262J412J712J751J491J402J691J936
52884B27103J718J236P88J43r55j947j896p69L57N83P5n13r15j195j214o74M10
52867B22335J623K491K738K333J470N49n2j91M0M27P32Q22P32N52K53k31p21q43
52849B35059n33l73j093k613l768l296j239Q52J409L35j188k224k771k990k601
52834B12966j539n27k25k50J72Q87J063O07L25N53O18M7o24p50n27m06k33K85
52816B12442P83O88K19Q4L73N59N33Q33J668K410K428J911J468J269R77L11o74
52799B28282j742k617l041k938k564k272k042j497m81N14P50P0q83j381j304r81
52783B05873o55m03l29m73n21j26N27Q96Q04N76L92P6l59m98j91J38J73J88M12
$$ plain form
52899 209553 210353 210870 211033 211242 211940 213128 214446 215708 217120 218832 220583 222074 223476 225167 227103
52884 227103 228821 230057 230845 230988 230033 228086 226190 225421 225778 226361 226436 225923 225008 223813 222599 221925 222335
52867 222335 223958 226449 229187 231520 232990 233539 233487 233296 233336 233763 234495 235317 236049 236601 236854 236623 235902 235059
52849 235059 234526 234153 233060 230447 226679 223383 222144 222996 224405 224740 223552 221328 218557 215567 212966
52834 212966 211427 210900 210675 210425 210597 211484 212547 213154 213479 214032 214650 214697 214073 213323 212796 212390 212157 212442
52816 212442 213225 213913 214132 214216 214589 215148 215681 216514 218182 220592 223020 224931 226399 227668 228645 228956 228282
52799 228282 226540 223923 220882 217944 215380 213108 211066 209569 209088 209602 210352 210422 209539 208158 206854 205873
52783 205873 205218 204815 204486 204013 203492 203366 203893 204789 205593 206169 206561 206637 206278 205780 205589 205727 205900 206088 206500
52764B06500M45q4p28p35j25M43O47P23Q08P94P73R50J077O38k87r81j039p27
52746B09092l11L13J061J444J310J158J250J030N5j008j191o41l95p43p83J12
52730B11753J229J445P50J65L60R68J284J146Q36N04M0n85j179j494j376q08r2
52713B14946J98k07p45n85K10O57K39l09j80J53l53j539k064j277p7M43L14J19
52695B09943n3l36l24M07J297J308M28k04J00O43M44l96r84r03n46l01J3P22J696
52676B12954K378K344J698R53N20L49J10k76m40o9O24J124J248J212J128Q38L18
52659B27013q8j48p6j63k77j22K15M93Q66J663K560K688J743M88k47n44r38j445
52641B33681j649j514j481j752k018j890j268k97O71J156J023P63Q80J109P88
$$ plain form
52764 206500 206945 206861 206133 205398 205273 205716 206363 207086 207894 208688 209461 210411 211488 212126 211839 210858 209819 209092
52746 209092 208781 209094 210155 211599 212909 214067 215317 216347 216402 215394 214203 213562 213167 212424 211641 211753
52730 211753 212982 214427 215177 215342 215702 216670 217954 219100 219936 220440 220480 219895 218716 217222 215846 215038 214946
52713 214946 215144 214937 214192 213607 213817 214474 214713 214404 214224 214377 214024 212485 210421 209144 209067 209510 209824 209943
52695 209943 209890 209554 209230 209637 210934 212242 212670 212466 212566 213209 213653 213257 212273 211370 210824 210523 210536 211258 212954
52676 212954 215332 217676 219374 220327 220847 221196 221306 221030 220590 220521 221145 222269 223517 224729 225857 226695 227013
52659 227013 226925 226777 226701 226538 226261 226139 226354 226847 227713 229376 231936 234624 236367 236855 236608 236064 235126 233681
52641 233681 232032 230518 229037 227285 225267 223377 222109 221812 222483 223639 224662 225425 226305 227414 228202
52626B28202l1n18k41K64L85K79L65M94J84o02j387j745j548q48Q3P17P44M54
52608B25251L80O22R00J072J209J218Q60K19l04m98n61o84p47o15l73j67M9L31
52590B28162N99P96J054J440J657J313M95j77j91K75O11M96J85R8L02N21N45M26
52572B38607L31L62N22P15P56N06O0k74k09K67Q67J157Q84J93m98r73j401j873
52554B39999k041j555p18j80r0kK78L72M6l15l00k0L14Q50J588J895J176j42j025
52535B40130j046o19j38L56O67M26j67k76M75J396J629J190O57K84k9j24K98R76
52517B46085J081J66j258k224k165j181K90J755K835L351L293K737J848R65M21
52502B57999K72K83K99L83M47O3j017k223k557j671l18M91M78J51M6K71N73O84
$$ plain form
52626 228202 228171 227653 227412 227676 228061 228340 228705 229199 229383 228781 227394 225649 224101 223253 223336 224053 224797 225251
52608 225251 225631 226253 227153 228225 229434 230652 231512 231731 231427 230929 230368 229684 228937 228322 227949 227782 227831 228162
52590 228162 228761 229557 230611 232051 233708 235021 235516 235339 235148 235423 236034 236530 236715 236813 237115 237636 238181 238607
52572 238607 238938 239300 239822 240537 241293 241799 241859 241585 241376 241643 242510 243667 244551 244744 244246 243273 241872 239999
52554 239999 237958 236403 235685 235505 235415 235413 235691 236063 236109 235794 235494 235474 235788 236638 238226 240121 241297 241155 240130
52535 240130 239084 238465 238327 238683 239350 239776 239609 239333 239808 241204 242833 244023 244680 244964 244935 244811 245109 246085
52517 246085 247166 247332 246074 243850 241685 240504 240794 242549 245384 248735 252028 254765 256613 257578 257999
52502 257999 258271 258554 258853 259236 259683 259746 258729 256506 253949 252278 251960 252451 252929 253080 253126 253397 253970 254654
52484B54654N02J46j63k94k02K02R30J624J710J122N20M75P79R32R74J226J505
52467B66642J367J050J308K170K665K072P90l58j065j360j183o89m14o17q44o43
52451B70891l31n00j172k013k901l648l588k345p37o0n03j042q21L6R16J299Q32
52434B54313l86j537j724r91j07N38J031J131L48r61j639j284p58p25o48Q8R56
52417B47645J147R47J208J860K049J636J483K060K705K670K299K494L389M100
52403B77692L916L276L249M124M982M788L556K095Q79k32j355k347l186l912m144
52388B93381l409k148j471j579j356j33J077R89pm57J0L78j7n53m18K55P75Q79
52370B86196R22J369K292L168L264K438J478J222J540J623J161O14M05M55O01
$$ plain form
52484 254654 255156 255302 255139 254845 254643 254845 255775 257399 259109 260231 260751 261226 262005 262937 263911 265137 266642
52467 266642 268009 269059 270367 272537 275202 277274 278064 277706 276641 275281 274098 273409 272995 272378 271534 270891
52451 270891 270560 270060 268888 266875 263974 260326 256738 254393 253656 253596 253093 252051 251230 251266 252182 253481 254313
52434 254313 253927 252390 250666 249675 249568 250106 251137 252268 252616 251655 250016 248732 247974 247249 246601 246689 247645
52417 247645 248792 249739 250947 252807 254856 256492 257975 260035 262740 265410 267709 270203 273592 277692
52403 277692 281608 284884 288133 292257 297239 302027 305583 307678 308557 308325 306970 304623 301437 297525 293381
52388 293381 289972 287824 286353 284774 283418 283285 284362 285351 285344 284887 284897 285275 285258 284705 284287 284542 285317 286196
52370 286196 287118 288487 290779 293947 297211 299649 301127 302349 303889 305512 306673 307287 307692 308147 308748
52355C08748Q75J183J173O64j28q26j073o00M54J351J470J148J201J622J609R58
52339C19829N80J230K470L377L667L575L215K702K529L147M316N359N875N939
52325C67810N832N956O648P742Q543Q680Q549Q541Q303P424O383O036O341O551
52311D69339O527O922P915Q690Q580P992P678P739P894Q194Q777R268R152Q652
52297E83319Q527Q908R010Q206O876N808N170M536L734L088K778K491J950J477
52283F55878J540J946J909J077O6k21M02J296J716J483R60O57Q30J347J890K291
52267F75067K632L022L447L922M539N194N481N158M616M557N196O022O425O327
52253G41605O190O495P315Q269Q858Q917Q661Q248P463O120M605L659L597L992
$$ plain form
52355 308748 309623 310806 311979 312643 312515 311689 310616 310016 310470 311821 313291 314439 315640 317262 318871 319829
52339 319829 320409 321639 324109 327486 331153 334728 337943 340645 343174 346321 350637 355996 361871 367810
52325 367810 373642 379598 386246 393988 402531 411211 419760 428301 436604 444028 450411 456447 462788 469339
52311 469339 475866 482788 490703 499393 507973 515965 523643 531382 539276 547470 556247 565515 574667 583319
52297 583319 591846 600754 609764 617970 624846 630654 635824 640360 644094 647182 649960 652451 654401 655878
52283 655878 657418 659364 661273 662350 662416 662195 662597 663893 665609 667092 668052 668709 669539 670886 672776 675067
52267 675067 677699 680721 684168 688090 692629 697823 703304 708462 713078 717635 722831 728853 735278 741605
52253 741605 747795 754290 761605 769874 778732 787649 796310 804558 812021 818141 822746 826405 830002 833994
52239H33994M179L876L288K891L114L942M790N053M742M288L807L105K380K195
52225H85644K486K398J559Q73J259K207K465J806J109P71K62n47p32M26K243L425
52209I07654L557L252L135L327L691M016M085L960M039M503M920M829M456M356
52195I63780M524M445L989L677L968M701N340N437M832L737K689K115J882J515
52181A016631Q12r1j081k117k994l544m007m658n198n065m398m001m203m462m316
52166I67308l979l697l259k581k055j769j028N09J816J625K47p05l57N86J105
52151I53766J073Q44M40k01o29k22R21J886J940J314Q59R83J241J021L87j73o02
52134I64848j295k155k289j121O60J733J586Q76O61J652L881O528Q297Q545Q030
$$ plain form
52239 833994 838173 842049 845337 848228 851342 855284 860074 865127 869869 874157 877964 881069 883449 885644
52225 885644 888130 890528 892087 892960 894219 896426 898891 900697 901806 902577 902839 902292 901560 901986 904229 907654
52209 907654 911211 914463 917598 920925 924616 928632 932717 936677 940716 945219 950139 954968 959424 963780
52195 963780 968304 972749 976738 980415 984383 989084 994424 999861 1004693 1008430 1011119 1013234 1015116 1016631
52181 1016631 1017443 1017352 1016271 1014154 1011160 1007616 1003609 998951 993753 988688 984290 980289 976086 971624 967308
52166 967308 963329 959632 956373 953792 951737 949968 948940 949449 951265 952890 953137 952432 952075 952661 953766
52151 953766 954839 955683 956123 955922 955293 955071 955992 957878 959818 961132 961991 962974 964215 965236 965623 965450 964848
52134 964848 963553 961398 959109 957988 958648 960381 961967 962843 963504 965156 969037 975565 983862 992407 1000437
52119A000437Q053Q927R814R984R669R514R702R838R489Q679P936P706P750P428
52105A124926O727O450P027P815Q122Q284Q850R336Q946Q098P912Q323Q103O858
52091A235777N548M641L214O45k024l360l299k777k323j911j687j878k325k709
52077A225532k985l097k799k195j894k071k017j232l12l0j83j03J83L07M50R92
52061A208546J653J962K205K881L550L329K403J901K276K795K781K397K023J675
52047A242377J255P38n7j281k592l502m075m670n123n034m679m671m782m177k954
52032A196773k278k631l037k535j571j276k019l200l952l652k368j073q26j468
52018A164887j871j640j597k179k489j761p41o34j367j973k239k808l968n324
$$ plain form
52119 1000437 1008490 1017417 1027231 1037215 1046884 1056398 1066100 1075938 1085427 1094106 1102042 1109748 1117498 1124926
52105 1124926 1131653 1138103 1145130 1152945 1161067 1169351 1178201 1187537 1196483 1204581 1212493 1220816 1228919 1235777
52091 1235777 1241325 1245966 1249180 1249825 1247801 1244441 1241142 1238365 1236042 1234131 1232444 1230566 1228241 1225532
52077 1225532 1222547 1219450 1216651 1214456 1212562 1210491 1208474 1207242 1206930 1206900 1206717 1206614 1206797 1207104 1207554 1208546
52061 1208546 1210199 1212161 1214366 1217247 1220797 1224126 1226529 1228430 1230706 1233501 1236282 1238679 1240702 1242377
52047 1242377 1243632 1244370 1244313 1243032 1240440 1236938 1232863 1228193 1223070 1218036 1213357 1208686 1203904 1199727 1196773
52032 1196773 1194495 1191864 1188827 1186292 1184721 1183445 1181426 1178226 1174274 1170622 1168254 1167181 1166355 1164887
52018 1164887 1163016 1161376 1159779 1157600 1155111 1153350 1152609 1151975 1150608 1148635 1146396 1143588 1139620 1134296
52004A134296o730q593j1141j3958j6387j7996j8761j9124j9646k0305k0403j9594
51992I41658j8571j8177j8212j7880j7030j6236j5794j5478j5175j4928j4461
51981G59716j3433j2246j1776j2158j2543j2292j1653j1040j0377r559q880q474
51969F25285p793o249m113k294j287p41j3J160K490L457L740L461K964K385J591
51954F24043N17o73j820k831l482l473k896k409k538k958k722j300Q25K714M020
51939F05017N285P107R158J0356J0072Q872P780P109O380N183L664K033J55k152
51925F86019m678o956q648r736j0440j1126j2007j2780j2784j1739j0213r107
51913E65805q730q620q201p318o191n048l966k919j775l82J257K905M246N098
$$ plain form
52004 1134296 1127566 1118973 1107832 1093874 1077487 1059491 1040730 1021606 1001960 981655 961252 941658
51992 941658 923087 904910 886698 868818 851788 835552 819758 804280 789105 774177 759716
51981 759716 746283 734037 722261 710103 697560 685268 673615 662575 652198 642639 633759 625285
51969 625285 617492 611243 607130 604836 603549 602808 602795 603955 606445 609902 613642 617103 620067 622452 624043
51954 624043 624560 623887 622067 619236 615754 612281 609385 606976 604438 601480 598758 597458 598283 600997 605017
51939 605017 610302 617409 626567 636923 646995 655867 663647 670756 677136 682319 685983 688016 688171 686019
51925 686019 681341 674385 665737 656001 645561 634435 622428 609648 596864 585125 574912 565805
51913 565805 557075 548455 540254 532936 526745 521697 517731 514812 513037 512655 513912 516817 521063 526161
51899E26161N370M942L728J891j70k094l693m815n336n360n288n450n750n781
51885D98355n218m019k435r96j21L81J238K757M374N514O535Q072R789J0647J0392
51870E45265R818R416Q736P467O102N030L823K246J198J617K957L812L752L560
51856F14799L743L890L647L469L921M767N113M219K018r67m160p444j0855j3751
51842F12409j4911j4035j2495j1788j1674j0884r339q329q417q507p493n774m427
51829D84336l691l038k171j264n29j48l18r66j635j947j971j850j513r68m49N3
51813D61931R04K081K794K384J210J71l75o94j006j297j631k099k515k649k623
51798D56586k725k861k657k050j417j107j174j537k067k445k206j181J68J008
$$ plain form
51899 526161 531531 536473 540201 542092 541922 539828 536135 531320 525984 520624 515336 509886 504136 498355
51885 498355 493137 489118 486683 485687 485566 485947 487185 489942 494316 499830 506365 514437 524226 534873 545265
51870 545265 555083 564499 573235 580702 586804 591834 595657 597903 599101 600718 603675 607487 611239 614799
51856 614799 618542 622432 626079 629548 633469 638236 643349 647568 649586 648619 644459 637015 626160 612409
51842 612409 597498 583463 570968 559180 547506 536622 527283 518954 510537 502030 494537 488763 484336
51829 484336 480645 477607 475436 474172 473643 473495 473177 472211 470576 468629 466658 464808 463295 462327 461878 461931
51813 461931 462835 464916 467710 470094 471304 471475 471100 470406 469400 468103 466472 464373 461858 459209 456586
51798 456586 453861 451000 448343 446293 444876 443769 442595 441058 438991 436546 434340 433159 433327 434335
51784D34335Q45J3o01n22k01l86j153j921k306k361k027r65P10K225L021L382
51768D32088L788M191M389M636N161N487M884L432J915P53l62j719k999l706l848
51753D58090l919m278m668m442l388k225j917k488k932k446j254J0J083J902K232
51738D29360K146K339L270M384M893N005N538O498P043O780O266N996N752N229
51724E00499M641M328M216M067L862L604K942J456p73k940m037l744k876k637
51710E12608l242l655l006j787j008q26p71r24j674k455k066n39N66K87m18k23
51694D90867O42J030P77P52J350K004K209K013J344j82k346l953m056l182k709
51679D86560l122l505k898j599o91n86o41k22M66Q69R60J144J560J998K472L337
$$ plain form
51784 434335 435180 435193 434592 434070 433869 433483 432330 430409 428103 425742 423715 422750 423460 425685 428706 432088
51768 432088 435876 440067 444456 449092 454253 459740 464624 468056 469971 470724 470362 468643 465644 461938 458090
51753 458090 454171 449893 445225 440783 437395 435170 433253 430765 427833 425387 424133 424143 425226 427128 429360
51738 429360 431506 433845 437115 441499 446392 451397 456935 463433 470476 477256 483522 489518 495270 500499
51724 500499 505140 509468 513684 517751 521613 525217 528159 529615 528842 525902 521865 518121 515245 512608
51710 512608 509366 505711 502705 500918 499910 499084 498313 497389 495715 493260 491194 490655 491221 491508 491090 490867
51694 490867 491509 492539 493316 494068 495418 497422 499631 501644 502988 502806 500460 496507 492451 489269 486560
51679 486560 483438 479933 477035 475436 474745 474159 473518 473296 473762 474631 475591 476735 478295 480293 482765 486102
51663D86102M774O458P848Q533Q220O804M509J860o59k746m287n422o466p404
51649E08124p594o472m480k859k392k737l149l408l905n009o607q065q695q423
51635D34329p843p398o740n370l660k643k736l340l729l751l480k871j970j085
51621C77713m59j36j81n54p70l02N74J045Q93P31Q91Q76K86n11j049j418j743
51604C75886j688j031j51N47J292K399L616M483M904N000M896N064O144P962R342
51589D28665R571R223Q934Q244O651M928M156M082L755L334L845N341O849Q117
51575E15695R900J2311J4304J5311J6030J7052J7954J8458J9381K1379K3610K4713
51563G26098K4541K4004K3689K3655K4345K6436K9737L3058L5502L7162L8226
$$ plain form
51663 486102 490876 497334 505182 513715 521935 528739 533248 535108 534449 531703 527416 521994 515528 508124
51649 508124 500530 494058 489578 486719 484327 481590 478441 475033 471128 466119 459512 451447 442752 434329
51635 434329 426486 419088 412348 406978 403318 400675 397939 394599 390870 387119 383639 380768 378798 377713
51621 377713 377254 377118 376937 376383 375613 375311 375885 376930 377823 378554 379445 380321 380607 380096 379047 377629 375886
51604 375886 374198 373167 373016 373563 374855 377254 380870 385353 390257 395257 400153 405217 411361 419323 428665
51589 428665 438236 447459 456393 464637 471288 476216 480372 484454 488209 491543 495388 500729 507578 515695
51575 515695 525595 537906 552210 567521 583551 600603 618557 637015 656396 677775 701385 726098
51563 726098 750639 774643 798332 821987 846332 872768 902505 935563 971065 1008227 1046453
51552A046453L7930L5008K9018K0832J1830K890n788j4210k2204k9467l5673m0484
51540A036135m3627m5061m4978m3626m1334l8690l6293l4181l1785k8724k5293
51529F22543k1984j8917j6116j3891j2411j1267r975q700p844p213o313n297m887
51516D77728n305n901n953n259m007k635j759j641j784j651j629k390l557m058
51502D30199l869m070m823m717k892o44K03k80o06j79J54k68j002j309j055m68
51486D04374J99N36Q3j071k170k545k248j744j316r79p65p57q95r50q49q51j178
51469C86874j528j253l03L94n1j178j587p27M03O26O4k74R5P33J066R73O84N91
51451C85602J158K529M175N250N396N051M988N658O900Q130Q902R295R657R927
$$ plain form
51552 1046453 1084383 1119391 1148409 1169241 1181071 1183961 1178173 1163963 1141759 1112292 1076619 1036135
51540 1036135 992508 947447 902469 858843 817509 778819 742526 708345 676560 647836 622543
51529 622543 600559 581642 565526 551635 539224 527957 517982 509282 501438 494225 487912 482615 477728
51516 477728 472423 466522 460569 455310 451303 448668 446909 445268 443484 441833 440204 437814 434257 430199
51502 430199 426330 422260 417437 412720 409828 409184 409387 409107 408501 408322 408476 408208 407206 405897 404842 404374
51486 404374 404573 405109 405192 404121 401951 399406 397158 395414 394098 393119 392354 391597 390702 389752 388903 388052 386874
51469 386874 385346 384093 383790 384184 384133 382955 381368 380641 381044 381670 381734 381460 381555 382288 383354 384327 385011 385602
51451 385602 386760 389289 393464 398714 404110 409161 414149 419807 426707 434837 443739 453034 462691 472618
51437D72618R583Q421O982N806M694L169J477M21J63k04j608l843n812o768p046
51422D88053p430q049q154p143n464m143l512k974k031j010m28j97M6K39O6k60
51406D37609n7R68K302L250L583L484L104K536K050K117K950M144N037N492O083
51391D84652P282Q741R849J0692J1872J3481J5006J6390J8315K1124K4217K7111
51379F68732L0418L4987M0415M5249M8539N0490N1631N1999N1217M8858M4546
51368A167081L8019K9358J9077Q061k697j2535k1432k9655l6988m2758m6756m9546
51356A019229n1463n1941n0421m7439m4105m0832l7274l3398k9734k6633k3948
51345E82041k1487j9279j7311j5485j3914j2788j2024j1348j0631r767q509o940
$$ plain form
51437 472618 482201 490622 497604 503410 508104 511273 512750 513171 513334 513130 511522 507679 501867 495099 488053
51422 488053 480623 472574 464420 457277 451813 447670 444158 441184 439153 438143 437715 437518 437564 437803 437869 437609
51406 437609 437552 438520 440822 444072 447655 451139 454243 456779 458829 460946 463896 468040 473077 478569 484652
51391 484652 491934 500675 510524 521216 533088 546569 561575 577965 596280 617404 641621 668732
51379 668732 699150 734137 774552 819801 868340 918830 970461 1022460 1073677 1122535 1167081
51368 1167081 1205100 1234458 1253535 1261596 1258899 1246364 1224932 1195277 1158289 1115531 1068775 1019229
51356 1019229 967766 915825 865404 817965 773860 733028 695754 662356 632622 605989 582041
51345 582041 560554 541275 523964 508479 494565 481777 469753 458405 447774 438007 429498 422558
51333D22558n835n819o307o064m799l451k812k620k266j673j122o75k45R5J76
51318C79141n5n03r78j273j353j343j177n34N17J273J267J039J299J743J597J044
51302C81704R98J495J518O70j24j38J7n36j569k248k426k611l027l392l467l268
51286C63596k826k151j361n69J67O54O45K93J68O06J402K244L028L563L455K613
51270C75527J520P59N49Q99J683K510K954L146L506L856L468K242J049N01K00
51255D04369l69r74j330j834k809l620l494k790k514k840l021k642k074j699j461
51240C70898j313j499k115k761k822j986o02L89K17q41j643j497q61m32j29M24
51224C53427R49Q82M28M04J073J830K058J772J375J180J301J648K017K287K472
$$ plain form
51333 422558 416723 410904 404597 398533 393734 390283 387471 384851 382585 380912 379790 379115 378870 378965 379141
51318 379141 379086 378583 377605 376332 374979 373636 372459 371925 372442 373715 374982 376021 377320 379063 380660 381704
51302 381704 382702 384197 385715 386385 386261 386123 386140 385604 384035 381787 379361 376750 373723 370331 366864 363596
51286 363596 360770 358619 357258 356689 356856 357510 358155 358448 358616 359222 360624 362868 365896 369459 372914 375527
51270 375527 377047 377806 378355 379254 380937 383447 386401 389547 393053 396909 400377 402619 403668 404169 404369
51255 404369 404000 403026 401696 399862 397053 393433 389939 387149 384635 381795 378774 376132 374058 372359 370898
51240 370898 369585 368086 365971 363210 360388 358402 357800 358189 358406 357565 355922 354425 353564 353132 353003 353427
51224 353427 354376 355258 355686 356090 357163 358993 361051 362823 364198 365378 366679 368327 370344 372631 375103
51209C75103K429J935J198Q60J197J781K214K619L020K989K446K089K301K397
51195D04578J740R10O70N82p9o86m4J446K093J338L41n8l09p28o76J23P47M78
51177D12466p7q0K35K64J67L27L97j59j056j606j697j609j264n67j03n13j417
51160D03708j735j139l37l5k35o68j215j745k053k164k305k463k321j725r00j63
51144C82505K52J12o65j625j970j432o52m16o29n28J92R08R70O28O57J248J825
51127C81380J957J791J551J200R25J274K303L133L021K369J981J799J265O24O92
51112D07265J443J911J706J506J774K065K052K242L007L694L471K460J320L01
51098D36217o25j152r68m74m21r32j480j717j835k095k357k205j413l09L65K66
$$ plain form
51209 375103 377532 379467 380665 381525 382722 384503 386717 389336 392356 395345 397791 399880 402181 404578
51195 404578 406318 407228 407898 408480 408401 407715 407671 409117 411210 412548 412889 412831 412522 411794 411118 411241 411988 412466
51177 412466 412389 412309 412544 412808 412975 413302 413699 413540 412484 410878 409181 407572 406308 405741 405638 405125 403708
51160 403708 401973 400834 400497 400462 400227 399559 398344 396599 394546 392382 390077 387614 385293 383568 382668 382505
51144 382505 382757 382869 382204 380579 378609 377177 376525 376109 375480 374952 375144 376052 377022 377650 378307 379555 381380
51127 381380 383337 385128 386679 387879 388804 390078 392381 395514 398535 400904 402885 404684 405949 406573 407265
51112 407265 408708 410619 412325 413831 415605 417670 419722 421964 424971 428665 432136 434596 435916 436217
51098 436217 435592 434440 433472 432998 432577 431645 430165 428448 426613 424518 422161 419956 418543 418234 418599 418865
51082D18865KM26J409J946J598J041R26J011Q38N86O58J019J547K396L402L772
51066D41442L078K098J830K202K511K714L353M486N606O404O926P101O902O697
51052E03350O758O632N822M792M465M917N498N992O643P160O898O081N687N953
51038E86648O017N387M676M428M241L624K837K158J120p36k956m809o400q243
51024E97992j0067j0879j0257q871p594o638n737m741l678k456q83Q85K224K668
51010E31968K611K938L858M622M669M498M824N387N480N331N853O987P440O490
50996F02956N088M582N028N473N343M892M560M552M920N591O395P256Q273R400
50982F84309J0376J1154J2024J3090J4002J4469J4633J4614J4134J3048J1773
$$ plain form
51082 418865 418867 419293 420702 422648 424246 425287 426213 427224 428062 428648 429306 430325 431872 434268 437670 441442
51066 441442 444520 446618 448448 450650 453161 455875 459228 463714 469320 475724 482650 489751 496653 503350
51052 503350 510108 516740 522562 527354 531819 536736 542234 548226 554869 562029 568927 575008 580695 586648
51038 586648 592665 598052 602728 607156 611397 615021 617858 620016 621136 620400 617444 612635 606235 597992
51024 597992 587925 577046 566789 557918 550324 543686 537949 533208 529530 527074 526191 527076 529300 531968
51010 531968 534579 537517 541375 545997 550666 555164 559988 565375 570855 576186 582039 589026 596466 602956
50996 602956 608044 612626 617654 623127 628470 633362 637922 642474 647394 652985 659380 666636 674909 684309
50982 684309 694685 705839 717863 730953 744955 759424 774057 788671 802805 815853 827626
50971H27626J0767R881Q788P730P259P404P704P962Q435R352J0704J2531J4909
50958I51052J7570J9954K1717K2857K3371K3218K2722K2584K3164K4000K4309
50947A196518K3877K3204K2840K2848K2989K3264K3894K4778K5310K5061K4346
50936A458929K3693K2855K0871J7240J2499P522K782j483m965p683j0302j3471
50924A528487j7091k0617k3933k7362l1012l4519l7403l9256l9721l8870l7511
50913A181192l6567l6086l5286l3661l1499k9288k7061k4694k2335k0241j8385
50902H66089j6594j4872j3359j2089j1001j0058r193q222p092o052n415n159n000
50889G41983m770m546m358m050l436k480j236J60J394K069K127J971J953J949
$$ plain form
50971 827626 838393 848274 857062 864792 872051 879455 887159 895121 903556 912908 923612 936143 951052
50958 951052 968622 988576 1010293 1033150 1056521 1079739 1102461 1125045 1148209 1172209 1196518
50947 1196518 1220395 1243599 1266439 1289287 1312276 1335540 1359434 1384212 1409522 1434583 1458929
50936 1458929 1482622 1505477 1526348 1543588 1556087 1563609 1566391 1564908 1559943 1552260 1541958 1528487
50924 1528487 1511396 1490779 1466846 1439484 1408472 1373953 1336550 1297294 1257573 1218703 1181192
50913 1181192 1144625 1108539 1073253 1039592 1008093 978805 951744 927050 904715 884474 866089
50902 866089 849495 834623 821264 809175 798174 788116 778923 770701 763609 757557 752142 746983 741983
50889 741983 737213 732667 728309 724259 720823 718343 717107 717267 718661 720730 722857 724828 726781 728730
50875G28730J773J807K676M220N474N926O276P434R190J0489J0849J0823J1092
50862H16759J1733J2553J3558J4863J6411J8048J9662K1160K2552K4081K6052
50851A017432K8524L1363L4452L7556M0258M2546M5172M8681N2309N4759N6068
50840A489120N7553N9707O1333O1374O0395N9318N7695N4552N0260M6279M3217
50829B100803M0410L7416L4823L3327L2879L3027L3412L3711L3731L3789L4490
50818B481818L5821L6853L6513L4325L0342K4742J7617Q911j431j3003k4786l5824
50806B631898m5927n5293o3728p0812p6618q1409q4650q5193q2797p8765p4634
50795A832072p0683o6112o0324n3685m7157m1410l6243l0945k5368k0341j6688
$$ plain form
50875 728730 730503 732310 734986 739206 744680 750606 756882 764316 773506 783995 794844 805667 816759
50862 816759 828492 841045 854603 869466 885877 903925 923587 944747 967299 991380 1017432
50851 1017432 1045956 1077319 1111771 1149327 1189585 1232131 1277303 1325984 1378293 1433052 1489120
50840 1489120 1546673 1606380 1667713 1729087 1789482 1848800 1906495 1961047 2011307 2057586 2100803
50829 2100803 2141213 2178629 2213452 2246779 2279658 2312685 2346097 2379808 2413539 2447328 2481818
50818 2481818 2517639 2554492 2591005 2625330 2655672 2680414 2698031 2706942 2705511 2692508 2667722 2631898
50806 2631898 2585971 2530678 2466950 2396138 2319520 2238111 2153461 2068268 1985471 1906706 1832072
50795 1832072 1761389 1695277 1634953 1581268 1534111 1492701 1456458 1425513 1400145 1379804 1363116
50784A363116j4153j1900r770q295p597p195o899p023p607q225q783r621j0578
50771A245470j0955j0683j0715j1704j3142j4308j5263j6311j7326j8201j9256
50760A087606k0388k0630j9394j7516j6173j5356j4367j3160j2093j0774q505
50749I19250n718l675k636j424Q86L817O295P901Q963J0037J1555J3514J5394
50736I84159J6843J8396K0868K4055K6821K8559K9760L0900L1724L2000L2190
50725A276275L2745L3298L3221L2557L1794L1081L0159K8866K7164K4902K2048
50714A604110J9011J6251J3682J0860P845N470M627N411P055Q699J0149J1902
50702A725072J4305J6899J8774J9502J9270J8154J5826J2192P778L053k265q661
$$ plain form
50784 1363116 1348963 1337063 1327293 1318998 1311401 1304206 1297307 1290284 1282677 1274452 1265669 1256048 1245470
50771 1245470 1234515 1223832 1213117 1201413 1188271 1173963 1158700 1142389 1125063 1106862 1087606
50760 1087606 1067218 1046588 1027194 1009678 993505 978149 963782 950622 938529 927755 919250
50749 919250 913532 909857 907221 905797 906683 910500 916795 924696 933659 943696 955251 968765 984159
50736 984159 1001002 1019398 1040266 1064321 1091142 1119701 1149461 1180361 1212085 1244085 1276275
50725 1276275 1309020 1342318 1375539 1408096 1439890 1470971 1501130 1529996 1557160 1582062 1604110
50714 1604110 1623121 1639372 1653054 1663914 1671759 1677229 1681856 1687267 1694322 1703021 1713170 1725072
50702 1725072 1739377 1756276 1775050 1794552 1813822 1831976 1847802 1859994 1867772 1870825 1868560 1859899
50690A859899j5748k2282k7312l0904l3610l5572l6422l5900l4276l1987k9086
50679A526800k5358k0986j6687j2965r507n775j878J700N063Q865J3155J7112
50667A479539K0120K2444K4382K5436K4992K3381K1526J9896J8416J7186J6460
50656A713778J6020J5287J4121J2946J2043J1381J1168J1793J2977J3730J3652
50645A858896J3686J5015J7597K0428K2917K5225K7415K9110L0285L1623L3476
50634B125673L4958L4796L3017L1016K9769K8594K6226K2579J8790J5620J2502
50623B413540Q329K639m190j1447j8478k4847l0366l4747l7172l6784l3803k9684
50611B162990k5638k1542j6785j1742p541m733k987k147k661m851q512j3392j9396
$$ plain form
50690 1859899 1844151 1821869 1794557 1763653 1730043 1694471 1658049 1622149 1587873 1555886 1526800
50679 1526800 1501442 1480456 1463769 1450804 1441297 1435522 1433644 1435344 1440407 1449272 1462427 1479539
50667 1479539 1499659 1522103 1546485 1571921 1596913 1620294 1641820 1661716 1680132 1697318 1713778
50656 1713778 1729798 1745085 1759206 1772152 1784195 1795576 1806744 1818537 1831514 1845244 1858896
50645 1858896 1872582 1887597 1905194 1925622 1948539 1973764 2001179 2030289 2060574 2092197 2125673
50634 2125673 2160631 2195427 2228444 2259460 2289229 2317823 2344049 2366628 2385418 2401038 2413540
50623 2413540 2421869 2424508 2420318 2408871 2390393 2365546 2335180 2300433 2263261 2226477 2192674 2162990
50611 2162990 2137352 2115810 2099025 2087283 2079742 2075009 2072022 2069875 2067214 2062363 2053851 2040459 2021063
50598B021063k6049l2411l7912m2733m7024n0291n2041n2571n2584n2248n1084
50587A524115m8664m5109m1090l7415l4432l1629k8213k4182k0350j7150j4102
50576A181779j0784p588m932k420M03L047M775N887P261Q892R990J0404J0793
50563A217507J1282J1150J0229R477R728J0789J2312J4551J7476K0117K1709K2895
50551A389222K4782K7310K9556L1220L2726L4038L4539L4198L3769L3648L3502
50540A738510L3311L3931L5962L8811M1491M3917M6813N0631N5128N9829O4428
50529B242762O8828P3191P7891Q3029Q8078R2291R5411R7700R9268R9798R8922
50518C217169R6578R2679Q6779P8388O7659N5471M2656K9281J4925l93j5875l0591
$$ plain form
50598 2021063 1995014 1962603 1924691 1881958 1834934 1784643 1732602 1680031 1627447 1575199 1524115
50587 1524115 1475451 1430342 1389252 1351837 1317405 1285776 1257563 1233381 1213031 1195881 1181779
50576 1181779 1170995 1163407 1158475 1156055 1156458 1159505 1164280 1170167 1177428 1186320 1196310 1206714 1217507
50563 1217507 1228789 1239939 1250168 1259645 1269373 1280162 1292474 1307025 1324501 1344618 1366327 1389222
50551 1389222 1414004 1441314 1470870 1502090 1534816 1568854 1603393 1637591 1671360 1705008 1738510
50540 1738510 1771821 1805752 1841714 1880525 1922016 1965933 2012746 2063377 2118505 2178334 2242762
50529 2242762 2311590 2384781 2462672 2545701 2633779 2726070 2821481 2919181 3018449 3118247 3217169
50518 3217169 3313747 3406426 3493205 3571593 3639252 3694723 3737379 3766660 3781585 3781192 3765317 3734726
50506C734726m4114n6287o6659p4630q0009q2974q3418q0834p5108o6995n7542
50495B966156m7342l6603k5608j4751m280N450J3567J8833K0406J8210J2623M093
50483B930754o902j9765l3840m8404o2495p4966q4864r1793r5870r7443r6943
50472B217469r4867r1693q7664q2769p7071p1046o5363o0286n5452n0520m5832
50461A434906m2038l9061l5969l2127k8037k4576k1752j8834j5590j2663j0515
50450A153744q673o511m359l126k941k736j471O14K326K930K909L293M508O065
50436A146572P285P944Q183Q057P505O784O511P167Q580J0190J1684J3181J4770
50423A264413J6176J7066J7612J8397J9769K1526K3349K5408K8259L2216L6980
$$ plain form
50506 3734726 3690612 3634325 3567666 3493036 3413027 3330053 3246635 3165801 3090693 3023698 2966156
50495 2966156 2918814 2882211 2856603 2841852 2837572 2843022 2856589 2875422 2895828 2914038 2926661 2930754
50483 2930754 2923852 2904087 2870247 2821843 2759348 2684382 2599518 2507725 2411855 2314412 2217469
50472 2217469 2122602 2030909 1943245 1860476 1783405 1712359 1646996 1586710 1531258 1480738 1434906
50461 1434906 1392868 1353807 1317838 1285711 1257674 1233098 1211346 1192512 1176922 1164259 1153744
50450 1153744 1145071 1138560 1134201 1131075 1128134 1125398 1123927 1124541 1126867 1129797 1132706 1135999 1140507 1146572
50436 1146572 1153857 1161801 1169984 1178041 1185546 1192330 1198841 1206008 1214588 1224778 1236462 1249643 1264413
50423 1264413 1280589 1297655 1315267 1333664 1353433 1374959 1398308 1423716 1451975 1484191 1521171
50412A521171M1836M6086M9327N1710N3949N6692N9677O1702O1763O0078N7635
50401B121626N4872N1260M6211L9919L2951K5353J6704O998k973j2305k0830k8986
50389B330800l6956m4263n0242n4592n7301n8244n7282n4716n1255m7233m2141
50378A776575l5377k7392j9642j3201p833k731K042N401O488N467K845j348p125
50365A684169j3638j9566k4594k9695l5599m1508m5861m8009m8492m7935m6433
50354A282839m4029m1136l8211l5449l2957l0754k8481k5646k2421j9755j8245
50343I45755j7326j5965j3867j1573r697q516q098q244q326p692o308m782l760
50330H21601l538m020m651m600l464j846p52m49k69L73J301K028K504L128M164
$$ plain form
50412 1521171 1563007 1609093 1658420 1710130 1764079 1820771 1880448 1942150 2003913 2063991 2121626
50401 2121626 2176498 2227758 2273969 2313888 2346839 2372192 2388896 2395894 2392921 2380616 2359786 2330800
50389 2330800 2293844 2249581 2199339 2144747 2087446 2029202 1971920 1917204 1865949 1818716 1776575
50378 1776575 1741198 1713806 1694164 1680963 1673130 1670399 1672441 1677842 1684330 1689797 1692642 1691294 1684169
50365 1684169 1670531 1650965 1626371 1596676 1561077 1519569 1473708 1425699 1377207 1329272 1282839
50354 1282839 1238810 1197674 1159463 1124014 1091057 1060303 1031822 1006176 983755 964000 945755
50343 945755 928429 912464 898597 887024 877327 868811 860713 852469 844143 836451 830143 825361 821601
50330 821601 818063 814043 809392 804792 801328 799482 798730 798281 798012 798385 799686 801714 804218 807346 811510
50315H11510N372O189O235N761N421N562N946O306O770P334P460O854O305O875
50301H99900Q298R169Q822Q053P744P803P933Q428R494J0496J0844J1059J2002
50288A020045J3420J4126J3510J1992J0071P759M932J590k290o500j0176j2355
50276A066124j3107j3391j3642j3214j1492q936o547m783l486k436j505n04O37
50263I73718J547J710J051P4o20q18p27o03l46L52J335J762J007l64j177j255
50247I76646j576k593l334k867j923j954k956l436k582j301p14o78m67j52l26
50232I49787q28q34j91J76n00j823k812l004k631k055j543j355j626k151k600
50217I26010k925l271l622l839l972m123m062l459k568k079k079j775o51O46J225
$$ plain form
50315 811510 816882 823071 829306 835067 840488 846050 851996 858302 865072 872406 879866 886720 893025 899900
50301 899900 908198 917367 926189 934242 941986 949789 957722 966150 975644 986140 996984 1008043 1020045
50288 1020045 1033465 1047591 1061101 1073093 1083164 1090923 1095855 1097445 1095155 1088655 1078479 1066124
50276 1066124 1053017 1039626 1025984 1012770 1001278 992342 985795 981012 977526 975090 973585 973081 973718
50263 973718 975265 976975 978026 978100 977480 976662 975935 975332 974986 975338 976673 978435 979442 979078 977901 976646
50247 976646 975070 972477 969143 966276 964353 962399 959443 956007 953425 952124 951410 950732 950265 950113 949787
50232 949787 948959 948125 947934 948110 947610 945787 942975 939971 937340 935285 933742 932387 930761 928610 926010
50217 926010 923085 919814 916192 912353 908381 904258 900196 896737 894169 892090 890011 888236 887585 888231 889456
50202H89456J308J928L407N054O418P863R537J0652J0479R507Q886R002R332R439
50188I92268R357Q994Q068O806N946N658N098L543J449l09j842m032p067r982
50174A023955j1949j3206j4276j4876j4264j2466j0394q794p502o019m387l165
50162I02657k734k904l239l621m330n586p077q106q303q019p839p824p469o402
50148H19204m852l389k454k203k629l592m834o021o790o844o255n625n592n951
50134G52173n650l964j540J63M79J90M92J589K619K751J972Q14l49j373j959j715
50118G46692p44K28O52P73J121J623J787J678K036L193M431M832M470M275M893
50103G81940O031O828O694N811N029N163O291P735Q772R188R201R142R278R688
$$ plain form
50202 889456 890764 892692 896099 901153 907571 915434 924971 935623 946102 955609 964495 973497 982829 992268
50188 992268 1001625 1010619 1018687 1025493 1031439 1037097 1042195 1045738 1047187 1046878 1045036 1041004 1033937 1023955
50174 1023955 1012006 998800 984524 969648 955384 942918 932524 923730 916228 910209 905822 902657
50162 902657 899923 897019 893780 890159 885829 880243 873166 865060 856757 848738 840899 833075 825606 819204
50148 819204 814352 810963 808509 806306 803677 800085 795251 789230 782440 775596 769341 763716 758124 752173
50134 752173 746523 742559 741019 741182 741661 741851 742343 743932 746551 749302 751274 752088 751739 750366 748407 746692
50118 746692 745948 746176 746828 747601 748722 750345 752132 753810 755846 759039 763470 768302 772772 777047 781940
50103 781940 787971 794799 801493 807304 812333 817496 823787 831522 840294 849482 858683 867825 877103 886791
50089H86791J0174J0693J1796J4162J7465K0343K1827K2348K2954K4019K5254
50078A087826K6423K7428K8033K8174K8247K8459K8292K7311K6146K5801K6149
50067A388289K6017K4642K2167J8807J4540R736N035M07m768j0411j5507j9480
50055A459474k2794k5749k7706k8241k8154k8433k8855k8446k6932k4862k2634
50044A166668k0282j7946j5823j3731j1311q677o349m674l686l230k880k002m64
50031A055613J048J890K334L012L870M320M188L701K781J183p00j973k389k658
50017A076220l482m802o179p358q265q858r247r658j0193j0789j1302j1394j0597
50004I64096q999p636p505q218q291o830m329j778L23J811K558K651K524K471
$$ plain form
50089 886791 896965 907658 919454 933616 951081 971424 993251 1015599 1038553 1062572 1087826
50078 1087826 1114249 1141677 1169710 1197884 1226131 1254590 1282882 1310193 1336339 1362140 1388289
50067 1388289 1414306 1438948 1461115 1479922 1494462 1504198 1509233 1509640 1504872 1494461 1478954 1459474
50055 1459474 1436680 1410931 1383225 1354984 1326830 1298397 1269542 1241096 1214164 1189302 1166668
50044 1166668 1146386 1128440 1112617 1098886 1087575 1078898 1072549 1067875 1064189 1060959 1058079 1056077 1055613
50031 1055613 1056661 1058551 1060885 1063897 1067767 1072087 1076275 1079976 1082757 1083940 1083240 1081267 1078878 1076220
50017 1076220 1072738 1067936 1061757 1054399 1046134 1037276 1028029 1018371 1008178 997389 986087 974693 964096
50004 964096 955097 947461 939956 931738 923447 916617 912288 910510 910833 912644 915202 917853 920377 922848
49990I22848K342J972J472Q81n7j452k928m035m798n559o448p184p313o620n490
49975H77631m702m612m649m020k666r97J046L750O457P787P473P045P999J0038
49961I07580J1879J3168J4663J6825J9213K1240K2727K3667K4023K3960K3869
49950A122814K3932K3892K3299K1861J9576J6675J3382R628N143k3n375j0480
49938A264324j5332k0016k4363k8157l1354l3761l4998l5118l4777l4249l2817
49927I39382k9918k6490k4155k3157k2028j9552j6190j3224j1217r782q372o724
49915G28573m876l175k072j481o62Q59K422K911K285J899L027N482Q000R728J0785
49900G63705J1481J1670J1230J0635J0438J0377R644Q005O017M078J970m21k692
$$ plain form
49990 922848 925190 927162 928634 929515 929458 928006 925078 921043 916245 910686 904238 897054 889741 883121 877631
49975 877631 872929 868317 863668 859648 856982 855985 857031 860781 867238 875025 882498 889543 897542 907580
49961 907580 919459 932627 947290 964115 983328 1004568 1027295 1050962 1074985 1098945 1122814
49950 1122814 1146746 1170638 1193937 1215798 1235374 1252049 1265431 1275059 1280202 1280179 1274804 1264324
49938 1264324 1248992 1228976 1204613 1176456 1145102 1111341 1076343 1041225 1006448 972199 939382
49927 939382 909464 882974 858819 835662 813634 794082 777892 764668 753451 743669 735297 728573
49915 728573 723697 720522 718450 716969 716307 717166 719588 722499 724784 726683 729710 735192 743192 752920 763705
49900 763705 775186 786856 798086 808721 819159 829536 839180 847185 853202 857280 859250 858829 856137
49887H56137m671o897r666j2121j3158j2930j2679j3113j3774j4017j3814j3389
49875G15908j2756j1956j1251j0749j0163r177p769o034m106k359j316j067j035
49862F26170m92Q44K784M859O537P596Q404R505J0854J1820J2031J1774J1452
49849G24138J1064J0411R402P972O110M193K766J797N86j311l511n510p363r212
49835G51532j0635j1128j0895j0505r939q704o744m639k922j685r17n95l75K74
49821F72123J444K709L805N011O618Q357R660J0345J0748J1261J1813J1885J1013
49808G76792R304P330N472L654J873N40j33q09k392m751o753p653p847q003q115
$$ plain form
49887 856137 851466 844569 834903 822782 809624 796694 784015 770902 757128 743111 729297 715908
49875 715908 703152 691196 679945 669196 659033 649856 642087 636053 631947 629588 628272 627205 626170
49862 626170 625678 626522 629306 634165 640702 648298 656702 666207 677061 688881 700912 712686 724138
49849 724138 735202 745613 755015 762987 769097 773290 776056 777853 778439 777128 773617 768107 760744 751532
49835 751532 740897 729769 718874 708369 698430 689726 682982 678343 675421 673736 672819 672224 671849 672123
49821 672123 673567 676276 680081 685092 691710 700067 709727 720072 730820 742081 753894 765779 776792
49808 776792 786096 793426 798898 802552 804425 804965 804832 804023 801631 796880 790127 782474 774627 766624 758509
$$ [...]
##END NTUPLES=NMR SPECTRUM
##END=
