
##TITLE=UV1257_M11_1332-1242_10_7409485_rOIlnEYvJ9
##JCAMPDX= 6.0         $$ Bruker NMR JCAMP-DX V2.0
##DATA TYPE= NMR SPECTRUM
##DATA CLASS= NTUPLES
##ORIGIN= BRUKER
##OWNER= Administrator
$$ 1.72 TOPSPIN		Version 2.1
$$ 2013-01-25 01:55:19.325 -0500  Administrator@X
$$ Compression mode = diff/dup
##.OBSERVE FREQUENCY= 400.02188249412
##.OBSERVE NUCLEUS= ^1H
##.ACQUISITION MODE= SIMULTANEOUS (DQD)
##.ACQUISITION SCHEME= undefined
##.AVERAGES= 8
##.DIGITISER RES= 22
##SPECTROMETER/DATA SYSTEM= spect
##.PULSE SEQUENCE= zg30
##.SOLVENT NAME= COFFEE_meoh
##.SHIFT REFERENCE= INTERNAL, COFFEE_meoh, 1, 14.98509
##AUDIT TRAIL= $$ (NUMBER, WHEN, WHO, WHERE, PROCESS, VERSION, WHAT)
$$ ##TITLE= Audit trail, TOPSPIN		Version 2.1
$$ ##JCAMPDX= 5.01
$$ ##ORIGIN= Bruker BioSpin GmbH
$$ ##OWNER= Administrator
$$ $$ E:\/data/COFFEE/nmr/UV1257_M11_1332-1242_10_7409485_rOIlnEYvJ9/10/pdata/1/auditp.txt
$$ ##AUDIT TRAIL=  $$ (NUMBER, WHEN, WHO, WHERE, PROCESS, VERSION, WHAT)
(   1,<2013-01-25 01:55:11.231 -0500>,<Administrator>,<X>,<go>,<TOPSPIN 2.1>,
      <created by zg
	started at 2013-01-25 01:54:05.153 -0500,
	POWCHK enabled, PULCHK disabled,
       configuration hash MD5:
       86 BA 57 50 F2 9D 5C 9B 26 00 A9 28 5F 66 2E 89
       data hash MD5: 64K
       AD 3F 97 0E 65 80 B1 00 23 1B D4 12 ED E9 B3 39>)
(   2,<2013-01-25 01:55:14.278 -0500>,<Administrator>,<X>,<proc1d>,<TOPSPIN 2.1>,
      <Start of raw data processing
       efp LB = 0 FT_mod = 6 PKNL = 1 PHC0 = 0 PHC1 = 0 SI = 32K 
       data hash MD5: 32K
       A5 A7 6E 08 2B 61 F0 B4 BC 63 EB 14 B9 9D 25 8E>)
(   3,<2013-01-25 01:55:14.762 -0500>,<Administrator>,<X>,<proc1d>,<TOPSPIN 2.1>,
      <pk PHC0 = 100.036 PHC1 = 0 
       data hash MD5: 32K
       50 BF A6 C7 69 74 83 B2 CD 15 3A F7 9D 13 E9 FD>)
(   4,<2013-01-25 01:55:14.997 -0500>,<Administrator>,<X>,<proc1d>,<TOPSPIN 2.1>,
      <abs ABSG = 1 
       data hash MD5: 32K
       82 7D 02 AD 9E 51 9A FB A3 E8 7B 8A 96 40 76 44>)
(   5,<2013-01-25 01:55:15.137 -0500>,<Administrator>,<X>,<proc1d>,<TOPSPIN 2.1>,
      <abs ABSG = 2 
       data hash MD5: 32K
       1E D8 60 A4 A7 DE 27 D8 92 20 E1 16 91 B7 D1 53>)
(   6,<2013-01-25 01:55:15.293 -0500>,<Administrator>,<X>,<proc1d>,<TOPSPIN 2.1>,
      <abs ABSG = 3 
       data hash MD5: 32K
       6C 6F C8 8B 33 34 C5 83 92 75 FD C4 7C 59 BF BB>)
(   7,<2013-01-25 01:55:15.434 -0500>,<Administrator>,<X>,<proc1d>,<TOPSPIN 2.1>,
      <abs ABSG = 4 
       data hash MD5: 32K
       1D B7 D1 11 BD 3A 4F 18 55 C3 95 66 43 01 6B 9A>)
(   8,<2013-01-25 01:55:15.590 -0500>,<Administrator>,<X>,<proc1d>,<TOPSPIN 2.1>,
      <abs ABSG = 5 
       data hash MD5: 32K
       81 F7 07 A0 FF B1 FF C7 8B 3B C4 21 B2 85 20 E0>)
$$ ##END=
$$ 
$$ $$ hash MD5
$$ $$ DE 44 D0 0B 85 D2 69 BC 47 D2 50 D8 F8 DC E2 74
##$RELAX= 
##$RELAX= 
##$RELAX= 
##$RELAX= 
##$RELAX= 
##$RELAX= 
##$RELAX= 
$$ Bruker specific parameters
$$ --------------------------
##$DU= <E:\>
##$EXPNO= 10
$$ [...]
##$TP= (0..7)
150 150 150 150 150 150 150 150
##$TP07= 0
##$TPNAME0= <>
##$TPNAME1= <>
##$TPNAME2= <>
##$TPNAME3= <>
##$TPNAME4= <>
##$TPNAME5= <>
##$TPNAME6= <>
##$TPNAME7= <>
##$TPOAL= (0..7)
0.5 0.5 0.5 0.5 0.5 0.5 0.5 0.5
##$TPOFFS= (0..7)
0 0 0 0 0 0 0 0
##$TUNHIN= 0
##$TUNHOUT= 0
##$TUNXOUT= 0
##$USERA1= <user>
##$USERA2= <user>
##$USERA3= <user>
##$USERA4= <user>
##$USERA5= <user>
##$V9= 5
##$VALIST= <valist>
##$VCLIST= <CCCCCCCCCCCCCCC>
##$VD= 0
##$VDLIST= <DDDDDDDDDDDDDDD>
##$VPLIST= <PPPPPPPPPPPPPPP>
##$VTLIST= <TTTTTTTTTTTTTTT>
##$WBST= 1024
##$WBSW= 4
##$XGAIN= (0..3)
0 0 0 0
##$XL= 0
##$YL= 0
##$YMAX_a= 632262
##$YMIN_a= -540065
##$ZGOPTNS= <>
##$ZL1= 120
##$ZL2= 120
##$ZL3= 120
##$ZL4= 120
##$ABSF1= 14.98509
##$ABSF2= -5.573092
##$ABSG= 5
##$ABSL= 3
##$ALPHA= 0
##$AQORDER= 0
##$ASSFAC= 0
##$ASSFACI= 0
##$ASSFACX= 0
##$ASSWID= 0
##$AUNMP= <proc_prof1d_extract_pilot.lims>
##$AXLEFT= 0
##$AXNAME= <>
##$AXNUC= <1H>
##$AXRIGHT= 0
##$AXTYPE= 0
##$AXUNIT= <>
##$AZFE= 0.1
##$AZFW= 0.1
##$BCFW= 0
##$BC_mod= 0
##$BYTORDP= 0
##$COROFFS= 0
##$CY= 15
##$DATMOD= 1
##$DC= 0
##$DFILT= <>
##$DTYPP= 0
##$F1P= 0
##$F2P= 0
##$FCOR= 0.5
##$FTSIZE= 32768
##$FT_mod= 6
##$GAMMA= 0
##$GB= 0
##$INTBC= 1
##$INTSCL= 1
##$ISEN= 128
##$LB= 0
##$LEV0= 0
##$LPBIN= 0
##$MAXI= 10000
##$MC2= 0
##$MEAN= 0
##$ME_mod= 0
##$MI= 0
##$NCOEF= 0
##$NC_proc= -8
##$NLEV= 6
##$NOISF1= 0
##$NOISF2= 0
##$NSP= 0
##$NTH_PI= 0
##$NZP= 0
##$OFFSET= 14.98509
##$PC= 1
##$PHC0= 100.036
##$PHC1= 0
##$PH_mod= 1
##$PKNL= yes
##$PPARMOD= 0
##$PPDIAG= 0
##$PPIPTYP= 0
##$PPMPNUM= 2147483647
##$PPRESOL= 1
##$PSCAL= 4
##$PSIGN= 0
##$PYNMP= <proc.py>
##$REVERSE= no
##$SF= 400.02
##$SI= 32768
##$SIGF1= 0
##$SIGF2= 0
##$SINO= 400
##$SIOLD= 32768
##$SPECTYP= <>
##$SREGLST= <1H.CDCl3>
##$SSB= 0
##$STSI= 32768
##$STSR= 0
##$SW_p= 8223.68421052631
##$SYMM= 0
##$S_DEV= 0
##$TDeff= 65536
##$TDoff= 0
##$TI= <>
##$TILT= no
##$TM1= 0
##$TM2= 0
##$TOPLEV= 0
##$USERP1= <user>
##$USERP2= <user>
##$USERP3= <user>
##$USERP4= <user>
##$USERP5= <user>
##$WDW= 1
##$XDIM= 32768
##$YMAX_p= 474026685
##$YMIN_p= -790536
##$CURPLOT= <Network HP LaserJet P1505>
##$CURPRIN= <$Network HP LaserJet P1505>
##$DFORMAT= <normdp>
##$LAYOUT= <+/1D_H.xwp>
##$LFORMAT= <normlp>
##$PFORMAT= <normpl>
##$SURQMSG= 1
$$ End of Bruker specific parameters
$$ ---------------------------------
##NTUPLES= NMR SPECTRUM
##VAR_NAME=  FREQUENCY,     SPECTRUM/REAL,   SPECTRUM/IMAG
##SYMBOL=    X,             R,               I
##VAR_TYPE=  INDEPENDENT,   DEPENDENT,       DEPENDENT
##VAR_FORM=  AFFN,          ASDF,            ASDF
##VAR_DIM=   32768,         32768,           32768
##UNITS=     HZ,            ARBITRARY UNITS, ARBITRARY UNITS
##FACTOR=    0.250966925370066, 1,           1
##FIRST=     8223.43324360094, -118719,      188032
##LAST=      0,             144724,          -260176
##MIN=       0,             -790536,         0
##MAX=       8223.43324360094, 474026685,    0
$$ Real data points
##PAGE= N=1
##DATA TABLE= (X++(R..R)), XYDATA
$$ [...]
19525h9137b0108m3221A791J5164J14872J34957K2365e47843B6123P7440a63903
19513C3867b8207A03365B7033a46278A3157f3646B48626j17851E2858d2892j72567
19502b15459d4690Q272k81299M0234o6423f8753F4884h6673B35062o7395e9875
19490h2112F2887d2419j99006R8129N0625G166a57213N0885F9679J35397b69036
19478C2126b94035B9632J81555i0968k51152J61538B5660P9230B3131b85722H4722
19466b04737h4724B50011d6857j66562D1651K5353b7010m77667C48503a62237
19455E6850d2951A09089h2996k17524P7544j04002J05494E2049f5631k7436A55430
19443g1614B39656a14142A05752b0645r6934M6166j87848J22630A24788J5991
$$ y = [-89137, -20108, -63329, 1791, 16955, 131827, 266784, 289149, -547843, 26123, 103563, -163903, 33867, -28207, 103365, 27033, -146278, 13157, -63646, 248626, 130775, 52858, -42892, -215459, -44690, -36418, -317717, -277483, -343906, -68753, 64884, -86673, 235062, 167667, -59875, -82112, 62887, -42419, -241425, -143296, -92671, 7166, -157213, -106328, 69679, 205076, -269036, 32126, -294035, 29632, 211187, -90968, -342120, -180582, 25660, 104890, 23131, -285722, 84722, -204737, -84724, 250011, -46857, -213419, 41651, 67004, -27010, -504677, 348503, -162237, 56850, -42951, 109089, -82996, -300520, -222976, -326978, -221484, 52049, -65631, -93067, 155430, -71614, 239656, -114142, 105752, -20645, -117579, -71413, -259261, -136631, 124788, 140779]
19433A40779b20915g3626A16387K4855C2c23610d4566j25800j03205J07663D32680
19421b01980D6987b48210G0083a97596o655h448n6150A96010a55814I005b98427
19409d604p9035B74381g421B125J73438m6041J3069b33282o5569A04648a00779
19397H7558K1789O6330b86199A35082f8470p5528j07243H51h0666l19586H6421
19385A450a83759p1421a04998G164d6814j34741c9210A19195f5021B44288e7077
19373A137b76632M8365A00078a4711j46556e7560I2773K2262b17160L3017K3481
19362a60662g4815A22088b50024e5895j48975j45232J54131B15019a10260E81360
19351a44047a3613A90443b88160D8047L9159B0744N1158A8314b177j11801d2099
$$ y = [140779, -220915, -73626, 116387, 141242, 32, -323610, -44566, -170366, -273571, -165908, 432680, -201980, 46987, -248210, 70083, -197596, -204251, -8448, -64598, 196010, -155814, 9005, -298427, -4604, -83639, 274381, -7421, 2125, 175563, 129522, 142591, -233282, -298851, 104648, -100779, 87558, 109347, 175677, -286199, 135082, -68470, -143998, -251241, 851, -80666, -400252, 86421, 1450, -183759, -255180, -104998, 7164, -46814, -181555, -39210, 119195, -65021, 244288, -57077, 1137, -276632, -228267, 100078, -14711, -161267, -57560, 92773, 115035, -217160, -184143, -160662, -74815, 122088, -250024, -55895, -204870, -350102, -195971, 215019, -110260, 581360, -144047, -13613, 190443, -288160, 48047, 87206, 20744, 71902, 18314, -2177, -113978, -42099]
19339b41832f115r0986k56391m4329J87947B11505r4470b51491J21170E7500P5223
19328A32723c5629o0807k30007A90598a64304a6549A58884K33679g1776I443L90927
19317D00370H8328A8247b98993O3816c8197N302j55556G5396d889B64897b04618
19305C8349K9587b85462N4764C9429J7775A7840J19066c10259D5760a22700F8548
19293A66199c84783a61202g544D7605J54336b70248E5577b36890A38354b49146
19282a98042l40529K03416l2769J60311L9728A12155h0074j39476f3863a5995
19271B55553b20980h9684j49995B08996e2548A34221b41292B04417h4845L3699
19261e1146o7918A10778a08400k65951N2825F2171b72724J09184e4331C6086d51864
$$ y = [-241832, -6115, -97101, -353492, -397821, -209874, 211505, 117035, -251491, -130321, 57500, 132723, -35629, -96436, -326443, 190598, -164304, -16549, 158884, 392563, -71776, 9443, 400370, 88328, 18247, -298993, -235177, -38197, -32895, -188451, 75396, -4889, 264897, -204618, 38349, 67936, -285462, -230698, 39429, 57204, 17840, 136906, -310259, 45760, -122700, 68548, 166199, -384783, -161202, -7544, 47605, 201941, -270248, 55577, -236890, 138354, -249146, -198042, -538571, -335155, -367924, -207613, -167885, 112155, -80074, -219550, -63863, -15995, 255553, -220980, -89684, -239679, 208996, -52548, 134221, -241292, 204417, -84845, -51146, -119064, 110778, -108400, -374351, -321526, 62171, -272724, -163540, -54331, 36086, -451864]
19249A30985K62116a37737k4953O1045A2659M598c17005a17165C2463c662m4346
19238d8008k32034A4619c28230A83619b16070O6085e6222m43A98259F1412b6518
19226a55412f0165A80542d85319C6473L10090b97222a298k34728A57654N9129
19216B16783a73843H4538b5782j54095m7264A45271J4032B2566J31806K03530
19206C57902d726n2964A74701i8215l47488F6701b76607N5276G7715L1534n4123
19195E5126c14787j37163i0144n9715b6286A74982F1775a86949c4861k40773K3872
19184b51762C1379J50461b25059c8726F759K35629H0979L28404A6425d7185A01172
19172c98686a53986d4820H1203a85911L3060l0443E1388M6033a02678k165j37145
$$ y = [130985, 393101, -137737, -162690, -101645, 12659, 17257, -317005, -117165, 32463, -3662, -48008, -280042, 14619, -328230, 183619, -216070, -149985, -56222, -56665, 198259, 61412, -26518, -155412, -60165, 180542, -485319, 36473, 346563, -297222, -1298, -236026, 157654, 216783, -173843, 84538, -25782, -179877, -227141, 145271, 159303, 22566, 154372, 357902, -4726, -57690, 174701, -98215, -445703, 66701, -276607, -221331, 77715, 109249, 55126, -314787, -451950, -90144, -149859, -26286, 174982, 61775, -186949, -34861, -275634, -251762, 31379, 181840, -225059, -38726, 6759, 242388, 80979, 409383, 16425, -47185, 101172, -398686, -153986, -44820, 81203, -185911, -152851, -183294, 51388, 97421, -102678, -104843, -241988]
19161b41988e8894a2186q483j34655N4580p1472a1659G3205a93595B04922c393
19149B2937N3523b40783A7595P254a7265l7757l614K7587C9705b89410C54499
19137A89338c29209A26428J60813A09763a35015B29a72469l14558f9874l279K5432
19126d7721A01042b23412g4709B2370a5992p2193F0669J01164B1863i937j10845
19115a20782D5319a72020C78896a41654k3434q6269A98037e6206A5947b13053
19104b60731M3116j96359f547A55850e282k83391A57092c7455J1342B5014c2549
19092e14138Q8410c9827j86374K9500b7156A06375D2349e43026G0015a57459e8857
19080e74017F4066N6546a5244G1691c19251B22676d2998r420A26687j0250J0330
$$ y = [-241988, -58894, -12186, -20669, -155324, -100744, -172216, -11659, 73205, -193595, 204922, -3393, 22937, 76460, -240783, 17595, 24849, -17265, -55022, -58636, -31049, 39705, -289410, 354499, 189338, -329209, 126428, 287241, 109763, -135015, 229, -172469, -487027, -69874, -73153, -47721, 101042, -223412, -74709, 22370, -15992, -88185, 60669, 161833, 21863, -9937, -120782, 45319, -172020, 378896, -141654, -165088, -251357, 198037, -56206, 15947, -213053, -260731, -217615, -413974, -6547, 155850, -5282, -288673, 157092, -37455, -26113, 25014, -32549, -514138, -425728, -39827, -226201, -196701, -27156, 106375, 42349, -543026, 70015, -157459, -58857, -574017, 64066, 120612, -15244, 71691, -319251, 222676, -42998, -52418, 126687, 116437, 126767]
19069A26767b47549J19987N913C56569j44526P6633B4575b86887C93698d10611
19058D9365e6209d914A76386b32108k62495e7842A74216n1868l8012g5267A5793
19046a29766A25373F0779g9580E7214a18011b6413G9980a41014j27094c1021A27700
19034a88070i3588j08041a5190I0806K47008D3565N38808a37201A44237J51664
19024B95901o7246d8295E8893c35160d2330o2204r4339a5897A02321Q2897b67608
19012b11328r6900J53483C3492b19738D1782a42766O2409G1932h7670A602a53467
19000a86109B88150c58348G1710a44135J2601C50391b75539C7225b9257k69476
18990b98733A25508l2598b07065A00466c8253k02357b6685l23041A45438g751
$$ y = [126767, -247549, -127562, -121649, 356569, 212043, 288676, 24575, -286887, 393698, -410611, 49365, -56209, -4914, 176386, -232108, -494603, -57842, 174216, 122348, 84336, -75267, 15793, -129766, 125373, 60779, -79580, 57214, -118011, -26413, 79980, -141014, -268108, -31021, 127700, -188070, -93588, -201629, -15190, 90806, 337814, 43565, 582373, -137201, 144237, 295901, 228655, -48295, 58893, -335160, -42330, -104534, -198873, -15897, 102321, 185218, -267608, -211328, -308228, -154745, 33492, -219738, 41782, -142766, -80357, 71932, -87670, 1602, -153467, -186109, 288150, -358348, 71710, -144135, -131534, 350391, -275539, 37225, -29257, -298733, 125508, 92910, -207065, 100466, -38253, -240610, -26685, -349726, 145438, -7751]
18979B02719M9035E7326a27973o7190f8326D2084K15208a17840l6737j38662j35788
18968d29027A04592l4819a69199f9400j38405N3692J2684k31437J27786A92674
18957b3530m1313j65534A14212b03915l8196A87484h1621l5346A04964c11336
18946a29936G8981k6859b02141k065R9734m8415b1007m4256L1744H0979J23471
18935B04450a41386j713A54119h8184D5921k1256a86017a6563E1173P4208E0492
18923b1324l7655A29715M3615J82704c11261A14559h4476j44486J4682B58065
18912b43803B74480a33777H1072L4928M4028f8420a0840B65158j22405o033a06383
18900b84752A03194K8824a95028H3888P9518B7510b06306e7524k33747b1537O497
$$ y = [202719, 251754, 57326, -127973, -195163, -68326, 42084, 257292, -117840, -154577, -293239, -429027, 104592, 69773, -169199, -69400, -207805, -154113, -141429, -372866, -245080, 192674, -23530, -64843, -230377, 114212, -203915, -242111, 187484, -81621, -116967, 104964, -311336, -129936, 78981, 52122, -202141, -204206, -104472, -152887, -21007, -65263, -33519, 80979, 204450, -141386, -143099, 154119, -88184, 45921, 24665, -186017, -16563, 51173, 125381, 50492, -21324, -58979, 129715, 173330, 356034, -311261, 114559, -84476, -228962, -214280, 258065, -243803, 274480, -133777, 81072, 116000, 160028, -68420, -10840, 265158, 142753, 136720, -106383, -284752, 103194, 132018, -195028, 83888, 163406, 27510, -206306, -57524, -291271, -21537, -15040]
18889a5040B20661C1978K85773c66072a24159B12642a41053A23130a58595p295
18879a65890a0998F3598i7456G4853o690a40936c2263D51c38670p7033h3424k1590
18867a05014l5646e2135J9778j22199m6821l3345I8176a24651D3714d6458j62520
18856b08978B94041b34906I5130a99391A40300F6204b70282J07906B22368c7629
18845B30589b4002A73620D4043g9554B0050h7707K1565l04757J46097Q5385j69453
18834c08870R6196B168a6503o5959A01243f2653B82734c24310O8458J23726D6467
18822b17646R7870p1068B7477i133j23884j09456g658q8485B46866b76346A59443
18810B06335F9826K56528j31469J44755A48429i777l940j9192m5308B34652F1157
$$ y = [-15040, 220661, 31978, 317751, -366072, -124159, 212642, -141053, 123130, -158595, -165890, -10998, 63598, -97456, 74853, 68163, -140936, -32263, 451, -338670, -415703, -83424, -105014, -140660, -52135, -32357, -154556, -201377, -234722, 98176, -124651, 43714, -46458, -208978, 294041, -234906, 95130, -199391, 140300, 66204, -270282, -162376, 222368, -37629, 230589, -24002, 173620, 44043, -79554, 20050, -87707, -66142, -370899, -224802, -139417, -308870, -212674, 2168, -16503, -82462, 101243, -62653, 282734, -324310, -255852, -132126, 46467, -217646, -119776, -190844, 27477, -9133, -133017, -242473, -7658, -96143, 246866, -276346, 159443, 206335, 69826, 326354, 194885, 339640, 148429, -9777, -13717, -32909, -78217, 234652, 61157]
18798a04947k744j32713A96652g3279j56017g0548C1350d4428n5104B87807b5452
18786b50654J05482L9683K935o2441b08j68402B76717A21607K2602c75166J80607
18775a94559h4492k60820A735e5462C10731c37734a54924A33505c99654A30169
18764a49384P3842j61777C4129A1644c5760B17105q0059J67270a4654j15708A28882
18752d5069k78202P3201I4813C8461J39065c6663E1167d2397A95735a21993m0832
18741a62825k13816B4870J00499a4178A69967d1810I0640a52411a7807I5039b19509
18729a16463n2179n9849A35541a39103d8664j05786e5584D14953C9527K88358
18719C27885A29385J15749B2205R1469m8473a67069l2259I8228D0403M9178g9878
$$ y = [-104947, -107691, -240404, 196652, -73279, -229296, -70548, 31350, -44428, -99532, 287807, -25452, -250654, -145172, -105489, -102554, -164995, -208, -168610, 276717, 121607, 144209, -375166, -194559, -84492, -345312, 1735, -55462, 310731, -337734, -154924, 133505, -399654, 130169, -149384, -75542, -237319, 34129, 11644, -35760, 217105, 137046, 304316, -14654, -130362, 128882, -45069, -323271, -250070, 94813, 38461, 177526, -36663, 51167, -42397, 195735, -121993, -162825, -376641, 24870, 125369, -14178, 169967, -41810, 90640, -152411, -17807, 95039, -219509, -116463, -168642, -228491, 135541, -139103, -48664, -154450, -55584, 414953, 39527, 327885, 129385, 245134, 22205, 113674, 65201, -167069, -199328, 98228, 40403, 89581, -79878]
18707b56500P2664f6966C04642E1584b18421k14330c7284j05809I2983R314C22
18695g8891j2872H0794k0854K06476a19869c3220D049b1788A77321b82032e0101
18683a76142G953K71088I9934b02904R568M6484O7350r616j42800F3256L57704
18672D20960a14554A04794D9198i5074l747J9661k7919C06670d61121a80689e9637
18660d3023B57839b20838A26432c51710J54273I9012B8257n551b1897A16237b66837
18648d25248H1613c55716a20666A90346p99A211K37874E9298b98731C6344e8750
18636C8741d356E5985b39610B8554c5744j05517A30152h9329G7910b67681a25054
18624c16145b8509A38422d39243J72557D1424e015k94229A87373m4722O8561J34696
$$ y = [-256500, -183836, -66966, 304642, 51584, -218421, -432751, -37284, -143093, 92983, 102297, 322, -78891, -91763, 80794, 59940, 266416, -119869, -33220, 4049, -21788, 177321, -282032, -50101, -176142, 7953, 279041, 99934, -202904, -193336, -146852, -79502, -89118, -231918, 63256, 420960, -114554, 104794, 49198, -95074, -98821, -79160, -107079, 306670, -461121, -180689, -59637, -43023, 257839, -220838, 126432, -351710, -197437, 99012, 28257, 22706, -21897, 116237, -266837, -425248, 81613, -355716, -120666, 190346, 189547, 1211, 239085, 59298, -298731, 36344, -58750, 38741, -4356, 55985, -239610, 28554, -35744, -141261, 130152, -89329, 77910, -267681, -125054, -316145, -28509, 138422, -439243, -266686, 41424, -5015, -299244, 187373, 142651, 211212, 345908]
18613C45908I8977a03003A46108b22946A09921A2755a19392A47728l6686a53600
18602D4381b32231a01173A63692b76347e4080l88291A61240d8634K166A55798
18591A91215C7139j5335J15660f230r2868l8002C3232b11306A86171a24517k09326
18580c33843a65021B1293a2437k01082m1484i4525j3115m8802F4204J5311J49649
18569B29164g3869P664j47576a9599A65803b80705a9706k5511C9911B193i2792
18557B88921b4556A03755a88831r4921a13970p3514C21340a0515j97591a01865
18546a84427F9287b54187l9881C25319A40402b33079G9080c30717k8206f2737
18535b30993c840D7929f3435K2419k37166L8238J06981f0772j43045H4779b07100
$$ y = [345908, 98977, -103003, 146108, -222946, 109921, 12755, -119392, 147728, 111042, -153600, 44381, -232231, -101173, 163692, -276347, -54080, -442371, 161240, -48634, -46468, 155798, 191215, 37139, 21804, 137464, -6230, -99098, -137100, 33232, -211306, 186171, -124517, -333843, -165021, 21293, -12437, -213519, -255003, -94525, -107640, -156442, 64204, 79515, 229164, -73869, -66205, -213781, -19599, 165803, -280705, -19706, -45217, 39911, 2193, -92792, 288921, -24556, 103755, -188831, -283752, -113970, -187484, 321340, -10515, -208106, -101865, -184427, 69287, -254187, -294068, 325319, 140402, -233079, 79080, -330717, -358923, -62737, -230993, -3840, 47929, -63435, -41016, -278182, -239944, -132963, -60772, -203817, 84779, -207100]
18523b13319B8229d1496h308k35707C2667b3401j01564D0207J03822e8287B03115
18511e3649D5793b13295f9194p5306F4300a39319A30427a02397a50F1186b22496
18499G7282J3288l7030a2332j91642B13762a45099G4620b4593k26550B9487L76
18488B9863a68790e923j20713L6324j99549g4344k14861C22939C5597a48082A00813
18476a35332n1514b0847j81692J2446I0594M4447o4229c5602k0012o9271l6461
18465a61346j03474I779a19501j5537D0585a96014e3017p090j14177d1877l3749
18454g5626D5711g5900E8837c56322a6964H642a55444A27198f146j57818l3384
18443a97348a7802j91427C6368a25930l22205B76184d6192a9115k53401H8846
$$ y = [-213319, 28229, -41496, -8308, -244015, 32667, -23401, -124965, 40207, 144029, -58287, 203115, -53649, 45793, -213295, -69194, -144500, 64300, -139319, 130427, -102397, -150, 61186, -222496, 77282, 90570, 53540, -12332, -203974, 213762, -145099, 74620, -24593, -251143, 29487, 29863, -168790, -5923, -126636, -90312, -289861, -74344, -289205, 322939, 35597, -148082, 100813, -135332, -186846, -20847, -202539, -190093, 90594, 135041, 70812, -35602, -55614, -124885, -161346, -264820, 9779, -119501, -135038, 40585, -196014, -53017, -60107, -174284, -41877, -75626, 45711, -75900, 58837, -356322, -16964, 8642, -155444, 127198, -6146, -163964, -197348, -17802, -209229, 36368, -125930, -448135, 276184, -46192, -19115, -272516, 88846]
18432f6142j17900B67892c72075B6701b7924C2532K66309a4666D17023d2288A38699
18420B62445f9655J336B54187j12705J58562a01237A7813J7538a35109I8621J26553
18409B25174c49498A00585a90231B20776C0192a10326L3343C09929a60998k29961
18399c90959B23600B5440a22041I2832c01907A97214H5413J12403J28385b10258
18388I646a96745N3304p3283C9775Q3741a72216j26356a3622C52352g7854l13625
18377c91479a53932B43029A11802a09181B297J49100M4814c1840o6161A35103
18366d4182k18500B26029g8211l5185l2635e012G4474J0939J6743a13308E0774
18354h2015A85877a45351H1028M14505D0766L01222d4584C6491g1404j78102B2159
$$ y = [-66142, -184042, 267892, -372075, 26701, -27924, 32532, 298841, -14666, 417023, -42288, 138699, 262445, -69655, -68319, 254187, 141482, 300044, -101237, 17813, 35351, -135109, 98621, 225174, -349498, 100585, -190231, 220776, 30192, -110326, -76983, 309929, -160998, -390959, 223600, 25440, -122041, 92832, -301907, 197214, 85413, 197816, 326201, -210258, 9646, -196745, -143441, -216724, 39775, 123516, -172216, -298572, -13622, 352352, -77854, -391479, -153932, 243029, 111802, -109181, 2297, 151397, 196211, -31840, -98001, 135103, -44182, -262682, 226029, -78211, -113396, -146031, -5012, 74474, 85413, 102156, -113308, 50774, -82015, 185877, -145351, 81028, 495533, 40766, 341988, -44584, 36491, -71404, -249506, 22159]
18342b52244a3622a15j61058e3403j16277D53149b9730m675p7491A75580d3473
18330B6298J11878a10467K1486E5502i0980j29864I6698b16515k3444C8164J53568
18319A91732n8659o1203a08428j32941K0614h8477o588j22307A05929b06379q2469
18308b88848B21652n9439f5236k80672E0358d0116j89952J6746P6493A06198A3581
18296b9529B3399a74492H0796j0009N04518A99134o7809B8637e528m28379b9272
18284a63811B56363h0401r664j15809B0021a11732o4118o7011j17642i5126E4632
18272b2131A30835d8645B38807d9204A28695a06603j1184F7614a69556j23005
18262b92561B60575h6463l5672B24958e3175A41650J6438K75M6977b77472J34809
$$ y = [-252244, -13622, -115, -161173, -53403, -169680, 453149, -29730, -34405, -111896, 175580, -43473, 26298, 138176, -110467, -88981, 55502, -90980, -220844, 96698, -216515, -239959, 38164, 191732, 133073, 71870, -108428, -241369, -220755, -88477, -95065, -217372, 105929, -206379, -288848, 221652, 162213, -65236, -345908, 50358, -40116, -230068, -213322, -136829, 106198, 13581, -29529, 23399, -174492, 80796, 70787, 575305, 199134, 131325, 28637, -5528, -433907, -29272, -163811, 256363, -80401, -90065, -205874, 20021, -111732, -175850, -242861, -360503, -95126, 54632, -22131, 130835, -48645, 238807, -49204, 128695, -106603, -117787, 67614, -169556, -292561, 260575, -86463, -122135, 224958, -53175, 141650, 158088, 158363, 205340, -277472, -142663]
18251a42663E3031a16911L5202k2098A6908d6676j13535j40024k93a36948J6370
18240a20578L1066l8051K802j70671Q1676G7114C3316b27119B86473b3484A55624
18228d40612A33301a12632b0169n187H053f3907m5085a2923N377j21721H6318
18216b38839Q1844O5944A83239a21130q967A38604a22677j34890C38902A16255
18205f9777k88102A07813K4908a62470g2096l0239j6783m5240q4791Q110C40740
18193a52348A98909j7082a94272d5309l0505A96889b57750A8670K17316I8397
18182g4619m39652I7489a91181b5252j04033A9331c85558A49718a34643A99849
18171b05979d4981A45262h4508R325A62517J23534a38309G8062b14796D8288d54456
$$ y = [-142663, 53031, -116911, -81709, -103807, 16908, -46676, -160211, -300235, -300528, -136948, -120578, -89512, -127563, -124761, -295432, -213756, 77114, 33316, -227119, 286473, -23484, 155624, -440612, 133301, -112632, -20169, -25356, 8053, -63907, -108992, -12923, -7546, -129267, 86318, -238839, -156995, -91051, 183239, -121130, -130097, 138604, -122677, -257567, 338902, 116255, -69777, -357879, 107813, 132721, -162470, -72096, -102335, -119118, -164358, -249149, -241039, 340740, -152348, 198909, 181827, -194272, -45309, -75814, 196889, -257750, 18670, 235986, 98397, -74619, -514271, 97489, -191181, -25252, -129285, 19331, -385558, 149718, -134643, 199849, -205979, -44981, 145262, -84508, -75183, 162517, 286051, -138309, 78062, -214796, 48288, -454456]
18159I4532J34378h8026C13467C0078f7186K0012m3512B14169g4789j50916B88593
18147c33739B18226n8717a57725E39669a55072r1306A92552D7189Q1527b23964
18136D6646a00997j86636D5909c01304J17715e4907D72427a19526L7999G4291
18125B2361J93027a86290D29b17586A09201d8135m9413k19828D1160i1100E4360
18113i4436B01179b5037l71642J59922d8090l3041A29427a39755k55961A96724
18102C48621g3958k36298g0597A88949b46772C38859e3325I9948i6354b2151J0443
18091a1708A05576h2949c6861k34435i1318H2057a77782G6717J7064b63088n6251
18080c19339g7822L1253j52410C94432c0150E2491i6268A75463a3687B97721f0014
$$ y = [94532, 228910, -88026, 313467, 30078, -67186, -47174, -90686, 214169, -74789, -225705, 288593, -333739, 218226, 159509, -157725, 539669, -155072, -246378, 192552, 47189, 128716, -223964, 46646, -100997, -287633, 45909, -301304, -183589, -54907, 472427, -119526, -81527, 74291, 22361, 215388, -186290, 429, -217586, 109201, -48135, -97548, -317376, 41160, -91100, 54360, -94436, 201179, -25037, -396679, -236757, -48090, -81131, 129427, -139755, -395716, 196724, 348621, -73958, -310256, -70597, 188949, -246772, 338859, -53325, 99948, -96354, -22151, -11708, 105576, -82949, -36861, -271296, -91318, 82057, -177782, 76717, 93781, -263088, -319339, -77822, -46569, -198979, 394432, -30150, 52491, -96268, 175463, -13687, 297721, -60014]
18068B56357B6758M5997b18433E3606f0772A7369J14178b72132B9562J06065a2567
18056e1982m2016D5738a8066r2682j46033a4924A48830d6977e705A90979A8244
18044b7024j00555J7805r5102H6198c63997B10079H0966J2008a38768r1537O5725
18033a64580a5600A94733a35146J7751N1449p1103l810j04792q6909g3505J9503
18022e4002B43008o9012E5036J61305C4958a74286D5940a47B04256d5499A1660
18010f1034q164k49411B23425G7693J59448b78137D0628c8627l5725H5648h8514
17998b27779a03451k47311A1533h9317b00j99434M5837e6224l32D3379f9932k18157
17986b88089A39417c48796H9675b9049j24703A60889c11927O3930i4730j3267
$$ y = [256357, 26758, 72755, -218433, 53606, -60772, 17369, 131547, -272132, 29562, 135627, -12567, -51982, -93998, 45738, -18066, -110748, -256781, -14924, 148830, -46977, -5705, 190979, 18244, -27024, -127579, -109774, -204876, 86198, -363997, 210079, 80966, 92974, -138768, -230305, -164580, -15600, 194733, -135146, -117395, -65946, -137049, -140859, -245651, -332560, -73505, -54002, 243008, 173996, 55036, 216341, 34958, -174286, 45940, -147, 204256, -45499, 11660, -61034, -69198, -318609, 223425, 77693, 237141, -278137, 40628, -38627, -74352, 85648, -88514, -227779, -103451, -350762, 11533, -89317, -200, -199634, -153797, -56224, -56556, 43379, -69932, -288089, 139417, -348796, 89675, -29049, -153752, 160889, -311927, -247997, -94730, -107997]
17976a07997j01179K2965G5008P1490A2270K13616r2210N9357B4198c1098A33493
17964A95277a07423p0336K4046j5514F8162j355b03489g8295o6527A92495c46749
17952F4589A6781a30885A26890a22505A87117D2001N2462a07023A97532J02936
17942C00468l7559G6512b22870d4429j93163K3341A07956f971n9783B08755c54343
17930B2070b15266B30916b5674P542F6015b67776A05735b79594k9300J18215O7293
17919a23386G692b54144o702A11908d7138j62271H0161Q5220b04077N6370D8496
17907b2226r4890C2839a51697e1910I1290c8956A59768f05C83914a23939B14926
17895F6747b05957Q8471A54330C8472b78633B69839o1618a5084G5065J48929a65305
$$ y = [-107997, -209176, -186211, 75008, 146498, 12270, 225886, 133676, 193033, 24198, -31098, 133493, 195277, -107423, -177759, -153713, -169227, 68162, 66807, -203489, -78295, -144822, 192495, -346749, 64589, 16781, -130885, 126890, -122505, 187117, 42001, 94463, -107023, 197532, 300468, 262909, 76512, -222870, -44429, -237592, -214251, 107956, -6971, -66754, 208755, -354343, 22070, -215266, 230916, -25674, -18132, 66015, -267776, 105735, -279594, -308894, -190679, -123386, 7692, -254144, -260846, 111908, -47138, -209409, 80161, 165381, -204077, -147707, 48496, -22226, -117116, 32839, -151697, -51910, 91290, -38956, 159768, -605, 383914, -123939, 214926, 66747, -205957, -117486, 154330, 38472, -278633, 269839, 208221, -15084, 75065, 223994, -165305]
17883A37836N9205M3310b4663B69567b33621d9468p5560M385j03779B55544b44899
17871A52400C6711b55879h417j03228B91268a37050F1712J89902d4561A30140
17860a20776C31050g500k47158c5009n5498B81121I5625Q0205J35526J09742F7740
17848G1616b86385h8531m7783A62381d3853m293j76845P3858F9908e6470P323
17837d9147k13036K2057f1049n7185q5167j30645a50340H7503k4952L74759j96275
17826B41035l7252q2375d2225a9225o0905l4691A7342R8473c64757A60779d0685
17814c04311E05917a11223a4327l0825a0249l03074A45879n5770c5588F449f0543
17802C75179b59174A08283l259d65877c8823D1352b62791g3118B25117H7486l5921
$$ y = [137836, 197041, 240351, -24663, 269567, -233621, -49468, -125028, -120643, -224422, 255544, -244899, 152400, 36711, -255879, -8417, -111645, 291268, -137050, 61712, 251614, -44561, 130140, -120776, 331050, -7500, -254658, -35009, -90507, 281121, 95625, 175830, 311356, 421098, 67740, 71616, -286385, -88531, -136314, 162381, -43853, -48146, -224991, -151133, 69908, -56470, -49147, -262183, -240126, -61049, -118234, -203401, -334046, -150340, 87503, 62551, 437310, 241035, 203783, 121408, -42225, -19225, -80130, -114821, 17342, 115815, -364757, 160779, -40685, -304311, 505917, -111223, -14327, -45152, -10249, -313323, 145879, 90109, -35588, 6449, -60543, 375179, -259174, 108283, 105024, -465877, -38823, 41352, -262791, -73118, 225117, 87486, 51565]
17791E1565a94528L8299A00989j3054b24425A22808b48328J7806A61245g4728
17780c14835A40755b77292i526j11452R573e1640j91518c3200f496A11861E2093
17768I0659c4724A85362C5629L73659j61217j6084a52155B12681A04440c8568
17757a2860A65391n0527b22191A8117J39981E3915P5406L8431a65882p2206c0958
17745a02020k77622B8439c48085e7425j53206G1471a27744A44499n341M9695n2762
17734A36091o0872h0174C338a26570r9C08136j50000f8020B9930J47720A8474
17722a57151H2333a94361m5182A90231E8358L05907j58174i0186j17471G2107
17711A10986R8574c14247H6548l8913h1233B34237j9901a85223C4637a52758j05476
$$ y = [51565, -194528, -156229, 100989, 87935, -224425, 122808, -248328, -230522, 161245, -74728, -314835, 140755, -277292, -9526, -120978, -111405, -51640, -243158, -33200, -6496, 111861, 52093, 90659, -34724, 185362, 35629, 409288, 248071, 231987, -152155, 212681, 104440, -38568, -12860, 165391, 114864, -222191, 18117, 158098, 53915, 129321, 167752, -165882, -238088, -30958, -102020, -379642, 28439, -348085, -57425, -210631, 71471, -127744, 144499, 139158, 188853, 136091, 75219, -80174, 3338, -126570, -126669, 308136, 158136, -68020, 29930, 177650, 18474, -157151, 82333, -194361, -239543, 190231, 58358, 364265, 206091, -90186, -207657, 72107, 110986, 209560, -314247, 86548, 47635, -81233, 234237, 214336, -185223, 34637, -152758, -258234]
17700b58234A32562a71469I0739a27803D50025C8698a46446D54207B10773m9193
17690A61580a28497A2248h5165o4773e2930A68190a23482A14691O0259p3350g5629
17678f1848l004j5846A54568g6965C1080b86539a02545C6890J2064a82092E0969
17666E6738K38599a74398Q3115H1348d3179f984o2659A49654F8589j8835c04346
17654A00967N6679F4418L0874H36O9346J46363l3056L0083D2652g2098A1222M3713
17642E4935k3512a15596A71704L2130E7556A5443b76060A14088c93182J84941
17632b08241C839K48737M483p3176a04942j43531H0152b46577i4822A84242i2224
17620A22066a38720I4207m2902a81051M2710B45440A14731P1579L8457h58k59683
$$ y = [-258234, 132562, -171469, 90739, -127803, 450025, 38698, -146446, 454207, 210773, 161580, -128497, 12248, -85165, -149938, -52930, 168190, -123482, 114691, 174950, 101600, -75629, -61848, -64852, -80698, 154568, -76965, 31080, -286539, -102545, 36890, 48954, -182092, 50969, 56738, 295337, -174398, -91283, 81348, -43179, -6984, -69643, 149654, 68589, 49754, -304346, 100967, 157646, 64418, 95292, 836, 70182, 216545, 183489, 213572, 42652, -72098, 11222, 54935, 31423, -115596, 171704, 203834, 57556, 15443, -276060, 114088, -393182, -208241, 3839, 252576, 257059, 183883, -104942, -248473, 80152, -246577, -94822, 184242, -92224, 122066, -138720, 94207, 51305, -181051, -138341, 245440, 114731, 186310, 224767, -858, -260541]
17609b60541Q4895p3833A11526M26456f5904j1550A09728a81044O0487C31526
17598b534q6900B39037C5799J69821b24974f0357o5338I4273J60317G7680b08189
17586a84118R1646A76357o0554a59435q7771A82387K43047b5625I3134N2784K39766
17575C85684q1395F8931M00553A87544J80022a68292A51634b76747h107A78813
17564b53502C07741A18278d48384G0509j189k8901M8621b20837A25568M1199J80186
17553C46953B599L3642i1582F9041a74321P5443D9388J05464e5714A65406q0803
17542H4603Q3060b3981Q650B90975b04220A97492E6724M87941A34028h8026o3321
17531a51347f6344H1098j327k38g2284A23189c5613A88187K03043j29049a19596
$$ y = [-260541, -175646, -249479, 111526, 537982, -65904, -77454, 109728, -181044, -120557, 331526, -2534, -89434, 239037, 35799, 205620, -224974, -60357, -125695, 94273, 254590, 77680, -208189, -184118, -92472, 176357, 115803, -159435, -247206, 182387, 425434, -25625, 93134, 145918, 385684, 304289, 68931, 469484, 187544, 367566, -168292, 151634, -276747, -8107, 178813, -253502, 307741, 118278, -448384, 70509, 69320, 40419, 89040, -220837, 125568, 166767, 346953, 2599, 36241, -91582, 69041, -174321, -98878, 49388, 154852, -55714, 165406, 84603, 167663, -23981, -15331, 290975, -204220, 197492, 56724, 544665, 134028, -88026, -151347, -66344, 81098, 79771, 79533, -72284, 123189, -35613, 188187, 391230, 262181, -119596]
17519f2175F3731K12656A23125K6347c62427e1156E3525k2984K78582c0150q985
17508c9135G8479J20613b0390q7430C53074b4742B32193a77804H2327e031A03094
17496a33612I609K6708J02099a19846C4230K685K44626a1274B8504c5688B63569
17484C35541j66358b20337b931k21270C30161A24104b00026C44808b7811E4902
17473B34040n1091g4568K6975H2636J06974o518m3222d197A83684a61260C19532
17461A63266E1560J28894f173A38235p567K32677G1483d5328C61188j01666l0267
17450B29255r7497Q6171J65917J96145k40666B6232K66763p1815E8102L83003
17440D41105j68785J47914j37747N9780e244j60640B47537J11770B2512L73115
$$ y = [-62175, 63731, 276387, 123125, 149472, -362427, -51156, 53525, 30541, 309123, -30150, -39135, 78479, 199092, -20390, -107820, 353074, -24742, 232193, -177804, 82327, -5031, 103094, -133612, 9609, 36317, 138416, -119846, 34230, 36915, 281541, -11274, 28504, -35688, 263569, 335541, 169183, -220337, -2931, -224201, 330161, 124104, -200026, 344808, -27811, 54902, 234040, 182949, -74568, -47593, 82636, 189610, 183092, 139870, -4197, 183684, -161260, 319532, 163266, 51560, 180454, -6173, 138235, 130668, 363345, 71483, -45328, 361188, 259522, 229255, 131758, 217929, 383846, 579991, 339325, 26232, 292995, 221180, 58102, 441105, 272320, 420234, 282487, 342267, -5244, -165884, 247537, 359307, 22512, 395627]
17430C95627A88769M8441M58758A92247O2680K83370k55348A12412J51660K56046
17420E20118A20153J86878E6022L15802j18021L9739R3896R4814A4343J50690
17410A65033o2132E1229O9996b6972c982B58430a29926B91908c7213n0784a6122
17398C36717e1220a992A13062K23715A0642a60571A40218l5889P4740a0094B41896
17386a30304C92320j78869M6463p2365Q6435A7019L61611A80334K21657c7151
17375h7675A90163O0430A08891a7300B30332J20128i1679B63764D9346j1297a3667
17363A25672f5981m0300A52532a74795B19862J17919D1638R3307F1519N8026J14292
17352B33837D3806b1541k56845D12375o7042C6894a20271B67816K61461a37311
$$ y = [395627, 188769, 237210, 695968, 192247, 254927, 538297, 282949, 112412, 264072, 520118, 120153, 307031, 56022, 371824, 253803, 293542, 387438, 482252, 14343, 165033, 102901, 51229, 121225, -26972, -3982, 258430, -129926, 291908, -37213, -87997, -16122, 336717, -51220, -1992, 113062, 336777, 10642, -160571, 140218, 104329, 179069, -10094, 241896, -130304, 392320, 213451, 259914, 187549, 273984, 17019, 378630, 180334, 401991, -37151, -87675, 190163, 250593, 108891, -17300, 230332, 350460, -91679, 263764, 49346, 38049, -13667, 125672, -65981, -106281, 152532, -174795, 219862, 337781, 41638, 134945, 61519, 119545, 233837, 43806, -21541, -278386, 412375, 345333, 36894, -120271, 267816, 529277, -137311]
17341H6756j8460g6103B49447b4067r2A03530b5248H6245J71817O6468l6141a21759
17328B35455m2299J58235F8222h1467A29076N3483J53875A30002G8K53567N9347
17317C12992r1355A0803h4199C94808O4670h1965C568g4967N596F2347P5161J15215
17305B52723A08709b7984A90464o5188J04769A03618a48613B15886J9287A8493
17294E7443J27242a00377D11302C1500c2297j54650C14999A06462e0642B58199
17283B52699A13347C3943a42561B91116m2981j17502i3115A23310K23439N0414
17273C97163A34920J20813A02087b60739A45193b11322A84362k6974P124D7543
17262A90242j1785N2379A00339l2472J29637K09849A51568Q9379G1616M7713J96707
$$ y = [86756, 68296, -76103, 249447, -24067, -24159, 103530, -25248, 86245, 258062, 324530, 288389, -121759, 235455, 193156, 351391, 68222, -81467, 129076, 182559, 336434, 130002, 78, 253645, 312992, 221637, 10803, -84199, 394808, 459478, -81965, 3568, -74967, -69371, 62347, 137508, 252723, 108709, -27984, 190464, 125276, 230045, 103618, -148613, 215886, 235173, 18493, 57443, 184685, -100377, 411302, 31500, -32297, -186947, 314999, 106462, -50642, 258199, 252699, 113347, 33943, -142561, 291116, 248135, 130633, -93115, 123310, 346749, 397163, 134920, 255733, 102087, -260739, 145193, -211322, 184362, 157388, 164512, 47543, 190242, 178457, 230836, 100339, 67867, 197504, 407353, 151568, 240947, 71616, 119329, 316036]
17251C16036j5216q1286J75993A60758J74526j25928H6445J82465D8660L16123
17241C64783K7672A21539L55925N1224A73353G3449i8650A04334J12186b27611
17230A26314e920A68455O3227q4140K03250q3146l1867K24763j11866A53111K99194
17219D52305j73686J8391r5633c2779C4767K55213K5387A46442J38483A7187L7724
17208E4911N5921m7355M08388n6467j50706G5742K71567J5619K20619D9863b7508
17196F0187N3479n5087J84039J65099B8648J75527E4000L76720a49335A71190
17185I5112J01825R1154J24046c4540C23694j27011J10515A11261J4428K30062
17175C55751J65163I3542c8790D17980j14862j47828K12675A65804q1472M31604
$$ y = [316036, 300820, 219534, 395527, 160758, 335284, 209356, 86445, 268910, 48660, 364783, 392455, 121539, 477464, 528688, 173353, 73449, -98650, 104334, 216520, -227611, 126314, -5920, 168455, 231682, 147542, 350792, 267646, 235779, 460542, 348676, 153111, 452305, 278619, 297010, 201377, -32779, 34767, 289980, 315367, 146442, 284925, 17187, 54911, 110832, 63477, 471865, 415398, 264692, 75742, 347309, 362928, 583547, 49863, -27508, 60187, 113666, 58579, 242618, 407717, 28648, 204175, 54000, 430720, -149335, 171190, 95112, 196937, 288091, 412137, -34540, 323694, 196683, 307198, 111261, 125689, 355751, 520914, 93542, -38790, 417980, 303118, 155290, 367965, 165804, 84332, 515936]
17165E15936A46205L2824Q66J05428L3330R2460N0570A66469K30344A5291L53771
17154C69062A28809K91634P0737H3430L80808G4940K10207K36457A54965L81612
17144E36577q0387j60864r9899P8398k6734H3910L68913j98418M9988J56980A56071
17132B17862M1829L7994R3868A22925Q5860J30594J41761k02795P7962J02124
17122D58431A46162E7385M41804A33795K72815j24932b6236D70555J81572p5738
17112E76389j54485I3028P9447r429J77036j35494L29860A39039L22646j60080
17102C01605O2302l4807J06479L51716B83941L29202B92058N2475l8739l5550
17092B70244K1163J15559J0587J24808k37541K10082A87081K26405l5537J74570
$$ y = [515936, 146205, 179029, 179895, 285323, 318653, 411113, 461683, 166469, 396813, 15291, 369062, 128809, 420443, 491180, 83430, 464238, 74940, 285147, 521604, 154965, 536577, 456190, 295326, 195427, 273825, 247091, 83910, 452823, 254405, 304393, 461373, 156071, 217862, 259691, 297685, 391553, 122925, 208785, 339379, 481140, 278345, 356307, 458431, 146162, 57385, 499189, 133795, 406610, 281678, -26236, 470555, 652127, 576389, 421904, 93028, 172475, 163046, 340082, 204588, 534448, 139039, 461685, 301605, 363907, 329100, 435579, 787295, 283941, 613143, 292058, 344533, 305794, 270244, 291407, 406966, 417553, 542361, 304820, 514902, 187081, 413486, 377949, 552519]
17082E52519P9631A02806K63085j72403J94426J49170j8598B25990q1860L79273
17072E23403p3385J99543C19116K03866k04782J13490L25573C58549G1859N23714
17062E95573J8685P2777k17937L46180C61302L83720L0529A89184M59424l21962
17052C26646M74564C66389J54614K99278k54737j44651M41593k75040k12261K86648
17042F61833Q521k52553K19817k24941j2236K91831r6218j14080K3718K66825
17032G72517k49343j37513L51106l33488K7223M96047J33378m65355n2820J73845
17022G15597J362k41590J30498a7443H86038l96658N159p9986J78341L5445K11551
17011H39890j64121l4324K76688k07932l19619K47239K57235j95662K68268j31489
$$ y = [552519, 632150, 102806, 365891, 193488, 387914, 537084, 518486, 225990, 144130, 523403, 450018, 649561, 319116, 522982, 318200, 431690, 757263, 358549, 71859, 595573, 614258, 687035, 469098, 815278, 361302, 745022, 775551, 189184, 648608, 326646, 801210, 366389, 521003, 820281, 565544, 420893, 862486, 587446, 375185, 661833, 670354, 417801, 637618, 412677, 400441, 692272, 596054, 481974, 505692, 772517, 523174, 385661, 736767, 403279, 430502, 926549, 1059927, 594572, 541752, 715597, 716959, 475369, 605867, -17443, 886038, 489380, 494539, 414553, 592894, 628339, 839890, 675769, 641445, 918133, 710201, 390582, 637821, 895056, 699394, 967662, 836173]
17001H36173J06966p9655k90585L90363r1647l68308J68576K31266k98297K13414
16991H18266j80735P6677K77239m41979j8289K51582K24064j96227P2773r0123
16981G93248J11309O1391p0118K23683P2346n09549K42112L19484n73371J73169
16971H43704K10399j23176J65543J05316l74681L27730J0637J23641m47374L34957
16961A176696j15655o8335P1398L2683l5481J92039m92052m7352N20958q4720
16951A150179j91547k04729K05539K29411K26478n5040n91329K52085K16636n6430
16941A181253j78259M8009Q2552n9857J07268k33627N0310M18341p0849k41876
16931A103265J73886N7305p7355J69161j06487K9406k34169M08488j04474k41460
$$ y = [836173, 943139, 863484, 572899, 963262, 871615, 503307, 671883, 903149, 604852, 818266, 637531, 714208, 991447, 549468, 531179, 782761, 1006825, 810598, 883371, 793248, 904557, 965948, 895830, 1119513, 1191859, 682310, 924422, 1243906, 670535, 843704, 1054103, 930927, 1096470, 1201786, 827105, 1154835, 1165472, 1289113, 841739, 1176696, 1061041, 992706, 1064104, 1096787, 1061306, 1253345, 761293, 713941, 1234899, 1150179, 958632, 753903, 959442, 1188853, 1415331, 1360291, 768962, 1021047, 1237683, 1181253, 1002994, 1051003, 1133555, 1073698, 1180966, 947339, 997649, 1415990, 1345141, 1103265, 1277151, 1334456, 1257101, 1426262, 1319775, 1349181, 1115012, 1523500, 1419026, 1177566]
16921A177566J25656K18674k50712n4789M67510k71332j73585L64527j82143J2130
16911A433502K34652l21998J70187P8059J32621J52021R5964j75001m28033M47056
16901A819030j17394K58111K55875m63390K25656k66278J31689K09909n7770J51794
16891B147232k71378k37073M99568L1538O5130o6896P7640M61741n33883J33431
16881B307050L94767l92805r3386K83752l66248J9373K13742J91399j49245m6877
16871B361522J10574L43734l65420J20642j12709L80153p2182j7862O8361K60280
16861C077093j49801L11975j42560K20165j07697M904j20332K47350K9647P0597
16851C441341j43530J3214k9841K67573j44248L41836j68059L47371J8347L3606
$$ y = [1177566, 1303222, 1521896, 1271184, 1216395, 1683905, 1412573, 1238988, 1603515, 1421372, 1433502, 1668154, 1346156, 1516343, 1594402, 1727023, 1879044, 1975008, 1800007, 1371974, 1819030, 1701636, 1959747, 2215622, 1752232, 1977888, 1711610, 1843299, 2053208, 1995438, 2147232, 1875854, 1638781, 2138349, 2169887, 2235017, 2168121, 2245761, 2707502, 2173619, 2307050, 2701817, 2309012, 2215626, 2499378, 2133130, 2152503, 2366245, 2557644, 2408399, 2361522, 2472096, 2815830, 2450410, 2571052, 2458343, 2838496, 2766314, 2748452, 2816813, 3077093, 2927292, 3239267, 3096707, 3316872, 3209175, 3214079, 3093747, 3341097, 3370744, 3441341, 3297811, 3311025, 3281184, 3548757, 3404509, 3746345, 3578286, 3925657, 3944004, 3977610]
16841C977610j17804o7044L22639O8020P4933J69054j55286J89011m3298N27430
16831D945265n25565J52081o2617M29506N2601j12384M26459K3159j29780q4072
16821E114653K07414M72545j5793j35951K27020J31934L3929K25899j45169L82442
16811F498923m7278M94384l69185O22564K15539l06247K67647M72261K02741K01558
16801H252907m3169K05521J45136J40151N44813j53183L67205M18697o7535M15211
16791A0225754K89600K68918J56722P16493J40864K89023Q5006N40953M37353
16782A3150686J84305L02702P41068R8374P43406K25312M24270P67531L32105
16773A6969759O10426Q26508N62171M74990Q56835O70111Q65765O57333Q63283
$$ y = [3977610, 3859806, 3792762, 4115401, 4183421, 4258354, 4427408, 4272122, 4461133, 4417835, 4945265, 4419700, 4571781, 4509164, 4938670, 4991271, 4878887, 5305346, 5328505, 5198725, 5114653, 5322067, 5794612, 5778819, 5642868, 5869888, 6001822, 6035751, 6261650, 6116481, 6498923, 6451645, 6946029, 6576844, 7199408, 7414947, 7108700, 7376347, 7848608, 8051349, 8252907, 8209738, 8415259, 8560395, 8700546, 9245359, 9092176, 9459381, 9878078, 9810543, 10225754, 10515354, 10784272, 10940994, 11657487, 11798351, 12087374, 12172380, 12713333, 13150686, 13334991, 13637693, 14378761, 14477135, 15220541, 15445853, 15870123, 16637654, 16969759, 17580185, 18406693, 18968864, 19443854, 20300689, 20970800, 21836565, 22493898, 23357181]
16764B3357181L41705J449537Q95136J094233N51018J492776R60453J505074J471262
16755C3118375J039164J907432J550520J539381J866847K092757J928538J985887
16747D7028901K033467K583266K890307K715545L081316K956074L296700L507754
16739G0093330L935790M414582M324592M641093M644122N240057N181707N588150
16731A08063423O165129N668184N897520N784839O491064O052419N603460N687825
16723A55413863M888225M636384L480832L089197J577052J437542L26760r86079
16715A73863776j896448k715602m023832m002327n067192n354778o042338n804700
16707A38956559o013821o376256n959231o361039o156037n595383n374232m853770
$$ y = [23357181, 23698886, 25148423, 26043559, 27137792, 27688810, 29181586, 30142039, 31647113, 33118375, 34157539, 36064971, 37615491, 39154872, 41021719, 43114476, 45043014, 47028901, 49062368, 51645634, 54535941, 57251486, 60332802, 63288876, 66585576, 70093330, 74029120, 78443702, 82768294, 87409387, 92053509, 97293566, 102475273, 108063423, 114228552, 119896736, 125794256, 131579095, 138070159, 144122578, 149726038, 155413863, 160302088, 164938472, 168419304, 171508501, 173085553, 174523095, 174849855, 173863776, 171967328, 169251726, 165227894, 161225567, 156158375, 150803597, 144761259, 138956559, 132942738, 126566482, 120607251, 114246212, 108090175, 102494792, 97120560, 92266790]
16699I2266790n057756m799764m565588m413452l866682l395193l651305l236547
16691E9280503k990240k831412k963042k110798k361862k479645j861363k041044
16683C9641097j601460j934235j566973j253975j503701j769798p91443j403919
16675B7815593j220346r82329j139849r48013r77157m26170j094716q22031m63127
16666A9741855r74133m61145r12240j27407p72169n04599m74698k84229p29844
16657A4501391l37593l60808o17833j24574n44840n57005k38641m14209k55998
16648A1049890j16740n27996m59851l5525J95076n76411n59640Q887k00794m11446
16638H365450l58489L31441o2494l88517k12016k98681J46175m66801o4974n50580
$$ y = [92266790, 87209034, 82409270, 77843682, 73430230, 69563548, 66168355, 62517050, 59280503, 56290263, 53458851, 50495809, 48385011, 46023149, 43543504, 41682141, 39641097, 38039637, 36105402, 34538429, 33284454, 31780753, 30010955, 29219512, 27815593, 26595247, 25612918, 24473069, 23525056, 22547899, 22121729, 21027013, 20204982, 19741855, 18767722, 18306577, 17394337, 17266930, 16494761, 15990162, 15515464, 15231235, 14501391, 14163798, 13802990, 13185157, 13060583, 12515743, 11958738, 11720097, 11305888, 11049890, 10933150, 10405154, 9945303, 9909778, 10104854, 9528443, 8968803, 8977690, 8776896, 8365450, 8006961, 8338402, 8275908, 7887391, 7675375, 7376694, 7522869, 7056068, 6991094, 6440514]
16628F440514J69744p7783k68096j52095l56271K86321K15074l69567m08321J96221
16618E675741k87977r0898J32698j62193r5266k58147l4771J19200m44013N2764
16608D607138L0737q03185N06651K0550n11969J85684k13750m5426j60998L20519
16598C935951k25184j4965j45383k77695L56092j54429j30434J9140l09379j49162
16588B904552L56872j86015j68836j83680L13284r3407j24051j32715K25766j91814
16578B719956l2870k04120j35010K46488P3154j78810k12552J11206J76669k24598
16568B339513J7213j28592J6735K04149L0841k23794k53181j43884j42134N92080
16558B308946m38865J19340j90596p3548Q3007k18769K84605j34229L29243n89727
$$ y = [6440514, 6610258, 6532475, 6264379, 6112284, 5756013, 6042334, 6257408, 5887841, 5479520, 5675741, 5387764, 5296866, 5429564, 5267371, 5172105, 4913958, 4879187, 4998387, 4554374, 4607138, 4637875, 3834690, 4341341, 4361891, 3849922, 4035606, 3821856, 3776430, 3615432, 3935951, 3710767, 3695802, 3550419, 3272724, 3628816, 3474387, 3343953, 3363093, 3053714, 2904552, 3261424, 3075409, 2906573, 2722893, 3036177, 2942770, 2818719, 2686004, 2911770, 2719956, 2687086, 2482966, 2347956, 2594444, 2667598, 2488788, 2276236, 2387442, 2564111, 2339513, 2356726, 2228134, 2244869, 2449018, 2479859, 2256065, 2002884, 1859000, 1716866, 2308946, 1870081, 1989421, 1798825, 1725277, 1808284, 1589515, 1874120, 1739891, 2069134, 1479407]
16548A479407M35329l42290M00446n35902K45219p8877j40615j83847L36219l27414
16538A287675N7482M15642m60098M94402m47617K33926q0062L2712J02903q4214
16528A552751j48335k4774K79120p4772k09372k4034j09749J41222R2198j45763
16518A328492q6504l58417J87271K14086K24313n48816q3412K15153L21800k22362
16508A191604L74478l51005k71784K28035k5010k8166k51197j5917J63871J72396
16498A187305k94764J08835o9274k9657k01708Q0231R5296o7151J38972L3072
16488I81157O1860j01513L3284m24319J26322J21915K4757j2110J87153q8348
16478I10158Q1563C73074N01614J94877k52898j55314j80992L75690l60455N95222
$$ y = [1479407, 1914736, 1572446, 1972892, 1436990, 1682209, 1603332, 1462717, 1278870, 1615089, 1287675, 1345157, 1760799, 1300701, 1795103, 1347486, 1581412, 1501350, 1534062, 1636965, 1552751, 1404416, 1379642, 1658762, 1583990, 1374618, 1350584, 1240835, 1382057, 1474255, 1328492, 1241988, 883571, 1070842, 1284928, 1509241, 960425, 877013, 1092166, 1413966, 1191604, 1566082, 1215077, 943293, 1171328, 1146318, 1118152, 866955, 851038, 1014909, 1187305, 892541, 1001376, 932102, 902445, 700737, 780968, 876264, 809113, 948085, 981157, 1043017, 941504, 974788, 550469, 676791, 798706, 823463, 811353, 998506, 910158, 991721, 373074, 874688, 1069565, 816667, 661353, 480361, 856051, 495596, 1090818]
16468A090818l55628j7355q961K87761m80296K18103j07643M69045j57121O7378
16458A006101m69549O8767M50133k56379J77967m08136j41824J67988K95414l38286
16448E52196j54453J94310K36560j34357r4286j59436J28949J13290J90045k78362
16438E94456k39157J22618L40557j30822J50968M1258j92545k47018J50178J30501
16428G20994l20493J44005L51370D05297M43725j88749j25266B50259K77490j81575
16418C46174K67853J0471j97199J3352J55649q3148j82804K84664a71115C24657
16407C68459j7242j62700O0704O1850J05945J63983M0324J41628k45814o8766
16397D48371N8954j46674O00K77054A50060K52534p3289J86107k20167K6644J56735
$$ y = [1090818, 735190, 717835, 708874, 996635, 516339, 734442, 626799, 1095844, 938723, 1006101, 536552, 605319, 1055452, 799073, 977040, 568904, 427080, 595068, 890482, 552196, 397743, 592053, 828613, 694256, 599970, 440534, 569483, 682773, 872818, 594456, 355299, 477917, 818474, 687652, 838620, 879878, 687333, 440315, 590493, 720994, 400501, 544506, 895876, 405297, 849022, 660273, 535007, 250259, 527749, 346174, 614027, 624498, 427299, 440651, 596300, 513152, 330348, 615012, -171115, 324657, 368459, 351217, 188517, 249221, 311071, 417016, 580999, 621323, 762951, 517137, 448371, 507325, 360651, 361251, 638305, 150060, 402594, 329305, 515412, 295245, 321889, 478624]
16386D78624K19807C43022F5122K26912J92777N0888l9338k00688j30217K57551
16376D23007D8302K76662j42109J40859k9201K89653j08331j37482J29326o1774
16366D05905l7284b9853A31978k3492L31634B18596R779A4464K45417J46832J95809
16355F02522j23484A92398p5365L60383A70951O6090M0486N9032C6356K93271
16345C29627Q9765j83856A10918P7112L15261B37767A7650b5692B65399Q293j03723
16334A69969K29615J79318K8532D1068J52102O2873Q9392r4689j13686F2624M8590
16323A11214L28676A99255G0918j6805A0041M5958L94775A95140L8000e3745I3336
16311A34240N7228n8825J61692A4765K77981D9760K1577L90333D4058L52706j62167
$$ y = [478624, 698431, 343022, 65122, 292034, 484811, 535699, 496361, 295673, 165456, 423007, 48302, 324964, 182855, 323714, 294513, 584166, 475835, 338353, 467679, 405905, 368621, -29853, 131978, 108486, 440120, 218596, 228375, 14464, 259881, 406713, 602522, 479038, 192398, 117033, 477416, 170951, 237041, 277527, 336559, 36356, 329627, 419392, 235536, 110918, 188030, 503291, 237767, 17650, -25692, 265399, 273692, 169969, 399584, 578902, 607434, 41068, 193170, 256043, 345435, 250746, 137060, 62624, 111214, 439890, 199255, 70918, 54113, 10041, 55999, 450774, 195140, 233140, -53745, 93336, 134240, 191468, 132643, 294335, 14765, 292746, 49760, 71337, 461670, 44058, 396764, 234597]
16300B34597j12947E2619K66746J42453A89286J45240j08162n389g2856A92390
16289A13861M55191A33453k6171J1193b7918l195p0272A34197J87348h2848B04597
16277A35127M51742A45783B0246L06057J4624j02497I9018a6009A80837L24029
16267E04866A93301j9367b2392B92451a25072B53553J9300O7528n0086R895A13245
16255B22888i4536B60012I6398a51250D58719k00360j8965L6290B5445J29793
16245A55238C9542J98314p3372g6918j46548C94583A35428K9079C7480J1638a71200
16233a68288A442b15950B99673a03221C13613j48240N6864r9826C6354b03785
16222B74951G6164g5540B00861q8176K8054c8748J7631p0112M1561B22066p0800
$$ y = [234597, 121650, 52619, 319365, 461818, 189286, 334526, 226364, 220975, -72856, 192390, 113861, 569052, 133453, 107282, 118475, -27918, -31113, -101385, 134197, 321545, -82848, 204597, 135127, 586869, 145783, 20246, 326303, 340927, 238430, 99018, -16009, 180837, 504866, 193301, 173934, -22392, 292451, -125072, 253553, 272853, 340381, 290295, 300190, 113245, 222888, -94536, 260012, 96398, -151250, 458719, 258359, 239394, 275684, 25445, 155238, 39542, 237856, 164484, -76918, -223466, 394583, 135428, 164507, 37480, 49118, -171200, -168288, 1442, -215950, 299673, -103221, 313613, 165373, 222237, 122411, 36354, -203785, 274951, 76164, -75540, 200861, 112685, 140739, -38748, -21117, -91229, -49668, 222066, 151266]
16211A51266J39723m0992j3566j7474n6385Q9658h4267A34730m140a79885B88566
16199b3441A14662a98463B74823J12969A21287D3220J28119D0459a53098c7547
16188a08919j51940F2400r911i4609E2588c4427l8019Q780p5828b3217D31416
16176A39054K32016A4958K3869C222K02175G1583J26200F2957b86824B14218a67014
16164A55112K49589b88065B76474R6368A56812g2282B52674G5987c26418B94753
16153b74314B79704A17764D8483c9658A36515f7999a3205B38657c9972p5917C13470
16141c0944H4701J427b3528F7465J72331B0034b58859N1803A60155C813e2957
16129B2194J75560c4264A50306b81742H87b1834j16014B62399p2395q3702c8740
$$ y = [151266, 290989, 249997, 236431, 218957, 162572, 252230, -84267, 134730, 130590, -179885, 288566, -23441, 114662, -198463, 274823, 387792, 121287, 43220, 171339, 40459, -153098, -37547, -108919, -260859, 62400, 52489, -94609, 52588, -34427, -72446, -63666, -139494, -23217, 431416, 139054, 371070, 14958, 38827, 3222, 205397, 71583, 197783, 62957, -286824, 214218, -167014, 155112, 404701, -288065, 276474, 372842, 156812, -72282, 252674, 75987, -326418, 294753, -274314, 279704, 117764, 48483, -39658, 136515, -67999, -13205, 238657, -39972, -115889, 313470, -30944, 84701, 86128, -23528, 67465, 239796, 20034, -258859, -207056, 160155, 3813, -52957, 22194, 197754, -34264, 150306, -281742, 887, -21834, -137848, 262399, 190004, 106302, -38740]
16117b52493a8985A6093K06330i7692N498B64629b75067B64290F8695b55485A21906
16105D36571g9527B81492b4094A30052g4743D62428d7684F3557J09513A8558a48424
16093A30729e978j25221A41280J37551j01301a23161C2289f5514j12061F5361
16082A1565a36099d1249A07278a02791j50812a00029K3839o315m2136j46808A09869
16070B81382j38685B7004a96019H878h0729j5388L3922A21224a87588A18742N9941
16059A78683D3258g847m1754A89951d3019j28112l2183j34881J64775B9703a18506
16047b15927K412L530B23366C7421i6356C4039J08779n5145e8848A10258b033
16035a52980d3309A44553F1300c9093o7894j84695g0464A63042c1746k7732I648
$$ y = [-252493, -18985, 16093, 222423, -97692, -92194, 264629, -275067, 264290, 68695, -255485, 121906, 436571, -79527, 281492, -24094, 130052, -74743, 462428, -47684, 63557, 173070, 18558, -148424, 130729, -5978, -131199, 141280, 278831, 177530, -123161, 32289, -65514, -177575, 65361, 11565, -136099, -41249, 107278, -102791, -253603, -100029, -76190, -82505, -124641, -271449, 109869, 281382, 142697, 27004, -196019, 8878, -80729, -96117, -62195, 121224, -187588, 118742, 178683, 43258, -7847, -49601, 189951, -43019, -171131, -203314, -338195, -173420, 29703, -118506, -215927, -213515, -209985, 223366, 37421, -96356, 34039, 142818, 87673, -58848, 110258, -2033, -152980, -43309, 144553, 61300, -39093, -106987, -291682, -70464, 163042, -31746, -59478, 9648]
16023E5848J47913b9808j31196j6924l2290B91673a48579n6890j13066A3235a98663
16011a23620J3334A44656L2902m5690a29463F7934C0680c0117E9134J52188e2247
15999B21390b99700B12799a31108B1585K4223k0402K46345b18186O8101m6406
15989a96491A14485J21580C9262J49021F6250P8416J07010K37317j22971A61263
15978D9351L0685d460r9004L601A30808n3009M7134b16490d8827A47098C7198
15966B7152J33251F9284O8987c3835A67380K22432a8663E2605b27910R2705j42218
15955b77423d1648e287A75045b07188E2945j063J5354b71271i4705M3011k55428
15944c07122I2531a36954j13052a01445B7888e12638B20696a53785A0307J117
$$ y = [55848, 203761, -29808, -161004, -177928, -210218, 291673, -148579, -205469, -318535, 13235, -198663, -123620, -110286, 144656, 177558, 131868, -129463, 67934, 30680, -30117, 59134, 211322, -52247, 221390, -299700, 212799, -131108, 21585, 45808, 25406, 271751, -218186, -150085, -196491, 114485, 236065, 39262, 188283, 66250, 144666, 251676, 488993, 366022, 161263, 49351, 80036, -4460, -103464, -99863, 130808, 77799, 124933, -216490, -48827, 147098, 37198, 27152, 160403, 69284, 138271, -33835, 167380, 389812, -18663, 52605, -227910, -135205, -277423, -41648, -5287, 175045, -207188, 52945, 51882, 67236, -271271, -94705, -51694, -307122, 92531, -136954, -250006, -101445, 27888, -512638, 220696, -153785, 10307, 11424]
15934A1424b6312F338J20129D1020a54184k31323F9571a35287M3617A30887c75616
15922A46949L7902e838k14061d5697j66773c9532k81549J13140E9026K7595f315
15910a52404g1932I5211D4760b45420D10944d9467A347b8771A69624c92913C28630
15898G320J11073b9899B4967M2982b93587k0408g3693j16303j14707D09527a92185
15886a19015K1362j05173p470A20711J0559L0841b24675l0961I6621a60456P1917
15875h8539q1709J3088e7811B96135I8806k7184i6742I4057l3429a02086j36532
15864b38618c585j26659m8789m1247g038j6109B43960j3945b47879A01240a90341
15852c06496a34763K7462k88944J82828n614C12334c06427G1313J87658I4239
$$ y = [11424, -26312, 6338, 126467, 41020, -154184, -385507, 69571, -135287, -91670, 130887, -375616, 146949, 184851, -5838, -219899, -45697, -212470, -39532, -321081, -207941, 59026, 86621, -6315, -152404, -71932, 95211, 44760, -245420, 410944, -49467, 1347, -28771, 169624, -392913, 328630, 7320, 118393, -29899, 24967, 67949, -293587, -313995, -73693, -189996, -304703, 409527, -192185, -119015, -97653, -202826, -210296, 120711, 131270, 162111, -224675, -255636, 96621, -160456, -88539, -170248, -157160, -57811, 296135, 98806, 71622, -96742, 94057, 60628, -102086, -238618, -3585, -130244, -179033, -220280, -7038, -23147, 243960, 230015, -247879, 101240, -190341, -306496, -134763, -107301, -396245, -213417, -219031, 312334, -306427, 71313, 258971, 94239]
15841c42800B9931J66240n2497d9730A9104d0127B4994J19573O7077b50052A11282
15829i3131A94881J9107b81717J01597A32397E4989a27142C28934h312j35496
15819a43808q7m112j20488a27508A99921L936a15436j17073e3296j8282e954B06039
15806a7772m2070A0283a30204A3205J31375h6031B8666A2237L93444A54601R4176
15795B48777A1921P0159c70375O2520B95946b18262G0238e3429D8624b31428n5206
15784b86634J28421J7230j92908a55480H819K8365D310b38535K7798a00299o0786
15773a61085g8048D3091M6905C8499g0167A16185b68160B07726F3211a9473k0298
15762c9771l3254A27066d935B8767L12734B4755M04661E541R6166d49282A18876
$$ y = [-342800, 29931, 196171, 143674, -49730, 19104, -40127, 24994, 144567, 211644, -250052, 111282, -93131, 194881, 213988, -281717, -180120, 132397, 54989, -127142, 328934, -8312, -143808, -143895, -148007, -268495, -127508, 199921, 203857, -115436, -232509, -53296, -71578, -5954, 206039, -17772, -59842, 10283, -130204, 13205, 144580, -86031, 28666, 12237, 405681, 154601, 248777, 11921, 82080, -370375, -307855, 295946, -218262, 70238, -53429, 48624, -231428, -286634, -158213, -140983, -333891, -155480, 8819, 37184, 4310, -238535, -210737, -100299, -161085, -78048, 43091, 89996, 38499, -70167, 116185, -268160, 207726, 63211, -19473, -39771, -73025, 127066, -4935, 28767, 341501, 24755, 429416, 5541, 101707, -449282, 118876]
15750d2317A09618c6332F4846e4498C16466c01060A31146k8859m3960a54728j55248
15739c09976b1937D1885a6079j78164B6305Q3981j6591a51501c7325j45295G397
15727d83568g6236E5245a26293a0669k39075J10564m4115a5018B78455G5961Q2182
15716A58143f8771O274m9976q0079q6137d9397p2692A37815i0061F5005b05602
15704B31537H2288A1708a49239N7595A84927k5109J7790c71173A02940a25278
15693a27624J4702Q813a7319l75646a35653A66193a04058A0846c05174p156A01929
15681i657j01833A54516b30187f5045F862K5244c022l2956A17080B4834J60209
15670A85043J89216j20671F895M07039a14872F0568b5793j88387m3273J02275
$$ y = [-42317, 109618, -36332, 64846, -54498, 316466, -301060, 131146, 102287, 58327, -154728, -309976, -21937, 41885, -16079, -194243, 26305, 110286, 93695, -151501, -37325, -182620, 7397, -483568, -76236, 55245, -126293, -10669, -249744, -139180, -183295, -15018, 278455, 75961, 158143, -68771, -62497, -112473, -192552, -278689, -49397, -122089, 137815, -90061, 65005, -205602, 231537, 82288, 11708, -149239, -91644, 184927, 159818, 177608, -371173, 102940, -125278, -127624, -112922, -104109, -17319, -392965, -135653, 166193, -104058, 10846, -305174, -312330, 101929, -9657, -111490, 154516, -230187, -65045, 6862, 32106, -3022, -35978, 117080, 24834, 185043, 374259, 253588, 6895, 413934, -114872, 60568, -25793, -214180, -257453, -155178]
15660a55178L1199B44196D1633a7622j03275j03564A37539A3282a63579N4100
15650a09479j69771i4274j20764A70342e9539E17374k10205A9645I280a50929
15639A44076M99E5140L2266h2651n4085L8130B69550L0864c6678p7460c8143o6619
15627a04762q543A00764K08396a66128B66383B7108a15576j34174A90871e6856
15616A10167b71878c058H2228C7372a12803A4834Q9436K2606a90326r2182c978
15604a35839j66507j2242n5969i4140k77483h4438G9035a94425Q4762j75287i2841
15592B18766b74710L3376j44250F9978k1862b28321F759a18096A92807d2980j13538
15581a56518G1421J38289a04609h192C4365J02841n5665h4588B02273n6459a34640
$$ y = [-155178, -123979, 244196, 41633, -17622, -120897, -224461, 137539, 13282, -163579, -109479, -279250, -94274, -215038, 170342, -59539, 517374, 307169, 19645, 9280, -150929, 144076, 144575, 55140, 87406, -82651, -136736, -98606, 269550, 300414, -36678, -114138, -38143, -104762, -113305, 100764, 309160, -166128, 266383, 27108, -115576, -249750, 190871, -56856, 110167, -271878, -3058, 82228, 37372, -112803, 14834, 104270, 126876, -190326, -282508, -3978, -135839, -302346, -314588, -370557, -94140, -371623, -84438, 79035, -194425, -109663, -284950, -92841, 218766, -274710, -241334, -385584, 69978, 48116, -228321, 6759, -118096, 192807, -42980, -156518, 71421, 209710, -104609, -8192, 34365, 137206, 81541, -84588, 202273, 145814, -134640]
15569c01775a02928B98344A31608b89344A90074f5865n9299A18638a45567e5753
15558a5391k35998B66230b55200B15000G2958J93686C4718b94563a01641J1907
15548h9734C7241g9926f429j8851M84A13937N7867P1822I7597J04828D6206R5549
15536A41755J67122b00443A21352k0295g7795A03795c41716a19124b2100l0418
15526e2518k76596b2413B7523q899b6293j0022j34428A30321J24493b923k7388
15515c0311A25037a55407m6298K1121B42073a195j11407A74730d28206h529I4117
15503b58861i0712n590k5052G0594J1117c909l80824a21333J0766D54231f0108
15491e1844j20933e997j18594r949A65517e418C50572a2931l13562B41538e4270
$$ y = [-301775, -102928, 298344, 131608, -289344, 190074, -65865, -125164, 118638, -145567, -55753, -15391, -251389, 266230, -255200, 215000, 72958, 266644, 34718, -294563, -101641, -89734, 37241, -79926, -6429, -25280, -24796, 113937, 171804, 243626, 97597, 202425, 46206, 141755, 308877, -200443, 121352, 101057, -77795, 103795, -341716, -119124, -22100, -52518, -329114, -22413, 27523, 18624, -26293, -36315, -170743, 130321, 254814, -2923, -30311, 125037, -155407, -201705, -180584, 242073, -1195, -112602, 174730, -428206, -8529, 94117, -258861, -90712, -96302, -121354, 70594, 81711, -3909, -384733, -121333, -110567, 454231, -60108, -51844, -172777, -5997, -124591, -134540, 165517, -5418, 350572, -12931, -326493, 241538, -54270]
15479A32950D5578b82511B589a87127J8692B58870r7645G6901a00412E0509j0261
15468D0248d46216a10256K9934I6799a88814A34230a96796o1170D9331L92397
15458D41728a64687O8260J0448B74087h7561l3951K1804j27330J3846D0910a47996
15446F5463b03403H7046B463e7365E4262c2611A05888b89319P288a16032I5874
15434b00932B39182K32265a34538B30698C3471J96830h7971A44994g518o7613
15424g5131B05729j5449r1811g2890l2313A79960K35261a25237G9270K069d8857
15412h4441A68643K35293b2024l32044a76048B52531b94742D09452j03198a44389
15401a48319l61296B3343b53015c7572m4731c8847C2885b44208I8478b42851g539
$$ y = [132950, 45578, -282511, 2589, -187127, -168435, 258870, 161225, 76901, -100412, 50509, 40248, -446216, -110256, -80322, 96799, -188814, 134230, -196796, -257966, 49331, 441728, -164687, -96427, -85979, 274087, -87561, -121512, -99708, -227038, -213192, 40910, -147996, 65463, -203403, 87046, 2463, -57365, 54262, -32611, 105888, -289319, -282031, -116032, 95874, -200932, 239182, 471447, -134538, 230698, 33471, 230301, -87971, 144994, -7518, -75131, 205729, 190280, 98469, -72890, -105203, 179960, 415221, -125237, 79270, 81339, -48857, -84441, 168643, 403936, -22024, -354068, -176048, 252531, -294742, 409452, 306254, -144389, -148319, -509615, 23343, -253015, -37572, -82303, -38847, 32885, -244208, 98478, -242851, -7539]
15389A40760L17340a74543H5458m1945J11067a06814c4834p7769F3925b73117
15378c92488H8998b21885A99709i7711q1545b2217j64191C79463A50305a30535
15367a44205A03778L6678E0818M7021b47152a18867C3622a92427L8337j2705A77866
15355h8884A36607a60635A49902a8092D7519a31757B75723c25657a428l69522
15345c70950B03528i3152j76335C07215f656A00281a58378b1984o5848r3975B01109
15333I2049a6665C91423F5211J69963o1472i459k38413f6518n2098N6240j81649
15322b44025B00924g2745q3464K8910K0054I8744b42033j04341E07102I5025P0914
15311A65939b297I4196b4157H5688E256J27900B0421j0040N9143a41622C58531
$$ y = [140760, 458100, -174543, 85458, 43513, 154580, -106814, -34834, -112603, 63925, -273117, -392488, 88998, -221885, 199709, -97711, -179256, -22217, -186408, 379463, 150305, -130535, -144205, 103778, 140456, 50818, 97839, -247152, -118867, 33622, -192427, -154090, -166795, 177866, -88884, 136607, -160635, 149902, -18092, 47519, -131757, 275723, -325657, -1428, -370950, 203528, -93152, -269487, 307215, -6656, 100281, -158378, -21984, -87832, -181807, 201109, 92049, -16665, 391423, 65211, 235174, 173702, -9459, -247872, -66518, -118616, -62376, -244025, 200924, -72745, -156209, -127299, -107245, 98744, -242033, -346374, 507102, 95025, 165939, -2297, 94196, -24157, 85688, 5256, 133156, 20421, 10381, 69524, -141622, 358531]
15299a66736B69217A20565A6268a15133B09956E525J44459L0742d918C3322g6438
15287C01937A39567L3194p5831a56961D7892a15932j75977A60971C9723b4969
15276B17960J57182d2808B45165j15706n0698B5982M1942K9429g7233C86223q9363
15265B96860r0798L7897H6527J58711a47081F7248J74539A9659L98125A23081
15254D76305a8696E46567B8343J62704K38933K18058O68275K72349m47720N9048
15244A199990l30035B60793K2605c29507A13896i4772b8433H023K5018a46853
15233a1642F3429K61025a41088n3094A27130M8597n1583L4540A5526K36482A07129
15221B29488F955L34065A51807e118b7F3416b4867r1242m9220a3022I7138O2361
$$ y = [-166736, 269217, 120565, 16268, -115133, 209956, 5525, 149984, 180726, -4918, 33322, -76438, 301937, 139567, 172761, 96930, -156961, 47892, -115932, -291909, 160971, 39723, -24969, 217960, 375142, -42808, 245165, 129459, 78761, 25982, 67924, 97353, -77233, 386223, 296860, 206062, 243959, 86527, 245238, -147081, 67248, 241787, 19659, 417784, 123081, 476305, -18696, 546567, 28343, 191047, 429980, 648038, 1316313, 1588662, 1140942, 1199990, 869955, 260793, 283398, -329507, 113896, -94772, -28433, 8023, 33041, -146853, -11642, 63429, 324454, -141088, -194182, 127130, 175727, 124144, 158684, 15526, 252008, 107129, 229488, 6955, 341020, 151807, -5118, -27, 63416, -24867, -116109, -165329, -13022, 97138, 159499]
15209A59499c30C80617a10640j38065A84402F5138c7023o0262F1435c18311A18734
15197a57245G9665J73918J69392A15723J03370d1142j60009A48614J06470o005
15187B49079N7164A29601A2288K29954J49498A54692Q932a88667A18032k7078
15177I0954m3162J21939k1462d8918B21728j0793r0297a30027M425D3708M6685
15166I0393k7320i530C30639A55689C591a81033B36876O2710I740J64174H0074
15154A90821e8765k45707C05609C8117h8777q3568P9093C92573c65361A90681
15143B8961J84146b97937A06202A5866K90421j45008d6476J4930k4676A46313
15132i6013B78846A11556m2838J67895A6765G201J73901C9677h5750h736A70065
$$ y = [159499, -330, 380617, -110640, -248705, 184402, 65138, -37023, -97285, 61435, -318311, 118734, -157245, 79665, 253583, 422975, 115723, 219093, -41142, -201151, 148614, 255084, 249079, 306243, 129601, 12288, 242242, 391740, 154692, 163624, -188667, 118032, 90954, 47792, 169731, 148269, -48918, 221728, 210935, 120638, -130027, -125602, 43708, 90393, 63073, -9530, 330639, 155689, 3591, -181033, 236876, 299586, 9740, 173914, 80074, 190821, -58765, -304472, 305609, 38117, -88777, -172345, -93252, 392573, -365361, 190681, 28961, 213107, -297937, 106202, 15866, 306287, 161279, -46476, -31546, -56222, 146313, -96013, 278846, 111556, 68718, 236613, 16765, 7201, 181102, 39677, -85750, -8736, 170065]
15120a58671a7382A2427J26318J27937a27910B96930B9707J07640L2646p3622
15110I6371J09425d8970C751O4912R0507A4724K92835e6294B03097d3262b616
15098i9272A05812P5896A3296a04300B33723P272C4399j5477o945a17024A97232
15086A02916M7197a9374n0769H4789j8255b22734C6677J06582c0350D5483J10398
15075A55881M7597i207A52610B8253J10829K19142c9225D29397H451a06980H3365
15063A94197J51173a41121A66904o9387P3221J24999a35053j53602D00583j73275
15053B27308Q0081P5172C5985J46322P8729d779E59399A87540n0182N3498a38870
15041g6130B94715o4891F0315M03999A5548L0796f5497A58340g9363D00232a34042
$$ y = [-158671, -17382, 12427, 138745, 266682, -127910, 296930, 29707, 137347, 169993, 96371, 205796, -48970, 3751, 68663, 159170, 14724, 307559, -56294, 203097, -43262, -2616, -99272, 105812, 181708, 13296, -104300, 233723, 240995, 34399, 18922, 11977, -117024, 197232, 102916, 150113, -19374, -70143, 84789, 66534, -222734, 36677, 143259, -30350, 45483, 155881, 203478, -9207, 152610, 28253, 139082, 358224, -39225, 429397, 8451, -106980, 83365, 194197, 345370, -141121, 166904, 97517, 170738, 295737, -135053, -288655, 400583, 227308, 307389, 382561, 35985, 182307, 261036, -4779, 559399, 187540, 137358, 190856, -138870, -76130, 294715, 229824, 60315, 464314, 15548, 46344, -65497, 158340, -79363, 400232, -134042]
15029I2272K46661m6881j22322p7871G64b7097C23393L6584a97963c4946D15352
15017A00576R3411c460A66209J40501l2041j28443J02144A10603J82131j40480
15007A52254a2350C97489f210B43225k2375J18916H7662Q1566m8362R4749N4128
14996B69743e1402j03355B361J0890P4367a711C482J35038J96600r7078K48051
14985D86093j00266A76425K2281J44095A40808j7381K81764n6502A38326D4196
14974E71801B22284k5871k619G9456K23592L4754A66631K81429j73098j18089
14964A56873j3249R3509R2597A63261a58665B15154Q1715j31351L9081K0668n926
14953B19341J11472A31845J1391c0388B76266R5450j83375E0988M51358A3768
$$ y = [92272, 338933, 292052, 169730, 91859, 764, -27097, 323393, 359977, -197963, -34946, 415352, 100576, 193987, -3460, 166209, 306710, 274669, 146226, 248370, 110603, 292734, 152254, -12350, 397489, -6210, 243225, 220850, 339766, 87662, 169228, 120866, 215615, 269743, -51402, -154757, 2361, 13251, 87618, -1711, 3482, 138520, 335120, 238042, 486093, 385827, 176425, 198706, 342801, 140808, 123427, 405191, 348689, 138326, 44196, 571801, 222284, 196413, 193794, 79456, 303048, 337802, 166631, 448060, 274962, 156873, 143624, 237133, 329730, 163261, -158665, 215154, 296869, 165518, 204599, 225267, 219341, 330813, 131845, 143236, -30388, 276266, 371716, 188341, 50988, 502346, 13768]
14942A19818K46119j54729l4907a0564D82216n8662p6164q5232J03013A55168
14931B07831o1353L41989k17170A22286J55799n025M0026R5594n1653j31830A07384
14919b04351A80820L38834A72828J36665d6842B12547k0262k1225R3040B796N05533
14908E08329b0043B7340J49415J49778J29478A15779k728L82882k42651J34234
14898C87516h202C14896r0571K74772O9337N500k42290j05451k3806c33197B89145
14886B8999K97047l2928k5933J9345Q9046J0778J53039H6287J9797P5906P8069
14875B60059j3064J22933p2145A42207K88784A78764J79443Q1535J11757A99092
14864C60425N1084q7992J2154J60901A30102L08031j17523J11746J71682C01411
$$ y = [119818, 365937, 211208, 176301, -10564, 482216, 423554, 347390, 262158, 365171, 155168, 207831, 146478, 488467, 271297, 122286, 278085, 273060, 313086, 408680, 357027, 225197, 107384, -204351, 180820, 519654, 172828, 309493, -46842, 212547, 192285, 171060, 264100, 2796, 508329, -20043, 27340, 176755, 326533, 456011, 115779, 113051, 495933, 253282, 387516, -8202, 314896, 224325, 499097, 568434, 573934, 331644, 226193, 202387, -333197, 289145, 28999, 326046, 293118, 267185, 286530, 375576, 386354, 539393, 86287, 106084, 181990, 260059, 246995, 369928, 297783, 142207, 430991, 178764, 358207, 439742, 551499, 199092, 360425, 411509, 323517, 335671, 496572, 130102, 438133, 320610, 432356, 604038, 301411]
14853b29511B26275J42976J8974j09444J0281j12632K34746P7013A52297J34696
14843B86993L48964j73841j72394m515H6035M77076j50784h251F87310C15974
14832B73398K43282P5744A1317L20456A30762N30751l23231J33619j77155N77810
14822H72556D12946j32592J81871J93774B05577J92849K2855J40335A39681P7320
14812B17001K07229j32365m8411K27478J01687K457k16536n2438M08397k99974
14802D14525l7878L61015j88934j66527k5797p595R4383R5522o0805J30340k36180
14791C72069q7611l7003J95764K415r6618P9901P0946K59849o1653C04256L61113
14780F65369j36594Q8480A88665K47014K00659P8803B58680L97329k9235j90137
$$ y = [-229511, 226275, 369251, 388225, 278781, 289062, 176430, 411176, 488189, 152297, 286993, 635957, 462116, 289722, 285207, 86035, 563111, 412327, -8251, 687310, 315974, 273398, 516680, 592424, 11317, 331773, 130762, 661513, 338282, 471901, 294746, 872556, 412946, 280354, 462225, 655999, 205577, 398426, 421281, 561616, 139681, 217001, 424230, 291865, 243454, 470932, 572619, 575076, 358540, 306102, 714499, 414525, 376647, 737662, 548728, 382201, 356404, 348809, 443192, 538714, 477909, 608249, 372069, 284458, 247455, 443219, 445634, 349016, 428917, 499863, 759712, 698059, 304256, 665369, 528775, 617255, 188665, 435679, 636338, 715141, 258680, 656009, 626774, 436637]
14770D36637r0974J73557K8402k6693K34990l76317J14119A65829N15784l7110
14760F44503J63147C76230J77436j46356Q7901L12239C80999J81029M0201j00961
14750E01268j44464R0191L64957j92151O8973P3726B73414L47835j21648Q8845
14740E88446J42829J29934k09802J25277j08488p1048J5727n3423j79234K60099
14730F40317J5341j19583O6201k4560l5526J91178j75939N3288M5097j5026J6057
14719F56845J76167J2675P8531k26393k07138N82109m42316L36087l47797J99651
14709H18421k46882L265M40799K13484m05902p3117j89252m3714J10659J93503
14699H21264p3035K83645k36003l338l25251M63897K95402m76304J48360q683
$$ y = [436637, 345663, 519220, 547622, 520929, 755919, 379602, 493721, 165829, 681613, 644503, 807650, 376230, 553666, 407310, 495211, 807450, 380999, 562028, 602229, 501268, 356804, 446995, 811952, 619801, 688774, 762500, 273414, 621249, 499601, 588446, 731275, 861209, 651407, 776684, 668196, 597148, 612875, 559452, 380218, 640317, 655658, 536075, 602276, 577716, 542190, 733368, 557429, 610717, 655814, 640788, 656845, 833012, 845687, 924218, 697825, 490687, 1072796, 630480, 966567, 618770, 818421, 571539, 574804, 1015603, 1229087, 823185, 750068, 560816, 517102, 627761, 821264, 748229, 1031874, 795871, 792533, 467282, 931179, 1226581, 750277, 898637, 889954]
14689H89954M2443l31382J27385K10516j85108J78069q2243J16703R758j90671
14679G85424k9087K3273O2426j4220L5154L37991E77427K01164q577K74835j15080
14668I29769j8515L04836p6361J21134k82075j44537J70686k88274L87856j89642
14658I14877L95143n65677L70427J76932l87605N2894j94498K41773k42730M48740
14648A210276j67465j24261p7518L82919q228k57373L79032m5102n0813k2093
14638A219374J69431k97071M3482O9567K40697j2029n40954L82654k26388l7269
14628A011494K74668Q0252j57970L12569k25435j08883K06888q0021K92708k38160
14618A368110j02458M7063m2135K69206k33897J59074j14257K27276r0123J8373
$$ y = [889954, 932397, 601015, 728400, 938916, 753808, 931877, 849634, 966337, 976095, 785424, 756337, 779610, 842036, 827816, 862970, 1200961, 577427, 778591, 770014, 1044849, 929769, 911254, 1216090, 1139729, 1260863, 978788, 834251, 1004937, 716663, 1104519, 914877, 1310020, 744343, 1114770, 1291702, 904097, 956991, 762493, 1004266, 761536, 1210276, 1042811, 918550, 841032, 1223951, 1215723, 958350, 1337382, 1292280, 1241467, 1219374, 1388805, 1091734, 1135216, 1204783, 1445480, 1433451, 892497, 1275151, 1048763, 1011494, 1286162, 1366414, 1208444, 1521013, 1295578, 1186695, 1393583, 1313562, 1606270, 1368110, 1265652, 1312715, 1270580, 1539786, 1305889, 1464963, 1350706, 1577982, 1487859, 1506232]
14608A506232l52854R6755P5904M4862q9699K23989o5143k1027Q1839k560k76642
14597A221656M2868K34423l8152K39652r9786o2077n0973J35123J0377Q7376k48639
14586A471848k29205K57961J64914J39734N7847l31780J16428K10916n9257l20359
14576A479047O2124L12925J2684o547j30590L15289K89561o7008m88196M6498
14566A825787L20592m0981k11558L57952J27484K8510J09536j40308o1159M85452
14556B801307l1256R5616J39094K35909L01166P34766J099413J090530N288476
14547A1755021R653432J3577943N202063j2105192A0608641D238756j408120p95809
14539B034827m84977N58899n77753R7439L6407j22946k57921O48285l1021K00844
$$ y = [1506232, 1153378, 1250133, 1326037, 1370899, 1281200, 1505189, 1440046, 1419019, 1500858, 1498298, 1221656, 1264524, 1498947, 1460795, 1700447, 1600661, 1538584, 1487611, 1622734, 1633111, 1720487, 1471848, 1242643, 1500604, 1665518, 1805252, 1863099, 1531319, 1647747, 1858663, 1799406, 1479047, 1541171, 1854096, 1866780, 1860233, 1729643, 2044932, 2334493, 2267485, 1779289, 1825787, 2146379, 2105398, 1893840, 2251792, 2379276, 2407786, 2517322, 2377014, 2315855, 2801307, 2770051, 2865667, 3004761, 3240670, 3541836, 4276602, 5376015, 6466545, 11755021, 21408453, 34986396, 40188459, 28083267, 10608641, 4238756, 2830636, 2034827, 1549850, 2108749, 1530996, 1628435, 1664842, 1541896, 1283975, 1932260, 1901239, 2102083]
14529B102083P8819q5232j69271O92524n40270k90556K98927j04868J72685r6090
14519B058751j14603N34705l74373J60518L31540j15221l07519M49539j71409
14510B451928L8207J83508j68725J57332Q2095j42832L58713Q9698l11501J84676
14500B923099N7392R674j28536M02277m13383k8541N57620O1440m50588K34912
14490C225366k37030M5933M68505j42426l40756L05778K20367j28069N0989O0706
14480C529363l9348j43408J29669j88088L03063l2223J25524j14830L20088j57089
14470C732721j29289N43135m03798L18134k41431K56285k89906P16392n73114
14461C929129R1110K28469M94176j40633J9676j10379M3501J84481j64929K78642
$$ y = [2102083, 2180902, 2095670, 1926399, 2618923, 2078653, 1788097, 2087024, 1982156, 2154841, 2058751, 1944148, 2478853, 2104480, 2264998, 2596538, 2481317, 2173798, 2623337, 2451928, 2490135, 2673643, 2504918, 2662250, 2744345, 2601513, 2960226, 3049924, 2738423, 2923099, 2980491, 2990165, 2861629, 3263906, 2850523, 2821982, 3379602, 3441042, 2990454, 3225366, 2988336, 3034269, 3502774, 3360348, 3019592, 3325370, 3545737, 3417668, 3468657, 3529363, 3490015, 3346607, 3476276, 3288188, 3591251, 3559028, 3684552, 3569722, 3889810, 3732721, 3603432, 4146567, 3742769, 4060903, 3819472, 4075757, 3785851, 4502243, 3929129, 4020239, 4248708, 4742884, 4602251, 4621927, 4511548, 4555049, 4739530, 4574601, 4853243]
14451D853243o6512K61690l06102J91393P3712R8356p0078K68507j16018M30568
14441E618759j87483M02724j05432k47045J86927J48850l11460O79322m9909k33096
14431E902157J81014N0421m1266L20835q3098J51366P7366K72020Q9850K58591
14421G179256l187k36865K45076K07944j98935O59118l33016L55986K97352j35920
14411H036809M18879n35959M80143J80681K91464n93237O43004N1673J02909K25828
14401I302194J84431J74279R1072O56389m29630L93668M614N67178l55537N16294
14391A1104952l83293N82057J40769q995P13513k63245n5257M71067M53227K04007
14381A2958802K82810K7217K73460M88615J59813J02103J93689N15331j25067
$$ y = [4853243, 4786731, 5048421, 4742319, 4933712, 5007424, 5105780, 5035702, 5304209, 5188191, 5618759, 5431276, 5834000, 5728568, 5481523, 5668450, 5817300, 5505840, 6185162, 6135253, 5902157, 6083171, 6133592, 6092326, 6413161, 6330063, 6481429, 6558795, 6830815, 6920665, 7179256, 7176069, 6939204, 7184280, 7392224, 7193289, 7852407, 7519391, 7875377, 8172729, 8036809, 8455688, 7919729, 8399872, 8580553, 8872017, 8278780, 8921784, 8973457, 9076366, 9302194, 9486625, 9660904, 9751976, 10408365, 9978735, 10372403, 10377017, 10944195, 10588658, 11104952, 10721659, 11303716, 11444485, 11435490, 12149003, 11885758, 11830501, 12301568, 12754795, 12958802, 13241612, 13268829, 13542289, 14030904, 14190717, 14292820, 14486509, 15001840, 14876773]
14372A4876773L32559N08156o3327P23845L13993J10029K06165O18379M66402
14363A8092974Q9647L98456L53517N33197Q24791O83186J36318N04076O31528
14354B2247690N7560P54508N87714N69344M44426P88980N17173P54325Q60088
14345B7581808N74282J121827M98140K66635J461584N10049J018781J003603M42798
14336C4479507J271458J334007J050447J201679R92518J025419J358771J412649
14328D4126455J722373J280174J735704J307778J846423J975184J733556J721751
14320E7449398K409813K014622K395476K177913K865171K185326L119021K865043
14312G7481783L081664L494873L673618L466557L921500M059758M284336M756048
$$ y = [14876773, 15209332, 15717488, 15654161, 16378006, 16691999, 16802028, 17008193, 17626572, 18092974, 18182621, 18581077, 18934594, 19467791, 20292582, 20975768, 21112086, 21616162, 22247690, 22305250, 23059758, 23647472, 24216816, 24661242, 25450222, 25967395, 26721720, 27581808, 28156090, 29277917, 29776057, 30042692, 31504276, 32014325, 33033106, 34036709, 34479507, 35750965, 37084972, 38135419, 39337098, 40329616, 41355035, 42713806, 44126455, 45848828, 47129002, 48864706, 50172484, 52018907, 53994091, 55727647, 57449398, 59859211, 61873833, 64269309, 66447222, 69312393, 71497719, 74616740, 77481783, 80563447, 84058320, 87731938, 91198495, 95119995, 99179753, 103464089, 108220137]
14304A08220137N380039N154397N572343O003534N926816P096325O946654Q220400
14296A58520645P777568Q768012R260334J0157783R969547J1317713J1831530
14289B27603132J2559451J3076714J3841333J4448899J4974830J5975263J6094452
14282C28574074J6608804J6824214J6824950J6687158J6329693J5238459J4111487
14275D41198839J2619442J0632163P088288K487953k004427m72524k085157k173928
14267D67290649J204140l361925r623564j2288059j4245143j5790260j6593791
14260C96592047j6434250j7542112j6781122j7284000j6495145j5609684j4757163
14253B81688571j4831733j3874604j3332891j3123081j1689904j1245428j0761206
$$ y = [108220137, 113600176, 118754573, 124326916, 130330450, 136257266, 143353591, 150300245, 158520645, 166298213, 175066225, 184326559, 194484342, 204453889, 215771602, 227603132, 240162583, 253239297, 267080630, 281529529, 296504359, 312479622, 328574074, 345182878, 362007092, 378832042, 395519200, 411848893, 427087352, 441198839, 453818281, 464450444, 471538732, 474026685, 472022258, 471549734, 469464577, 467290649, 468494789, 465132864, 455509300, 443221241, 428976098, 413185838, 396592047, 380157797, 362615685, 345834563, 328550563, 312055418, 296445734, 281688571, 266856838, 252982234, 239649343, 226526262, 214836358, 203590930, 192829724]
14246A92829724r853541r052844q650065q309705p840583p457339o494022o579480
14238A28592145n693512n434837n205999n308042m661019m429026m158062l325697
14230I0375951l767925l502106l913051k836586l173306k540874l018489k430417
14222F5193197k112334k391939j996755k084619j832571k244903j544595j586298
14214D9399183j231588j512472j672322j169830j721746j054349j057065r87002
14206C8992809p89452j056803j784430q68843q19271k13470j147516j197113o84527
14197C0431384o87649o58385r98442m82699o52023o72882r15502n23335k69170
14188B4571297r84213n18346j96903n96692n67346m73083n07100j20455k26758
$$ y = [192829724, 182976183, 173923339, 165273274, 156963569, 149122986, 141665647, 135171625, 128592145, 122898633, 117463796, 112257797, 106949755, 102288736, 97859710, 93701648, 90375951, 86608026, 83105920, 79192869, 76356283, 73182977, 70642103, 67623614, 65193197, 63080863, 60688924, 58692169, 56607550, 54774979, 52530076, 50985481, 49399183, 48167595, 46655123, 44982801, 43812971, 42091225, 41036876, 39979811, 38992809, 38203357, 37146554, 35362124, 34493281, 33674010, 33460540, 32313024, 31115911, 30431384, 29743735, 29085350, 28086908, 27604209, 26952186, 26279304, 25363802, 24840467, 24571297, 23587084, 23068738, 22871835, 22275143, 21707797, 21234714, 20727614, 20607159, 20380401]
14179B0380401n17748m80868o51935n65489l01275j69457m89171l03939n10347
14170A6390172j00013k05458n34675j31468k53332m16300l67556m55174O8163
14161A3994359l98672l22117k27185l13664k5582l51627m06900k7964n13390K36775
14151A1644033k54855j50987k74150l49454k28376M791J6466m31376K60457j34388
14141A0102161k25269m4364n14361N2117l89520L90039l03228j71822l91385k70474
14131H233894L24261m22113J93697l38247n157j54053R1608k97651l05968K6585
14121G346856K14772o705m56690J83286m8830l22502P7341m03044K02357k13466
14111F573375k91050J45548j31831l70888P9039M5553r9664Q8782m93356L12137
$$ y = [20380401, 19862653, 19381785, 18729850, 18164361, 17863086, 17693629, 17204458, 16900519, 16390172, 16290159, 16084701, 15550026, 15418558, 15165226, 14748926, 14381370, 13926196, 13994359, 13595687, 13273570, 13046385, 12732721, 12707139, 12355512, 11948612, 11920648, 11407258, 11644033, 11389178, 11238191, 10964041, 10614587, 10386211, 10391002, 10407468, 9976092, 10236549, 10102161, 9876892, 9832528, 9318167, 9370284, 8980764, 9370803, 9067575, 8895753, 8504368, 8233894, 8558155, 8136042, 8329739, 7991492, 7986335, 7832282, 7923890, 7626239, 7320271, 7346856, 7561628, 7554923, 7098233, 7281519, 7232689, 6910187, 6987528, 6584484, 6786841, 6573375, 6282325, 6427873, 6296042, 5925154, 6004193, 6049746, 5950082, 6038864, 5545508, 5857645]
14101E857645q6238k93108Q5927j71727O5759m99460O35268m14528k91699O46078
14091E533917l26409l86920r8483L65399k40878k33694M56230j44153r6249l83215
14081D445545P4186J58695m57819K93360j35012k42006M01854n56905J40540M4775
14071D167213k32930L60666k26658k32349k48L44146k62063q9356K83400m21543
14061C690278j22328M03067j8931l97042M32887o08325J19106j35945J80273j20323
14051C422717j82982k05592J67246m4677j58143R5011j32924R9288J6127o9252
14041C006819J09867l7535l27660j6805L80342r7095k08022k93437L50777P8050
14031B945301J65172l92206K59337q5283k97913K1883k00138M25450O5827k50523
$$ y = [5857645, 5771407, 5478299, 5564226, 5392499, 5458258, 4958798, 5594066, 5179538, 4887839, 5533917, 5207508, 4820588, 4722105, 5087504, 4846626, 4612932, 5069162, 4925009, 4828760, 4445545, 4519731, 4678426, 4220607, 4513967, 4378955, 4136949, 4538803, 3981898, 4122438, 4167213, 3934283, 4294949, 4068291, 3835942, 3835694, 4179840, 3917777, 3828421, 4111821, 3690278, 3567950, 3971017, 3952086, 3555044, 3987931, 3379606, 3498712, 3362767, 3543040, 3422717, 3239735, 3034143, 3201389, 3156712, 2998569, 3093580, 2960656, 3059944, 3076071, 3006819, 3116686, 3079151, 2751491, 2734686, 3115028, 3017933, 2809911, 2516474, 2867251, 2945301, 3110473, 2718267, 2977604, 2892321, 2594408, 2616291, 2416153, 2841603, 2907430, 2656907]
14021B656907j70886k79488N40333m85775N7479L38195o25015K17244L58290k86416
14011B320868J60793q9873J00331m10645O7492q596j9129M4693j27865L37442
14001B375511l41638J88765j93493J96768j32080m4372j89826k63815Q4238L63058
13991B043116O3588Q7197J434355K847192Q706125J3987826J0345589q151496
13983C1363492A4713281o810218k352926r57084j088334l76217P5807q2748m65944
13974B655617j54882K9832r8206J73805N9815l14534N9122m21020K62545j51948
13964B100146j473q5325K61029P5062l66884J43287m27150L3003r0170k3024K38931
13953A857432k4280K90721p05443L48555K00710p7219l23511K16244l32731K91091
$$ y = [2656907, 2486021, 2206533, 2746866, 2261091, 2318570, 2656765, 2031750, 2248994, 2607284, 2320868, 2481661, 2391788, 2492119, 2081474, 2148966, 2140370, 2121241, 2165934, 2038069, 2375511, 2033873, 2222638, 2029145, 2225913, 2093833, 2049461, 1859635, 1595820, 1680058, 2043116, 2106704, 2193901, 3628256, 6475448, 15181573, 29169399, 39514988, 31363492, 14713281, 7903063, 5550137, 4593053, 3504719, 3128502, 3204309, 3121561, 2655617, 2500735, 2530567, 2432361, 2606166, 2665981, 2351447, 2410569, 1989549, 2252094, 2100146, 2098673, 2013348, 2274377, 2349439, 1982555, 2125842, 1698692, 1731695, 1641525, 1618501, 1857432, 1833152, 2123873, 1418430, 1766985, 1967695, 1890476, 1566965, 1783209, 1450478, 1741569]
13943A741569L25943n79480L78883l69551O5163j25573R9233R0264j47089j70886
13933A308476L69172j88410n164l0021L10264l36794o3442M5927J83190j68297
13923A424901r6355P12288o94901k8033O2354L8895j16073k35909M04304l10012
13913A161459j6549L7426L40380k93176J18407R8113o5540l50896N02038l26209
13903A205453r6078Q7919j48910K38814K61199j63254K0352J39767k71226J10484
13893A384520j27857m1225P741r0667J92742k98647K84968O1922k83024K52521
13883A342994q2539j8663l79399M43034k62006K11330k24938K81279l34583J69040
13873A145549k0286l08031K40835l47627L51956O879k36331J99510L08849j93186
$$ y = [1741569, 2067512, 1488032, 1866915, 1497364, 1562527, 1436954, 1536187, 1626451, 1479362, 1308476, 1677648, 1489238, 1484074, 1454053, 1764317, 1427523, 1364081, 1410008, 1593198, 1424901, 1328546, 2040834, 1345933, 1317900, 1380254, 1419149, 1303076, 1067167, 1471471, 1161459, 1144910, 1182336, 1522716, 1229540, 1347947, 1446060, 1380520, 1029624, 1531662, 1205453, 1109375, 1197294, 1048384, 1287198, 1548397, 1385143, 1405495, 1545262, 1274036, 1384520, 1256663, 1215438, 1223179, 1132512, 1325254, 1026607, 1311575, 1373497, 1090473, 1342994, 1260455, 1241792, 862393, 1305427, 1043421, 1254751, 1029813, 1311092, 976509, 1145549, 1125263, 817232, 1058067, 710440, 1062396, 1069275, 832944, 1032454, 1341303, 1148117]
13863A148117l22634L17243j48008N4867N2086j86284P8742J27912l0450J00773
13853A192364Q0228j25474l67737K99037J05797l20252j05776J4010k06399M69442
13843A035240j02583r5627k6507L61935n32639N84480k88376l33758N65034n50560
13833F16639p2771L79535j84111K23567r1917l72654N67114l9650L170D54853
13822A012663l52942J8763O8780k0789k40670M24469j03690j01932L49159m15210
13812F38601M04258l45015j53108K08982J91288j12901j32567k27925M6977R9494
13802F18084j12145k114L63237l61216N65084m97734O2856K54663o3187J54094
13792I81622j67608j6402l15651M80665j16878Q44R113C79756L43243K35293j47676
$$ y = [1148117, 825483, 1142726, 994718, 1049585, 1101671, 915387, 994129, 1122041, 1091591, 1192364, 1272592, 1147118, 779381, 1078418, 1184215, 863963, 758187, 772197, 565798, 1035240, 932657, 837030, 810523, 1172458, 639819, 1224299, 935923, 602165, 1167199, 616639, 543868, 923403, 739292, 962859, 870942, 498288, 1065402, 1025752, 1028922, 454853, 1012663, 659721, 678484, 747264, 726475, 485805, 910274, 806584, 704652, 1053811, 638601, 1042859, 697844, 544736, 753718, 945006, 832105, 699538, 471613, 518590, 618084, 505939, 503825, 867062, 505846, 1070930, 573196, 636052, 890715, 827528, 981622, 814014, 797612, 481961, 962626, 845748, 846592, 855705, 379756, 722999, 958292, 810616]
13781H10616D01278Q1549M13128k62094r2124J67111j6508j40482K4773J09724
13771F86355K37668l2889j68349k18492L43034n1699j68332R6783j76270J54364
13761G02173K7685p5158J32129M6200o3423k47830K00587k85963J40383K20023
13751G96806B42651N60169m2544o8540C33963L97813k01324Q8583k32587J64935
13741E51383K4234B52121K50577J17007B72937K92469N1606J6789j97366L6149
13731D72584j9177p0418M09417k11584M00218B99383P6321P831K27633q2053K39640
13720G68755k00804J59156B71136L16053K22257l28229k32844m3099J87441O9202
13710D61917K95331l18700O4713N6706L16022k44043n0569k04350K04277j77466
$$ y = [810616, 401278, 482827, 895955, 633861, 541737, 708848, 692340, 551858, 576631, 686355, 924023, 891134, 722785, 504293, 847327, 795628, 627296, 724079, 547809, 702173, 729858, 654700, 786829, 833029, 769606, 521776, 722363, 436400, 576783, 796806, 242651, 802820, 760276, 691736, 333963, 731776, 530452, 619035, 386448, 551383, 575617, 252121, 502698, 619705, 272937, 565406, 617012, 633801, 436435, 472584, 453407, 382989, 792406, 580822, 981040, 299383, 375704, 383535, 611168, 529115, 768755, 567951, 727107, 271136, 587189, 809446, 481217, 248373, 205274, 392715, 461917, 757248, 438548, 503261, 559967, 875989, 631946, 581377, 377027, 581304, 403838]
13700D03838l7642j65239l0198K91900j45586N59540B63579J17635Q3434M6747
13690E11395r7385k36K9734J5953j15249K35641j16265m9047B2858L37791L90383
13679G51032l19952M6376m6933j13954J0417R6649J44880k11036R5171K07120
13669F59770j22665p4625B10078B1621N24692J69142j16690k25404m0229R6898
13659D30030L1240p8147A68518M99704k65285j57728K94572o5504k3990A62552
13648G31794K2816q0913k13075K911j95035L57166j98550e6234D22283o8590A67991
13636C47978L862P068j22061H2602M23653N6963B36305l2324L3313K74334J79464
13625F91092k89196p8685k0052n5020K44391j69102j1281L08333k96643N1546
$$ y = [403838, 366196, 200957, 170759, 462659, 317073, 876613, 263579, 381214, 464648, 511395, 414010, 413774, 443508, 459461, 344212, 579853, 463588, 414541, 22858, 360649, 751032, 431080, 477456, 430523, 316569, 326986, 423635, 568515, 357479, 452650, 659770, 537105, 462480, 210078, 21621, 546313, 715455, 598765, 373361, 333132, 430030, 461270, 383123, 168518, 668222, 402937, 245209, 539781, 474277, 450287, 162552, 731794, 754610, 673697, 460622, 463533, 268498, 625664, 427114, -56234, 422283, 353693, 167991, 347978, 351840, 358908, 236847, 82602, 506255, 563218, 236305, 203981, 237294, 511628, 691092, 401896, 323211, 303159, 248139, 492530, 323428, 312147, 620480, 323837, 375383]
13615C75383K31549j71154J04775B31366M9051E1906J03989K66299o5573J4275
13605C70896L18343j42168k29705R9265J76513n3392j70176A33856J76867L37507
13595F48230B72834o5646J27189N4877a51767C47004K85178B52928J29885o4046
13585C18767J32839D173L37297K48984L76141B10352f1925D94632j80755j47941
13575A65936E3253N04484g6338j21823A21810L10995p4239A8950K03510M18597
13565F41057j46250B06396M3976J42475J51800j63903A45502c9950B66890J20242
13555C87132O9936A62868k0927D8072L00537p49J43652e148B00623K53021J0701
13544D64345k07454b79783B83249r6548J06998A04940M45294a0926B14574G4869
$$ y = [375383, 606932, 435778, 540553, 231366, 280417, 51906, 155895, 422194, 356621, 370896, 689239, 547071, 317366, 416631, 593144, 539752, 369576, 133856, 310723, 648230, 272834, 207188, 334377, 389254, -151767, 347004, 632182, 252928, 382813, 318767, 451606, 4173, 341470, 590454, 966595, 210352, -61925, 494632, 313877, 165936, 53253, 557737, -76338, -198161, 121810, 432805, 358566, 18950, 222460, 641057, 494807, 206396, 250372, 392847, 544647, 380744, 145502, -39950, 266890, 387132, 457068, 162868, 141941, 48072, 348609, 347860, 491512, -5148, 200623, 453644, 464345, 256891, -279783, 283249, 186701, 293699, 104940, 550234, -10926, 214574, 74869]
13533B6752N5631J2380J16158j6970N4293K44877A20214J79473K03123B45334
13522C10741j18178K39991j38728L2975N6076n759j06090K36616A24258L23803
13512D48061j26298L0446j51156j7367O4722J90111A56001Q8524J3414L0441A2380
13500H3489O78k3923M56171A55373l3613L20840M9615k01253m0907K76567q5462
13489D41160H0081J14774L28262o248F5671L27902j64210a49725P2018E16270
13478B87902q4236d6838D31986d3669h059j63309A33022R9395A07378L14797k08222
13467B13953A2619Q0199l3829J92181P4299J50640r6202A26949a2697F6142J3119
13456G9261J68602B3141Q1232P9697Q7383M5094M1804j25268J0911G599K95063
$$ y = [26752, 82383, 94763, 210921, 193951, 248244, 493121, 120214, 299687, 502810, 245334, 310741, 192563, 432554, 293826, 326801, 382877, 377118, 271028, 507644, 124258, 448061, 321763, 352209, 201053, 183686, 248408, 438519, 156001, 244525, 257939, 288380, 12380, 83489, 84167, 60244, 516415, 155373, 121760, 442600, 492215, 290962, 250055, 526622, 441160, 80081, 194855, 523117, 516869, 65671, 393573, 229363, -149725, -77707, 516270, 287902, 203666, -46838, 431986, -43669, -8059, -171368, 133022, 232417, 107378, 422175, 213953, 12619, 92818, 58989, 251170, 325469, 476109, 379907, 126949, -12697, 66142, 79261, 247863, 23141, 104373, 184070, 271453, 316547, 358351, 233083, 243994, 7599, 302662]
13445C02662H5038k054P4596J11667J55303a51914C42198A29918N77235A12886
13434F09854A57779J25670Q3634j04489J6508G8064J68577l9265k5654Q0367D2674
13422B33169O3185r8092k9184M09112E5358d1850C68835n2660N5140n2733A39431
13410A84805K40819n0610E9894K10725I2515K86180r4203k3103p2516J06704r6441
13399A99136j8543o3733l6432K97320A15967N3261A4326c3267j30800A05710b07057
13387A30267L040J15953j8377J80628H4432a6464C12271a91935D1534Q7702K24505
13376C53741E8260K07896j9911K75152d396C2264L21765l4016G016K42717P0640
13365C20373n3312B7035M57763A37414o6659Q5033k4276a8338A09848K6108d0827
$$ y = [302662, 85038, 82984, 157580, 269247, 424550, -151914, 342198, 129918, 707153, 112886, 609854, 157779, 283449, 367083, 262594, 279102, 78064, 246641, 207376, 181722, 262089, 42674, 233169, 296354, 198262, 169078, 578190, 55358, -41850, 368835, 316175, 371315, 318582, 139431, 184805, 425624, 375014, 59894, 270619, 92515, 378695, 284492, 261389, 188873, 295577, 199136, 180593, 116860, 80428, 377748, 115967, 169228, 14326, -33267, -164067, 105710, -207057, 130267, 133307, 249260, 230883, 411511, 84432, -16464, 312271, -191935, 41534, 129236, 353741, 58260, 266156, 246245, 521397, -4396, 32264, 354029, 320013, 7016, 249733, 320373, 267061, 27035, 484798, 137414, 70755, 155788, 131512, -18338, 109848, 135956, -40827]
13353A22884J40923a0205B07678J74016j19554J91822H4934a2639A9570M57713
13343D77283A57792k2402Q2672d3751C4596J75015b5408A73032o6837J07066K08875
13332D22136m8179q8525K148f8632C88684A91118a0184A93717q6596j4209J58407
13321B51319b9006C19648C0269K48869G8699K24931f8144A744M93365B09825K85416
13310D95241j75677m1125L2102a31631B8777J84816P064J34799E3625e977B83595
13298A03665k0969c00767D2909P8475P6467n4150K38424F1416A1373L85645p8472
13287C18546q5813o3532J8735e2450E711J32042b2575A11428k669D4137J69381
13276B13518j02863J92028A18659J5005j7100K76829j88550J17642j01653g4246
$$ y = [122884, 263807, -10205, 207678, 381694, 262140, 453962, 84934, -12639, 19570, 477283, 157792, 135390, 218062, -43751, 34596, 209611, -25408, 173032, 106195, 213261, 422136, 373957, 285432, 287580, -68632, 388684, 191118, -10184, 193717, 107121, 92912, 251319, -29006, 319648, 30269, 279138, 78699, 303630, -68144, 1744, 495109, 209825, 495241, 319564, 278439, 310541, -131631, 28777, 213593, 220657, 355456, 53625, -5977, 283595, 103665, 82696, -300767, 42909, 121384, 197851, 143701, 382125, 61416, 11373, 397018, 318546, 232733, 169201, 187936, -52450, 5711, 137753, -22575, 111428, 108759, 44137, 213518, 110655, 302683, 118659, 133664, 116564, 393393, 204843, 322485, 220832, -74246]
13265D5883e234A28881J22496H499M14079j16570p4091j11949m4250b68120g3950
13253A7918g7595C10301Q0791j33110j08075e8957j5812B74435c04678b7294H2083
13241A73657e0556J1506A35542J71283b58578D6907a81356M2634C00799a64558
13230b40370B31323r6276b76021B01426C2849b59111B70951e1028B86806G8294
13219A97630G6599J16807J73634A50067K93459a84865D10413F4899b97115a37936
13208B59587q6296J1934p6011j8540K45163a32409a892k81105d5749n7401I1032
13196B08483O8555F5355a31980b9590n2963B45092b5938D29631A51777G5717C5012
13184A287P5675e2983D41349k09205m0980p594a85769B40879N8403a25142f2223
$$ y = [45883, -5234, 128881, 251377, 8499, 422578, 306008, 231917, 119968, 75718, -268120, -73950, 17918, -77595, 310301, 391092, 257982, 149907, -58957, -74769, 274435, -304678, -27294, 82083, 173657, -50556, -39050, 135542, 306825, -258578, 46907, -181356, -138722, 300799, -164558, -240370, 231323, 135047, -276021, 201426, 32849, -259111, 270951, -51028, 286806, 78294, 197630, 76599, 193406, 367040, 150067, 443526, -184865, 410413, 64899, -297115, -137936, 259587, 173291, 185225, 109214, 90674, 335837, -132409, -1892, -282997, -45749, -103150, 91032, 208483, 277038, 65355, -131980, -29590, -82553, 245092, -25938, 429631, 151777, 75717, 35012, 1287, 76962, -52983, 441349, 232144, 191164, 183570, -185769, 240879, 299282, -125142, -62223]
13172A98351n2827R1674j05112a35337G5924A9646r315a5788C96162A36371J00527
13161B36898c8963a5765k77045B1438K86093A39014H385J70835a14493o8493H554
13149f0842A11207a76671B11451F0876a8537A76257c00250J10022B70037b70495
13138B41333a5633A66273D7105J06471K12733d8999q5059M5829F2187A3536a08855
13126C3996i4833L3B1630J45028a60348c3602q3500e7581r8421J9008A82814K03275
13114C86089a63606B33772J6242j06439b72738G0869b37718M6325d3388F50698
13103F4770K6530b9860j38397a8816j68300A78823J10879o0060b52076b4409a298
13091d1468m1541C54210k2795f3325F190J68166g1762A53351h9469k56980D3413
$$ y = [198351, 145524, 237198, 132086, -135337, 75924, 19646, 10331, -15788, 396162, 136371, 236898, -38963, -15765, -292810, 21438, 307531, 139014, 8385, 179220, -114493, -182986, 8554, -60842, 111207, -176671, 211451, 60876, -18537, 176257, -300250, -190228, 270037, -270495, 241333, -15633, 166273, 47105, 153576, 366309, -48999, -134058, -88229, 62187, 13536, -108855, 33996, -94833, -94800, 21630, 166658, -160348, -33602, -117102, -57581, -156002, -136994, 182814, 386089, -163606, 233772, 250014, 143575, -272738, 70869, -237718, -191393, -43388, 650698, 64770, 91300, -29860, -168257, -18816, -187116, 178823, 289702, 229642, -252076, -24409, -1298, -41468, -83009, 354210, 331415, -63325, 6190, 174356, -71762, 153351, -89469, -346449, 43413]
13079E5709J60538d2763j43350C710a88977B34171o2904J4273q5494a67807A61166
13067A90674F6946b00205A84759J30698B2457N7762B0186h097p8630D9236b0701
13055C1278L0022J87699l6844K11809m4755K8445A11326a542A71065a79006A22748
13043b7053I9110K77860j12442C7074P3811J39661J19335e912C0701a87129A02756
13031a98078C02258a44878D29694I3641m5077N5012O6397a13704B2997c8406k34617
13020b73023B83663F8646b5423E46756B38800F6358K7706L0017m7358R6288R3779
13009B66790j19787m9494O8925m1497E6554L35906A9743b18618A93518p2481a83104
12997D5897J4523B4944K13962a83146F7942J00751p6236M5045b35169B3161b03406
$$ y = [55709, 216247, -42763, -186113, 3710, -188977, 234171, 171267, 185540, 100046, -167807, 161166, 190674, 66946, -200205, 184759, 315457, 22457, 80219, 20186, -8097, -86727, 49236, -20701, 31278, 61300, 248999, 212155, 423964, 379209, 407654, 111326, -1542, 171065, -179006, 122748, -27053, 99110, 376970, 264528, 37074, 110885, 250546, 369881, -5912, 30701, -187129, 102756, -198078, 302258, -144878, 429694, 93641, 48564, 103576, 169973, -113704, 22997, -38406, -273023, 283663, 68646, -25423, 546756, 238800, 66358, 94064, 124081, 76723, 173011, 266790, 147003, 97509, 166434, 124937, 56554, 392460, 19743, -218618, 193518, 121037, -183104, 45897, 60420, 24944, 238906, -183146, 67942, 168693, 92457, 137502, -235169, 23161, -203406]
12985c1959k02904c4506C53657b4054r5320C33203j55286b8783B8645J96319a13774
12973A10000l5882I812O9555a25970A14464g7320j44443b6341A08118A621a29761
12961f8956r2424A58998l3533d21040A43406F864K9999b02309Q1711k568C20686
12949e2262m518A51545J84476q6221j05710D9176g3616C44881G6224b97717f5060
12937c7622k45104A68938a42459h852A59136e057A68501n4613a31271A35789k7979
12926A07810a43201A22758a636B23424i0690C5040a19231B24359i319B61579A07917
12914A11568K65921A28211m2378e6552A58598J93877a31648B29669a75405E4722
12903A88049a50475B51405m2368q0138a9048j0865k37986C7008M14810c32723
$$ y = [-31959, -234863, -34506, 353657, -24054, -119374, 333203, 177917, -28783, 28645, 224964, -113774, 110000, 74118, 9812, 79367, -125970, 114464, -77320, -221763, -26341, 108118, 1621, -129761, -68956, -161380, 158998, 125465, -421040, 143406, 6864, 36863, -202309, -120598, -123166, 320686, -52262, -56780, 151545, 336021, 249800, 144090, 49176, -73616, 344881, 76224, -297717, -65060, -37622, -282726, 168938, -142459, -8852, 159136, -5057, 168501, 113888, -131271, 135789, 107810, -143201, 122758, -1636, 223424, -90690, 35040, -119231, 224359, -9319, 261579, 107917, 111568, 377489, 128211, 85833, -56552, 158598, 352475, -131648, 229669, -175405, 54722, 188049, -150475, 251405, 209037, 128899, -19048, -29913, -267899, 37008, 451818, -332723]
12892G9129b90747B63386b764A18023b8183C70660G9297B5301Q0871Q3270f4410
12880H5891a27735B38385A09075B8344M4405a52971B20179q7114k1201b06150
12869B02546e5079H4237L1407h3386j18223q8591a26928N1727D4991N03K11302
12858B56796F6711K04892a19139B93590B2227N7746b27140b0589k74327G2471
12847B90637f544D01830j75351G4830R8163M5690e0225B31655e8645A96494c70270
12835F068K76720B0912b14471E85261a90729j34613J34677H1129k0D902b4626
12823g9258j36437C19577C3736b35059l6460n0803i7687A22407J00756A354c0294
12811g4440j51580q4847Q9956D4236K26483b20269G233a6957n0977A17207K42720
$$ y = [79129, -290747, 263386, -2764, 118023, -28183, 370660, 79297, 25301, 106172, 189442, -64410, 85891, -127735, 238385, 109075, 28344, 72749, -152971, 220179, 133065, 111864, -206150, 202546, -55079, 84237, 115644, -83386, -201609, -290200, -126928, -75201, 44991, 45494, 256796, 66711, 271603, -119139, 293590, 22227, 79973, -227140, -20589, -294916, 72471, 290637, -6544, 401830, 226479, 74830, 172993, 218683, -50225, 231655, -58645, 196494, -370270, 6068, 282788, 20912, -214471, 585261, -190729, -325342, -190665, 81129, 81109, 4902, -24626, -79258, -215695, 319577, 33736, -235059, -271519, -322322, -97687, 122407, 223163, 1354, -30294, -74440, -226020, -310867, -220911, 44236, 270719, -220269, 7233, -16957, -67934, 117207, 359927]
12800C59927A00073l7337J19644g919j20615l3401A12210c51791a16545g383A0682
12788d84679K13741a07413A60375K9259e9428A21889j397c35827A41966h0393
12777b8797k49473g5569B43888g05j79074G0557h6846C54014d27354c5236B46724
12765A5319c26820B97890q723M9814D1003Q877R8566a71078H3483a55175m8427
12754b03602C6566a20391j11914B590a98580B52548A13701m0280J68339n4433
12744A87327a63419A33171n3753c08936B99107Q1675A12043Q7555D9767N4029
12734A03796B3614J9108J07373O5920p3878l5595K10091b58611F4285A3861G29
12722G6632A6803a71312A21556b8121A58266c31809J65109F6709l0654Q2454D7775
$$ y = [359927, 100073, 62736, 182380, -7919, -128534, -161935, 112210, -351791, -116545, -7383, 10682, -484679, -270938, -107413, 160375, 189634, -59428, 121889, 120492, -335827, 141966, -80393, -28797, -278270, -75569, 243888, -705, -179779, 70557, -86846, 354014, -427354, -35236, 246724, 15319, -326820, 297890, 289167, 338981, 41003, 49880, 148446, -171078, 83483, -155175, -203602, 36566, -120391, -232305, 2590, -198580, 252548, 113701, 73421, 241760, 187327, -163419, 133171, 79418, -308936, 299107, 380782, 112043, 199598, 49767, 103796, 23614, 42722, 150095, 216015, 142137, 106542, 316633, -258611, 64285, 13861, 729, 76632, 16803, -171312, 121556, -28121, 158266, -331809, -166700, 66709, 36055, 118509, 47775]
12710B18567J14305f3415A79790J17579C3710K38569O5054j17706k9600m0990
12700A49037R5390b05223N57G1274A1323a86855E1725a89977I5250a34546E9874
12688E87570A3906K43048F0381a93453B61956n3076E2593f3878A61643a3567A74914
12676C22664O3616h6411k01775B34606J36911j00905I2324i5812j28494k43415
12666d67721B15583n5155f5245G3277a26705B13108O7910A26692c8879C6523J84426
12655B20949r3289D4593d5044A91407E1735a71027A51311a89128G5942K7968O2206
12644A66116a0304k01824A91917g1031B03446b32132b3326p6674E8165B8434J05945
12633A34379a23455P995B39600r8450g3339B36037N6000K4913F4239a2367A66426
$$ y = [218567, 332872, -63415, 179790, 297369, 33710, 272279, 337333, 219627, 190027, 149037, 244427, -205223, -204666, 71274, 11323, -186855, 51725, -189977, 95250, -134546, 59874, 587570, 13906, 256954, 60381, -193453, 261956, 208880, 52593, -63878, 161643, -13567, 174914, 322664, 386280, -86411, -288186, 234606, 371517, 270612, 92324, -95812, -224306, -467721, 215583, 160428, -65245, 73277, -126705, 213108, 281018, 126692, -38879, 36523, 220949, 127660, 44593, -45044, 191407, 51735, -171027, 151311, -189128, 75942, 103910, 166116, -10304, -212128, 191917, -71031, 203446, -232132, -23326, -100000, 58165, 28434, 134379, -123455, -115460, 239600, 141150, -73339, 236037, 292037, 316950, 64239, -12367, 166426]
12621B0219J20630Q6335Q3467A45157J6814D2812J61965N4227j18886a03978a43
12609A04928J09121F1602m568B3759P6488e0611J0525B59970j18307O8900a37694
12597a05480D98803A59268l2814k2753J7652c05210O1329c2112j66108e3905j3472
12586f7377A23179b22027B60403a31687B05345b3510C3011a80068j17104B91458
12575B19141L1739b60863E7309k1061a90370a1252H2446J72152a10308c3122B24353
12563A37085g2457H6928a13726G1877K11088I1952a29232K2120j05203J01260
12553a11055d8010a6706A63291G0208C871b53380I7360O861a09198F074b87764
12541B54431a59241A63883J68877i3302j0013D7598R286K90336j40832a20096
$$ y = [20219, 140849, 227184, 310651, 145157, 161971, 42812, 204777, 259004, 140118, -103978, -143, 104928, 214049, 61602, 57034, 23759, 100247, -50611, -40086, 259970, 141663, 210563, -137694, -105480, 498803, 159268, 126454, 103701, 121353, -305210, -243881, -32112, -198220, -53905, -67377, 123179, -222027, 260403, -131687, 205345, -23510, 33011, -180068, -297172, 291458, 219141, 250880, -260863, 57309, 36248, -190370, -11252, 82446, 254598, -110308, -33122, 224353, 137085, -72457, 86928, -113726, 71877, 282965, 91952, -129232, -107112, -212315, -111055, -48010, -16706, 163291, 70208, 3871, -253380, 97360, 104221, -109198, 6074, -287764, 254431, -159241, 163883, 332760, -93302, -103315, 47598, 56884, 347220, 206388, -120096]
12530a9409C19814j50050J21981g3575a432j15118k28754F6857k4960d713H2970
12518e6909C38004D4887K53211N3634h5057j42185K0454a02565c6300C66896b30780
12506C9364R1949b51646L7394L2962B82963G072a37265G9732a2351A62243f1081
12494B87853b63773I3788Q7186o3094m4464a53447I1766b19244A32667b09741
12483b37469A8761J55428a75992e0555K081k53413a9567j73003d453k93399c6696
12471d36796B23640r7302k331a47321E7595a41998o96M6188B22859h1153p1319
12460a52472A68937h6835C0124d6120j68725E4609h5366j19038C5157J03457b05878
12448B71315d0074B17680A5477a99927A97503a36557l4829d0012B25794a2895
$$ y = [-19409, 319814, 169764, 291745, -73575, -1432, -116550, -345304, 66857, 41897, -4713, 82970, -56909, 338004, 44887, 298098, 351732, -85057, -227242, -206788, -102565, -36300, 366896, -230780, 39364, 131313, -251646, -214252, -181290, 282963, 7072, -137265, 79732, -12351, 162243, -61081, 287853, -263773, 93788, 180974, 117880, 73416, -153447, 91766, -219244, 132667, -209741, -237469, 18761, 174189, -175992, -50555, -48474, -301887, -19567, -192570, -4453, -297852, -36696, -436796, 223640, 126338, 124007, -147321, 57595, -141998, -142694, -96506, 222859, -81153, -152472, 168937, -86835, 30124, -46120, -214845, 54609, -85366, -204404, 35157, 138614, -205878, 271315, -40074, 217680, 15477, -199927, 197503, -136557, -171386, -40012, 225794, -12895]
12437i5096D7211c6016A77182q746k8395E7735d4848H8732A9612K5692a62289
12425D50000h1667j50953A17578l8652J7573k6783b73355B30540j06458K72297
12415C96379D6940L8042j9444K65412g0902j12570h37l18216B5744P0441a20589
12403a03162A7403a42390f1254C44886A67483j3116m1162k2941a25360A31282
12392c8073A29776b54839H1108J85806A00965c07146D0583b96256a43031k06250
12382c49281C0186R1558J83251C056c40348B46786a88570b0733C38359A8335a77997
12370h0715j64878C16478i3290M0580G1949b38019E870k178b96609d662j32461
12359a37123o336B66837i9106A1383b34495C4439a73354B54426n1058M5747G3586
$$ y = [-95096, 47211, -36016, 177182, 168436, 140041, 57735, -44848, 88732, 19612, 45304, -162289, 450000, -81667, -232620, 117578, 78926, 96499, 69716, -273355, 230540, 124082, 396379, 46940, 84982, 65538, 330950, -70902, -183472, -837, -319053, 25744, 96185, -120589, -103162, 17403, -142390, -61254, 344886, 167483, 154367, 113205, 90264, -125360, 131282, -38073, 129776, -254839, 81108, 266914, 100965, -307146, 40583, -296256, -143031, -349281, 30186, 121744, 304995, 3056, -340348, 246786, -188570, -20733, 338359, 18335, -177997, -80715, -245593, 316478, -93290, -52710, 71949, -238019, 5870, 3692, -296609, -4662, -137123, -143459, 266837, -99106, 11383, -234495, 34439, -173354, 254426, 203368, 249115, 73586]
12347d3761C9951j4677a6995k8589Q240B21009n6774e4594A52372i4572j34455
12336b29027j12894I4337J22268j03793J46416i9841C73874f3107b0247r026p7343
12325a06616h849o9843C3686L7661h1073A52204a95341m6993L256k3895J05051
12314a57922a3080A24443b28396b7465B79612a20996B18306b3326G8791k9520
12304D9271K4127a03995A06492c7937F6211J29449K70609A44793C6936h3854B60526
12292A10705b04607F1640a7363k1543A17591f6512A19355n8176A1096O07158I5057
12280H2530L1169O2442n6070K53188j75163f9518P034B17968c6928r0910D734
12268b41017D9129M44863a64508K7550B36217A0268f693M10H6884C7439N1868
$$ y = [-43761, 39951, 25274, -16995, -45584, -37344, 221009, 164235, -54594, 152372, -94572, -229027, -341921, 94337, 216605, 112812, 259228, -99841, 373874, -63107, -20247, -29273, -106616, -8849, -78692, 33686, 71347, -81073, 152204, -195341, -242334, -239078, -262973, -157922, -13080, 124443, -228396, -27465, 279612, -120996, 218306, -23326, 78791, 49271, 73398, -103995, 106492, -37937, 66211, 195660, 466269, 144793, 36936, -83854, 260526, 110705, -204607, 61640, -17363, -38906, 117591, -66512, 119355, 61179, 11096, 618254, 95057, 82530, 113699, 176141, 120071, 373259, 198096, -69518, -62484, 217968, -36928, -127838, 4734, -241017, 49129, 493992, -164508, -136958, 236217, 10268, -6693, -6283, 86884, 37439, 89307]
12257H9307C1147Q4938b198B34184H5251d7120G7313c8708j02990B80744A34978
12245i8301A88857g9361J648l693m3450A91558n6565K64322j61113A14144E557
12233F2248K9913Q1503K09637A19116K15552e1068j82840J7865B23481J67946
12223C91427C0652O6045a37945F9804L24620j71777E3961K90840G1256O5627j2774
12212A24109B7858a7778I2366l782c7459j80755C9368J72682n5224O034O8644
12201B31504g0843D62087j22505I8804L56434Q711A85850J14810J656I4946P7590
12190A72536F6636M0458J01299m5421K48448a5542C71293k1649j72705a45115
12179i2670B08832a65350E54331G0069J50142J88759j80573E5608c1489B40027
$$ y = [89307, 31147, 116085, -2198, 234184, 85251, -47120, 77313, -38708, -141698, 280744, 134978, -98301, 188857, -79361, -77713, -81406, -124856, 191558, 134993, 399315, 238202, 114144, 5557, 62248, 92161, 173664, 383301, 119116, 334668, -51068, -233908, -216043, 223481, 391427, 30652, 96697, -137945, 69804, 394424, 222647, 53961, 344801, 71256, 136883, 124109, 27858, -17778, 92366, 88584, -37459, -218214, 39368, 212050, 156826, 162860, 231504, -70843, 462087, 339582, 98804, 455238, 463949, 185850, 300660, 302316, 94946, 172536, 66636, 107094, 208393, 162972, 411420, -15542, 371293, 349644, 176939, -145115, -92670, 208832, -165350, 554331, 70069, 220211, 408970, 228397, 55608, -31489, 240027]
12168F3175O6928K22505j75569N4487c92077b4475I3883J27610J01582j51310
12158A71765a49919L6546C57096B2134c73624B36928D0564J45723e7223a1630
12147B34981j3832o3047b95053F7192a27074D30276j96230G2439i9126C15629
12136C03951a23798A3976b2945A12605d6630A31595K02009a4934A42480P9748
12126B22228b17909C14509G2829b41000B12924l1782a480C56170a98155b2732
12115E24924h0483L2116A40879b13974a2677r4289B94010a61250I8622J61178
12105B59800E331P612K39545b2694e852j37739g121A2501K29068I9164B2157H927
12092A01421a0378B0186R8390D1768h8299j25474A35082g1943A25209a23455q4005
$$ y = [63175, 130103, 352608, 177039, 231526, -392077, -24475, 93883, 221493, 323075, 171765, -149919, -113373, 357096, 22134, -373624, 236928, 40564, 186287, -57223, -11630, 234981, 221149, 158102, -295053, 67192, -127074, 430276, 234046, 72439, -99126, 315629, 303951, -123798, 13976, -22945, 112605, -46630, 131595, 333604, -14934, 142480, 222228, -217909, 314509, 72829, -241000, 212924, 181142, -1480, 356170, -198155, -22732, 524924, -80483, -48367, 140879, -213974, -12677, -106966, 294010, -161250, 98622, 259800, 5331, 12943, 252488, -22694, -5852, -143591, -7121, 12501, 241569, 99164, 22157, 8927, 101421, -10378, 20186, 118576, 41768, -88299, -213773, 135082, -71943, 125209, -123455, -207460]
12081b07460A59029N7360k7639J90151Q99050K22746G36561B12680M9432c9683
12070A88769K50795C475a3995l4089C47993A2562a51780B9203K96423g1737j95092
12059b66829J29046j81061B96371E3679N3407n78D9853P2814l1234b53508i0172
12047B19898G2859a0948B4084c80985A35688O8724a18451A44877A2889a11992
12036e6293K501C21178B8982K4778B2871N8742b6362h427j30579l0530I2413g2529
12023a81756A46927a5966m6614A78849H8202A1685a90638C09947j52571d67763
12012a08188l1056A70685a09894B55888b14712k58773b073A69781H142d440k85046
12001b89486K8177I0042l1212a87772P3423A42489g6303b508A36424d5369B56829
$$ y = [-207460, 159029, 216389, 188750, 378901, 1277951, 1500697, 736561, 212680, 262112, -39683, 188769, 439564, 3475, -13995, -48084, 347993, 12562, -151780, 29203, 325626, -71737, -266829, -137783, -318844, 296371, 53679, 107086, 106508, 49853, 122667, 91433, -253508, -90172, 219898, 72859, -10948, 24084, -380985, 135688, 204412, -118451, 144877, 12889, -111992, -56293, -53792, 321178, 28982, 53760, 22871, 81613, -26362, -8427, -139006, -169536, 92413, -72529, -181756, 146927, -15966, -62580, 178849, 88202, 11685, -190638, 309947, 157376, -467763, -108188, -139244, 170685, -109894, 255888, -214712, -473485, -2073, 169781, 8142, -4440, -289486, -261309, 90042, 58830, -187772, -114349, 142489, -76303, -2508, 136424, -45369, 256829]
11989H4181f2655A50333m3552e2660l83925A73518J4599b26347a07102j0791A43733
11977b09708F880a34574b9233G5399B2447a33484A74961h8697M4311m118j47203
11966a95707B2180b9104A97425C8241J09260b2511k24928O5498A6530a73689N6592
11955a17097F6798f5689j07566l8765l9520d1934A89580G6201b9478k79682d0926
11943a13232E4796g6726H6588b5185j1211r7680E3708a67343o1322C8807J06409
11932A45216i6454l6483L1237l7388d502C78681G614a04876c6292A0613b76541
11920b60865G5238a3848j44118A58264b55341e8213r1721G4681J86731c5068I2665
11908A52671b26974h3101a6502B42913c2184A39335h5074l5282j95699f4546h617
$$ y = [84181, -62655, 150333, 106781, -52660, -436585, 173518, 188117, -226347, -107102, -117893, 143733, -209708, 6880, -134574, -29233, 75399, 22447, -133484, 174961, -88697, -44386, -48504, -195707, 22180, -29104, 197425, 38241, 147501, -22511, -247439, -181941, 16530, -173689, -117097, 66798, -65689, -173255, -212020, -251540, -41934, 189580, 76201, -29478, -309160, -40926, -113232, 54796, -76726, 86588, -25185, -36396, -134076, 53708, -167343, -228665, 38807, 145216, -96454, -132937, -101700, -139088, -4502, 378681, 7614, -104876, -36292, 10613, -276541, -260865, 75238, -13848, -157966, 158264, -255341, -58213, -149934, 74681, 261412, -35068, 92665, 152671, -226974, -83101, -16502, 242913, -32184, 139335, -85074, -120356, -316055, -64546, -8617]
11896A32934R1917n9339b08551F6329a41079N4836j39922k78826A01669c10000
11885C6639l708L522K16262a32556m8860f3079G89L4879J19025J70525r3012l644
11873B28562b43688A2244b43817C58791i2637j6386k0339G1220A8333J5514a47254
11861b95082A39427a92295A7682b67678G9904L03061A55333b9082r6747H2740
11850A83135J948h9839J2739b5110A88626j3449b71875G5705a86897j61238J52529
11839a95606A06512f3592A56758p3950c48095B96860h9778b8907k48398J03282
11829a74023j83496a24514c2924A60656i988F4195b78227k0564G151f1446k04171
11818b65617A11360j9458R9554b4015D5801R6860a5027n8349J8402A33157c9029
$$ y = [132934, 224851, 165512, -208551, 66329, -141079, -86243, -226165, -504991, 101669, -310000, 36639, 32931, 36453, 252715, -132556, -181416, -63079, 789, 35668, 154693, 325218, 232206, 228562, -243688, 12244, -243817, 358791, -92637, -109023, -129362, 71220, 18333, 33847, -147254, -295082, 139427, -192295, 17682, -267678, 79904, 382965, 155333, -29082, -125829, 82740, 183135, 185083, -89839, -77100, -25110, 188626, 175177, -271875, 75705, -186897, -348135, -195606, 106512, -63592, 156758, 82808, -348095, 296860, -89778, -28907, -277305, -174023, -357519, -124514, -32924, 160656, -9988, 64195, -278227, -298791, 7151, -61446, -265617, 111360, 91902, 191456, -24015, 45801, 142661, -15027, -73376, -54974, 133157, -39029]
11806a10494q8414k5454p6287M1135i7678l8625I9211d24949J01016H5696B0886
11794a93974D1303a11063k77137A62625M3730a01355A09399e8588o7964M1601
11784h4951j35257B72184d646A4819b43100f2294r587F2429b56032h3118J0194
11773g2924p7355r4819R1159A22651a01536L1589l81286A24563b6093j42927n6983
11762b26003L3545O9180q2871O8556I8550b5933C48468a23648B11351a343j03957
11751a05300a8725A43306J09223d5850n4339A80148M0334H8935b32202J3452i1547
11739a33759B8968a22722A5437M976Q1769a32138M5246e705D9617i5356A8920
11727A49851C1697N0650k3308a28960E4256j7457A0324a0591E2024a28848g012
$$ y = [-110494, -198908, -224362, -300649, -259514, -97678, -136303, 99211, -424949, -323933, 85696, 20886, -193974, 41303, -111063, -388200, 162625, 206355, -101355, 109399, -58588, -126552, -84951, -220208, 272184, -4646, 14819, -243100, -62294, -71881, 62429, -256032, -83118, -72924, -150279, -245098, -153939, 122651, -101536, -69947, -451233, 124563, -26093, -169020, -226003, -192458, -123278, -206149, -137593, 98550, -25933, 348468, -123648, 211351, -1343, -105300, -18725, 143306, 252529, -45850, -100189, 180148, 220482, 88935, -232202, -218750, -91547, -133759, 28968, -122722, 15437, 20413, 102182, -132138, -86892, -5705, 49617, -95356, 18920, 149851, 31697, 82347, 59039, -128960, 54256, 36799, 10324, -10591, 52024, -128848, -7012]
11715A33996k8425N7661c01815M8124a25751B8764M837K10221j07029b00886h1752
11703d05904i0218J2630c0944j09842B95595r1397o0733a20807A36783o0017c42130
11691F0211L96458b9634q0801L939M9305A64063n1051b6071B863L014a25777A45758
11678A44532i853l77993A36392a05395Q930D97432a31328C05132A29045A6482
11667I1967b08525H0337K03945a87242h254A3559a523A2309K42306a09402a415
11655D5965K62939C4314L01704a48279A75553c39B73704m1527d5774I8137l1634
11644F6503b30729J13643c5074a6455I1850M7534D4922b82766C43855i1486b5877
11632B79243a09628J9693E25572c0504p098k61651R6767E2979N2638B8111P7884
$$ y = [133996, 105571, 163232, -301815, -253691, -125751, 28764, 33601, 243822, 136793, -200886, -81752, -405904, -90218, -77588, -30944, -140786, 295595, 204198, 143465, -120807, 136783, 76766, -342130, 60211, 456669, -29634, -110435, -106496, -57191, 164063, 113012, -26071, 2863, 5877, -125777, 145758, 144532, -9853, -387846, 136392, -105395, -96465, 497432, -131328, 305132, 129045, 16482, 91967, -208525, 80337, 284282, -187242, -8254, 13559, -1523, 12309, 254615, -109402, -1415, 45965, 308904, 34314, 336018, -148279, 175553, -339, 273704, 232177, -45774, 98137, 66503, -230729, -117086, -35074, -16455, 91850, 139384, 44922, -282766, 343855, -91486, -25877, 279243, -109628, -89935, 525572, -30504, -37602, -299253, -202486, 52979, 105617, 28111, 105995]
11621A05995e4806A11526c63037A2106L06934J7644A1410d0775j65678M5379J6324
11610a44750m5978b4594D3403g3017K6240r8430I825J66933a463n1582p8391B11998
11597a6618A25181K00706g998m9478A01597J60480R0434A2727J71490f481l5475
11586d1956B06325D0913O9608K73906I9523q2O6974Q3727i7155a555E3425K46610
11574C00035A42182R2853n5024A8838M8315K2023J20793n3464J54047a83662D96944
11562B46920o6641C1090k18a88904D4624I021a02251b6470d374C3919b7936l20307
11550c48243a2304j1785E4104b2772k3818A45945b9860D0909a40383B4714L21173
11539C45887m5908I9030c99771C92243A15518R3600M0481L9261k9273m5989I3559
$$ y = [105995, -54806, 111526, -363037, 12106, 319040, 336684, 11410, -40775, -206453, -161074, -144750, -190728, -24594, 43403, -73017, -46777, -145207, 9825, 176758, -1463, -53045, -131436, 211998, -16618, 125181, 325887, -7998, -57476, 101597, 262077, 352511, 12727, 184217, -6481, -41956, 206325, 40913, 110521, 384427, 99523, 99441, 166415, 250142, -97155, -1555, 53425, 300035, 142182, 235035, 180011, 18838, 67153, 89176, 209969, 156505, 310552, -183662, 496944, 246920, 180279, 31090, 30872, -188904, 44624, 9021, -102251, -26470, -4374, 33919, -27936, -348243, -12304, -24089, 54104, -22772, -46590, 145945, -29860, 40909, -140383, 24714, 345887, 299979, 99030, -399771, 392243, 115518, 209118, 249599, 288860, 259587, 213598, 93559]
11527a00010C06838A8539a50470e6484r665b6991B43419A06007J02387l6232b82696
11515g1321H7412f9480A60881Q8069E0218K85735j21581H8331J10360L52654A90967
11503H5681J94926j8315A3458a10466D14931C230L42945a811D3558K77244M3510
11492C64312I8168L16824A47337f3383A56332f6987G726K78683O853a62536f8070
11480D57193A28052e3418E2996i6082A37370J6636J86066j37907c4157B60912
11469B4932K49327A34077L14515k03840K28893D8337J38929p5624N0518b87216
11458B36764i6030A7059F323J20592N6310b17658J05985A34485L0233o6511a12655
11446B68241G8581a6858k94763B13882k9286e68137B43211h2452D5183K53326
$$ y = [-100010, 306838, 18539, -150470, -56484, -66149, -26991, 243419, 106007, 208394, 172162, -282696, -71321, 87412, -69480, 160881, 248950, 50218, 335953, 214372, 88331, 198691, 551345, 190967, 85681, 280607, 262292, 13458, -110466, 414931, 3230, 346175, -1811, 43558, 320802, 364312, 98168, 414992, 147337, -63383, 156332, -66987, 7726, 286409, 293262, -162536, -68070, 457193, 128052, -53418, 52996, -96082, 137370, 154006, 340072, 202165, -34157, 260912, 24932, 274259, 134077, 448592, 244752, 473645, 48337, 187266, 111642, 162160, -287216, 236764, -96030, 17059, 6323, 126915, 183225, -217658, -111673, 134485, 164718, 98207, -112655, 268241, 78581, -16858, -311621, 213882, 184596, -568137, 243211, -82452, 45183, 298509]
11436B98509c8637E9825a9108o7571D64614a28092K178e4519H3480i5373A3677
11424a46019d0717E3543c35383J04353H4794i710A95986g5112F7574a21877j05901
11413b27778A13372q017l9806a19787a6374B74839A12584i4867A2030K0851O5593
11402I8474c07411B39827j09418J72177N1145A1420a80273r0081C65365b48662
11391C8133c84654N8725h6663m2655L5116R295H8512b88176C45689a9933I5765
11379d0522q194B20439a01806L013A72149M8365E3023J76556c7025D4884e2214
11367a08575G5885c7155B62006i9426j69037l2528c0205l00992A23661D1546B576
11355a89355A7423b55711a7384k62020f0849k23493A84923d0273D12724F2892
$$ y = [298509, -38637, 59825, -19108, -86679, 464614, -128092, -125914, -54519, 83480, -95373, 13677, -146019, -40717, 53543, -335383, -231030, 84794, -9710, 195986, -75112, 67574, -121877, -227778, 113372, 105355, 65549, -119787, -16374, 274839, 112584, -94867, 12030, 32881, 98474, -307411, 239827, 130409, 302586, 353731, 11420, -180273, -270354, 365365, -248662, 38133, -384654, -325929, -86663, -129318, -94202, -84907, 88512, -288176, 345689, -19933, 95765, -40522, -48716, 220439, -101806, -98793, 172149, 220514, 53023, 229579, -37025, 44884, -52214, -108575, 75885, -37155, 262006, -99426, -268463, -300991, -30205, -331197, 123661, 41546, 2576, -189355, 17423, -255711, -17384, -279404, -60849, -284342, 184923, -40273, 412724, 62892]
11344a67686F6335c27607D0684a05349A12369e5948B34411b41581n1674J34838
11334a58417r8353d9445j86654l1776B05075b74425m7092b4231B46577b62541
11323B72543l3273a0417A11525d4567E1239c9153I7035J534J55878g2231B81617
11311A97423d76601H701b62013F4593J20939R2099a0475r5727G9481b65757E0506
11299F6903a64576J986A59068d5487J4217k36050B84818a3720m2799A27426m1613
11288H5813c74535j28955D499b51976a17083L271j12603C1940N0770i1970B94826
11276e221q6254B4740K89819a43814K3650e8181A04266L9560J09672a18011K1481
11265i6530j01114N4863C7545K44688F7087a55112A18861c91434C63286A27231
$$ y = [-167686, 66335, -327607, 40684, -105349, 112369, -55948, 234411, -241581, -293255, -158417, -256770, -49445, -236099, -267875, 205075, -274425, -321517, -24231, 246577, -262541, 272543, 239270, -10417, 111525, -44567, 51239, -39153, 97035, 98569, 254447, -72231, 281617, 197423, -476601, 8701, -262013, 64593, 185532, 277631, -10475, -106202, 79481, -265757, 50506, 66903, -164576, -162590, 159068, -45487, -31270, -267320, 284818, -13720, -56519, 127426, 85813, -374535, -503490, 4499, -251976, -117083, -113812, -226415, 31940, 82710, -91970, 294826, -5221, -91475, 24740, 314559, -143814, -120164, -58181, 104266, 143826, 253498, -118011, -96530, -197644, -142781, 37545, 282233, 67087, -155112, 118861, -391434, 363286, 127231]
11254A38255d61427J26997H5376C0727c02325A93736o1447b11067C2740a45548
11243I4489K0911a07198k3827F9313O2697K5958J21037n0809E4664b70453A01387
11231D7247c28953f868l37670i3089D04064A0761K2174J72669a87708c1974j14245
11220a46219J5242l4245O6716A10417J7622R7030j802g0715E0971a51050k75449
11209d26499K03503D5203P7547b46529A79915d1071C1838j2009J25004a24928
11198D485b9839j60944l5792G886R6784b11030E1575P8442d8505C4702a17317
11186A24495b58431I5336d511A31812a07989p8001A87954D073b87723B3160b8665
11174b72772f1527A14506B4309c13737D7142b39681G9756K55188A60884a52120
$$ y = [138255, -461427, -334430, 85376, 30727, -302325, 193736, 132289, -211067, 32740, -145548, 94489, 115400, -107198, -131025, 69313, 132010, 157968, 279005, 228196, 54664, -270453, 101387, 47247, -328953, -6868, -344538, -93089, 404064, 10761, 32935, 205604, -187708, -31974, -146219, -130977, -165222, -98506, 110417, 128039, 225069, 223267, -70715, 50971, -151050, -426499, -222996, 45203, 122750, -246529, 179915, -41071, 31838, 19829, 144833, -124928, 4485, -29839, -190783, -226575, 7886, 104670, -211030, 51575, 130017, -48505, 34702, -117317, 124495, -258431, 95336, -4511, 131812, -107989, -185990, 187954, 4073, -287723, 23160, -28665, -272772, -61527, 114506, 24309, -313737, 47142, -239681, 79756, 334944, 160884, -152120]
11163c96936J36127i5855n8077k49852A70617d0380I3503c9749H5649P9648d22514
11151B00742j6840a1307D8564b26339b1550k68431A07072a86120k7963A49672
11140h3415C92722I1185a22527A9081d1976j46051C15304o7382c85865a44646
11129B5081c16685A03526a12847B79155a93904g9399A92506F6069K33802j35243
11119A64628c7060A75023i3190E7031N9332J4371g969k46479B39211B7722a2390
11107E0695O7832c86730E2947b39330B61792g3725F3411a71569C11271j02080
11097B09191M65304l33101H7097J44118K6456k4879c0949A19119m7539K07180
11087B78760A08406O2259Q4367K55328A60029e7539A95466j1716C720J18683K20423
$$ y = [-396936, -260809, -95855, -153932, -403784, 170617, -40380, 93503, -39749, 85649, 165297, -422514, 200742, 183902, -11307, 48564, -226339, -21550, -289981, 107072, -186120, -214083, 149672, -83415, 392722, 91185, -122527, 19081, -41976, -188027, 315304, 247922, -385865, -144646, 25081, -316685, 103526, -112847, 279155, -193904, -79399, 192506, 66069, 299871, 164628, -37060, 175023, -93190, 57031, 116363, 130734, -7969, -254448, 239211, 27722, -12390, 50695, 118527, -386730, 52947, -239330, 261792, -73725, 63411, -171569, 311271, 209191, 674495, 341394, 87097, 231215, 257671, 232792, -30949, 119119, 71580, 278760, 108406, 170665, 255032, 510360, 160029, -57539, 195466, 183750, 3720, 122403, 342826]
11076C42826j26089h5161B15798J78324A86918G1250L69406n6076N40434C01866
11065C21768N9404K66728k37315j73q0191O3602L9563j73268M42034l22682J71562
11054E51032K54874l80758J52758J95795l25772J3517K63976k08522j0846J7100
11044E23154K23814k60192K87922C86240L11208k90375L80341j21309J21609k55903
11034E31811L85526M5286D68554R8314K25986m608j08066O1810k86431p5553K6512
11023D06518K02462J0965J63973l09459J52973A81231P74070j24576C57647M8427
11013D06074L64819l09697K83096l358r8303P7882j70120Q0925J00J7791J05397
11002G54606k57779P7715j38195M73221n4577j54605L3459J3782k55685N5197
$$ y = [342826, 216737, -85161, 215798, 394122, 186918, 71250, 440656, 384580, 925014, 301866, 321768, 381172, 647900, 410585, 410412, 330221, 393823, 433386, 260118, 702152, 379470, 551032, 805906, 425148, 577906, 773701, 447929, 461446, 725422, 516900, 506054, 523154, 746968, 486776, 774698, 386240, 697448, 407073, 787414, 666105, 787714, 531811, 917337, 962623, 468554, 566868, 792854, 788246, 680180, 741990, 455559, 380006, 406518, 608980, 619945, 783918, 474459, 627432, 181231, 955301, 830725, 357647, 406074, 770893, 461196, 744292, 740934, 642631, 720513, 550393, 631318, 631418, 649209, 754606, 496827, 574542, 436347, 909568, 854991, 700386, 733845, 747627, 491942, 547139]
10992E47139J52366k13863J95253L9731k85655M96019K9118k39861K72683L09744
10982A302674k05659l48887O2803N03471j4271J20393j00416M91393L38220K03903
10972B353624K15347l85485L55292k8555J94140l27179n95565j64354j11401K03659
10962A709523l61324M09998j80817K68082j42296m9922Q8621l77486L93164l97907
10952A359636j89371K12050m75934k98320j47208j32625R3196J26956A61405l9877
10942A21528m5793Q8230P606Q4909j07301J22553A25748L9273J80676f0883G397
10930B4370a4736j36231d8950D52389A92843E5595J13903C4706a08826N97D9295
10918A901c4793D9777J47794N812b27924e3213H7525Q2117J647F6893a07247D01280
$$ y = [547139, 699505, 485642, 680895, 720626, 434971, 930990, 960108, 720247, 992930, 1302674, 1097015, 748128, 810931, 1314402, 1300131, 1420524, 1320108, 1811501, 2149721, 2353624, 2568971, 2183486, 2538778, 2510223, 2704363, 2377184, 1781619, 1617265, 1505864, 1709523, 1348199, 1758197, 1577380, 1845462, 1703166, 1653244, 1741865, 1364379, 1757543, 1359636, 1170265, 1382315, 906381, 608061, 460853, 328228, 421424, 548380, 161405, 121528, 75735, 163965, 171571, 256480, 149179, 271732, 125748, 165021, 345697, -60883, 7397, 24370, -14736, -150967, -48950, 452389, 192843, 55595, 169498, 34706, -108826, -108229, 49295, 1901, -34793, 49777, 197571, 203383, -227924, -53213, 87525, 169642, 171289, 66893, -107247, 401280]
10905A14523J94342A41170O5870b16784A98988h4200D3171J22769p5879M9417
10895A39478a26592C0309J29561m1971B9379c0163k6656a1696o5037A7514K73223
10884B90737d1954j79186f3057A7432a8593A89636D6997c69563G8454b90910A20187
10872b74390e4297k3128k7979b5616p9845A453a2085q6197k210A68264b98578
10860a07706H1357a06399A5662c19048D45772a50388A11722B2438Q6043a66335
10849a60541g6786A74069G4892J9887e1648k09017B476J40250a31994F2106c2023
10837F5118a89085g3680D6700Q5969d191j7048j82851C16041a11063J2295C23372
10825a08320j71895h2794A34438A8129N7775b40840A7316K9116P7982R856d0740
$$ y = [114523, 308865, 141170, 207040, -216784, 198988, -84200, 43171, 165940, 90061, 139478, -126592, 30309, 159870, 117899, 29379, -30163, -56819, -11696, -76733, 17514, 290737, -41954, -221140, -63057, 17432, -18593, 189636, 46997, -369563, 78454, -290910, 120187, -274390, -54297, -77425, -105404, -25616, -105461, 1453, -12085, -98282, -100492, 168264, -298578, -107706, 81357, -106399, 15662, -319048, 445772, -150388, 111722, 22438, 108481, -166335, -160541, -76786, 174069, 74892, 94779, -51648, -260665, 2476, 142726, -131994, 62106, -32023, 65118, -189085, -73680, 46700, 132669, -4191, -21239, -204090, 316041, -111063, -98768, 323372, -108320, -280215, -82794, 134438, 18129, 75904, -240840, 17316, 46432, 124414, 134270, -40740]
10813a49476K6763D23171B9622a12040H9206K0782a40018j30974B38370C4354
10802h7400K5666A00163L5475d58328A17083l1990b47700R309L8059a6468q3691
10791a00159j77722A42910b13713J0108g4583A09138b37666e9318F0190c9379
10780b67255I1369N7387L4301a87534F9343g3420l26248a60827M5655j86166Q2375
10769b18963A24631a7476r8932m9543M1431E1430i8134q9156e8405C52065b18561
10757A37679O1370J83097g9841B6438J07597L6691a18640C57296A8388e0857B97041
10745C62930b40683P5113B91352A35036b4847a1342j83296A41082a90247M25A48782
10733c00716a35121I8898b60145C8653b1213F2627a43147B82271E7909a1050d665
$$ y = [-149476, -122713, 423171, 29622, -112040, 89206, 109988, -140018, -270992, 238370, 34354, -87400, -61734, 100163, 135638, -458328, 117083, 85093, -247700, -238391, -200332, -16468, -100159, -277881, 142910, -213713, -203605, -74583, 109138, -237666, -59318, 60190, -39379, -267255, 91369, 148756, 183057, -187534, 69343, -73420, -399668, -160827, -115172, -301338, -218963, 124631, -17476, -116408, -165951, -124520, 51430, -98134, -187290, -58405, 352065, -218561, 137679, 199049, 382146, -79841, 26438, 134035, 170726, -118640, 357296, 18388, -50857, 297041, 362930, -240683, -165570, 291352, 135036, -24847, -11342, -194638, 141082, -190247, -189822, 148782, -300716, -135121, 98898, -260145, 38653, -21213, 62627, -143147, 282271, 57909, -11050, -4665]
10721B98369c126R91q5438A68198K74146A43985Q7848a56076D2695d44561B2067
10709A91623a51884c0354A3411K3925a38015M5074j65848A63698a40276B47069
10698g2169k6603C77146a24132a5917A69700b4569C30217e3671F9535g3435A55821
10686B5212O8268a79627j65302L2081i1549E3533M4393h6237A9717a87772D5524
10674a86082d301j282j67967F2617d1701A1247a50146B5613b67514D4066n14b19358
10661A32141J576J05156b59001R1634C76341b30515P7238N3348j74489A31009
10650A84056D8763a34055r8894P8238F0503b35280O4661C1607h1333j33619l17144
10639e32096C9412a83955Q3287A12032a07479j7095N4330A56241c84896n6246
$$ y = [298369, -3126, -2135, -87573, 168198, 442344, 143985, 231833, -156076, 42695, -444561, 22067, 191623, -151884, -30354, 13411, 37336, -138015, -92941, -258789, 163698, -140276, 247069, -72169, -98772, 377146, -124132, -15917, 169700, -24569, 330217, -53671, 69535, -73435, 155821, 25212, 93480, -179627, -344929, -312848, -91549, 53533, 97926, -86237, 19717, -187772, 45524, -186082, -4301, -5583, -173550, 62617, -41701, 11247, -150146, 25613, -267514, 44066, 43552, -219358, 132141, 133717, 238873, -259001, -167367, 376341, -230515, -153277, -99929, -274418, 131009, 184056, 48763, -134055, -232949, -154711, 60503, -235280, -170619, 31607, -81333, -214952, -532096, 39412, -183955, -100668, 112032, -107479, -124574, -70244, 156241, -384896, -441142]
10629d41142a99645G5745a99694h0642h789G2511a33342j72037r4589e3778q0435
10618a34213J8173G1041K8680m0224a83227O1697j53264A62962n1997E962a07699
10606a09435A23512a73381B13309a76078n1129G7191f3348j64909N298Q3297b6839
10594G3647c5060E5691a56268O8256A8867c20201a34830d8769j89971A39352K9778
10583A69130m2932a27408B73287a3913r4196L8419p3817A63564f8541j92739B8502
10571b36371A62167d23828i8598j3867B15986r4528j3988b6957m8205n6841C8704
10559d5003p1876C93129g3430F0118i9874B1110d5474j11890n651D0565a79045
10547I694J07633b7603A40854a50950b2226n9396A39982G145f8848F8937k0039
$$ y = [-441142, -199645, 75745, -199694, -80642, -8789, 72511, -133342, -305379, -399968, -53778, -134213, -116040, 71041, 99721, 59497, -183227, -121530, -274794, 162962, 110965, 5962, -107699, -109435, 123512, -173381, 213309, -176078, -227207, 77191, -63348, -228257, -222959, -139662, -26839, 73647, -35060, 55691, -156268, -88012, 18867, -320201, -134830, -48769, -238740, 139352, 169130, 126198, -127408, 273287, -13913, -108109, -69690, -143507, 163564, -68541, -261280, 28502, -236371, 162167, -423828, -98598, -112465, 215986, 121458, 107470, -26957, -75162, -132003, 38704, -45003, -116879, 393129, -73430, 60118, -99874, 21110, -45474, -157364, -163015, 40565, -179045, 9694, 117327, -27603, 140854, -150950, -22226, -81622, 139982, 7145, -68848, 68937, 48898]
10536D8898f086B43292n0888m5503h8192F879b11097R7201b3759k14160k3543
10525b61462E8731L43123j19146o3900a91587C77538a49490J4558f808q3578c7063
10513B81979f284D4984j9884a75375B77128h4573l2673j90213a36585B9512j0094
10502A9418a24989d3387E0953j3459b14427d0995j64096A60123b57171h7694F2857
10490D541i9460f677j5507A94762r075b12303C31583j47336L3424k5988J31094
10479C22777A19303K86162n9850f9663C41219D7430K82779g1804n5058B7080D824
10467A31749d3803j70280D2361K30676n1582D6138a46987A56172b77457a20850
10456i1557j9869C2472b51893h1224p8052k79017A23806d40948J41656a39166
$$ y = [48898, -6086, 243292, 192404, 146901, -88192, 6879, -211097, -113896, -23759, -237919, -261462, 58731, 401854, 282708, 218808, -191587, 377538, -149490, -134932, -6808, -90386, -37063, 281979, -6284, 44984, 25100, -175375, 277128, -84573, -117246, -307459, -136585, 29512, 19418, -124989, -43387, 50953, 37494, -214427, -40995, -205091, 160123, -257171, -87694, 62857, 4541, -99460, -6677, -22184, 194762, 185687, -212303, 331583, 184247, 217671, 191683, 322777, 119303, 405465, 345615, -69663, 341219, 47430, 330209, -71804, -126862, 27080, 4824, 131749, -43803, -214083, 42361, 273037, 221455, 46138, -146987, 156172, -277457, -120850, -91557, -111426, 32472, -251893, -81224, -159276, -438293, 123806, -440948, -299292, -139166]
10445f3332k03152A82306h0377A47270B570J40521n6862J54047C1561a83139Q7041
10434i6098j81273A85666a21406I1418a37014R069B1432J1164j3177R5488E0492
10422B2582L6449K8267J90466c9983A04631h0432k2989A449g7182A03782c1560
10410a29144A41580b26077B14804b05528A78276K02120a30109A28635a72730Q0125
10400i2605j96134c6113G1648a34012C02727a60501c6349A28535K75405H972J40497
10389A49469m7026P0564a08221C73025f155A96589n7322N5025L5157q6871M7582
10378A90160J13356A5439J5989a28429D98735A82347k7414o528k0182L15657j75336
10367B68544J97063J00835j13050j88369K48773A87896K6629j2229b02859f2056
$$ y = [-63332, -266484, 182306, -80377, 147270, 2570, 143091, 86229, 240276, 31561, -183139, -96098, -277371, 185666, -121406, 91418, -137014, -127945, 21432, 32596, 19419, 114907, 50492, 22582, 59031, 87298, 277764, -39983, 104631, -80432, -103421, 1449, -77182, 103782, -31560, -129144, 141580, -226077, 214804, -205528, 178276, 380396, -130109, 128635, -172730, -92605, -288739, -36113, 71648, -134012, 302727, -160501, -36349, 128535, 403940, 8972, 149469, 102443, 173007, -108221, 373025, -6155, 196589, 139267, 194292, 229449, 142578, 190160, 303516, 15439, 31428, -128429, 498735, 182347, 154933, 148405, 128223, 443880, 268544, 465607, 566442, 453392, 265023, 513796, 187896, 214525, 202296, -202859, -62056]
10356a5238D13315j11832p1995O3164e2401C57404P0511K37721j55434R396k58922
10345B60676K59174E8095M89620k48630L3784k6041A19850Q9273l8853o1350c7912
10333b8053o1163B24567j00246D3328a14353A98352p1191A3717Q2142K51853L8536
10322C86248I3641M12329e7137K8560A34964J98466A33361a06136F0886J93691
10312B54577D5102a04410D5145O5806J51836c33620c06k3980A92029b39572J12184
10301a27388G691f9748A34140j2894E692J74394a70100j5274A9978a73607j05154
10290b78761A54055a46848C10992a46790q9367O2926C539a14462p9396K3748G1991
10278B6549b72902A32089d924A36133P1043g6266I8343b38343O4424G7412h2222
$$ y = [-15238, 413315, 301483, 229488, 292652, -52401, 357404, 427915, 665636, 510202, 519598, 260676, 519850, 58095, 547715, 299085, 332869, 306828, 119850, 209123, 170270, 108920, -37912, -28053, -89216, 224567, 124321, 43328, -114353, 198352, 127161, 13717, 95859, 347712, 386248, 93641, 505970, -57137, -28577, 134964, 333430, 133361, -106136, 60886, 254577, 45102, -104410, 45145, 110951, 262787, -333620, -306, -24286, 192029, -239572, -127388, 7691, -69748, 134140, 121246, 5692, 180086, -170100, -185374, 19978, -173607, -278761, 154055, -146848, 310992, -146790, -236157, -173231, 3539, -114462, -193858, -170110, 71991, 26549, -272902, 132089, -4924, 136133, 207176, -76266, 98343, -238343, -173919, 77412, -82222]
10266B97745b15011C9451a82652Q5643M144H0053a38301D07698A86055o9612a20886
10254A50085l4418k8316D2996d52729E0118e452o5613l64D41305A08008i541l8710
10242d8251E5618b7815A18753j236J06772d5356m52108c1701G1123g1415G2053
10230a48012g732A1920J08802l1167K46015g8227E4925N104j8180b67091A35664
10218a29065C8669b6670k20519l3501J28032A13918m7785a74128b0504F476b77657
10206b55772f6926j0697p0479A69568g584B099b22246h8081B85503h8866f203
10194c9748A75083a3375H9739a8568l35638D4956K3261a03130K5589k49697a03171
10182A15976Q5991A6894a79356J1973A37919o3817a61937g849n120D6778a35403
$$ y = [297745, -215011, 39451, -182652, -97009, -92865, 80053, -138301, 407698, 186055, 116443, -120886, 150085, 115667, 87351, 42996, -452729, 50118, -5452, -71065, -71429, 441305, 108008, -9541, -48251, 55618, -27815, 118753, 117517, 224289, -45356, -497464, -31701, 71123, -71415, 72053, -148012, -7732, 11920, 120722, 89555, 335570, -78227, 54925, 60029, 41849, -267091, 135664, -129065, 38669, -26670, -247189, -280690, -152658, 113918, 66133, -174128, -20504, 6476, -277657, -255772, -66926, -77623, -148102, 169568, -7584, 2099, -222246, -88081, 285503, -88866, -6203, -39748, 175083, -13375, 89739, -18568, -354206, 44956, 68217, -103130, -77541, -327238, -103171, 115976, 201967, 16894, -179356, -167383, 137919, 74102, -161937, -7849, -12969, 46778, -135403]
10170B15909a11908C0900N60633e0783m7142j68990Q2281M7531A8788a54458G2696
10158a32733N9940C207O5595c30211e2853o3960q007D376a95011d1839F0513c9753
10145a64426A00939L59345i5251j98598l5624B2376K44164b29008h358r4469d6005
10133A39331c89349R8070Q4776M8240F2322i4641o8678j0749c0360B87580b26793
10121a58161L9755r0781C65679c33593f0247A50898c99236A02437C5875b205A03075
10109d7176k39085C32087c30772A19903f8852b4777A10050i1689r4502f8453j54846
10098b23299a9770k33383H0732f072j32589B2225c38031a67191a5516j05353A21483
10086B14086g3055J2264B35372a47990J4039A38557a28201j02332j34478i4103
$$ y = [215909, -111908, 30900, 591533, -50783, -97925, -266915, -184634, -137103, 18788, -154458, 72696, -132733, -72793, 3207, 68802, -330211, -52853, -116813, -124820, 4376, -195011, -41839, 60513, -39753, -164426, 100939, 460284, -95251, -293849, -329473, 22376, 266540, -229008, -8358, -102827, -46005, 139331, -389349, -291279, -206503, -158263, 62322, -94641, -163319, -174068, -30360, 287580, -226793, -158161, -118406, -209187, 365679, -333593, -60247, 150898, -399236, 102437, 35875, -2205, 103075, -47176, -286261, 332087, -330772, 119903, -68852, -24777, 110050, -91689, -186191, -68453, -223299, -19770, -253153, 80732, -6072, -138661, 22225, -338031, -167191, -15516, -120869, 121483, 214086, -73055, -60791, 235372, -147990, -133951, 138557, -128201, -230533, -365011, -94103]
10075e4643H0535P2549B0851J477c12570c1819G4776b11952d5729A60627i9457
10063b33050a6804m892j5198C11236j19635b27782h0402j20932b216C52850B9008
10051e8227B45100b55067P3644C6283b01716i5248j6697G2394b9021p7645B21176
10039h2786H801a23699j05461i6555G0417a51217r5222f4215J776j40259A07983
10027c08711h9795B43803b9262j80242Q9405p4296h0199l7279m5481d9804A348
10015A15423D1827m830J17659i129A61785d76212A30065d6522D8240m455c13663
10003c15207F7775K2859a48429j18391J0281A15728m6006c92495c6611j59690
9993a96301c7709A03695h9406C58923a61879B67283a32843n4589N8219c446A9579
$$ y = [-54643, 80535, 153084, 20851, 22328, -312570, -31819, 74776, -211952, -45729, 160627, -99457, -233050, -16804, -21696, -36894, 311236, 191601, -227782, -80402, -201334, -2216, 352850, 29008, -58227, 245100, -255067, -181423, 36283, -201716, -95248, -111945, 72394, -29021, -106666, 221176, -82786, 8801, -123699, -229160, -96555, 70417, -151217, -246439, -64215, -62439, -202698, 107983, -308711, -89795, 243803, -29262, -209504, -120099, -194395, -80199, -117478, -162959, -49804, 1348, 115423, 41827, 36997, 154656, -9129, 161785, -476212, 130065, -46522, 48240, 43785, -313663, -315207, 67775, 90634, -148429, -266820, -256539, 115728, 69722, -392495, -36611, -196301, -37709, 103695, -89406, 358923, -161879, 267283, -132843, -187432, -129213, -3446, 19579]
9981I0385d48606a40135b0r8160M8107C2255R0160E0554e5350j23225C99884c03567
9968a48416a5375j78666C0726c09938H6251a5203r6800j14189g1890k7693K9511
9957g0072D4829d4119p3921K3359j25233k1901a05253m95937a8702B31537a41904
9945a3864k66819a9212B51953a40012d3182k19780h1863C1164A19a26090C2458
9933d8281F6579e9967f243l42258J18353K533a6401D2593a78114G769a37103j3075
9921a50178k9866e6110G0398b25568F0999J3530g2054A42609a67811o4271A06115
9909d4777l3528C1028b74397A50546c82325C7695c51469B36811A9575J73734K1081
9898B14390a25958n4259j72782J57799E9411a79783o3049A99587O3736i738D4911
$$ y = [90385, -448606, -140135, -20, -98180, -50073, 32255, 122415, 50554, -55350, -178575, 399884, -303567, -148416, -15375, -194041, 30726, -309938, 86251, -15203, -112003, -226192, -71890, -99583, -70072, 44829, -44119, -118040, -94681, -219914, -241815, -105253, -601190, -18702, 231537, -141904, -13864, -280683, -19212, 251953, -140012, -43182, -262962, -81863, 31164, 119, -126090, 32458, -48281, 66579, -59967, -6243, -348501, -230148, -227615, -16401, 42593, -178114, 7769, -137103, -150178, -180044, -56110, 70398, -225568, 60999, 74529, -72054, 142609, -167811, -232082, 106115, -44777, -78305, 31028, -274397, 150546, -382325, 37695, -351469, 236811, 19575, 193309, 214390, -125958, -180217, -352999, -195200, 59411, -179783, -242832, 199587, 263323, -9738, 44911]
9886A09944A148a01867j81480A16148f27034B1625a96403r7104a8815p3843b5709
9874a08972A10868a3443j89079B07669P3290C7994J3800a67152g4251j40430j37545
9863c52226E5894b9836l7466j76524N0219B5622e6980C02839g564B2513c26365
9851E653b5482l69058B9544b77354k4214d1001B03817a51954n7164A24484b03794
9839d08112P8931A37123c924j18492J9306H6100e4116j21464n631H7242m205M8047
9827A31084b8994k28551B12779B5249j864H808a14709F8600e6674C5978a35199
9815A84123p0953a96172o805C5427K1796a28730c8237n20601c6008k5301A98966
9803i8695H5223L6849g4653i531G9554K7265A6735b64797L0242a159q2368p8906
$$ y = [109944, 1148, -101867, -283347, 116148, -627034, 21625, -196403, -293507, -18815, -92658, -25709, -108972, 110868, -13443, -202522, 207669, 280959, 37994, 51794, -167152, -74251, -214681, -352226, 55894, -29836, -67302, -243826, -193607, 25622, -56980, 302839, -7564, 22513, -326365, 5653, -25482, -394540, 29544, -277354, -301568, -41001, 203817, -151954, -209118, 124484, -203794, -408112, -329181, 137123, -3924, -122416, -103110, 86100, -54116, -175580, -181211, 87242, 83037, 131084, -28994, -257545, 212779, 25249, 23385, 8808, -114709, 68600, -56674, 35978, -135199, 184123, 113170, -196172, -202977, 35427, 57223, -128730, -38237, -558838, -36008, -61309, 198966, -98695, 85223, 122072, -74653, -9531, 79554, 106819, 16735, -264797, -234555, -1159, -83527, -162433]
9791a62433A37500d9316j87325E1825L2477l8108a23657A2091e5732r203d512
9779A84419i8110j19700g8658j69587J9027a12292H0094j8668a8626j37482e1675
9767b93738h6153k02528A00196b57810O1685J5940N1212c8811r4183B43966B3266
9755I4411c33731J10771A44054C671a33715d0003m0289B28900a71794q425H0531
9743b06132A7248a82900A94812c47558A47636J7562j9867a07945A91272C4267
9732b09731D0125K0562a44528B0891b15974d8616m3061B6006K8273b9366k42051
9721b71417i5693C00429j43095A0501b34993B31419C9328L8052a32771H3943a77374
9709c12907E1749c61019L8235A14391a68088A8992a13264k14673D8888g4387A10690
$$ y = [-162433, 137500, -49316, -236641, 51825, 84302, 46194, -123657, 12091, -55732, -64935, -4512, 184419, -98110, -217810, -78658, -248245, -229218, -112292, 80094, 61426, -18626, -156108, -51675, -293738, -86153, -288681, 100196, -257810, -196125, -180185, -128973, -38811, -132994, 243966, 23266, 94411, -333731, -222960, 144054, 3671, -133715, -40003, -80292, 228900, -171794, -180219, 80531, -206132, 17248, -182900, 194812, -347558, 147636, 165198, 145331, -107945, 191272, 34267, -209731, 40125, 60687, -144528, 20891, -215974, -48616, -91677, 26006, 54279, -29366, -271417, -95693, 300429, 157334, 10501, -234993, 231419, 39328, 77380, -132771, 83943, -177374, -312907, 51749, -361019, -322784, 114391, -168088, 18992, -113264, -327937, 48888, -74387, 110690]
9697c3017I1509a5704A46358D7862J16601a23330B01055e5373j48046E736e7075
9685c5700A77128j1433d33163a69773A19635d30702A28390L4929e6953p0702m0485
9674a68140r7700J04459j30627J429f3813N047A45893b71929k966E449c38180
9662A00402e8354j65025A95144j9200a44590k61955J90907K0493R537A18741L2723
9651A51464C9345a76091H9539h0314J9413D4024b14465A20640m7560B8219e1317
9639a95365H7514c70225a15758E9651h7448I580a08629A34559c14075F2905b2243
9627d4613A30161c49677A03708C932J84973C2523O3686O6264b21944D694j61c05267
9614b24266O5007k7419A28587a36431E3160J5512a30083k8669j67358R4111d1768
$$ y = [-33017, 91509, -15704, 146358, 47862, 164463, -123330, 201055, -55373, -203419, 5736, -57075, -35700, 177128, 165695, -433163, -169773, 119635, -430702, 128390, 163319, -56953, -127655, -168140, -265840, -161381, -292008, -290579, -63813, -58766, 145893, -271929, -274895, 5449, -338180, 100402, -58354, -223379, 195144, 175944, -144590, -406545, -215638, -195145, -185608, 118741, 151464, 39345, -176091, 89539, -80314, -60901, 44024, -214465, 120640, 73080, 28219, -51317, -195365, 87514, -370225, -115758, 59651, -87448, 9580, -108629, 134559, -314075, 62905, -22243, -44613, 130161, -349677, 103708, 3932, 188905, 32523, 96209, 162473, -221944, 4694, 4533, -305267, -224266, -159259, -186678, 128587, -136431, 53160, 68672, -130083, -158752, -326110, -231999, -41768]
9602G285a49997J4992J2733A24610J20517a65828q0205j29135e1944A94373b2728
9590a97592A6932c50398I4356b19928P1716K4931C2376N427a79253k32302J63510
9579b48045I7452a68678A60064J67124b76109H6626c8333H5627A4876a82654C1360
9567B39637a62502G9558B4154b71652i6304I3400a42911l1089B7444d1011k2809
9556f3820D1779i9025A25381q471a03253m9347B466J69377l6327C777J08748i6599
9543A39278a98367Q2109F2600b66343a26305f2198j39125q2133C566e4115A28523
9531i1892r3364A81166a63057A67612J76177a81332A54634b26602B11386c51452
9520b35930h9551b182I2236m5907b28737O1543G5555a33729k1179N8070A47840
$$ y = [7285, -149997, -135005, -122272, 124610, 245127, -165828, -246033, -375168, -51944, 194373, -22728, -197592, 16932, -350398, 94356, -219928, -148212, -123281, 32376, 37803, -179253, -411555, -248045, 97452, -168678, 160064, 327188, -276109, 86626, -38333, 85627, 14876, -182654, 31360, 239637, -162502, 79558, 24154, -271652, -96304, 93400, -142911, -174000, 27444, -41011, -63820, 41779, -99025, 125381, 116910, -103253, -152600, 2466, 171843, 135516, 3777, 112525, -96599, 139278, -198367, -116258, 62600, -266343, -126305, -62198, -201323, -283456, 3566, -54115, 128523, -91892, -185256, 181166, -163057, 167612, 343789, -181332, 154634, -226602, 211386, -351452, -235930, -89551, -2182, 92236, 46329, -228737, -167194, 75555, -133729, -154908, -96838, 147840]
9508f8539D3850b0152A9430K4081g1519l06100A45819C8288a7499j68538j5147
9497b01184b5204j86371N184H0669P7382b37824k6413j37921D8937J75159C9252
9485e6956B9913j2367a2633j06142B28196b74850e9718H1199a99813M6547k0397
9474a73663n6116C88928b13715Q6082k20992A3141b09777e5923G9107k5192J28559
9463A82474a48647c2235A66346M1452i6292A03346k8107a59415F2457B3289e5385
9451b32190A95914e0740I2153h7923G7781d9145o9429b7335j50450C034K804L0891
9439C6729a84252l80581a44981L1733K4163A6654a74424q7908Q5627r0257h5861
9427e7929H8929b81970A27045b08877j41711a33326a8807G7808j2564b10585n3406
$$ y = [-68539, 43850, -20152, 19430, 43511, -71519, -377619, 145819, 38288, -17499, -186037, -201184, -25204, -211575, -206391, 80669, 158051, -237824, -264237, -402158, 48937, 224096, 39252, -56956, 29913, 17546, -12633, -118775, 228196, -274850, -59718, 81199, -199813, -153266, -173663, -229779, 388928, -213715, -127633, -348625, 13141, -209777, -55923, 79107, 53915, 182474, -148647, -32235, 166346, 207798, -96292, 103346, 75239, -159415, 62457, 23289, -55385, -232190, 195914, -50740, 92153, -87923, 77781, -49145, -118574, -27335, -177785, 3034, 5838, 36729, -184252, -564833, -144981, -113248, -89085, 16654, -174424, -262332, -176705, -266962, -85861, -57929, 88929, -281970, 127045, -208877, -350588, -133326, -18807, 77808, 65244, -210585, -263991]
9416b63991D6208q824K36126f0420k6254B80349a94290I1347d16808J77622h5865
9404b12375f2502j39070B19673c05150a13702I3355e5278L780j24475B04212g9395
9392c15663J9988g5658a9745L030j09141J0315I9818d8937j63336A6497K82931
9381B99428K9675f820o1176n2530l16433a90812G2586d22744i7823I0194J68379
9370B58573e947I2991K15730b04232o8376A0076L4150J30028c03961I4431b39376
9358A6667J89996b47487J4224M0938H6488d1408k35620e6179o4669M6868k33583
9347c07563R6097A36085d2963q8579j73283J15734L7115G2068m750a0292A59744
9335b37582A88258E89J29617c07784k00253C37972a42182j91657C88300a31384
$$ y = [-263991, 46208, 37384, 273510, -60420, -86674, 280349, -194290, 91347, -416808, -239186, -85865, -212375, -62502, -201572, 219673, -305150, -113702, 93355, -55278, -51498, -175973, 204212, -79395, -315663, -295675, -75658, -19745, -16715, -125856, -115541, 99818, -48937, -212273, 16497, 299428, 329103, -6820, -67996, -120526, -436959, -190812, 72586, -422744, -97823, 90194, 258573, -5947, 92991, 308721, -204232, -272608, 10076, 44226, 174254, -303961, 94431, -239376, 16667, 206663, -247487, -233263, -192325, 86488, -41408, -277028, -56179, -120848, -73980, -307563, -211466, 136085, -42963, -131542, -304825, -189091, -151976, 72068, 67318, -10292, 159744, -237582, 188258, 589, 130206, -307784, -508037, 337972, -142182, -333839, 388300, -131384]
9324a51197r8805B8096d7811j1505B90700b87162R5783k60977c9074B0280a88914
9312b350A51081a51582j86976A23443n4060L3616i8489b0195E02531C1421a59866
9300a00308C61894a51048f4329j61547A69254a15570j19500H5221b73287I3553
9289B56137i5930E4439O8746f5559F4024a92833p9019C1784c02185B51049b49260
9277a60779d0240A57472Q2545b39849A07393a19141B7538c5628q631A73454k1575
9266A51879H649K283a35029I8568b35056A64441b64348f3081k82529d2364r3461
9255a35825A57214C8636J78240p4100B1523b59246q5316A54376a73021n7105j32935
9244c63061J01228J27324H0894d8436l46391n0556c1437k26039d1733l03721a17598
$$ y = [-151197, -250002, 28096, -47811, -59316, 290700, -287162, -191379, -452356, -39074, 20280, -188914, -2350, 151081, -151582, -338558, 123443, 69383, 102999, -98489, -20195, 502531, 31421, -159866, -100308, 361894, -151048, -64329, -225876, 169254, -115570, -235070, 85221, -273287, 93553, 256137, -95930, 54439, 123185, -65559, 64024, -192833, -271852, 31784, -302185, 251049, -249260, -160779, -40240, 157472, 240017, -239849, 107393, -119141, 27538, -35628, -44259, 173454, 151879, 8649, 10932, -135029, 98568, -235056, 164441, -264348, -63081, -345610, -42364, -135825, 157214, 38636, 216876, 142776, 21523, -259246, -344562, 154376, -173021, -230126, -363061, -261833, -134509, 80894, -48436, -394827, -445383, -31437, -257476, -41733, -345454, -117598]
9232a25310j28500C25048A55879a47974A41916I419f2298G1675B8844a92381A74939
9220H1812a03362d0578A05160a93041A12095a39501A32924f3541B37360a03713
9209b26008D6622c20769i3440N324A69824h7774A08936c22217J4508p9910e7544
9197h314A54091f3857l6416H2797i6642C28815A9417L16a05556G8051c68124A1689
9184A0572d4036c732D326f1254B06000a71904c9111B01281a82240D0084L7276
9173G7360b72228e0686m4365A31576P7000f9025k04343L4951Q1258L5665j7026
9162a38520K9834a442j61329o8891G7416C1648a3025B4985a69258k05201A33907
9150b17935E6224b77277h5194A59744a11816k74104J36220A88431G4702a37365
$$ y = [-125310, -253810, 325048, 155879, -147974, 141916, 9419, -62298, 71675, 28844, -192381, 174939, 81812, -103362, -40578, 105160, -193041, 112095, -139501, 132924, -63541, 237360, -103713, -226008, 46622, -320769, -93440, -88116, 169824, -87774, 108936, -322217, -307709, -387619, -57544, -8314, 154091, -63857, -100273, 82797, -96642, 328815, 19417, 19733, -105556, 78051, -368124, 11689, 10572, -44036, -3732, 4326, -61254, 206000, -171904, -39111, 201281, -182240, 40084, 77360, -272228, -50686, -95051, 131576, 208576, -69025, -273368, -238417, -157159, -121494, -138520, -108686, -1442, -162771, -231662, 77416, 31648, -13025, 24985, -169258, -374459, 133907, -217935, 56224, -277277, -85194, 159744, -111816, -385920, -249700, 188431, 74702, -137365]
9139f8399E2656a80290A55308I717a44776B162O0651b5327J1937k02781A13108
9127A16587L1456b56595B42601f206D4882c08326e023A15181J29317d7134A79501
9115H6940R1368B5267d11486a326l6503A78355j2432E9660b14124p2831A87761
9103B21976D3538c6816A12296b98090a24928o9615B1050g3672m9166D9842b56190
9091B0023J37988A7679c55518Q2722h0403A41956M8740J2461G3732b29602C0831
9079a39353N8753r1861B52132b20378i9601J6451B47227m942I4320l8607a38755
9067A30388a9901k9042j9400K6453k09636J14785A2005c33723R7390K9675k37739
9056d44397F4688c40621A04385C582f8546r6841k39161e3697l28355J33921A40074
$$ y = [-68399, 52656, -180290, 155308, 9717, -144776, 2162, 62813, -25327, -13390, -216171, 113108, 116587, 148043, -256595, 242601, -6206, 44882, -308326, -5023, 115181, 244498, -47134, 179501, 86940, 178308, 25267, -411486, -1326, -37829, 178355, 165923, 59660, -214124, -286955, 187761, 221976, 43538, -36816, 112296, -298090, -124928, -194543, 21050, -73672, -122838, 49842, -256190, 20023, 158011, 17679, -355518, -272796, -80403, 141956, 190696, 203157, 73732, -229602, 30831, -139353, -80600, -172461, 252132, -220378, -99601, -83150, 247227, 242285, 94320, 55713, -138755, 130388, -19901, -48943, -68343, -41890, -251526, -136741, 12005, -333723, -236333, -206658, -444397, 64688, -340621, 104385, 3582, -68546, -165387, -404548, -53697, -382052, -248131, 140074]
9044b73817g974j33532F7554b85475g1604j48588h9289A22868a78607A51403P1541
9033B22944a39377C95184A59230C4340a98026p2117A22344b71197b4186B55431
9022b90289j969R6238j5211J04927B92416i3303E0605f6202l22006a36454B057
9010a73706o7384j15029B56347b023j34719m4161D458c95138a29530A78028c2692
8998d8243B09674m9320g6339j28122e2564A85757F872K04392G4630a13986k83523
8987c97509E87903a00402a2212G031a93239k3455A06639c33526I0342l4876i9522
8975b92117J05427e2137F4467J6341b23426A92229b05044A97127c06152A59214
8964a79032f2067A43155d13543B87133h0090k48139a44131I2971b18946F2943
$$ y = [-273817, -7974, -141506, 67554, -285475, -71604, -220192, -89289, 122868, -178607, 151403, 222944, -139377, 395184, 159230, 34340, -198026, -270143, 122344, -271197, -24186, 255431, -290289, -292258, -196020, -211231, -106304, 292416, -93303, 50605, -66202, -388208, -136454, 2057, -173706, -241090, -356119, 256347, -2023, -136742, -180903, 4458, -395138, -129530, 178028, -32692, -48243, 209674, 160354, -76339, -204461, -52564, 185757, 6872, 211264, 74630, -113986, -397509, 587903, -100402, -12212, 7031, -193239, -216694, 106639, -333526, 90342, 55466, -99522, -292117, -186690, -52137, 64467, 80808, -223426, 192229, -205044, 197127, -306152, 159214, -179032, -62067, 143155, -413543, 287133, -80090, -328229, -144131, 92971, -218946, 62943]
8953a71659M3511A1866K26900c5862q3120A12381i2707A69894F6222a81433j28838
8942c10271I1848f9242j33099B13912b99544c3322l71384A50612L31048f0583
8931A61022a85007b3256C09973b4699A77251o1279N56178J32728K735112N077466
8921H617456M784094m227784A768336C38405r9608J74579a42197l2182A5628a64110
8910H8804c1918I141L27439j722m1796E8656a01105c8563l4920J5646j29137K5747
8898a61227d2635A14654e5743B03162a7062q0472D5885O7406J51415b54142Q4235
8887a69907A55326J43967F5046a10085B20405j06024c72842O8661A09648n483
8877A04165d45189M1283b3548A7351d9288J0111C4383b6775A77702a30994o1406
$$ y = [-171659, -128148, 11866, 238766, -35862, -118982, 112381, -92707, 169894, 66222, -181433, -310271, 91848, -69242, -202341, 213912, -299544, -33322, -404706, 150612, 481660, -60583, 161022, -185007, -23256, 309973, -24699, 177251, 115972, 672150, 804878, 3539990, 8617456, 13401550, 9173766, 1768336, 338405, 238797, 413376, -142197, -174379, 15628, -164110, 88804, -31918, 9141, 336580, 334858, 293062, 58656, -101105, -38563, -73483, -57837, -186974, -161227, -42635, 114654, -55743, 203162, -17062, -97534, 45885, 113291, 264706, -254142, -169907, 155326, 299293, 65046, -110085, 220405, 114381, -372842, -304181, 109648, 104165, -445189, -403906, -23548, 17351, -49288, -39177, 34383, -26775, 177702, -130994, -192400]
8866a92400j6621A21207J29156a4023j8253A18111b97590C1991d8510p9576j49055
8855b77141B72121I5949m0437J75025a8065j41522K4606q8235N7708k6495e0948
8843A9388L3316c03853A14579k2900J30850b0319B1080a91463f3932a4317e981
8831A28309b07479i2143j17305F5912b683j31238A0956b81686C0575e07821h3071
$$ y = [-192400, -209021, 121207, 250363, -14023, -32276, 118111, -297590, 31991, -48510, -128086, -277141, 272121, 95949, 55512, 230537, -18065, -159587, -134981, -223216, -165508, -192003, -50948, 19388, 52704, -303853, 114579, 91679, 222529, -20319, 21080, -191463, -63932, -14317, -5981, 128309, -207479, -92143, -209448, 65912, -2683, -133921, 10956, -281686, 30575, -507821, -83071]
$$ [...]
##END NTUPLES=NMR SPECTRUM
##END=
