
##TITLE=UV1257_M11_1332-1242_10_7409485_rOIlnEYvJ9
##JCAMPDX= 6.0         $$ Bruker NMR JCAMP-DX V2.0
##DATA TYPE= NMR SPECTRUM
##DATA CLASS= NTUPLES
##ORIGIN= BRUKER
##OWNER= Administrator
$$ 1.72 TOPSPIN		Version 2.1
$$ 2013-01-25 02:08:22.733 -0500  Administrator@X
$$ Compression mode = diff/dup
##.OBSERVE FREQUENCY= 400.02188249412
##.OBSERVE NUCLEUS= ^1H
##.ACQUISITION MODE= SIMULTANEOUS (DQD)
##.ACQUISITION SCHEME= undefined
##.AVERAGES= 64
##.DIGITISER RES= 22
##SPECTROMETER/DATA SYSTEM= spect
##.PULSE SEQUENCE= noesygpps1d.comp
##.SOLVENT NAME= COFFEE_meoh
##.SHIFT REFERENCE= INTERNAL, COFFEE_meoh, 1, 14.96125
##AUDIT TRAIL= $$ (NUMBER, WHEN, WHO, WHERE, PROCESS, VERSION, WHAT)
$$ ##TITLE= Audit trail, TOPSPIN		Version 2.1
$$ ##JCAMPDX= 5.01
$$ ##ORIGIN= Bruker BioSpin GmbH
$$ ##OWNER= Administrator
$$ $$ E:\/data/COFFEE/nmr/UV1257_M11_1332-1242_10_7409485_rOIlnEYvJ9/12/pdata/1/auditp.txt
$$ ##AUDIT TRAIL=  $$ (NUMBER, WHEN, WHO, WHERE, PROCESS, VERSION, WHAT)
(   1,<2013-01-25 02:08:16.920 -0500>,<Administrator>,<X>,<go>,<TOPSPIN 2.1>,
      <created by zg
	started at 2013-01-25 01:56:46.747 -0500,
	POWCHK enabled, PULCHK disabled,
       configuration hash MD5:
       86 BA 57 50 F2 9D 5C 9B 26 00 A9 28 5F 66 2E 89
       data hash MD5: 64K
       F3 94 69 8D BB 33 76 0A BE BC CF 84 7A A1 8E 4C>)
(   2,<2013-01-25 02:08:19.920 -0500>,<Administrator>,<X>,<proc1d>,<TOPSPIN 2.1>,
      <Start of raw data processing
       efp LB = 0.3 FT_mod = 6 PKNL = 1 PHC0 = 0 PHC1 = 0 SI = 128K 
       data hash MD5: 128K
       B0 A6 F7 A4 D2 B6 F5 78 E0 C2 2B 08 86 16 ED CD>)
(   3,<2013-01-25 02:08:20.967 -0500>,<Administrator>,<X>,<proc1d>,<TOPSPIN 2.1>,
      <pk PHC0 = -77.62939 PHC1 = 0 
       data hash MD5: 128K
       43 A6 3F BD 76 47 57 88 DF 91 49 09 55 F2 9A 3F>)
(   4,<2013-01-25 02:08:21.686 -0500>,<Administrator>,<X>,<proc1d>,<TOPSPIN 2.1>,
      <abs ABSG = 1 
       data hash MD5: 128K
       C9 55 E3 C9 3D A8 A2 98 99 45 6F B9 BB 0F ED 83>)
(   5,<2013-01-25 02:08:21.889 -0500>,<Administrator>,<X>,<proc1d>,<TOPSPIN 2.1>,
      <abs ABSG = 2 
       data hash MD5: 128K
       EC 4D 8C 6B 37 26 91 47 37 5B 46 EF 6B 9E CA 04>)
(   6,<2013-01-25 02:08:22.045 -0500>,<Administrator>,<X>,<proc1d>,<TOPSPIN 2.1>,
      <abs ABSG = 3 
       data hash MD5: 128K
       75 09 EC B8 18 6A C6 54 33 E1 59 D4 3F 46 C6 2C>)
(   7,<2013-01-25 02:08:22.233 -0500>,<Administrator>,<X>,<proc1d>,<TOPSPIN 2.1>,
      <abs ABSG = 4 
       data hash MD5: 128K
       57 2F E7 72 35 A2 8E A7 9E 66 00 E1 C3 58 D9 DA>)
(   8,<2013-01-25 02:08:22.405 -0500>,<Administrator>,<X>,<proc1d>,<TOPSPIN 2.1>,
      <abs ABSG = 5 
       data hash MD5: 128K
       B1 96 59 1B F4 51 EF F2 3E 93 5B 52 19 7D 6B DE>)
$$ ##END=
$$ 
$$ $$ hash MD5
$$ $$ 0E B2 5F 2C 6E 56 CA 31 89 68 DC DF 35 78 53 64
##$RELAX= 
##$RELAX= 
##$RELAX= 
##$RELAX= 
##$RELAX= 
##$RELAX= 
##$RELAX= 
##$RELAX= 
$$ Bruker specific parameters
$$ --------------------------
##$DU= <E:\>
##$EXPNO= 12
$$ [...]
##$TP07= 0
##$TPNAME0= <>
##$TPNAME1= <>
##$TPNAME2= <>
##$TPNAME3= <>
##$TPNAME4= <>
##$TPNAME5= <>
##$TPNAME6= <>
##$TPNAME7= <>
##$TPOAL= (0..7)
0.5 0.5 0.5 0.5 0.5 0.5 0.5 0.5
##$TPOFFS= (0..7)
0 0 0 0 0 0 0 0
##$TUNHIN= 0
##$TUNHOUT= 0
##$TUNXOUT= 0
##$USERA1= <user>
##$USERA2= <user>
##$USERA3= <user>
##$USERA4= <user>
##$USERA5= <user>
##$V9= 5
##$VALIST= <valist>
##$VCLIST= <CCCCCCCCCCCCCCC>
##$VD= 0
##$VDLIST= <DDDDDDDDDDDDDDD>
##$VPLIST= <PPPPPPPPPPPPPPP>
##$VTLIST= <TTTTTTTTTTTTTTT>
##$WBST= 1024
##$WBSW= 4
##$XGAIN= (0..3)
0 0 0 0
##$XL= 0
##$YL= 0
##$YMAX_a= 6015499
##$YMIN_a= -12440412
##$ZGOPTNS= <>
##$ZL1= 120
##$ZL2= 120
##$ZL3= 120
##$ZL4= 120
##$ABSF1= 14.96125
##$ABSF2= -5.596931
##$ABSG= 5
##$ABSL= 3
##$ALPHA= 0
##$AQORDER= 0
##$ASSFAC= 0
##$ASSFACI= 0
##$ASSFACX= 0
##$ASSWID= 0
##$AUNMP= <proc_prof1d_extract.lims>
##$AXLEFT= 0
##$AXNAME= <>
##$AXNUC= <1H>
##$AXRIGHT= 0
##$AXTYPE= 0
##$AXUNIT= <>
##$AZFE= 0.1
##$AZFW= 0.1
##$BCFW= 0
##$BC_mod= 0
##$BYTORDP= 0
##$COROFFS= 0
##$CY= 15
##$DATMOD= 1
##$DC= 0
##$DFILT= <>
##$DTYPP= 0
##$F1P= 0
##$F2P= 0
##$FCOR= 0.5
##$FTSIZE= 131072
##$FT_mod= 6
##$GAMMA= 0
##$GB= 0
##$INTBC= 1
##$INTSCL= 1
##$ISEN= 128
##$LB= 0.3
##$LEV0= 0
##$LPBIN= 0
##$MAXI= 10000
##$MC2= 0
##$MEAN= 0
##$ME_mod= 0
##$MI= 0
##$NCOEF= 0
##$NC_proc= -2
##$NLEV= 6
##$NOISF1= 0
##$NOISF2= 0
##$NSP= 0
##$NTH_PI= 0
##$NZP= 0
##$OFFSET= 14.96125
##$PC= 1
##$PHC0= -77.62939
##$PHC1= 0
##$PH_mod= 1
##$PKNL= yes
##$PPARMOD= 0
##$PPDIAG= 0
##$PPIPTYP= 0
##$PPMPNUM= 2147483647
##$PPRESOL= 1
##$PSCAL= 4
##$PSIGN= 0
##$PYNMP= <proc.py>
##$REVERSE= no
##$SF= 400.020009536739
##$SI= 131072
##$SIGF1= 0
##$SIGF2= 0
##$SINO= 400
##$SIOLD= 131072
##$SPECTYP= <>
##$SREGLST= <1H.CDCl3>
##$SSB= 0
##$STSI= 131072
##$STSR= 0
##$SW_p= 8223.68421052631
##$SYMM= 0
##$S_DEV= 0
##$TDeff= 65536
##$TDoff= 0
##$TI= <>
##$TILT= no
##$TM1= 0
##$TM2= 0
##$TOPLEV= 0
##$USERP1= <user>
##$USERP2= <user>
##$USERP3= <user>
##$USERP4= <user>
##$USERP5= <user>
##$WDW= 1
##$XDIM= 131072
##$YMAX_p= 401800869
##$YMIN_p= -12385
##$CURPLOT= <Network HP LaserJet P1505>
##$CURPRIN= <$Network HP LaserJet P1505>
##$DFORMAT= <normdp>
##$LAYOUT= <+/1D_H.xwp>
##$LFORMAT= <normlp>
##$PFORMAT= <normpl>
##$SURQMSG= 1
$$ End of Bruker specific parameters
$$ ---------------------------------
##NTUPLES= NMR SPECTRUM
##VAR_NAME=  FREQUENCY,     SPECTRUM/REAL,   SPECTRUM/IMAG
##SYMBOL=    X,             R,               I
##VAR_TYPE=  INDEPENDENT,   DEPENDENT,       DEPENDENT
##VAR_FORM=  AFFN,          ASDF,            ASDF
##VAR_DIM=   131072,        131072,          131072
##UNITS=     HZ,            ARBITRARY UNITS, ARBITRARY UNITS
##FACTOR=    0.0627417313425164, 1,          1
##FIRST=     8223.62146879497, -1027,        -62346
##LAST=      0,             746,             -63223
##MIN=       0,             -12385,          0
##MAX=       8223.62146879497, 401800869,    0
$$ Real data points
##PAGE= N=1
##DATA TABLE= (X++(R..R)), XYDATA
$$ [...]
63952I06529N6796O7127P8374R0046J02833J17443J33277J49147J64773J80520
$$ 906529 963325 1030452 1108826 1198872 1301705 1419148 1552425 1701572 1866345 2046865
63942B046865J95900K09536K20613K29241K35238K37602K35518K28961K17917
$$ 2046865 2242765 2452301 2672914 2902155 3137393 3374995 3610513 3839474 4057391
63933D057391K01835J80461J54559J25230R3083N8480K2239j4519n0878q6053
$$ 4057391 4259226 4439687 4594246 4719476 4812559 4871039 4893278 4878759 4827881 4741828
63923D741828j18935j48321j73515j94432k11050k23025k29899k31588k28628
$$ 4741828 4622893 4474572 4301057 4106625 3895575 3672550 3442651 3211063 2982435
63914B982435k21995k12704k01509j88893j75175j60624j45613j30746j16616
$$ 2982435 2760440 2547736 2346227 2157334 1982159 1821535 1675922 1545176 1428560
63905A428560j03355r0722p8795o8207n9368n1827m4835l8386l3118k9324k6572
$$ 1428560 1325205 1234483 1155688 1087481 1028113 976286 931451 893065 859947 830623 804051
63894H04051k4249k2093k0152j8667j7926j7843j7681j6701j5065j3620j2672
$$ 804051 779802 757709 737557 718890 700964 683121 665440 648739 633674 620054 607382
63883F07382j1591r729p280m862k703o01J546L563N303O874Q612J0777J3252J5562
$$ 607382 595791 586062 578782 573920 571217 570616 572162 575725 581028 587902 596514 607291 620543 636105
63869F36105J7348J8772K0296K2093K3912K5386K6252K6345K5757K4880K4009
$$ 636105 653453 672225 692521 714614 738526 763912 790164 816509 842266 867146 891155
63858H91155K2927K1233J8916J6202J3015R154M963J160k064n191q548j1903j5029
$$ 891155 914082 935315 954231 970433 983448 992602 997565 998725 996661 991470 982922 971019 955990
63845I55990j8023k0882k3399k5680k8098l0400l1642l1448l0665l0222k9940
$$ 955990 937967 917085 893686 868006 839908 809508 777866 746418 715753 685531 655591
63834F55591k9173k8002k6970k6042k4715k2913k1032j9224j7369j5612j4266
$$ 655591 626418 598416 571446 545404 520689 497776 476744 457520 440151 424539 410273
63823D10273j3256j2375j1811j1714j1384r958p870o567o534o670o026n086m643
$$ 410273 397017 384642 372831 361117 349733 339775 331905 325338 318804 312134 306108 301022 296379
63810B96379m387l603k582k174k317k142j501j287k006k884k900k132j564j912
$$ 296379 291992 288389 285807 283633 281316 279174 277673 276386 274380 271496 268596 266464 264900 262988
63796B62988k953l878m026l379k519j986j766j545j403j731k446k783k252j322
$$ 262988 260035 256157 252131 248752 246233 244247 242481 240936 239533 237802 235356 232573 230321 228999
63782B28999p82o79m22J90O06K89n62j239j286q11k18J44J15k92q74j253j088
$$ 228999 228217 227538 227116 227306 227912 228201 227639 226400 225114 224303 224085 224229 224344 224052 223178 221925 220837
63765B20837m45J43J80k74p91j197j617j912j575n00N59Q00L33n2M5L92P58J217
$$ 220837 220392 220535 220715 220441 219650 218453 216836 214924 213349 212849 213408 214208 214541 214489 214534 214926 215684 216901
63747B16901J723J907J564R81O35P85J453K419L198L387L185L163L340K983J620
$$ 216901 218624 220531 222095 223076 223711 224496 225949 228368 231566 234953 238138 241301 244641 247624 249244
63732B49244q5r61o17L14J119J740K508L479M256M447M175M001M333M972N407
$$ 249244 249159 248198 247581 247895 249014 250754 253262 256741 260997 265444 269619 273620 277953 282925 288332
63717B88332N293M455K765N63j091j332p70r78k418l718l505k162j034n59j80
$$ 288332 293625 298080 300845 301408 300317 298985 298215 297237 294819 291101 287596 285434 284400 283841 283661
63702B83661K94L90l9m24l63o8K01N70J104J572J889K343L074L700L779L286K433
$$ 283661 283955 284345 284306 283882 283519 283451 283652 284222 285326 286898 288787 291130 294204 297904 301683 304969 307402
63685C07402J393L74k97n01m81n19o81r33j216j259p16L13J171J357J091R32J047
$$ 307402 308795 309169 308872 308371 307890 307371 306690 305757 304541 303282 302566 302879 304050 305407 306498 307430 308477
63668C08477J179J112R15P39O55O48O08L13l80j372k398l213l725l978m084m091
$$ 308477 309656 310768 311683 312422 313077 313725 314333 314646 314266 312894 310496 307283 303558 299580 295496 291405
63652B91405l947l627l258k949k624k166j691j421j263q20R2J130J761J826J664
$$ 291405 287458 283831 280573 277624 275000 272834 271143 269722 268459 267639 267731 268861 270622 272448 274112
63637B74112J764K283K914L255L355L654M313M954N304N696O524P533Q261Q894
$$ 274112 275876 278159 281073 284328 287683 291337 295650 300604 305908 311604 318128 325661 333922 342816
63623C42816R917J1078J1625J1639J2211J3964J6177J7883J9060K0243K1571K2932
$$ 342816 352733 363811 375436 387075 399286 413250 429427 447310 466370 486613 508184 531116
63611E31116K4530K6480K8130K8535K7572K5886K3862K1250J7828J3821R530N084
$$ 531116 555646 582126 610256 638791 666363 692249 716111 737361 755189 769010 778540 783624
63599G83624P04l164o223q533j0219j1253j1679j1817j2048j2455j2934j3602
$$ 783624 784328 781164 774941 766408 756189 744936 733257 721440 709392 696937 684003 670401
63587F70401j4871j6998j9578k1650k2440k1948k0714j9226j7678j6053j4105
$$ 670401 655530 638532 618954 597304 574864 552916 532202 512976 495298 479245 465140
63576D65140j1422q056m950l122k379j540k4J587K823M226O239Q023Q438P787
$$ 465140 453718 445662 440712 437590 435211 433671 433647 435234 438057 442283 448522 456545 464983 472770
63562D72770P534Q409R644J0215J0086J0064J0993J3196J6225J9114K1281K3196
$$ 472770 480304 488713 498357 508572 518658 528722 539715 552911 569136 588250 609531 632727
63550F32727K5706K8795L1551L3303L4048L3719L1789K7826K1909J4349N647l012
$$ 632727 658433 687228 718779 752082 786130 819849 851638 879464 901373 915722 921369 918357
63538I18357r956j4212j6085j6383j5539j3858j2043j0846j0526j0997j2255j4229
$$ 918357 908401 894189 878104 861721 846182 832324 820281 809435 798909 787912 775657 761428
63526G61428j6588j9010k1382k3429k4637k4984k5282k6104k6778k6140k4092
$$ 761428 744840 725830 704448 681019 656382 631398 606116 580012 553234 527094 503002
63515E03002k1641j9537j7657j5751j4018j2641j1417j0177r050q029o774n267
$$ 503002 481361 461824 444167 428416 414398 401757 390340 380163 371113 363084 356310 351043
63503C51043m133l823l864l523k890k616k708k394j344k79Q6O0L55Q42P62R7j65
$$ 351043 346910 343087 339223 335700 332810 330194 327486 325092 323748 323469 323555 323615 323970 324812 325574 325671 325506
63486C25506N91J689K174K161K486L289L807L576L090K994L224L335L113K526
$$ 325506 326097 327786 329960 332121 334607 337896 341703 345279 348369 351363 354587 357922 361035 363561
63472C63561J442m9j344j921k072k464l095l337l027k876l453m293m412l439j827
$$ 363561 365003 364954 363610 361689 359617 357153 354058 350721 347694 344818 341365 337072 332660 329221 327394
63457C27394k36Q79J218P64R0J51J404L303M824N507N822O510P688Q751R235R607
$$ 327394 327158 328037 329255 330019 330109 330260 331664 334967 339791 345298 351120 357630 365318 374069 383304 392911
63441C92911J0900J3538J6778J9592K1774K3818K5808K7039K6888K5518K3371
$$ 392911 403811 417349 434127 453719 475493 499311 525119 552158 579046 604564 627935
63430F27935K0423J6471J1982Q054N478M383M774O785J0084J3682J6895K0144
$$ 627935 648358 664829 676811 684865 690343 694726 699500 706285 716369 730051 746946 767090
63418G67090K4148K8441L1400L1827L0018K7063K3541J9273J4002P886J483m406
$$ 767090 791238 819679 851079 882906 912924 939987 963528 982801 996803 1004689 1006172 1001766
63406A001766q959j1805j3366j4481j5562j6365j6702j7060j8226k0396k2992
$$ 1001766 992807 981002 967636 953155 937593 921228 904526 887466 869240 848844 825852
63395H25852k5348k7251k8674k9394k9268k8693k8237k7763k6403k3637k0095
$$ 825852 800504 773253 744579 715185 685917 657224 628987 601224 574821 551184 531089
63384E31089j6942j4686j2872j0805q212n308k549l16J382K868M335N526O196
$$ 531089 514147 499461 486589 475784 467572 462264 459715 459399 460781 463649 467984 473510 479706
63371D79706O709P786R686J2011J4245J6142J7617J8812K0250K2406K5002K7224
$$ 479706 486415 494201 503887 515898 530143 546285 563902 582714 602964 625370 650372 677596
63359F77596K8784L0191L1696L2680L2447L1074K8914K5825K1558J6463J1106
$$ 677596 706380 736571 768267 800947 833394 864468 893382 919207 940765 957228 968334
63348I68334N494n25o274j0577j3060j4440j5399j5965j6011j5728j5399j5391
$$ 968334 973828 973303 967029 956452 943392 928952 913553 897588 881577 865849 850450 835059
63336H35059j6493j9360k3299k6417k7497k7115k6343k5136k2851j9795j7077
$$ 835059 818566 799206 775907 749490 721993 694878 668535 643399 620548 600753 583676
63325E83676j5021j2725r455n741k823j552k039l934o594r338j1783j3887j5522
$$ 583676 568655 555930 546475 540734 537911 536359 534320 530386 523792 514454 502671 488784 473262
63312D73262j6324j6056j4972j3550j2088j0654r284q011o794n583m469l679l371
$$ 473262 456938 440882 425910 412360 400272 389618 380334 372323 365529 359946 355477 351798 348427
63299C48427l434l434k927j951j133j104j773k449k602k364k179k236k325k145
$$ 348427 344993 341559 338632 336681 335548 334444 332671 330222 327620 325256 323077 320841 318516 316371
63285C16371j599q98m01k79l63m44n86r46j308j178m47L22M77L3l83k49L36Q47
$$ 316371 314772 313874 313473 313194 312831 312387 311801 310855 309547 308369 307922 308244 308721 308754 308371 308122 308458 309305
63267C09305R45Q78J203K053K862L011K601K272K364K642K853L035L171L047K751
$$ 309305 310250 311128 312331 314384 317246 320257 322858 325130 327494 330136 332989 336024 339195 342242 344993
63252C44993K798L416M055M150M036M553N850P222Q071Q519R003R760J0927J2624
$$ 344993 347791 351207 355262 359412 363448 368001 373851 381073 389144 397663 406666 416426 427353 439977
63238D39977J4672J6509J7683J8298J8770J9443K0577K2369K4532K6119K6313
$$ 439977 454649 471158 488841 507139 525909 545352 565929 588298 612830 638949 665262
63227F65262K5502K4989K5436K5984K5390K3678K2065K1384K1272K1160K1268
$$ 665262 690764 715753 741189 767173 792563 816241 838306 859690 880962 902122 923390
63216I23390K2046K3056K3233K2105K0031J7239J3482Q943M523O56l586r295j6001
$$ 923390 945436 968492 991725 1013830 1033861 1051100 1064582 1073525 1078048 1078704 1075118 1065823 1049822
63203A049822k1899k5787k8042k9677l1108l2100l2312l1521k9573k6572k3025
$$ 1049822 1027923 1002136 974094 944417 913309 881209 848897 817376 787803 761231 738206
63192G38206j9593j6638j4005j1152p611l542K83L280N756Q446J1339J3496J4281
$$ 738206 718613 701975 687970 676818 669207 665665 665948 669228 674984 683430 694769 708265 722546
63179G22546J4356J5005J6580J8080J8364J7512J6755J7028J7934J8265J7352
$$ 722546 736902 751907 768487 786567 804931 822443 839198 856226 874160 892425 909777
63168I09777J5562J3562J1625R775P985N842K532k195p338j1599j4837j7927k1307
$$ 909777 925339 938901 950526 960301 968286 974128 976660 974465 967127 955528 940691 922764 901457
63155I01457k4464k6808k8287k8978k8827k8089k7301k6456k4919k2521k0108
$$ 901457 876993 850185 821898 792920 764093 736004 708703 682247 657328 634807 614699
63144F14699j8467j7279j5749j3730j1639r658p810o409n679n104l974k532j779
$$ 614699 596232 578953 563204 549474 537835 528177 520367 513958 508279 503175 499201 496669 494890
63131D94890k075k612k449j506k75Q88J889K648L128L445L731M012M274M533M764
$$ 494890 492815 490203 487754 486248 485973 486861 488750 491398 494526 497971 501702 505714 509988 514521 519285
63116E19285M902M901M681M143L381K762K517K415K139J764J560J446J165Q55
$$ 519285 524187 529088 533769 537912 541293 544055 546572 548987 551126 552890 554450 555896 557061 557916
63102E57916Q55R84O37k21q47p41l13j81l12l42k67k52j31L35Q76J035Q81R08
$$ 557916 558771 559755 560392 560171 559324 558583 558270 558089 557777 557435 557168 556916 556785 557120 557996 559031 559912 560820
63084E60820J278J722K141K656L060K886K299K224L181M471N089N053N197N899
$$ 560820 562098 563820 565961 568617 571677 574563 576862 579086 582267 586738 591827 596880 602077 607976
63070F07976O689P218P841R048J0727J2386J3783J5035J6245J7442J8749K0385
$$ 607976 614665 621883 629724 638772 649499 661885 675668 690703 706948 724390 743139 763524
63058G63524K2461K4984K7959L1339L4900L8366M1614M4631M7419N0028N2593
$$ 763524 785985 810969 838928 870267 905167 943533 985147 1029778 1077197 1127225 1179818
63047A179818N5171N7562N9464O0664O0931N9997N8009N5840N4508N4175N4051
$$ 1179818 1234989 1292551 1352015 1412679 1473610 1533607 1591616 1647456 1701964 1756139 1810190
63036A810190N3334N1947N0268M8545M6719M4536M1664L7789L2776K6541J8804
$$ 1810190 1863524 1915471 1965739 2014284 2061003 2105539 2147203 2184992 2217768 2244309 2263113
63025B263113R279j772j3430k4759l5345m5146n4071o1910o8420p3236p5950p6405
$$ 2263113 2272392 2270620 2257190 2232431 2197086 2151940 2097869 2035959 1967539 1894303 1818353 1741948
63013A741948p4777p1232o5854n9047n1770m4873l8362l1610k4238j6594r302
$$ 1741948 1667171 1595939 1530085 1471038 1419268 1374395 1336033 1304423 1280185 1263591 1254289
63002A254289k590L766R840J5078J8707K0749K2266K4263K6626K8588K9924L0997
$$ 1254289 1251699 1255465 1265305 1280383 1299090 1319839 1342105 1366368 1392994 1421582 1451506 1482503
62990A482503L1727L1486L0169K8562K7230K5783K3595K0603J6917J2398P122
$$ 1482503 1514230 1545716 1575885 1604447 1631677 1657460 1681055 1701658 1718575 1730973 1738095
62979A738095J523m520j1858k0538k8885l5246m0041m4841m9860n3749n5746n6515
$$ 1738095 1739618 1735098 1723240 1702702 1673817 1638571 1598530 1553689 1503829 1450080 1394334 1337819
62967A337819n6667n5731n3232m9721m6138m2809l9565l6319l3139l0232k8081
$$ 1337819 1281152 1225421 1172189 1122468 1076330 1033521 993956 957637 924498 894266 866185
62956H66185k7030k6495k5346k3278k1198j9893j9066j8063j6911j6000j5320
$$ 866185 839155 812660 787314 764036 742838 722945 703879 685816 668905 652905 637585
62945F37585j4528j3400j1873j0065q585q233q868r231q429p097o410o406o168
$$ 637585 623057 609657 597784 587719 579134 570901 562033 552802 544373 537276 530866 524460 518292
62932E18292n267m226l571l215k892k569k301k041j741j419j061o67l46j85j14
$$ 518292 513025 508799 505228 502013 499121 496552 494251 492210 490469 489050 487989 487322 486976 486791 486677
62917D86677j51m86j095j509j379j079j290k109k950l322l269l034k678k157j524
$$ 486677 486526 486040 484945 483436 482057 480978 479688 477579 474629 471307 468038 465004 462326 460169 458645
62902D58645r66o87p47r04p72l14M7lk35k39l3J30L31Q63J559J805J309M92p5
$$ 458645 457679 456992 456245 455341 454569 454255 454302 454299 454064 453825 453792 453922 454253 455116 456675 458480 459789 460281 460206
62883D60206l06m70o87q07p20n23l63k83k21j41p0o9k24o57j372k031k102j536
$$ 460206 459900 459430 458743 457936 457216 456693 456330 456047 455826 455685 455615 455546 455322 454665 453293 451262 449160 447624
62865D47624j004j150j660j634q28KK08J11L85J001J388J321J149J121R74L37
$$ 447624 446620 445470 443810 442176 441348 441350 441558 441669 442054 443055 444443 445764 446913 448034 449008 449345
62849D49345o85j494j530q46q2K50K91M21N20J28o82j194r84m51j42j33l18p35
$$ 449345 448660 447166 445636 444790 444708 444958 445249 445670 446190 446318 445636 444442 443458 443007 442865 442732 442414 441679
62831D41679j176j101l57M98J042J568K252K449J652N86L67R28J335J370J715
$$ 441679 440503 439402 439045 439543 440585 442153 444405 446854 448506 449092 449459 450387 451722 453092 454807
62816D54807K572L284L513L774M460N196N544N652N749N691N452N451N989O746
$$ 454807 457379 460663 464176 467950 472410 477606 483150 488802 494551 500242 505694 511145 517134 523880
62802E23880P285P590P814P993Q290R058J0296J1496J2435J3656J5701J8246K0558
$$ 523880 531165 538755 546569 554562 562852 571910 582206 593702 606137 619793 635494 653740 674298
62789F74298K2518K4752K7910L2197L7336M2620M7294N1326N5627O1050O7337
$$ 674298 696816 721568 749478 781675 819011 861631 908925 960251 1015878 1076928 1144265
62778A144265P3430P8650Q3043Q6812Q9871R2003R2931R2171Q9206Q3932P6585
$$ 1144265 1217695 1296345 1379388 1466200 1556071 1648074 1741005 1833176 1922382 2006314 2082899
62767B082899O7195N5498M1554K6169J0424n040k0116l4764m8656o1207p1797
$$ 2082899 2150094 2205592 2247146 2273315 2283739 2278699 2258583 2223819 2175163 2113956 2042159
62756B042159p9961q5621q9087r0815r1035q9696q6851q2977p8735p4428o9908
$$ 2042159 1962198 1876577 1787490 1696675 1605640 1515944 1429093 1346116 1267381 1192953 1123045
62745A123045o5048o0032n5059n0045m4913l9960l5541l1543k7608k3836k0775
$$ 1123045 1057997 997965 942906 892861 847948 807988 772447 740904 713296 689460 668685
62734F68685j8614j6886j5119j3385j1851j0307q521o813n734n261m731l652k261
$$ 668685 650071 633185 618066 604681 592830 582523 574002 567189 561455 556194 551463 547811 545550
62721E45550j118l56M77J817L453M678N151N469O614Q790J1215J3106J4619J6448
$$ 545550 544432 544076 544553 546370 549823 554501 559652 565121 571735 580525 591740 604846 619465 635913
62707F35913J8827K1254K3221K4938K7219L0742L5359M0116M4057M7112N0070
$$ 635913 654740 675994 699215 724153 751372 782114 817473 857589 901646 948758 998828
62696I98828N3611N7497O0918O3383O4984O5833O5610O3758N9935N4045M6102
$$ 998828 1052439 1109936 1170854 1234237 1299221 1365054 1430664 1494422 1554357 1608402 1654504
62685A654504L6311K5283J3817K314r447k1630l3614m4200n2620n8894o3257o5682
$$ 1654504 1690815 1716098 1729915 1732229 1722782 1701152 1667538 1623338 1570718 1511824 1448567 1382885
62673A382885o6362o6102o5590o4542o2182n8452n4140m9860m5620m1399l7471
$$ 1382885 1316523 1250421 1184831 1120289 1058107 999655 945515 895655 850035 808636 771165
62662G71165l3887l0375k6964k4092k1824j9628j7356j5682j4977j4488j3415
$$ 771165 737278 706903 679939 655847 634023 614395 597039 581357 566380 551892 538477
62651E38477j2165j1604j1407j0360q226o263n611n960o238n806m735l437k457
$$ 538477 526312 514708 503301 492941 484715 478452 472841 466881 460643 454837 450102 446665 444208
62638D44208k152k195j806q64k86q38j979k521k175j763j922k278k144j530j054
$$ 444208 442056 439861 438055 437191 436905 436067 434088 431567 429392 427629 425707 423429 421285 419755 418701
62623D18701j041j154q72p0R53J803K253K343K343K561L032L543M049M820N903
$$ 418701 417660 416506 415634 415564 416517 418320 420573 422916 425259 427820 430852 434395 438444 443264 449167
62608D49167O686O602O195O778Q764J0986J2310J3283J5375J8848K2395K4958
$$ 449167 455853 462455 468650 475428 484192 495178 507488 520771 536146 554994 577389 602347
62596F02347K6932K9250L2090L5122L8336M1828M4971M6666M6527M5276M3651
$$ 602347 629279 658529 690619 725741 764077 805905 850876 897542 944069 989345 1032996
62585A032996M1326L7276L1101K3634J6037Q589P00p821j6002k2686k7949l2862
$$ 1032996 1074322 1111598 1142699 1166333 1182370 1190959 1191659 1183838 1167836 1145150 1117201 1084339
62573A084339l7793m1676m3378m3172m2291m1435m0380l8824l6842l4466l1508
$$ 1084339 1046546 1004870 961492 918320 876029 834594 794214 755390 718548 684082 652574
62562F52574k8138k5016k2552k0405j8069j5627j3506j1764j0107q511p322o678
$$ 652574 624436 599420 576868 556463 538394 522767 509261 497497 487390 478879 471557 464879
62550D64879o225n589m823m185l703l153k402j562q83o40r68j642k099j943j377
$$ 464879 458654 453065 448242 444057 440354 437201 434799 433237 432354 431714 430746 429104 427005 425062 423685
62535D23685r10o44j52Q37J988K779L155L520M179N127O232P408Q599R841J1330
$$ 423685 422775 422131 421979 422816 424804 427583 430738 434258 438437 443564 449796 457204 465803 475644 486974
62520D86974J3196J5263J7290J9398K1884K4589K6937K8744L0571L2910L5372
$$ 486974 500170 515433 532723 552121 574005 598594 625531 654275 684846 717756 753128
62509G53128L7090L7744L7735L7411L6554L4682L1492K6972K1382J5248R195L636
$$ 753128 790218 827962 865697 903108 939662 974344 1005836 1032808 1054190 1069438 1078633 1082269
62497A082269j356n900j0191j4297j7824j9856j9673j7556j4592j1631q698n477
$$ 1082269 1080913 1075013 1064822 1050525 1032701 1012845 993172 975616 961024 949393 940695 935218
62485I35218j930J729N305Q546J1115J2839J3851J4167J3386J1061P290K686k144
$$ 935218 933288 935017 940322 948868 959983 972822 986673 1000840 1014226 1025287 1032577 1035263 1033119
62472A033119o854j1313j5572j9797k4017k8004l1487l4264l5970l6155l4964
$$ 1033119 1026265 1014952 999380 979583 955566 927562 896075 861811 825841 789686 754722
62461G54722l3395l2306l1327k9358k6101k2453j9293j6561j3820j1214r255p970
$$ 754722 721327 689021 657694 628336 602235 579782 560489 543928 530108 518894 509639 501669
62449E01669o812n394l945k839j955p49J024K856L988M312M454M874N266N190
$$ 501669 494857 489463 485518 482679 480724 479975 480999 483855 487843 492155 496609 501483 506749 511939
62435E11939M863M741M541L420J221j116k681l586m545n928p505q786r330r024
$$ 511939 516802 521543 526084 529504 530725 529609 526928 523342 518797 512869 505364 496578 487248 478224
62421D78224q322p925p933p746o998o120n560n015l977k699j949j945k166k161
$$ 478224 469902 461977 454044 446298 439300 433180 427620 422605 418628 415929 413980 412035 409869 407708
62407D07708k037k081k277k246j509k3J390J553L33q19l45J574L271L549K755
$$ 407708 405671 403590 401313 399067 397558 397535 398925 400478 400811 399992 399647 401221 404492 408041 410796
62392D10796J987J987K832L997M594M152L340L300M139M815M741M716N660P149
$$ 410796 412783 414770 417602 421599 426193 430345 433685 436985 441124 445939 450680 455396 461056 468205
62378D68205P998P852P434P399P728Q279R174J0370J1363J1771J1952J2673J4223
$$ 468205 476203 484055 491489 498888 506616 514895 524069 534439 545802 557573 569525 582198 596421
62365E96421J6156J7974J9836K2338K5721K9582L3426L7184M0980M4615M7655
$$ 596421 612577 630551 650387 672725 698446 728028 761454 798638 839618 884233 931888
62354I31888M9894N1307N1559M9976M6218M0719L4254K7288J9849J1959L963l597
$$ 931888 981782 1033089 1084648 1134624 1180842 1221561 1255815 1283103 1302952 1314911 1318874 1315277
62342A315277j0311j6084k0915k4674k7323k9338l1439l3693l5247l5370l4345
$$ 1315277 1304966 1288882 1267967 1243293 1215970 1186632 1155193 1121500 1086253 1050883 1016538
62331A016538l2954l1460k9712k7885k6316k4780k2784k0597j9034j8227j7524
$$ 1016538 983584 952124 922412 894527 868211 843431 820647 800050 781016 762789 745265
62320G45265j6815j6894j8003j9052j9044j8451j8208j8074j7008j4829j2411
$$ 745265 728450 711556 693553 674501 655457 637006 618798 600724 583716 568887 556476
62309E56476j0371q529o784n486m715l904k622j124J67J366K858M667O427P827
$$ 556476 546105 537576 530792 525306 520591 516687 514065 512941 513108 514474 517332 521999 528426 536253
62295E36253Q772R209R159Q854Q659Q672Q612Q216P685P448P458P000N488L292
$$ 536253 545025 554234 563393 572247 580906 589578 598190 606406 614091 621539 628997 635997 641485 644777
62281F44777J392L06k79q50j543k323l177l849l825k908j474O9J741L650N610
$$ 644777 646169 646475 646196 645346 643803 641480 638303 634454 630629 627721 626247 626316 628057 631707 637317
62266F37317P447R432J1996J5225J8923K2904K6990L0998L5025L9434M4181M8550
$$ 637317 644764 654196 666192 681417 700340 723244 750234 781232 816257 855691 899872 948422
62254I48422N1785N3658N4081N2774M9807M5888M1336L5284K6855J6870P318p62
$$ 948422 1000207 1053865 1107946 1160720 1210527 1256415 1297751 1333035 1359890 1376760 1384078 1383316
62242A383316p997j5187k2141k8352l3829l8757m2873m5793m7536m8341m8245
$$ 1383316 1375319 1360132 1337991 1309639 1275810 1237053 1194180 1148387 1100851 1052510 1004265
62231A004265m7232m5473m3090l9888l5741l1073k6724k3359k1051j9275j7254
$$ 1004265 957033 911560 868470 828582 792841 761768 735044 711685 690634 671359 654105
62220F54105j4605j1741r494q237p612p059o393n770n453n578n948o004n418m547
$$ 654105 639500 627759 618265 610028 602416 595357 588964 583194 577741 572163 566215 560211 554793 550246
62206E50246l950l468k414o55J123K385L316M084M314L810L259L477M367N295
$$ 550246 546296 542828 540414 539759 540882 543267 546583 550667 554981 558791 562050 565527 569894 575189
62192E75189O228P688R633J1111J1269J0274R019Q275Q225Q485Q482Q019P583
$$ 575189 581417 589105 598738 609849 621118 631392 640411 648686 656911 665396 673878 681897 689480
62179F89480P768Q440Q779Q332P594P399Q067R427J1375J3880J6674J9453K2396
$$ 689480 697248 705688 714467 722799 730393 737792 745859 755286 766661 780541 797215 816668 839064
62166H39064K5959K9992L3571L5983L7445L8383L8355L6348L2081K6366K0174
$$ 839064 865023 895015 928586 964569 1002014 1040397 1078752 1115100 1147181 1173547 1193721
62155A193721J3917P798K121l120q407j3856j8641k1905k3976k5979k8388l0652
$$ 1193721 1207638 1215436 1217557 1214437 1206030 1192174 1173533 1151628 1127652 1101673 1073285 1042633
62143A042633l2217l3085l3176l1928k9084k5381k1902j8967j6193j3463j1279
$$ 1042633 1010416 977331 944155 912227 883143 857762 835860 816893 800700 787237 775958
62132G75958r996r211q213o855n626m921m498l836k713j298K24J782L264M589
$$ 775958 765962 756751 748538 741683 736057 731136 726638 722802 720089 718791 719015 720797 724061 728650
62118G28650N915P388Q657R113Q726Q062P234N542K650m50k493l488m407n568
$$ 728650 734565 741953 750610 759723 768449 776511 783745 789287 791937 791487 788994 785506 781099 775531
62104G75531o350o458o490o942p543p949q278q517q066o477m216k033K6K356M760
$$ 775531 769181 762723 756233 749291 741748 733799 725521 717004 708938 702461 698245 696212 696238 698594 703354
62089G03354O400O845O685O801P316P513O889O067O388Q371J0908J2330J2227
$$ 703354 709754 716599 723284 730085 737401 744914 751803 757870 764258 772629 783537 795867 808094
62076H08094J1720J1988J3128J4594J6151J7913J9761K1209K1828K1674K1360
$$ 808094 819814 831802 844930 859524 875675 893588 913349 934558 956386 978060 999420
62065I99420K1657K2782K3939K3991K2627K0598J8708J6924J4607J1245O805J809
$$ 999420 1021077 1043859 1067798 1091789 1114416 1135014 1153722 1170646 1185253 1196498 1203303 1205112
62053A205112k874o715j0193j4205j8681k2437k4732k6257k8086l0279l2211l3697
$$ 1205112 1202238 1195523 1185330 1171125 1152444 1130007 1105275 1079018 1050932 1020653 988442 954745
62041I54745l4902l5506l4860l3001l0789k8916k7355k5808k4127k2193j9829
$$ 954745 919843 884337 849477 816476 785687 756771 729416 703608 679481 657288 637459
62030F37459j7078j4311j1979j0365r503r084q643p983p352o914o450n896n752
$$ 637459 620381 606070 594091 583726 574223 565139 556496 548513 541161 534247 527797 521901 516149
62017E16149o405p334p637p187o566o025n261m203l237k486j611n28L54R20J666
$$ 516149 509744 502410 494773 487586 481020 474995 469734 465531 462294 459808 458197 457669 458023 458943 460609
62002D60609K859L928M259M040L817L562K844J734Q31M19P4p04j874k990l802
$$ 460609 463468 467396 471655 475695 479512 483074 485918 487652 488483 488902 488976 488272 486398 483408 479606
61987D79606m541n572o896p989q275p719o852o221n953n861n652n064m074l089
$$ 479606 475065 469493 462597 454608 446333 438614 431762 425541 419588 413727 408075 403011 398937 395848
61973C95848k635k726k862k791k790k948k698j659n48m83j406j982j230L57J593
$$ 395848 393213 390487 387625 384834 382044 379096 376398 374739 374191 373708 372302 370320 369090 369447 371040
61958C71040J987J978K184K844L761M423M395L950M052N363P342Q889R673J0374
$$ 371040 373027 375005 377189 380033 383794 388217 392612 396562 400614 405977 413319 422208 431881 442255
61944D42255J1593J3123J4442J5390J6081J6609J7183J8113J9243J9747J9062
$$ 442255 453848 466971 481413 496803 512884 529493 546676 564789 584032 603779 622841
61933F22841J7768J6938J6745J6321J5015J3099J1113R075O772M334K031k29k697
$$ 622841 640609 657547 674292 690613 705628 718727 729840 738915 745687 750021 752052 751823 749126
61920G49126n205p231q510r159r166q158n954k996K3K830N565Q164J0205J1491
$$ 749126 743921 736690 728180 719021 709855 701697 695743 692747 692770 695600 701165 709329 719534 731025
61906G31025J2337J3002J3139J2251J0552Q722O871M392J059k461n520q287j1089
$$ 731025 743362 756364 769503 781754 792306 801028 807899 812291 813350 810889 805369 797082 785993
61893G85993j3516j4950j5547j5889j5984j5518j4860j4719j4835j4198j2744
$$ 785993 772477 757527 741980 726091 710107 694589 679729 665010 650175 635977 623233
61882F23233j1661j1597j1698j1080j0192r826r613q676p160o011n471m878l875
$$ 623233 611572 599975 588277 577197 567005 557179 547566 538890 531730 525719 520248 515370 511495
61869E11495k805j879q37M38J690K815M006N270O451P762R632J1910J3920J5488
$$ 511495 508690 506811 505974 506412 508102 510917 514923 520193 526644 534406 544038 555948 569868 585356
61855E85356J7186J9340K1450K3088K4656K6742K9129L0997L1832L1629L0502
$$ 585356 602542 621882 643332 666420 691076 717818 746947 777944 809776 841405 871907
61844H71907K8580K6152K3477K0494J7003J3010Q598L711j476o141r301j0727
$$ 871907 900487 926639 950116 970610 987613 1000623 1009221 1012932 1011456 1005315 996014 985287
61832I85287j0965j0418q823n866j965J863M769O560P635Q606R744J0579J0141
$$ 985287 974322 963904 955081 949215 947250 949113 953882 960442 968077 976683 986427 997006 1007147
61819A007147P865M178o1m519r457j4800j9742k3423k5736k7129k7930k8234k8279
$$ 1007147 1015012 1019190 1019129 1014610 1005153 990353 970611 947188 921452 894323 866393 838159 809880
61806H09880k8324k8203k7373k5552k3010k0157j7281j4762j3036j2042j1044
$$ 809880 781556 753353 725980 700428 677418 657261 639980 625218 612182 600140 589096
61795E89096r444p574o291n841n617n043m347m157m535m817m465l790l532l778
$$ 589096 579652 572078 565787 559946 554329 549286 544939 540782 536247 531430 526965 523175 519643 515865
61781E15865l829l254k607k570k825k430j286l83l80p39o51k24j43n85j059j105
$$ 515865 512036 508782 506175 503605 500780 498350 497064 496681 496301 495562 494911 494687 494544 493959 492900 491795
61765D91795o41K11J097J415Q71Jk89K79J196J890K199K144J744J130N45R1l09
$$ 491795 491154 491365 492462 493877 494748 494749 494460 494739 495935 497825 500024 502168 503912 505042 505587 505678 505369
61748E05369o89j058j600k481l425l804l290k242j359j081j357j795j981j780
$$ 505369 504680 503622 502022 499541 496116 492312 489022 486780 485421 484340 482983 481188 479207 477427
61734D77427j417j124q13k24O02J248J333R36N46P07J542K618L299L315K870K199
$$ 477427 476010 474886 474073 473849 474451 475699 477032 477968 478514 479221 480763 483381 486680 489995 492865 495064
61718D95064J341M31q9M3M49N18J66j51j95l55j214k843m607n629n538m797m250
$$ 495064 496405 496836 496747 496790 497239 497757 497923 497772 497577 497222 496008 493165 488558 482929 477391 472594 468344
61701D68344m316m719m968m818m295l649l310l475l656l145k101j599k242l282
$$ 468344 464028 459309 454341 449523 445228 441579 438269 434794 431138 427993 425892 424293 422051 418769
61687D18769l530k755j710j189j532k577l608l735k902k115k157k546k395j784
$$ 418769 415239 412484 410774 409585 408053 405476 401868 398133 395231 393116 390959 388413 386018 384234
61673C84234j427j391j133o28m39o76p76m39N1M54P81Q16K61n15o73p9M41K47
$$ 384234 382807 381416 380283 379655 379216 378540 377764 377325 377376 377830 378611 379427 379688 379173 378500 378421 378862 379109
61655C79109l85q46r19n91J78J192K021K538L017L530L753L579L418L594L879
$$ 379109 378724 377878 376959 376368 376546 377738 379759 382297 385314 388844 392597 396176 399594 403188 407067
61640D07067L780L057J887Q07L89N47L98o75k081k780k766k849l218l250k837
$$ 407067 410847 413904 415791 416598 416987 417534 417932 417257 415176 412396 409630 406781 403563 400313 397476
61625C97476k676l010l137k590j823j343j017o58m29k83J18N30K25o66j019m92
$$ 397476 394800 391790 388653 386063 384240 382897 381880 381222 380793 380510 380628 381158 381383 380717 379698 379206
61609C79206k43j101k255k762l182m388n739n941n128m531m424l980l014k446
$$ 379206 378963 377862 375607 372845 369663 365275 359536 353595 348467 343936 339512 335532 332518 330072
61595C30072k790l363l367k776j937j051l75j81l19l47j99k19m54n74n24o14p98
$$ 330072 327282 323919 320552 317776 315839 314788 314413 314232 313913 313566 313367 313148 312694 312120 311596 310982 310184
61578C10184n73J97Q61P38o7q56j073p47l55l20n25m89r3J91O3q2J42L32k8n39
$$ 310184 309611 309808 310669 311407 311340 310484 309411 308664 308309 307989 307464 306975 306882 307073 307136 307054 307196 307528 307500 306961
61558C06961l45M88J018Q31N07N35O47O02P68J393J917J624P07Q1K65Q44J060
$$ 306961 306616 307104 308122 308953 309460 309995 310642 311244 312012 313405 315322 316946 317653 317734 317999 318843 319903
61541C19903O70K21M90J589K708K954K304J479R68O40K93J07K90P46J251J659
$$ 319903 320573 320794 321284 322873 325581 328535 330839 332318 333286 333926 334219 334326 334616 335362 336613 338272
61525C38272J757J240J08j134j977k392k613k584k010r58n6R8m09r71j208j253
$$ 338272 340029 341269 341377 340243 338266 335874 333261 330677 328667 327709 327653 327751 327342 326371 325163 323910
61509C23910j212p57L14J377J501O60j77l55k44l36l76K4M88M82L80R53J911J981
$$ 323910 322698 321941 322255 323632 325133 325793 325616 325261 325017 324681 324305 324329 324817 325299 325679 326632 328543 330524
61491C30524O88q10j118k41P16J042J000J038J049O75M2j96L89J427K144K214
$$ 330524 331212 330402 329284 329043 329759 330801 331801 332839 333888 334563 334605 334409 334798 336225 338369 340583
61475C40583J912J529J079O34L89K13l04j045j240n71J75K12q6J00N92N63J0k20
$$ 340583 342495 344024 345103 345737 346126 346339 346035 344990 343750 343179 343354 343566 343480 343580 344172 344735 344745 344525
61457C44525O8Q5m96q82m09L36M35m4l19r4K62M41M43K88L1L3O47J643K367K545
$$ 344525 344593 344678 344182 343300 342891 343227 343662 343618 343299 343205 343467 343908 344351 344639 344670 344703 345350 346993 349360 351905
61437C51905K504K545K525K303K199K571L102K966J867N37L5O38J702K401K363
$$ 351905 354409 356954 359479 361782 363981 366552 369654 372620 374487 375024 375059 375697 377399 379800 382163
61422C82163J757J086Q88J298J936K404K739L009K768J605J32m75r1J01n96j319
$$ 382163 383920 385006 385894 387192 389128 391532 394271 397280 400048 401653 401785 401310 401219 401320 400724 399405
61406C99405j023j72q9j070k166k518k106j312n84m57j073j735j627r35n47o95
$$ 399405 398382 398210 398121 397051 394885 392367 390261 388949 388365 387908 386835 385100 383473 382538 381991 381296
61390C81296o98j41M80M77j74r27j133m26Q45J669J410P52R39K183L530M252M451
$$ 381296 380598 380457 380937 381414 381240 380313 379180 378754 379599 381268 382678 383430 384369 386552 390082 394334 398785
61373C98785M275L498K284J424J386J738J937K013K148K211K175K324K582K335
$$ 398785 403060 406558 408842 410266 411652 413390 415327 417340 419488 421699 423874 426198 428780 431115
61359D31115J453Q62J418K706L744M393N233O349P072P041O702O585O655O608
$$ 431115 432568 433430 434848 437554 441298 445691 450924 457273 464345 471386 478088 484673 491328 497936
61345D97936O360N943N214M032K580J267L38k45n42n47m47p05j539k487k928k964
$$ 497936 504296 510239 515453 519485 522065 523332 523670 523425 522883 522336 521889 521184 519645 517158 514230 511266
61329E11266l251l848l932l042j884j355j299j013n06l15l92j18O73J570K428
$$ 511266 508015 504167 500235 497193 495309 493954 492655 491642 491136 490821 490429 490311 490984 492554 494982
61314D94982L337L914L700L413M526P251J0048J1643J2478J3420J4123J3672J2199
$$ 494982 498319 502233 505933 509346 513872 521123 531171 542814 555292 568712 582835 596507 608706
61301F08706J0744R771Q725O984M553J870o27k715m477o099p436q055p859p301
$$ 608706 619450 629221 637946 644930 649483 651353 650726 648011 643534 637435 629999 621944 614085 606784
61287F06784o781o372o208o580p210p175o060m665l966l825l409k438j289k24
$$ 606784 600003 593631 587423 580843 573633 566458 560398 555733 551767 547942 544533 542095 540806 540582
61273E40582P86J627K145K588L315M097M334L995L835M494N750O836P286P356
$$ 540582 541368 542995 545140 547728 551043 555140 559474 563469 567304 571798 577548 584384 591670 599026
61259E99026P646Q371R025Q934Q050O856N559L917J970L17o99j544k749m117n134
$$ 599026 606672 615043 624068 633002 641052 647908 653467 657384 659354 659671 658972 657428 654679 650562 645428
61244F45428n759o238o448o090n318m657m326m072l651l136k787k827l127k994
$$ 645428 639669 633431 626983 620893 615575 610918 606592 602520 598869 595733 592946 590119 586992 583998
61230E83998j642P49K835L432K846K412K887L810M371M439M513M991N637N877
$$ 583998 582356 583105 585940 589372 592218 594630 597517 601327 605698 610137 614650 619641 625278 631155
61216F31155N556N243N497O107O445O353O080N509M328L025K677L434M179M162
$$ 631155 636711 641954 647451 653558 660003 666356 672436 677945 682273 685298 687975 691409 695588 699750
61202F99750L996M469N356O257P667J0129J2963J4953J5873J6297J6355J5736
$$ 699750 703746 708215 713571 719828 727495 737624 750587 765540 781413 797710 814065 829801
61190H29801J4601J3368J1772R203N903K869N96j143k423l082l526m505n970p085
$$ 829801 844402 857770 869542 878745 884648 887517 888113 886970 884547 881465 877939 873434 867464 860379
61176H60379p620q343r748j1238j1976j1892j1516j1361j1756j2685j3603j3858
$$ 860379 852759 844416 834668 823430 811454 799562 788046 776685 764929 752244 738641 724783
61164G24783j3516j3205j3124j2770j1833j0678r746r030q366p611o339m036r40
$$ 724783 711267 698062 684938 672168 660335 649657 639911 630881 622515 614904 608565 604529 603589
61151F03589J796L230L467L216K896K484J805O42j134l284n223o474o913o616
$$ 603589 605385 608615 612082 615298 618194 620678 622483 623125 621991 618707 613484 607010 600097 593481
61137E93481n793m806l827k553p19J215K542L387M584O407Q215R544J0749J2226
$$ 593481 587688 582882 579055 576502 575783 576998 579540 582927 587511 593918 602133 611677 622426 634652
61123F34652J3796J5224J6695J8259J9428J9941K0321K1101K1985K2437K2670
$$ 634652 648448 663672 680367 698626 718054 737995 758316 779417 801402 823839 846509
61112H46509K3257K4068K4330K3692K2474K0930J8940J6598J4424J2637J0661
$$ 846509 869766 893834 918164 941856 964330 985260 1004200 1020798 1035222 1047859 1058520
61101A058520P789M156O80j919l798n700q207j1259j4248j6397j7239j6913j6042
$$ 1058520 1066309 1070465 1071145 1069226 1065428 1059728 1051521 1040262 1026014 1009617 992378 975465 959423
61088I59423j5155j4352j3562j2896j2343j1321r182o258l777k429j562k15J649
$$ 959423 944268 929916 916354 903458 891115 879794 870612 864354 860577 858148 856586 856371 858020
61075H58020L456N055O658Q137R169R966J1053J2362J3229J3457J3707J4629J6056
$$ 858020 861476 866531 873189 881326 890495 900461 911514 923876 937105 950562 964269 978898 994954
61062I94954J7236J7601J7249J6863J7073J7734J8054J7719J7320J7309J7125
$$ 994954 1012190 1029791 1047040 1063903 1080976 1098710 1116764 1134483 1151803 1169112 1186237
61051A186237J6131J4881J4377J4447J4059J3133J2752J3370J4038J3843J3115
$$ 1186237 1202368 1217249 1231626 1246073 1260132 1273265 1286017 1299387 1313425 1327268 1340383
61040A340383J2647J2536J2360J1949J1450J1116J1324J2278J3559J4494J5134
$$ 1340383 1353030 1365566 1377926 1389875 1401325 1412441 1423765 1436043 1449602 1464096 1479230
61029A479230J6210J7974J9922K1839K4244K7348L0401L2601L4109L5786L8542
$$ 1479230 1495440 1513414 1533336 1555175 1579419 1606767 1637168 1669769 1703878 1739664 1778206
61018A778206M3182N0155N9082O9078P9846R1844J05516J21430J41190J66968
$$ 1778206 1821388 1871543 1930625 1999703 2079549 2171393 2276909 2398339 2539529 2706497
61008B706497K00054K41515K94606L64477M54245N62747O86956Q24618R73602
$$ 2706497 2906551 3148066 3442672 3807149 4261394 4824141 5511097 6335715 7309317
60999G309317J131509J297616J470387J636702J764854J815984J766007J613252
$$ 7309317 8440826 9738442 11208829 12845531 14610385 16426369 18192376 19805628
60991A9805628J365858J034067O46795K70496r163j41693j50610j14690j12381
$$ 19805628 21171486 22205553 22852348 23122844 23113681 22971988 22821378 22706688 22594307
60982B2594307j86815l53624o18078r66414j345506j670797j868554j913774j830547
$$ 22594307 22407492 22053868 21435790 20469376 19123870 17453073 15584519 13670745 11840198
60973A1840198j664308j457562j242347j040285q62262p10327n82987m78551l94364
$$ 11840198 10175890 8718328 7475981 6435696 5573434 4863107 4280120 3801569 3407205
60964C407205l26303k70958k26848j92594j65598j43464j25306j10613r8151q6957
$$ 3407205 3080902 2809944 2583096 2390502 2224904 2081440 1956134 1845521 1747370 1660413
60954A660413p7231o9121o1702n4156m7048m1414l7362l4529l3064l3013l3472
$$ 1660413 1583182 1514061 1452359 1398203 1351155 1309741 1272379 1237850 1204786 1171773 1138301
60943A138301l3441l3031l2777l2301l0872k8846k7317k6480k5516k4050k2572
$$ 1138301 1104860 1071829 1039052 1006751 975879 947033 919716 893236 867720 843670 821098
60932H21098k1333j9857j7860j5824j4251j3047j1962j1012j0172r132p766o449
$$ 821098 799765 779908 762048 746224 731973 718926 706964 695952 685780 676648 668882 662433
60920F62433n588n160m909m748m678m639m601m561m359l719k608j302k0J149J917
$$ 662433 656845 651685 646776 642028 637350 632711 628110 623549 619190 615471 612863 611561 611541 612690 614607
60905F14607J849J019J36l09o55j411k343k792k716k817l618m933o289p402q116
$$ 614607 616456 617475 617611 617302 616647 615236 612893 610101 607385 604568 600950 596017 589728 582326 574210
60890E74210q293q077p854p728p361o606n924n790n920n572m561l531l249l904
$$ 574210 565917 557840 549986 542258 534897 528291 522367 516577 510657 505085 500524 496993 493744 489840
60876D89840n030n820n619m465l175k495k248j685o96K5R6J36Q65K035K819K960
$$ 489840 484810 478990 473371 468906 465731 463236 460988 459303 458607 458632 458728 458864 459729 461764 464583 467543
60860D67543L006L471M262M951N202M914M208L409K801K349J850J331J094J300
$$ 467543 470549 474020 478282 483233 488435 493349 497557 500966 503767 506116 507966 509297 510391 511691
60846E11691J714J936J787J345P08j94j468k952m146m669m766n055n719o238o120
$$ 511691 513405 515341 517128 518473 519181 518987 517519 514567 510421 505752 500986 495931 490212 483974 477854
60831D77854n606n344n553n847n827n454m881m214l519k845k205j680j544k003
$$ 477854 472248 466904 461351 455504 449677 444223 439342 435128 431609 428764 426559 424879 423335 421332
60817D21332k827l447l549l348l211l162k997k782k859l300l570l090k077j438
$$ 421332 418505 415058 411509 408161 404950 401788 398791 396009 393150 389850 386280 383190 381113 379675
60803C79675j705k366k529j960j110l21M36J129J432J145M65k27n60k59N52J171
$$ 379675 377970 375604 373075 371115 370005 369684 370120 371249 372681 373826 374291 374064 373504 373245 373797 374968
60787C74968J054O84J063K174K832K357J572J526K019K160J738J184N91k67j110
$$ 374968 376022 376706 377769 379943 382775 385132 386704 388230 390249 392409 394147 395331 395922 395655 394545
60772C94545j346r95o85p28q63q86p94m08M00J110R46rq21r35o96n27l84k86n71
$$ 394545 393199 392204 391519 390791 389928 389042 388248 387840 388240 389350 390296 390287 389466 388531 387835 387308 386924 386638 386067
60753C86067j256j755j691j412j269r76j75Q34J457J576J447J145N82j87j111
$$ 386067 384811 383056 381365 379953 378684 377708 377533 378367 379824 381400 382847 383992 384574 384387 383276
60738C83276k315l662m474m217l377l068l720m590m628l512j832n22r2k01L8J081
$$ 383276 380961 377299 372825 368608 365231 362163 358443 353853 349225 345713 343881 343359 343267 343066 343104 344185
60722C44185K334K672J672J61n10K98J923L007K771J736J057J197J557J475J151
$$ 344185 346519 349191 350863 351024 350514 350812 352735 355742 358513 360249 361306 362503 364060 365535 366686
60707C66686J226J741K045J685R73N53O94J112J318R70L7j167k109k241j371J6
$$ 366686 367912 369653 371698 373383 374356 374909 375603 376715 378033 379003 379040 377873 375764 373523 372152 372168
60691C72168Q82M52r56k075j936q04K85P36Q41J062J349J371J201J332J959K546
$$ 372168 373050 373502 372546 370471 368535 367731 368016 368752 369593 370655 372004 373375 374576 375908 377867 380413
60675C80413K361J391M48L28J036J913K316K003J116M1q50j518k239l030l415
$$ 380413 382774 384165 384613 384941 385977 387890 390206 392209 393325 393366 392516 390998 388759 385729 382314
60660C82314l026k290j978k246k525k372j803q79L73J535K016J969K322L381M143
$$ 382314 379288 376998 375020 372774 370249 367877 366074 365195 365568 367103 369119 371088 373410 376791 380934
60645C80934L621K247J193O75n9j251k148k249k088k429l150l490k956j723l50
$$ 380934 384555 386802 387995 388670 388611 387360 385212 382963 380875 378446 375296 371806 368850 367127 366777
60630C66777N60P14L92J47J05p8m58m55K76J151J338R54Q42J244J434Q54J1j96
$$ 366777 367337 368051 368443 368590 368695 368617 368159 367704 367980 369131 370469 371423 372265 373509 374943 375797 375808 375612
60612C75612L62R57R19K03p23j286j142m27L59Q44J061J082P03j49r11r24l95
$$ 375612 375974 376931 377850 378053 377330 376044 374902 374475 374834 375678 376739 377821 378524 378375 377464 376540 376145
60595C76145j63l89k19Q85K147K487K082K082K868L523L182K190J426J044N65
$$ 376145 375982 375593 375374 376259 378406 380893 382975 385057 387925 391448 394630 396820 398246 399290 399855
60580C99855n5j21Q30K217K923K500J652J469K368L838N152O102O948P904Q904
$$ 399855 399800 399679 400509 402726 405649 408149 409801 411270 413638 417476 422628 428730 435678 443582 452486
60565D52486R833J0716J1469J1747J1291J0289R120P681N444K397m25j915k287
$$ 452486 462319 473035 484504 496251 507542 517831 526951 534632 540076 542473 542048 540133 537846
60552E37846k938m633o414o723n289l258j633l32J147K823M398N922P779J0159
$$ 537846 534908 530275 523861 517138 511849 508591 506958 506626 507773 510596 514994 520916 528695 538854
60538E38854J2841J5401J7482J9034K0399K1916K3358K4072K3748K2605K0617
$$ 538854 551695 567096 584578 603612 624011 645927 669285 693357 717105 739710 760327
60527G60327J7118J1755N415m03m943q462j1319j3454j4656j4815j3914j2207
$$ 760327 777445 789200 794615 794212 789269 780807 769488 756034 741378 726563 712649 700442
60515G00442j0441r318q731p912o415m517k690j096L85K004M136O934R993J2843
$$ 700442 690001 680683 671952 664040 657625 653108 650418 649322 649707 651711 655847 662781 672774 685617
60501F85617J5753J9454K4003K8644L2936L7321M2126M6728N0236N2483N3695
$$ 685617 701370 720824 744827 773471 806407 843728 885854 932582 982818 1035301 1088996
60490A088996N3606N1681M8015M3225L7457L0274K1698J2662M000m611j4179k4890
$$ 1088996 1142602 1194283 1242298 1285523 1322980 1353254 1374952 1387614 1391614 1387003 1372824 1347934
60478A347934l5557m4646n1607n6883o0808o2893o2501n9892n6166n2114m7597
$$ 1347934 1312377 1267731 1216124 1159241 1098433 1035540 973039 913147 856981 804867 757270
60467G57270m2222l6292l0782k6457k3308k0800j8390j5887j3489j1646j0639
$$ 757270 715048 678756 647974 621517 598209 577409 559019 543132 529643 517997 507358
60456E07358j0170r433p851n763m194l752l997m109l990m135m533m355l146j673
$$ 507358 497188 487755 479904 474141 469947 466195 462198 458089 454099 449964 445431 441076 437930 436257
60442D36257j043j353j801j915j887j842j587j176j045j267j292p84k21k89r36
$$ 436257 435214 433861 432060 430145 428258 426416 424829 423653 422608 421341 420049 419265 419044 418755 417819
60427D17819j476j445j032p09o38n09L6Q82J504J636J602J688J625J178R09J501
$$ 417819 416343 414898 413866 413157 412519 412010 412046 412928 414432 416068 417670 419358 420983 422161 423070 424571
60411D24571K483K538J272j88o43j01P23J443J946K011J591J069P09L05j51q3
$$ 424571 427054 429592 430864 430676 430033 429932 430655 432098 434044 436055 437646 438715 439424 439729 439578 439495
60395D39495P48J509J325O90Q50J981K942K924K445K432K987L502L541L204K829
$$ 439495 440243 441752 443077 443767 444617 446598 449540 452464 454909 457341 460328 463830 467371 470575 473404
60380D73404K641K574K350J835J315J187J454J772K019K452L189L820L797L070
$$ 473404 476045 478619 480969 482804 484119 485306 486760 488532 490551 493003 496192 500012 503809 506879
60366E06879K158J571J346J122O90L06M62J345K651L896M782N327N797O513P491
$$ 506879 509037 510608 511954 513076 513766 514072 514534 515879 518530 522426 527208 532535 538332 544845 552336
60351E52336Q321Q595Q415Q210P999P253N504K843k05k967m836n735o320p172
$$ 552336 560657 569252 577667 585877 593876 601129 606633 609476 609271 606304 601468 595733 589413 582241
60337E82241p815p326n967n194n614o005n165l738l182l558l724l240k832k933
$$ 582241 574426 567100 561133 555939 550325 544320 539155 535417 532235 528677 524953 521713 518881 515948
60323E15948l104l055l087l164k562r86P97J979K752L750N062O398P762R305J0767
$$ 515948 512844 509789 506702 503538 500976 499990 500787 502766 505518 509268 514330 520728 528490 537795 548562
60308E48562J1713J2205J2684J3216J3374J2913J2145J1449J0721R605Q081O454
$$ 548562 560275 572480 585164 598380 611754 624667 636812 648261 658982 668587 676668 683122
60296F83122M708K231j463n840r705j2447j4452j6055j6769j6102j4672j3607
$$ 683122 687830 690061 688598 682758 673053 660606 646154 630099 613330 597228 582556 568949
60284E68949j3069j2214j0620q876p459n986m143k628k373l147l751l460k721
$$ 568949 555880 543666 533046 524170 516711 510725 506582 503954 501581 498434 494683 491223 488502
60271D88502k267k214k133j690r71l60k54p26j407j805j793j600j333q10l4N14
$$ 488502 486235 484021 481888 480198 479227 478867 478613 477887 476480 474675 472882 471282 469949 469139 469105 469619
60255D69619M42J97O79K034L248L257K166R85L83J86ok99o69j150j609j736j485
$$ 469619 470061 470258 470937 472971 476219 479476 481642 482627 483010 483196 483190 482891 482222 481072 479463 477727 476242
60238D76242j243j256j263r13k61M35J070J569J726J596J711K450L386L767L454
$$ 476242 474999 473743 472480 471567 471306 471741 472811 474380 476106 477702 479413 481863 485249 489016 492470
60223D92470K994K815K834K795K640K524K741L514M625N414N474N133M937M999
$$ 492470 495464 498279 501113 503908 506548 509072 511813 515327 519952 525366 530840 535973 540910 545909
60209E45909N240N812O730P411P287O714O470O583O426N804N046M105K667J182
$$ 545909 551149 556961 563691 571102 578389 585103 591573 598156 604582 610386 615432 619537 622204 623386
60195F23386O19Q82O35p68k290k818k758l076l674l819l617l775m293m502m332
$$ 623386 624005 624887 625522 624754 622464 619646 616888 613812 610138 606319 602702 598927 594634 590132 585800
60180E85800m373m692m600l825k946k377j798r34j88J9o0J2J27p8n24q49r96j212
$$ 585800 581427 576735 572135 568310 565364 562987 561189 560255 560067 560086 560026 560038 560165 560087 559563 558714 557718 556506
60162E56506j542j702j393n02Q43K147K686K175J173M86K45ol73l28M84J595K212
$$ 556506 554964 553262 551869 551367 552210 554357 557043 559218 560391 560877 561122 561116 560743 560415 560899 562494 564706
60145E64706K107J698J427J405J640K173K878L372L390L167L275M048N234O260
$$ 564706 566813 568511 569938 571343 572983 575156 578034 581406 584796 587963 591238 595286 600520 606780
60131F06780O677O349N382M121L080K564K279J592L80o78r25n69k98k22J63J009
$$ 606780 613457 619806 625188 629309 632389 634953 637232 638824 639204 638526 637601 637032 636734 636512 636675 637684
60115F37684J773K011J870J510O69o45j659j709j191r77j227j550j986k825l651
$$ 637684 639457 641468 643338 644848 645517 644872 643213 641504 640313 639336 638109 636559 634573 631748 628097
60100F28097l623k838k320k431k379j687j085j268j737j676j215r02n38L58J409
$$ 628097 624474 621636 619316 616885 614506 612819 611734 610466 608729 607053 605838 604936 604398 604756 606165
60085F06165J782J458J117Q83K51p45j373j383j356j678j990k106k587l872n408
$$ 606165 607947 609405 610522 611405 611656 610911 609538 608155 606799 605121 603131 601025 598438 594566 589158
60070E89158o324o507o484o491o301n820n355n199n304n371n105m387l372k477
$$ 589158 582834 576327 569843 563352 557051 551231 545876 540677 535373 530002 524897 520510 517138 514661
60056E14661k058k045k001j637j162r32q05j44J269K682L208L069L312M211M747
$$ 514661 512603 510558 508557 506920 505758 504826 504021 503877 505146 507828 511036 514105 517417 521628 526375
60041E26375M081K780J959J830J840J781J821J719R62l03j387k095k794l439l482
$$ 526375 530456 533236 535195 537025 538865 540646 542467 544186 545148 544845 543458 541363 538569 535130 531648
60026E31648k980k872l710m900n672o126o723p365p658p641p593p413o786n803
$$ 531648 528668 525796 522086 517186 511514 505388 498665 491300 483642 476001 468408 460995 454209 448406
60012D48406m883m120l267k239j280n70kN48R90J120Q29K55k59m35l58l94p09
$$ 448406 443523 439403 436136 433897 432617 432047 432045 432593 433583 434703 435532 435787 435528 435093 434735 434341 433632
59995D33632r63o41M15J784K766K901K384J913J960K279K340K064J816J723J494
$$ 433632 432669 432028 432443 434227 436993 439894 442278 444191 446151 448430 450770 452834 454650 456373 457867
59980D57867R62L36k55r84j869k435k230j491r54j094j660j920j285J22J473K031
$$ 457867 458829 459165 458910 457926 456057 453622 451392 449901 448947 447853 446193 444273 442988 443110 444583 446614
59964D46614J954K017K551L041K969K576K483K787K988K692J992J128J48r51j904
$$ 446614 448568 450585 453136 456177 459146 461722 464205 466992 469980 472672 474664 475792 475940 474989 473085
59949D73085k354k322k272k472k513j836o58R7r8q08j396j738j904j706j158q59
$$ 473085 470731 468409 466137 463665 461152 459316 458658 458755 458657 457849 456453 454715 452811 451105 449947 449088
59933D49088j157j343m65J315L013M229N260N976N730M584L575L330L296K726
$$ 449088 447931 446588 446123 447438 450451 454680 459940 465916 471646 476230 479805 483135 486431 489157
59919D89157J714P54j3n94p73m39J58Q15J582K285K466K148K045K544L072K938
$$ 489157 490871 491625 491612 491018 490245 489806 489964 490779 492361 494646 497112 499260 501305 503849 506921 509859
59903E09859K247J521R72N99N57Q06Q72M61m3k03j29l0L45J227K253L035L814
$$ 509859 512106 513627 514599 515198 515755 516561 517433 517894 517851 517648 517519 517489 517834 519061 521314 524349 528163
59886E28163M881N755N813N428N661O843Q133Q489P622O111M999N066N945O214
$$ 528163 533044 538799 544612 550040 555701 562544 570677 579166 586788 592899 597898 602964 608909 615123
59872F15123M923K806J329Q39M99k20r23j295j695k362k810k586k076j989k336
$$ 615123 620046 622852 624181 625020 625519 625299 624376 623081 621386 619024 616214 613628 611552 609563 607227
59857F07227k483k071j443j043q15l99K26O63P73J145K533M776O697P281O647
$$ 607227 604744 602673 601230 600187 599372 598973 599199 599862 600635 601780 604313 609089 615786 623067 629714
59842F29714N602M498L020J058o79j204l01J196K194K330K064J824J412L90j191
$$ 629714 635316 639814 642834 643892 643213 642009 641708 642904 645098 647428 649492 651316 652728 653118 651927
59827F51927k767l830m238m149l986m269n023n593n491n209n463n924n564m269
$$ 651927 649160 645330 641092 636943 632957 628688 623665 618072 612581 607372 601909 595985 590421 586152
59813E86152l080k658k572k432k703l722m806n092m657m072l435k636k062k248
$$ 586152 583072 580414 577842 575410 572707 568985 564179 559087 554430 550358 546923 544287 542225 539977
59799E39977l024l678l741l231k394j678j572k046k504k621k716k981k962k327
$$ 539977 536953 533275 529534 526303 523909 522231 520659 518613 516109 513488 510772 507791 504829 502502
59785E02502j486r07m22J63M66K59J26N76J126J167J176J967L219L831L518L024
$$ 502502 501016 500109 499687 499850 500316 500575 500701 501277 502403 503570 504746 506713 509932 513763 517281 520305
59769E20305K910L093L417L823M014L818L724M271N094N428N304N293N326M785
$$ 520305 523215 526308 529725 533548 537562 541380 545104 549375 554469 559897 565201 570494 575820 580605
59755E80605L734L002L012L419L914M480M894M893M889N536O499O640N610M285
$$ 580605 584339 587341 590353 593772 597686 602166 607060 611953 616842 622378 628877 635517 641127 645412
59741F45412L405K736J922J307J392K029K610K589J745L52p47q48k04L34M42M91
$$ 645412 648817 651553 653475 654782 656174 658203 660813 663402 665147 665499 664752 663904 663700 664034 664476 664967
59725F64967O53O51M35L47M97O45P73J048J191O58m17j235j433j420j471j317
$$ 664967 665620 666271 666706 667053 667550 668195 668968 670016 671207 671865 671448 670213 668780 667360 665889 664572
59709F64572q61n58p80j397k077k434j915m29J002J144J96m60k51k1m24q91p96
$$ 664572 663711 663153 662373 660976 658899 656465 654550 654121 655123 656267 656463 656003 655752 655731 655307 654416 653620
59692F53620m75m65o02n95p36j283j841k017k086k407k796l012l240l562l568
$$ 653620 653145 652680 652078 651483 650747 649464 647623 645606 643520 641113 638317 635305 632065 628503 624935
59677F24935l239l415m651o154o724o294n799n735n722n312m547l731l168l054
$$ 624935 621696 618281 613630 607476 600752 594458 588659 582924 577202 571890 567343 563612 560444 557390
59663E57390l217l096k286j027J28R14J354J433J153P51O29J092K104L142L388
$$ 557390 554173 551077 548791 547764 547892 548806 550160 551593 552746 553497 554126 555218 557322 560464 563852
59648E63852K574J474J014Q88j41k427m800n996n947n320m568l996l920m100l609
$$ 563852 566426 567900 568914 569802 569661 567234 562434 556438 550491 545171 540603 536607 532687 528587 524978
59633E24978j963N1J236J263N68m76j611k314k183j592j421k116l272m012l668
$$ 524978 523015 523066 524302 525565 526133 525657 524046 521732 519549 517957 516536 514420 511148 507136 503468
59618E03468k388j197j060j801k469k705k932l082k312m71J159J514J199J362
$$ 503468 501080 499883 498823 497022 494553 491848 488916 485834 483522 483051 484210 485724 486923 488285
59604D88285J877J824J234J027J460J810J681J545J753J937J725J448J623K161
$$ 488285 490162 491986 493220 494247 495707 497517 499198 500743 502496 504433 506158 507606 509229 511390
59590E11390K479K189J483Q95P43Q47Q15N40K20p8n21j115j597j831j954j988
$$ 511390 513869 516058 517541 518436 519179 520026 520841 521381 521601 521523 521002 519887 518290 516459 514505 512517
59574E12517j803j548j637k077k313j975j283m85M16J214J380P94Mn78j090j530
$$ 512517 510714 509166 507529 505452 503139 501164 499881 499396 499812 501026 502406 503200 503204 502626 501536 500006
59558E00006j459q58n09q89j357j079q3J125K289L123L089K288J867K691M235
$$ 500006 498547 497689 497180 496291 494934 493855 493772 494897 497186 500309 503398 505686 507553 510244 514479
59543E14479N572O757Q310R995J1319J2581J4278J5786J5920J4499J2226R238
$$ 514479 520051 526808 535118 545113 556432 569013 583291 599077 614997 629496 641722 650960
59531F50960N088J55m130o702p583p142n634l615j909q18o6M32L36m59j639k969
$$ 650960 656048 656203 652073 645371 637788 630646 625012 621397 619488 618670 618604 619036 619372 618913 617274 614305
59515F14305m383n585o229o395o398o240n924n983o775p530p120n716m608m393
$$ 614305 609922 604337 598108 591713 585315 579075 573151 567168 560393 552863 545743 540027 535419 531026
59501E31026m389l996l452l017k422j611j072j004r63o94n73p33o39n0L79J35
$$ 531026 526637 522641 519189 516172 513750 512139 511067 510063 509100 508406 507833 507100 506461 506411 506790 506925
59485E06925j70M12J848L224L895L930L651L308L132L300L798M470N090N354N061
$$ 506925 506755 507167 509015 512239 516134 520064 523715 527023 530155 533455 537253 541723 546813 552167 557228
59470E57228M351L548K748J913J282J194J443J387Q69N27R66K052L256M254M977
$$ 557228 561579 565127 567875 569788 571070 572264 573707 575094 575963 576490 577456 579508 582764 587018 591995
59455E91995N480N996O733P400P310O248M801L615K722J875J091L98n59k126l984
$$ 591995 597475 603471 610204 617604 624914 631162 635963 639578 642300 644175 645266 645664 645105 642979 638995
59440F38995n304n608n147m499m024l748l501l110k510j753q75J83J499L040M565
$$ 638995 633691 628083 622936 618437 614413 610665 607164 604054 601544 599791 598916 599099 600598 603638 608203
59425F08203N814O781P839R330J1166J2986J4708J6529J8294J9427J9795K0180
$$ 608203 614017 620798 628637 637967 649133 662119 676827 693356 711650 731077 750872 771052
59413G71052K1290K2570K2584K0465J6569J1747O502R98m448r037j1695j1723
$$ 771052 792342 814912 837496 857961 874530 886277 892779 893777 889329 880292 868597 856874
59401H56874r363n575j355K400M494L814N27l862q130j2333j6631j9995k1152
$$ 856874 847511 841936 840581 842981 847475 851289 851816 847954 839824 827491 810860 790865 769713
59388G69713k0217j8330j6115j3650j1570j0648j0351r121o549m032k914k896
$$ 769713 749496 731166 715051 701401 689831 679183 668832 659711 653162 649130 646216 643320
59376F43320k828k186j204k51L71N05M37P07J369J886J973K007K472L479M950
$$ 643320 640492 638306 637102 636851 637222 637727 638164 638871 640240 642126 644099 646106 648578 652057 657007
59361F57007O646P880P990P357P224Q157R454J0413J1382J2895J4499J5237J4947
$$ 657007 663653 671533 679523 686880 694104 702261 711715 722128 733510 746405 760904 776141 791088
59348G91088J4346J4007J3828J3419J2608J1463J0094Q454O362L851J382p25k886
$$ 791088 805434 819441 833269 846688 859296 870759 880853 889307 895669 899520 900902 900177 897291
59335H97291n748r043j1654j3017j3832j4978j6320j7078j6953j6326j5608j4884
$$ 897291 891543 882500 870846 857829 843997 829019 812699 795621 778668 762342 746734 731850
59323G31850j4160j3550j3191j3015j2625j1499r539p405o005n658n917o146n906
$$ 731850 717690 704140 690949 677934 665309 653810 644271 636866 630861 625203 619286 613140 607234
59310F07234n038l776k683k006j245J40J870L339M754O893R739J2213J3427J3367
$$ 607234 602196 598420 595737 593731 592486 592626 594496 597835 602589 609482 619221 631434 644861 658228
59296F58228J2306J0338P738M801J240l368q208j1418j2182j1663j1244j0688
$$ 658228 670534 680872 688610 693411 694651 691283 683075 671657 659475 647812 636568 625880
59284F25880q952o026l020q12O57J906L429N387P362Q690R344J0091J1384J2688
$$ 625880 616928 610902 607882 607070 607727 609633 613062 618449 625811 634501 643845 653936 665320 678008
59270F78008J3341J3512J3700J3773J3216J1888R999P635M994K692J219K73p69
$$ 678008 691349 704861 718561 732334 745550 757438 767437 775072 780066 782758 783977 784250 783481
59257G83481k032l258m391n509o388o771o798o637o001m608k920j714j066m09
$$ 783481 781449 778191 773800 768291 761903 755132 748334 741697 735696 731088 728168 726454 725388 724979
59243G24979N10J337J817K154K531K729K439J621M95o44j584k377l318m576n897
$$ 724979 725489 726826 728643 730797 733328 736057 738496 740117 740612 739968 738384 736007 732689 728113 722216
59228G22216o937p704q474r311r930j0034r618q960q307p620o678n572m870m870
$$ 722216 715279 707575 699101 689790 679860 669826 660208 651248 642941 635321 628643 623071 618201 613331
59214F13331m953m206k715j551j341j568j549j381j424j476j088l57K31N07P52
$$ 613331 608378 604172 601457 599906 598565 596997 595448 594067 592643 591167 590079 589722 589953 590460 591212
59199E91212J168J656K004K067J930J955K361K690K187Q71l07n81j52M88J224
$$ 591212 592380 594036 596040 598107 600037 601992 604353 607043 609230 610101 609794 609213 609061 609549 610773
59184F10773J955K216J783J131P11K78m65j017o62M92J716K616L166L146K365
$$ 610773 612728 614944 616727 617858 618569 618847 618382 617365 616703 617195 618911 621527 624693 627839 630204
59169F30204J343R34J292J818K125K358K553K353J543L68q72k139l346m181m473
$$ 630204 631547 632481 633773 635591 637716 640074 642627 644980 646523 646891 646019 643880 640534 636353 631880
59154F31880m531m839n467n996o066n909o100o730p066o445n265m590m772n114
$$ 631880 627349 622510 617043 611047 604981 599072 592972 586242 579176 572731 567466 562876 558104 552990
59140E52990n007m713m726m979n111m997m584l649k162n16R40K232L305L795L673
$$ 552990 547983 543270 538544 533565 528454 523457 518873 515224 513062 512546 513486 515718 519023 522818 526491
59125E26491L595M111M956N638O211O942P701Q290Q965R993J1017J1523J1609
$$ 526491 530086 534197 539153 544791 551002 557944 565645 573935 582900 592893 603910 615433 627042
59112F27042J1698J1799J1679J1398J1054J0265Q687O789N370M469L508K349J388
$$ 627042 638740 650539 662218 673616 684670 694935 703622 710411 715781 720250 723758 726107 727495
59099G27495O67l25j737k987l547l610l626l589l143k229j363j157j665k351k799
$$ 727495 728162 727837 726100 723113 719566 715956 712330 708741 705598 703369 702006 700849 699184 696833 694034
59084F94034l211l854m330m047l392l530m840o360p151p353p362o905n709m397
$$ 694034 690823 686969 682639 678592 675200 671670 666830 660470 653319 645966 638604 631699 625990 621593
59070F21593l773l721l675l629l847l991l543k823k622k984l196k900k456k304
$$ 621593 617820 614099 610424 606795 602948 598957 595414 592591 589969 586985 583789 580889 578433 576129
59056E76129k640l436m159l774j908K63J183P45J26k2j69p32j342j557j474j378
$$ 576129 573489 570053 565894 562120 560212 560475 561658 562403 562529 562507 562338 561606 560264 558707 557233 555855
59040E55855j351j358j245o84L88J376J649J418J369J677K113K879M402O396Q031
$$ 555855 554504 553146 551901 551217 551605 552981 554630 556048 557417 559094 561207 564086 568488 574884 582915
59025E82915R087J0068J1131J1833J2001J1981J1814J1041R562P823N986L739
$$ 582915 592002 602070 613201 625034 637035 649016 660830 671871 681433 689256 695242 698981
59013F98981J191q56j971k644l424m159m494m398l793k386m49R49J198J170K149
$$ 698981 700172 699316 697345 694701 691277 687118 682624 678226 674433 672047 671598 672547 673745 674915 677064
58998F77064M072N561N664M801L896L220K459J509O79J59k74q50j419j775k096
$$ 677064 681136 686697 692361 697162 701058 704278 706737 708246 708925 709084 708810 707960 706541 704766 702670
58983G02670k633l068k790j826r13m00K86J749L719N496O856Q040R256J0561J1917
$$ 702670 700037 696969 694179 692353 691440 691040 691326 693075 696794 702290 709146 717186 726442 737003 748920
58968G48920J3038J3511J3361J3039J2661J1881J0753R854R153P747N336K980
$$ 748920 761958 775469 788830 801869 814530 826411 837164 847018 856171 863918 869254 872234
58956H72234J497J39k150n026p526r746j2372j5086j6873j7510j7444j6651j5007
$$ 872234 873731 873870 871720 866694 859168 849422 837050 821964 805091 787581 770137 753486 738479
58943G38479j3333j2503j1792r758o607m056k903k409k071k256k708k382j309
$$ 738479 725146 712643 700851 691093 684486 680430 677527 675118 673047 670791 668083 665701 664392
58930F64392q96j662k234j494l15j32r32j734k086k095j772j257j052j295j431
$$ 664392 663496 661834 659600 658106 657791 657659 656727 654993 652907 650812 649040 647783 646731 645436 644005
58915F44005j192j092j386j363m44P99J555K023K941M418O044P628R138J0321
$$ 644005 642813 641721 640335 638972 638528 639327 640882 642905 645846 650264 656308 663936 673074 683395
58901F83395J1042J1718J2751J3908J4692J5039J5188J5249J5290J5501J5874
$$ 683395 694437 706155 718906 732814 747506 762545 777733 792982 808272 823773 839647
58890H39647J6101J6094J6279J7093J8503K0004K0618J9129J5211J0373O728M569
$$ 839647 855748 871842 888121 905214 923717 943721 964339 983468 998679 1009052 1015780 1020349
58878A020349K217j425n402q319j0208j1836j3225j3944j4174j4351j4208j3229
$$ 1020349 1022566 1021141 1015739 1007420 997212 985376 972151 958207 944033 929682 915474 902245
58866I02245j1642j0088q669p159n878n467n963o873p968r196j0058r946r156
$$ 902245 890603 880515 871846 864687 858809 853342 847379 840506 832538 823342 813284 803338 794182
58853G94182q774r289r998j0030r527r328r706r931r276q159p755q390q987q541
$$ 794182 785408 776119 766121 756091 746564 737236 727530 717599 708323 700164 692409 684019 675032 666491
58839F66491p587p361p917q135p477o558n845m948l669k657k315k021j114M3P93
$$ 666491 658904 651543 643626 635491 628014 621456 615611 610663 606994 604337 602022 600001 598887 598930 599723
58824E99723J279J987K713K953K937L393M331M853M288L029K069J991K455K623
$$ 599723 601002 602989 605702 608655 611592 614985 619316 624169 628457 631486 633555 635546 638001 640624
58810F40624K038J100N39N46P07N72q5j393l120m473m785m457m487n109n606n566
$$ 640624 642662 643762 644301 644847 645554 646126 646041 644648 641528 637055 632270 627813 623326 618217 612611 607045
58794F07045n372n331n132m536l842l360l022k756k511j858l48J529K701K986
$$ 607045 601673 596342 591210 586674 582832 579472 576450 573694 571183 569325 568977 570506 573207 576193
58780E76193L307M081M522L966K913K110J470O12k68p97j077j412j903k704m042
$$ 576193 579500 583581 588103 592069 594982 597092 598562 599174 598906 598109 597032 595620 593717 591013 586971
58765E86971n585o425o136n239m332l511k850k593k480j725j03J672K977L781
$$ 586971 581386 574961 568825 563586 559254 555743 552893 550300 547820 546095 545992 547664 550641 554422
58751E54422L989L325K238J801K259K774K946L332M017M194L813M102N542O800
$$ 554422 558411 561736 563974 565775 568034 570808 573754 577086 581103 585297 589110 593212 598754 605554
58737F05554O810O504P076P908P778P102P195Q050Q518Q257P939P746P116N917
$$ 605554 612364 618868 625944 633852 641630 648732 655927 663977 672495 680752 688691 696437 703553 709470
58723G09470M737M009L689L688L926M219M668N673P035P724P249O409N982N443
$$ 709470 714207 718216 721905 725593 729519 733738 738406 744079 751114 758838 766087 772496 778478 783921
58709G83921L948J721n69k966n694q312j0459j2696j5388j7581j8274j8094j8240
$$ 783921 787869 789590 789021 786055 780361 772049 761590 748894 733506 715925 697651 679557 661317
58696F61317j8477j7729j6158j4957j4356j3370j1549r511p751o172m929m515
$$ 661317 642840 625111 608953 593996 579640 566270 554721 545210 537459 531287 526358 521843
58684E21843m859n247n281n092m675l834k704j635o71K23Q02J065J689L150M914
$$ 521843 516984 511737 506456 501364 496689 492855 490151 488516 487845 488068 488870 489935 491624 494774 499688
58669D99688O277P445Q892J0232J0782J0774J0965J1410J1571J1117R817P251
$$ 499688 505965 513410 522302 532534 543316 554090 565055 576465 588036 599153 608970 616221
58657F16221L657L28j889l775o252q556r399r123r079r347q829p356n968n146
$$ 616221 619878 620206 618317 614542 608290 599734 590335 581212 572133 562786 553957 546601 540633 535487
58643E35487m343l265k261j401m64K80M45N46J274K065J794P37L06Q64J316R81
$$ 535487 531144 527879 525618 524217 523753 524033 524478 525024 526298 528363 530157 530894 531200 532064 533380 534361
58627E34361L82K3k52m38j55M54P39O25P15J233J899K744L920M864M793L995L432
$$ 534361 534743 534766 534514 534076 533921 534375 535114 535739 536454 537687 539586 542330 546250 551114 555907 559902 563334
58610E63334L211K683J958J812K086J650J89j201j556j079m95l24q29j742k174
$$ 563334 566545 569228 571186 572998 575084 576734 576923 575722 574166 573087 572592 572268 571439 569697 567523
58595E67523j744j387j928k376j194J218L086M008N205P016Q271Q536Q969J0217
$$ 567523 565779 564392 562464 560088 558894 560112 563198 567206 572411 579427 587698 596234 605203 615420
58581F15420J1202J0892R813Q937Q306P636P178P177P259P032O698O732P580R681
$$ 615420 626622 637514 647327 656264 664570 672206 679384 686561 693820 700852 707550 714282 721862 731543
58567G31543J2894J6010J7872J8964K0661K3036K4700K4915K4316K3350K1428
$$ 731543 744437 760447 778319 797283 817944 840980 865680 890595 914911 938261 959689
58556I59689J8117J3857R127M055p77m342o331p337p743p573p435q180r516j0352
$$ 959689 977806 991663 1000790 1004845 1004068 999726 993395 986058 978315 970742 963307 955127 945611 935259
58542I35259j0710j1750j3669j5233j5839j6398j7516j8346j8019j6947j5834
$$ 935259 924549 912799 899130 883897 868058 851660 834144 815798 797779 780832 764998
58531G64998j4552j2772j0802r121p793o797o076n094l325j331l25n07r21j071
$$ 764998 750446 737674 726872 717751 709958 703161 697085 691991 688666 687335 687010 686503 685582 684511
58517F84511j362j877k106k096k504l262l526l126k703k279j282j27j03j306k358
$$ 684511 683149 681272 679166 677070 674566 671304 667778 664652 661949 659670 658388 658261 658158 656852 654494
58502F54494k556k632k922k607j440m71l30l38l2M7k28Q1J364K679L439M328N787
$$ 654494 651938 649306 646384 643777 642337 641866 641536 641198 641166 641213 640985 641066 642430 645109 648548 652876 658663
58485F58663P014P417P651Q375R231R906J0886J2325J3356J3336J2621J1441R288
$$ 658663 665677 673094 680745 689120 698351 708257 719143 731468 744824 758160 770781 782222 791510
58472G91510O052K563o33l781o718q515q948q904q891q374p082n443l401m36K815
$$ 791510 797562 800125 799492 795711 788993 780478 771530 762626 753735 745361 738279 732836 729435 728999 731814
58457G31814M827N525O467Q094Q915Q181P193O843O000L675Q57j222k896m732
$$ 731814 736641 742166 748633 756727 765642 773823 781016 787859 793859 797534 798391 797169 794273 789541
58443G89541n997o034n696n885n930m779k716p32P43J506J242M52M61J611K806
$$ 789541 783544 777510 771814 765929 759999 755220 752504 751772 752515 754021 755263 755715 756176 757787 760593
58428G60593L434M113M905M755L709L587N167O631O223M596L093J487q52l207
$$ 760593 764027 768140 773045 777800 781509 785096 790263 796894 803117 807713 810806 812293 811441 808234
58414H08234m659n670o952p974q061p756p759p671o931n847m712l254j776j278
$$ 808234 803575 797905 790953 782979 774918 767162 759403 751732 744801 738954 734242 730988 729212 727934
58400G27934j528q53J234L094L610L661L933L514K172J619K840M216M086L138
$$ 727934 726406 725553 726787 729881 733491 737152 741085 744599 746771 748390 751230 755446 759532 762670
58386G62670K579K045J151J040K414L910M316M508N343N773N026M581N754P321
$$ 762670 765249 767294 768445 769485 771899 775809 780125 784633 789976 795749 800775 805356 811110 818431
58372H18431P708P616Q215Q739Q190P575Q024Q565Q115P810Q864J0026R723Q881
$$ 818431 826139 833755 841970 850709 858899 866474 874498 883063 891178 898988 907852 917878 927601 936482
58358I36482R000R210Q013O220N383M923L639K436K636L084J974K05qJ326K667
$$ 936482 945482 954692 962705 968925 974308 979231 982870 985306 987942 991026 993000 993205 993197 994523 997190
58343I97190L925N936Q073R245J0124J1788J3320J3358J2805J3279J4200J4096
$$ 997190 1001115 1007051 1015124 1024369 1034493 1046281 1059601 1072959 1085764 1099043 1113243 1127339
58331A127339J3486J3636J3733J2240R860Q336P457O006M421L785L415K179R34
$$ 1127339 1140825 1154461 1168194 1180434 1190294 1198630 1206087 1212093 1216514 1220299 1223714 1225893 1226827
58318A226827R84J583J684K483N221Q181R070Q840R875J1886J2969J3278J4193
$$ 1226827 1227811 1229394 1231078 1233561 1238782 1246963 1256033 1264873 1274748 1286634 1299603 1312881 1327074
58305A327074J5131J4625J3384J3090J3413J3313J3771J5882J7842J7429J5961
$$ 1327074 1342205 1356830 1370214 1383304 1396717 1410030 1423801 1439683 1457525 1474954 1490915
58294A490915J6201J7788J8346J7734J7594J8008J8102J8507J9939K0935K0378
$$ 1490915 1507116 1524904 1543250 1560984 1578578 1596586 1614688 1633195 1653134 1674069 1694447
58283A694447K0226K2255K4484K4541K4096K5677K7836K8087K8023L0425L3735
$$ 1694447 1714673 1736928 1761412 1785953 1810049 1835726 1863562 1891649 1919672 1950097 1983832
58272A983832L4821L4908L7189M0592M1892M2090M4629M8798N0997N1321N2801
$$ 1983832 2018653 2053561 2090750 2131342 2173234 2215324 2259953 2308751 2359748 2411069 2463870
58261B463870N5376N6550N6811N8454O0339N9846N8606N9988O2558O2572O1459
$$ 2463870 2519246 2575796 2632607 2691061 2751400 2811246 2869852 2929840 2992398 3054970 3116429
58250C116429O3777O9129P3239P5905Q0535Q6774R1168R4308R9888J07326J12906
$$ 3116429 3180206 3249335 3322574 3398479 3479014 3565788 3656956 3751264 3851152 3958478 4071384
58239D071384J17357J24639J34076J41575J47817J57098J68890J78940J87890
$$ 4071384 4188741 4313380 4447456 4589031 4736848 4893946 5062836 5241776 5429666
58230E429666K00191K15388K29282K42798K60509K81451L00932L20374L45369
$$ 5429666 5629857 5845245 6074527 6317325 6577834 6859285 7160217 7480591 7825960
58221G825960L75219M04857M35778M74080N19026N65214O14737O74927P45481
$$ 7825960 8201179 8606036 9041814 9515894 10034920 10600134 11214871 11889798 12635279
58212A2635279Q20925R04304J004689J122830J254359J405726J591173J815743
$$ 12635279 13456204 14360508 15365197 16488027 17742386 19148112 20739285 22555028
58204B2555028K078984K394491K787785L276308L871972M604763N526972O697601
$$ 22555028 24634012 27028503 29816288 33092596 36964568 41569331 47096303 53793904
58196E3793904Q178818J0030297J2267439J4824463J7591754K0490780K3485980
$$ 53793904 61972722 72003019 84270458 99094921 116686675 137177455 160663435
58189A60663435K6534368K9540350L2274916L4199914L4392379L1877582K6251404
$$ 160663435 187197803 216738153 249013069 283212983 317605362 349482944 375734348
58182C75734348J7986322Q080199k503619j2958459k2376930k9728628l4281581
$$ 375734348 393720670 401800869 399297250 386338791 363961861 334233233 299951652
58175B99951652l5975282l5310755l2963517k9559497k5668054k1777889j8201998
$$ 299951652 263976370 228665615 195702098 166142601 140474547 118696658 100494660
58168A00494660j5062791j2386963j0173332q382012o934155n758290m812444
$$ 100494660 85431869 73044906 62871574 54489562 47555407 41797117 36984673
58161C6984673m056851l441184k929854k511520k173820j892292j651046j450990
$$ 36984673 32927822 29486638 26556784 24045264 21871444 19979152 18328106 16877116
58153A6877116j289664j152494j030282r26718q42129p66422o93876o29578n75797
$$ 16877116 15587452 14434958 13404676 12477958 11635829 10869407 10175531 9545953 8970156
58144H970156n26034m77286m34826m00303l67568l34356l06198k84999k65243
$$ 8970156 8444122 7966836 7532010 7131707 6764139 6429783 6123585 5838586 5573343
58135E573343k45083k29975k21498k13219k01375j89742j80511j70155j57754
$$ 5573343 5328260 5098285 4876787 4663568 4462193 4272451 4091940 3921785 3764031
58126C764031j47857j41494j33505j22253j13086j08524j03706r5508q7902q4077
$$ 3764031 3616174 3474680 3341175 3218922 3105836 2997312 2893606 2798098 2710196 2626119
58116B626119q0900p5519p0514o8181o6036o1931n7917n5517n2715m8812m6735
$$ 2626119 2545219 2469700 2399186 2331005 2264969 2203038 2145121 2089604 2036889 1988077 1941342
58105A941342m7503m7735m5495m3308m2751m1506l8484l6543l7111l7185l4635
$$ 1941342 1893839 1846104 1800609 1757301 1714550 1673044 1634560 1598017 1560906 1523721 1489086
58094A489086l1671l0242k8696k5902k4061k4479k4754k3037k1143k0720k0264
$$ 1489086 1457415 1427173 1398477 1372575 1348514 1324035 1299281 1276244 1255101 1234381 1214117
58083A214117j8516j7094j7211j7417j6901j7456j9864k1791k1505k0457k0177
$$ 1214117 1195601 1178507 1161296 1143879 1126978 1109522 1089658 1067867 1046362 1025905 1005728
58072A005728j9834j8715j7812j7249j5492j2692j1302j1859j1752r797q229q455
$$ 1005728 985894 967179 949367 932118 916626 903934 892632 880773 869021 859224 850995 842540
58060H42540q702p850p609q792r191p629o436p441q858q726q134q494q658p474
$$ 842540 833838 825988 818379 809587 800396 792767 786331 778890 770032 761306 753172 744678 736020 728546
58046G28546o329o588p098o696o519p484q122p255o351o878p720p540p273p990
$$ 728546 722217 715629 708531 701835 695316 687832 679710 672455 666104 659226 651506 643966 636693 628703
58032F28703q576p875o927o936p104o625o590p749q538p552o011n580n721n244
$$ 628703 620127 612252 605325 598389 591285 584660 578070 570321 561783 554231 548220 542640 536919 531675
58018E31675m611m623m642m040l607l757l269j623m82j026j861j548j018j405
$$ 531675 527064 522441 517799 513759 510152 506395 503126 501503 501021 499995 498134 496586 495568 494163
58004D94163j610l37J326J688J142R39Q73M01L32J321K120J503M22J97J06j088
$$ 494163 492553 492216 493542 495230 496372 497311 498184 498585 498917 500238 502358 503861 504283 504480 504586 503498
57988E03498k697l346l329l672m157m236m595n784o648o111n191n194n300m137
$$ 503498 500801 497455 494126 490454 486297 482061 477466 471682 465034 458923 453732 448538 443238 439101
57974D39101k464j952k387k391j962k038k301j622j88Q12J114J269J209O19L0
$$ 439101 436637 434685 432298 429907 427945 425907 423606 421984 421796 422608 423722 424991 426200 426819 426849
57959D26849N5J37l83q31m01J31m78j885k855l172l272k924j897j099j326j688
$$ 426849 426904 427041 426658 425827 425426 425557 425079 423194 420339 417167 413895 410971 409074 407975 406649 404961
57943D04961r42M51J301J884L296N378P112Q404R730J0572J0121R063Q822R283
$$ 404961 404019 404470 405771 407655 410951 416329 423441 431845 441575 452147 462268 471331 480153 489436
57929D89436Q960P177M628J992n77k851m700o529q460r715r913j0115j1172j1964
$$ 489436 498396 505573 510201 512193 511616 508765 504065 497536 489076 479361 469448 459333 448161 436197
57915D36197j0960q709o972o024m760l070k069k027j957j313n73MP37J492J590
$$ 436197 425237 416528 409556 403532 398772 395702 393633 391606 389649 388336 387763 387767 388504 389996 391586
57900C91586R33J64l18n74n88m11n57j169j290jK003L182L126K723K728L256M288
$$ 391586 392519 392683 392365 391791 391203 390792 390235 389066 387776 387775 389778 392960 396086 398809 401537 404793 409081
57883D09081N464N792M718L137K267J972J366M77J8j04o13j461j941k000k204
$$ 409081 414545 420337 425055 428192 430459 432431 433797 434274 434292 434188 433575 432114 430173 428173 425969
57868D25969k584k691k566k518k301j569q41p66p99P8J673K844L178L154K954
$$ 425969 423385 420694 418128 415610 413309 411740 410899 410133 409334 409412 411085 413929 417107 420261 423215
57853D23215K459K149K606L270L017J869Q76L93j85j076j672j580r98j55O30O78
$$ 423215 425674 427823 430429 433699 436716 438585 439461 439854 439669 438593 436921 435341 434343 434188 434818 435496
57837D35496j70p84j66Q50P78K5M53K430M142M152L057K021J151R1r18j367j219
$$ 435496 435326 434542 434376 435226 436004 436029 436482 438912 443054 447206 450263 452284 453435 453526 452608 451241 450022
57820D50022q42o36q98j474j633r63k82q23k601m479n689o422p028p634q423r384
$$ 450022 449180 448544 447646 446172 444539 443576 443294 442471 439870 435391 429702 423280 416252 408618 400195 390811
57804C90811r873r388q543q235q142p227n521m150l575l177k580k104j745j016
$$ 390811 380938 371550 363007 354772 346630 339403 333882 329732 326157 322980 320400 318296 316551 315535
57790C15535n2L77J50N3M57R45J461K573M183N217N126M763N120O080O864P021
$$ 315535 315483 315860 316010 316063 316520 317465 318926 321499 325682 330899 336025 340788 345908 351988 358852 365873
57774C65873O477N416M488M381M803M561L061J061m22j306k135l154m156m879
$$ 365873 372350 377766 382254 386635 391438 395999 399060 400121 399699 398393 396258 393104 388948 384069
57760C84069n187n042m489l575k420j461j232j478j121L38J910K425K173K230
$$ 384069 378882 373840 369351 365776 363356 361895 360663 359185 358064 358402 360312 362737 364910 367140
57746C67140K658K558J663O25j64q62j334j191p68q98j635k170k121j865j595
$$ 367140 369798 372356 374019 374644 374480 373618 372284 371093 370325 369427 367792 365622 363501 361636 360041
57731C60041j079m48j93k99l01j77k69m10j90R6p4k29N26J818K327J776J106P29
$$ 360041 358962 358514 358321 358022 357721 357544 357275 356865 356675 356771 356697 356468 356994 358812 361139 362915 364021 364750
57713C64750J43m75j56J009J615J125O88J051J287M79p47j402j580j724j586r99
$$ 364750 364893 364418 364262 365271 366886 368011 368699 369750 371037 371516 370769 369367 367787 366063 364477 363478
57697C63478o62j146j908k160j919j506q98l68p17k021l104l081k571k518k706
$$ 363478 362816 361670 359762 357602 355683 354177 353279 352911 352194 350173 347069 343988 341417 338899 336193
57682C36193k372j428r8J804M272O610Q543J1086J5266K0605K5980L1259L7014
$$ 336193 333821 332393 332295 334099 338371 344981 353524 364610 379876 400481 426461 457720 494734
57669D94734M3170M9086N4415N8712O0477N7803M9867L7079K0249O33j9514l7623
$$ 494734 537904 586990 641405 700117 760594 818397 868264 905343 925592 926225 906711 869088
57657H69088n1948o1455o5150o2813n6244m8412m1124l4364k7883k2328j8387
$$ 869088 817140 755685 690535 627722 571478 523066 481942 447578 419695 397367 378980
57646C78980j5709j3334j0739q182o183m982m349l782k988k080j276o49l03m49
$$ 378980 363271 349937 339198 331016 324833 319851 315502 311720 308732 306652 305376 304727 304424 303975
57632C03975r69j239q01J2M99M46J88jj71m43p77j020j072j024j171j658k195
$$ 303975 303006 301767 300966 300978 301477 301923 302111 302110 301939 301496 300719 299699 298627 297603 296432 294774 292579
57615B92579k379k270k222k237j983j471j096r35p13n18q42j670k290k254j825
$$ 292579 290200 287930 285708 283471 281488 280017 278921 277986 277273 276755 275913 274243 271953 269699 267874
57600B67874j180j09J084J341J33j722l099l766m002l784l104k451k192j994j541
$$ 267874 266694 266585 267669 269010 269143 267421 264322 260556 256554 252770 249666 247215 245023 243029 241488
57585B41488j227j420j649j318p46o22q40p36k24J26l8n52j114j393j080l86j09
$$ 241488 240261 238841 237192 235874 235128 234506 233666 232930 232706 232832 232794 232242 231128 229735 228655 228269 228160
57568B28160p03j628k184k482k908l157k654j615q24n39l64o3J79J81n6m40o62
$$ 228160 227457 225829 223645 221163 218255 215098 212444 210829 210005 209466 209102 209039 209218 209399 209343 208903 208241
57551B08241l16M42Q57O63O10J300K157K366K121K073K116J812J456J539J602
$$ 208241 207925 208367 209224 209887 210497 211797 213954 216320 218441 220514 222630 224442 225898 227437 229039
57536B29039R23J6N6R15J221M99j61K0K81l71j602k251j782o35M10Q40O66M62
$$ 229039 229962 229978 230034 230949 232170 232669 232508 232528 232809 232438 230836 228585 226803 226168 226578 227418 228084 228546
57518B28546Q02J551K061K058J920K010K241K346K222J869J446J294J559J879
$$ 228546 229348 230899 232960 235018 236938 238948 241189 243535 245757 247626 249072 250366 251925 253804
57504B53804J860J650J587J505J056M27O5j55o36j141j044m86l42r21j555j672
$$ 253804 255664 257314 258901 260406 261462 261889 261954 261799 261163 260022 258978 258492 258150 257229 255674 254002
57488B54002j478j361j337j332j322j086m70L3l09j345k079j964j388p66j11L37
$$ 254002 252524 251163 249826 248494 247172 246086 245616 245649 245340 243995 241916 239952 238564 237798 237687 238024
57472B38024J27l89p7J302K425K144J026L70L87L45lk37k00j56j53lQ5l66j231
$$ 238024 238151 237762 237685 238987 241412 243556 244582 244952 245339 245684 245681 245444 245244 245088 244935 244932 245017 244651 243420
57453B43420j759j617j338j402j403n86J004K439K970K775K420J999J216J79m55
$$ 243420 241661 240044 238706 237304 235901 235315 236319 238758 241728 244503 246923 248922 250138 250317 249862
57438B49862l15J79M47M32L02o0o54q90k83N88O45j85q48o76j98j67m57l82L39
$$ 249862 249547 249726 250173 250605 250907 250847 250193 249303 249020 249608 250253 250068 249220 248544 248346 248179 247722 247340 247679
57419B47679J259J664J157J42l48L35J580K154J656P69J54j73k40J80R42J318
$$ 247679 248938 250602 251759 251901 251553 251888 253468 255622 257278 258047 258201 258028 257788 257968 258910 260228
57403B60228Q55p1q56j274j256p35q2K6m22n56J50J025J147N44r3l36j08O50J675
$$ 260228 261083 261012 260156 258882 257626 256891 256809 256835 256413 255857 256007 257032 258179 258723 258630 258294 258186 258836 260511
57384B60511K217J781P95J7l47m44k16L22O78N15L46P86J453J484R02N57P14O54
$$ 260511 262728 264509 265304 265321 264974 264530 264314 264636 265314 265829 266175 266961 268414 269898 270800 271357 272071 272725
57366B72725r4r34j005k13Q58J667J996J806J205N25J79L79R10J266J181R99J256
$$ 272725 272631 271697 270692 270479 271337 273004 275000 276806 278011 278536 278715 279094 280004 281270 282451 283450 284706
57349B84706J830J983J425Q30Q78J245J167N97K08L24N50M08r3n75o23p1P32J132
$$ 284706 286536 288519 289944 290774 291652 292897 294064 294661 294869 295193 295743 296151 296058 295483 294860 294789 295521 296653
57331B96653R32O33N97M20k93r44o14N30J328J150N12J16J8lK7J13J34Q1P1Q6
$$ 296653 297585 298218 298815 299235 298942 297998 297384 297914 299242 300392 300904 301020 301038 301035 301062 301175 301309 301390 301461 301547
57311C01547Q1K46O87R50N47r2j4R24J921K518L004L364K936J694P91J020J596
$$ 301547 301628 301874 302561 303511 304058 303966 303952 304876 306797 309315 312319 315683 318619 320313 321104 322124 323720
57294C23720J370N98L87R31J367J266J071J066Q22L3q77j242q35J61J331K008
$$ 323720 325090 325688 326075 327006 328373 329639 330710 331776 332598 332631 331754 330512 329677 329838 331169 333177
57278C33177J627M65l59N9J501K967L706L747L565L577L915M501N207N917O463
$$ 333177 334804 335269 334910 334969 336470 339437 343143 346890 350455 354032 357947 362448 367655 373572 380035
57263C80035O689O611O444O294N990N352M568M039L905L852L486K775K091J867
$$ 380035 386724 393335 399779 406073 412063 417415 421983 426022 429927 433779 437265 440040 442131 443998
57249D43998K180K659K885K862K899L121L301L328L469L987M745N392N809O093
$$ 443998 446178 448837 451722 454584 457483 460604 463905 467233 470702 474689 479434 484826 490635 496728
57235D96728O255O211N928N423M742M130L996M526N447O380P129P542P418O932
$$ 496728 502983 509194 515122 520545 525287 529417 533413 537939 543386 549766 556895 564437 571855 578787
57221E78787O791P435Q314Q450P667O784O644P333Q422R570J0691J1769J2590
$$ 578787 585578 593013 601327 609777 617444 624228 630872 638205 646627 656197 666888 678657 691247
57208F91247J2778J2174J1243J0786J1092J1731J2292J2949J3964J5149J6219
$$ 691247 704025 716199 727442 738228 749320 761051 773343 786292 800256 815405 831624
57197H31624J7288J8494J9593K0330K0870K1282K1156K0325J9544J9566K0001
$$ 831624 848912 867406 886999 907329 928199 949481 970637 990962 1010506 1030072 1050073
57186A050073J9920J9254J8651J8330J8052J8059J8851K0141K1078K1421K1449
$$ 1050073 1069993 1089247 1107898 1126228 1144280 1162339 1181190 1201331 1222409 1243830 1265279
57175A265279K0974J9688J8285J7893J8287J8196J7540J7723J9345K1224K2306
$$ 1265279 1286253 1305941 1324226 1342119 1360406 1378602 1396142 1413865 1433210 1454434 1476740
57164A476740K3054K4124K5121K5577K5854K6154K5845K4759K3979K4309K5052
$$ 1476740 1499794 1523918 1549039 1574616 1600470 1626624 1652469 1677228 1701207 1725516 1750568
57153A750568K5324K5434K5876K6112K5642K5174K5478K5976K5834K5501K5833
$$ 1750568 1775892 1801326 1827202 1853314 1878956 1904130 1929608 1955584 1981418 2006919 2032752
57142B032752K6481K6678K6819K7876K9795L1809L3757L5766L7372L8216L8998
$$ 2032752 2059233 2085911 2112730 2140606 2170401 2202210 2235967 2271733 2309105 2347321 2386319
57131B386319M0465M2167M3496M5118M7868N1069N3490N5276N7398O0011O2830
$$ 2386319 2426784 2468951 2512447 2557565 2605433 2656502 2709992 2765268 2822666 2882677 2945507
57120B945507O6335P0911P5635P9614Q3690Q9104R5464J01951J09400J19119J30657
$$ 2945507 3011842 3082753 3158388 3238002 3321692 3410796 3506260 3608211 3717611 3836730 3967387
57109C967387J43019J57094J74503J94980K17470K42989K74009L12048L58390
$$ 3967387 4110406 4267500 4442003 4636983 4854453 5097442 5371451 5683499 6041889
57100F041889M16001M88048N75884O81077Q07303R56935J127960J317632J525398
$$ 6041889 6457890 6945938 7521822 8202899 9010202 9967137 11095097 12412729 13938127
57091A3938127J746897J968788K176616K364959K532434K670897K769527K824486
$$ 13938127 15685024 17653812 19830428 22195387 24727821 27398718 30168245 32992731
57083C2992731K830487K769482K634945K473222K367307K347623K328118K159175
$$ 32992731 35823218 38592700 41227645 43700867 46068174 48415797 50743915 52903090
57075E2903090J748242J116709L50184m74253j304670k092348k785513l343868
$$ 52903090 54651332 55768041 56118225 55643972 54339302 52246954 49461441 46117573
57067D6117573l745272l980224m050971l975496l783424l505953l172496k812667
$$ 46117573 42372301 38392077 34341106 30365610 26582186 23076233 19903737 17091070
57059A7091070k453243k111967j798023j517546j274599j068135q93195p45783
$$ 17091070 14637827 12525860 10727837 9210291 7935692 6867557 5974362 5228579
57051E228579o23890n24525m43171l76244l21530k76549k38846k07494j82208
$$ 5228579 4604689 4080164 3636993 3260749 2939219 2662670 2423824 2216330 2034122
57042B034122j61512j43499j27609j13907j01627r0187q0348p2451o4845n5959
$$ 2034122 1872610 1729111 1601502 1487595 1385968 1295781 1215433 1142982 1078137 1022178
57032A022178m6599l8049k9427j9277q300K069J2412K3598L3226L7031L3422K3859
$$ 1022178 975579 937530 908103 888826 880526 882595 895007 918605 951831 988862 1022284 1046143
57020A046143R137j1394l6398o1089q0193r0952r3231q8768q0642p1668o2675
$$ 1046143 1055280 1043886 1007488 946399 866206 775254 682023 593255 512613 440945 378270
57009C78270n3373m4501l7412l1973k6820k1712j7745j5210j3097j0913r192p980
$$ 378270 324897 280396 242984 211011 184191 162479 144734 129524 116427 105514 96322 88342
56997H8342o546m972m306m758n181m758l749k293J0K928N369O935Q429J0385J2139
$$ 88342 81796 76824 72518 67760 62579 57821 54072 51779 51789 54717 60086 67021 75450 85835 97974
56982I7974J2819J2275J0648P988M580Q58l133p345j0902j2735j2995j2693j2008
$$ 97974 110793 123068 133716 141704 146284 147142 144009 136664 125762 113027 100032 87339 75331
56969G5331j0172p099l745o98K312N260P551R285J1475J4472J7310J9113K0131
$$ 75331 65159 58060 54315 53617 55929 61189 68740 78025 89500 103972 121282 140395 160526
56956A60526K0718K0350J8324J4675R848M025k611r392j5323j9512k1394k1003
$$ 160526 181244 201594 219918 234593 244441 248466 245855 236463 221140 201628 180234 159231
56944A59231j9039j6226j2745q676m550p57L083P245J0904J3188J4796J7278K0803
$$ 159231 140192 123966 111221 102545 97995 97238 100321 107566 118470 131658 146454 163732 184535
56931A84535K4015K5902K6379K5065K1038J4165N426m225j4035k2469k7654k9327
$$ 184535 208550 234452 260831 285896 306934 321099 326525 322300 308265 285796 258142 228815
56919B28815k9042k7977k5846k2358j8399j4995j2274j0084q548p428n980m074
$$ 228815 199773 171796 145950 123592 105193 90198 77924 67840 59292 51864 45884 41810
56907D1810k511j721j126k51N50J075J855L160M314M744M859N370O471Q066J0059
$$ 41810 39299 37578 36452 36201 36751 37826 39681 42841 47155 51899 56758 62128 68599 76665 86724
56892H6724J2073J3730J5399J7595J9655K0247J9485J8904J8928J7966J4716R814
$$ 86724 98797 112527 127926 145521 165176 185423 204908 223812 242740 260706 275422 285236
56880B85236M295j865q560j4430j8254k0284k0966j9644j5909j1007o255j239
$$ 285236 289531 287666 279106 264676 246422 226138 205172 185528 169619 158612 152357 151118
56868A51118M831J0976J5648J9334K3939K9914L5901M1087M5899N0120N2065N0163
$$ 151118 155949 166925 182573 201907 225846 255760 291661 332748 378647 428767 480832 530995
56856E30995M4149L4373K1180N636j0167k4115l4913m1792m4190m2220l6899k9505
$$ 530995 575144 609517 630697 636333 626166 602051 567138 525346 481156 438936 402037 372532
56844C72532k0919j1589j728Q522J8856K8820L8335M7841N7569O6913P5025Q1430
$$ 372532 351613 340024 338296 346818 365674 394494 432829 480670 538239 605152 680177 761607
56832G61607Q5236Q4136P5375N8110L4318P378j9653m4424o4838p8980q5672q5109
$$ 761607 846843 930979 1006354 1064464 1098782 1106160 1086507 1042083 977245 898265 812593 727484
56820G27484p8883o9094n7258m4252l1123j9119q543J568J1995K2201L1244L9160
$$ 727484 648601 579507 522249 477997 446874 427755 419212 420780 432775 454976 486220 525380
56808E25380M6504N2912N7009N7423N3143M3350K7983Q515j2552l2878n0470o3242
$$ 525380 571884 624796 681805 739228 792371 835721 863704 872219 859667 826789 776319 713077
56796G13077o9660o9888o5514n8142m8906l9093k9982k1876j4178o677P6N842
$$ 713077 643417 573529 508015 449873 400967 361874 331892 310016 295838 289161 289237 295079
56784B95079J1234J6755K2026K6369K9455L0833K9491K4579J6381O023n472j7324
$$ 295079 306313 323068 345094 371463 400918 431751 461242 485821 502202 508225 502753 485429
56772D85429k8374l7011m1987m3169m1372l7687l3101k8465k4377k0876j7508
$$ 485429 457055 420044 378057 334888 293516 255829 222728 194263 169886 149010 131502
56761A31502j4037j0913q740p385o119m651l432k789k412j980j723j916k263k306
$$ 131502 117465 106552 97812 90427 84308 79657 76225 73436 71024 69044 67321 65405 63142 60836
56747F0836k094j944j861j705j656j923k162j735n74N95R45K90q21j571j566j133
$$ 60836 58742 56798 54937 53232 51576 49653 47491 45756 45182 45777 46722 47012 46191 44620 43054 41921
56731D1921q17o45k35M26Q95R87R37P66K47k47J75J504K383J785M39j86L00J231
$$ 41921 41104 40459 40224 40650 41545 42532 43469 44235 44482 44235 44410 45914 48297 50082 50521 50335 50635 51866
56713E1866K114K866L202K785J829R02K62n8J57R01J536J514J231J365J746J647
$$ 51866 53980 56846 60048 62833 64662 65564 65826 65768 65925 66826 68362 69876 71107 72472 74218 75865
56697G5865J003M28J64j56p01j090r31j88Q76J743J772Q89j43n87n93o93q03m20
$$ 75865 76868 77296 77460 77304 76603 75513 74582 74394 75270 77013 78785 79674 79531 78944 78351 77658 76855 76435
56679G6435M57J293J705J653J231P48O93J075J219P06M9j28M4K56P13J446J726
$$ 76435 76892 78185 79890 81543 82774 83522 84215 85290 86509 87215 87264 87136 87180 87436 88149 89595 91321
56662I1321J098L34K58L56k36j049r84k07K12P9K4l1o54j369j023K44J085J140
$$ 91321 92419 92753 93011 93367 93131 92082 91098 90891 91103 91182 91206 91175 90521 89152 88129 88373 89458 90598
56644I0598J489K626L588L586L085K696K359K118K434L138L298K572J639Q63j32
$$ 90598 92087 94713 98301 101887 104972 107668 110027 112145 114579 117717 121015 123587 125226 126089 125957
56629A25957j205j481j043j312k852m183l857k533j782j844j869j610j563j827
$$ 125957 124752 123271 122228 120916 118064 113881 110024 107491 105709 103865 101996 100386 98823 96996
56615I6996j951j745j471j371j523j844j889j128J66R91R41O59N18j37j671l015
$$ 96996 95045 93300 91829 90458 88935 87091 85202 84074 84240 85231 86172 86831 87349 87212 85541 82526
56599H2526k876j470pR95J797K222J667L19o51m55L54O57J11n36l69O27J572J801
$$ 82526 79650 78180 78173 79168 80965 83187 84854 85173 84522 84067 84421 85078 85189 84653 84284 84911 86483 88284
56581H8284J659J843K244K136J368O76O52J134J709K110K027J303M88L94J013
$$ 88284 89943 91786 94030 96166 97534 98210 98862 99996 101705 103815 105842 107145 107633 108027 109040
56566A09040J622J999K531L095L032K522K679L769M619M432L901L736L359K137
$$ 109040 110662 112661 115192 118287 121319 123841 126520 130289 134908 139340 143241 146977 150336 152473
56552A52473P71K25J67k13o03j43Q94J363Q84O9o47j287j604j176k60L13J92k12
$$ 152473 153244 153469 153636 153423 152820 152677 153571 154934 155818 155887 155240 153953 152349 151173 150913 151226 151418 151206
56534A51206m64m92l48j24r1l80p05p46o12n74o44q07j195j632j519p14l3k84
$$ 151206 150742 150250 149902 149778 149687 149307 148602 147856 147244 146670 146026 145219 144024 142392 140873 140159 140126 139842
56516A39842j200j907k003j630r60k33J06o0k60j76k01o58j059p61R1R24J469
$$ 139842 138642 136735 134732 133102 132142 131909 132015 131955 131695 131519 131318 130660 129601 128840 128931 129855 131324
56499A31324J594J033K8m63M1P40P18K39l7l83j306k134j679p4J230J314N86j66
$$ 131324 132918 133951 133979 133516 133557 134297 135015 135254 135217 134834 133528 131394 129715 129641 130871 132185 132771 132605
56481A32605n47l75L21J018J170Q97O60M08j58p62q30m14j9K95Q18J300J110K57
$$ 132605 132058 131683 132004 133022 134192 135089 135749 136157 135999 135237 134407 133993 133974 134269 135087 136387 137497 137754
56463A37754m92n82j46M14P52O46L18M08J069J492J055M28O38J460J836J539J275
$$ 137754 137262 136680 136534 136948 137700 138346 138664 139072 140141 141633 142688 143116 143754 145214 147050 148589 149864
56446A49864J223P09n26j797k438k457k091j455p43j28N73J438J894J390M31O9
$$ 149864 151087 151796 151270 149473 147035 144578 142487 141032 140289 140161 140734 142172 144066 145456 145887 145956
56430A45956M24P19O36O36Q61Q45M85L08M84N10K04J23O20J263J554J601J659
$$ 145956 146380 147099 147735 148371 149232 150077 150562 150870 151354 151864 152068 152191 152811 154074 155628 157229 158888
56413A58888J557J035K01n95j034r16k52N91J187J396J217N56m08r85o92M3N38
$$ 158888 160445 161480 161681 161086 160052 159136 158884 159475 160662 162058 163275 163831 163423 162438 161746 161789 162327
56396A62327Q72J497K187K243J647J096R69J037J104J144R68N12L37R24J670J603
$$ 162327 163199 164696 166883 169126 170773 171869 172838 173875 174979 176123 177091 177603 177940 178864 180534 182137
56380A82137R27P69J384J787J356P00O29J136J779K228K218J636R34P14Q52P07
$$ 182137 183064 183833 185217 187004 188360 189060 189689 190825 192604 194832 197050 198686 199620 200334 201186 201893
56364B01893L12M04J149J746J651J305J224J081K75j026j936j811r00j17m5k18
$$ 201893 202205 202609 203758 205504 207155 208460 209684 210765 211040 210014 208078 206267 205367 205250 205205 204987
56348B04987K51J252J634R29J41J14K13l23o82K63J819K374J967K048K898L256
$$ 204987 205238 206490 208124 209053 209194 209308 209521 209198 208516 208779 210598 212972 214939 216987 219885 223141
56332B23141K657K149K348K446J898J405J599K019K079J841J346M08m63k81Q67
$$ 223141 225798 227947 230295 232741 234639 236044 237643 239662 241741 243582 244928 245336 244873 244592 245459
56317B45459J760J968K402L378L735K786J712J880K930L581L401K765J986J403
$$ 245459 247219 249187 251589 254967 258702 261488 263200 265080 268010 271591 274992 277757 279743 281146
56303B81146J554K383K996K928K889L575M526M916M733M460M281M237M487M862
$$ 281146 282700 285083 288079 291007 293896 297471 301997 306913 311646 316106 320387 324624 329111 333973
56289C33973M904M766N195O245O970O861O557O617O731O780P304Q217Q341P288
$$ 333973 338877 343643 348838 355083 362053 368914 375471 382088 388819 395599 402903 411120 419461 426749
56275D26749O536P454R330J0617J1207J2058J3346J4409J5132J6077J7477J9139
$$ 426749 433285 440739 450069 460686 471893 483951 497297 511706 526838 542915 560392 579531
56263E79531K1098K3472K5977K8400L1192L4915L9475M4575N0387N7012O3843
$$ 579531 600629 624101 650078 678478 709670 744585 784060 828635 879022 936034 999877
56252I99877P0364P7162Q5187R4309J03363J11532J18908J25713J31534J35392
$$ 999877 1070241 1147403 1232590 1326899 1430262 1541794 1660702 1786415 1917949 2053341
56242B053341J36391J34452J30389J24717J16525J04278Q7873O8994M9196K8600
$$ 2053341 2189732 2324184 2454573 2579290 2695815 2800093 2887966 2956960 3006156 3034756
56232C034756O911j5277l6785n6689p4283q8937j00505j09298j15380j18600j19468
$$ 3034756 3041667 3026390 2989605 2932916 2858633 2769696 2669191 2559893 2444513 2325913 2206445
56221B206445j18971j17325j13981j09177j04157r9425r4061q7398q0083p2927
$$ 2206445 2087474 1970149 1856168 1746991 1642834 1543409 1449348 1361950 1281867 1208940
56211A208940o6017n9666n4818n1560m8451m4342l9761l5726l2284k9078k6227
$$ 1208940 1142923 1083257 1028439 976879 928428 884086 844325 808599 776315 747237 721010
56200G21010k3727k1106j8449j6604j5652j4521j2821j1523j0992j0033q018o202
$$ 721010 697283 676177 657728 641124 625472 610951 598130 586607 575615 565582 557564 551362
56188E51362n606n288m241l337l641m260l774k577j932j821j510j189j273j108
$$ 551362 545756 540468 536227 532890 529249 524989 521215 518638 516706 514885 513375 512186 510913 509805
56174E09805j26O83L51j34O71K219L052L348M241N453N770N358N396N937O165
$$ 509805 509679 510362 510713 510579 511250 513469 516521 519869 524110 529563 535333 540691 546087 552024 558189
56159E58189O420P752R743J0821J0684J0608J1420J2874J4883J7637K0635K3180
$$ 558189 564609 572361 582104 592925 603609 614217 625637 638511 653394 671031 691666 714846
56147G14846K5750K9370L4003L9012M4851N2485O1431P0093P7882Q5390R2528
$$ 714846 740596 769966 803969 842981 887832 940317 1001748 1071841 1149723 1235113 1327641
56136A327641R8096J01163J01536R8921R3010Q4292P3825O2572N1841M3365L7536
$$ 1327641 1425737 1526900 1628436 1727357 1820367 1904659 1978484 2041056 2092897 2136262 2173798
56125B173798L2397K5898J8329J0943L367n574j5267k3829l0742l7015m3286m9805
$$ 2173798 2206195 2232093 2250422 2261365 2264732 2259158 2243891 2220062 2189320 2152305 2109019 2059214
56113B059214n7689o7903p9127q8636r5050r8487r8603r4692q7456p8615o8933
$$ 2059214 2001525 1933622 1854495 1765859 1670809 1572322 1473719 1379027 1291571 1212956 1144023
56102A144023n8506m8464m0230l3452k6765k0293j5335j1921q933o274m693l775
$$ 1144023 1085517 1037053 996823 963371 936606 916313 900978 889057 880124 873850 869157 865382
56090H65382k343n92M12R42K110L520L899L735M629O334P041O592O693P891Q897
$$ 865382 863039 862447 862859 863801 865911 869431 873330 877065 881694 888028 895069 901661 908354 916245 925142
56075I25142R184R717J0839J1739J2268J3093J3981J4073J3795J4326J5372J5721
$$ 925142 934326 944043 954882 966621 978889 991982 1005963 1020036 1033831 1048157 1063529 1079250
56063A079250J5619J6152J6717J5786J3810J2671J2494J1922J1093J1306J2076
$$ 1079250 1094869 1111021 1127738 1143524 1157334 1170005 1182499 1194421 1205514 1216820 1228896
56052A228896J1718J0759J1382J3557J5058J5351J5990J7157J7374J6933J7852
$$ 1228896 1240614 1251373 1262755 1276312 1291370 1306721 1322711 1339868 1357242 1374175 1392027
56041A392027K0085K1368K1350K2189K4451K6116K6380K6791K7892K8384K8373
$$ 1392027 1412112 1433480 1454830 1477019 1501470 1527586 1553966 1580757 1608649 1637033 1665406
56030A665406K9767L2589L4558L5124L6285L8568M0066M0355M1452M3874M5590
$$ 1665406 1695173 1727762 1762320 1797444 1833729 1872297 1912363 1952718 1994170 2038044 2083634
56019B083634M5975M6967M9215N1009N2088N4450N8346O1442O3214O6002P0566
$$ 2083634 2129609 2176576 2225791 2276800 2328888 2383338 2441684 2503126 2566340 2632342 2702908
56008B702908P4776P7800Q1405Q5878Q9166R1216R4729J00385J05812J10393J16280
$$ 2702908 2777684 2855484 2936889 3022767 3111933 3203149 3297878 3398263 3504075 3614468 3730748
55997C730748J23631J29987J35528J43530J54320J64265J72322J81787J94020
$$ 3730748 3854379 3984366 4119894 4263424 4417744 4582009 4754331 4936118 5130138
55988E130138K06341K17902K31603K48375K65653K83298L04617L29928L55801
$$ 5130138 5336479 5554381 5785984 6034359 6300012 6583310 6887927 7217855 7573656
55979G573656L82403M14349M52675M93624N37072N87938O47499P12266P83574
$$ 7573656 7956059 8370408 8823083 9316707 9853779 10441717 11089216 11801482 12585056
55970A2585056Q68667R70119J084616J214915J372076J563371J790466K063224
$$ 12585056 13453723 14423842 15508458 16723373 18095449 19658820 21449286 23512510
55962B3512510K402652K826498L346255L984250M782404N792917P073687Q684992
$$ 23512510 25915162 28741660 32087915 36072165 40854569 46647486 53721173 62406165
55954F2406165J0656547J2944885J5446664J8065095K0745152K3445464K6098070
$$ 62406165 73062712 86007597 101454261 119519356 140264508 163709972 189808042
55947A89808042K8549375L0415955L0956895K9246682K4696223J7482582Q432222
$$ 189808042 218357417 248773372 279730267 308976949 333673172 351155754 359587976
55940C59587976j479173j1411861k0518395k7805151l2400691l4007592l3030444
$$ 359587976 358108803 346696942 326178547 298373396 265972705 231965113 198934669
55933A98934669l0278459k6586479k2625852j8862178j5545749j2742648j0423759
$$ 198934669 168656210 142069731 119443879 100581701 85035952 72293304 61869545
55926F1869545q540146p033405n828567m856200m072397l444661k935407k513029
$$ 61869545 53329399 46295994 40467427 35611227 31538830 28094169 25158762 22645733
55918B2645733k163788j879014j642108j438221j264564j120588r97941q88783
$$ 22645733 20481945 18602931 16960823 15522602 14258038 13137450 12139509 11250726
55910A1250726p94165p15663o47524n84548n29274m84172m44671m06472l72212
$$ 11250726 10456561 9740898 9093374 8508826 7979552 7495380 7050709 6644237 6272025
55901F272025l44573l19937k94876k72019k53715k36500k17503j99964j86898
$$ 6272025 5927452 5607515 5312639 5040620 4786905 4550405 4332902 4132938 3946040
55892C946040j75217j61561j48204j37998j28822j18187j08210j01014r4097q5095
$$ 3946040 3770823 3609262 3461058 3323060 3194238 3076051 2967841 2866827 2772730 2687635
55882B687635p6489p0976o6758o1842n8483n8755o0104n9891o0149o3091o5957
$$ 2687635 2611146 2540170 2473412 2411570 2353087 2294332 2234228 2174337 2114188 2051097 1985140
55871A985140o5229o2504o1313o1213n9647n6918n4802n2676m9163m5503m3426
$$ 1985140 1919911 1857407 1796094 1734881 1675234 1618316 1563514 1510838 1461675 1416172 1372746
55860A372746m1822l8921l5779l4217l3473l1992l0400k9678k8599k6046k3681
$$ 1372746 1330924 1292003 1256224 1222007 1188534 1156542 1126142 1096464 1067865 1041819 1018138
55849A018138k3415k4220k4222k3762k3806k3509k2118k1050k1382k1517j9935
$$ 1018138 994723 970503 946281 922519 898713 875204 853086 832036 810654 789137 769202
55838G69202j7970j7191j6494j4527j2642j2447j2680j1581j0202j0294j0947
$$ 769202 751232 734041 717547 703020 690378 677931 665251 653670 643468 633174 622227
55827F22227j0393r256q931q574o864n021m954n983o406o680p969r085q178o216
$$ 622227 611834 602578 593647 585073 578209 573188 568234 562251 555845 549165 541196 532111 523933 517717
55813E17717n578o199o178n198m369l564j790N07K209L743O035Q122Q453P643
$$ 517717 512139 505940 499762 494564 490195 486631 484841 485348 487557 491300 497335 505457 513910 521553
55799E21553P328P152N547K740K76j737m304p108r011j0305j1927j3039j2110
$$ 521553 528881 536033 541580 544320 544596 542859 538555 531447 522436 512131 500204 487165 475055
55786D75055r844q410q151p626o541o039o275o211n658n185m210j552K233N454
$$ 475055 465211 456801 448650 441024 434483 428444 422169 415958 410300 405115 400905 399353 401586 407040
55772D07040P936J0721J3288J3713J1615Q443M683o48p338j3281j7098j9317k0403
$$ 407040 414976 425697 438985 452698 464313 472756 477439 476791 469453 456172 439074 419757 399354
55759C99354j9773j7536j5154j3470j1731r442p525o767o550o014n307m927m833
$$ 399354 379581 362045 346891 333421 321690 312248 304723 297956 291406 285392 280085 275158 270325
55746B70325m896n171n337m769l618k793k517k002r33k40p97k232l547m230m325
$$ 270325 265429 260258 254921 250152 246534 243741 241224 239222 238289 238049 237252 235020 231473 227243 222918
55731B22918l961l301k572j951j629j823k362k652k530k685l570m408m132k877
$$ 222918 218957 215656 213084 211133 209504 207681 205319 202667 200137 197452 193882 189474 185342 182465
55717A82465j578n49O00J985L379M812O170O625N500L466J819Q70M1p95j276j611
$$ 182465 180887 180338 180938 182923 186302 191114 197284 203909 209409 212875 214694 215564 215605 214810 213534 211923
55701B11923k420l655m680n316n806n955n403m533m032l752l078k151j606j329
$$ 211923 209503 205848 201168 195852 190046 184091 178688 174155 170123 166371 163293 161142 159536 158207
55687A58207o72K68Q65J277K277L723M483M067L239K819K885L177L407L122K111
$$ 158207 157535 157803 158668 159945 162222 165945 170428 174495 177734 180553 183438 186615 190022 193144 195255
55672A95255R35K61j55r19j789k060j894k065k527k448j629o81J38J071J910K184
$$ 195255 196190 196451 196296 195377 193588 191528 189634 187569 185042 182594 180965 180284 180422 181493 183403 185587
55656A85587K246K951M056M364L563K676K324J846N94j014k264l058l540l698
$$ 185587 187833 190784 194840 199204 202767 205443 207767 209613 210207 209193 206929 203871 200331 196633
55642A96633l780m354n521o634p115p035o753o545o581o641n988m286k473j796
$$ 196633 192853 188499 182978 176344 169229 162194 155441 148896 142315 135674 129686 125400 122927 121131
55628A21131k132k245j697j301j591j947j680r86m46k64l96p64j124j263j424
$$ 121131 118999 116754 115057 113756 112165 110218 108538 107552 107106 106842 106446 105682 104558 103295 101871
55613A01871j954k573k646k119j492r97n63m61j025j840k102j744j286p91L1Q26
$$ 101871 99917 97344 94698 92579 91087 90090 89527 89066 88041 86201 84099 82355 81069 80278 80309 81135
55597H1135Q71L20M6J69n4q04j318j177q07n20j58O2m09j344j712j147l88K2L60
$$ 81135 82006 82326 82372 82541 82487 81683 80365 79188 78381 77861 77703 77765 77356 76012 74300 73153 72765 72787 73147
55578G3147P68Q60O53P65J244J297O61J46L11P08R26J290J890K026J395Q44J106
$$ 73147 73915 74775 75428 76193 77437 78734 79395 79541 79852 80560 81486 82776 84666 86692 88087 88931 90037
55561I0037J613J413N48k24n68p17r49j390j915j960j083J31N51J01n5O79J433
$$ 90037 91650 93063 93611 93387 92819 92102 91153 89763 87848 85888 84805 84936 85487 85588 85533 86212 87645
55544H7645J327P68N67P41R57J276J652J505P08J75N89J222J007J35m21n03p29
$$ 87645 88972 89740 90307 91048 92005 93281 94933 96438 97146 97321 97910 99132 100139 100274 99853 99350 98621
55527I8621j252j509j219p43n11o54j182k009k822l318l413l081k294j385r46
$$ 98621 97369 95860 94641 93898 93387 92733 91551 89542 86720 83402 79989 76908 74614 73229 72283
55512G2283j051j110p81m69n21n86l54k49p02j286j298q15l62m0L05L60k79j165
$$ 72283 71232 70122 69341 68872 68351 67765 67411 67162 66460 65174 63876 63061 62699 62659 62964 63324 63045 61880
55494F1880j357o77Q5L19K72L60M51J78l19m33J30Q51Q84M8q53r59l57J88K76
$$ 61880 60523 59846 59931 60250 60522 60882 61333 61511 61192 60759 60889 61740 62624 62672 61819 60860 60503 60691 60967
55475F0967J26o8l73o15l40M29J029J017O76M19J55l51r89j457j624j422p95P0
$$ 60967 61093 61025 60652 60037 59697 60126 61155 62172 62848 63267 63422 63071 62082 60625 59001 57579 56784 56854
55457E6854P92J241J479J336O38j19r8N70O99l24j543j650n82O50J271J264R56
$$ 56854 57646 58887 60366 61702 62340 62221 62123 62693 63392 63068 61525 59875 59293 59943 61214 62478 63434
55440F3434O66N87O39N81M00K73J16l02p10m96K89P71M18k44m67j85J95M06L03
$$ 63434 64100 64687 65326 65907 66307 66580 66696 66394 65684 65188 65477 66248 66666 66422 65955 65770 65965 66371 66674
55421F6674j14m41j40N92R68Q25Q99J539K032J661O48m50j430j989j501m7J133
$$ 66674 66560 66119 65979 66571 67539 68364 69263 70802 72834 74495 75143 74693 73263 71274 69773 69726 70859
55404G0859J019M6p10r73j133j344j515j639j498o81M95R17K36l72O4P67N38k09
$$ 70859 71878 71924 71214 70241 69108 67764 66249 64610 63112 62431 62926 63843 64079 63707 63771 64538 65076 64867
55386F4867k13M77O50M6k45L95J170J156M96l9l4K76K39o50j988k497j524j04
$$ 64867 64654 65131 65781 65827 65582 65977 67147 68303 68799 68760 68726 69002 69241 68591 66603 64106 62582 62478
55368F2478K02o67j334r65j59J85l1l39l88j13L09N17L95L27O15Q52M46l78q07
$$ 62478 62680 62013 60679 59714 59555 59740 59709 59370 58982 58869 59178 59695 60090 60417 61032 61884 62330 61952 61145
55349F1145n32M6O06J172J573J391N95k66p50q58p12l46P7K36k5n57j035j055
$$ 61145 60613 60659 61265 62437 64010 65401 65996 65730 64980 64122 63410 63064 63141 63377 63352 62795 61760 60705
55331F0705l60P37J382J083K91k25k78j56k2O7o8m44o74m98j61R3M28Q18P40N7
$$ 60705 60345 61082 62464 63547 63838 63613 63335 63179 63157 63224 63156 62712 62038 61540 61379 61472 61900 62718 63458 63515
55311F3515m36k19jn61j313j221n79n05j045j218p67m23l42K15J404K276K158
$$ 63515 63079 62860 62859 62298 60985 59764 59185 58680 57635 56417 55650 55227 54885 55100 56504 58780 60938
55294F0938J482Q70L47j30k77l9K72O00J134J552J268N64M10Q68Q26j91j085p64
$$ 60938 62420 63290 63637 63507 63230 63191 63463 64063 65197 66749 68017 68581 68991 69859 70685 70494 69409 68645
55276F8645L09R36Q18M68J62j88m96n84n75o71p30n38k16j7O5K14M98Q35J034
$$ 68645 68954 69890 70708 71176 71338 71150 70654 70070 69495 68824 68094 67556 67340 67323 67388 67602 68100 68935 69969
55257F9969P82K6o87o67RO05P09N64L44o8m57k86M08Q62O82L46K25o2q10j492
$$ 69969 70751 70777 70090 69423 69432 70037 70746 71310 71654 71586 71129 70843 71251 72113 72795 73141 73366 73304 72494 71002
55237G1002j507j104q43p25m45q7J08L07P12R24M06n87j152p91K3M40M4p91j265
$$ 71002 69495 68391 67548 66823 66378 66291 66399 66706 67418 68342 68748 68161 67009 66218 66241 66681 66725 65934 64669
55218F4669r54l00j1q3J15O78Q63K21o61j013q50n61j27N56J015P00p8m10J3O38
$$ 64669 63715 63415 63404 63321 63436 64114 64977 65198 64537 63524 62674 62113 61986 62542 63557 64257 64179 63769 63782 64420
55198F4420R07Q57P60O29L45pj31J80P63J187J187R55Q43Q41O76L37P9m7k47m66
$$ 64420 65327 66184 66944 67573 67918 67911 67780 67960 68723 69910 71097 72052 72895 73736 74412 74749 74828 74781 74534 74068
55178G4068l74J6K58J64L8P4Q7O8K64M89J08q56j415j045n90r36j502j082K17
$$ 74068 73694 73710 73968 74132 74170 74244 74331 74399 74663 75152 75260 74404 72989 71944 71354 70418 68916 67834 68051
55159F8051J050P39O4L7O93J381J577J152L49k68k22L60Q90R78O72R4o79j376
$$ 68051 69101 69840 69904 69941 70634 72015 73592 74744 75093 74825 74603 74963 75853 76831 77503 77597 76918 75542
55141G5542j579j221p03m33m41n01l88j4N20R13R26O17K41m5k13k50j37J15N16
$$ 75542 73963 72742 72039 71606 71165 70664 70276 70262 70782 71695 72621 73238 73479 73434 73221 72971 72834 72949 73465
55122G3465J022J339J086L54k73m70n45p39o32J65J061J062J74n36l74J86L54
$$ 73465 74487 75826 76912 77266 76993 76523 75978 75239 74607 74772 75833 76895 77069 76533 76159 76345 76699
55105G6699J18R5N31R63P35k03j049p75P00K111K032N33q49q93K1P31Q28Q12R89
$$ 76699 76817 76912 77443 78406 79141 78938 77889 77114 77814 79925 81957 82490 81641 80748 80769 81500 82328 83140 84129
55086H4129R45K96o39j220j312j301j363j155l64P12J410J463J226J105J066Q12
$$ 84129 85074 85370 84731 83511 82199 80898 79535 78380 78016 78728 80138 81601 82827 83932 84998 85810
55070H5810L15j41l19k49r1K5jk06m33l88m5J24l46j208j574r75oM31L04L51Q06
$$ 85810 86125 85984 85665 85416 85325 85350 85349 85143 84710 84322 84277 84401 84055 82847 81273 80298 80292 80723 81027 81378 82184
55049H2184R69L54m09m14J84M03j69q56r02l51K52N95P74R61J122R45J51r88j641
$$ 82184 83153 83507 83098 82684 82868 83271 83102 82246 81344 80993 81245 81840 82614 83575 84697 85642 85793 84805 83164
55030H3164j276l71J44L2k05k49k92l91k71O9J65j58m41k48K49O94J054J384J509
$$ 83164 81888 81517 81661 81693 81488 81239 80947 80556 80285 80354 80519 80361 79920 79672 79921 80615 81669 83053 84562
55011H4562J258P33J30l81m42K66J365J958J740J404J527J696J265M16j38j80
$$ 84562 85820 86553 86683 86302 85860 86126 87491 89449 91189 92593 94120 95816 97081 97497 97359 97179
54995I7179J7K94O20P00K25o18j360j820k000j722r33j66o3n46r44q93o08l63
$$ 97179 97196 97490 98110 98810 99035 98417 97057 95237 93237 91515 90582 90416 90353 89807 88863 87970 87362 86999
54977H6999j93p8L0L16Q80J468J799J907J847J363M43j48L16J347J711J071L65
$$ 86999 86806 86728 86758 87074 87954 89422 91221 93128 94975 96338 96781 96633 96949 98296 100007 101078 101443
54960A01443L65O73N17q1n24n90o48r56j205q37K41J329J498O13l79m88Q2K59
$$ 101443 101808 102481 102998 102917 102393 101803 101155 100199 98994 98157 98398 99727 101225 101838 101459 100971 101053 101312
54942A01312m22j169r66J90J391J839J500Q50L63J87K23M23R31J824K816L427
$$ 101312 100890 99721 98755 98945 100336 102175 103675 104525 104888 105075 105298 105721 106652 108476 111292 114719
54926A14719L513L473L812M614N461N910N948N959O113N930M792K841R16n51k030
$$ 114719 118232 121705 125517 130131 135592 141502 147450 153409 159522 165452 170244 173085 174001 173450 171420
54911A71420l903n551o111n799n649o010o133n381m121l027k209j543j349j951
$$ 171420 167517 161966 155855 150056 144407 138397 132264 126883 122762 119735 117526 115983 114634 112683
54897A12683k774k642j205M63J083O82M22J037J999K426K318K374K863L292L264
$$ 112683 109909 107267 106062 106525 107608 108290 108712 109749 111748 114174 116492 118866 121729 125021 128285
54882A28285L075L226L772M421M935N165M954M357L714L272K877K226J181l21
$$ 128285 131360 134586 138358 142779 147714 152879 157833 162190 165904 169176 172053 174279 175460 175139
54868A75139k240m139n385n893o262o805o989o343n341m767m614m327l763l156
$$ 175139 172899 168760 163375 157482 151220 144415 137426 131083 125742 120975 116361 112034 108271 105115
54854A05115k418j333l16m0l43l36K88Q98R87P51M01k91j362k234k409k122j874
$$ 105115 102697 101364 101048 101008 100665 100329 100617 101515 102502 103253 103654 103363 102001 99767 97358 95236 93362
54837I3362j720j407q87l56N1L11M83O58P36L50n67j245q25L01P09j77j188q73
$$ 93362 91642 90235 89348 88992 89043 89354 89837 90495 91231 91581 91014 89769 88944 89245 89954 89777 88589 87716
54819H7716O61K053K328J661Q24M78Q47J536J727J019l3n44l34N5J69j0l87q87
$$ 87716 88377 90430 92758 94419 95243 95721 96568 98104 99831 100850 100817 100273 99939 99994 100163 100153 99766 98879
54801I8879j249j183p82m22j74K88J033J598J600J292J148J133Q44K76n2J26L97
$$ 98879 97630 96447 95665 95243 95069 95357 96390 97988 99588 100880 102028 103161 104005 104281 104229 104355 104752
54784A04752K97P0L03R59J326J003M37K86O78J417K459L755M893N479N694N960
$$ 104752 105049 105119 105422 106381 107707 108710 109147 109433 110111 111528 113987 117742 122635 128114 133808 139768
54768A39768O188N960N437N342N816N929M748K515L11j196k165l008l887m795
$$ 139768 145956 151916 157353 162695 168511 174440 179188 181703 182014 180818 178653 175645 171758 166963
54754A66963n696o381o450n746m663l843l548l479l250k780k175j461p33k82k45
$$ 166963 161267 154886 148436 142690 138027 134184 130636 127157 123907 121127 118952 117491 116758 116476 116231
54739A16231k40J32N43L17l38l07R15K390K976K768K590K662K701K967M082N820
$$ 116231 115991 116123 116666 116983 116645 116338 117253 119643 122619 125387 127977 130639 133340 136307 140389 146209
54723A46209P101P323O927O391N505L931J853l32k432m214n311n697n888o314
$$ 146209 153310 160633 167560 173951 179456 183387 185240 184908 182476 178262 172951 167254 161366 155052
54709A55052o781o763n960m432k594j209r38j656k508k760k301j381m04k0o68
$$ 155052 148271 141508 135548 131116 128522 127313 126375 124719 122211 119451 117150 115769 115365 115345 114677
54694A14677j797k222j590q55q85j273j076j63Q22J469J839J925J512O05m50j270
$$ 114677 112880 110658 109068 108213 107328 106055 104979 104816 105638 107107 108946 110871 112383 112988 112538 111268
54678A11268j668j683j523j324q54J09J049J022Pp25k33P58R12K27j23K94N68
$$ 111268 109600 107917 106394 105070 104216 104325 105374 106396 106403 105678 105445 106203 107115 107342 107219 107513 108081
54661A08081l8r42j165p23m42p02r95p06Q6P64Q27K86m62j026j229j098p63m00
$$ 108081 108043 107101 105936 105213 104771 104069 103074 102368 102454 103218 104045 104331 103869 102843 101614 100516 99753 99353
54643I9353j28P2K99N88Q49R29O81R5n01n80QP06Q26L53j59m08n98q36q05k52
$$ 99353 99225 99297 99596 100184 101033 101962 102643 102738 102237 101657 101665 102371 103197 103550 103391 102983 102385 101549 100744 100492
54623A00492N60J051Q49M5p74q23J23J232J411N64l01l56K98J104J603J350J40
$$ 100492 101052 102103 102952 102997 102223 101400 101523 102755 104166 104730 104429 104073 104371 105475 107078 108428 108568
54606A08568j361j972j427p56o76n20N35J870K120J056k01p07m98nM52N86K63
$$ 108568 107207 105235 103808 103052 102376 101856 102391 104261 106381 107437 107236 106529 106031 106026 106478 107064 107327
54589A07327j84l30l36n40n86K21J543K011R60n39j009l85J28k66j113j495j070
$$ 107327 107143 106813 106477 105937 105351 105572 107115 109126 110086 109547 108538 108153 108281 108015 106902 105407 104337
54572A04337j63P75J458J714J475R36M66J95j14o18j001q42k54K44M36O00R69
$$ 104337 104174 104949 106407 108121 109596 110532 110998 111193 111079 110461 109460 108618 108364 108608 109044 109644 110613
54555A10613J415J713J747J401P13J69L04R33J327J216R51O33m8q06o99M32J372
$$ 110613 112028 113741 115488 116889 117602 117771 118075 119008 120335 121551 122502 123135 123087 122281 121582 122014 123386
54538A23386J135K82j40j74m67q83q50n20m51m99j92J23k26q46o99J17L85l34
$$ 123386 124521 124803 124663 124489 124022 123139 122289 121769 121318 120819 120627 120750 120524 119678 118979 119096 119481 119147
54520A19147j099j214j132j345j494j144n04K10J227K461L159K839J955J126M46
$$ 119147 118048 116834 115702 114357 112863 111719 111215 111425 112652 115113 118272 121111 123066 124192 124638
54505A24638j1R5N67M54o29j745j948j640j697j901j395k45N98P67Q20J121J309
$$ 124638 124627 124722 125289 125743 125114 123369 121421 119781 118084 116183 114788 114543 115141 115908 116728 117849 119158
54488A19158J102P95O36L95j60p68r82o40J26R94J489J259N15k3J09O26Q93O97
$$ 119158 120260 121055 121691 122086 121926 121158 120176 119536 119662 120656 122145 123404 123919 123896 124005 124631 125524 126221
54470A26221M44O47J316J889J787J021J35m30p21r07q89n61k58m49j025j248o69
$$ 126221 126665 127312 128628 130517 132304 133325 133460 133030 132309 131402 130513 129952 129694 129245 128220 126972 126303
54453A26303K83Q84J017J081J146O67o38j987k191j084J83N45K32J64N45P38M46
$$ 126303 126586 127470 128487 129568 130714 131381 130743 128756 126565 125481 125664 126209 126441 126605 127150 127888 128334
54436A28334K05M55P81N81M1j50J35L30J28m4K62P47P69K67j87k31j43k66m29
$$ 128334 128539 128994 129775 130356 130397 130247 130382 130712 130840 130796 131058 131805 132574 132841 132654 132423 132280 132014 131585
54417A31585l27j18j17j21L05Q67O70m56j442j353n39J41O25J297J818J466M98
$$ 131585 131258 131140 131023 130902 131207 132074 132744 132288 130846 129493 128954 129095 129720 131017 132835 134301 134799
54400A34799O6N60J075Q91M20K42L6o21j138n45R51J954J506Q5j112j370p56K96
$$ 134799 134865 135425 136500 137391 137811 138053 138089 137468 136330 135785 136736 138690 140196 140281 139169 137799 137043 137339
54382A37339J329J939J832R90j77r78r20q4R63J645J755J446J149J252J712K036
$$ 137339 138668 140607 142439 143429 143252 142274 141354 141270 142233 143878 145633 147079 148228 149480 151192 153228
54366A53228J932J802K177K841L060K631K093J801J444P01k47j129k010k915l522
$$ 153228 155160 156962 159139 161980 165040 167671 169764 171565 173009 173710 173463 172334 170324 167409 163887
54351A63887l543l131k570j987j565j604j961j976j387q14r14j464j836j887j800
$$ 163887 160344 157213 154643 152656 151091 149487 147526 145550 144163 143349 142435 140971 139135 137248 135448
54336A35448j429n91L50Q24Q88R83J117R39N04J92ll20n13j39L69J1j139j634
$$ 135448 134019 133428 133778 134602 135490 136473 137590 138529 139033 139225 139222 138902 138389 138250 138619 138630 137491 135857
54318A35857o21P53P56o03j585r54O20J508R89j06m01M76J430J090n50k063k284
$$ 135857 135236 135989 136745 136142 134557 133603 134223 135731 136720 136614 136213 136689 138119 139209 138659 136596 134312
54301A34312j571j028r69q24l15P5n5l80l36J95R35J585J860J517P78L47O44J233
$$ 134312 132741 131713 130744 129920 129605 129680 129625 129245 128909 129104 130039 131624 133484 135001 135779 136126 136770 138003
54283A38003J450J289J195J138O12m59j415j679j367r28o12m99n58m97l9M67L26
$$ 138003 139453 140742 141937 143075 143687 143228 141813 140134 138767 137839 137227 136728 136170 135673 135634 136101 136427
54266A36427l27l98O24J707J609O05k7K01O62Q67R58J044J003R91J251J376P47
$$ 136427 136100 135702 136326 138033 139642 140247 140220 140421 141083 141950 142908 143952 144955 145946 147197 148573 149320
54249A49320k40m70J38L75l61j085q27j40l9l69k89K57O64Q12J058J329J148M58
$$ 149320 149080 148610 148748 149123 148762 147677 146850 146710 146671 146302 146013 146270 146934 147746 148804 150133 151281 151739
54231A51739l58j068j481j131R6J256J243K82l85k51N0kj55k25n15j069j360j176
$$ 151739 151381 150313 148832 147701 147797 149053 150296 150578 150193 149942 149992 149990 149835 149610 149095 148026 146666 145490
54213A45490r90j066j000o26n28j015j340p61K12N03M0k81J1M67N73K71l89j319
$$ 145490 144500 143434 142434 141808 141280 140265 138925 138164 138376 138879 138919 138638 138649 139116 139689 139960 139571 138252
54195A38252j998j763p59Q2L47O81J516K044J366J16k09N95J181P65K69O85J421
$$ 138252 136254 134491 133732 133814 134161 134842 136358 138402 139768 139884 139675 140270 141451 142216 142485 143170 144591
54178A44591J323N77K71L84k09j667k587k041r63o78j019r79n32n16j090j459
$$ 144591 145914 146491 146762 147146 146937 145270 142683 140642 139679 139001 137982 137003 136471 135955 134865 133406
54162A33406j180p24n07k80K27P34Q90Q77J119J730K422K786K493J528L16o21
$$ 133406 132226 131502 130995 130715 130942 131676 132566 133443 134562 136292 138714 141500 143993 145521 145837 145216
54146A45216j142j385j248m81O82J473J444R49N97N29N11M08K80J36m7k12k65
$$ 145216 144074 142689 141441 140960 141642 143115 144559 145508 146105 146634 147145 147553 147833 147969 147922 147710 147445
54129A47445k00n6J75M97Q25J069J211J283J335J389J381J192Q63O07N47N19M03
$$ 147445 147245 147189 147364 147861 148686 149755 150966 152249 153584 154973 156354 157546 158409 159016 159563 160082 160485
54112A60485M37R02J606K131K500L160M210N113N404N295N281N389N165M304K941
$$ 160485 160922 161824 163430 165561 168061 171221 175431 180544 185948 191243 196524 201913 207078 211382 214323
54097B14323J387j98j690k769l110k898k870l455l985l309j357N17J052N08J4
$$ 214323 215710 215512 213822 211053 207943 205045 202175 198720 194735 191426 190069 190586 191638 192146 192160
54082A92160r3n14j681k953l315k481j108k04l78j364k283k503k179j765j387
$$ 192160 192067 191553 189872 186919 183604 181123 180015 179811 179433 178069 175786 173283 171104 169339 167952
54067A67952j038r26j043p81J97J034O37n90j073j96R81J374J142Q91O56L80M66
$$ 167952 166914 165988 164945 164164 164361 165395 166032 165442 164369 164173 165154 166528 167670 168561 169217 169597 170063
54050A70063J127J823K046J995J939J714J458J943L254M070L384K264K492L941
$$ 170063 171190 173013 175059 177054 178993 180707 182165 184108 187362 191432 194816 197080 199572 203513
54036B03513M857M526M076M452N131N331N195N041M522L410K398K228K605K728
$$ 203513 208370 212896 216972 221424 226555 231886 237081 242122 246644 250054 252452 254680 257285 260013
54022B60013K489K295K119J515N08k84m62k44o5k46r76k235l640m730n400n836
$$ 260013 262502 264797 266916 268431 268939 268655 268193 267949 267884 267638 266662 264427 260787 256057 250657 244821
54006B44821o071n928n349m440l320k246j777k251l103l250k367j340j157j789
$$ 244821 238750 232822 227473 223033 219713 217467 215690 213439 210336 207086 204719 203379 202222 200433
53992B00433k419k488k078j557j232j261j505j553j248j048j445k095k071j058
$$ 200433 198014 195526 193448 191891 190659 189398 187893 186340 185092 184044 182599 180504 178433 177375
53978A77375J92P76N97J60o1K41J291K939M481N219N159M851M699M742M985N466
$$ 177375 177567 178343 178940 179100 179039 179280 180571 183510 187991 193210 198369 203220 207919 212661 217646 223112
53962B23112O069O607P048P254O636M554J135k693n959q095q714p654n480l393
$$ 223112 229181 235788 242836 250090 256726 261280 262415 259722 253763 245668 236954 229300 223820 220427
53948B20427k216j784j491j112p54l69J99R08J586K220K842L223L034K340J703
$$ 220427 218211 216427 214936 213824 213070 212701 212900 213808 215394 217614 220456 223679 226713 229053 230756
53933B30756J732K540L620M226M007L270K580K167K039K365L317M474N030M832
$$ 230756 232488 235028 238648 242874 246881 250151 252731 254898 256937 259302 262619 267093 272123 276955
53919B76955M679N198N940O076N592N243N533O300P118P594P387O421N075L780
$$ 276955 281634 286832 292772 298848 304440 309683 315216 321516 328634 336228 343615 350036 355111 358891
53905C58891K544J294M27L89Q04O51n10k095l386m246m735m678m125l775m301
$$ 358891 361435 362729 363156 363545 364349 365000 364490 362395 359009 354763 350028 345350 341225 337450 333149
53890C33149n420o203o203n863n753n883n902n679n366n071m813m746n109n742
$$ 333149 327729 321526 315323 309460 303707 297824 291922 286243 280877 275806 270993 266247 261138 255396
53876B55396n909m957l202j805j608k276k811k749k545k794l438l866l667l053
$$ 255396 249487 244530 241328 239523 237915 235639 232828 230079 227534 224740 221302 217436 213769 210716
53862B10716k639k758l124l117k462j539r82j080j550j795j363l48N37N48k81
$$ 210716 208077 205319 202195 199078 196616 195077 194095 193015 191465 189670 188307 187959 188496 189044 188763
53847A88763j069j012k52M28N53L44K67N19Q79Q16k5j175j504m88Q87J206M30
$$ 188763 187694 186682 186430 186858 187411 187755 188022 188541 189420 190236 190211 189036 187532 187044 187931 189137 189567
53830A89567j50J60N88L21j35J96J183J774J489Q01K47k1J23O90J041M31o55o77
$$ 189567 189417 189577 190165 190486 190351 190547 191730 193504 194993 195794 196041 196020 196143 196833 197874 198305 197650 196973
53812A96973R26K706K997K007J204J206J485J907L103N003O270N949M795M160
$$ 196973 197899 200605 203602 205609 206813 208019 209504 211411 214514 219517 225787 231736 236531 240691
53798B40691M222M215L946L997M534M869M463L669L125K940K747K233J369L40
$$ 240691 244913 249128 253074 257071 261605 266474 270937 274606 277731 280671 283418 285651 287020 287360
53784B87360n93j317j993k752l368l541l403l370l543l720l931m359m747m575
$$ 287360 286767 285450 283457 280705 277337 273796 270393 267023 263480 259760 255829 251470 246723 242148
53770B42148l963l711m097m400l971l165k614k247j696j226j366j929k162j837
$$ 242148 238185 234474 230377 225977 222006 218841 216227 213980 212284 211058 209692 207763 205601 203764
53756B03764j442j333j324j175r25o12j72K54L17o0n30o87l65L09Q48O35l94j366
$$ 203764 202322 200989 199665 198490 197565 196953 196781 197035 197352 197292 196762 196075 195710 196019 196867 197502 197108 195742
53738A95742j374n80J03L26N67J050J286R62N47N26O42M27j0k19p3K88Q79J613
$$ 195742 194368 193788 193891 194217 194784 195834 197120 198082 198629 199155 199797 200224 200214 199995 199922 200210 201089 202702
53720B02702J984J576Q21N74R84J298R21J89q7M43J386K090K216J952J813K130
$$ 202702 204686 206262 207083 207657 208641 209939 210860 211049 210962 211405 212791 214881 217097 219049 220862 222992
53704B22992K764L343L718M005M240M250L903L275K521J813J473J865K805L361
$$ 222992 225756 229099 232817 236822 241062 245312 249215 252490 255011 256824 258297 260162 262967 266328
53690B66328K712J241L09O63J507J514N17m51o56n14o66r03o20P5M28J82n5K42
$$ 266328 269040 270281 270590 271253 272760 274274 274791 274340 273684 273170 272504 271601 270981 271056 271484 271666 271611 271853
53672B71853P51Q11L05l20o67o15r2Q70J802J921R56l53r49o41l00o97j526j930
$$ 271853 272604 273415 273720 273400 272733 272118 272026 272896 274698 276619 277575 277222 276273 275632 275332 274635 273109 271179
53654B71179j679j304j105p58q8L77J62l55l98J91R54J575K033K169J778J135
$$ 271179 269500 268196 267091 266333 266245 266622 266784 266429 266031 266222 267176 268751 270784 272953 274731 275866
53638B75866Q47J063J342J374J313J315J283J243J437J854K177K380K841L640
$$ 275866 276713 277776 279118 280492 281805 283120 284403 285646 287083 288937 291114 293494 296335 299975
53624B99975M290M521M696N012M933M010K871K541L030L296K594J268J44l07j17
$$ 299975 304265 308786 313482 318494 323427 327437 330308 332849 335879 339175 341769 343037 343181 342874 342757
53609C42757M38J006J402J728K129K481K562K521K746L241L489L060K111J199
$$ 342757 343195 344201 345603 347331 349460 351941 354503 357024 359770 363011 366500 369560 371671 372870
53595C72870P90R82J458J631J124J91n26p35p35q80j107j210j259j427j560j307
$$ 372870 373660 374642 376100 377731 378855 379046 378520 377785 377050 376170 375063 373853 372594 371167 369607 368300
53579C68300p46m57q30j477j636j146o74q89j598j960j538q12n43q32j072p41
$$ 368300 367554 367097 366267 364790 363154 362008 361334 360445 358847 356887 355349 354537 353994 353162 352090 351349
53563C51349j9N18O08M75L29k4q04j597j477n3J779K515J535k99j598j759j219
$$ 351349 351330 351848 352456 352931 353260 353236 352432 350835 349358 349305 351084 353599 355134 354835 353237 351478 350259
53546C50259o53k29L09J048J650J752J504J492K038K847L456L842M275M762N010
$$ 350259 349606 349377 349686 350734 352384 354136 355640 357132 359170 362017 365473 369315 373590 378352 383362
53531C83362M964N026N590O639P834Q722Q912Q364P692P739Q682R837J0542J0892
$$ 383362 388326 393352 398942 405581 413415 422137 431049 439413 447105 454844 463526 473363 483905 494797
53517D94797J1391J2232J3284J4480J5801J7011J7831J8352J8898J9536K0056
$$ 494797 506188 518420 531704 546184 561985 578996 596827 615179 634077 653613 673669
53506F73669K0447K1003K1843K2543K2472K1445K0033J9123J9105J9487J9476
$$ 673669 694116 715119 736962 759505 781977 803422 823455 842578 861683 881170 900646
53495I00646J8938J8480J8524J8711J8521J8121J8105J8533J8783J8376J7534
$$ 900646 919584 938064 956588 975299 993820 1011941 1030046 1048579 1067362 1085738 1103272
53484A103272J6822J6512J6464J6395J6210J6134J6511J7274J7722J7174J5758
$$ 1103272 1120094 1136606 1153070 1169465 1185675 1201809 1218320 1235594 1253316 1270490 1286248
53473A286248J4233J2971J1483R154O071K956M03j467k805l805m726n945p686
$$ 1286248 1300481 1313452 1324935 1334089 1340160 1343116 1343519 1342052 1339247 1335442 1330716 1324771 1317085
53460A317085r750j1573j2648j2964j2956j3054j3365j3817j4401j5164j6066
$$ 1317085 1307335 1295762 1283114 1270150 1257194 1244140 1230775 1216958 1202557 1187393 1171327
53449A171327j7011j7928j8664j8922j8528j7697j6810j5999j5173j4421j3953
$$ 1171327 1154316 1136388 1117724 1098802 1080274 1062577 1045767 1029768 1014595 1000174 986221
53438I86221j3573j2627j0770q501o592n104l436j368M31J264J400J763K691L548
$$ 986221 972648 960021 949251 940750 934158 929054 925618 924250 924681 925945 927345 929108 931799 935347
53424I35347L756L704M268N710P532R225J0693J1981J3162J4471J6079J7573J8288
$$ 935347 939103 942807 947075 952785 960317 969542 980235 992216 1005378 1019849 1035928 1053501 1071789
53411A071789J8295J8543J9666K1189K2385K3345K4639K6317K7993K9622L1443
$$ 1071789 1090084 1108627 1128293 1149482 1171867 1195212 1219851 1246168 1274161 1303783 1335226
53400A335226L3317L4896L6473L8780M1731M4181M5394M6072M7345M9195N0577
$$ 1335226 1368543 1403439 1439912 1478692 1520423 1564604 1609998 1656070 1703415 1752610 1803187
53389A803187N0879N0559N0353N0387N0257M9627M8493M7109M5760M4460M2770
$$ 1803187 1854066 1904625 1954978 2005365 2055622 2105249 2153742 2200851 2246611 2291071 2333841
53378B333841M0104L6499L2877L0177K8220K5833K2214J7854J3823J0452P138
$$ 2333841 2373945 2410444 2443321 2473498 2501718 2527551 2549765 2567619 2581442 2591894 2599032
53367B599032L176j691p481j4018k0657k6529l1373l5638l9563m2754m4978m6682
$$ 2599032 2602208 2600517 2593036 2579018 2558361 2531832 2500459 2464821 2425258 2382504 2337526 2290844
53355B290844m8189m8946m8377m7018m5986m5540m4975m3817m2235m0411l8400
$$ 2290844 2242655 2193709 2145332 2098314 2052328 2006788 1961813 1917996 1875761 1835350 1796950
53344A796950l6695l5981l6075l5916l4976l3856l3152l2506l1306k9631k7800
$$ 1796950 1760255 1724274 1688199 1652283 1617307 1583451 1550299 1517793 1486487 1456856 1429056
53333A429056k5618k2853k0093j8276j7443j6654j5148j3092j1127r675q825q644
$$ 1429056 1403438 1380585 1360492 1342216 1324773 1308119 1292971 1279879 1268752 1259077 1250252 1241608
53321A241608r305j0872j2845j4187j4156j3179j2384j2114j1593j0237q635p567
$$ 1241608 1232303 1221431 1208586 1194399 1180243 1167064 1154680 1142566 1130973 1120736 1112101 1104534
53309A104534o815n713m424l593l018j786K13K004L029L945N434P138Q429R482
$$ 1104534 1097719 1092006 1087582 1083989 1080971 1079185 1079398 1081402 1084431 1088376 1093810 1100948 1109377 1118859
53295A118859J0821J2333J3655J5132J7384J9964K1525K1564K1183K1605K2600
$$ 1118859 1129680 1142013 1155668 1170800 1188184 1208148 1229673 1251237 1272420 1294025 1316625
53284A316625K2981K2204K0818J9530J8458J7330J5932J4193J2160J0028P883
$$ 1316625 1339606 1361810 1382628 1402158 1420616 1437946 1453878 1468071 1480231 1490259 1498142
53273A498142N443K304j384m910p705r819j1564j3141j4788j6832j9185k1199
$$ 1498142 1503585 1505889 1504505 1499595 1491890 1482071 1470507 1457366 1442578 1425746 1406561 1385362
53261A385362k2451k3319k4426k5679k6452k6458k5935k5209k4646k4786k5697
$$ 1385362 1362911 1339592 1315166 1289487 1263035 1236577 1210642 1185433 1160787 1136001 1110304
53250A110304k6356k5552k3541k1913k1576k1815k1641k1161k0965k0978k0705
$$ 1110304 1083948 1058396 1034855 1012942 991366 969551 947910 926749 905784 884806 864101
53239H64101k0108j9472j8822j8175j7867j7891j7321j5359j2698j0921j0575
$$ 864101 843993 824521 805699 787524 769657 751766 734445 719086 706388 695467 684892
53228F84892j0729j0431r683q864q073p391p113p290p625q051q873j0114j1225
$$ 684892 674163 663732 654049 645185 637112 629721 622608 615318 607693 599642 590769 580655 569430
53215E69430j1877j2429j3204j3833j3796j3241j2717j2335j1772j0894r896q882
$$ 569430 557553 545124 531920 518087 504291 491050 478333 465998 454226 443332 433436 424554
53203D24554p796o753o109o082o524p075p375p256o910o769p026p398p494p296
$$ 424554 416758 410005 403896 397814 391290 384215 376840 369584 362674 355905 348879 341481 333987 326691
53189C26691p034o754o334n789n317n006m770m457l914l042k063j531j789k439
$$ 326691 319657 312903 306569 300780 295463 290457 285687 281230 277316 274274 272211 270680 268891 266452
53175B66452k748k488k062j833j795j911k254k647k607j961j211r40j129j363
$$ 266452 263704 261216 259154 257321 255526 253615 251361 248714 246107 244146 242935 241995 240866 239503
53161B39503j436j362j021l36L10L15l42j010j154r01o39n44o63j083j628j725
$$ 239503 238067 236705 235684 235348 235658 235973 235631 234621 233467 232566 231927 231383 230720 229637 228009 226284
53145B26284j022L5O67O93N91O38N47J34j69J90J058J641J370M63l22m35K2N09
$$ 226284 225262 225297 225964 226657 227248 227886 228433 228567 228398 228588 229646 231287 232657 233120 232798 232363 232385 232894
53127B32894O50O07P52J151J498J527J212O60J20N9P65J706J867R67r7m17k90
$$ 232894 233544 234151 234903 236054 237552 239079 240291 240951 241071 241130 241895 243601 245468 246435 246338 245921 245631
53110B45631o36j510j967j444n79l07p14j174j316j345j461j426q98J0P40Q71
$$ 245631 244995 243485 241518 240074 239495 239188 238474 237300 235984 234639 233178 231752 230854 230864 231604 232475
53094B32475N24J36q7k76n19o64n58k99q8m4k57p38j168j002j23Q48J231J029
$$ 232475 232999 233135 233048 232772 232253 231589 231031 230732 230644 230600 230343 229605 228437 227435 227312 228160 229391 230420
53076B30420O55K19l81r01q91l93P0J51q0o17j533k476k730k041r30l5M40N67
$$ 230420 231075 231294 230913 230012 229121 228728 228798 228949 228869 228252 226719 224243 221513 219472 218542 218507 218947 219514
53058B19514M61M06N73N52k03j219j239LJ132R66J67J21Q01R80K38n26o14l75
$$ 219514 219975 220381 220954 221506 221303 220084 218845 218848 219980 220946 221113 221234 222035 223015 223253 222727 222113 221738
53040B21738k40K7O19J072R50N87N21O17L76j03j49M93J137Q64l35j389j253j73
$$ 221738 221498 221525 222144 223216 224166 224753 225274 225891 226267 226164 226015 226508 227645 228509 228174 226785 225532 225359
53022B25359M95n9r82q02O17J869J775O52l98p77o00j48L01M42K54J33M08Q49
$$ 225359 225854 225795 224813 224011 224628 226497 228272 228924 228526 227749 227149 227001 227302 227744 227998 228131 228539 229388
53004B29388J050J050J157J373J436J301J200J216J150Q45L72o3k70j72J8o7m98
$$ 229388 230438 231488 232645 234018 235454 236755 237955 239171 240321 241166 241538 241475 241205 241033 241051 240984 240486
52987B40486q76q28m47m8K70M65L61Rn3N46J318J473J002N90O11Q83J314J949
$$ 240486 239610 238782 238335 238287 238557 239022 239383 239392 239339 239885 241203 242676 243678 244268 244879 245762 247076 249025
52969B49025K348J905R80P45J469J943J256K24O8M39O8j021j378l55Q08O75n32
$$ 249025 251373 253278 254258 255003 256472 258415 259671 259895 259963 260402 260470 259449 258071 257716 258524 259199 258667
52952B58667j541j754j655j747j935j914j667j426j404j605j748j402m95L94N12
$$ 258667 257126 255372 253717 251970 250035 248121 246454 245028 243624 242019 240271 238869 238374 238768 239280
52937B39280k26j090j317q06QP28J186J228O93k62j079j248q44l88k21k14j07
$$ 239280 239054 237964 236647 235841 235849 236577 237763 238991 239684 239422 238343 237095 236251 235863 235642 235428 235321
52920B35321J30L46M46L95J52j79l42k11j8n7k36k69j12M3K17O35J213J413R04
$$ 235321 235451 235797 236243 236638 236790 236611 236269 236058 236040 235983 235747 235478 235366 235409 235626 236261 237474 238887 239791
52901B39791L8n46o80p59j099j471j290k54J232K273K282J525P69M26K93Q9j05
$$ 239791 239829 239283 238603 237844 236745 235274 233984 233730 234962 237235 239517 241042 241811 242237 242530 242619 242514
52884B42514j37j65m44q95j161j038o14j02L02M91N50O87R15J015R50J092J655
$$ 242514 242377 242212 241768 240873 239712 238674 238060 237958 238260 238751 239301 239988 240903 241918 242868 243960 245615
52867B45615K170K014J320Q09P47O42J97j35L7J72n94k153l398l516k855k362
$$ 245615 247785 249799 251119 251928 252675 253317 253514 253379 253416 253588 252994 250841 247443 243927 241072 238710
52851B38710k509k951l034k388j234k30P9k37o98j080j589k225k438j823q66m66
$$ 238710 236201 233250 230216 227828 226594 226364 226443 226206 225508 224428 222839 220614 218176 216353 215487 215021
52835B15021p31q88m98r0j96l33L83J856K966K904J990J044M65J80J7j46k99j73
$$ 215021 214290 213402 212904 212814 212618 212285 212668 214524 217490 220394 222384 223428 223893 224073 224090 223944 223645 223472
52817B23472M78J309J484P34j26j10P69J752K423K930L203K680J077j059k840
$$ 223472 223950 225259 226743 227477 227351 227241 228010 229762 232185 235115 238318 240998 242075 241016 238176
52802B38176l836m148l979l373k388j299n83o13j243j797j664q76J7N69P00N39
$$ 238176 234340 230192 226213 222840 220452 219153 218570 217957 216714 214917 213253 212377 212394 212963 213663 214202
52786B14202L03L34P88J287J270O95Q9k05l62n11l51L18J053J163M80m78j027
$$ 214202 214505 214839 215627 216914 218184 218879 218968 218763 218401 217890 217539 217857 218910 220073 220553 220075 219048
52769B19048q22r1M73K80n07j104j001m29J92P39J067P58k13r52n33P48J596J271
$$ 219048 218226 218135 218608 218888 218381 217277 216276 215847 216039 216778 217845 218603 218390 217438 216905 217653 219249 220520
52751B20520L35k18r1K98N03N74R25J773K662K798K047J296J362J891J964J531
$$ 220520 220855 220637 220546 220844 221347 221921 222846 224619 227281 230079 232126 233422 234784 236675 238639 240170
52735B40170J405J813J902J069rk49M09J043R17J15p78j173q83l44k52p43j174
$$ 240170 241575 243388 245290 246359 246350 246101 246510 247553 248470 248585 247807 246634 245751 245407 245155 244412 243238
52718B43238j042p24q88j440j693j368q19l51O3L22Q9n72r77n67L58J008J032
$$ 243238 242196 241472 240584 239144 237451 236083 235264 234913 234976 235298 235387 234815 233838 233271 233629 234637 235669
52701B35669P57O11O05M49M7l06k46J56M37L41J75L60Q10J037Q16M26J40j41n78
$$ 235669 236426 237037 237642 238091 238138 237832 237586 237742 238179 238520 238695 239055 239865 240902 241718 242144 242284 242143 241565
52682B41565j006j107q68o58p78j075j094o10N1L30Ko61j235j457j187m42M08
$$ 241565 240559 239452 238584 237926 237148 236073 234979 234369 234420 234750 234752 234091 232856 231399 230212 229770 230178
52665B30178Q29P40P14J210J911K201K061J947J999J872J433R86P79P52Q55J106
$$ 230178 231007 231747 232461 233671 235582 237783 239844 241791 243790 245662 247095 248081 248860 249612 250467 251573
52649B51573J274J010M61J53J19k37j094j672j276l28J90l5n30q38q63n73M4Q09
$$ 251573 252847 253857 254318 254471 254590 254353 253259 251587 250311 249983 250173 250138 249608 248770 247907 247334 247378 248187
52631B48187J488K066K510K578K173J646J312Q87k2j169j946k219k225j902j054
$$ 248187 249675 251741 254251 256829 259002 260648 261960 262847 262825 261656 259710 257491 255266 253364 252310
52616B52310j33K5o53j356j574j593j631j348o63k26m56p35k59O77J050M60m63
$$ 252310 252177 252202 251549 250193 248619 247026 245395 244047 243384 243158 242702 241967 241708 242385 243435 243895 243432
52599B43432q93m85O11J804K265J643O16K12N80R05O10R9J07P18J333J338O30
$$ 243432 242539 242054 242665 244469 246734 248377 248993 249205 249785 250690 251300 251399 251506 252224 253557 254895 255525
52582B55525l31q46m86M27J020O88k92j075j169q26n94o45p36o76n99o30n32r
$$ 255525 255194 254348 253862 254289 255309 255997 255705 254630 253461 252635 252041 251396 250660 249984 249385 248755 248223 248214
52564B48214O91R24M63j29j76K79N86L45j71m62m33m97j015j732j926j245k08
$$ 248214 248905 249829 250292 250163 249987 250266 250852 251197 251026 250564 250131 249634 248619 246887 244961 243716 243508
52547B43508M35O18P85R48O07k15p07m61j88n84j109p34M08J172R99M88K83L57
$$ 243508 243943 244561 245346 246294 246901 246686 245979 245518 245330 244746 243637 242903 243311 244483 245482 245970 246253 246610
52529B46610N56R21J168P58j19m39K35R56P70J60K10Q51J068N99L32P98J326J125
$$ 246610 247166 248087 249255 250013 249894 249455 249690 250646 251416 251576 251786 252637 253705 254304 254636 255434 256760 257885
52511B57885N09M30J207K219K657K217J205K12m69j094j982k754k616j548o67
$$ 257885 258394 258824 260031 262250 264907 267124 268329 268541 268072 266978 264996 262242 259626 258078 257411
52496B57411q85j668j759r03j5K36J89L08L97J58n6K32P28O80Jn55m01K27P12
$$ 257411 256526 254858 253099 252196 252181 252417 252606 252914 253311 253469 253413 253645 254373 255053 255054 254499 254098 254325 255037
52477B55037O81J53n70r23m78M98J195J225J077J351J924K259K219K138K186K174
$$ 255037 255718 255871 255301 254378 253900 254398 255593 256818 257895 259246 261170 263429 265648 267786 269972 272146
52461B72146J918J391O13k92r18r51p66j121k170l145l300k768k243k069k075
$$ 272146 274064 275455 276068 275776 274858 273907 273141 272020 269850 266705 263405 260637 258394 256325 254250
52446B54250k009j848j652j465j307j070n10M10J227J309N67m32j034r87l53O01
$$ 254250 252241 250393 248741 247276 245969 244899 244389 244799 246026 247335 247902 247470 246436 245449 245096 245697
52430B45697J343J312N87M6L67J102J248N96n6j09J08J05M4K94O72Q02Q85J369
$$ 245697 247040 248352 248939 248985 249352 250454 251702 252298 252242 252133 252241 252346 252390 252684 253356 254158 255043 256412
52412B56412K070K421K531L162M568O186P617R043J0297J0481R134P104N453M025
$$ 256412 258482 260903 263434 266596 271164 277350 284967 294010 304307 314788 323922 331026 336479 340504
52398C40504J903j068m027o152p226p351o801o100n643n196m338l238k414j927
$$ 340504 342407 341339 337312 331160 323934 316583 309782 303682 298039 292843 288505 285267 282853 280926
52384B80926j414q49n33l73Q0Q48J489J841K118K217J807J146J021J556K025K068
$$ 280926 279512 278663 278130 277757 277837 278685 280174 282015 284133 286350 288157 289303 290324 291880 293905 295973
52368B95973K219K767L032K423J474J097J359J684J780J660J198M44J3M00J161
$$ 295973 298192 300959 303991 306414 307888 308985 310344 312028 313808 315468 316666 317110 317123 317523 318684
52353C18684J394R11K70j01j95N0P35J549J908J659J204R86J173J823K850L867
$$ 318684 320078 320989 321259 321158 320963 321013 321748 323297 325205 326864 328068 329054 330227 332050 334900 338767
52337C38767M503M845N267N870O430O756O802O614O500O962Q051R048R366R492
$$ 338767 343270 348115 353382 359252 365682 372438 379240 385854 392354 399316 407367 416415 425781 435273
52323D35273J0341J1914J3320J4050J4429J4791J5053J5312J6042J7312J8425
$$ 435273 445614 457528 470848 484898 499327 514118 529171 544483 560525 577837 596262
52312E96262J8752J8502J8331J8511J8840J9044J9036J8963J9114J9530J9702
$$ 596262 615014 633516 651847 670358 689198 708242 727278 746241 765355 784885 804587
52301H04587J9085J7969J7257J7246J7188J6336J4786J2907J0566P526M214J362
$$ 804587 823672 841641 858898 876144 893332 909668 924454 937361 947927 955453 959667 961029
52289I61029q79k849m556n617n991o186o539o760o423n642m897m435m091l638
$$ 961029 960150 957301 952745 947128 941137 934951 928412 921652 915229 909587 904690 900255 896164 892526
52275H92526l059k396j559m72O89J607K296L172M514N994P047P598Q015Q437Q642
$$ 892526 889467 887071 885512 885040 885729 887336 889632 892804 897318 903312 910359 917957 925972 934409 943051
52260I43051Q739R464J1302J3618J5121J5249J4687J4481J4894J5298J4947J3690
$$ 943051 951790 961254 972556 986174 1001295 1016544 1031231 1045712 1060606 1075904 1090851 1104541
52248A104541J1952J0246Q780P430N936M063J718r04l310m998n890o439p244q539
$$ 1104541 1116493 1126739 1135519 1142949 1148885 1152948 1154666 1153762 1150452 1145454 1139564 1133125 1125881 1117342
52234A117342r969j0903j1057j0828j0919j1580j2367j2697j2437j1821j1047
$$ 1117342 1107373 1096470 1085413 1074585 1063666 1052086 1039719 1027022 1014585 1002764 991717
52223I91717j0209r422q701p849o764n802n412n443n184m168k677j358n21Q2R32
$$ 991717 981508 972086 963385 955536 948772 942970 937558 932115 926931 922763 920086 918728 918207 918289 919221
52208I19221K182L369L770L249K499K277K596K998L347L827M371M650M601M468
$$ 919221 921403 924772 928542 931791 934290 936567 939163 942161 945508 949335 953706 958356 962957 967425
52194I67425M315M073L976M361M902M700L358J468j59j233j833k161k689l883
$$ 967425 971740 975813 979789 984150 989052 993752 997110 998578 998419 997186 995353 993192 990503 986620
52180I86620n386o044n340m291m361n723p130p330o233m813m120m298m348l220
$$ 986620 981234 975190 969850 965559 961198 955475 948345 941015 934782 929969 925849 921551 917203 913983
52166I13983j174M02P09M17M64P52P38O95J272K163K237J171Nj69N36J192J209
$$ 913983 912809 913211 913920 914337 914801 915553 916291 916986 918258 920421 922658 923829 923834 923665 924201 925393 926602
52149I26602P91O35J354K933M542N147M481L215K153J455P88n6q49j186r08k35
$$ 926602 927393 928028 929382 932315 936857 942004 946485 949700 951853 953308 954096 954040 953191 952005 951097 950862
52133I50862N20J321K375L722N136O560Q289J0509J2837J4640J5661J6223J6934
$$ 950862 951382 952703 955078 958800 963936 970496 978785 989294 1002131 1016771 1032432 1048655 1065589
52120A065589J8256K0046K1483K1850K1497K1471K2016K2210K1516K0793K0929
$$ 1065589 1083845 1103891 1125374 1147224 1168721 1190192 1212208 1234418 1255934 1276727 1297656
52109A297656K1238K0417J8681J7591J7865J8535J8472J7554J6058J4011J1667
$$ 1297656 1318894 1339311 1357992 1375583 1393448 1411983 1430455 1448009 1464067 1478078 1489745
52098A489745R671Q104O196L497N94k032m995q972j3196j6074j7030j6877j6484
$$ 1489745 1499416 1507520 1513716 1517213 1517807 1515775 1510780 1501808 1488612 1472538 1455508 1438631 1422147
52085A422147j5979j5257j4469j3786j3199j2725j2348j1630r947p416n118m025
$$ 1422147 1406168 1390911 1376442 1362656 1349457 1336732 1324384 1312754 1302807 1295391 1290273 1286248
52073A286248l904l575k169R7K303L793M758N993Q058J0703J3093J4552J5043
$$ 1286248 1282344 1278769 1276600 1276697 1279000 1282793 1287551 1293544 1301602 1312305 1325398 1339950 1354993
52060A354993J5008J4929J5068J5384J5553J5188J4214J2961J1673J0076P710
$$ 1354993 1370001 1384930 1399998 1415382 1430935 1446123 1460337 1473298 1484971 1495047 1502757
52049A502757M773K171M51r80l040n604p595q491r003r960j1198j2111j2714j3405
$$ 1502757 1507530 1509701 1510152 1509172 1506132 1500528 1492933 1484442 1475439 1465479 1454281 1442170 1429456 1416051
52035A416051j4046j4156j3956j4297j5457j6652j7111j6998j7005j7463j8177
$$ 1416051 1402005 1387849 1373893 1359596 1344139 1327487 1310376 1293378 1276373 1258910 1240733
52024A240733j8797j9074j9003j8794j8441j7432j5442j3236j2183j2576j3133
$$ 1240733 1221936 1202862 1183859 1165065 1146624 1129192 1113750 1100514 1088331 1075755 1062622
52013A062622j2600j1181r975r521r550r721r945j0285j0993j2397j4267j5654
$$ 1062622 1050022 1038841 1028866 1019345 1009795 1000074 990129 979844 968851 956454 942187 926533
$$ [...]
##END NTUPLES=NMR SPECTRUM
##END=
