
##TITLE=UV1258_M11_1332-1242_20_7409803_wlDLvFkFin
##JCAMPDX= 6.0         $$ Bruker NMR JCAMP-DX V2.0
##DATA TYPE= NMR SPECTRUM
##DATA CLASS= NTUPLES
##ORIGIN= BRUKER
##OWNER= Administrator
$$ 1.72 TOPSPIN		Version 2.1
$$ 2013-01-24 22:54:56.724 -0500  Administrator@X
$$ Compression mode = diff/dup
##.OBSERVE FREQUENCY= 400.02188249412
##.OBSERVE NUCLEUS= ^1H
##.ACQUISITION MODE= SIMULTANEOUS (DQD)
##.ACQUISITION SCHEME= undefined
##.AVERAGES= 8
##.DIGITISER RES= 22
##SPECTROMETER/DATA SYSTEM= spect
##.PULSE SEQUENCE= zg30
##.SOLVENT NAME= COFFEE_meoh
##.SHIFT REFERENCE= INTERNAL, COFFEE_meoh, 1, 14.98509
##AUDIT TRAIL= $$ (NUMBER, WHEN, WHO, WHERE, PROCESS, VERSION, WHAT)
$$ ##TITLE= Audit trail, TOPSPIN		Version 2.1
$$ ##JCAMPDX= 5.01
$$ ##ORIGIN= Bruker BioSpin GmbH
$$ ##OWNER= Administrator
$$ $$ E:\/data/COFFEE/nmr/UV1258_M11_1332-1242_20_7409803_wlDLvFkFin/10/pdata/1/auditp.txt
$$ ##AUDIT TRAIL=  $$ (NUMBER, WHEN, WHO, WHERE, PROCESS, VERSION, WHAT)
(   1,<2013-01-24 22:54:48.615 -0500>,<Administrator>,<X>,<go>,<TOPSPIN 2.1>,
      <created by zg
	started at 2013-01-24 22:53:42.630 -0500,
	POWCHK enabled, PULCHK disabled,
       configuration hash MD5:
       86 BA 57 50 F2 9D 5C 9B 26 00 A9 28 5F 66 2E 89
       data hash MD5: 64K
       9E 5A 0E 4D FA BD 7A 5C 60 05 B8 BC E2 0D DF 2F>)
(   2,<2013-01-24 22:54:51.661 -0500>,<Administrator>,<X>,<proc1d>,<TOPSPIN 2.1>,
      <Start of raw data processing
       efp LB = 0 FT_mod = 6 PKNL = 1 PHC0 = 0 PHC1 = 0 SI = 32K 
       data hash MD5: 32K
       E5 F8 0D DD D7 EB 6D 18 0B 97 91 43 6C B4 6A 4A>)
(   3,<2013-01-24 22:54:52.115 -0500>,<Administrator>,<X>,<proc1d>,<TOPSPIN 2.1>,
      <pk PHC0 = 96.08643 PHC1 = 0 
       data hash MD5: 32K
       E6 6A 29 AA 47 33 04 0F 99 EF C8 FB 9E E4 53 2D>)
(   4,<2013-01-24 22:54:52.349 -0500>,<Administrator>,<X>,<proc1d>,<TOPSPIN 2.1>,
      <abs ABSG = 1 
       data hash MD5: 32K
       05 0E 1C FC 13 A7 A6 34 F5 85 A5 DD 92 77 02 D9>)
(   5,<2013-01-24 22:54:52.490 -0500>,<Administrator>,<X>,<proc1d>,<TOPSPIN 2.1>,
      <abs ABSG = 2 
       data hash MD5: 32K
       55 90 66 50 5C C4 26 F8 66 F9 A0 6F 61 2D F0 D7>)
(   6,<2013-01-24 22:54:52.646 -0500>,<Administrator>,<X>,<proc1d>,<TOPSPIN 2.1>,
      <abs ABSG = 3 
       data hash MD5: 32K
       15 26 7C 8A A4 EF 0B 21 99 9B 70 23 02 46 77 7C>)
(   7,<2013-01-24 22:54:52.786 -0500>,<Administrator>,<X>,<proc1d>,<TOPSPIN 2.1>,
      <abs ABSG = 4 
       data hash MD5: 32K
       C6 D6 BA 4D 2F F5 93 E3 98 52 27 8D B3 12 61 1B>)
(   8,<2013-01-24 22:54:52.927 -0500>,<Administrator>,<X>,<proc1d>,<TOPSPIN 2.1>,
      <abs ABSG = 5 
       data hash MD5: 32K
       38 05 94 9A 95 2B 04 58 FD 54 5D 96 AD 9F E3 9B>)
$$ ##END=
$$ 
$$ $$ hash MD5
$$ $$ 87 7B 1F 72 C9 8E 59 E7 A2 C3 8F 7A 4F 94 A0 B6
##$RELAX= 
##$RELAX= 
##$RELAX= 
##$RELAX= 
##$RELAX= 
##$RELAX= 
##$RELAX= 
$$ Bruker specific parameters
$$ --------------------------
##$DU= <E:\>
##$EXPNO= 10
$$ [...]
150 150 150 150 150 150 150 150
##$TP07= 0
##$TPNAME0= <>
##$TPNAME1= <>
##$TPNAME2= <>
##$TPNAME3= <>
##$TPNAME4= <>
##$TPNAME5= <>
##$TPNAME6= <>
##$TPNAME7= <>
##$TPOAL= (0..7)
0.5 0.5 0.5 0.5 0.5 0.5 0.5 0.5
##$TPOFFS= (0..7)
0 0 0 0 0 0 0 0
##$TUNHIN= 0
##$TUNHOUT= 0
##$TUNXOUT= 0
##$USERA1= <user>
##$USERA2= <user>
##$USERA3= <user>
##$USERA4= <user>
##$USERA5= <user>
##$V9= 5
##$VALIST= <valist>
##$VCLIST= <CCCCCCCCCCCCCCC>
##$VD= 0
##$VDLIST= <DDDDDDDDDDDDDDD>
##$VPLIST= <PPPPPPPPPPPPPPP>
##$VTLIST= <TTTTTTTTTTTTTTT>
##$WBST= 1024
##$WBSW= 4
##$XGAIN= (0..3)
0 0 0 0
##$XL= 0
##$YL= 0
##$YMAX_a= 681654
##$YMIN_a= -579539
##$ZGOPTNS= <>
##$ZL1= 120
##$ZL2= 120
##$ZL3= 120
##$ZL4= 120
##$ABSF1= 14.98509
##$ABSF2= -5.573092
##$ABSG= 5
##$ABSL= 3
##$ALPHA= 0
##$AQORDER= 0
##$ASSFAC= 0
##$ASSFACI= 0
##$ASSFACX= 0
##$ASSWID= 0
##$AUNMP= <proc_prof1d_extract_pilot.lims>
##$AXLEFT= 0
##$AXNAME= <>
##$AXNUC= <1H>
##$AXRIGHT= 0
##$AXTYPE= 0
##$AXUNIT= <>
##$AZFE= 0.1
##$AZFW= 0.1
##$BCFW= 0
##$BC_mod= 0
##$BYTORDP= 0
##$COROFFS= 0
##$CY= 15
##$DATMOD= 1
##$DC= 0
##$DFILT= <>
##$DTYPP= 0
##$F1P= 0
##$F2P= 0
##$FCOR= 0.5
##$FTSIZE= 32768
##$FT_mod= 6
##$GAMMA= 0
##$GB= 0
##$INTBC= 1
##$INTSCL= 1
##$ISEN= 128
##$LB= 0
##$LEV0= 0
##$LPBIN= 0
##$MAXI= 10000
##$MC2= 0
##$MEAN= 0
##$ME_mod= 0
##$MI= 0
##$NCOEF= 0
##$NC_proc= -8
##$NLEV= 6
##$NOISF1= 0
##$NOISF2= 0
##$NSP= 0
##$NTH_PI= 0
##$NZP= 0
##$OFFSET= 14.98509
##$PC= 1
##$PHC0= 96.08643
##$PHC1= 0
##$PH_mod= 1
##$PKNL= yes
##$PPARMOD= 0
##$PPDIAG= 0
##$PPIPTYP= 0
##$PPMPNUM= 2147483647
##$PPRESOL= 1
##$PSCAL= 4
##$PSIGN= 0
##$PYNMP= <proc.py>
##$REVERSE= no
##$SF= 400.02
##$SI= 32768
##$SIGF1= 0
##$SIGF2= 0
##$SINO= 400
##$SIOLD= 32768
##$SPECTYP= <>
##$SREGLST= <1H.CDCl3>
##$SSB= 0
##$STSI= 32768
##$STSR= 0
##$SW_p= 8223.68421052631
##$SYMM= 0
##$S_DEV= 0
##$TDeff= 65536
##$TDoff= 0
##$TI= <>
##$TILT= no
##$TM1= 0
##$TM2= 0
##$TOPLEV= 0
##$USERP1= <user>
##$USERP2= <user>
##$USERP3= <user>
##$USERP4= <user>
##$USERP5= <user>
##$WDW= 1
##$XDIM= 32768
##$YMAX_p= 480307068
##$YMIN_p= -715577
##$CURPLOT= <Network HP LaserJet P1505>
##$CURPRIN= <$Network HP LaserJet P1505>
##$DFORMAT= <normdp>
##$LAYOUT= <+/1D_H.xwp>
##$LFORMAT= <normlp>
##$PFORMAT= <normpl>
##$SURQMSG= 1
$$ End of Bruker specific parameters
$$ ---------------------------------
##NTUPLES= NMR SPECTRUM
##VAR_NAME=  FREQUENCY,     SPECTRUM/REAL,   SPECTRUM/IMAG
##SYMBOL=    X,             R,               I
##VAR_TYPE=  INDEPENDENT,   DEPENDENT,       DEPENDENT
##VAR_FORM=  AFFN,          ASDF,            ASDF
##VAR_DIM=   32768,         32768,           32768
##UNITS=     HZ,            ARBITRARY UNITS, ARBITRARY UNITS
##FACTOR=    0.250966925370066, 1,           1
##FIRST=     8223.43324360094, 26963,        -294538
##LAST=      0,             -115351,         -114493
##MIN=       0,             -715577,         0
##MAX=       8223.43324360094, 480307068,    0
$$ Real data points
##PAGE= N=1
##DATA TABLE= (X++(R..R)), XYDATA
$$ [...]
19527i4825d2077G8494J3871i5031I56d05159a94183q5860c8048j03485j44533
19516b86066L1170a7461j6405A30828D8249a33540r6086j78230a3306A82733J5615
19505A98348O4952D017e44011a81733C26996a86731e6739O131h011A11826A9988
19493c388A27683a51585b5622j02641j90297J07541f3654j34829K7801G9000B4805
19481b62100A37671c29915C7830J5123J80602a14346j05431D72669C4205J7553
19471E1758P5256b73105c7918m3185F5182J6160a62100j05908A11458b53554M6624
19460b06930M5796e9317J9563I1398a10571k0321L6345K8194j38685j15087J25025
19449a95100b1984m8095k3676A41923K18D6912a06034A69626k4518b78812B1348
$$ plain form
19527 -94825 -42077 78494 92365 -95031 956 -405159 -194183 -280043 -38048 -141533 -286066
19516 -286066 -254896 -17461 -33866 130828 48249 -133540 -229626 -407856 -13306 182733 198348
19505 198348 263300 4017 -544011 -181733 326996 -186731 -56739 -50608 -8011 111826 19988
19493 -3388 127683 -151585 -25622 -128263 -318560 -211019 -63654 -198483 -170682 79000 24805
19481 -262100 137671 -329915 37830 52953 233555 -114346 -219777 472669 34205 51758
19471 51758 127014 -273105 -37918 -81103 65182 81342 -162100 -268008 111458 -253554 -206930
19460 -206930 -161134 -59317 -39754 91398 -110571 -130892 -94547 -66353 -205038 -320125 -195100
19449 -195100 -21984 -70079 -93755 141923 142141 46912 -106034 169626 145108 -278812 21348
19437h4597A18489b15485d0067C8807R1591a77539A13169b51313B87634q8921
19427A98713b83974I3310a86900A72486b81365M5887c1784j04792A92725a2150
19416b39409R0780r411l3513B6070e4398b1097A6412c31159A21244a20629j49249
19405b69878J05036B20447B0604f11898a59061d4826j42179E4699a77134F5137
19394C35804j49757a44981A0845d6472D7493b61435A43982c06148a38104j09016
19384b47120C9534a44487e3270B9346f4213r2892c0772D0111e5764j71322n3132
19373b80218d4563E9724J4441a55267K9052P715E0070a41426k2150P9341A82397
19361A70867E9267b33316d5687A42041J22710d7746A22879l1977M4616b75357
$$ plain form
19437 -84597 118489 -215485 -40067 38807 130398 -177539 113169 -251313 287634 198713
19427 198713 -283974 93310 -186900 172486 -281365 -235478 -31784 -136576 192725 -12150
19416 -239409 -148629 -158040 -191553 26070 -54398 -21097 16412 -331159 121244 -120629 -269878
19405 -269878 -164842 220447 20604 -611898 -159061 -44826 -187005 54699 -177134 65137
19394 335804 186047 -144981 10845 -46472 47493 -261435 143982 -306148 -138104 -247120
19384 -247120 39534 -144487 -53270 29346 -64213 -157105 -30772 40111 -55764 -227086 -280218
19373 -280218 -44563 59724 74165 -155267 -126215 -118500 50070 -141426 -163576 -84235 182397
19361 170867 59267 -233316 -45687 142041 264751 -47746 122879 90902 135518 -275357
19350c53725a10263a2482B44676a62382j8967l1353g8442J7342m9529k33581A04130
19338c1349j03241h077n3406A02223e22B81960f436k67414j3659A51781b0138
19326G2810c13848i9168j99038C7826J7020b02301a00676K7084e687G8006a89734
19314F0574K76556a31663m63668D5723b6411j61205e8274p1395A25086c38568
19303a23727B95291b33862A07543N9714B0818c25211B75479A17344c08506b6594
19292b35915a2755C2970c1985B26289b41249h723l23583P5358J5612k09379B2339
19280a07582G1839K1492d5177k7312q0787A61376a59771K3105K4659q3272A20353
19268b52093b7114k74235J45267g4522b9083C1773a50718C19148d2299A70459
$$ plain form
19350 -353725 -110263 -12482 244676 -162382 -181349 -212702 -78442 -61100 -110629 -344210 104130
19338 -31349 -134590 -8077 -61483 102223 -522 281960 -6436 -273850 -287509 151781 -20138
19326 72810 -313848 -99168 -298206 37826 54846 -202301 -100676 -73592 -5687 78006 -189734
19314 60574 337130 -131663 -595331 45723 -26411 -187616 -58274 -129669 125086 -338568
19303 -123727 295291 -233862 107543 167257 20818 -325211 275479 117344 -308506 -26594
19292 -235915 -12755 32970 -31985 226289 -241249 -8723 -332306 -256948 -241336 -450715 22339
19280 -107582 71839 93331 -45177 -72489 -153276 161376 -159771 -136666 -112007 -195279 120353
19268 -252093 -27114 -301349 -156082 -74522 -29083 31773 -150718 319148 -42299 170459
19257b11253p54j04043J11484m1507G3094b64173B6992e4143q0423A72668p5456
19246I7212k7947c87672A21403e0517C05877C8646h175A58016a78018k09724I9433
19234d32126F958b09300A22770f5965B0681P160h461F2277a9725p865A00227a38501
19221A62322a75134e6272J0526C9917K35927d7168K3279j97186P0300j45565a42285
19209h989A82803b16062E7877i3446A55118F6909Q5212h1504K9738b315B4962
19197b00773C23682a81614g996k41015a17990b7493j30787k72736C3002h5485
19186A20939a39583K0059A89396j4272c63512A07085a77922B4587a07215A34935
19175b10543P5910G4797a82863D4597c1330I8685c16194k4202D586L3445O519
$$ plain form
19257 -211253 -212007 -316050 -204566 -246073 73094 -264173 26992 -54143 -134566 172668 97212
19246 97212 69265 -387672 121403 -50517 305877 38646 -8175 158016 -178018 -387742 99433
19234 -432126 6958 -209300 122770 -65965 20681 27841 -8461 62277 -19725 -27590 100227 -138501
19221 162322 -175134 -56272 -45746 39917 275844 -47168 -23889 -221075 -150775 -296340 -142285
19209 -8989 182803 -216062 57877 -93446 155118 66909 152121 -81504 -51766 -2315 24962
19197 -200773 323682 -181614 -7996 -249011 -117990 -27493 -158280 -431016 33002 -85485
19186 120939 -139583 -119524 189396 175124 -363512 107085 -177922 24587 -107215 134935
19175 -210543 -134633 74797 -182863 44597 -31330 98685 -316194 -340396 4586 38031 44550
19164D4550b90809a19414j00815d6026j51764a2548F3888b76725a09271b2484
19153b77164e934B52838g8077I3754d17413b07487N4724M5721E1815D719b06436
19141b38564A732a30260I1124i1579j23013A2548e1454C4408a09617C48460a65472
19129A29506E7341B6596b57877H412a50256H4761M8803d36461a45217C34434A58261
19117A07551c94806M6564a1503j18282m0483j34515B31942J6541C076b2739j96181
19106b18920E6273k5463h8322E0061h9452l0899J5432k65045G6528j9365a84882
19094a71165j91977A9646K388M1829c97554D6882K86182b8593m07904b6238j12101
19083a38339m62932a78793c6713B94635P114a74412N9336k6033A29472e0771j62503
$$ plain form
19164 44550 -290809 -119414 -220229 -46026 -197790 -12548 63888 -276725 -109271 -22484
19153 -277164 -5934 252838 -78077 93754 -417413 -207487 -152763 -107042 51815 4719 -206436
19141 -238564 1732 -130260 91124 -91579 -214592 12548 -51454 34408 -109617 348460 -165472
19129 129506 57341 26596 -257877 8412 -150256 84761 133564 -436461 -145217 334434 158261
19117 107551 -394806 -348242 -11503 -129785 -170268 -304783 231942 248483 3076 -22739 -218920
19106 -218920 56273 30810 -88322 50061 -89452 -120351 -104919 -369964 76528 57163 -184882
19094 -171165 -363142 19646 22034 63863 -397554 46882 333064 -28593 -436497 -26238 -138339
19083 -138339 -601271 -178793 -36713 294635 301749 -174412 -115076 -141109 129472 -50771 -213274
19072b13274B56672A21126L6363g2523j849b7863k7114l0401A2409L19796A03525
19060b24113q0506A5739a7639q9230C1905b38294j40018a6527D11387r6392d29100
19048a8975C5331a30243F2097a06715C09516g7008C0056k625b20136Q4208O2930
19037g2998B48415b14296J00386j37484B5453L0749J8759O2722a18789B63481
19026A97675I8132M7282J15788J16063j73076A8738O5928C3478J14859a14285
19015a19478A02294e9281l3598o944A36084R2082c12743D8373j3955a71650P4717
19004i6933l5747e0328C38704g2182B8055i9252k96571B17207a31912K3958l02811
18993d10765a8071E5666b78809H0392b34100L8598J00M5254C03813b12378g6885
$$ plain form
19072 -213274 256672 121126 157489 -72523 -74372 -27863 -54977 -85378 12409 332205 103525
19060 -224113 -304619 15739 -17639 -106869 31905 -238294 -378312 -16527 411387 314995 -429100
19048 -18975 35331 -130243 62097 -106715 309516 -77008 30056 27431 -220136 -135928 -72998
19037 -72998 248415 -214296 -113910 -251394 25453 56202 74961 137683 -118789 263481
19026 197675 98132 145414 261202 377265 204189 18738 84666 33478 148337 -114285
19015 -119478 102294 -59281 -92879 -99823 136084 228166 -312743 48373 34418 -171650 -96933
19004 -96933 -132680 -50328 338704 -72182 28055 -99252 -395823 217207 -131912 -107954 -410765
18993 -410765 -18071 55666 -278809 80392 -234100 -195502 -195402 -150148 303813 -212378 -76885
18981a07261J8961j95368h6996k20230a27300L3328A74640i5055G9480b26956
18970a75844A22487a23992d318l16446g9433k13238a09238B93237i2190D2764
18959A38939F5105f0044K7520k11915B28636A03007h7487j01503B47441b84454
18948B58943i8685A28565B2063c1605B09651c9761d666B6132a29702H8639b7722
18936A39784L2959a44832n5232M4220j40759J45491a2151B9778O8099a30183l0852
18925a61035H2058c71B00640R731C4828I144a7827j6690A04590R395a52093O8322
18913h3771D139a82864K8354I1458b97264d4131C8351c54868B56568n7793E9757
18901a59007D0808J4j1907Q5069h7895j16476R2724c7516j0755c516j70195O3347
$$ plain form
18981 -107261 -88300 -283668 -86996 -307226 -127300 -93972 174640 -95055 79480 -226956
18970 -175844 122487 -123992 -4318 -320764 -79433 -292671 -109238 293237 -92190 42764
18959 138939 65105 -60044 -32524 -244439 228636 103007 -87487 -188990 247441 -284454
18948 258943 -98685 128565 22063 -31605 209651 -39761 -4666 26132 -129702 88639 -27722
18936 139784 172743 -144832 -200064 -155844 -296603 -151112 -12151 29778 97877 -130183 -161035
18925 -161035 82058 -371 200640 210371 34828 9144 -17827 -34517 104590 113985 -152093 -83771
18913 -83771 4139 -182864 -154510 91458 -297264 -44131 38351 -354868 256568 198775 59757
18901 -159007 40808 40822 28915 113984 -87895 -204371 -111647 -37516 -48271 -3516 -173711 -110364
18889a10364F2301I389a10500M5577k1106n1020q0163q5615L1673a32407B1651
18877f3011k83441A02090b13372e6150n62704a46685A53482a53156E84a73979
18866f7623l68093a06144F3157b82410a8429F5732a83085K3136k8904c3455l64287
18855c97742A7320L08296a44820B13776H8807d8224q2438A45686l8426O0817P7166
18844B45243j04411a60971a1712q4077p5197d0393C9490d0591E3709a17568d2737
18832c09574A8314o310d25335J55668c8424A59282B1157c54323J15779r5277C29283
18820B9447a1797B78002C82K33794q2935j3764a67747j04852F3960b89099L2610
18809b56489I4300B2420K35885a62456D040b2193C44589a55563K6638A05657a28400
$$ plain form
18889 -110364 62301 9389 -110500 -64923 -86029 -137049 -217212 -302827 -271154 -132407 21651
18877 -63011 -346452 102090 -213372 -56150 -618854 -146685 153482 -153156 584 -173979
18866 -67623 -435716 -106144 63157 -282410 -18429 65732 -183085 -159949 -188853 -33455 -397742
18855 -397742 17320 325616 -144820 213776 88807 -48224 -130662 145686 107260 168077 245243
18844 245243 140832 -160971 -11712 -95789 -170986 -40393 39490 -40591 53709 -117568 -42737
18832 -309574 18314 12004 -425335 -269667 -38424 159282 21157 -354323 -238544 -333821 329283
18820 29447 -11797 278002 382 234176 151241 137477 -167747 -272599 63960 -289099 -256489
18809 -256489 94300 22420 258305 -162456 4040 -22193 344589 -155563 -128925 105657 -128400
18797b21840c2252k62539C234a77652G2643b49473O8714h8154j71315g1517G7023
18785d78236a97284g3360A64341p080a8216H9433q7i3181B05952I9684i2749F599
18772d961k23629a05620K7228j34332o2590A06062c10265g5268A29610c71635
18761b01119O0157O728o9638j61863c0541j15278I3018i1864l49344G4388l5734
18750C8654a18356d837k70246e7936k2703B63616j13750Q844a53382j4918D7401
18738c87834A30916L3575m577K02150a56556j318C28736h4791K8408F9498c44613
18726I8494b74199A5022M4130a96180i564o0233j71642A00198a6696k0816C01993
18714A2030e2769B625J41088c35624B8460a92536B5266J35629b45557a20037o7749
$$ plain form
18797 -221840 -32252 -294791 3234 -177652 72643 -249473 -180759 -88154 -259469 -71517 77023
18785 -478236 -197284 -73360 164341 157261 -18216 89433 89346 -93181 205952 99684 -92749 6599
18772 -4961 -228590 -105620 -78392 -212724 -275314 106062 -310265 -75268 129610 -371635
18761 -201119 -140962 -134234 -203872 -365735 -30541 -145819 93018 -91864 -441208 74388 38654
18750 38654 -118356 -4837 -275083 -57936 -80639 263616 149866 158710 -153382 -168300 47401
18738 -387834 130916 164491 159914 362064 -156556 -157874 328736 -84791 -56383 69498 -344613
18726 98494 -274199 15022 59152 -196180 -9564 -69797 -241439 100198 -16696 -37512 301993
18714 12030 -52769 2625 143713 -335624 28460 -192536 25266 160895 -245557 -120037 -187786
18703a87786C866M3302J56561a66957h637k89986J8128O6472a9984j07636b3543
18691A08168J7924L576a43399A30b38843I5634N161A4689b90314m6331a59476
18679i6045A85111J7956f4368j25170j3365K7901c4016A48135Q0026A9664b60156
18667F2266a32821f394C34182a22990n0961A71453a70558b8540o7127A78374a28219
18655C78357A71973b60897R3575B95061a04182M7631C4428e3684l1152B25582
18644b74771a13487a3272j23673N1471B9474M30626D2131N2205d9991A24933a38473
18632a62617j28365P2405d637B3348r220a54913j01878a07993J2068O361B8063
18620D124h0562k17473M1826J7802N2598a83l01725g4960B44202d55069A95348
$$ plain form
18703 -187786 3866 47168 203729 -166957 -8637 -298623 -280495 -214023 -19984 -127620 -23543
18691 108168 126092 129668 -143399 130 -238843 95634 100795 14689 -290314 -336645 -159476
18679 -96045 185111 203067 -64368 -189538 -202903 -175002 -34016 148135 228161 19664 -260156
18667 62266 -132821 -6394 334182 -122990 -173951 171453 -170558 -28540 -95667 178374 -128219
18655 378357 171973 -260897 -167322 295061 -104182 -56551 34428 -53684 -84836 225582
18644 -274771 -113487 -13272 -136945 -85474 29474 460100 42131 94336 -49991 124933 -138473
18632 -162617 -290982 -218577 -4637 23348 14128 -154913 -256791 -107993 -95925 -89564 28063
18620 4124 -80562 -298035 -256209 -238407 -185809 -183 -301908 -74960 244202 -455069 195348
18608b48645j6249C5706L6489Q4759k2695b99663H1313k8998a04650k16753a38208
18596a03146F6812i3876o061D64g1583A59582c5158j09249F3958J32421J58179
18585C54558b67126a08605A14887e4718A53482a35302A39145J28204a26644K7698
18575i8946F0483N784b53174m5057A82818a44418a2976j56746k08445f3133D1270
18563d90110h7672H0054a58595g9196k09872B11624I312J28297a36824A10788
18552b50131A25541b47207J3062E9940a81726q6279a26174B41864a76703E7196
18541a80921A866K12720o0076a33272M1934m8928A20451b05271n1435b4420A55738
18529d0979m625A45785f2819j46658d4000A07054f769A421a26336e6954C8379
$$ plain form
18608 -248645 -264894 35706 72195 156954 134259 -299663 81313 52315 -104650 -321403 -138208
18596 -103146 66812 -93876 -99937 464 -71583 159582 -35158 -144407 63958 196379 354558
18585 354558 -267126 -108605 114887 -54718 153482 -135302 139145 267349 -126644 -98946
18575 -98946 60483 66267 -253174 -298231 182818 -144418 -12976 -169722 -378167 -63133 41270
18563 -490110 -87672 80054 -158595 -79196 -289068 211624 9312 137609 -136824 110788
18552 -250131 125541 -247207 -234145 59940 -181726 -268005 -126174 241864 -176703 57196
18541 -180921 1866 214586 154510 -133272 -91338 -140266 120451 -205271 -256706 -24420 155738
18529 -40979 -45604 145785 -62819 -209477 -44000 107054 -6769 1421 -126336 -56954 38379
18517a54110A96548a44656N2743j88615A88753d87082F995L3357a35021j30831
18507b65852A60037l2563I455b06057B07198n2954a8637G422K0669J17973c00101
18495A8614l054O8541a73075C9415b46635R0782j06865m9113A2998J58123c42235
18483B93890f1969j32184h2619r6394A28781o2871R0225b4946j05063J8209k01593
18472c13393e1820K1399p1119r0302n1803d2827r033A19993d7131b1073A10676
18460a53385j15351F7747a69472P4267G3991N2215c1031H6741O9930c03810f9195
18448G2576a89683c6668A87609n2762a17214B86129d26490J28673a18582A01680
18437b300A74683b17882f2282B1587B745J25519a43232A07904a97565A14696a04136
$$ plain form
18517 -154110 196548 -144656 -91913 -280528 188753 -487082 6995 40352 -135021 -265852
18507 -265852 160037 127474 9455 -206057 207198 154244 -18637 7422 28091 146064 -300101
18495 18614 15560 84101 -173075 39415 -246635 -155853 -262718 -311831 12998 171121 -342235
18483 293890 -61969 -194153 -82619 -179013 128781 65910 156135 -24946 -130009 -111800 -313393
18472 -313393 -51820 -30421 -101540 -191842 -243645 -42827 -51860 119993 -47131 -21073 110676
18460 -153385 -268736 67747 -169472 -95205 73991 126206 -31031 86741 156671 -303810 -69195
18448 72576 -189683 -36668 187609 134847 -117214 286129 -426490 -297817 -118582 101680
18437 -2300 174683 -217882 -62282 21587 2745 128264 -143232 107904 -197565 114696 -104136
18425H0814d9579D4315i9258k10240E7522A0893h5199o9125G5920b7010B07505
18413A38207o6951k8151Q0401a04444N837n044j9947D8746R3174J81484n4796
18402B68608b13566J06256k9663k6983a5883F3181a71068d2452A82376a36011
18391b48176b2238C40132A53599d44273I9293a16306G9954b82380a14171G226
18380D6128g1605k13964C1947b69369Q0760A89691a85945B0524L8642b6692A71213
18368E9335J27467b0879D4955b2384B76118F6315b24673a9046D4081a00868m7954
18357a48822e6879j51789J0634c8114A93437q5135a60332j48706F8336i536A7394
18345b75681h787j18745j19670A54031a68292f6554D9658I977K5147a93126o1571
$$ plain form
18425 80814 -49579 44315 -99258 -309498 57522 10893 -85199 -154324 75920 -27010 207505
18413 138207 71256 43105 123506 -104444 -98607 -103651 -123598 48746 141920 323404 268608
18402 268608 -213566 -107310 -136973 -163956 -15883 63181 -171068 -42452 182376 -136011
18391 -248176 -22238 340132 153599 -444273 99293 -116306 79954 -282380 -114171 7226
18380 46128 -71605 -285569 31947 -269369 -188609 189691 -185945 20524 59166 -26692 171213
18368 59335 186802 -20879 44955 -22384 276118 66315 -224673 -19046 44081 -100868 -148822
18357 -148822 -56879 -208668 -198034 -38114 193437 108302 -160332 -309038 68336 -9536 17394
18345 -275681 -8787 -127532 -247202 154031 -168292 -66554 49658 9977 35124 -193126 -254697
18334b54697j3817A9241R5248d9193C1925G374d5183l49546A21364a08365l1619
18323a39984M354B14120k6822k0623e5134n304l1881k01753D020c4135C58664
18311a19043A72188p7458R3969a73792f5197C29149A33186i2886A7209J7055I180
18299a91472A03141g5413R595j18091e4191C0153R5409J13714F5093g3215D649
18287C05367j49154b41260D4013b46781B29760a45552a8402n8799I2158b23999
18276B21379E6217d888B54371b40663j68698A35451Q4682r7828b65264M9986B23475
18264B16785b48929J02334M5330G7818b99061B1188a14791p8341O9762B75978
18253E1252a30406M0791C57519b75515b365o6429D1035a40711f0362H4564m181
$$ plain form
18334 -254697 -268514 19241 114489 -49193 31925 7374 -45183 -394729 121364 -108365 -139984
18323 -139984 -135630 214120 187298 166675 -55134 -60438 -92319 -294072 4020 -34135 358664
18311 -119043 172188 94730 188699 -173792 -65197 329149 133186 -92886 17209 34264 9180
18299 -191472 103141 -75413 -65818 -183909 -54191 30153 125562 239276 65093 -73215 4649
18287 305367 156213 -241260 44013 -246781 229760 -145552 -18402 -77201 92158 -223999
18276 221379 56217 -4888 254371 -240663 -409361 135451 220133 122305 -265264 -215278 223475
18264 216785 -248929 -146595 -101265 77818 -299061 21188 -114791 -193132 -123370 275978
18253 51252 -130406 -89615 357519 -275515 -2365 -68794 41035 -140711 -60362 84564 80383
18242H0383a1193A22013b1929A20557i0983p7685e5789A14335a70638B6499h2779
18230f6007k13275A47235a31001A33097I239g0762j11408B74529c4885C37231
18219C3208e4231j56319D1982a91156o7529F7122d6054B02734O9788B6788a2611
18207d43096A72448l7945A0027J1209a2583n15220E0820a18812l86380A12055
18196a92198A81808a01941j15750a01191r2564C8718d24583E9188e8745D7114
18185b06291A54872a28508A60203j0172a22743K9230A31088a55698n8859a2672
18174b1702A46675D7907i1741C09417f1273D6325p380A3009R7295O827m3186d48463
18161a23101G1370d6916D0070f8489m9889l9284B9388a0241A60771h056A11809
$$ plain form
18242 80383 -11193 122013 -21929 120557 -90983 -168668 -55789 114335 -170638 26499 -82779
18230 -66007 -279282 147235 -131001 133097 9239 -70762 -182170 274529 -34885 337231
18219 33208 -54231 -210550 41982 -191156 -258685 67122 -46054 202734 272522 26788 -12611
18207 -443096 172448 134503 10027 21236 -12583 -527803 50820 -118812 -505192 112055
18196 -192198 181808 -101941 -217691 -101191 -193755 38718 -424583 59188 -58745 47114
18185 -206291 154872 -128508 160203 150031 -122743 -93513 131088 -155698 -214557 -12672
18174 -21702 146675 47907 -91741 309417 -61273 46325 38945 13009 110304 117131 73945 -448463
18161 -123101 71370 -46916 40070 -68489 -118378 -157662 29388 -10241 160771 -8056 111809
18149E2329c74636J9708J58222R2211b3290M045k77434E8298b23017j43351J20493
18138b45875B3162c46935A16775a51720A03217R721K3460a85954A55480K9342
18128A84822a87807m7368p7452J35977A34511b26440A5621e9341B45883g6387
18117i1174D77a83016h7077j78511a22320n1121C9511L42591H5466k5355a38815
18105g6092A0180P0340a91108P632c0254j99690A02631a30861C59263j15364A17925
18093C65335A9956a32064I8938J38531A9554f2651j61405D2344g0018B67595A07350
18081a52641A19027b59892i7899A27177b63096A04015b7235D695R1345h5334n0021
18070a35355A09534L6319J7543a26134F1659K556Q0442K53461b32696Q7025J7390
$$ plain form
18149 52329 -374636 -354928 -196706 -104495 -23290 -19245 -296679 58298 -223017 -366368 -245875
18138 -245875 23162 -346935 116775 -151720 103217 112938 136398 -185954 155480 184822
18128 184822 -187807 -235175 -312627 -176650 134511 -226440 15621 -59341 245883 -76387
18117 -91174 477 -183016 -87077 -265588 -122320 -173441 39511 382102 85466 60111 -138815
18105 -76092 10180 80520 -191108 -183476 -30254 -229944 102631 -130861 359263 243899 117925
18093 365335 19956 -132064 98938 237469 19554 -62651 -224056 42344 -70018 267595 107350
18081 -152641 119027 -259892 -97899 127177 -263096 104015 -27235 4695 96040 -85334 -135355
18070 -135355 109534 145853 163396 -126134 61659 64215 144657 398118 -232696 -145671 -128281
18059a28281a0268A53225p1935J96444e7039a0641F8098e7183A36419g1782k6002
18048i7784q2387A63285F6483d004B27555d3149k12365d628j6397A13231i5304
18036B60769b75286A05921c6261E8991N5881h253r3952M5180C33310a1842j0873
18025b2715j56511B03626d7283k64855H4172a17222G4996J92590a63794l2936
18015a96730A08855J5360f0728j77553q3317e0076F9190a08968d3059C6313J39240
18004A75553J52467A33512h7601b2936k26232c9735J8960A27073b7473q7625A58857
17992A10237b14582K8801C904O171a2334k56818J20599A57131N9795R437d46871
17980a29924r8533k8320j20794B34555r8863a6565o6083b4761O694M162E0839
$$ plain form
18059 -128281 -10268 153225 81290 277734 -57039 -10641 68098 -57183 136419 -71782 -97784
18048 -97784 -180171 163285 66483 -4004 227555 -43149 -255514 -4628 -21025 113231 -95304
18036 260769 -275286 105921 -36261 58991 114872 -8253 -102205 -57025 333310 -11842 -22715
18025 -22715 -179226 203626 -47283 -312138 84172 -117222 74996 267586 -163794 -196730
18015 -196730 108855 124215 -60728 -238281 -321598 -50076 69190 -108968 -43059 36313 175553
18004 175553 328020 133512 -87601 -22936 -249168 -39735 -20775 127073 -27473 -115098 158857
17992 110237 -214582 -185781 3904 10075 -12334 -269152 -148553 157131 216926 226363 -446871
17980 -129924 -228457 -256777 -377571 234555 135692 -16565 -82648 -24761 -18067 -13905 50839
17968A15548h6895o1537C39617a77448A8549i8545A15031a72657b4335p9836b0447
17956b8757A83272K4679c3078a774A06050a28679G2695b6795l19549D647e6164
17944c06254b9979B29621a54410e2831E4265J24940e6256B06155i1550j44485
17934b36035N2821G4387E624a676r3153m2643E7979a61457g2131p5506A91398
17922B08796B5612a47849r0990F2269d25393G3261b643l35723J62415g6234A00456
17910b5211A04518d5781k9488j56413C50938G1950J57343b7342n4698l0653j35525
17899b48218A91416b21936a0903B4330c28060A65639L4591d7497A53988A5648
17888a73743C35421a0597r5558q2445N1927F2359g6340m5707L0998k5564k01917
$$ plain form
17968 115548 -86895 -148432 339617 -177448 18549 -98545 115031 -172657 -24335 -104171 -20447
17956 -28757 183272 207951 -33078 -1774 106050 -128679 72695 -26795 -346344 4647 -56164
17944 -306254 -29979 229621 -154410 -52831 54265 179205 -56256 206155 -91550 -236035
17934 -236035 -183214 74387 5624 -1676 -94829 -137472 57979 -161457 -72131 -147637 191398
17922 208796 25612 -147849 -238839 62269 -425393 73261 -2643 -338366 -175951 -76234 100456
17910 -25211 104518 -45781 -75269 -231682 350938 71950 229293 -27342 -82040 -112693 -248218
17899 -248218 191416 -221936 -10903 24330 -328060 165639 200230 -47497 153988 15648
17888 -173743 335421 -10597 -106155 -188600 -136673 62359 -76340 -122047 -91049 -116613 -318530
17877c18530e4922q7840O3425b2798A80603O2381h7174J7E7704c99523G1833K02585
17865B74418E8674K45285E4233N9061n1674c11785B98334i115E2742c02116a899
17853e0229m5059q1467B42833G1419N1082e660A74696n2736a0881j07033B4304
17841A17852b85761C9113J03722L9984a92585D06723A86817C3250a2910C4705
17830a6005j90402B31670a99106k0818B8530b49997Q6288E093b54733B13605o5736
17819A47869J68169A28280E743a70599e0322b743A06467O107M5680K9157O3744
17808B51155D1549b03095d066A92219g5145K3148B25442A02580b30225h3342k1117
17797a04459A36191a40554P369j11096R8608A39355M0879n9777E6718b24845B26702
$$ plain form
17877 -318530 -54922 -142762 -79337 -22798 180603 242984 -87174 -87157 57704 -399523 71833 274418
17865 274418 58674 303959 54233 113294 61620 -311785 298334 -9115 52742 -302116 -1899
17853 -50229 -95288 -176755 242833 71419 122501 -5660 174696 121960 -10881 -117914 24304
17841 117852 -285761 39113 142835 182819 -192585 406723 186817 33250 -12910 34705
17830 -16005 -206407 231670 -199106 -219924 28530 -249997 -163709 5093 -254733 213605 147869
17819 147869 316038 128280 5743 -170599 -50322 -2743 106467 112574 158254 187411 251155
17808 251155 41549 -203095 -4066 192219 -75145 -51997 225442 102580 -230225 -83342 -104459
17797 -104459 136191 -140554 -133185 -244281 -145673 139355 180234 120457 56718 -224845 226702
17785F4128J69061b993B32666e1662A02464d54065A1718J59435l8174g939A77399
17773F4167O689j2264b4025A555J13290f8546L2197A65759e8295G7715k6171a0511
17760B37591a91686h8098E1693a82857A05021J43576Q9628A15061h5606J5892
17750f9714B92567b5755J2640l80804J75698d6979j61296A89761j5331M0483g0221
17738A83664h4655B28288A5437b07196K6194D9130Q2292f4456B37868J85069A07201
17726d2946B85310a52715A28409J50221G1270b80899D8448K3627a02889C74183
17715a33771r566e4818C240J32180m209c40406d7057j49998F4396e9799C18756
17703c5330l4514F0139K41889A9721J52215J9569c4862F8366d4632j79400A7667
$$ plain form
17785 64128 233189 -2993 232666 -51662 102464 -454065 11718 171153 132979 -7939 177399
17773 64167 70856 58592 -24025 1555 114845 -68546 -36349 165759 -58295 77715 51544 -10511
17760 237591 -191686 -88098 51693 -182857 105021 248597 338225 115061 -85606 -69714
17750 -69714 292567 -25755 -13115 -393919 -218221 -46979 -208275 189761 174430 214913 -70221
17738 183664 -84655 228288 15437 -207196 -181002 49130 131422 -64456 237868 422937 107201
17726 -42946 285310 -152715 128409 278630 71270 -280899 48448 72075 -102889 374183
17715 -133771 -143337 -54818 3240 135420 131211 -340406 -47057 -197055 64396 -59799 318756
17703 -35330 -69844 60139 302028 19721 171936 191505 -34862 68366 -44632 -224032 17667
17691D1325K2708a97018E6793b4001q2664j64980D9173R2366o1747K7059l024
17680A03827m1031J6576N8673F7976a12534j45312A82079A762K64721A22597l9425
17669H3172L8266o196b55733J04464M515f0658K9388G879N2880c1783B46768b87385
17656a02625d5285B82009b77156R5005C44117E9277c1676j46737o2294C23146
17645B0288f3468l51228a83295Q0520A29930M84749B92524B2731J97406d57704
17634C04827h73q0908C00101e2081G6779d6035J2430A98020J53119a53911B47921
17622B40929i6072B06895E6515a38845C08691j51152a7693C00538a929B03394
17611b9463k67265b5961A11532J4507Q6293a41205B61338h5508A88427b63494
$$ plain form
17691 41325 64033 -197018 56793 -24001 -106665 -271645 49173 141539 79792 106851 103827
17680 103827 62796 79372 138045 67976 -112534 -257846 182079 1762 266483 122597 83172
17669 83172 121438 115242 -255733 -151269 -146754 -60658 -31270 7879 60759 -31783 246768 -287385
17656 -102625 -45285 282009 -277156 -182151 344117 59277 -31676 -178413 -240707 323146
17645 20288 -63468 -414696 -183295 -102775 129930 614679 292524 22731 220137 -457704
17634 304827 -873 -81781 300101 -52081 76779 -46035 -33605 198020 351139 -153911 247921
17622 240929 -96072 206895 56515 -138845 308691 157539 -17693 300538 -1929 203394
17611 -29463 -296728 -25961 111532 126039 212332 -141205 261338 -85508 188427 -263494
17600c46173F9385b0568k61918c5737o7067K3421n6189j20083A08149B7922P8011
17589A05933J31992A18553a9477l5546j94088n9183D695b14349B76672j27621
17579A49051b17745G9033J23221b62667a05471L0191A35145J94029L6965j05765
17569B60374a26926A39352R3725K2589l0585h5084L4789B31473K9631R9558E1139
17557a10751D54841a24779g026C253L02644b04814b9569C59422b03010D4179b17122
17545B11836g6800B24312d4574A65564A9840J45383b660j02655c2811A37246k8368
17534A08878C0066O2778B6068J1750P6500a67498B60570D1038L96675E6578J16286
17523A72864n9368J41565c6486A0647a6795k9614G9957b58037B5482K61646b6430
$$ plain form
17600 -346173 69385 -20568 -282486 -35737 -102804 -79383 -135572 -255655 108149 27922 105933
17589 105933 237925 118553 -19477 -55023 -249111 -308294 4695 -214349 276672 149051
17579 149051 -217745 79033 202254 -262667 -105471 -75280 135145 329174 366139 260374
17569 260374 -126926 139352 233077 255666 225081 -85084 -50295 231473 261104 360662 51139
17557 -110751 454841 -124779 -7026 3253 305897 -204814 -29569 359422 -203010 44179 -217122
17545 211836 -76800 224312 -44574 165564 19840 165223 -2660 -105315 -32811 137246 108878
17534 108878 30066 92844 26068 37818 114318 -167498 260570 41038 437713 56578 172864
17523 172864 113496 255061 -36486 10647 -16795 -46409 79957 -258037 25482 287128 -26430
17511a62743b1280B8732L318e1625I4009c48999D42N1247P1237L13476A43263
17499g5499A95651j7374L21174B21216K7732a9692k38015B6633L0965M20053k09280
17488B68371A28835b47734C78884p2457b73960H5769J54819k0849m6399p8438
17478I4902J71666O5021A06642J4013l6327M12578a83805f7528A41859C7167i7624
17466b1430C5524N4481Q5283E1260a83672A35013d005B7725a19584E8231K32192
17455B90423L0276A37260J44010M710I7311m1837J18408E1365a36360C76919l7031
17444C39888j68572J38039C3773L9539J80183J64323j3350j98313a14221G5401
17433B42005j5209J75173F7503J23610Q876a63183A05264M63002B33127J75255
$$ plain form
17511 -162743 -21280 28732 32050 -51625 94009 -348999 442 51689 122926 436402 143263
17499 -75499 195651 178277 499451 221216 248948 -19692 -257707 26633 57598 477651 268371
17488 268371 128835 -247734 378884 306427 -273960 85769 240588 219739 173340 94902
17478 94902 266568 331589 106642 120655 84328 496906 -183805 -67528 141859 37167 -97624
17466 -21430 35524 90005 175288 51260 -183672 135013 -4005 27725 -119584 58231 290423
17455 290423 320699 137260 281270 285980 97311 55474 173882 51365 -136360 376919 339888
17444 339888 171316 309355 33773 73312 253495 417818 404468 206155 -114221 75401
17433 242005 226796 401969 67503 191113 199989 -163183 105264 568266 233127 408382
17423D08382j75668K32273j4912i4955B18526R4647A08927L9505J18537l2447
17413B34522r9597M55944k44342O2951L27817B83655j28741q216n4316K79658
17403C72040L48j12102J31708A27433P8493E476L75548G3857i9360A89654n6622
17392A33032J78428d4342D35848A57287J67224O4406A89385o3436O902a61139
17381A09295J04184I7242a36906B54c6243k6512A54055a32531B90191B0387J17513
17370A37900R6723J82392D0577J32086H4054M01076A52189A2302L30778F7139
17359E1816J24728h0012A83926k3092o7084c9428n9843j8770B78471K01958B27576
17347a32536c4184m2634C07950Q1957A58850Q8517m2060H5006K10698m0441j08624
$$ plain form
17423 408382 232714 464987 450075 -94955 218526 313173 108927 148432 266969 234522
17413 234522 134925 590869 346527 409478 737295 283655 154914 146698 92382 372040
17403 372040 372388 260286 391994 127433 205926 5476 381024 73857 -99360 189654 133032
17392 133032 311460 -44342 435848 157287 324511 388917 189385 125949 132851 -161139
17381 109295 213479 97242 -136906 254 -36243 -62755 154055 -132531 290191 20387 137900
17370 137900 234623 417015 40577 172663 84054 485130 152189 12302 343080 67139
17359 51816 176544 -80012 183926 160834 93750 -39428 -99271 -118041 278471 480429 227576
17347 -132536 -34184 -76818 307950 389907 158850 247367 205307 85006 295704 255263 146639
17336A46639L3635P6227e1054k85568B66440i0871a8127D44605k17831A1686K39312
17325B50998O0863n0397q0541G3506a05852k16193C76380A84248p5411J49218
17315B58055L0894A25882K46908G6954R1102K2299J65474b13742A88259q7312
17305A00947J34250a8607B08130g1483D27546j16875A24359l1061g0194B42018
17294F3486K4906f0673A74160g451F8852J49170A530b83222e4963B64556a85892
17282D98558C6528K17747E1450R4766A053K02336J6323L81456A85350I1154M30970
17271E22124a00002A49783P3629k558M21237a0154I8559O0012k2767L74110A48007
17259A74064K9010a7700B33808L02493j69864B8013g5299C25537a33322B28146
$$ plain form
17336 146639 180274 256501 -51054 -336622 266440 -90871 -18127 444605 226774 11686 250998
17325 250998 311861 261464 180923 73506 -105852 -322045 376380 184248 108837 258055
17315 258055 288949 125882 372790 76954 168056 190355 355829 -213742 188259 100947
17305 100947 235197 -18607 208130 -71483 427546 310671 124359 93298 -70194 242018
17294 63486 88392 -60673 174160 -7451 68852 218022 1530 -283222 -54963 264556 -185892
17282 498558 36528 254275 51450 146216 1053 203389 219712 601168 185350 91154 522124
17271 522124 -100002 149783 223412 220854 642091 -10154 98559 158571 135804 509914 148007
17259 174064 203074 -17700 233808 536301 366437 28013 -75299 325537 -133322 228146
17248E1634K49563j33728h2748m5629C18063E7835M34947B0374K04846l7197J38831
17237C26854K05602b6202A78456J68163J03751J25316B11213J77367A71596K14159
17227C85755j47594F0743K35175K23778B2773J3936L9163J42579j0931R2224L4238
17216C33982q8738Q3512r3046r4241K1762J24766B9282M14902r9213n672H8580
17204D38892A29678r316L33610H2742M8781a98407C16075Q9875L19208D3652J04408
17193A48060K30862A41631O3189J18608O3378K20371j92357j04212J05683H5939
17182B00129O5879a22274A95685O4972k5642j05436R5335J21244L7312G9308K58324
17171C37632M7295M4113j59673L4001H2987L83570p5344H2426K43681r2090J17314
$$ plain form
17248 51634 301197 167469 -82748 -128377 318063 57835 492782 20374 225220 188023 326854
17237 326854 532456 -26202 178456 346619 450370 575686 211213 388580 171596 385755
17227 385755 238161 60743 295918 519696 22773 36709 75872 218451 207520 299744 333982
17216 333982 245244 328756 235710 141469 163231 287997 29282 444184 344971 339299 88580
17204 438892 129678 120362 453972 82742 131523 -198407 316075 405950 725158 43652 148060
17193 148060 378922 141631 204820 323428 386806 607177 414820 310608 416291 85939
17182 200129 266008 -122274 195685 260657 235015 129579 224914 346158 383470 79308 337632
17171 337632 384927 429040 269367 303368 82987 466557 391213 82426 326107 234017 351331
17160C51331n2526a2062B87277Q8298n4008J23993j02981j62208K0280L99262
17150E99913j50842j40731q9028M63173l20454n7896J8595P6498P508P2302k32325
17139B46713J08938j11754C8969N84419k23095K6114f8681E70805o8203I8231
17128I8530K49235J85547L282j63039K90366C27747K12143k10563R9539j91144
17118B37722I7540L49340B21157K67053J5929k20169K19612k03871Q929J31458
17108D40098n4311o702o8410o7326L37028j89234J32436A40137K66582K39667
17098F46386k60291J04851j46537J54220k9072n8751Q4735q050J5957j56757m7367
17087B99324L02081k29045J23323j4778o8934K80092n0353Q6385q8782r4889R6481
$$ plain form
17160 351331 298805 -12062 287277 375575 321567 445560 342579 180371 200651 599913
17150 599913 449071 308340 219312 682485 362031 304135 322730 399228 406736 479038 246713
17139 246713 355651 243897 38969 623388 400293 426407 -68681 570805 502602 98231
17128 98530 347765 533312 536594 373555 663921 327747 539890 329327 428866 237722
17118 237722 97540 446880 221157 488210 504139 283970 503582 299711 308640 440098
17108 440098 385787 379085 310675 243349 580377 391143 523579 140137 406719 646386
17098 646386 386095 490946 344409 498629 469557 410806 495541 487491 503448 346691 299324
17087 299324 601405 372360 495683 480905 411971 692063 641710 728095 639313 544424 640905
17076F40905j52967j41334j16991J74495k3030o3615O5611L31859k83284O1255
17066D92904A66714O79796k83656j58663J79103J19827j44779O2285j53144j55913
17056C11570K95669J14835j5654n8805B90120K58626K99203C82144k5945K08256
17046E64455J77026k93815o1195K99669K3541J31582A59334R33994C64378M11882
17036G76260C64815L33516L1249j86413M2674K00759j63801J7536j7192K65272
17026H88415k80880K95036k76945K50068l84320L13872l15996L1466M02353l40557
17016E82512o929J75067r6090K26857o5930N5385R1784C63677K42341K2654K34890
17005H63562N9453l07927j28773L21972l0854N1779L64493n07611P7999j17147
$$ plain form
17076 640905 487938 346604 229613 404108 381078 317463 383074 714933 431649 492904
17066 492904 166714 846510 562854 404191 583294 703121 558342 620627 467483 311570
17056 311570 607239 722074 706420 647615 290120 548746 847949 382144 356199 564455
17046 564455 741481 447666 386471 686140 709681 841263 159334 1093328 364378 776260
17036 776260 364815 698331 729580 543167 585841 786600 622799 640335 623143 888415
17026 888415 607535 902571 625626 875694 491374 805246 489250 520716 923069 582512
17016 582512 575583 750650 654560 881417 815487 870872 962656 363677 606018 628672 863562
17005 863562 923015 615088 486315 808287 777433 829212 1193705 686094 764093 646946
16995F46946k0923K6723J08480M58140r6729k13078J69697K9338n45503J05263
16985F68354o7084M23147n0894m8083J96215J5930k64973K31472K07818j91744
16975A120158K00442l47673J02461j17034K28746l59049J71990M2234K92144m02108
16965I32311M7906J5320M06565j13846m6034j68637l6339O1271K6597J52720K07343
16954A485177k42977l4467q4297J59451k29336M71587l55253j9677j71011J93944
16944A173141K40115j41342J13578l41024n6208M85518K22244l06548l7634l8727
16934A313113N4228k78670L87281J82712J2605k19061L8474K50067p6080j62732
16924A501937J46603l92309L32641o183l43495K82981j84670K62166l3094K77303
$$ plain form
16995 646946 626023 652746 761226 1219366 1122637 909559 1079256 1108594 563091 668354
16985 668354 601270 1024417 973523 925440 1121655 1137585 872612 1104084 1311902 1120158
16975 1120158 1320600 972927 1075388 958354 1187100 828051 1000041 1042275 1334419 932311
16965 932311 980217 995537 1402102 1288256 1242222 1073585 1037246 1098517 1125114 1277834 1485177
16954 1485177 1242200 1207733 1123436 1282887 1053551 1525138 1169885 1150208 979197 1173141
16944 1173141 1413256 1271914 1385492 1044468 988260 1473778 1696022 1389474 1351840 1313113
16934 1313113 1367341 1088671 1475952 1658664 1671269 1452208 1490682 1740749 1664669 1501937
16924 1501937 1648540 1256231 1588872 1582689 1239194 1522175 1337505 1599671 1566577 1843880
16914A843880j72778K81666k59513j0694J74165j46335O3037J71126k91943J83558
16904A836169q4499J1758L74808k61943L38372k93964L24448j67983R3685J25766
16894B296617l20023K95806O620k96974m5281K87187l07711K02458N53191j27184
16884B544706j51404N2476M3018k9526P5505N8105O083J73069q1578M3846j85078
16873B549222K13999j2222L3110j65128L66813j34219j52787O57725k37020R7324
16863C216817K8706K06591m74272K36417j45683K22836K72357r8390J91677l07457
16853C349599L66134m5629J01023j98459Q7228L66325o72185P31310l15688M15777
16843D185435K4880N3432l381K37287J04771k6487q5997N06940m09428J60729
$$ plain form
16914 1843880 1671102 1952768 1693255 1682561 1856726 1710391 1773428 1944554 1652611 1836169
16904 1836169 1751670 1763428 2138236 1876293 2214665 1920701 2245149 2077166 2170851 2296617
16894 2296617 1976594 2272400 2279020 1982046 1936765 2223952 1916241 2118699 2671890 2544706
16884 2544706 2393302 2445778 2488796 2459270 2534775 2592880 2598963 2772032 2690454 2734300 2549222
16873 2549222 2763221 2750999 2784109 2618981 2985794 2851575 2698788 3356513 3119493 3216817
16863 3216817 3245523 3452114 2977842 3214259 3068576 3291412 3563769 3465379 3657056 3349599
16853 3349599 3715733 3670104 3771127 3572668 3659896 4026221 3354036 4085346 3769658 4185435
16843 4185435 4210315 4263747 4260366 4497653 4602424 4575937 4489940 4996880 4587452 4748181
16833D748181K64582j21517L89772j55806M73087l6686K12848k48104J11779J28568
16823E766704J64150l0223l7025K00318K81491L02343L102J77614k76560L64610
16813F916524Q18630l96295o2215L20575Q0765K19199J41957L14240Q4433j12179
16803H325634K06740K93334K46205J1110L18251L52976J94234N36260J19461K18556
16793A0822761M18703L96475J68005L28932L78701L93508M45256O3448N42156
16784A3957945K68385K42073M49459N91772M86418M26820O11523K48469L88566
16775A7671430J046679J86911P63233R28940N42790P90194O21437J109865O53993
16766B4315472Q95666R55762J012931J012934J025386J495379Q78873J639019
$$ plain form
16833 4748181 5012763 4891246 5281018 5125212 5598299 5561613 5774461 5526357 5638136 5766704
16823 5766704 5930854 5900631 5863606 6063924 6345415 6647758 6650860 6828474 6551914 6916524
16813 6916524 7735154 7338859 7276644 7597219 7677984 7897183 8039140 8353380 8437813 8325634
16803 8325634 8532374 8825708 9071913 9083023 9401274 9754250 9948484 10484744 10604205 10822761
16793 10822761 11241464 11637939 11805944 12134876 12513577 12907085 13352341 13415789 13957945
16784 13957945 14226330 14468403 14917862 15509634 15996052 16422872 17034395 17282864 17671430
16775 17671430 18718109 18905020 19668253 20597193 21139983 21930177 22551614 23661479 24315472
16766 24315472 25211138 26166900 27179831 28192765 29218151 30713530 31592403 33231422
16758C3231422J286741J476467J479482J298480J945160J620799K150615K210633
16750D6699799K338163K445092K172084K773446L076836K921106L180398L494509
16742F9101433L293370L649266M447622M609350M272087M872589N227507N037801
16734A04511025N850154N778641N934917O621799N935386O793740O343477O393769
16726A54162908O096882N550208N510218N266858L598085L310010K304435J363562
16718A87163166L51636r26374j700672k812137l973101m423684m981388n787022
16710A62910424n997195o577841o712782o561835o521842o661020o333849n908517
16702A11635543n952535n280598n789761n070479m316225n004133m072108m027037
$$ plain form
16758 33231422 34518163 35994630 37474112 38772592 40717752 42338551 44489166 46699799
16750 46699799 49037962 51483054 53655138 56428584 59505420 62426526 65606924 69101433
16742 69101433 72394803 76044069 80491691 85101041 89373128 94245717 99473224 104511025
16734 104511025 110361179 116139820 122074737 128696536 134631922 141425662 147769139 154162908
16726 154162908 160259790 165809998 171320216 176587074 180185159 183495169 185799604 187163166
16718 187163166 187514802 186588428 184887756 182075619 178102518 173678834 168697446 162910424
16710 162910424 156913229 150335388 143622606 137060771 130538929 123877909 117544060 111635543
16702 111635543 105683008 100402410 94612649 89542170 85225945 80221812 76149704 72122667
16694G2122667l979798l376678l409634k664602l004479k822789k704125k174655
16686D7985907k438228k287178j535048j799683k381713j111059j716158j343674
16678C3373166j320383j197973j398717j277964j036569j025434q57664j359222
16670B3899240l19691r46735j156654q81732l30169m89667j125733l72583p28786
16661A7547490o86273m70672K0292o44070p80606l85270l91403k53421p56037
16652A3200030j19147p17253k5851m05974l54171l05874j35301o38809O1825l53852
16642A0205623n23648J89481m73782l6134k84480n19517J01201n89739M1302k31520
16632G878787l50277j68669L0801m0904j36330j86082l73161k89817k10976L7401
$$ plain form
16694 72122667 68142869 64766191 61356557 58691955 55687476 52864687 50160562 47985907
16686 47985907 45547679 43260501 41725453 39925770 37544057 36432998 34716840 33373166
16678 33373166 32052783 30854810 29456093 28178129 27141560 26116126 25258462 23899240
16670 23899240 23579549 22632814 21476160 20594428 20264259 19774592 18648859 18276276 17547490
16661 17547490 16861217 16390545 16410837 15766767 14986161 14600891 14209488 13956067 13200030
16652 13200030 13080883 12363630 12337779 11931805 11577634 11271760 11136459 10497650 10559475 10205623
16642 10205623 9681975 9871456 9397674 9361540 9077060 8557543 8658744 8069005 8110307 7878787
16632 7878787 7528510 7359841 7390642 7349738 7213408 7027326 6654165 6364348 6153372 6190773
16622F190773r6713J84714l40948J9628l81496K4977k24775J57367k75504O586
16612E264609l10565K4056l52508K23157L7379m0280k42202q3620k05273k14176
16602D100577K49771k07053P0650j16101J3805l12323J12031k41562K21973l32727
16592C559041n2700K88305q8768m06786l79877O06126l52429j27721j26367M59381
16582C378205k27544k18772j04371K43347j80048J46639l99868j38948K88094
16573B786734q9468k81986m4407j1822J22915J83762O8999m26683R3411l06072
16563B095383M70987j96140l12026N59008o12540P1962M6031m6365O6187J51893
16553B294380j90586k54989J62048L6250m25717L87147q1549l148j79215J49208
$$ plain form
16622 6190773 6094060 6278774 5937826 5957454 5575958 5600935 5376160 5533527 5258023 5264609
16612 5264609 4954044 4978100 4625592 4848749 4886128 4845848 4603646 4520026 4314753 4100577
16602 4100577 4350348 4143295 4213945 4097844 4111649 3799326 3911357 3669795 3891768 3559041
16592 3559041 3506341 3794646 3705878 3299092 2919215 3525341 3172912 3045191 2918824 3378205
16582 3378205 3150661 2931889 2827518 3070865 2890817 3037456 2637588 2498640 2786734
16573 2786734 2697266 2415280 2370873 2359051 2481966 2665728 2734727 2308044 2401455 2095383
16563 2095383 2566370 2370230 2058204 2617212 2004672 2076634 2122665 2076300 2142487 2294380
16553 2294380 2103794 1848805 2010853 2047103 1621386 2008533 1926984 1923836 1744621 1893829
16543A893829j20632j80361L21081k14556J08956j39343o0287N9280l7645l5594
16533A594728J43004m62792j47800M72478m23717K64648J97976K87926l09264
16524A617187j25655K5934l3924K63900j60588n4418j73640J01034k33170q4358
16514A142302K13391j6958N3123j39209J35727o8634K30686J8903j45594j90979
16504A232758J62582k40830J44823m35375N18517j05901k73987J14845j99837
16495I17595M42566k07924k81325J57027k12668K2371m2624K44424n3758k14829
16485G70855K70846L6855l3323J28726m9721j54502l69680j60983J34221K38768
16475H12062J87751Q1109k03276l3133M3530K93697k93044m10697M63869j79811
$$ plain form
16543 1893829 1773197 1592836 1913917 1699361 1808317 1668974 1608687 1667967 1630322 1594728
16533 1594728 1737732 1274940 1127140 1599618 1175901 1440549 1638525 1926451 1617187
16524 1617187 1491532 1517466 1483542 1747442 1586854 1532436 1358796 1459830 1226660 1142302
16514 1142302 1355693 1338735 1391858 1252649 1388376 1319742 1550428 1569331 1423737 1232758
16504 1232758 1395340 1154510 1299333 863958 1382475 1276574 1002587 1117432 917595
16495 917595 1360161 1152237 870912 1027939 815271 837642 795018 1039442 985684 770855
16485 770855 1041701 1078556 1045233 1173959 1124238 969736 600056 439073 573294 812062
16475 812062 999813 1080922 877646 844513 888043 1181740 888696 477999 941868 762057
16465G62057N1464K5314P1019l96639K01224J04267j09280j88670L03273k69932
16455E54097j00801K11476n2854J08997q2058j72168l2945l7225M71873k33272
16445F35120L29159k47044K25424k01801L03954j05576k83237l6673q8198J65355
16435F96483K7114C11810K44853O3285J5957j52176P9004J07622j30023j91379
16425C48953K72201j42979J3364P0262J21270k65050J23841n4185R3376n6171
16415E24882K0957n6161p6515K35562L9209r0809j58422J39338n4281J65728k1341
16404F68147j67219O4404r3429k4575l7039m043K96563k11248J00351R6903A92606
16392E65633p8136B34406K11479j05410A37036M42783n0306k4128A72624J15189
$$ plain form
16465 762057 813521 838835 909854 513215 714439 818706 709426 520756 824029 554097
16455 554097 453296 664772 611918 720915 638857 466689 433744 396519 868392 635120
16445 635120 964279 717235 942659 740858 1044812 939236 655999 619326 531128 696483
16435 696483 723597 311810 556663 619948 635905 483729 562733 670355 540332 348953
16425 348953 621154 478175 491539 561801 683071 418021 541862 487677 581053 524882
16415 524882 545839 489678 413163 648725 687934 597125 438703 578041 523760 689488 668147
16404 668147 500928 565332 471903 447328 410289 406246 702809 491561 591912 688815 192606
16392 565633 487497 234406 445885 340475 137036 579819 529513 505385 172624 287813
16382B87813m2705j2461L96920k16389j98181K65887A11751J35949p7304M62016
16372F32412j66752G799O40181B57251J76663J38985j70273A56530J46390J28573
16362D31493o5148r4971L12819B64876Q6602P9093B01930J98590A85676j8673
16352A67003K89515A06245K80823j15317j21476K79430a05670H4119L07258j19836
16342B71541j03379J94194j40596Q6439j16883J68516r5480P5837j31111L04317
16332E13395j10642A04344J62970L4962Q0830J92961A08002J22449d9819C89110
16321C57907j52549J6232q1711n5363J36423E8696a33739B74641K75809A07500
16310b8291B6049K50902a70727D71862j27639j06668j17772J83623C7775L51282
$$ plain form
16382 287813 245108 232647 629567 413178 214997 480884 111751 247700 170396 632412
16372 632412 465660 7799 647980 257251 433914 572899 402626 156530 302920 431493
16362 431493 366345 271374 584193 264876 351478 430571 201930 400520 185676 167003
16352 167003 456518 106245 387068 271751 150275 429705 -105670 84119 391377 271541
16342 271541 168162 362356 221760 308199 191316 359832 264352 340189 209078 513395
16332 513395 402753 104344 267314 302276 383106 576067 108002 230451 -49819 389110
16321 357907 205358 221590 139879 84516 220939 58696 -133739 274641 550450 107500
16310 -28291 26049 276951 -170727 471862 344223 237555 119783 303406 37775 389057
16300C89057K21728B6413J28140J14600q8922p228K06214j78815A151f7552A16476
16288B50308H381L09301f2258C3567J97239J87700A45512L30770E7152K84724
16278C41876E2858J94024k2165N7107A33442J06705A3264J00716J36050m5742
16268B04288j2712k1769a13925d6047B70657f7875l5582A46015m4730N4789J76282
16257C32356A25391d4798A85142k1436n94k2637M89648A14159N0777O9509c9040
16245a17921B17040E8122R7816A6580J8306L76720j72993a03110A05472J10919
16235B16391j02469K95982m4861A17456I689P7610f7273C44282A05585b1321D05078
16223E108J75739a2089A18979k1632J34538h592n0297A41951F202a06320C41496
$$ plain form
16300 389057 610785 26413 154553 269153 180231 173003 379217 200402 1151 -67552 116476
16288 250308 8381 317682 -62258 33567 230806 418506 145512 476282 57152 341876
16278 341876 52858 246882 224717 281824 133442 240147 13264 113980 250030 204288
16268 204288 191576 169807 -113925 -46047 270657 -67875 -103457 146015 101285 156074 332356
16257 332356 125391 -44798 185142 163706 163112 140475 630123 114159 164936 234445 -39040
16245 -117921 217040 58122 155938 16580 34886 411606 238613 -103110 105472 216391
16235 216391 113922 409904 365043 117456 9689 87299 -67273 344282 105585 -21321 405078
16223 5108 180847 -12089 118979 97347 231885 -8592 -58889 141951 6202 -106320 341496
16211B64388F4226J52378J13673g523m0340B41743g1154A17081M702J66448N3351
16200C41582A02051B9781b76765A1269J93609c13903A10486B776L02160b0758
16189A96898a58014b9208A42433e1356A77056K03953F249a35566D7236M3178i0605
16177A48456a59541G1922j3243f5572B12042J27937b56128D40309a20150J1895
16167a08255A33866p807c497B09377a1962A58896h0399B85968j6929a10226M018
16156a06208d2677r1945D20161q1092C1166a51770c2499j22593B70290i0023B38091
16144A33608N2109J01284e1573G2074h7688p8283A55824J69463i0047C99622H3325
16132A35668K57106c3938j95661B31009b56683B27897j02656K6436K854P1306
$$ plain form
16211 264388 64226 216604 330277 -7523 -47863 241743 -71154 117081 121783 288231 341582
16200 341582 102051 29781 -276765 11269 204878 -313903 110486 2776 304936 -20758
16189 196898 -158014 -29208 142433 -51356 177056 381009 6249 -135566 47236 90414 -90605
16177 148456 -159541 71922 58679 -65572 212042 339979 -256128 440309 -120150 -108255
16167 -108255 133866 126059 -3497 209377 -11962 158896 -80399 285968 269039 -110226 -106208
16156 -106208 -42677 -134622 420161 339069 31166 -151770 -32499 -155092 270290 -90023 238091
16144 133608 185717 287001 -51573 72074 -87688 -165971 155824 325287 -90047 399622 83325
16132 135668 392774 -33938 -229599 231009 -256683 227897 125241 151677 154531 225837
16122B25837d25791A47125b906j15074B59668d4016G5532O6328B8276a88937P9574
16111a09363B55307i7564q3362C09227a91982A79879C6550a31694I9505h4538
16100g1912A27838K64267A53165F9915J7436c5737I9575Q2927A8287J59745q0582
16089I7450J03744f4200j15749K4335B2232f7402B47157h5551C6390J59868D5718
16077F7241Q381K8064b78891f360k18923F1968a44374n4766A01037b85884B05424
16065B38249a79229A98420a51807B25312C2828b761k69140r3163B85751B2907
16054b85124B24624l6048a95099F9939P0897h4893R689A95634D084i7584j02953
16043b00537g1710A1097O6827H68M9448A304N4358a63395j37779A98559l0494
$$ plain form
16122 225837 -425791 147125 -2906 -117980 259668 -44016 75532 141860 28276 -188937 -109363
16111 -109363 255307 -97564 -180926 309227 -191982 179879 36550 -131694 99505 -84538
16100 -71912 127838 392105 153165 69915 87351 -35737 99575 182502 18287 178032 97450
16089 97450 201194 -64200 -179949 -155614 22232 -67402 247157 -85551 36390 196258 45718
16077 67241 75622 103686 -278891 -6360 -225283 61968 -144374 -199140 101037 -285884 205424
16065 238249 -179229 198420 -151807 225312 32828 -2761 -271901 -365064 285751 22907
16054 -285124 224624 188576 -195099 69939 140836 -84893 -75204 195634 4084 -97584 -200537
16043 -200537 -71710 11097 77924 868 50316 1304 55662 -163395 -301174 198559 168065
16032A68065G183K14707g4248k64321J30219A00635b8975n8867K3283j10355g5069
16020E3371L5754L2753b94310a11523D2394d0756I5702a80275M9688l6032B6448
16008h4156I4131a39750B05402a53235A62643E427d24083a64570L9103B53307
15997E1436k3322a62151j07795J02317A31731R252a0076j16790A10559f5453m0896
15986a06349G4391M0593j8977O9799J46049R8631j59775P2655j33374Q0033B4374
15974i4707A17513a55658g3823q1761N8129r7922c7357A27901g5957k22565O7282
15963b31240A58909b57523C3406N7225a92903c3046B32020a24031H2045d4748
15952E6992J77233b17784k0540H7046a40956A8600b35451K2112a21j62592E823
$$ plain form
16032 168065 7183 221890 -74248 -338569 -208350 100635 -28975 -87842 -64559 -174914 -75069
16020 53371 89125 121878 -294310 -111523 42394 -40756 95702 -180275 -130587 -166619 26448
16008 -84156 94131 -139750 205402 -153235 162643 5427 -424083 -164570 -125467 253307
15997 51436 28114 -162151 -269946 -167629 131731 140983 -10076 -126866 110559 -65453 -106349
15986 -106349 74391 114984 96007 165806 311855 410486 250711 323366 189992 270025 24374
15974 -94707 117513 -155658 -73823 -155584 -97455 -195377 -37357 127901 -75957 -298522 -231240
15963 -231240 158909 -257523 33406 90631 -192903 -33046 232020 -124031 82045 -44748
15952 56992 234225 -217784 -238324 87046 -140956 18600 -235451 -213339 -121 -162713 5823
15940A13889E6575c4275J2696k14473M1478M0344K885j9177A68771E6386a67031
15928A09831J26763a84720E4457k1048J6096b70450R8030B806J80521a45845j57114
15917c02959e0884m9930k32879K6446a32510J2638p8361Q0790A27070o187a90926
15905A41825a96340D3012i720B39384e2254j943E4061J50975i2052C89739h2941
15893A34216c2385l5936Q477l66516I4286J10953Q7008A34164C604K47799b06688
15881A62464b8590B6853K4169a54283J4955j38278C85239a79635F1140J55092
15871B16232r668l5012i6589D46873c19403J35255C0595J72074c0552k26525a07673
15859a31942M0687j27696R6438C2880G580J32373K79434f3564d875q6332j06291
$$ plain form
15940 113889 56575 -34275 -21579 -236052 -194574 -154230 -151345 -170522 168771 56386 -167031
15928 109831 236594 -184720 54457 33409 49505 -270450 -172420 2806 183327 -145845 -302959
15917 -302959 -50884 -100814 -333693 -307247 -132510 -119872 -198233 -117443 127070 120883 -190926
15905 141825 -196340 43012 -9720 239384 -52254 -54197 54061 205036 -92052 389739 -82941
15893 134216 -32385 -68321 -59844 -426360 94286 205239 292247 134164 3604 251403 -206688
15881 162464 -28590 26853 51022 -154283 -139328 -277606 385239 -179635 61140 216232
15871 216232 206564 171552 -96589 446873 -319403 -184148 30595 202669 -30552 -257077 -107673
15859 -131942 -91255 -218951 -122513 32880 7580 139953 419387 -63564 -4875 -91207 -197498
15848a97498e2623k8257j9495A59900c52662F4641a44335f0252j85124D52257
15837C84446F8402J23754B874K46369r6245p5655d0892C66600D9627K44861B2477
15825e5581A08516m4521k1458D962L3193i7647B60906b98123Q4452F1453l445
15814E8008B3037d15851J48680j6785A10753f4382A6297L6298K8418a3366o0444
15803g3810k5911j5188D0095N6784a54806c6815n7594G0510b67139c4408B8880
15791F6067c3541A21829K48913a93791K6287j67905a19674F5946d1187j10974
15781a52161o3924N8603N0711B25936m4349c09832J08451f0950H0500a53344i621
15769F4592a81143M8842k7427I7787d0135h903F2892a24187A1748a51650o6117
$$ plain form
15848 -197498 -52623 -80880 -100375 159900 -352662 64641 -144335 -60252 -245376 452257
15837 384446 68402 192156 2874 249243 152998 77343 -40892 366600 49627 294488 22477
15825 -55581 108516 63995 42537 4962 38155 -97647 260906 -298123 -213671 61453 58008
15814 58008 23037 -415851 -267171 -283956 110753 -64382 16297 52595 81013 -13366 -73810
15803 -73810 -99721 -114909 40095 96879 -154806 -36815 -94409 70510 -267139 -34408 28880
15791 66067 -33541 121829 370742 -193791 -167504 -335409 -119674 65946 -41187 -152161
15781 -152161 -216085 -157482 -106771 225936 181587 -309832 -201381 -60950 80500 -153344 -9621
15769 64592 -181143 -132301 -159728 97787 -40135 -8903 62892 -124187 11748 -151650 -217767
15758b17767I72L24837b50C23529a38818A26968k6276a71288o8954d9096A84738
15746A79142b2134A13970L32797a69679A6305b097A4382g9406p1741c9007j75869
15735b14876a3196A37049l8096R0881c68907J53466f0427B80003H634b31282j14876
15724c46158E3047B2184k904i6303A4319a10310M4952j78294e2750k16218C9441
15712F9495b06638h6440k10224A76172c03190B91070A32925b12641j699q897K7252
15701a95985N0183j8730Q2220A30343c2133C1611R9561Q6348b20101A06809b7546
15689A98930E1753J39707f7289B64575a78820c5838j1506n458A14317c32808c8151
15677h8416q4381L2499l3812A07346J29854Q4235i6995A27891M9310J22063i0934
$$ plain form
15758 -217767 972 325809 -250 323529 -138818 126968 100692 -171288 -240242 -49096 184738
15746 179142 -22134 113970 446767 -169679 16305 -2097 14382 -79406 -151147 -39007 -214876
15735 -214876 -13196 137049 98953 189834 -368907 -215441 -60427 280003 8634 -231282 -346158
15724 -346158 53047 22184 19280 -96303 14319 -110310 -65358 -243652 -52750 -268968 39441
15712 69495 -206638 -86440 -296664 176172 -303190 291070 132925 -212641 -214340 -223237 -195985
15701 -195985 -145802 -164532 -82312 130343 -32133 31611 131172 217520 -220101 106809 -27546
15689 198930 51753 191460 -67289 264575 -178820 -35838 -47344 -52802 114317 -332808 -38151
15677 -88416 -172797 -140298 -174110 107346 237200 321435 -96995 127891 177201 299264 -90934
15665b53443D9878d9272k30524j46982F9524b92557D1117h885k76845g4944A27797
15653B21211b24573A28426E1185L31379a56549j42217L4567A60144j5325L5667
15643A80486E2834a82359e4690G980d934G3572b19793B81036b31633j85713K3470
15632c93876D0795c1672A86500a87684d4586A21027a00785A01835c48156F2310
15621D4940a8772I795b93177D97731A52069k0181L8459b41892F2719a2846o7642
15610h0488C1827J30012b12852A42599E1454L43985b29366A27043a4071B5754
15599B2813d46733I1355k8057n716K49001f19k25904m5917f7698J5594G6354O7677
15587A44031j3004L01806f2849n5474r18E1789b21346B52211A18487a48A07552
$$ plain form
15665 -253443 49878 -49272 -279796 -426778 69524 -292557 41117 -8885 -285730 -74944 127797
15653 221211 -224573 128426 51185 382564 -156549 -298766 -264199 160144 144819 180486
15643 180486 52834 -182359 -54690 7980 -4934 73572 -219793 281036 -231633 -417346 -393876
15632 -393876 40795 -31672 186500 -187684 -44586 121027 -100785 101835 -348156 62310
15621 44940 -18772 9795 -293177 497731 152069 131888 170347 -241892 62719 -12846 -80488
15610 -80488 31827 161839 -212852 142599 51454 395439 -229366 127043 -14071 25754
15599 22813 -446733 91355 63298 57582 306583 -619 -226523 -272440 -67698 -52104 76354 144031
15587 144031 131027 432833 -62849 -118323 -119241 51789 -221346 252211 118487 -148 107552
15575f4010l0783b3045k33341J24357A71990m2208A9302a82827A69113a7526A5159
15563b13952B98527P7838A74490F2015e691q8148C5863R590a81120p1193d8781
15551a34741D2386b02547A82691a13125r5858C90172G9532a96486a5138E09385
15540I7543J11968a52525A7678K30547a2180c010A26626D5234A6142L08336a50654
15528C70014A57459b44068A21276a90534j5380O3319A23099a51031d3395j90998
15518b34393h6098k90209h0361j87446G5100I988J26285g5691B11453b2855k45513
15507b68368A08127c75004c2104o5457A1330b39291i4371d0296k900M435j86454
15496b25215g1982q5599f1153K581q5519N583k2914j28655A30709Q2750a0758
$$ plain form
15575 -64010 -94793 -23045 -256386 -132029 171990 129782 19302 -182827 169113 -17526 15159
15563 -213952 298527 376365 174490 62015 -5691 -93839 35863 45453 -181120 -252313 -48781
15551 -134741 42386 -202547 182691 -113125 -208983 390172 79532 -196486 -15138 509385
15540 97543 209511 -152525 17678 248225 -12180 -3010 126626 45234 16142 324478 -150654
15528 370014 157459 -244068 121276 -190534 -205914 -142595 123099 -151031 -43395 -234393
15518 -234393 -86098 -376307 -80361 -267807 75100 9988 136273 -75691 211453 -22855 -268368
15507 -268368 108127 -375004 -32104 -97561 11330 -239291 -94371 -40296 -43196 -38761 -225215
15496 -225215 -71982 -157581 -61153 -58572 -144091 -138508 -161422 -290077 130709 213459 -10758
15484C51713h0697j29008B1512a80443A02800j8857g953k22557r456g1681A80408
15472f0221l4888o330b7601l1666E7013c8932H7691D779b6062C7493M147K14680
15460B56320J26865A0636c15039B97968o7750b57722B20458p3490K8677h3020
15449A9901a23102C9026J57177a06917K9032A7554N5436f1069B14904I7835F102
15437a19456C24583E3201K5570b20872R8146Q455B9016a29223K9204j1818H4124
15425a03035L8548j93886J02529n3500B35511g8283B6490b5053E5372a12105C8568
15413b06254A46591O7242a33154n8318B43568a64399f0306B2883K00033c06563
15402A73211a4436C49909a53910J0235A75679n7982f5471k98584a5576A8631K33108
$$ plain form
15484 351713 -80697 -209705 21512 -180443 102800 83943 -7953 -230510 -239966 -71681 180408
15472 -60221 -95109 -101439 -27601 -59267 57013 -38932 87691 4779 -26062 37493 41640 256320
15460 256320 383185 10636 -315039 297968 230218 -257722 220458 146968 175645 -83020
15449 19901 -123102 39026 196203 -106917 -77885 17554 72990 -61069 214904 97835 6102
15437 -119456 324583 53201 78771 -220872 -122726 -114271 29016 -129223 -100019 -111837 84124
15425 -103035 -64487 -258373 -155844 -209344 235511 -78283 26490 -25053 55372 -112105 38568
15413 -206254 146591 213833 -133154 -191472 243568 -164399 -60306 22883 222916 -306563
15402 173211 -14436 349909 -153910 -143675 175679 117697 -65471 -364055 -15576 18631 251739
15391B51739c6147D7073K8208b58547i1573c6611I7129B8391a39349K9674E43613
15379b13035i5934j43379C19741e1229E6682d9562C47697H2565L11491e9476A12142
15367a89024J7720O5682C2082a43076B44088q7644a22475B13251F4082P9981b5379
15355B62101j1377c68637O6343B9610L4091K0053d2124A64854a66319j7154A73725
15343C69338b03715p675A07269n416a44185O19D2198a63792l3762A88407n9014
15332A29393E4979c4209A52437k2011g2419C5407c1719E9649b32065A38355K06860
15321C45215A24975b7050j52809r7362A32435A4708R3600m4838c6896e429F1690
15309A81997d1748A64194B1284J07935K57985G9431J55041f6899A19262l1789
$$ plain form
15391 251739 -36147 47073 75281 -258547 -91573 -36611 97129 28391 -139349 -109675 543613
15379 -213035 -95934 -239313 319741 -51229 56682 -49562 347697 82565 394056 -59476 112142
15367 -189024 -171304 -105622 32082 -143076 244088 156444 -122475 213251 64082 144063 -25379
15355 262101 250724 -368637 -302294 29610 63701 83754 -42124 164854 -166319 -183473 173725
15343 369338 -203715 -211390 107269 101853 -144185 -143566 42198 -163792 -197554 188407 129393
15332 129393 54979 -34209 152437 130426 -72419 35407 -31719 59649 -232065 138355 345215
15321 345215 124975 -27050 -179859 -277221 132435 14708 108308 63470 -36896 -5429 61690
15309 181997 -41748 164194 21284 129219 387204 79431 234472 -66899 119262 87473
15299H7473a1115p4628c3698J5227B82741G2202P5065L02013I3840J1857A5033
15287I4124b1820o0526j43840h9190H3894C0207N0470M9352a42499C25867e23220
15275d4319B4923J92391i2255C11675k4830E0340R0847J16989a11208C6920J58831
15264A95751G5151c80761b9845k47880D65474C2958R5167a1779j52387B62600
15253B20082p8576j5034b15517C97540L72560Q88489m50757o9001L98948E16902
15242B34973B4854L35718G9141d5440j7442l45388e0873B09517j03376e7123J5469
15231d1654F9202b06A4473N1049e0176p5978A41627P6497e2737C24152j26099
15220A98053g452H0660i1693a0509A84301a35709D2198K96840A1434a84374B250
$$ plain form
15299 87473 -11115 -85743 -33698 -18471 282741 72202 147267 449280 93840 105697 15033
15287 94124 -21820 -82346 -226186 -89190 83894 30207 80677 130029 -142499 325867 -523220
15275 -44319 24923 217314 -92255 311675 286845 50340 141187 258176 -111208 36920 195751
15264 195751 75151 -380761 -29845 -277725 465474 32958 128125 -11779 -164166 262600
15253 220082 141506 126472 -215517 397540 770100 1658589 1207832 1138831 1537779 516902
15242 234973 24854 360572 79141 -45440 -62882 -408270 -50873 209517 106141 -57123 -41654
15231 -41654 69202 -206 14473 65522 -50176 -126154 141627 218124 -52737 324152 198053
15220 198053 -7452 80660 -91693 -10509 184301 -135709 42198 339038 11434 -184374 2250
15208B7247K0548g9618B34152A0247O1851K05561e4582b7141A4604e589m0154
15197d5743j46953A21899J24931i372A66370F4439d2548I8502O3366N1402O0168
15186B73438A29406J21576m6966I6346a41499B49914c35203A97161L0211o7503
15176A59869J6343a5868G8671K03003a07284B4663c7356A36020O7985J98130c9890
15164D14663b02322b6939B26992q7534J33648p5849M4021E3380e7062D96706g9052
15152A29802K16491f7242C51439C0799L89224A81611J1213E9585b05454A03809
15141b22008O1686B09041n3974L39250B3091Q1992m8837m011b1904A57889I409
15129C1321N71652B64377r434n6416b78249e9829A77289J29486L017A18121a42747
$$ plain form
15208 27247 47795 -79618 234152 10247 72098 277659 -54582 -27141 14604 -5589 -45743
15197 -45743 -192696 121899 246830 -9372 166370 64439 -42548 98502 161868 213270 273438
15186 273438 129406 250982 204016 96346 -141499 249914 -335203 197161 227372 159869
15176 159869 176212 -15868 78671 281674 -107284 24663 -37356 136020 204005 402135 -39890
15164 414663 -202322 -26939 226992 139458 273106 197257 241278 53380 -57062 496706 -79052
15152 129802 346293 -67242 351439 30799 420023 181611 192824 59585 -205454 103809
15141 -222008 -160322 209041 155067 494317 23091 105083 56246 52235 -21904 157889 9409
15129 31321 602973 264377 254943 198527 -278249 -59829 177289 306775 309792 118121 -142747
15117H7585J06593L0775b88282A47268F7058a2650A39157L29938a04241A56194
15106A26309c5493A86060J03672A08575D3168K05901n2921K4278a67377G8223
15095A34970b96679A55424P748b0843A46331K4011j7591C4662O5638J1384J89772
15084C01456q5293r7480J15730E5019a01208A18894C9594K67176r4716e1328A59310
15072H8078P0980G1318K95399n784A36317A7915M5480c82784A40796b40930C14258
15060A68134J5595a07756A83226j4116i5834G2450a2372B56346J03901C8408a97418
15048A20623R0740K8652J76614L3265k14503a05215A66286d2594j4818j8591B56003
15036B33204k3954j4964m1092K24056F5418a55999A12329R9850D3949J08984L75233
$$ plain form
15117 87585 194178 224953 -288282 147268 67058 -12650 139157 469095 -104241 156194
15106 126309 -35493 186060 289732 108575 43168 249069 196148 220426 -167377 78223
15095 134970 -296679 155424 163172 -20843 146331 170342 152751 34662 100300 111684 301456
15084 301456 216163 118683 234413 55019 -101208 118894 39594 306770 212054 -51328 159310
15072 88078 159058 71318 366717 360933 136317 17915 63395 -382784 140796 -240930 314258
15060 168134 183729 -107756 183226 169110 -95834 72450 -12372 256346 360247 38408 -197418
15048 120623 211363 240015 416629 449894 235391 -105215 166286 -42594 -57412 -76003 256003
15036 233204 209250 194286 153194 377250 65418 -155999 112329 212179 43949 152933 528166
15025E28166A74479g7822C61751j73675J86581J09800A06597K60505p3671J03821
15015C97252q1461q3024q2015e4645A67289d7332A19253M2946c9349g32A36032
15003B64307C383L79036j60923J55978o7270j10240J42801C540J62249g7838C12592
14991B5649K49959J3113J97542k05937M5712o6158K6226e6139F16635B6959M86474
14980E13433q3184A32875a67696B52146J00066F7449M2199L76127b5945A16839
14969D78624j79453j07469g2485B28411j0325L5071C0692K2915K71236n9208j2407
14958B53228Q1147j50086R078g8944B87128A32136K69704n0590l9586K22801j26773
14947D07692r1557J1539J24803j25548A23808K66610m2994J29195E4560N2255
$$ plain form
15025 528166 174479 -77822 361751 188076 374657 484457 106597 367102 293431 397252
15015 397252 315791 232767 150752 -54645 167289 -47332 119253 162199 -39349 -732 136032
15003 264307 3383 382419 221496 377474 310204 199964 342765 3540 165789 -77838 312592
14991 25649 275608 288721 486263 280326 326038 259880 286106 -56139 616635 26959 513433
14980 513433 430249 132875 -167696 252146 352212 67449 109648 485775 -25945 116839
14969 478624 299171 191702 -72485 228411 218086 253157 30692 53607 324843 265635 253228
14958 253228 334375 184289 193367 -78944 287128 132136 401840 351250 311664 534465 407692
14947 407692 316135 327674 452477 326929 123808 390418 347424 476619 54560 106815
14937A06815K09415M8446P0883j64950J39267j9761K775j94535K75915A87281
14926C39689j03722J99648G8954P60282C79665J38271J1240k2499B19067K44034
14916D63101K7044m4421j2691J654c03185B91668J65327j53460j23787K05909
14906C85657J83418R960k68403M6912L12745C11906L29529l7325k85428A45456
14895B51047I5798L27042j67922H0136K41644O4400J57500k03810A18204A7633
14884C79579r0201J58234a73282C01182r662o8191J69360a82669B98418J3711
14874C12129Q119D8480N62099k49709A80139l2454M26890k41620K39120B79974
14863C84226j45943o966P0832L50665C24970K48679J00569A35065L30842J74349
$$ plain form
14937 106815 316230 364676 435559 270609 409876 390115 392890 198355 474270 187281
14926 339689 235967 435615 78954 839236 379665 517936 529176 506677 219067 463101
14916 463101 490145 445724 433033 434687 -303185 291668 456995 303535 179748 385657
14906 385657 569075 579035 310632 357544 670289 311906 641435 604110 318682 145456
14895 251047 95798 422840 254918 80136 321780 386180 543680 339870 118204 17633
14884 379579 289378 447612 -173282 301182 291520 223329 392689 -182669 298418 312129
14874 312129 320248 48480 610579 360870 180139 147685 574575 332955 572075 279974
14863 384226 238283 231317 302149 652814 324970 573649 674218 135065 465907 640256
14853F40256B69922K67122j91475O2069L93192B22324N38910B23190K03558n3891
14843C72857J2779A24172L02950O1351J2058j77927N0451j43716J76350J09971
14833E15660Q023P3362B92914j7694j397N1653L01871k23262r9670M01496j4143
14822F91768j31876j66258J01231j66077K48057j6784K66600m02090j06012K11028
14812E29587r7659L09839j07388k53971J36300K72661B00314M45457B05892J09438
14802C15330J77106r5989L21403q5508K5655j77594K85739B94943K93111J27631
14792G15685r6168j53582K68169R6432L04813E03232J72320p7383p4687J07133
14782F30615b0720D90120Q2042J62339o1637J7145l06499O26447l20839C06718
$$ plain form
14853 640256 269922 537044 345569 407638 800830 222324 761234 223190 426748 372857
14843 372857 385636 124172 427122 488473 500531 322604 373055 229339 405689 515660
14833 515660 523683 597045 292914 275220 273823 325476 627347 404085 304415 705911 691768
14822 691768 559892 393634 494865 328788 576845 560061 826661 424571 318559 529587
14812 529587 431928 741767 634379 380408 516708 789369 200314 645771 205892 315330
14802 315330 492436 396447 717850 632342 657997 480403 766142 294943 588054 715685
14792 715685 619517 465935 734104 830536 1135349 503232 675552 598169 523482 630615
14782 630615 -20720 490120 572162 734501 672864 690009 383510 1009957 689118 306718
14771G94731j22707l9830r6032k1180J44142L01726k44462k03465R1107J70715
14761G74745J6807j71545j10928J83379J921O2821Q0230J3491K8064C16850P431
14750C24281Q31549E49578Q021M11119k03854O3287j6658r430M4025N6124q0982
14739H21230j50424j13831O01555m30067J25732j19313l099p9256o0230J40869
14729G33166K20561j40593l61805J43945j38021L97552k69619K40392j30475K6284
14719G21387J22247j55282L39586m2008k10063M51665E73172M02550j62314M1552
14709H54960Q1861P0306m19195J34953J37142j46400L44322k08406j02399L98919
14699A146063j42634r2385j32901L66181j41076k61019O10856l48237J92080k78674
$$ plain form
14771 794731 672024 632194 536162 514982 659124 960850 716388 512923 604030 774745
14761 774745 791552 620007 509079 692458 694379 757200 837430 850921 878985 316850 324281
14750 324281 1155830 549578 557599 968718 764864 828151 811493 802063 846088 902212 821230
14739 821230 670806 556975 1158530 728463 854195 734882 731783 652527 592297 733166
14729 733166 953727 813134 451329 595274 457253 854805 585186 825578 695103 721387
14719 721387 843634 688352 1027938 985930 775867 1227532 573172 975722 813408 854960
14709 854960 936821 1007127 587932 722885 860027 713627 1057949 849543 747144 1146063
14699 1146063 1003429 911044 778143 1144324 1003248 742229 1353085 1004848 1196928 918254
14689I18254k63001K24114o4532J62287l43492N56656j37431k00466J71356n7516
14679I66229P3419J48262k21478K63579J05621k62267j44081M68558l48301k24871
14669H24670L63112q4662J97018l64552K2298J34003K03404j05808l0970K13324
14659A371837l76331K41493N4164m53125J41087J69163L48080j54468k0375k19466
14649A102059J78120l07413Q7754J87399j97034M72785k96246J25323k8344K78250
14639A602653l58406k03420K85594J17054k52430K99995l55820K56453j69797
14630A221876r1473M17715m9437o4727J49239r1479q9348K39440l341m14774R5230
14619A318921p1156k7285K54956N14776o00101j27023K85642J93082j57888k18070
$$ plain form
14689 918254 655253 879367 814835 977122 633630 1190286 1052855 852389 1023745 966229
14679 966229 1039648 1187910 966432 1230011 1335632 1073365 929284 1397842 1049541 824670
14669 824670 1187782 1103120 1300138 935586 957884 1091887 1295291 1189483 1158513 1371837
14659 1371837 995506 1236999 1291163 838038 979125 1148288 1496368 1341900 1321525 1102059
14649 1102059 1280179 972766 1060520 1247919 1050885 1523670 1227424 1352747 1324403 1602653
14639 1602653 1244247 1040827 1326421 1443475 1191045 1491040 1135220 1391673 1221876
14630 1221876 1130403 1548118 1498681 1433954 1583193 1491714 1402366 1641806 1638465 1223691 1318921
14619 1318921 1247765 1220480 1475436 1990212 1390111 1263088 1548730 1741812 1583924 1365854
14609A365854r1498M40709K549m06578M67103k79265L13001j99911K21032k25740
14599A607256L18536j05635K5794K31570m13925L54848o6731K42719l25703K27406
14589B096135n3133k76703J19230j18596M95188j99678J58088l28571P5170k8794
14579A938336L60815j29212J61251J19747Q6050k18992M1998J91032j39029J9495
14569B431491j71885L06168k4646j6883Q0499j20027M01507J01521p5626o68j94128
14558B717323N08582q2832M37628j36666O26056K3429L17116P11673J289283J363890
14548G775482K902333Q922350K2261410P930681B4866116I992265D839907j616787
14540C223120o58557l89632N4140k21079L44596l61243K33196K43770j76343p3025
$$ plain form
14609 1365854 1274356 1715065 1717614 1311036 1778139 1498874 1811875 1611964 1832996 1607256
14599 1607256 1925792 1820157 1845951 2077521 1663596 2018444 1951713 2194432 1868729 2096135
14589 2096135 2043002 1766299 1885529 1766933 2262121 2062443 2220531 1891960 1967130 1938336
14579 1938336 2299151 2169939 2331190 2450937 2536987 2317995 2359993 2551025 2411996 2431491
14569 2431491 2259606 2565774 2541128 2524245 2604744 2484717 2886224 2987745 2912119 2911451 2717323
14558 2717323 3225905 3143073 3580701 3444035 4070091 4093520 4410636 5122309 6411592 7775482
14548 7775482 10677815 19600165 41861575 49792256 24866116 9992265 4839907 3223120
14540 3223120 2564563 2174931 2229071 2007992 2352588 1991345 2224541 2468311 2291968 2218943
14530B218943K77422j18217k5978K85489K6439k19807n1474M85690k85380N9103
14520B652230j70530J57512P8692n3878K23050k57519M22521M194k5160r2619
14510B938493K76592o27140O66435j54037j02750J38885k26758L93378k57469
14501C045629L31021j3922O6800J77497j75352r640L6698N1368J14453M64168
14491D088720n23844K11079j57165K63533R8701m9297N4341L0249O6725k05372
14481C877670R7873K0385J80333K10352n3873k22358N59283r0122r1696K21434
14471D709281j37008q2663L35032J12033l10125M03702o8301q2480N4102J1609
14461D945182L80818J73808J62164k58032P8757K50858l52083J14507L38256l45301
$$ plain form
14530 2218943 2496365 2378148 2352170 2637659 2664098 2444291 2392817 2878507 2593127 2652230
14520 2652230 2481700 2639212 2717904 2664026 2887076 2629557 3052078 3056272 3031112 2938493
14510 2938493 3215085 2587945 3254380 3100343 2997593 3136478 2909720 3303098 3045629
14501 3045629 3376650 3362728 3429528 3607025 3431673 3422033 3458731 3510099 3624552 4088720
14491 4088720 3564876 3775955 3618790 3882323 3981024 3931727 3986068 4016317 4083042 3877670
14481 3877670 3975543 3995928 4176261 4386613 4332740 4110382 4669665 4579543 4487847 4709281
14471 4709281 4572273 4489610 4824642 4936675 4626550 5030252 4961951 4879471 4933573 4945182
14461 4945182 5326000 5499808 5661972 5403940 5482697 5733555 5381472 5495979 5834235 5488934
14451E488934N52114j8117P9559R8807L83899l06781j19386K12398P9755K03203
14441F654385q180j19322j2710L66038K06516l96248M39499J08623O4335R9425
14431G402361J3279L1138N8497L37816n9701J60339J74371K1707j70397M30720
14421H400130j6403N50192k70977J50732q7154L54975M74855l62827K42828R6764
14411I533115K34797K48358r1335M38467j96742J09247J14205N18370K1857K97273
14401A1227612N8563q587J81147J92655K16872J02612L82497O05371m581O0619
14391A3014780J7475K56498L46270J46289L13436N56857k07102M99100j55346
14382A4788257O80018O07434K45284k0167K71656L34756M26259L34231O51533
$$ plain form
14451 5488934 6041048 6022931 6102490 6201297 6585196 6278415 6159029 6371427 6451182 6654385
14441 6654385 6646205 6526883 6514173 6880211 7086727 6690479 7129978 7238601 7302936 7402361
14431 7402361 7415640 7446778 7505275 7843091 7783390 7943729 8118100 8139807 7969410 8400130
14421 8400130 8383727 8933919 8662942 8813674 8726520 9081495 9556350 9193523 9436351 9533115
14411 9533115 9767912 10016270 9924935 10363402 10166660 10275907 10390112 10908482 10930339 11227612
14401 11227612 11286175 11277588 11458735 11651390 11868262 11970874 12353371 12958742 12954161 13014780
14391 13014780 13032255 13288753 13635023 13781312 14094748 14651605 14444503 14943603 14788257
14382 14788257 15468275 16075709 16320993 16300826 16572482 16907238 17333497 17667728 18319261
14373A8319261K7237J79299R01004k21430O33763J18601O59684N51067M79479
14364B1647965K96815M42938K59141O21310P60140K12979O35393R25183J67946
14355B5969810Q19120M47417M51610P25225J038837L68244J092533L08532J086100
14346C2307428O87103Q22433J084649O47461J095654J403558M94100J401496R95420
14337D0939302J181339R49790J429784J367392J203145J404738J475770J743647
14329E1694907J954024J222335J890883J910181K103326J550927K674339K292631
14321F7293553K467161K480892K142280K991112K745008L266648K788183L748505
14313H9923342L364451L814273L912327L881297M452532M761382M745486N090097
$$ plain form
14373 18319261 18346498 18525797 19426801 19205371 19839134 19957735 20617419 21168486 21647965
14364 21647965 21944780 22387718 22646859 23268169 24028309 24241288 24876681 25801864 25969810
14355 25969810 26788930 27236347 27687957 28413182 29452019 29820263 30912796 31221328 32307428
14346 32307428 32994531 33816964 34901613 35549074 36644728 38048286 38542386 39943882 40939302
14337 40939302 42120641 43070431 44500215 45867607 47070752 48475490 49951260 51694907
14329 51694907 53648931 54871266 56762149 58672330 60775656 62326583 65000922 67293553
14321 67293553 69760714 72241606 74383886 77374998 80120006 83386654 86174837 89923342
14313 89923342 93287793 97102066 101014393 104895690 109348222 114109604 118855090 123945187
14305A23945187N608820N917953O080764O209099O853117P343649P380196Q614671
14297A77953456P923233R564961R123318J0441495J0611282J0667865J1995807
14290B48281417J2245240J2815882J3348796J3575490J3701763J5059626J4342629
14283C43370843J4670141J5171818J4471696J4261404J3865360J3150041J2217903
14276D41179206J1069970R504046Q074538O353378L721008M04922l092818l257910
14268D73956340m204236m332914p851168r200528j1228004j3659913j4556495
14261D08923082j5451831j5407893j5917656j5620196j5765572j5543055j3857548
14254C01359331j4098818j3830610j3211641j2756708j1853153j1403103j0920190
$$ plain form
14305 123945187 129554007 135471960 141552724 147761823 154614940 161958589 169338785 177953456
14297 177953456 185876689 195441650 204564968 215006463 225617745 236285610 248281417
14290 248281417 260526657 273342539 286691335 300266825 313968588 329028214 343370843
14283 343370843 358040984 373212802 387684498 401945902 415811262 428961303 441179206
14276 441179206 452249176 461753222 469827760 476181138 479902146 480307068 477214250 473956340
14268 473956340 469752104 465419190 457568022 448367494 437139490 423479577 408923082
14261 408923082 393471251 378063358 362145702 346525506 330759934 315216879 301359331
14254 301359331 287260513 273429903 260218262 247461554 235608401 224205298 213285108
14247B13285108r956138j0244429q784510q512204q240227p493531p307514p243094
14239A45503461o444574n349352n871556n430835n112996n026198m352234m226210
14231A03689506m038392l609154l984857l418846l402667l180139k758793l315183
14223G5981475k376954k560596k483933j735011k749467k106735k015938j855401
14215E8097440j826975j578828j333212j627142k147163j309983j539004q25568
14207D5909565p55044j525431j151488j396848j039563j071088j033942q46908
14199C7089253j014811r92916r15025p29112j298027l19542o99994r84593q55725
14190B9279508o79198q23621m44752p58075o05559m11170n42682o56224p70536
$$ plain form
14247 213285108 203328970 193084541 184300031 175787827 167547600 160054069 152746555 145503461
14239 145503461 139058887 133709535 127837979 122407144 117294148 112267950 107915716 103689506
14231 103689506 99651114 96041960 92057103 88638257 85235590 82055451 79296658 75981475
14223 75981475 73604521 71043925 68559992 66824981 64075514 61968779 59952841 58097440
14215 58097440 56270465 54691637 53358425 51731283 49584120 48274137 46735133 45909565
14207 45909565 45154521 43629090 42477602 41080754 40041191 38970103 37936161 37089253
14199 37089253 36074442 35081526 34166501 33437389 32139362 31819820 31119826 30135233 29279508
14190 29279508 28600310 27776689 27331937 26573862 25968303 25557133 25014451 24358227 23587691
14181B3587691k81473o43304j60653q97391j78365m59309m92142K6046m95051
14172B0006049n87755k54464l40127p52774J62768l40896n27936M4922o98008
14163A6711779j36492n80504q52n22518k36433k95222K8507n12164J51135o66948
14153A3940288M9297k11684l22385m93570j97155p5278n794l59388j56306k95057
14143A1872968l21483k05337j98364L8899k57893l2291k85963K29963j94711m68121
14133A0177667J22682n03585R5062k67911q0824j38538J38736l82941k94657q039
14123H857652N6077j48563j98208k27561J4795k1770m1962k88760j85749q9199
14113G726752J99910k79926j5667j35572n27622J04985K16302j1152j26266k72370
$$ plain form
14181 23587691 23306218 22662914 22502261 21604870 21426505 20967196 20475054 20501100 20006049
14172 20006049 19418294 19163830 18823703 18070929 18233697 17892801 17364865 17409787 16711779
14163 16711779 16575287 15994783 15993931 15471413 15234980 14939758 14968265 14456101 14607236 13940288
14153 13940288 13989585 13777901 13455516 12961946 12764791 12689513 12683719 12324331 12168025 11872968
14143 11872968 11551485 11346148 11147784 11186683 10928790 10896499 10610536 10840499 10645788 10177667
14133 10177667 10300349 9796764 9891826 9623915 9543091 9404553 9543289 9160348 8865691 8857652
14123 8857652 8913729 8765166 8566958 8339397 8354192 8332422 8290460 8001700 7815951 7726752
14113 7726752 7926662 7646736 7631069 7495497 6967875 7072860 7289162 7278010 7151744 6879374
14103F879374j63045j71559k50127O53125p56128J74009K34881k40169k19819
14094F140542Q2997k07927J21453m69937K1621N6917n7019Q7183j52967J18365
14084E741228j80508k78492J96330k52726k09938J41823k86042L924m837R7179
14074D967941L31604l58471k77737K38502k38718L7819m8820m1310j21135L23317
14064D812992k24028l49423L0137r1357J06548j13015K50114l2373l54884K87157
14054D321868k27082J26006k20419K06248k55740M0650O0835k21616j88038K71329
14044C914041k4282l54470k1568j4824K95727l02844j92228J58094R8610l69588
14034C186668J94539j95834K75910K05477l49158M70461o65927J60027J59030
$$ plain form
14103 6879374 6716329 6544770 6294643 6947768 6191640 6365649 6600530 6360361 6140542
14094 6140542 6223539 6015612 6137065 5667128 5688749 5745666 5688647 5775830 5622863 5741228
14084 5741228 5560720 5282228 5478558 5225832 5015894 5157717 4871675 4875599 4870762 4967941
14074 4967941 5299545 4941074 4663337 4901839 4663121 4700940 4652120 4610810 4489675 4812992
14064 4812992 4588964 4239541 4269678 4178321 4284869 4171854 4421968 4389595 4034711 4321868
14054 4321868 4094786 4220792 4000373 4206621 3950881 3991531 4052366 3830750 3642712 3914041
14044 3914041 3889759 3535289 3513721 3498897 3794624 3491780 3299552 3457646 3556256 3186668
14034 3186668 3381207 3185373 3461283 3666760 3317602 3788063 3122136 3282163 3441193
14025C441193n53841K68384j9675J44720l08061k06967L81974o1294l75248K57981
14015B969166j91343j5684K81945m17648K12509l46770j0764J41526p0146j43474
14005B409317L86929l84654K05862P3664k11243k11484J90062q5079L74820l33280
13995B414914o1566L2734p1216M63796p915M39896O44951J647800O281163K0861806
13985C2646363J7160713k0310586j4687279n876091k774036j192533n18140k03385
13977D245026q12051q2942j32041k39023j06307N1909J17853l34916J02816n6525
13967B753799l64087K24332j1834j98417n0566L7575N5434k59680K52222j77073
13957B261705L26808l36908J84103k18518p6267k82581K87948k28968L71231j94275
$$ plain form
14025 3441193 2887352 3155736 3136061 3280781 2972720 2765753 3147727 3086433 2711185 2969166
14015 2969166 2777823 2762139 3044084 2626436 2838945 2492175 2481411 2622937 2552791 2409317
14005 2409317 2796246 2411592 2617454 2691118 2479875 2268391 2458453 2373374 2748194 2414914
13995 2414914 2353348 2386082 2314866 2778662 2770747 3210643 3855594 5503394 11784557 32646363
13985 32646363 49807076 29496490 14809211 8933120 6159084 4966551 4448411 4245026
13977 4245026 3432975 3350033 3217992 2978969 2872662 2924571 3042424 2707508 2810324 2753799
13967 2753799 2389712 2614044 2602210 2403793 2353227 2390802 2446236 2186556 2438778 2261705
13957 2261705 2588513 2251605 2435708 2217190 2140923 1858342 2146290 1917322 2288553 2094278
13947B094278j63491L3258J83097l0621j6369N0917k82395J67481k08540K09962
13937B037577j54908j86725O8819K5702j27442L85937k11740k1055K5776N0812
13927A892753j17134K08177Q3291k36118R8622J2587l32526O934Q4828K63591
13917A965005k33837R6987N6640m86577K57271o3862j12355j5589M88224o13413
13907A338494L06940m8205l42241J43639M03535l55722l22558L13034j1006J85154
13897A611064j65617P7967j79850M82720n41064K36334J78871m18631O9596R4801
13887A446191j5937J45502k1278o88259M58651J34090j78394Q7537N9994k55194
13877A172903k82847N94275j70077Q9376j60207L61688k69878J3211j60036j53446
$$ plain form
13947 2094278 1930787 1964045 2147142 2116521 2100152 2151069 1868674 2036155 1827615 2037577
13937 2037577 1882669 1695944 1764763 1790465 1663023 2048960 1837220 1816165 1841941 1892753
13927 1892753 1775619 1983796 2067087 1830969 1929591 1942178 1609652 1616586 1701414 1965005
13917 1965005 1731168 1828155 1884795 1398218 1655489 1591627 1479272 1463683 1951907 1338494
13907 1338494 1645434 1597229 1254988 1398627 1802162 1446440 1123882 1436916 1425910 1611064
13897 1611064 1445447 1523414 1343564 1826284 1285220 1521554 1700425 1281794 1351390 1446191
13887 1446191 1430254 1575756 1554478 866219 1324870 1458960 1280566 1368103 1428097 1172903
13877 1172903 890056 1484331 1314254 1403630 1243423 1605111 1335233 1348444 1188408 1034962
13867A034962l16979K70379L73414j99993r3394L73133j77349k24773p3243j12207
13857H53950L92440Q3922k03942K02265J39984k83047p1234J62984j19850o1648
13847A095824k7820j29878Q3008J01121k2806K08608k10246k81643L68091l17207
13837H67052p76J98743r2415j13801K66537j50766J96839k74650J48171l53198
13827F91736L20494j19345K10377l5706L14085m25489M15645n51806O2036J37746
13817A019773k89505J51790q3017o005K04162j08146o9536K13672k84934j32023
13807F16231J40613J62605J39139n6323j29844J58146k3353k73921l8403O5801
13797G60691J50984j27205N492j2330r7721M39270m76884L68197l51387K47461
$$ plain form
13867 1034962 717983 988362 1361776 1161783 1068389 1441522 1264173 1039400 966157 853950
13857 853950 1246390 1330312 1126370 1328635 1468619 1185572 1114338 1277322 1157472 1095824
13847 1095824 1068004 938126 1021134 1122255 1099449 1308057 1097811 816168 1184259 867052
13837 867052 866276 1065019 972604 858803 1125340 974574 1171413 896763 1044934 691736
13827 691736 1012230 892885 1103262 1067556 1381641 956152 1371797 819991 882027 1019773
13817 1019773 730268 882058 799041 793036 997198 889052 819516 1033188 748254 616231
13807 616231 756844 919449 1058588 1002265 872421 1030567 1007214 733293 694890 760691
13797 760691 911675 784470 789962 777632 679911 1119181 642297 1010494 659107 906568
13787I06568M9391j62176R4112k07655p4219K15899j92830j89586M24834J085
13777H65423j53870M20029k10131P976k35670k9763K06674j98611J82224J50096
13767A004377N8290l31736L45960n36876J36067M1067M68538l75297k56694n3085
13757E00611r2704L75297J40825j91488N0262j61197J14117J65274j76017p0615
13747F54365j47905M45701j58520k71660N98078n59415K17435J31826k89221K5726
13737F46410J3631J35114J18577m55222M15344l54750R6388j61670K60930J59490
13727H74242m2251l16945K30085L2961l61974L11395C63328N24406k96544Q2799
13717F73989J06323A73439K96162O7340M7484K94586k60633p8985k50440J3729
$$ plain form
13787 906568 955959 793783 887895 680240 606021 821920 629090 439504 864338 865423
13777 865423 711553 1131582 921451 929427 693757 663994 870668 672057 854281 1004377
13767 1004377 1062667 730931 1076891 540015 676082 717149 1185687 810390 553696 500611
13757 500611 407907 783204 924029 732541 782803 621606 735723 900997 724980 654365
13747 654365 506460 952161 793641 521981 1120059 560644 778079 909905 620684 646410
13737 646410 660041 795155 913732 458510 873854 519104 615492 453822 714752 874242
13727 874242 831991 515046 745131 778092 416118 727513 363328 887734 591190 673989
13717 673989 780312 173439 469601 536941 584425 879011 618378 539393 288953 302682
13707C02682L75623r0341k40695K15861L0937J37847C42629M95854m12907J14432
13697E40008j31777M59007m23734n6753M60442l44508L7875O4023K2674l2595
13687E94662o6659J63238R3648B73555K51954L0579j87178L43671j00563j8553
13677E93465o9010K60271k66781k07740K95949j41203j6426K45360l40679L11672
13667F64878C32100L93590l34000M9286L88152l58597K31854B12687J98045l778
13657D06954j55814G9113A7893M35100j16708J98437k56023L58048J92993l44379
13647D85361J9215k4772j15193J85028J18258A45459M28309k09857a37097E34908
13636F51795j01729L38330C84912J23782K85718l32010j22807M84603A08939M88965
$$ plain form
13707 302682 678305 587964 347269 563130 594067 731914 342629 838483 425576 540008
13697 540008 408231 867238 443504 386751 847193 502685 540560 604583 627257 594662
13687 594662 528003 691241 784889 273555 525509 556088 368910 712581 612018 593465
13677 593465 524455 784726 517945 310205 606154 464951 448525 693885 353206 664878
13667 664878 332100 725690 391690 440976 829128 470531 702385 212687 410732 406954
13657 406954 251140 79113 17893 452993 336285 534722 278699 636747 829740 485361
13647 485361 504576 479804 364611 549639 667897 145459 573768 363911 -137097 534908
13636 651795 550066 888396 384912 508694 794412 462402 339595 824198 108939 597904
13626E97904L8307k50745K11569j97651r5097K09482j74582N3989L53919C38440
13615D83642J13080k95195J88966n7577N3829R5103j88242O6816A34720N16719
13605F51439j27980p9520n6372m495B9370K47887K07345L60042k29752J1733A19992
13593D92508J22347B45721J55952j12016A3936L41745k1405j03927P54885H7290
13582B15021R1256N489J21112M9220M8458j38908j66271M28590A00126N7299l2852
13571A24573L2442L18405j27634K49951j54194R9330P3527j68416N1765j31679
13561C68070r6157M8948j42447M7199g9822E51631B47718J67155K7808J68215
13551F10896k62992B6577M33689j28437j62539L08753k1092J11145l0874B54104
$$ plain form
13626 597904 636211 385466 597035 399384 304287 513769 339187 393176 747095 338440
13615 483642 596722 301527 490493 432916 486745 581848 393606 460422 134720 651439
13605 651439 523459 443939 387567 383072 29370 277257 484602 844644 614892 626625 119992
13593 492508 614855 245721 401673 289657 13936 355681 334276 230349 985234 87290
13582 215021 306277 311766 432878 482098 530556 391648 225377 653967 100126 157425 124573
13571 124573 157015 475420 347786 597737 443543 542873 616400 447984 499749 368070
13561 368070 271913 320861 178414 225613 -79822 551631 247718 414873 442681 610896
13551 610896 347904 26577 460266 331829 169290 478043 456951 568096 537222 254104
13540C83689J95960H0444L36492J47097k18151c3015D23772A14437M49395B47018
13529C51847R5270P1875B18529M51713k85211A86883m9876K68925j83741N902
13519B28093J5710K82740k09379M52619k44382j21549j60048q5308a57597F48830
13508D179J24708K05423A56645J24576r088F5564a7059C67583q7892M9532K72548
13497F01771k58263J49555h4520C67209j34918M7129L39284j75771A51454J00334
13487B51788q8585K18986A09305J10877K49767A23677N96613i902A30821J56999
13477B87820j2341K24513p8209A21837L55656F1893K12281D2657L84390j83586
13467B43461J77947j27707k7822l4145g9030C06027m1696L8595j0724j04342J53482
$$ plain form
13540 383689 579649 80444 416936 564033 345882 -33015 423772 114437 563832 247018
13529 351847 447117 518992 218529 670242 385031 186883 137007 405932 222191 228093
13519 228093 243803 526543 317164 769783 525401 403852 243804 158496 -157597 648830
13508 4179 128887 334310 156645 281221 272133 65564 -17059 367583 279691 329223 601771
13497 601771 343508 493063 -84520 367209 232291 279420 618704 442933 151454 251788
13487 251788 163203 382189 109305 220182 469949 123677 720290 -9902 130821 287820
13477 287820 275479 499992 421783 121837 477493 61893 274174 42657 427047 243461
13467 243461 421408 293701 265879 231734 -79030 306027 264331 302926 292202 187860 341342
13456C41342E2503L01495F7439K28246K623Q7613J34812A85191J37961j37478
13446A85674O2477r261C9486J61480k1528h3513c0504i406D24975A50586k8583
13435A22003K11346L2574A55794F206K04935H7804f6483D92211A30086J81667
13425C11753r2858M0778J23734j40528J4430L3812j26751K2751n8820J33506j01112
13414A60695N7077b2598k3016B099N98444k89895j44518K47763j85678J0122D7742
13402C54926E7783K95694D0154K81686K52674a0497C51533k3410E9330b8170C44305
13390C73219j4076Q3559k09427q2963b2330C96930I1913K69385A43699M368J99394
13379C47461n9720Q3103A61321e4270D13650j75118R1373I2718Q6344h4500c8615
$$ plain form
13456 341342 52503 353998 67439 295685 298308 385921 520733 185191 323152 185674
13446 185674 248151 238890 39486 200966 179438 -83513 -30504 -9406 424975 150586 122003
13435 122003 333349 365923 155794 6206 211141 87804 -66483 492211 130086 311753
13425 311753 218895 259673 383407 242879 257309 291121 164370 187121 128301 261807 160695
13414 160695 217772 -22598 -45614 2099 600543 310648 166130 413893 228215 238337 47742
13402 354926 57783 353477 40154 321840 574514 -10497 351533 328123 59330 -28170 344305
13390 373219 359143 442702 233275 150312 -22330 396930 91913 361298 143699 148067 347461
13379 347461 287741 370844 161321 -54270 413650 238532 329905 92718 179062 -84500 -38615
13367D01184j80996J24102F4020K78785j20538K2045P2564a61291B17847C0244
13356F44013l20497g4971E660J42386L07221A51157P6455J49926P1744p9721P4811
13345D44372k05440q0077K62198R5935O5429A28629M9415K31187A19481J31479
13335B50960r0610J06444L0553p9186O499E0708J77895L8640K29817A45103J83485
13324C28588A32812K26983l9081G4686K85153j11219J40584A35747k7849K55197
13314C63095B7850J83320D1343l688M8596J03672j5895H4136P6562K35011A64957
13302D44042A22427D0854J41007J20874K46588B72107l5060q5357a05011B19483
13291B45702E1324M18456F8547J38563F068J59720a47927A5156K39287a55195
$$ plain form
13367 401184 220188 344290 64020 342805 222267 244312 316876 -161291 217847 30244
13356 644013 323516 -74971 5660 148046 455267 151157 227612 377538 449282 369561 444372
13345 444372 238932 158855 421053 516988 582417 128629 178044 409231 119481 250960
13335 250960 160350 266794 297347 218161 224660 50708 228603 267243 497060 145103 328588
13324 328588 132812 359795 320714 74686 359839 248620 389204 135747 107898 363095
13314 363095 27850 211170 41343 37655 86251 189923 174028 84136 160698 395709 164957
13302 444042 122427 40854 181861 302735 549323 272107 237047 151690 -105011 219483
13291 245702 51324 469780 68547 207110 6068 165788 -147927 15156 254443 -155195
13280B25688h7355C91199j58224J13985H4513J30351G2720C0903c0494A08256
13269e7715A39004a79689O4696d6020b2393A73322J9284K66290A04183O5494G2485
13257C38722Q5237A04270a01476A77269d3616A66897C4867L6845L10867K93120
13247F75699A86936N9532b1573m1316j3176B37849e3491G4492K84777G5502L19447
13236C94949A96919E1850j2462j1300L5435J93903G5139M8608A1582a0712B26834
13224A58988n6085j4939J50496I6132j9676K20906j5546M4335j44104L01340k19727
13213B63660a48913A15622a59051I5935e6217r9387C31431P6472E2097M4863K50399
13202C47359A49731K20083r5816J15464j70722g4413C38087J04019a46458g0832
$$ plain form
13280 225688 -87355 391199 232975 346960 84513 214864 72720 30903 -30494 108256
13269 -57715 139004 -179689 -114993 -46020 -22393 173322 192606 458896 104183 169677 72485
13257 338722 423959 104270 -101476 177269 -43616 166897 34867 71712 382579 675699
13247 675699 186936 246468 -21573 -62889 -76065 237849 -53491 74492 359269 75502 394949
13236 394949 196919 51850 39388 28088 63523 257426 75139 123747 11582 -10712 226834
13224 158988 102903 87964 238460 96132 76456 297362 281816 326151 182047 483387 263660
13213 263660 -148913 115622 -159051 95935 -56217 -155604 331431 407903 52097 96960 347359
13202 347359 149731 369814 273998 389462 218740 -74413 338087 442106 -146458 -70832
13191A65436B415M28732B02921c28485E8194A5459J7195L08411g2368F9811J4296
13180H4107b71813D663M06057c6987B50283c8732A42398L4055q7440J90571A4120
13168D45332E5725J46151C1457j0808L816K15242a68051D15359i2725B70883A18070
13156C12113a20676J3289G2093J15803N7283p9605J96722A40335M4205L07326
13146D91866B1168N4680l180K4216b91075C6078P5338a45558C5422L67003g9197
13134A27837A9964K976a1712j56C29718o7416j30292Q3976b80170B10091l4942
13123A75149H4214J41214B2241K64741g5310A21457D1011K20167A7501L04052
13113C21553b8833A2619K34195E9750J20219M8311d5002G9741b00024A3176e588
$$ plain form
13191 165436 2415 431147 202921 -328485 58194 15459 32654 341065 -72368 69811 84107
13180 84107 -271813 4663 410720 -36987 250283 -38732 142398 176453 89013 279584 14120
13168 445332 55725 201876 31457 20649 24465 239707 -168051 415359 -92725 270883 118070
13156 312113 -120676 -107387 72093 187896 245179 165574 362296 140335 184540 491866
13146 491866 21168 75848 72668 96884 -291075 36078 111416 -145558 35422 402425 -79197
13134 127837 19964 22940 -11712 -11868 329718 262302 132010 215986 -280170 210091 175149
13123 175149 84214 225428 22241 286982 -75310 121457 41011 261178 17501 321553
13113 321553 -28833 12619 246814 59750 179969 228280 -45002 79741 -200024 13176 -5588
13101A20216m877M2704B5307b31176Q2189A82705g4233A69806C5393J89489c14248
13089c58448g911B99383g0195A06836M99816B49578j15877b88122a06361G4173
13078C87288F5045h7027C63687j60503b97921B07990f1759K0460k63107H6931
13067b9236l5697B12897B2094a27223A34236o3999K85131j1722h8139p9217A80053
13055C06062q2608a98967C02075A33264f6985C5125L15649N1526P4332b33803
13044G0193r334K76990d2085B78016C1981M7345J24850E9139J32516c35157C47662
13032C9951L6409a49647A92063L3789p6865D0905N83512k61400D1916K54439a38078
13020E0892O8183J00244I9550a26011R119A84895O3547K02811l8439A77702o2403
$$ plain form
13101 120216 115339 158043 25307 -231176 -148987 182705 -74233 169806 35393 224882 -314248
13089 -358448 -7911 299383 -70195 106836 606652 249578 133701 -288122 -106361 74173
13078 387288 65045 -87027 363687 203184 -297921 207990 -61759 -41299 -304406 86931
13067 -29236 -64933 212897 22094 -127223 134236 70237 355368 343646 -88139 -167356 180053
13055 306062 223454 -198967 302075 133264 -66985 35125 350774 402300 476632 -233803
13044 70193 60859 337849 -42085 278016 31981 79326 204176 59139 191655 -335157 347662
13032 39951 76360 -149647 192063 225852 148987 40905 624417 363017 41916 296355 -138078
13020 50892 119075 219319 99550 -126011 -116892 184895 248442 451253 412814 177702 115299
13009A15299l1553K57162E5566K31295B134K16451M4857m2573b6916j06028B76971
12997B13695C0217M7712O9093M1469K5920n3767K32531B5932K66363a00117B63880
12985H4368C1118h0956B62999O3688j15095I1402J09474C8507c08437a232G0981
12973F5716K5504N3804C1802a85990A67718f8359A71005a7915B50044c01059B34671
12961a85067H5335A2529K6594h2781k25533A93269H3965a89679A39074Q5953o8306
12950A56721g8944A28562C4500R0390n6034b75719D4904R2153b20111a08865j65413
12939b74278J03027A3039l859b158j69335J9675B3951K28445q3749J46279F3347
12927C0722b63845B36110a87540g3397r5504B69973b86761J40618e9665A03281
$$ plain form
13009 115299 83746 340908 55566 286861 2134 218585 263442 220869 -26916 -132944 276971
12997 213695 30217 77929 147022 188491 214411 160644 393175 25932 292295 -100117 263880
12985 84368 31118 -80956 262999 326687 211592 91402 200876 38507 -308437 -1232 70981
12973 65716 91220 145024 31802 -185990 167718 -68359 171005 -17915 250044 -301059 234671
12961 -185067 85335 12529 39123 -82781 -308314 193269 83965 -189679 139074 225027 156721
12950 156721 -78944 128562 34500 124890 68856 -275719 44904 137057 -220111 -108865 -274278
12939 -274278 -171251 13039 9180 -2158 -171493 -151818 23951 252396 168647 314926 63347
12927 30722 -263845 236110 -187540 -73397 -168901 269973 -286761 -146143 -59665 103281
12916B73942a74696A80552D1389l19o349g097A51662n1181C4216R7140R1367a57441
12903I2065m4422i8454j29493d6761J1089I0425j3413j7670k4513L060J34149
12892A72038K5839D2872a3202k01481E00833I1082c5598A09893B6596K25367q4857
12881A67106D5190J78926f2773B6407K67071A39187a27064k5906q1286B86758
12870E2638c1785J1523k04519c6696k5057j70169k61645A20763E733Q690a82948
12858a15042J1332B27380b6121A57934D5780K29347e3300C28122o8796a13417
12847C79422c6585p8613K2128A9594M00475j67520J76624A84805G4237a0520C680
12835A62991c3461j07382D0154J67430c4823F4129j3862a10552N3547p65B00127
$$ plain form
12916 273942 -174696 180552 41389 41070 34721 -7097 151662 100481 34216 131356 222723 -157441
12903 92065 47643 -98454 -227947 -46761 -35672 90425 77012 59342 34829 37889 172038
12892 172038 197877 42872 -13202 -214683 500833 91082 -35598 109893 26596 251963 167106
12881 167106 45190 224116 -62773 26407 293478 139187 -127064 -152970 -234256 286758
12870 52638 -31785 -20262 -224781 -36696 -61753 -231922 -493567 120763 5733 14423 -182948
12858 -115042 -103710 227380 -26121 157934 45780 275127 -53300 328122 259326 -113417
12847 379422 -36585 -115198 -93070 19594 420069 252549 429173 184805 74237 -10520 3680
12835 162991 -33461 -140843 40154 207584 -34823 64129 50267 -110552 -57005 -57770 200127
12823b05691g2093M28F7036B7204L1368k1810J24060F354J24880a2116A54022
12811c0962n6118B72463b40144d7259j1287B18433a41486D39908F9701a45633
12800A54627L5408c99650B38929h8589B0945a05191M9414A13814P0344D6314L6638
12789H2952a45912a1541D5287i7564B6508K1953O3979C8590K47738a06466k6081
12778a32547f34o5605K944A28039a04068D1877d2584G2485c8326E3761j3542J18087
12766A58306b73336a00985j58281B3523d6864I2299k7622l1487M07486p3619K9775
12755C96832C8536O5770c66470E5059a67995A05025L1047J1679a59338A61653
12744d6094A12748D7669B1885K14382L07992C649J06539a12276m814A59590K4468
$$ plain form
12823 -205691 -72093 -71665 67036 27204 58572 36762 160822 6354 131234 -12116 154022
12811 -30962 -87080 272463 -240144 -47259 -58546 218433 -141486 439908 69701 -145633
12800 154627 190035 -399650 238929 -88589 20945 -105191 -55777 113814 184158 46314 82952
12789 82952 -145912 -11541 45287 -97564 26508 48461 112440 38590 286328 -106466 -132547
12778 -132547 -634 -66239 -63295 128039 -104068 41877 -42584 72485 -38326 53761 40219 158306
12766 158306 -273336 -100985 -259266 23523 -46864 92299 64677 33190 440676 367057 396832
12755 396832 38536 104306 -366470 55059 -167995 105025 136072 147751 -159338 161653
12744 -46094 112748 47669 21885 236267 544259 3649 110188 -112276 -117090 159590 184058
12733A84058f5570g825m8768O981B20756b11767B03818H1682c50685a63963c9911
12721H5719b46086g1786J1906k78084A98563h7031A8254b55533d0917A78987n5035
12710A23952a95981b2131m0535B32622b10145C31481d456B96065l421j42936R8648
12699B48356D9285N8845a12824n743c2459I7334d087B05985F5110J71471b81539
12687F8657b46247H8483h1213C03859C6577a17301K8397d0747B24296b9874C37612
12675B75742L2793M2073j02956H393J86443L7360g5402A23243a81003A69255E3465
12663c35159a14256j3877A00308j664R978a05167K1600B35564k5552j1783K57887
12652D56116j23355I0013a50130A99937L5768I3412J45544F1735c1634B0214M08285
$$ plain form
12733 184058 -65570 -7825 -56593 -49612 220756 -211767 203818 81682 -350685 -163963 -39911
12721 85719 -246086 -71786 -59880 -337964 198563 -87031 18254 -255533 -40917 178987 123952
12710 123952 -195981 -22131 -62666 232622 -210145 331481 -4456 296065 292644 149708 248356
12699 248356 49285 108130 -112824 -118567 -32459 97334 -4087 205985 65110 236581 -281539
12687 68657 -246247 88483 -81213 303859 36577 -117301 -88904 -40747 224296 -29874 337612
12675 275742 308535 350608 247652 8393 194836 232196 -75402 123243 -181003 169255 53465
12663 -335159 -114256 -128133 100308 98644 108622 -105167 -83567 235564 210012 198229 456116
12652 456116 332761 90013 -150130 199937 235705 93412 238956 61735 -31634 20214 428499
12641D28499A59946b95589b4358j31128C46046b36138B19825k0113I2618l3759
12631E8859J46337b24897C08114j03823k0354j9724K4706J7858b73506a18341
12620A62807D516i15j09541I7287b15772J01001n4841M4534A54921a77860B26895
12608g5172A016O4892M07414A36189J12417a47083K2449j93603B7682J41668K4565
12597A93915N0619I4501a64853B58619q1837n2172L9371E1725j8759l03e2786
12585a36877I8197b01218L2629G5704a38586B42012a32992G4827L07343I8976
12574g7555l502A45068C2294b84138A2764b6783B30920a0818p1704A5395e3262
12562b50925A25309N2627i6531B50304c1626k86506A03845J0465C393a61159A07431
$$ plain form
12641 428499 159946 -295589 -24358 -155486 346046 -236138 219825 199712 92618 58859
12631 58859 205196 -224897 308114 204291 183937 164213 188919 206777 -273506 -118341
12620 162807 4516 -915 -110456 97287 -215772 -114771 -169612 -125078 154921 -177860 226895
12608 -75172 1016 65908 473322 136189 248606 -147083 -124634 -318237 27682 169350 193915
12597 193915 244534 94501 -164853 258619 176782 124610 163981 51725 32966 32663 -52786
12585 -136877 98197 -201218 -168589 75704 -138586 242012 -132992 74827 382170 98976
12574 -77555 -81057 145068 32294 -284138 12764 -26783 230920 -10818 -82522 15395 -53262
12562 -250925 125309 177936 -96531 250304 -31626 -318132 103845 114310 3393 -161159 107431
12550a82367O7684A97490a29482q5208f4321D66633H2106a74656k04238g2196
12539G3725a20162A22272D4253i826j28482A47294C7942b24275g6677H4113R4058
12528A78171K0045f6252j8568B32568a66343H6543f100j87706A9311a63630J4585
12517a49045K7182k53304h3901b4920G4714b47653C07643h2659C7796K15955O5539
12506C19290b2140a0499A26443a1639B37890a46527A81320b17281H4886M21897
12496E06783k15665C1966Q6905a24864A75780O449b42190A3172a98459Q3880B00092
12484b14675B01285G3464a80198A4231g199A45324a33208D81200D2831J20204
12474A63035J11275K580b58376eo4064B75577b53847A05869e8111k70813C44883
$$ plain form
12550 -182367 -114683 197490 -129482 -214690 -64321 466633 82106 -174656 -378894 -72196
12539 73725 -120162 122272 44253 -9826 -138308 147294 37942 -224275 -76677 84113 178171
12528 178171 198216 -66252 -84820 232568 -166343 86543 -6100 -193806 19311 -163630 -149045
12517 -149045 -121863 -375167 -83901 -24920 74714 -247653 307643 -82659 37796 253751 319290
12506 319290 -22140 -10499 126443 -11639 237890 -146527 181320 -217281 84886 506783
12496 506783 291118 31966 118871 -124864 175780 182229 -242190 13172 -198459 -114579 200092
12484 -214675 201285 73464 -180198 14231 -7199 145324 -133208 481200 42831 163035
12474 163035 274310 276890 -258376 -5 -64069 275577 -253847 105869 -58111 -328924 344883
12462A84513k7635b26036D06124b11399j2408A64230b3753A22837M02672A45468
12451f7382r5711G1966m34L0721d42650B7417i1091B8655J9736b25961A65239
12439a35215k20745B52796j24467E7498b32040f3110l40680b6988l8743j45730
12429b11461b432j14919L2732A89428n6419o323J57469F0124j8576f1668A34793
12417b3705A01021b63019B45195e8412L666j28539l95116A87524A521i7589b2008
12405A45831b65623c6467C16134b7215l21883B16414f3114m6469B8455c8433j04266
12394a42699A53324f12917K75480H7308R877a63090D61189A99523a7622j32613
12384a50235A04623a04999k80619B27317c98784A43125F506L30528a21666J8492
$$ plain form
12462 184513 156878 -226036 406124 -211399 -223807 164230 -23753 122837 525509 145468
12451 -67382 -163093 71966 71532 102253 -442650 27417 -91091 28655 48391 -225961 165239
12439 -135215 -355960 252796 128329 57498 -232040 -63110 -403790 -26988 -65731 -211461
12429 -211461 -2432 -117351 -84619 189428 133009 126686 284155 60124 41548 -61668 134793
12417 -23705 101021 -263019 245195 -58412 -54746 -183285 -578401 187524 1521 -97589 -22008
12405 145831 -265623 -36467 316134 -27215 -349098 216414 -63114 -109583 28455 -38433 -142699
12394 -142699 153324 -612917 -337437 87308 97185 -163090 461189 199523 -17622 -150235
12384 -150235 104623 -104999 -385618 227317 -398784 143125 6506 337034 -121666 -103174
12374a03174j58131I6412A4922J54656a04171d6422A82013p3970i8364j36784
12364b35148e6851l4033J2313j59659A57339J05907p879B6038J4321a87989A653
12352B42987a08469j7505a3196B03997G3786b8434A00321J08847F99a42388A05938
12340c30075H1408J10806J51371A17265a51892B0576a81053C25670j05193A09058
12329I4476a15773A90342b40440B39811b18406E5690K77469a67574A01345D689
12318A13920D1750a60901d4943j5273K341A02598b23994J02615R849L7837J8366
12307e5327n0973A55455f0008r682r8699j32279B58797A24243b0631l3083o9184
12296a22898B39277d62831A1123m515J46308L01055p7219a74088B68405A9845
$$ plain form
12374 -103174 -261305 96412 14922 169578 -104171 -46422 182013 108043 -98364 -235148
12364 -235148 -56851 -90884 -78571 -238230 157339 263246 255367 26038 40359 -187989 1653
12352 242987 -108469 -125974 -13196 203997 73786 -28434 100321 209168 699 -142388 105938
12340 -330075 81408 192214 343585 117265 -151892 20576 -181053 325670 220477 109058
12329 94476 -115773 190342 -240440 239811 -218406 55690 333159 -167574 101345 4689
12318 113920 41750 -160901 -44943 -60216 -57875 102598 -223994 -121379 -111530 -73693 -55327
12307 -55327 -106300 155455 -60008 -69690 -168389 -300668 258797 124243 -20631 -53714 -122898
12296 -122898 239277 -462831 11123 6608 152916 453971 376752 -174088 268405 19845
12285a30120A53017J61468j13989c10272B29940f5535C14199a447G596J94308
12275B01904o4446n8917h8978I4821b84363C8742a5240H4938G0K86564F4319K5387
12263H9706d1891A51539J9434C7980c8619o9731D11485A27718J34171c7887k52240
12252b90127A00259h4623K0521I6887b8261j08285A46947k559k2644a10973A00961
12240A58554h3921C13913A8658Q0631b21015D2142Q3718R3766o0180b82699B49235
12228D0081k257J33958B9819O5868J16876J85063k3948g7048b7420C85192E996
12216C08255j43166K89098E4718K02227g6731B41465j4086j4820n7763g6797A18080
12204A09337M0743n2304O7868G5147b0568A24867L2462n0035K54633E7611K80593
$$ plain form
12285 -130120 153017 314485 200496 -310272 229940 -65535 314199 -1447 7596 201904
12275 201904 137458 78541 -88978 94821 -284363 38742 -15240 84938 70 286634 64319 89706
12263 89706 -41891 151539 170973 37980 -38619 -108350 411485 127718 261889 -37887 -290127
12252 -290127 100259 -84623 -64102 96887 -28261 -136546 146947 144388 121744 -110973 100961
12240 158554 -83921 313913 18658 99289 -221015 42142 125860 219626 159446 -282699 249235
12228 40081 37824 171782 29819 95687 212563 397626 373678 -77048 -27420 385192 5996
12216 308255 165089 454187 54718 256945 -76731 241465 227379 212559 154796 -76797 118080
12204 109337 150080 97776 165644 75147 -20568 124867 157329 107294 361927 57611 338204
12193C38204F9592K39134o5480a32756B72630j09671R241M7401I253a03063J2467
12182i0596G8368J4814a40900K3848B69909j20049Q8616I3079b85551D1332R0845
12171A32177Q9550N4273K14880c1146A8449P5795K08532E1841O4276b655l03846
12160c06501g4094C9434K08666J77273A31549m4583J08246m2364C9988K56974
12150B96962I7542f7296I8474K58601a19808A92080p7902g086A01091J9163J6194
12139A36448a04195F6831G338K30128p7703n6270K50856A54649c2775j30941H8656
12127B8396B814Q7234a66155C48610A54812m2778d68429c0046A40049d47210D1959
12115b655q8375c4470l29671a7786F6090B6279b45203A72907g204A02286d1977
$$ plain form
12193 338204 69592 308726 243246 -132756 272630 162959 172200 219601 9253 -103063 -90596
12182 -90596 78368 93182 -140900 -117052 269909 149860 238476 93079 -285551 41332 132177
12171 132177 221727 276000 490880 -31146 18449 94244 302776 51841 116117 -2655 -306501
12160 -306501 -74094 39434 248100 425373 131549 86966 195212 152848 39988 296962
12150 296962 97542 -67296 98474 357075 -119808 192080 114178 -7086 101091 120254 136448
12139 136448 -104195 66831 7338 237466 159763 103493 354349 154649 -32775 -163716 88656
12127 28396 2814 90048 -166155 348610 154812 112034 -468429 -30046 140049 -447210 41959
12115 -2655 -91030 -34470 -364141 -17786 66090 26279 -245203 172907 -7204 102286 -41977
12103a0205j42623o6308A4351g8070L1981n0353A99384a23605C27035c06110R0578
12092b15532C37990A44163C3600J79246F867K31261F7040e0828n2844g817j60574
12081a68391r4911I4005f9372o6654A02132K74132J070146r2264E01210B41850
12070A37750L8980D5822J28214b5697j71587g1293E20039H7909b9170j14555C36459
12058C0947K3283f8134A28534M1011J32275c24143c9295G3658B5593b08983R9950
12047a09033I6082h5614j10775J4168C40155k4509E7807O9155d5394A15516L0629
12036A46145a29830M866j1175f1111j13476A5476J17106a95430N7321n2880P339
12025a83650C5996b11834B08018d3728e277A45205n1098K00536C6406a4743j40967
$$ plain form
12103 -10205 -152828 -219136 14351 -78070 -46089 -96442 199384 -123605 327035 -306110 -215532
12092 -215532 337990 144163 33600 212846 6867 238128 67040 -50828 -103672 -7817 -168391
12081 -168391 -263302 94005 -69372 -136026 102132 376264 1446410 1354146 501210 241850
12070 137750 176730 45822 174036 -25697 -197284 -71293 520039 87909 -29170 -143725 336459
12058 30947 54230 -68134 128534 169545 301820 -324143 -39295 73658 25593 -208983 -109033
12047 -109033 96082 -85614 -196389 -182221 340155 315646 57807 126962 -45394 115516 146145
12036 146145 -129830 -124964 -136139 -61111 -174587 15476 132582 -195430 -138109 -190989 -183650
12025 -183650 35996 -211834 208018 -43728 -5277 145205 94107 294643 36406 -14743 -155710
12014a55710a2306r093G5557Q9826H0772c35165B01615a10092B66537q646J20973
12003C78864j53665j11108M1153m9075j6136c89851A04372D6614A7685g9617A04227
11991A92841F7697K0870b56981a11597A22321N3999a53180j40555J06136F3153
11980b96521e3540K6221C74802b33026c0117j0168B31578D5014e2750B56303n8332
11969A97971d9561E9226c3138l3321A05351b30457j36349A00128b91204n4057
11959c45261a13896c7305E02522b51181A72338B5782a81474j87601h741j82886
11949a91627M9326i611A21318a01804d2214a143l74700b5256j24480p3889a2403
11937b6197c003r7290G6697a07499j13743a9185C13674b3777k49085a18086J0153
$$ plain form
12014 -155710 -12306 -21399 75557 165383 80772 -335165 201615 -110092 266537 257891 378864
12003 378864 225199 114091 155244 106169 90033 -389851 104372 46614 17685 -79617 104227
11991 192841 67697 88567 -256981 -111597 122321 176320 -153180 -293735 -187599 63153
11980 -296521 -53540 -27319 374802 -233026 -30117 -40285 231578 45014 -52750 256303 197971
11969 197971 -49561 59226 -33138 -66459 105351 -230457 -366806 100128 -291204 -345261
11959 -345261 -113896 -37305 502522 -251181 172338 25782 -181474 -369075 -8741 -191627
11949 -191627 -142301 -9611 121318 -101804 -42214 -1143 -375843 -25256 -149736 -223625 -12403
11937 -26197 -3003 -100293 76697 -107499 -221242 -19185 313674 -23777 -272862 -118086 -107933
11926a07933d3681B27046D9162i8215K0074F1610h7016A22637j1202g0584h747
11914A09816a99334N1595O4812H0428a45736e5378r1723B95936b06476I8173k6261
11903G1912K1917b79031q486f4056A07706d0516j40589A16549d6929A79978J38806
11892C18784A26787J06007a39259b0773j26432b2838E7478b28205b1502j65580
11882a87082D4207a24031N3565p530c1412H9732g4000k50177A27072K5116h7494
11870A97404b74436J36278C999K808b69768B59599A9744J20529b61137L0123E9226
11858i361j0574k34794A11939J68691D7874a35985p582B47837J21966A22978a92231
11846B10305F107d7540j50668c5464a4198j4185p2733D4532O5070J44089j01061
$$ plain form
11926 -107933 -43681 227046 49162 -98215 -78141 61610 -87016 122637 111435 -70584 -8747
11914 109816 -199334 -147739 -82927 80428 -145736 -55378 -147101 295936 -206476 98173 71912
11903 71912 93829 -279031 -287517 -64056 107706 -40516 -181105 116549 -46929 179978 318784
11892 318784 126787 232794 -139259 -20773 -147205 -22838 57478 -228205 -21502 -187082
11882 -187082 44207 -124031 -70466 -77996 -31412 89732 -74000 -324177 127072 152188 -87494
11870 197404 -274436 -138158 3999 6807 -269768 259599 19744 140273 -261137 -231014 59226
11858 -9361 -19935 -254729 111939 280630 47874 -135985 -143567 247837 369803 122978 -192231
11846 210305 6107 -47540 -198208 -35464 -14198 -28383 -101116 44532 109602 253691 152630
11835A52630n041c8515r9353A12185b62883E5049N3381J5901a85185k8806j6554
11824b30545A5629c0518k68153B5424b78905I2528a97291k7270m5883Q4875g1453
11812c2764A17657a843m49602F9246C4340a40986A00449d9129r9333M9656k39443
11801c38249B48336j22699k0288n2527Q089f3580j5323p1786k86531I1177b04130
11789g1532I258O6705a09695o0845B84925b39331B09921d1221A95064J224a55385
11777A93988p1218B7814a70731O428G8117d1933o1675j07045A44943a0350D4297
11765H5557a34794I1499M6051b40217e2750p6264A18425l4803M0035j7376b56372
11753a55710A38155F6710L5926Q7989a71990k09143c3734B02551h8606A31170
$$ plain form
11835 152630 147589 -38515 -137868 112185 -262883 55049 108430 124331 -185185 -213991 -230545
11824 -230545 15629 -30518 -298671 25424 -278905 92528 -197291 -224561 -270444 -185569 -71453
11812 -32764 117657 -1843 -451445 69246 34340 -140986 100449 -49129 -148462 -98806 -338249
11801 -338249 248336 125637 105349 52822 60911 -63580 -78903 -150689 -437220 91177 -204130
11789 -71532 9258 75963 -109695 -170540 284925 -239331 209921 -41221 195064 196288 -155385
11777 193988 122770 27814 -170731 -164303 78117 -41933 -103608 -210653 144943 -10350 44297
11765 85557 -134794 91499 137550 -240217 -52750 -129014 118425 83622 123657 106281 -256372
11753 -155710 138155 66710 102636 190625 -171990 -381133 -33734 202551 -88606 131170
11742D1094c8403k92454a27528B7069a75219L2582I2J43991g2531p9042j05054
11731b56627b6625A80922p2189J33948l1143b664C17351B8507M0622K3755a65162
11719A5047d71519D84099a04927d711A06776Q1183p5767f900A09036g3708A36440
11707b0463r3290j0883a6209A88524n0364F1266J01836O8077b24148A50760c3722
11695e9094a5684j43908j29840a09437j44066D43727f6q769r3920A14280l6416
11684G7864b46817h0003B71690j20066C1347J52866c5385C52471j67953F7308
11673c1436k06717b9308o4011K3870p8157D45059B9886J67208a54942p0775A56978
11661A1305N9750h33B5477M8127M73439B08125E3894K02755K3945A25349J23983
$$ plain form
11742 41094 -38403 -330857 -127528 27069 -175219 -142637 92 144083 -72531 -151573 -256627
11731 -256627 -26625 180922 108733 242681 211538 -2664 317351 28507 69129 92884 -165162
11719 15047 -471519 484099 -104927 -4711 106776 187959 112192 -6900 109036 -73708 136440
11707 -20463 -113753 -124636 -16209 188524 138160 61266 163102 231179 -224148 150760 -33722
11695 -59094 -15684 -159592 -289432 -109437 -253503 443727 -66 -8835 -102755 114280 77864
11684 77864 -246817 -80003 271690 151624 31347 184213 -35385 352471 184518 67308
11673 -31436 -238153 -29308 -93319 -69449 -147606 445059 29886 197094 -154942 -225717 156978
11661 11305 71055 -833 25477 73604 547043 208125 53894 256649 280594 125349 249332
11650B49332e3830A35856n7882a19100J4228C1988L0778a0186l0137j02647B63060
11638A34996i9977H9256h9435J6994A83745J23226C2525i1646j45157J13717m8151
11627a71237c986B3210Q1815m6287a32459I1683B0001K20977H8557d7288B38221
11615a14090c4109k88859c4291A72443F7062k721B6470R7915N336A3448a90339
11603A94511a76351o7843m4714A5433J35862n3481N6292f8349A89778p5745h0708
11591D24306g8433b0423j5981A50616a7476G1576M0766r448b0008n301A33191
11579A21733b2121B63997C0047c242A03315b2515B75850A23555J30835A16629
11568a62905f1306A71752J36297g0030c15l3713j05384F3601J50107a17926A00153
$$ plain form
11650 249332 -53830 135856 77974 -119100 -104872 31988 62766 -10186 -40323 -142970 263060
11638 134996 -99977 89256 -89435 -72441 183745 306971 32525 -91646 -236803 -123086 -171237
11627 -171237 -3986 23210 105025 58738 -132459 91683 20001 240978 88557 -47288 238221
11615 -114090 -34109 -322968 -34291 172443 67062 64341 26470 124385 129721 13448 -190339
11603 194511 -176351 -244194 -288908 15433 151295 97814 154106 -68349 189778 114033 -80708
11591 424306 -78433 -20423 -36404 150616 -17476 71576 112342 102894 -20008 -25309 133191
11579 121733 -22121 263997 30047 -3242 103315 -22515 275850 123555 254390 116629
11568 -162905 -61306 171752 308049 -70030 -315 -34028 -139412 63601 213708 -117926 100153
11556B14465a93135B06931J13077a18272N4393C625a29021b4327D16389H7952
11545b53583I5158b67368C52713a91807A05353b00292B32183G5193L31902H2188
11534B47994B2941L20641D5537a67646d4971C22478A40396a09824j37172A88825
11523F8523K15009A15861a62905A19354d2678k4715B11366J69823A39589a99708
11512b75491a21139d1826o383B48051D444K89786c4683D9543d8916A17231L31998
11501D49229A6851L24178A30811o097e9334D33096c7640B29812d8196A20442A3551
11489B87460A42282L8226K4071B1259K19636p1595F9764e9708q3225B0364a1594
11477A11467C5735K27488F5676P5657O2687a744B5038J95621m1234a18799e6703
$$ plain form
11556 214465 -193135 206931 320008 -118272 -63879 3625 -129021 -24327 416389 87952
11545 -253583 95158 -267368 352713 -191807 105353 -200292 232183 75193 407095 82188
11534 247994 22941 343582 45537 -167646 -44971 322478 140396 -109824 -246996 188825
11523 68523 283532 115861 -162905 119354 -42678 -67393 211366 381189 139589 -199708
11512 -275491 -121139 -41826 -48209 248051 4444 294230 -34683 49543 -48916 117231 449229
11501 449229 16851 341029 130811 124714 -59334 433096 -37640 229812 -48196 120442 13551
11489 287460 142282 180508 204579 21259 240895 169300 69764 -59708 -142933 20364 -11594
11477 111467 35735 263223 65676 141333 204020 -1744 25038 220659 179425 -118799 -56703
11465D02655D3877L28807B9984Q9056R2790p7183A9834O812c03764G1799K79515
11454C51314G1201j128i7553B73749A20242m5479J52202h4108A03330b10581A64334
11442a38553A24638a9110D48181A08200M2963R8488F9887l3022B368a38469B01423
11430B41181D6322J8541K74199A66113b517A63872b94337a4657B01767O5971i2002
11418b0950I204J60954a67229A42123k038J40136k9411a02455A37891R6359C3877
11406a55085B1085L62352G7943a55576B23057a95243C32675B1892b0174B22800
11395B22904J36432a47720b9670I640b84156d6469a2296A3104n29a07586C43624
11383f7636J8164n4956A48055P4493D2739f8247j13848H0122L7507j4781a67334
$$ plain form
11465 402655 43877 372684 29984 119040 211830 134647 19834 26646 -303764 71799 351314
11454 351314 71201 70073 -97553 273749 120242 74763 226965 -84108 103330 -210581 164334
11442 -138553 124638 -19110 448181 108200 151163 249651 69887 36865 2368 -138469 201423
11430 241181 46322 64863 339062 166113 -2517 163872 -294337 -14657 201767 267738 -92002
11418 -20950 9204 170158 -167229 142123 140085 280221 250810 -102455 137891 234250 33877
11406 -155085 21085 383437 77943 -155576 223057 -195243 332675 21892 -20174 222800
11395 222904 359336 -147720 -29670 9640 -284156 -46469 -12296 13104 12575 -107586 343624
11383 -67636 -49472 -104428 148055 222548 42739 -68247 -182095 80122 117629 102848 -167334
11371g7040B5336a00276L1199r530l927I3169g6319q6016j27809c7364j54644
11360a92008B43539B2804a96661f686G1903a83287C1034L8751b34283B54046a32329
11348A87181b49329k04110B22260n8276J22236p5653a77078Q7535A8013J78416
11338A96429G4612b38291H8492l0814a98642k222L0354n869l16081a99252f0342
11326f9076K2781r6831m44494C34738b7188m6253k62949d7711j70088l6112C4666
11314B33327L8321d5288B37337i1133A78920G3541a0011B0207a26202l8493j31095
11303b95790P9844A10539c18515A06937a52649d5808j27680o4174L805H1640a42180
11291b21393B82170b05783k2257h6360G2158b77227g8520M444n7066N3689p4832
$$ plain form
11371 -77040 25336 -100276 -69077 -78607 -82534 93169 -76319 -162335 -290144 -37364 -192008
11360 -192008 243539 22804 -196661 -6686 71903 -183287 31034 69785 -234283 254046 -132329
11348 187181 -249329 -453439 222260 163984 286220 210567 -177078 -89543 18013 196429
11338 196429 74612 -238291 88492 57678 -198642 -200864 -170510 -176379 -492460 -199252 -60342
11326 -69076 -46295 -143126 -587620 334738 -27188 -73441 -336390 -47711 -217799 -253911 34666
11314 233327 271648 -45288 237337 -91133 178920 73541 -10011 20207 -126202 -164695 -295790
11303 -295790 -215946 110539 -318515 106937 -152649 -45808 -173488 -237662 -233857 81640 -142180
11291 -221393 282170 -205783 -228040 -86360 72158 -277227 -78520 -74076 -131142 -77453 -152285
11280a52285B40273b62976B08568J0123b83834N20Q3605h570A52479d7393E4347
11268a40488B92423C0122Q7680a7636C84392a14425K6158q6960A30107J02521
11258B32628K3961A00587a57821A51794h8215c7684A3706a74224B9364b01083
11247C5632K83535J8809A58674b28134B45514e8249j18784A15591f4708A5543
11236i6550b8723E7884a36610a4568A19021K9062a99285E8148d270j30903G7533
11224A76273b14381Q4240A25836A1197b2793j76860M4175A62196A8302c01929
11213b15390m998a1249r7477q282p6208J5266B15981A4516i2109D18992E5873
11201b30703B45714B6312J61479H6186k1417a28998j0328O6612p8707L3651D7034
$$ plain form
11280 -152285 240273 -262976 208568 218691 -283834 -283314 -199709 -8570 152479 -47393 54347
11268 -140488 292423 30122 117802 -17636 384392 -114425 -88267 -175227 130107 232628
11258 232628 256589 100587 -157821 151794 -88215 -37684 13706 -174224 29364 -201083
11247 35632 319167 337976 158674 -228134 245514 -58249 -177033 115591 -64708 15543
11236 -96550 -28723 57884 -136610 -14568 119021 148083 -199285 58148 -4270 -135173 77533
11224 176273 -214381 -130141 125836 11197 -22793 -199653 -155478 162196 18302 -301929
11213 -215390 -220388 -11249 -108726 -117008 -193216 -177950 215981 14516 -92109 418992 55873
11201 -230703 245714 26312 187791 86186 64769 -128998 -139326 -72714 -151421 -117770 47034
11189a91941B77962a22709A44185a35369A57902J02777a26598b9220j03936j46634
11179b79790i5726H5646Q3701J0758a39397c8796k14753k95102A95908i7669k06975
11168c04644A54297A1811K92805m4061c65649I2867c33340a58735E9406d6429
11157c97k010l97479i0347r9733j70451N7574O5688F2299c5274p7456K6061c0604
11144b18656R3828B38957g0178c4618A05278a63818A35444m4742R2049N1903b64226
11132b58004I3229a13209B94271A26414e6969l5245m984p2750A08802J283J6797
11121A26882N3428D3679L919b17618A27801J38469A04551a79449j41139B6444
11110B48952k7363a74290B22048H8400L8970Q0982j4580C0746a06178a8364D26273
$$ plain form
11189 -191941 277962 -122709 144185 -135369 157902 260679 -126598 -29220 -133156 -279790
11179 -279790 -95726 85646 169347 180105 -139397 -38796 -253549 -548651 195908 -97669 -304644
11168 -304644 154297 11811 304616 260555 -365649 92867 -333340 -158735 59406 -46429
11157 -397 -2407 -399886 -90347 -190080 -360531 -302957 -237269 62299 -35274 -112730 -86669 -30604
11144 -218656 -124828 238957 -70178 -34618 105278 -163818 135444 90702 182751 234654 -264226
11132 -258004 93229 -113209 294271 126414 -56969 -92214 -97198 -169948 108802 110085 126882
11121 126882 180310 43679 47598 -217618 127801 266270 104551 -179449 -320588 26444
11110 248952 221589 -174290 222048 88400 127370 208352 193772 30746 -106178 -18364 426273
11098C67616A44802M39746a18452A83040K12926r2010j32212a7521F1779J69604
11088B31383p7710J58475p6630a1440I5866c49591h144C38554A13601J23971j07448
11077A30124L13029J29679d4018B23307M2945r7185j2676K69393A22788L94509
11067E17297k4868A12597K33979L63070m6405l7936l12506K35224K1302J9592
11057E88917N7121k4904m7527J63265K99042l92261K29191l73173N62080l22060
11047G39691j49117J1333K4331J68184l3825p5904O5634J7364J8925C69028M30108
11036G99136Q184k09986k16582J38943J92713p3477r573P6430j42630J28525k47592
11025D44091J90426j37131J07286O2514J50857k68104J58937j98296J63423k342
$$ plain form
11098 367616 144802 584548 -118452 183040 395966 303956 171744 -17521 61779 231383
11088 231383 153673 312148 235518 -11440 95866 -349591 -8144 338554 113601 237572 130124
11077 130124 443153 572832 -44018 223307 266252 169067 156391 425784 122788 517297
11067 517297 492429 112597 346576 709646 663241 625305 312799 548023 569325 588917
11057 588917 646038 621134 573607 736872 1035914 643653 872844 499671 1061751 739691
11047 739691 590574 601907 626238 794422 760597 684693 750327 767691 786616 369028 799136
11036 799136 807320 597334 380752 519695 712408 638931 629358 705788 563158 691683 444091
11025 444091 634517 497386 604672 667186 818043 549939 708876 510580 674003 671661
11015F71661j94808J42641m7370j70692M9144M57475l22994B02874L32520j08487
11005D26907K10123j81437J32733j69352J90582N8710J89863j16844O6409k65859
10995E41835K70809O8068C02281M75861q6717L8436N9059Q2983k1189J70980k71218
10984G50476L33598k33913K36889L75874j17429k06530q9167L32440J42885J39282
10974A664405Q77800l80524M95188Q5390l30691N5261K2671k17682k39128k19638
10964A813052l90406J65646O9902j16155l95241K79905J04245j08621N3549J30961
10954A606837l45012Q6929m05581j16299M61628o25549j7145C18485J89909B53827
10943B54467R9845n5738L7329A44608a2887A63324k1885N8517F6547K57625a20386
$$ plain form
11015 671661 476853 619494 572124 401432 450576 908051 585057 202874 535394 426907
11005 426907 637030 455593 588326 418974 609556 668266 858129 741285 807694 541835
10995 541835 812644 880712 302281 778142 691425 729861 788920 871903 850714 1021694 750476
10984 750476 1084074 850161 1087050 1462924 1345495 1138965 1049798 1382238 1525123 1664405
10974 1664405 2542205 2161681 2656869 2742259 2411568 2466829 2489500 2271818 2032690 1813052
10964 1813052 1422646 1588292 1658194 1542039 1146798 1426703 1530948 1422327 1475876 1606837
10954 1606837 1261825 1348754 943173 826874 1288502 662953 645808 318485 508394 253827
10943 254467 354312 298574 335903 144608 -12887 163324 141439 199956 66547 324172 -120386
10931e9853k7798B39279A06256C277K5495J96781P8272j30748i1938A3458b99351
10919D2444K87053C1340M4817a14070B7542P035a43479L5947I4933B5367c2529
10907b05923A22475a36262e1481b3646H0583J50354F8889c88759M8893C447b83350
10895G9886g5278p3474j01493M2115N8075g2807I9015c35896A86895b73375B98234
10883B41796d5564m9548C59746f2605I4698b00510F1996i2914G1078Q1683K21037
10872C73798A41043a38092j11667a09561A07742a05386j69981C92074j77191b11998
10861A42615b26775a0814A04511q548j8699J16180i288m7788j7426b4040n4002
10850g8042A29221J30400B2536R5719B992b9462A88685m7324n4577a69880B20021
$$ plain form
10931 -59853 -87651 239279 106256 3277 28772 225553 303825 173077 -91938 13458 -299351
10919 42444 329497 31340 76157 -114070 27542 34577 -143479 -107532 94933 25367 -32529
10907 -205923 122475 -136262 -51481 -23646 80583 230937 68889 -388759 -339866 3447 -283350
10895 79886 -75278 -148752 -250245 -208130 -150055 -72807 99015 -335896 186895 -273375 298234
10883 241796 -45564 -95112 359746 -62605 94698 -200510 61996 -92914 71078 152761 373798
10872 373798 141043 -138092 -249759 -109561 107742 -105386 -275367 392074 214883 -211998
10861 142615 -226775 -10814 104511 95963 77264 193444 -9288 -57076 -74502 -24040 -78042
10850 -78042 129221 259621 22536 118255 2992 -29462 188685 141361 86784 -169880 220021
10838b11108J8380g2451i726J273k0263A84351b51375j04290N7461a4930G7091
10826b08644l9696d0560J9861H0753J04334F6557c6210l50779a08343a7320j85623
10815b02943B8307J16382h2113r6056J898O8197j98103I5365a14552F6991M20518
10804D87509A5246A679J24789a51156c7808q234k07533E3645b3989j49480j36900
10793c10369i172F5271J01832n8953b0240K387k5679D50273c31403a08918A7842
10781A5812J9616M1586c14764O5480D4325a38935C4296K04107a58145N7876B54941
10769A47859b41257B32998d2079C4942K50803j37585J11636a29367k08302d2906
10758A35030R1752F9150a40726q9314K9910e2381k08171D7331j9058a932D3872
$$ plain form
10838 -211108 -192728 -72451 -9726 -8453 -28716 184351 -251375 -355665 -298204 -14930 77091
10826 -208644 -248340 -40560 -20699 80753 185087 66557 -36210 -386989 -108343 -17320 -202943
10815 -202943 28307 144689 -82113 -178169 -176271 -108074 -306177 95365 -114552 66991 487509
10804 487509 15246 1679 126468 -151156 -37808 -46042 -253575 53645 -23989 -173469 -310369
10793 -310369 -9172 65271 167103 108150 -20240 -17853 -43532 450273 -331403 -108918 17842
10781 15812 35428 77014 -314764 -249284 44325 -138935 34296 238403 -158145 -100269 254941
10769 147859 -241257 232998 -42079 34942 285745 148160 259796 -129367 -337669 -42906
10758 135030 226782 69150 -140726 -230040 -200130 -52381 -260552 47331 28273 -1932 43872
10746a83875d2692k60809A9978J03574P5849a51303A122b26303O2193N5523p9262
10735a87849f9173D4932f7766b4989A86593b32204I9643m9278K53631H1732a01032
10723b01205A61784r901O6256a10300B6884a22500d5746l82229c6180D889a8833
10711a40397A00929A4472a23608A17544h3124q225m4572A9547K98760b5863j72188
10700a98051f3606A92199a12250k74858a91271H2645B6828R8422L2471R2398g2550
10688A6857a72624C56790H07J30781O5374a56612N1521J9325q731j68988Q0207
10677a83278a9762r3394P760k13010e4929F3097J53468a46762M458I5233f9370
10665H0647a71257o814b0589r2054d7080A37313c01939J4175O3861c2889A83499
$$ plain form
10746 -183875 -42692 -303501 19978 123552 199401 -151303 1122 -226303 -164110 -108587 -187849
10735 -187849 -69173 44932 -67766 -24989 186593 -232204 99643 50365 303996 81732 -101032
10723 -201205 161784 151883 218139 -110300 26884 -122500 -45746 -427975 -36180 4889 -18833
10711 -140397 100929 14472 -123608 117544 -83124 -91349 -135921 19547 318307 -25863 -198051
10700 -198051 -63606 192199 -112250 -387108 -191271 82645 26828 125250 157721 250119 -72550
10688 16857 -172624 356790 807 131588 196962 -156612 -105091 -85766 -94497 -263485 -183278
10677 -183278 -19762 -113156 -105396 -318406 -54929 63097 216565 -146762 -142304 95233 -69370
10665 80647 -171257 -178071 -20589 -112643 -47080 137313 -301939 -287764 -223903 -32889 183499
10653c2229j62454j8031b2884A47102L7431b66189d1142B72006b15387O2877D9667
10641a27885N2042f823H7315h5559K8674A52499i6415b2564H5675a64691N1346
10630a13345j79354d9990j50590B71421a90421j43925A06203a50401k60382e0502
10619G5480e7232C7938K5864a97045b7308j65100d3834k03012A5556d8923C0096
10607g0152n8595r6420o879b5197A15747n1699h3647C11810b13175m1859B07177
10595b8533D25696e1403k79471J56708B45040k0443c7132D28273F6279L2053a20111
10583d9688q7334f0377A3220b24480k3884k22965a82067r1688A37961R664a25930
10571f8326A86694f3262e949l9415o3257A31734D3510L44921b7169C6268L95135
$$ plain form
10653 -32229 -194683 -212714 -22884 147102 184533 -266189 -41142 272006 -215387 -152510 49667
10641 -127885 -75843 -6823 87315 -85559 -56885 152499 -96415 -22564 85675 -164691 -113345
10630 -113345 -292699 -49990 -200580 271421 -190421 -334346 106203 -150401 -410783 -50502
10619 75480 -57232 37938 63802 -197045 -27308 -192408 -43834 -246846 15556 -48923 30096
10607 -70152 -128747 -225167 -232046 -25197 115747 64048 -83647 311810 -213175 -255034 207177
10595 -28533 425696 -51403 -330874 -174166 245040 224597 -37132 428273 66279 98332 -120111
10583 -49688 -137022 -60377 13220 -224480 -248364 -471329 -182067 -273755 137961 147625 -125930
10571 -68326 186694 -63262 -5949 -45364 -108621 131734 43510 388431 -27169 36268 431403
10560D31403b33439g2712l09400f4432j73881a06678c7619l53504g9171B71683
10549E2345K80851j50009c11887a6812A9934M890F168P7009i5213p174F2871i8565
10536b79127g7448A99077c04070h4434A12343J73580d62056A3264J30411a74601
10525f4054l50275i1756G4276N5229i3420A69785b33950k1937A27799b04793A24142
10513D48682A37606c20336e3824B83853C551b7133J3105F3049a4814q6888j569
10502a03271A55388i7789A76688g757A89529h6469j87340a19339D9708P5489L3527
10491A58724K22621a44176c4800k21452D8007b26692A44952k5818k2471J25573
10481B22236P1261j23587K28305j19060A15607K99931a71049B62543k4028a58644
$$ plain form
10560 431403 -233439 -72712 -382112 -64432 -238313 -106678 -37619 -391123 -79171 271683
10549 52345 333196 183187 -311887 -16812 19934 24824 6168 83177 -95213 -102387 62871 -98565
10536 -279127 -77448 199077 -304070 -84434 112343 285923 -462056 13264 143675 -174601
10525 -64054 -414329 -91756 74276 129505 -93420 169785 -233950 -255887 127799 -204793 124142
10513 448682 137606 -320336 -53824 283853 3551 -27133 -14028 63049 -14814 -101702 -103271
10502 -103271 155388 -97789 176688 -7757 189529 -86469 -273809 -119339 49708 125197 158724
10491 158724 381345 -144176 -34800 -256252 48007 -226692 144952 119134 96663 222236
10481 222236 293497 169910 398215 279155 115607 415538 -171049 262543 238515 -158644
10470i2024F2187L3987B1634J66328f0417O553A05865d765l97457B29851a01667
10458b94411g4549A82864D5282J57045a13339a9929l7846C7122c5995D1299R9911
10447A41210b7491j04362f5484A00308a23924B41778e4366Q657A11390d58435
10436b03773B07003c51187e624k02670i0535O316A62269K3622a42273F8638a57410
10424f0653B08871a02232A85403h7008l38965C3888K13450E2809B6005J36175
10414A62180p001a44793r144A40282a20606R882b1420h922A53423c05003J46864
10403a58139k7092A17764a3714j2316A47038B6111a06854G0660J08463q0060c52481
10391d4371l658B748J26714O8206n4020Q0247c15741E51461a34004B00593q5174
$$ plain form
10470 -92024 62187 96174 21634 187962 -60417 -53864 105865 -4765 -402222 229851 -101667
10458 -294411 -74549 182864 45282 202327 -113339 -19929 -57775 37122 -35995 41299 141210
10447 141210 -27491 -131853 -65484 100308 -123924 241778 -54366 -45709 111390 -458435
10436 -203773 207003 -351187 -5624 -208294 -90535 -84219 162269 185891 -142273 68638 -157410
10424 -60653 208871 -102232 185403 -87008 -425973 33888 247338 52809 26005 162180
10414 162180 155179 -144793 -153937 140282 -120606 -110724 -21420 -8922 153423 -305003 -158139
10403 -158139 -185231 117764 -13714 -26030 147038 26111 -106854 70660 179123 99063 -352481
10391 -44371 -48029 2748 129462 197668 143648 223895 -315741 551461 -134004 200593 115419
10380A15419O0694P211a95422D83186E2155a83888C26834a44846B45579I7173
10369A68156K73298P2458j40377K34468j40512A52375m9672J77737a472D18796
10358c8123A99020K15859j33362G4030L54601A46730L13147L3251Q3560R8763
10348F75451r0279j47486E4550M92745k354B01908B3353h6370I8931M7998J3703
10337A60632a84197g8862C53786R7287F4046M5592P5202f636k46595B30256I792
10325E3077g6680D0351K51184n2455K5830d1607n1913B17555A07736B0698L21096
10314C41794A3197k370J64204c36679R2282B64635A16536e1008E0942b00161A23567
10302a48283c9861F2870a01887B73994a28858B59828m187j05433b00679B7927
$$ plain form
10380 115419 176113 183324 -195422 483186 52155 -183888 326834 -144846 245579 97173
10369 168156 441454 513912 373535 608003 467491 152375 102703 280440 -1472 418796
10358 -38123 199020 414879 281517 74030 428631 146730 459877 493128 576688 675451
10348 675451 585172 437686 54550 547295 544941 201908 23353 -86370 98931 146929 160632
10337 160632 -184197 -78862 353786 451073 64046 109638 184840 -6636 -253231 230256 9792
10325 53077 -76680 40351 291535 239080 264910 -41607 -93520 217555 107736 20698 341794
10314 341794 13197 10827 175031 -336679 -244397 264635 116536 -51008 50942 -200161 123567
10302 -148283 -39861 62870 -101887 273994 -128858 259828 255641 150208 -200679 27927
10291h6155c6947k48173H3336a81780H4808q391O9453a26976B58613A7982a09470
10279b65636b610l09508D6870b51872N311D26452h7476D338J88796D8074c243
10267i9621G9356e6154j1878D1862d8574g561C29723A63027J55517c52438C19141
10255A07291J6955b19854A41070a87395q6481B909J49786b31022e5936I4229J25425
10244B19654P7788f9734b4908j27368F9328A5417J80090M3910d30108J69368E1075
10232d3596k19727G5787A0684c3188k4248B75524c57996B0832a46248B32865f5586
10220d1251k45844A6118J0165b01874A0397c66067g108F5654h9872l33570C19738
10208g3572C58040b18823r6872c6975A69551b13982a1394l49958A03168a20734
$$ plain form
10291 -86155 -36947 -285120 83336 -181780 84808 76417 145870 -126976 258613 17982 -109470
10279 -265636 -2610 -312118 46870 -251872 -246561 426452 -87476 4338 193134 48074 -3243
10267 -99621 79356 -56154 -68032 41862 -48574 -7561 329723 163027 318544 -352438 319141
10255 107291 124246 -219854 141070 -187395 -273876 2909 152695 -231022 -55936 94229 219654
10244 219654 297442 -69734 -24908 -152276 69328 15417 195507 239417 -430108 -260740 51075
10232 -43596 -263323 75787 10684 -33188 -57436 275524 -357996 20832 -146248 232865 -65586
10220 -41251 -287095 16118 26283 -201874 10397 -366067 -7108 65654 -89872 -423442 319738
10208 -73572 358040 -218823 -315695 -36975 169551 -213982 -11394 -361352 103168 -120734
10197c18308d9328k45384i7939k76881h539m309D39140c68249D8386J90613B3021
10185E5157c17754P8729A33974R7409H5881e01501A35133c3769k93303j8410d439
10173E12045A32834c03450B19651b28760J09009D1832a99173D4540K40302b18977
10162A42216d9732A00998c09258e3964A5974a5326D8358b28846B28357h7104l60383
10151d47487a01944A29266D9337J32099a19751j11854K3315C7868a60831B72087
10140b45579j28765A24482a94178q6292f0106j97152b3060m24681c8882J7066
10130b1816j54573A91635b6132o1244A31591J0285a0832j21361A42829g3664A79123
10118A04056R8592c990q0223i983a131o7866D0894J04842c63153b5261A15727
$$ plain form
10197 -318308 -49328 -294712 -97939 -374820 -8539 -12848 439140 -368249 48386 238999 23021
10185 55157 -317754 -239025 133974 231383 85881 -501501 135133 -33769 -327072 -345482 -4439
10173 512045 132834 -303450 219651 -228760 -119751 41832 -199173 44540 284842 -218977
10162 142216 -49732 100998 -309258 -53964 15974 -15326 48358 -228846 228357 -87104 -447487
10151 -447487 -101944 129266 49337 181436 -119751 -231605 -208290 37868 -160831 272087
10140 -245579 -374344 124482 -194178 -280470 -60106 -257258 -23060 -447741 -38882 -21816
10130 -21816 -176389 191635 -26132 -87376 131591 141876 -10832 -132193 142829 -73664 179123
10118 104056 202648 -3990 -84213 -9983 -1131 -68997 40894 145736 -363153 -25261 115727
10106e9264l43284P6593f1854E663b9184j56368L0930f7461m04730K08381f996
10094a47659B66409b34840B8607b12510C1988g9939J2223k23047c7077k8857C22181
10082A23547d0888l2181l0397a6714m9729k7749l4835B41162d11431B59888a82645
10070d2080l18047f2131A3101c8991I4107a16190a6983E9066a89370k26156A87402
10058D11348c66056a14776F7226b85390A97544G0796B9042e7190l1273j85385
10048b73848k18746g7230A10736b08453L6956E75486b43492j27937A60230n7899
10038A02331d5211j35584h9128C50339b28708H7173D844b02016g1698Q608C1990
10026b58749a5990p5172l8947e6521p8498O4652C27683A06399i4065a9251C1636
$$ plain form
10106 -59264 -402548 -325955 -61854 5663 -29184 -185552 -154622 -67461 -472191 -263810 -6996
10094 -147659 266409 -234840 28607 -212510 31988 -79939 -67716 -290763 -37077 -65934 322181
10082 123547 -40888 -73069 -103466 -16714 -66443 -94192 -129027 241162 -411431 259888 -182645
10070 -42080 -360127 -62131 13101 -38991 94107 -116190 -16983 59066 -189370 -415526 187402
10058 411348 -366056 -114776 67226 -285390 197544 70796 29042 -57190 -88463 -273848
10048 -273848 -492594 -77230 110736 -208453 -171497 575486 -243492 -371429 160230 102331
10038 102331 -45211 -180795 -89128 350339 -228708 87173 4844 -202016 -71698 -63090 31990
10026 -258749 -15990 -91162 -130109 -56521 -135019 -70367 327683 106399 -94065 -19251 31636
10014B45140b38516F3224j2240K8351J9280J82907a04141J8539j69147N0727K349
10003b01673I428b61801K3087Q9253B7624c93494c7289n3176n2616D892b40621
9991C1692a76331B1292a90469c2489o5694I5227a4011q5973E294a76984D4592
9979g7854B9530k683J26099i6580q0588B01169H1311q358l3859h6453H2241b74218
9966a53166B46332f4670j05478q7468A177e156A11397b6296A34266E9767L0328
9955I0095A961a66495A42476e96701b04354Q363A73331a2314j50327j54770k5485
9944c42896d203k08125C47473h3376m146j58225J15719B52572A01643a02133j82074
9933b84207a33766j618K7470r9160A08348e3104B86987q0447i8495c3788A08136
$$ plain form
10014 245140 -238516 63224 50984 79335 98615 281522 -104141 -85602 -254749 -204022 -201673
10003 -201673 9428 -261801 -238714 -149461 27624 -393494 -37289 -90465 -143081 4892 -240621
9991 31692 -176331 21292 -190469 -32489 -98183 95227 -14011 -99984 5294 -176984 44592
9979 -77854 29530 26847 152946 -96580 -177168 201169 81311 72953 39094 -86453 82241 -274218
9966 -153166 246332 -64670 -170148 -257616 1177 -5156 111397 -26296 134266 59767 90095
9955 90095 1961 -166495 142476 -596701 -204354 -195991 173331 -12314 -162641 -317411 -342896
9944 -342896 -4203 -212328 347473 -83376 -87522 -245747 -130028 252572 101643 -102133 -284207
9933 -284207 -133766 -135384 -107914 -207074 108348 -53104 286987 206540 -98495 -33788 108136
9921A35600a79354A03187a46532K243f0131A98781b0976I6811a16685j61694f9031
9909g3564j3847l7483J2288j08302O213a8187l06494B64141H4566f8546J8014
9898e0532j98349g7135E7731c58818C53727I3468r68J15435Q7242a67137a1418
9886A84751h6163p9972g6894k77772c4322j38396j63240F7857a98210N2136n6459
9875b02533F975f3664A35374K0157b07065q6428i4722j31504c9873l6471j37948
9864b14292O4375I5911a0801A4045b50182B11075c5569a3148A43093a84268i0307
9852a10582C3575J09696E6201P0536d5458j08050A25460a84815L4388k06877A71306
9840A54169D3166d19275B14529d24385a84408l4377q60Q3827e426k41132D10288
$$ plain form
9921 135600 -179354 103187 -146532 -144289 -60131 198781 -20976 96811 -116685 -278379 -69031
9909 -73564 -87411 -124894 -112606 -220908 -214695 -18187 -324681 264141 84566 -68546 -50532
9898 -50532 -248881 -77135 57731 -358818 353727 93468 92500 207935 295177 -167137 -11418
9886 184751 -86163 -166135 -76894 -354666 -34322 -172718 -335958 67857 -198210 -146074 -202533
9875 -202533 6975 -63664 135374 155531 -207065 -293493 -94722 -226226 -39873 -76344 -214292
9864 -214292 -149917 95911 -10801 14045 -250182 211075 -35569 -13148 143093 -184268 -90307
9852 -110582 33575 143271 56201 126737 -45458 -153508 125460 -184815 -150427 -357304 171306
9840 154169 43166 -419275 214529 -424385 -184408 -218785 -219645 -135818 -5426 -246558 410288
9828b6333J857A31815J11882c89965J90268c830j81647j83447F7904G529d38478
9816C07770c04634B13280b88387A0059b04030F8054K60C425c85462J65153A66627
9804B0180I331b24148O1402A28086a56762g2385A99885c09303g0708C4964g2578
9792a54849n772O3132b7086p7240b785F131J67092a80399P6246p2679j15800D7625
9779f2629j04675j90177H5345a64363O0535C04528b05646Q071d2143C54186a8974
9767c0714l62749c1552A05230h6110Q536A10236P8051o6340a85545O2103j12879
9756b36321A96417b36626c804A72605c69668e9468B2641a57789j18022Q5823C74255
9744G6936a10772m0242H0005a19704D39712A35530b7116n7595I964J59877n961
$$ plain form
9828 -26333 -24476 131815 243697 -389965 -199697 -3830 -185477 -368924 67904 7529 -438478
9816 307770 -304634 213280 -288387 10059 -204030 68054 68314 3425 -385462 -220309 166627
9804 20180 9331 -224148 -162746 128086 -156762 -72385 199885 -309303 -70708 34964 -72578
9792 -154849 -160621 -97489 -27086 -104326 -2785 6131 173223 -180399 -104153 -176832 -292632 47625
9779 -62629 -167304 -357481 85345 -164363 -103828 304528 -205646 -197575 -42143 354186 -18974
9767 -30714 -393463 -31552 105230 -86110 -77574 110236 188287 121947 -185545 -123442 -236321
9756 -236321 196417 -236626 -3804 172605 -369668 -59468 22641 -157789 -275811 -189988 374255
9744 76936 -110772 -151014 80005 -119704 439712 135530 -27116 -84711 9964 169841 163880
9733A63880c7463j96709R6651N8667D4475a87108l6452J09659k04159K1418f4077
9721E9325J01492R59c84422i0517j014I516O4643K76525a85853B70851b45326
9709E0590b1819F0819j0780j9537a7576F2974J25111B388c27219i0936B87J73539
9697A73826a16240A9866O7819d82653A33525a42543A1969a34566o7426h896A25260
9685e9056A36561m6383g0052C8069c22388a49190d5882G64a76445k32269D83197
9673B2160a22463B4338P7989f4461B02295a31240b8261G842i6532f911j58552
9662a65463d5616k98657A00176b76243b5902A08387a69908C24419a90811k31782
9652d22593a72740L1407A62904G2224B0477M7288e943j15760j6054H460O855b34404
$$ plain form
9733 163880 -37463 -234172 -137521 -78854 44475 -187108 -223560 -113901 -318060 -296642 -64077
9721 59325 160817 161776 -384422 -90517 -91531 9516 74159 350684 -185853 270851 -245326
9709 50590 -21819 60819 50039 30502 -17576 62974 188085 2388 -327219 -90936 287 173826
9697 173826 -116240 19866 87685 -482653 133525 -142543 11969 -134566 -201992 -8896 125260
9685 -59056 136561 90178 -70052 38069 -322388 -149190 -45882 764 -176445 -408714 483197
9673 22160 -122463 24338 102327 -64461 202295 -131240 -28261 7842 -96532 -6911 -165463
9662 -165463 -45616 -344273 100176 -276243 -25902 108387 -169908 324419 -190811 -422593
9652 -422593 -172740 -141333 162904 72224 20477 67765 -5943 -121703 -137757 8460 15315 -234404
9639c73271A2968b02093O752N9245c9122k25577a26038A02547f8780r5203L8402
9628a25581a7860j67836N2902A15794D9377h4134j10223O8388F0716b98219a20200
9616A24968a58372B2564a2996j27798F4328m288i0433A22566a10633A2752L6041
9605D8793e8586j39753A02752e18375H7568b82186a21851F1099K4494d313m74450
9594d78763a57013E0200b13316A05546J94041n3842b12097F8260B8142J55110
9584A83252d32419A55411A3806a99187n7259j51524J92945I8581b18075a01737
9573b04310j33636i0371I0495a14693A04009d55159a94307r0715I017a67361f8884
9561d4126I4238A0816f1238A23937c10433O1503B12771c33747a13423J9324j19220
$$ plain form
9639 -373271 12968 -202093 -195341 -136096 -39122 -264699 -126038 102547 -68780 -163983 -125581
9628 -125581 -17860 -185696 -132794 115794 49377 -84134 -194357 -125969 60716 -298219 -120200
9616 124968 -158372 22564 -12996 -140794 64328 60040 -90433 122566 -110633 12752 48793
9605 48793 -58586 -198339 102752 -518375 87568 -282186 -121851 61099 85593 -4313 -478763
9594 -478763 -157013 50200 -213316 105546 299587 245745 -212097 68260 28142 183252
9584 183252 -432419 155411 13806 -199187 -256446 -407970 -215025 98581 -218075 -101737
9573 -204310 -337946 -90371 90495 -114693 104009 -455159 -194307 -285022 9017 -167361 -68884
9561 -44126 94238 10816 -61238 123937 -310433 -248930 212771 -333747 -113423 -94099 -213319
9550b13319A71462a22862n6012j10423a02807D2342c22422G0817a47431b2080
9539b4773F8095A9992a52518O9483j65720A18703b07801j305R5599p5487O6058
9528a22936k592A03887a35781j83640m1182J68828A24992e0490j62822i3849k7543
9517a21392C52703A13502b47233C72566A22773b95066B492Q1387L29253i7003
9506C47527C8912d24583F7384k58j8310e1461j0746k9696A59980i9259l2541j13427
9494b45227a19964B51126c04420q5604A16894l6246M7302c3912k20559d3077B51034
9482b03285d5469k22719a5397B85094q6503a99675A6347c07036H3568c71979a71653
9470a6813C22094c71745G521L4382e6234j15851d3276A90080b37128Q757R0811
$$ plain form
9550 -213319 171462 -122862 -178874 -289297 -102807 42342 -322422 70817 -147431 -22080
9539 -24773 68095 19992 -152518 -83035 -248755 118703 -207801 -209106 -113507 -188994 -122936
9528 -122936 -125528 103887 -135781 -319421 -360603 -191775 124992 -50490 -213312 -93849 -121392
9517 -121392 352703 113502 -247233 372566 122773 -295066 2492 83879 413132 -97003
9506 347527 38912 -424583 67384 67126 48816 -51461 -62207 -91903 159980 -99259 -131800 -245227
9494 -245227 -119964 251126 -304420 -390024 116894 80648 127950 -33912 -254471 -43077 251034
9482 -203285 -45469 -268188 -15397 285094 198591 -199675 16347 -307036 83568 -371979 -171653
9470 -16813 322094 -371745 7521 41903 -56234 -172085 -43276 190080 -237128 -228371 -137560
9459a37560G3889O2030i9116j27332K92f2081l11640D4718b5299A30662a17948
9447I8084b35991A16271a626B0564a89187M2619a2451k42327b4333F8835e5627
9435C6128b23848h3094j91818L4203A36132B3400a93341A4641N3656b14647b5045
9423A79595p7629h8732m0004L8637l13402J37930h8355H324e9552j54163I6832
9411C5618J08147a27617M0793B61211c5602h599I0057h5301L0054k98466n9610
9400d13323A99666b01135D2565J31910F6226a46741Q406E5711a61668C6912O3362
9389A00274J289g7975k04524m208a21218J6502L3132I3427B6012a3662n7981A7501
9376b8454B37774j2109F7310J32478d8514B69459c71299A50398c25609a04537
$$ plain form
9459 -137560 73889 135919 -99116 -226448 -226156 -62081 -373721 44718 -25299 130662 -117948
9447 98084 -235991 116271 -1626 20564 -189187 -146568 -12451 -254778 -24333 68835 -55627
9435 36128 -223848 -83094 -274912 -240709 136132 23400 -193341 14641 68297 -214647 -25045
9423 179595 101966 -88732 -128736 -90099 -403501 -265571 -88355 8324 -59552 -213715 96832
9411 35618 143765 -127617 -86824 261211 -35602 -8599 90057 -85301 -55247 -353713 -413323
9400 -413323 199666 -201135 42565 174475 66226 -146741 -138335 55711 -161668 36912 100274
9389 100274 101563 -77975 -282499 -286707 -121218 -104716 -71584 93427 26012 -13662 -71643 17501
9376 -28454 237774 225665 67310 199788 -48514 269459 -371299 150398 -325609 -104537
9365a19916j009l8679j35624J26324m5506A17952a47627j64724B4360f9693C0408
9353e7810D2575g1804c5495D3703b1368j45156B49122h5124K6062b3188A10803
9341a79240d2577l31182I08h6037G9490c83336R8597J23828A65259d2860I7544
9329A52998c59983a67036M3340b8202l38254O6040A58098c1123A9576f0494k93622
9318c54116A88812c30088K6592a30471A27967e2310j18329r8408A23691n5470
9308F8221a00932j43115p2149g1405c4310j10245A03310b64884A82853J8221b23898
9296a86337E5014a78010B2834c14874F6040B1151J1627a33970B29616h8511b6903
9284h913j00322B11266q7042O9083K2797B7346b17304i0089c3878A89496f6807
$$ plain form
9365 -119916 -120925 -159604 -295228 -168904 -214410 117952 -147627 -312351 24360 -69693 30408
9353 -57810 42575 -71804 -35495 43703 -21368 -166524 249122 -85124 -59062 -23188 110803
9341 -179240 -42577 -373759 908 -86037 79490 -383336 -284739 -160911 165259 -42860 97544
9329 152998 -359983 -167036 -123696 -28202 -366456 -300416 158098 -31123 19576 -60494 -354116
9318 -354116 188812 -330088 -303496 -130471 127967 -52310 -170639 -269047 123691 68221
9308 68221 -100932 -244047 -316196 -71405 -34310 -144555 103310 -264884 182853 201074 -223898
9296 -186337 55014 -178010 22834 -314874 66040 21151 32778 -133970 229616 -88511 -26903
9284 -8913 -109235 211266 124224 193307 216104 27346 -217304 -90089 -33878 189496 -66807
9272E0991f36346g3094H8810a61990n1374l9624j99505A55803A7715k941c30361
9260b09690B90334c0760k09140a5280b967j81687A17839a48345M2178B82179E398
9248a52200d4295A30232e0177l01030O3625i8590a379B74252b37509B13743q3255
9237A30488a99683a1920p6927a6509j21842b1247A39404J5949B2669b79877G052
9225f9783m0258m0261a9302j72441j03553G3142c71441a33366a0911j75344F889
9213a73751B44338A01317b08927a8636A1424a68872N1156q6397J01957O859j40071
9202b35368a05453B57377b76012f1340H0904a03070o3893n713f6583o9788d826
9190d5997k88455g270m33120g9560B19267C4263J92404E7231e3370D0652b08592
$$ plain form
9272 50991 -636346 -73094 88810 -161990 -213364 -252988 -452493 155803 17715 14774 -330361
9260 -209690 290334 -30760 -239900 -15280 -2967 -184654 117839 -148345 -106167 282179 5398
9248 -152200 -44295 130232 -50177 -351207 -287582 -98590 -1379 274252 -237509 213743 130488
9237 130488 -199683 -11920 -88847 -16509 -138351 -21247 139404 155353 22669 -279877 7052
9225 -69783 -110041 -150302 -19302 -191743 -295296 73142 -371441 -133366 -10911 -186255 6889
9213 -173751 244338 101317 -208927 -18636 11424 -168872 -117716 -204113 -102156 -95297 -235368
9202 -235368 -105453 257377 -276012 -61340 80904 -103070 -166963 -172676 -66583 -136371 -4826
9190 -45997 -334452 -7270 -440390 -79560 219267 34263 226667 57231 -53370 40652 -208592
9178a7681o3806k88721G8969l1529d24286R4989J34347F7069J09213b43768F2312
9166A00813f8050l69109c8600j4603j48268Q8204N0775k96266A35006K9403L3141
9155A97550i492a788F6922R1059N9203B331a88137j42713A13310R1068a74079
9143F4152A0881L63629C8904j4513a80453N6244A11470k370a7093A97447H5062
9131B37380a12206B01431a99155M5519A16569a58443M2358N5186A13643h167G2613
9119C302K9089i0074F9790e555j1702k04442A48049c27045A96383I6230K19627
9108C15857b05934L4086C15048A11129j4550c76539a30152K167B04155b31291
9097b07622c1445k68802d8890j28732A27975l1239g0791A4359b26356C30729P6388
$$ plain form
9178 -17681 -81487 -370208 78969 47440 -424286 -329297 -194950 67069 176282 -243768 62312
9166 100813 -68050 -437159 -38600 -53203 -201471 -113267 -62492 -358758 135006 164409 197550
9155 197550 -9492 -1788 66922 157981 217184 2331 -188137 -330850 113310 204378 -174079
9143 64152 10881 374510 38904 24391 -180453 -124209 111470 109100 -17093 197447 85062
9131 237380 -112206 201431 -199155 -153636 116569 -158443 -116085 -60899 113643 -8167 72613
9119 3302 32391 -90074 69790 -5555 -17257 -221699 148049 -327045 196383 96230 315857
9108 315857 -205934 -171848 315048 111129 96579 -376539 -130152 -127985 204155 -231291
9097 -207622 -31445 -300247 -48890 -177622 127975 96736 -70791 14359 -226356 330729 407117
9086D07117n6875d0103k00330M4757j4721i1998r5802A40941L27743b29984m1859
9075b71843B33299l6850a53896O3891H0932b30746j2301a18487l5097P3135j91395
9064b71844j16030J85671B3733c4803k6495q8262A21428O1791b62173O3638C8308
9052B95158b27142a11353j67177B4353c33456B55261b03336A72167i61A20910
9041D8315b13187D883a63521E4180M6375K1963b69066a19130l1005g4791j66696
9030b41487A96801h146k82501d1766G9200C1046P0064a5887A49208R8376K3329
9019B70913d889m2089A05956a68358Q0446K9677k13320c3773A3094b33619R1459
9008a42160k8269a1569E1721g5542l05398d735n7540J0748o7681q0780c1803B59321
$$ plain form
9086 407117 350242 -40103 -240433 -195676 -210397 -91998 -187800 140941 468684 -229984 -271843
9075 -271843 233299 196449 -153896 -90005 80932 -230746 -243047 -118487 -153584 -80449 -271844
9064 -271844 -387874 -202203 23733 -34803 -61298 -149560 121428 183219 -262173 -198535 38308
9052 295158 -227142 -111353 -278530 24353 -333456 255261 -203336 172167 -961 120910
9041 48315 -213187 4883 -163521 54180 100555 122518 -269066 -119130 -150135 -74791 -241487
9030 -241487 196801 -8146 -290647 -41766 79200 31046 101110 -15887 149208 247584 270913
9019 270913 -4889 -46978 105956 -168358 -87912 -58235 -271555 -33773 13094 -233619 -142160
9008 -142160 -170429 -11569 51721 -75542 -380940 -4735 -62275 -51527 -119208 -199988 -31803 259321
8995a43259A79004a17162C7026d0404m05058a25920A70140D615P4748L94107b99356
8983c51132M9743A19530h2963o701n7733j11853C4366c22568b4187l28585H5629
8971G81b27768a01959D1492E197g056l2071l46329A03686k5767b19052e0330a6242
8958d9115J6689j19319K6108d4139j63722b2601G5922l1950a35490A46209b03567
8946A21309E7452a31846C3514h8565B25823d7532A81596c2889A07753m4417i2520
8934B46051N30090A43814M92811E479M92695a46097A92619K43826N082L72927
8924H14454j81884R82738Q003127Q153819F286990A959993D02287r2070A17464
8914C6060J33605a47092g1426n0517C9024a07891D99389j14508G0570d4294C19846
$$ plain form
8995 -143259 179004 -117162 37026 -40404 -445462 -125920 170140 4615 79363 473470 -299356
8983 -351132 -301389 119530 -82963 -89664 -147397 -259250 34366 -322568 -24187 -352772 85629
8971 781 -227768 -101959 41492 5197 -7056 -39127 -385456 103686 77919 -219052 -50330 -16242
8958 -49115 -32426 -151745 -125637 -44139 -207861 -22601 75922 43972 -135490 146209 -203567
8946 121309 57452 -131846 33514 -88565 225823 -47532 181596 -32889 107753 63336 -92520
8934 246051 776141 143814 636625 5479 498174 -146097 192619 436445 441527 814454
8924 814454 632570 1615308 9618435 17772254 6286990 1959993 402287 310217 117464
8914 36060 169665 -147092 -71426 -121943 39024 -107891 499389 384881 70570 -44294 319846
8902c02814H5468K66480j45889c9273F1859a50598F0345L1003a33512I5896b54957
8890a84327P7383o0824D0599n315a18784A85286a65466j28479a02874B33309Q9895
8879C23204j2110L3291C8879a78023F6617J27827a94208M0638a1612A07262C1245
8867a04320a1627D3952L41152I0189b41223m0221M7042I8678b68339A80962c33621
$$ plain form
8902 -302814 85468 351948 206059 -39273 61859 -150598 60345 91348 -133512 95896 -254957
8890 -184327 -106944 -167768 40599 35284 -118784 185286 -165466 -293945 -102874 233309 323204
8879 323204 311094 344385 38879 -178023 66617 194444 -194208 -153570 -11612 107262 31245
8867 -104320 -11627 43952 385104 90189 -241223 -281444 -234402 98678 -268339 180962 -333621
$$ [...]
##END NTUPLES=NMR SPECTRUM
##END=
