
##TITLE=UV1259_M11_1332-1242_30_7409759_IwiPTVSk5W
##JCAMPDX= 6.0         $$ Bruker NMR JCAMP-DX V2.0
##DATA TYPE= NMR SPECTRUM
##DATA CLASS= NTUPLES
##ORIGIN= BRUKER
##OWNER= Administrator
$$ 1.72 TOPSPIN		Version 2.1
$$ 2013-01-25 00:42:45.290 -0500  Administrator@X
$$ Compression mode = diff/dup
##.OBSERVE FREQUENCY= 400.02188249412
##.OBSERVE NUCLEUS= ^1H
##.ACQUISITION MODE= SIMULTANEOUS (DQD)
##.ACQUISITION SCHEME= undefined
##.AVERAGES= 8
##.DIGITISER RES= 22
##SPECTROMETER/DATA SYSTEM= spect
##.PULSE SEQUENCE= zg30
##.SOLVENT NAME= COFFEE_meoh
##.SHIFT REFERENCE= INTERNAL, COFFEE_meoh, 1, 14.98509
##AUDIT TRAIL= $$ (NUMBER, WHEN, WHO, WHERE, PROCESS, VERSION, WHAT)
$$ ##TITLE= Audit trail, TOPSPIN		Version 2.1
$$ ##JCAMPDX= 5.01
$$ ##ORIGIN= Bruker BioSpin GmbH
$$ ##OWNER= Administrator
$$ $$ E:\/data/COFFEE/nmr/UV1259_M11_1332-1242_30_7409759_IwiPTVSk5W/10/pdata/1/auditp.txt
$$ ##AUDIT TRAIL=  $$ (NUMBER, WHEN, WHO, WHERE, PROCESS, VERSION, WHAT)
(   1,<2013-01-25 00:42:37.102 -0500>,<Administrator>,<X>,<go>,<TOPSPIN 2.1>,
      <created by zg
	started at 2013-01-25 00:41:31.227 -0500,
	POWCHK enabled, PULCHK disabled,
       configuration hash MD5:
       86 BA 57 50 F2 9D 5C 9B 26 00 A9 28 5F 66 2E 89
       data hash MD5: 64K
       A4 92 A6 3A FA B7 E3 CB 5B 48 E6 28 70 DD 51 42>)
(   2,<2013-01-25 00:42:40.181 -0500>,<Administrator>,<X>,<proc1d>,<TOPSPIN 2.1>,
      <Start of raw data processing
       efp LB = 0 FT_mod = 6 PKNL = 1 PHC0 = 0 PHC1 = 0 SI = 32K 
       data hash MD5: 32K
       F3 66 AA 04 9E 80 FA D7 5E D3 13 50 48 8A 2E 46>)
(   3,<2013-01-25 00:42:40.634 -0500>,<Administrator>,<X>,<proc1d>,<TOPSPIN 2.1>,
      <pk PHC0 = 97.82776 PHC1 = 0 
       data hash MD5: 32K
       21 26 9B 2B 74 84 7A 62 97 6B C0 85 7D B1 05 B8>)
(   4,<2013-01-25 00:42:40.868 -0500>,<Administrator>,<X>,<proc1d>,<TOPSPIN 2.1>,
      <abs ABSG = 1 
       data hash MD5: 32K
       19 E0 49 CA 13 0C DC 88 4E AC 15 72 59 77 9A C8>)
(   5,<2013-01-25 00:42:41.040 -0500>,<Administrator>,<X>,<proc1d>,<TOPSPIN 2.1>,
      <abs ABSG = 2 
       data hash MD5: 32K
       B0 77 57 7C B4 24 1A 01 64 59 87 CF B6 F3 2E 72>)
(   6,<2013-01-25 00:42:41.212 -0500>,<Administrator>,<X>,<proc1d>,<TOPSPIN 2.1>,
      <abs ABSG = 3 
       data hash MD5: 32K
       A1 0C 54 06 FA 43 72 C0 F6 CC 40 60 8A 96 34 1B>)
(   7,<2013-01-25 00:42:41.368 -0500>,<Administrator>,<X>,<proc1d>,<TOPSPIN 2.1>,
      <abs ABSG = 4 
       data hash MD5: 32K
       7E 6C 54 21 D8 0E 11 E1 BA 6F 43 25 81 7F BD 55>)
(   8,<2013-01-25 00:42:41.524 -0500>,<Administrator>,<X>,<proc1d>,<TOPSPIN 2.1>,
      <abs ABSG = 5 
       data hash MD5: 32K
       77 A1 2B DE 31 D7 B6 2B CE 99 ED 7B 11 F1 CD 76>)
$$ ##END=
$$ 
$$ $$ hash MD5
$$ $$ 9E B6 00 E3 17 32 F5 A6 22 33 65 82 4A F6 F8 41
##$RELAX= 
##$RELAX= 
##$RELAX= 
##$RELAX= 
##$RELAX= 
##$RELAX= 
##$RELAX= 
$$ Bruker specific parameters
$$ --------------------------
##$DU= <E:\>
##$EXPNO= 10
$$ [...]
##$TP= (0..7)
150 150 150 150 150 150 150 150
##$TP07= 0
##$TPNAME0= <>
##$TPNAME1= <>
##$TPNAME2= <>
##$TPNAME3= <>
##$TPNAME4= <>
##$TPNAME5= <>
##$TPNAME6= <>
##$TPNAME7= <>
##$TPOAL= (0..7)
0.5 0.5 0.5 0.5 0.5 0.5 0.5 0.5
##$TPOFFS= (0..7)
0 0 0 0 0 0 0 0
##$TUNHIN= 0
##$TUNHOUT= 0
##$TUNXOUT= 0
##$USERA1= <user>
##$USERA2= <user>
##$USERA3= <user>
##$USERA4= <user>
##$USERA5= <user>
##$V9= 5
##$VALIST= <valist>
##$VCLIST= <CCCCCCCCCCCCCCC>
##$VD= 0
##$VDLIST= <DDDDDDDDDDDDDDD>
##$VPLIST= <PPPPPPPPPPPPPPP>
##$VTLIST= <TTTTTTTTTTTTTTT>
##$WBST= 1024
##$WBSW= 4
##$XGAIN= (0..3)
0 0 0 0
##$XL= 0
##$YL= 0
##$YMAX_a= 676970
##$YMIN_a= -576204
##$ZGOPTNS= <>
##$ZL1= 120
##$ZL2= 120
##$ZL3= 120
##$ZL4= 120
##$ABSF1= 14.98509
##$ABSF2= -5.573092
##$ABSG= 5
##$ABSL= 3
##$ALPHA= 0
##$AQORDER= 0
##$ASSFAC= 0
##$ASSFACI= 0
##$ASSFACX= 0
##$ASSWID= 0
##$AUNMP= <proc_prof1d_extract_pilot.lims>
##$AXLEFT= 0
##$AXNAME= <>
##$AXNUC= <1H>
##$AXRIGHT= 0
##$AXTYPE= 0
##$AXUNIT= <>
##$AZFE= 0.1
##$AZFW= 0.1
##$BCFW= 0
##$BC_mod= 0
##$BYTORDP= 0
##$COROFFS= 0
##$CY= 15
##$DATMOD= 1
##$DC= 0
##$DFILT= <>
##$DTYPP= 0
##$F1P= 0
##$F2P= 0
##$FCOR= 0.5
##$FTSIZE= 32768
##$FT_mod= 6
##$GAMMA= 0
##$GB= 0
##$INTBC= 1
##$INTSCL= 1
##$ISEN= 128
##$LB= 0
##$LEV0= 0
##$LPBIN= 0
##$MAXI= 10000
##$MC2= 0
##$MEAN= 0
##$ME_mod= 0
##$MI= 0
##$NCOEF= 0
##$NC_proc= -8
##$NLEV= 6
##$NOISF1= 0
##$NOISF2= 0
##$NSP= 0
##$NTH_PI= 0
##$NZP= 0
##$OFFSET= 14.98509
##$PC= 1
##$PHC0= 97.82776
##$PHC1= 0
##$PH_mod= 1
##$PKNL= yes
##$PPARMOD= 0
##$PPDIAG= 0
##$PPIPTYP= 0
##$PPMPNUM= 2147483647
##$PPRESOL= 1
##$PSCAL= 4
##$PSIGN= 0
##$PYNMP= <proc.py>
##$REVERSE= no
##$SF= 400.02
##$SI= 32768
##$SIGF1= 0
##$SIGF2= 0
##$SINO= 400
##$SIOLD= 32768
##$SPECTYP= <>
##$SREGLST= <1H.CDCl3>
##$SSB= 0
##$STSI= 32768
##$STSR= 0
##$SW_p= 8223.68421052631
##$SYMM= 0
##$S_DEV= 0
##$TDeff= 65536
##$TDoff= 0
##$TI= <>
##$TILT= no
##$TM1= 0
##$TM2= 0
##$TOPLEV= 0
##$USERP1= <user>
##$USERP2= <user>
##$USERP3= <user>
##$USERP4= <user>
##$USERP5= <user>
##$WDW= 1
##$XDIM= 32768
##$YMAX_p= 471488109
##$YMIN_p= -694055
##$CURPLOT= <Network HP LaserJet P1505>
##$CURPRIN= <$Network HP LaserJet P1505>
##$DFORMAT= <normdp>
##$LAYOUT= <+/1D_H.xwp>
##$LFORMAT= <normlp>
##$PFORMAT= <normpl>
##$SURQMSG= 1
$$ End of Bruker specific parameters
$$ ---------------------------------
##NTUPLES= NMR SPECTRUM
##VAR_NAME=  FREQUENCY,     SPECTRUM/REAL,   SPECTRUM/IMAG
##SYMBOL=    X,             R,               I
##VAR_TYPE=  INDEPENDENT,   DEPENDENT,       DEPENDENT
##VAR_FORM=  AFFN,          ASDF,            ASDF
##VAR_DIM=   32768,         32768,           32768
##UNITS=     HZ,            ARBITRARY UNITS, ARBITRARY UNITS
##FACTOR=    0.250966925370066, 1,           1
##FIRST=     8223.43324360094, 47552,        -226557
##LAST=      0,             23245,           51839
##MIN=       0,             -694055,         0
##MAX=       8223.43324360094, 471488109,    0
$$ Real data points
##PAGE= N=1
##DATA TABLE= (X++(R..R)), XYDATA
$$ [...]
19534a01342D7162k1190a4510j18177c7032A28456a61315F1575a0947k95677A33980
$$ -101342 47162 25972 -14510 -132687 -37032 128456 -161315 61575 -10947 -306624 133980
19522a37456A40722b99687A11362E5222N756b25657J9940e2089J5155A09371a27558
$$ -137456 140722 -299687 111362 55222 60978 -225657 -205717 -52089 -36934 109371 -127558
19510A62486g9619j3419j15470H6376a63379D9931b10301e9073A26163M4500J13710
$$ 162486 -79619 -93038 -208508 86376 -163379 49931 -210301 -59073 126163 170663 284373
19499B84373F5058i603m12A48793c76014a79501e8101j5071k87689D0877c8691
$$ 284373 65058 -9603 -10015 148793 -376014 -179501 -58101 -73172 -360861 40877 -38691
19487I6532J34418F7823c73322H3457N25065B49752j24515F1965b7728l61641
$$ 96532 230950 67823 -373322 83457 608522 249752 125237 61965 -27728 -389369
19477c89369J37884Q1117F7020L56203d95887a51915a1842k31753h1314C2505
$$ -389369 -251485 -170368 67020 423223 -495887 -151915 -11842 -243595 -81314 32505
19466b9507j07237l32653I1955a04241k46418m5715A28282J70165b88917J38497
$$ -29507 -136744 -469397 91955 -104241 -350659 -396374 128282 298447 -288917 -150420
19456a50420f1379j74336e5428B42032d7430A40000a61488e0022I0343b91548
$$ -150420 -61379 -235715 -55428 242032 -47430 140000 -161488 -50022 90343 -291548
19445c02663j11646C2132c1226A53864a0589o3231k19070g8179a2263E867d8081
$$ -302663 -414309 32132 -31226 153864 -10589 -73820 -292890 -78179 -12263 5867 -48081
19433f7059b6114k04520i6964r2856h989A18479a81928k9229b6460q3611K6854
$$ -67059 -26114 -230634 -96964 -189820 -8989 118479 -181928 -211157 -26460 -110071 -83217
19422h3217j58400B83024C454a82003A48217a30160O4072H2727a35396n980N9598
$$ -83217 -241617 283024 3454 -182003 148217 -130160 -66088 82727 -135396 -141376 -81778
19411h1778L954j41E415M2372p077J30669c60337J14444a16206A49455b40656
$$ -81778 -77824 -77965 5415 47787 40710 171379 -360337 -245893 -116206 149455 -240656
19399A34806a20394I8156a03091m0811b8973j09891A09572a92762j5150N1438
$$ 134806 -120394 98156 -103091 -143902 -28973 -138864 109572 -192762 -207912 -156474
19389a56474A55034G499b38999Q2347H6189r118c25342A82877a1553A82028I575
$$ -156474 155034 7499 -238999 -156652 86189 77071 -325342 182877 -11553 182028 9575
19377A56639a07856n0496a0444C88172c9979m0203k8692j05774C38402a84333
$$ 156639 -107856 -158352 -10444 388172 -39979 -80182 -108874 -214648 338402 -184333
19366E0359c73927N7762a10888j06862O5863Q797l31K3011A78894c30926f8839
$$ 50359 -373927 -316165 -110888 -217750 -151887 -143090 -143421 -120410 178894 -330926 -68839
19354a95296E2934A6744L2877b35551I5384C9185J88047c64028A37540C3280i1054
$$ -195296 52934 16744 49621 -235551 95384 39185 227232 -364028 137540 33280 -91054
19342D66157A55089E1314J20824p0504c8569r7562k19714J30243a0203A29430
$$ 466157 155089 51314 172138 101634 -38569 -136131 -355845 -225602 -10203 129430
19331i1314r2711H9508b5500m01639a55567p0690M6728k21669B26201A12133C3328
$$ -91314 -184025 89508 -25500 -427139 -155567 -226257 -179529 -401198 226201 112133 33328
19319C75036A72963g9167j10352k9882P6062k22011B73578j27045a10231A16939
$$ 375036 172963 -79167 -189519 -219401 -143339 -365350 273578 146533 -110231 116939
19308D7940L2613a64325a3052j2896B3190a61569e6928r6414M4147j68565G2373
$$ 47940 80553 -164325 -13052 -25948 23190 -161569 -56928 -153342 -109195 -277760 72373
19296A02813O5679J13959h2096A64673m6312j0851a97388A89750b16882B57818
$$ 102813 168492 282451 -82096 164673 118361 107510 -197388 189750 -216882 257818
19285b37200d0850o0629j01892d1319D1060O9592c27664A92894m1601a54328l2448
$$ -237200 -40850 -101479 -203371 -41319 41060 110652 -327664 192894 151293 -154328 -186776
19274a86776j94994a76419q4416e2927j5091l43286a17492m9961M5839j00116
$$ -186776 -381770 -176419 -260835 -52927 -68018 -411304 -117492 -167453 -121614 -221730
19264b21730a0654j43664G6321b71352J12516B75872D4796a50656G5724c01971
$$ -221730 -10654 -154318 76321 -271352 -158836 275872 44796 -150656 75724 -301971
19253g5547l6599c1104j55708n4511B11101b84735d2864J901k8113n7048A32781
$$ -75547 -112146 -31104 -186812 -241323 211101 -284735 -42864 -40963 -69076 -126124 132781
19241G8536K64892e8747j20660Q5289J8219m5033n7099E340f8684A85459h153
$$ 78536 343428 -58747 -179407 -94118 -75899 -120932 -178031 5340 -68684 185459 -8153
19229g7229k0117l6683B54690a96020A01150j5323b27016j94173J44825j5752
$$ -77229 -97346 -134029 254690 -196020 101150 85827 -227016 -421189 -276364 -292116
19219b92116A31142e3170C0298M0855a58482j13610a11776o6414B68516j08975
$$ -292116 131142 -53170 30298 71153 -158482 -272092 -111776 -178190 268516 159541
19209A59541b44528B46018a29055O2805A53815h6713E0829R042j7916e486l8490
$$ 159541 -244528 246018 -129055 -66250 153815 -86713 50829 59871 41955 -5486 -43976
19198d3976j70072A20558e4606C95035K47381G8053b3848j53976f7032j39247
$$ -43976 -214048 120558 -54606 395035 642416 78053 -23848 -177824 -67032 -206279
19188b06279B9659j988e0834l94077D2969J91125f7663k9666G2138b98309J33078
$$ -206279 29659 27671 -50834 -444911 42969 234094 -67663 -97329 72138 -298309 -165231
19177a65231j04620F9541i3607j06587A64889J23321a9295o042j1881m0123l57860
$$ -165231 -269851 69541 -93607 -200194 164889 288210 -19295 -25337 -37218 -77341 -435201
19166d35201G5552a54530j11517N3439E1256a25975j73125A44106M054L4889a64469
$$ -435201 75552 -154530 -266047 -212608 51256 -125975 -299100 144106 148160 183049 -164469
19154G3199B8926J08335a27249E7369f1654l43748a82200o9774B51133a59727
$$ 73199 28926 137261 -127249 57369 -61654 -405402 -182200 -251974 251133 -159727
19143c0447A42374b38965j3472a02806k09225c6565i791D2778Q0517k4362a47931
$$ -30447 142374 -238965 -252437 -102806 -312031 -36565 -9791 42778 123295 98933 -147931
19131d5791k92358l8436a71736m1765B8975A0566i3645H072e6730J2271P020k30021
$$ -45791 -338149 -376585 -171736 -213501 28975 10566 -93645 8072 -56730 -44459 -37439 -267460
19119b67460J18208C0641a09249k6169A62410j5300k3659M1832G5426a04526b6612
$$ -267460 -149252 30641 -109249 -135418 162410 147110 123451 165283 75426 -104526 -26612
19107b28939n262A5974L9828b57444I442J95052i4118A69404a17068j9293j98069
$$ -228939 -234201 15974 55802 -257444 9442 204494 -94118 169404 -117068 -136361 -334430
19096c34430a15010j6963N1448o3794n2700O8359A47303f6093o3032E5933b1076
$$ -334430 -115010 -131973 -80525 -144319 -197019 -128660 147303 -66093 -129125 55933 -21076
19084c6764A53711f518B6977a50102g2006j97461a15232j35534e3507k4718k00980
$$ -36764 153711 -6518 26977 -150102 -72006 -269467 -115232 -250766 -53507 -78225 -279205
19073b79205B3011A0069M54193a8190k7524j35576h1938c9049k37574N3467B90794
$$ -279205 23011 10069 464262 -18190 -45714 -181290 -81938 -39049 -276623 -223156 290794
19061b45510K490C1712K067a91339o8845A57682K51395B8483a4760A45507a81490
$$ -245510 -243020 31712 33779 -191339 -260184 157682 409077 28483 -14760 145507 -181490
19049c9816l7664B7976c2456A59460k9163M9516a73332l7076p0800G0699B9911
$$ -39816 -77480 27976 -32456 159460 130297 179813 -173332 -210408 -281208 70699 29911
19037e00276C0331d0683j02222c928j52717C1141N7410a13443O181C8726c07669
$$ -500276 30331 -40683 -142905 -3928 -156645 31141 88551 -113443 -107262 38726 -307669
19025A34691Q0398P6255C090K58514F5580b04682J02035a289D14057J5193D8731
$$ 134691 215089 291344 3090 261604 65580 -204682 -102647 -1289 414057 429250 48731
19013b63407Q4183O6712O228A9735J0698O733q266a52262b7454l0407B46190g4440
$$ -263407 -179224 -112512 -106284 19735 30433 37166 28900 -152262 -27454 -57861 246190 -74440
19000a05423p8337e2296l36578h2106k0137L1252p9047o9812D2148g31k09413
$$ -105423 -183760 -52296 -388874 -82106 -102243 -70991 -150038 -219850 42148 -731 -210144
18989b10144G3480C4760L4995a29157k11329D67735e8387k1140C6045M0430j0125
$$ -210144 73480 34760 69755 -129157 -340486 467735 -58387 -79527 36045 76475 66350
18978F6350K68908A27269B90J1642J3446J09306a17855K6366A93944h180m992
$$ 66350 335258 127269 290 11932 25378 134684 -117855 -91489 193944 -8180 -13172
18967a3172j76294n1551d8245A85390a01977D1298J04917d80A19053b0727A20617
$$ -13172 -189466 -241017 -48245 185390 -101977 41298 146215 -480 119053 -20727 120617
18955a49341F6873b55867j32050A75973O4486a21065D4480d48086h8218b4449
$$ -149341 66873 -255867 -387917 175973 240459 -121065 44480 -448086 -88218 -24449
18944c45964a35160A62901f298q1662j41455O1428j24134A52720A3343b43193
$$ -345964 -135160 162901 -6298 -87960 -229415 -167987 -292121 152720 13343 -243193
18933a2382j11659A66358n5937a0738p5135H9096c30104f0415A3947K66347F8742
$$ -12382 -124041 166358 110421 -10738 -85873 89096 -330104 -60415 13947 280294 68742
18921D181K30396J01402a71859B01384h7020j9706m1988A50198o6607L7618l2249
$$ 4181 234577 335979 -171859 201384 -87020 -106726 -148714 150198 83591 121209 88960
18910H8960b25915R9314k04487J51773g6952j2335j12019A4402a83693e3457j42379
$$ 88960 -225915 -126601 -331088 -179315 -76952 -89287 -201306 14402 -183693 -53457 -195836
18899a95836D51J55209b67118J22662r8912G7113a57322j13936H0787J40372a67285
$$ -195836 451 155660 -267118 -144456 -243368 77113 -157322 -271258 80787 221159 -167285
18887a28882A3251K48174g9154A25250a17265H372a5859B48528a62745g1420i739
$$ -128882 13251 261425 -79154 125250 -117265 8372 -15859 248528 -162745 -71420 -9739
18875C02879b01516i8656j00193l41628K24354A95719E8483a05773A02724a0996
$$ 302879 -201516 -98656 -198849 -540477 -316123 195719 58483 -105773 102724 -10996
18864b99792a1382r5665l5220k34865J8675J14052A63185l701q567a12718l2722
$$ -299792 -11382 -107047 -142267 -377132 -358457 -244405 163185 159484 150917 -112718 -145440
18853a45440K9512j10947A47716a56462A2740a23977C76087A03131a12932E8557
$$ -145440 -115928 -226875 147716 -156462 12740 -123977 376087 103131 -112932 58557
18842A61317L5195b79377M5305A73944j8519c1356A29414h8599l06685B7881N415
$$ 161317 196512 -279377 -234072 173944 155425 -31356 129414 -88599 -395284 27881 33296
18831C3296J12101l8249p542J5463c1145A91060J3507D0825P7683b13590M1365
$$ 33296 145397 107148 99606 115069 -31145 191060 204567 40825 118508 -213590 -172225
18820a72225F4747R0298M8683N2014I04P9255l6189k043K7154B8610J8404a13880
$$ -172225 64747 155045 203728 255742 904 80159 43970 41927 69081 28610 47014 -113880
18807a16451j20903A1333K08538a36320o2288J3107K3770I7960J41649j16769
$$ -116451 -237354 11333 219871 -136320 -198608 -185501 -161731 97960 239609 122840
18797A22840k4684j5544b15043d0931O545B02551c19069c0164A78869b90771A60578
$$ 122840 98156 82612 -215043 -40931 -34386 202551 -319069 -30164 178869 -290771 160578
18785A26869a2944k9487j21158Q0982J6687k4069J4274q7780j57784j19727K09191
$$ 126869 -12944 -42431 -163589 -82607 -65920 -89989 -75715 -163495 -321279 -441006 -231815
18774b31815A3053O5861F046b18209E2788e32154A29871a54324m2738L686M8826
$$ -231815 13053 78914 6046 -218209 52788 -532154 129871 -154324 -197062 -193376 -144550
18763a44550C7523a86756A06374b82321B2617b26309l3022A08728a60109e1174
$$ -144550 37523 -186756 106374 -282321 22617 -226309 -259331 108728 -160109 -51174
18752B3473b67575a26723k7004k9380k4901e236A9573J63748C9413i5922j90707
$$ 23473 -267575 -126723 -153727 -183107 -208008 -5236 19573 183321 39413 -95922 -286629
18741b86629O6130P9833A74556q1600b15752k13616J17477a34023j36514g2980
$$ -286629 -220499 -140666 174556 92956 -215752 -429368 -311891 -134023 -270537 -72980
18730A12743b37562G1435a7513j36408F3513b88324C23478h5727C01302C6852
$$ 112743 -237562 71435 -17513 -153921 63513 -288324 323478 -85727 301302 36852
18719B2175R2586c7184j15575k00050R9538O7165k741A9069K5727a03802B62422
$$ 22175 114761 -37184 -152759 -352809 -253271 -186106 -188847 19069 44796 -103802 262422
18707a5551j02901A93339D4437K1822n577a29510C8533a08877H5586k4082b10189
$$ -15551 -118452 193339 44437 66259 60682 -129510 38533 -108877 85586 61504 -210189
18695e640j07118A09096c38328H4579A9670K6600P2990C5226f4922j25464K6316
$$ -5640 -112758 109096 -338328 84579 19670 46270 119260 35226 -64922 -190386 -164070
18684a64070F0063b12673k19082K04851j24145a9627E6769g5473L7715M641N18
$$ -164070 60063 -212673 -431755 -226904 -351049 -19627 56769 -75473 -37758 -33117 -32599
18673c2599j76404C1012c05395b987j36777A86085G8502R5398M7719a63276H5298
$$ -32599 -209003 31012 -305395 -2987 -139764 186085 78502 173900 221619 -163276 85298
18661A48056i0351k17487f7935H6082a8645H349b28225L8099A93281b70068a33409
$$ 148056 -90351 -307838 -67935 86082 -18645 8349 -228225 -190126 193281 -270068 -133409
18649h4364L2281J428m85389b63346p781a04344M1262k22585m967O4248B20812
$$ -84364 -52083 -50655 -536044 -263346 -271127 -104344 -63082 -285667 -290634 -226386 220812
18637a68493j35005a1357A6566b24804I844a11177B06440b28649Q1198P0479B32338
$$ -168493 -303498 -11357 16566 -224804 9844 -111177 206440 -228649 -147451 -76972 232338
18625E0601A667c60210h2830l27742B65241h3976b324j31280n2823K5831d3217
$$ 50601 1667 -360210 -82830 -410572 265241 -83976 -2324 -133604 -186427 -160596 -43217
18613a70751B01027G2776a09985A29437d26178a84411Q8027J5171j8821c2151
$$ -170751 201027 72776 -109985 129437 -426178 -184411 -96384 -81213 -100034 -32151
18602b23017B85812A01234m1833J91250a80267C36195f1272c0593F6449a25794
$$ -223017 285812 101234 59401 250651 -180267 336195 -61272 -30593 66449 -125794
18591d22831a88341A49058h0031C3760g0244j71580a846m31435A8496a06083C10827
$$ -422831 -188341 149058 -80031 33760 -70244 -241824 -1846 -433281 18496 -106083 310827
18579c80953R0043a16992r2705p4198l9007A15181n0046j6068b17889j76075a1489
$$ -380953 -290910 -116992 -209697 -283895 -322902 115181 65135 49067 -217889 -393964 -11489
18567a39493A24038e5783P789A82558A8463J15538a40779j56145c7376j65209
$$ -139493 124038 -55783 -47994 182558 18463 134001 -140779 -296924 -37376 -202585
18557b02585L0446G23f5697D3027b38084E9321A4815b40781g731j45231E3071
$$ -202585 -172139 723 -65697 43027 -238084 59321 14815 -240781 -7731 -152962 53071
18545A4698a71136A79885H2988g522D533a1901l7271a3630I7062e2837A5646g2243
$$ 14698 -171136 179885 82988 -7522 4533 -11901 -49172 -13630 97062 -52837 15646 -72243
18532D9307d9787J2672j26194R562r4438h0268A25415g3180I5610c96904E0009
$$ 49307 -49787 -37115 -163309 -153747 -248185 -80268 125415 -73180 95610 -396904 50009
18520d1548k74426j01821A05878c01772a45402f1165A0818h8358j56444C67184
$$ -41548 -315974 -417795 105878 -301772 -145402 -61165 10818 -88358 -244802 367184
18509a96829j07465A22008b57569a04434o0382l4438E1129Q4581b27668e0919
$$ -196829 -304294 122008 -257569 -104434 -164816 -199254 51129 135710 -227668 -50919
18498g1966k15320J11008c5946B0449I68a7435j4225C0834b58119f8032j54532
$$ -71966 -287286 -176278 -35946 20449 968 -17435 -31660 30834 -258119 -68032 -222564
18487b22564Q6263B36906i9910e537k58379a29650B91196j14122b45690a04046
$$ -222564 -136301 236906 -99910 -5537 -263916 -129650 291196 177074 -245690 -104046
18476e8764H2753B8350L05169c38583B82875b07533F7077f4422k70942g4232E69
$$ -58764 82753 28350 333519 -338583 282875 -207533 67077 -64422 -335364 -74232 569
18464i1017A13454e96n8353B4787a9711k08466O9158E3047a13498k65998B58834
$$ -91017 113454 -596 -58949 24787 -19711 -228177 -159019 53047 -113498 -379496 258834
18452H4190e8024n3127j57841A15921k6995a1533A21873a4707j10421A5965f5586
$$ 84190 -58024 -111151 -268992 115921 88926 -11533 121873 -14707 -125128 15965 -65586
18440a04843R744A8501b3390p2947p0190A9284b0573p0190A83896a12155A48770
$$ -104843 -95099 18501 -23390 -96337 -166527 19284 -20573 -90763 183896 -112155 148770
18428G9940a64595M6654D1041a20672B13212m9641C6663b24690d0722a9115F3707
$$ 79940 -164595 -117941 41041 -120672 213212 163571 36663 -224690 -40722 -19115 63707
18416a50187F7870a44405b712j83162B10836d7588J204j37392E2086b74865C620
$$ -150187 67870 -144405 -2712 -185874 210836 -47588 -46384 -183776 52086 -274865 3620
18404g3537a5058l1906J1282A34155k5876e8436k5470k12740P175A21448b03385
$$ -73537 -15058 -46964 -35682 134155 108279 -58436 -83906 -296646 -289471 121448 -203385
18392a67171D32564A14699a01543k0859j52500j72569C19097o9436b61567B28375
$$ -167171 432564 114699 -101543 -122402 -274902 -447471 319097 249661 -261567 228375
18381i5719p4171c3731A19099D9139g7107J7376A2720a4242j2675F7865a5032
$$ -95719 -169890 -33731 119099 49139 -77107 -59731 12720 -14242 -26917 67865 -15032
18369a09652r8414Q4644K5051D0690b45657N8432C52878j56263A7018Q00a16490
$$ -109652 -208066 -123422 -98371 40690 -245657 -187225 352878 196615 17018 17818 -116490
18357A68107G0424b56315B00060a54615j65027F9185a2936j17103A55954J89506
$$ 168107 70424 -256315 200060 -154615 -319642 69185 -12936 -130039 155954 345460
18347C45460a31571l7568j66592N2413B70670c75701J12165B2980J57888b31943
$$ 345460 -131571 -169139 -335731 -283318 270670 -375701 -263536 22980 180868 -231943
18336a63433A56503a22372q2688I8936k4905a97447L9208O3851j94794D7484h6228
$$ -163433 156503 -122372 -205060 98936 74031 -197447 -158239 -94388 -289182 47484 -86228
18324A78862P3224a15546d8919n7327j56634c9248j05083A5533h0179F2692a29338
$$ 178862 252086 -115546 -48919 -106246 -262880 -39248 -144331 15533 -80179 62692 -129338
18312b96875a46822b9544A04571M5209h4278K1881k69477F1270J23840c34082
$$ -296875 -146822 -29544 104571 149780 -84278 -62397 -331874 61270 185110 -334082
18301G0040b4215A5459a54917N4084r6093Q0553j73947A40451e0652G8708d5631
$$ 70040 -24215 15459 -154917 -100833 -196926 -116373 -290320 140451 -50652 78708 -45631
18289a37678M2432L0206p6007j64919a38135A76116C9799a0490G8648a43633A49571
$$ -137678 -95246 -65040 -141047 -305966 -138135 176116 39799 -10490 78648 -143633 149571
18277A25396c63218C14106a08843B57341d49128K11773J14103j3685j60613A51826
$$ 125396 -363218 314106 -108843 257341 -449128 -237355 -123252 -136937 -297550 151826
18266B21536o1328Q3831m1365d21207e1509B40686f3288j34115D5136A1605c90790
$$ 221536 160208 244039 202674 -421207 -51509 240686 -63288 -197403 45136 11605 -390790
18254F9653e27229K54122B03094C4489b09263O1855k583E08796A65915c7549j54412
$$ 69653 -527229 -273107 203094 34489 -209263 -147408 -149991 508796 165915 -37549 -191961
18243a91961A81105B513e6028C8291g9091I6107g7643l852A6432K39157r6964
$$ -191961 181105 2513 -56028 38291 -79091 96107 -77643 -81495 16432 255589 158625
18232A58625a79798G5125j8953g898I0227C9630f1434j50934D7905Q0721a27922
$$ 158625 -179798 75125 56172 -7898 90227 39630 -61434 -212368 47905 128626 -127922
18220b67810G1022b37764i5333B7778O66c11703B24187b99143d2401J0282B9812
$$ -267810 71022 -237764 -95333 27778 28444 -311703 224187 -299143 -42401 -32119 29812
18208a16252q5017D18711a8659C66037C3304c00202A30210j6820c08165A73065
$$ -116252 -201269 418711 -18659 366037 33304 -300202 130210 113390 -308165 173065
18197b19302B22457E3501K13128j21721J00723g0778j8051A60946a45073m9889
$$ -219302 222457 53501 266629 144908 245631 -70778 -88829 160946 -145073 -194962
18187a94962D88387c33188a6990r6283r217F2575c21938i4465n7046B03974C6256
$$ -194962 488387 -333188 -16990 -113273 -122490 62575 -321938 -94465 -151511 203974 36256
18175D5788J00558c18356d9102j4274K3457k71480J40821g372r5356K7814A9434
$$ 45788 146346 -318356 -49102 -63376 -39919 -311399 -170578 -7372 -102728 -74914 19434
18163G4354b21771g0224C494N583b28649I4654b35897K4282e2390B51113f9349
$$ 74354 -221771 -70224 3494 9077 -228649 94654 -235897 -211615 -52390 251113 -69349
18151H723f2459B37049a79709A43200b12626m132E7007e4710k57074A2519g2158
$$ 8723 -62459 237049 -179709 143200 -212626 -216758 57007 -54710 -311784 12519 -72158
18139A21841h8013B67571c2435A09758A1012J38054n1446m4790b16034N1618A73117
$$ 121841 -88013 267571 -32435 109758 11012 149066 97620 52830 -216034 -164416 173117
18127i6309C5116b53656f9383e783j13540E7081b89942A1525O5270J2911M8619
$$ -96309 35116 -253656 -69383 -5783 -119323 57081 -289942 11525 76795 89706 138325
18116A38325a36862B0484f7822k16379E8732g8792k61599J59502N2806e1859n803
$$ 138325 -136862 20484 -67822 -284201 58732 -78792 -340391 -180889 -128083 -51859 -57662
18105e7662I5775C260e0577C35643A11269n4678Q0479K6024b2825j9656c118k12253
$$ -57662 95775 3260 -50577 335643 111269 56591 137070 163094 -22825 -42481 -3118 -215371
18093b15371h0705m3648I9706e4474D51734f3498A76883d28376a13224B02381
$$ -215371 -80705 -124353 99706 -54474 451734 -63498 176883 -428376 -113224 202381
18082B06379I5565e2855a4825I3749J6714b66077i8060I3044L48661a42249I4737
$$ 206379 95565 -52855 -14825 93749 110463 -266077 -98060 93044 441705 -142249 94737
18070A38807C0281J4831K81944e813n01229b41536f1061r4276C99379A01532k4636
$$ 138807 30281 45112 327056 -5813 -507042 -241536 -61061 -155337 399379 101532 76896
18059G6896a86156B55190c40339A19187A644c20107I3690f8559B1746d11427a74900
$$ 76896 -186156 255190 -340339 119187 1644 -320107 93690 -68559 21746 -411427 -174900
18047I3279b80523i1647a8842m6395A14597h8839C12864j19255G5697d5110B21131
$$ 93279 -280523 -91647 -18842 -65237 114597 -88839 312864 193609 75697 -45110 221131
18035C8232Q1006d04449A93118b35039C184K34899Q9710K4005h7384k13701c3045
$$ 38232 119238 -404449 193118 -235039 3184 238083 327793 351798 -87384 -301085 -33045
18023a9037A15583J26970q9282E9221L0017b2523o7321K8069A240a61922e3721
$$ -19037 115583 242553 153271 59221 89238 -22523 -89844 -61775 1240 -161922 -53721
18011d4472A85423c30978J40805p7772B19625c5287F3981a54318A11311L335K00574
$$ -44472 185423 -330978 -190173 -267945 219625 -35287 63981 -154318 111311 114646 315220
18000C15220H7929a38174l7006C7121a18633B7809c02076A01793L22822d4813
$$ 315220 87929 -138174 -175180 37121 -118633 27809 -302076 101793 424615 -44813
17989d0821H6709b91201a25816j3988b8486A4049a46898j99447P0960B18460a09758
$$ -40821 86709 -291201 -125816 -139804 -28486 14049 -146898 -346345 -275385 218460 -109758
17977A13329K92762j89978a40274M6516G8272a13164d318o0250J4450o6435C03336
$$ 113329 406091 216113 -140274 -93758 78272 -113164 -4318 -64568 -50118 -116553 303336
17965C8517J03763a63342J9170c5246n0069n4649a2490B84764L4496G2543a46680
$$ 38517 142280 -163342 -144172 -35246 -85315 -139964 -12490 284764 319260 72543 -146680
17953C5235b77059J23320C49687j09027a67251j71587a9734n8873A15526L0078
$$ 35235 -277059 -153739 349687 240660 -167251 -338838 -19734 -78607 115526 145604
17943A45604b13272A64269a45210A5826K17072b57573F8811c277r6799k65847
$$ 145604 -213272 164269 -145210 15826 232898 -257573 68811 -3277 -100076 -365923
17933c65923C76039A26946a26180M4495A86900a48567C07034b4889n02561E0288
$$ -365923 376039 126946 -126180 -81685 186900 -148567 307034 -24889 -527450 50288
17922G5463d09207f3997A2945c55507a31643A5069J09590a59138B58430H5516
$$ 75463 -409207 -63997 12945 -355507 -131643 15069 124659 -159138 258430 85516
17911a75263A39735n7403a78305N2680A11610d8585n7602A5711L098h1682F1744
$$ -175263 139735 82332 -178305 -125625 111610 -48585 -106187 15711 18809 -81682 61744
17899H1534B0738a10043a1689A01140a5040r2362I1352B9738L05695A00897a62877
$$ 81534 20738 -110043 -11689 101140 -15040 -107402 91352 29738 335433 100897 -162877
17887f6684j52870b0150j01297N2658B36795l0483c60929f4268J0728K0087r365
$$ -66684 -219554 -20150 -121447 -68789 236795 206312 -360929 -64268 -53540 -33453 -42818
17876d2818m19961C23945b20069o654a09875j13537g5198J5278q2331E13197h5109
$$ -42818 -462779 323945 -220069 -226723 -109875 -223412 -75198 -59920 -142251 513197 -85109
17864a88999C35140G9622a11078p571k8218k62235b4417A61360A3101J68163b11746
$$ -188999 335140 79622 -111078 -118649 -146867 -409102 -24417 161360 13101 181264 -211746
17852b5757A43798c9037p38k6556B33824j14680b3588A7111M4737a35817A63721
$$ -25757 143798 -39037 -39775 -66331 233824 119144 -23588 17111 61848 -135817 163721
17840a0299j46140c6824A51473o3357O5272o9890J15005n4258J19053r7921b17623
$$ -10299 -156439 -36824 151473 88116 153388 83498 198503 144245 263298 165377 -217623
17828a38643R461A75396c00989C9295M4246J42868D6732h321H3781a52439O907
$$ -138643 -129182 175396 -300989 39295 83541 226409 46732 -8321 83781 -152439 -145532
17817a45532A82064a0849D76099f5410m7557M511c6582j83647A57145b51151C65469
$$ -145532 182064 -10849 476099 -65410 -112967 -108456 -36582 -220229 157145 -251151 365469
17805h5417B6320A911c0908A94405d5045C8343l452L67338b30336A53921N928
$$ -85417 26320 1911 -30908 194405 -45045 38343 34891 402229 -230336 153921 159849
17794A59849D1196F291J50510a88627Q9214r8264D0180g705k45415J23156H8733
$$ 159849 41196 6291 156801 -188627 -99413 -197677 40180 -7705 -253120 -129964 88733
17782h1680n427K94B4539a18621n1963A89650e8771a400C6835M6879b15363J02067
$$ -81680 -87107 -86813 24539 -118621 -170584 189650 -58771 -1400 36835 83714 -215363 -113296
17770a13296A61327N0224p4512a56568A66426F7778B0758L730M9442J13647K7424
$$ -113296 161327 211551 137039 -156568 166426 67778 20758 24488 73930 187577 215001
17759B15001k6772g1278B9497a48623e6893C0456b11849A9809i6812E5305Q0308
$$ 215001 188229 -71278 29497 -148623 -56893 30456 -211849 19809 -96812 55305 135613
17748A35613b7432A01750a85042B7755K80260A01091J40106N1326b93622A37838
$$ 135613 -27432 101750 -185042 27755 308015 101091 241197 292523 -293622 137838
17737a39967b9251I9712N3793F0704c55404a39012O2806I6879J29502b33122B33291
$$ -139967 -29251 99712 153505 60704 -355404 -139012 -76206 96879 226381 -233122 233291
17725A11869b9990A44574b9841F5196O1614O668b55589A47370j9971K37990a02770
$$ 111869 -29990 144574 -29841 65196 126810 133478 -255589 147370 127399 365389 -102770
17713c10752a28479A7454O3091A6272c41768j21617B13510m5458c20497A17147
$$ -310752 -128479 17454 80545 16272 -341768 -463385 213510 168052 -320497 117147
17702B07425I2241c1155D7531M9888c61950A20648a37298B35811a92417O6843
$$ 207425 92241 -31155 47531 97419 -361950 120648 -137298 235811 -192417 -125574
17692a25574C39992a66742j42060j10245I9698J839q680a33421J4260A92450B2093
$$ -125574 339992 -166742 -308802 -419047 99698 101537 92857 -133421 -119161 192450 22093
17680H4055g30B0273N7237c74134A13193k8108h2941r0950a815j20401e6897b1100
$$ 84055 -730 20273 77510 -374134 113193 85085 -82941 -173891 -1815 -122216 -56897 -21100
17667c43824B54728c5793j97804g8568A14658D8838i414B18354a97151B1446c3792
$$ -343824 254728 -35793 -233597 -78568 114658 48838 -9414 218354 -197151 21446 -33792
17655b17692O7248o5247A09277e2794A11379a66276A81293o5955d368B38160I7915
$$ -217692 -150444 -215691 109277 -52794 111379 -166276 181293 115338 -4368 238160 97915
17643a17809k8526A07843a12558A8691a56737b3570j92846A27090O2330E9625
$$ -117809 -146335 107843 -112558 18691 -156737 -23570 -216416 127090 189420 59625
17632A09700L8442d8129I1409J74835f8068A41359a32017B50137A19114b08758
$$ 109700 148142 -48129 91409 266244 -68068 141359 -132017 250137 119114 -208758
17621F1929e9083E968i7619k56447F0372J10511a67983b442j77088b2942C6882
$$ 61929 -59083 5968 -97619 -354066 60372 170883 -167983 -2442 -179530 -22942 36882
17609D15180a79794A4617O4762k2798a09859H1841P9525e655k7296j03259A08414
$$ 415180 -179794 14617 79379 56581 -109859 81841 161366 -5655 -32951 -136210 108414
17597C39931A48894g7543j15438E4545J59067A4210a42510j37080F5710f391E9153
$$ 339931 148894 -77543 -192981 54545 213612 14210 -142510 -279590 65710 -6391 59153
17585A2473J71138a22200A18116L39973d7310J900b963B4270a36771B61147H9641
$$ 12473 183611 -122200 118116 458089 -47310 -45410 -2963 24270 -136771 261147 89641
17573F4440J41448a53789j15901H2932g1512k8302A64657f396E1678J64456b11093
$$ 64440 205888 -153789 -269690 82932 -71512 -99814 164657 -6396 51678 216134 -211093
17561d0769B65476g566B98540h3839o6828D61642b24002A36387J58504j23279
$$ -40769 265476 -7566 298540 -83839 -150667 461642 -224002 136387 294891 171612
17551A71612B8601K49522j14463b60186E5745K05253g4086A8509e9483a0469B11190
$$ 171612 28601 278123 163660 -260186 55745 260998 -74086 18509 -59483 -10469 211190
17539a8668A20961O5635J21329A27885N5856O0144F7449r301L86826A22303n3380
$$ -18668 120961 186596 307925 127885 183741 243885 67449 58148 444974 122303 68923
17528F8923J56962a32850D10024p5798G0514L21952A57472K7288J19419I8751
$$ 68923 225885 -132850 410024 334226 70514 392466 157472 184760 304179 98751
17517f3241C54947J11545E3672K5360J05994J31106a54043E18366b03405e9910
$$ -63241 354947 466492 53672 79032 185026 316132 -154043 518366 -203405 -59910
17506f9183A76745a48816A80929H4665P6588b55679B32160g8027A200J73030K02707
$$ -69183 176745 -148816 180929 84665 161253 -255679 232160 -78027 1200 174230 376937
17495C76937F1657q791Q7792L5339D4122n501C596a32832A79036J19204i5178
$$ 376937 61657 52866 140658 175997 44122 38621 3596 -132832 179036 298240 -95178
17483I0581J79691a0007C6203a60729A66009M1752b8304j29478E2621J3025M09026
$$ 90581 270272 -10007 36203 -160729 166009 207761 -28304 -157782 52621 65646 474672
17472D74672A46651k5825m0942l6949J1046h3368a6225n5677B06502K8689A3903
$$ 474672 146651 120826 79884 42935 53981 -83368 -16225 -71902 206502 235191 13903
17460D3814J0716M46421j93124d2715C59611A24941J27392r9510L50760C9440
$$ 43814 54530 500951 307827 -42715 359611 124941 252333 152823 503583 39440
17449A36543b23190F5972J65467J0092K51933G6687d9793B24497J15688p5116
$$ 136543 -223190 65972 231439 241531 493464 76687 -49793 224497 340185 265069
17439B65069G6841J52284D9485J80450a19603C66289A07544N5510J8236A7023
$$ 265069 76841 229125 49485 229935 -119603 366289 107544 163054 181290 17023
17428A16427E2237L42737A46641k4219L99925B26260K4993m8910K17401E8020
$$ 116427 52237 394974 146641 122422 522347 226260 251253 202343 419744 58020
17417D03974J18745H8829N12785b4930p987A53071J27410K22883H5158O0264P298
$$ 403974 522719 88829 601614 -24930 -32917 153071 280481 503364 85158 145422 152720
17406A52720f6284C87261I3546c2799A27083i960A1427L41744j58499c88862D63834
$$ 152720 -66284 387261 93546 -32799 127083 -9960 11427 353171 194672 -388862 463834
17394A1276L73833a61130E35515k10921P7190A45089D237c76059A17037O5335
$$ 11276 385109 -161130 535515 324594 401784 145089 4237 -376059 117037 182372
17384A82372L2951n9401p2869L54945j9834F4973K41651b8286B39214I5660A8156
$$ 182372 215323 155922 83053 437998 418164 64973 306624 -28286 239214 95660 18156
17372B89459p2092K8398K78091A14715J16196i332B89706o5724B9179c9720E963
$$ 289459 217367 245765 523856 114715 230911 -9332 289706 223982 29179 -39720 5963
17360a65269G8109P1978o3622a9547I6776i9559A93481Q1424Q739g5643C29298
$$ -165269 78109 150087 86465 -19547 96776 -99559 193481 274905 283644 -75643 329298
17348b66272C02196o5128a24090A61333a4289B2530K1607K3361f3249A61118a59410
$$ -266272 302196 237068 -124090 161333 -14289 22530 44137 67498 -63249 161118 -159410
17336B33388O5795f2267K5983A86148J76891A19964e3826A3044J60622P1468D1263
$$ 233388 299183 -62267 -36284 186148 363039 119964 -53826 13044 173666 245134 41263
17324B8108O8833B4548A0291N6216b44708B72989i7528G4024O8528R6769j03036
$$ 28108 96941 24548 10291 66507 -244708 272989 -97528 74024 142552 239321 136285
17313A36285J25050J65800A58227o0561N7078b24274C18190d890B0121J58586
$$ 136285 261335 427135 158227 97666 154744 -224274 318190 -4890 20121 178707
17303A78707K81549j07360m5933B6311J66821E019a44277B59969p7562J61044
$$ 178707 460256 352896 306963 26311 193132 5019 -144277 259969 182407 343451
17293C43451q4167D0556L28024b36961A20695D4034J27109J19630l749M32L9185
$$ 343451 259284 40556 368580 -236961 120695 44034 171143 290773 287024 287456 326641
17282C26641f2047l14D64648a3374B05260K3147A01301J58912A16119O1429p4917
$$ 326641 -62047 -62361 464648 -13374 205260 228407 101301 260213 116119 177548 102631
17271A02631J47759h022G41129b3988C4923L8839M13016m7453o2693K9521o2993
$$ 102631 250390 -8022 741129 -23988 34923 73762 486778 439325 376632 406153 343160
17260C43160M0062A49050M83995A95126O2073J01740j48666L34072k48212r1514
$$ 343160 383222 149050 633045 195126 257199 358939 210273 544345 296133 204619
17250B04619J28127A08467M16420A64602J57124a8912A86145k8813R8388j09991
$$ 204619 332746 108467 524887 164602 321726 -18912 186145 157332 255720 145729
17240A45729K89169A77354P5817A09596M9389K04272H1258k2939J82363o1253
$$ 145729 434898 177354 253171 109596 158985 363257 81258 58319 240682 179429
17230A79429J8505p7856J21781j2499q5507p0480L25320A78404L87144k79515
$$ 179429 197934 120078 241859 229360 143853 73373 398693 178404 565548 286033
17220B86033J75455q6485A85861q7423R8064L2266L9510n6404r730p7428Q1026
$$ 286033 461488 375003 185861 98438 196502 228768 268278 211874 202144 124716 205742
17209B05742K72757A62202K36522E5370J11904L35468k01808J38931r9924r493
$$ 205742 478499 162202 398724 55370 167274 502742 300934 439865 339941 330448
17199C30448e4965B57062b30717E06528A95520K54694J9966j25460A3586L7920
$$ 330448 -54965 257062 -230717 506528 195520 450214 470180 344720 13586 51506
17189E1506J71018K09935D1706K34504L8378m4541I3270M322K87073A52588M8082
$$ 51506 222524 432459 41706 276210 314588 270047 93270 97592 384665 152588 200670
17178B00670L40823j02604K66776B91498N8368j68663N75043A25520J08814O8380
$$ 200670 541493 438889 705665 291498 349866 181203 756246 125520 234334 302714
17168C02714k2n0345M8842j18733M4734H6863L28659a33178C25004D2782J57047
$$ 302714 302692 252347 301189 182456 227190 86863 415522 -133178 325004 42782 199829
17157A99829M2325r3300K5205L10697A00153J40395f425C27629j32503M093j8168
$$ 199829 242154 148854 174059 484756 100153 240548 -6425 327629 195126 199219 181051
17146A81051k4044J62246L2882A25348M21695j56851A06659M13011k35546a9471
$$ 181051 157007 319253 352135 125348 547043 390192 106659 519670 284124 -19471
17135h3152H2139L88025j31323k3150m299N7526o0472L03781M4858A91283K41119
$$ -83152 82139 470164 338841 315691 311392 368918 308446 612227 657085 191283 432402
17124D32402j6610j01235K60515k12259P9060I4603O67960A67383N08027E5741
$$ 432402 415792 314557 575072 362813 441873 94603 762563 167383 675410 55741
17113E80077j23595k6071J86432P20j44626L1639j35897j81378L69312B69363
$$ 580077 456482 430411 616843 617563 472937 504576 368679 187301 556613 269363
17102C31507K43179q2675B02894O6379J53175L61032R2312l58646n6560p2383
$$ 331507 574686 492011 202894 269273 422448 783480 875792 517146 460586 388203
17092C88203K37109j53487K71346C12349F3573N22755B31304K77421j62553K33059
$$ 388203 625312 471825 743171 312349 63573 586328 231304 508725 346172 579231
17082E79231k19097M75152C97642l7507K34093j77417q0740K85879k76795M84102
$$ 579231 360134 835286 397642 360135 594228 416811 336071 621950 345155 829257
17072H29257m9064r199k78951H9487L18274M4486J37256L489j87136L9508l1425
$$ 829257 780193 770994 492043 89487 407761 452247 589503 592992 405856 445364 413939
17061D13939L17262k52209K89311j03611N6466l14445M67619C82089M36172k44524
$$ 413939 731201 478992 768303 664692 721158 406713 874332 382089 818261 573737
17051E73737K40810l81890M05471j68943j53279K32793n2043j76804J28529j39559
$$ 573737 814547 432657 838128 669185 515906 748699 696656 519852 648381 508822
17041E08822q9785J65354j71791p1338L39810J56536j40095M58326m90707j38831
$$ 508822 419037 584391 412600 341262 681072 837608 697513 1155839 665132 526301
17031E26301K9360J39919K3490p0340j39878K29829j73846J69251j85235L61839
$$ 526301 555661 695580 719070 648730 508852 738681 564835 734086 548851 910690
17021I10690j21902K53026D22817r4702M50654n3538n4688J76615k62387J2584
$$ 910690 788788 1041814 422817 328115 778769 725231 670543 847158 584771 597355
17011E97355J72098K54541k77406j1623N9222J12829l9050l0058j69116K1078
$$ 597355 769453 1023994 746588 734965 794187 907016 867966 837908 668792 689870
17001F89870q6893M47083j76810J6649J95800n14750L74071O9472j40660j27363
$$ 689870 602977 1050060 873250 889899 1085699 570949 945020 1014492 873832 746469
16991G46469K91986o7745k58486K37780K98528l45419q7350K9034J2252J38257
$$ 746469 1038455 970710 712224 950004 1248532 903113 815763 844797 857049 995306
16981I95306p1005l28946L19833m2447j43118K83490J54295n20j21910j93322
$$ 995306 924301 595355 915188 872741 729623 1013113 1167408 1166888 1044978 851656
16971H51656J77392L0870k27908m3496L30225k94256L76864l41285M71762q5522
$$ 851656 1029048 1059918 832010 788514 1118739 824483 1201347 860062 1331824 1246302
16961A246302p9753N9275N0315j1401j93959R735l41679L72384K22060o2205m3641
$$ 1246302 1166549 1225824 1276139 1264738 1070779 1080514 738835 1111219 1333279 1271074 1227433
16950A227433K48332k36392l082J18681q0145l52629M75343m7892Q166K46354
$$ 1227433 1475765 1239373 1236291 1354972 1274827 922198 1397541 1349649 1357815 1604169
16940A604169k00204N8879m7242k44968J73356p8056k2494P9490M54027m01888
$$ 1604169 1403965 1462844 1415602 1170634 1343990 1265934 1243440 1322930 1776957 1375069
16930A375069J62593m9852J53155m26548N44264m88835M39866j79774M60004l42382
$$ 1375069 1537662 1487810 1640965 1214417 1758681 1269846 1709712 1529938 1989942 1647560
16920A647560j63788M12609j26334o8887Q1211k91872M75566k9297l38403M18164
$$ 1647560 1483772 1896381 1770047 1701160 1782371 1490499 1966065 1936768 1598365 2016529
16910B016529k82385j43304J57581k0972L359N4889J79983j17222K95695k72127
$$ 2016529 1734144 1590840 1748421 1727449 1730808 1785697 1965680 1848458 2144153 1872026
16900A872026P393j79084K62183K12495j8251j18119J7365j12486K18234J45865
$$ 1872026 1879419 1700335 1962518 2175013 2156762 2038643 2056008 1943522 2161756 2307621
16890B307621M63702n51466J07640k61879M24834o9115N8334Q2586k64900K45623
$$ 2307621 2771323 2219857 2327497 2065618 2490452 2421337 2479671 2562257 2297357 2542980
16880B542980k2494M4322J80298k45784J58265l21209M21147p5922J13168m0309
$$ 2542980 2520486 2564808 2745106 2499322 2657587 2336378 2757525 2681603 2794771 2754462
16870B754462m857l42753M21270l42182N58917j35290l73346M50419J55358l4050
$$ 2754462 2749605 2406852 2828122 2485940 3044857 2909567 2536221 2986640 3141998 3107948
16860C107948J21745J4091K01038k7412k291k67468L98829M2110k41581K79785
$$ 3107948 3229693 3243784 3444822 3417410 3415119 3147651 3546480 3588590 3347009 3626794
16850C626794O037K68066l07886J45729J86229J06021J32662J4546K55298n9069
$$ 3626794 3632831 3900897 3593011 3738740 3924969 4030990 4163652 4178198 4433496 4374427
16840D374427j91521J69854L46008m00449N11302j07078L51281j5049k51630L41531
$$ 4374427 4182906 4352760 4698768 4298319 4809621 4702543 5053824 5038775 4787145 5128676
16830E128676M6730k0057R005K40152K22386r1709L53281j50515N2095K13905
$$ 5128676 5175406 5155349 5164354 5404506 5626892 5535183 5888464 5737949 5790044 6003949
16820F003949r3602N80090J63981k61343J90982M11514o964J85282M4585Q7667
$$ 6003949 5910347 6490437 6654418 6393075 6584057 6995571 6988607 7173889 7218474 7306141
16810G306141K40483j17650N44351K5574M30039J51532J4523j45897N15748R7212
$$ 7306141 7546624 7428974 7973325 7998899 8428938 8580470 8594993 8449096 8964844 9062056
16800I062056K93454l9379N71973J80244K8245O47278K0752M5678N22849J79728
$$ 9062056 9355510 9316131 9888104 10068348 10096593 10743871 10764623 10810301 11333150 11512878
16790A1512878M36477N2658L44667N52940Q1592N41311K45890M85909N18203L94410
$$ 11512878 11949355 12002013 12346680 12899620 12981212 13522523 13768413 14254322 14772525 15166935
16780A5166935L26488N77591M45105N33127P71048Q21568K43845M42757Q75407
$$ 15166935 15493423 16071014 16516119 17049246 17820294 18641862 18885707 19328464 20203871
16771B0203871M96546P27096N72556J049070Q50921P49749O82051J281581Q99955
$$ 20203871 20700417 21427513 22000069 23049139 23900060 24649809 25331860 26613441 27513396
16762B7513396Q47687J172132J054936J533040J151114J353598J593015J242735
$$ 27513396 28361083 29533215 30588151 32121191 33272305 34625903 36218918 37461653
16754C7461653J889876J719850J625476K256462J968793K546157K381821K259417
$$ 37461653 39351529 41071379 42696855 44953317 46922110 49468267 51850088 54109505
16746E4109505K695947K592310L050750L357452L500697L551549L749972M517980
$$ 54109505 56805452 59397762 62448512 65805964 69306661 72858210 76608182 81126162
16738H1126162L926816M977457M272761N414052N161405N706324N424620O289765
$$ 81126162 85052978 90030435 94303196 99717248 104878653 110584977 116009597 122299362
16730A22299362N786667O325704O468966O068836O008546O030181N248337N069962
$$ 122299362 128086029 134411733 140880699 146949535 152958081 158988262 164236599 169306561
16722A69306561M406635L318802L071099K097457J283141k81158j235413j649120
$$ 169306561 173713196 177031998 180103097 182200554 183483695 183202537 181967124 180318004
16714A80318004l234976l792909m265554n610823n543380n874903o202758o304497
$$ 180318004 177083028 173290119 169024565 163413742 157870362 151995459 145792701 139488204
16706A39488204o320511o494687o085382o363283n813228n534021n497645n191932
$$ 139488204 133167693 126673006 120587624 114224341 108411113 102877092 97379447 92187515
16698I2187515m801451m824682m142714l979277m020010l432787l803932l008670
$$ 92187515 87386064 82561382 78418668 74439391 70419381 66986594 63182662 60173992
16690F0173992k920199k689126k618426k560966k317331k298763j990478j864150
$$ 60173992 57253793 54564667 51946241 49385275 47067944 44769181 42778703 40914553
16682D0914553j775870j487488j873638j408455j540262j409666j291245j331313
$$ 40914553 39138683 37651195 35777557 34369102 32828840 31419174 30127929 28796616
16674B8796616j100158p31867j310708q20736q73354r78627p13148r16071p77192
$$ 28796616 27696458 26964591 25653883 24833147 23959793 22981166 22268018 21351947 20574755
16665B0574755j056718m36977k66001m98532p74083p73356l03887m86007l47395
$$ 20574755 19518037 19081060 18815059 18316527 17542444 16769088 16465201 15979194 15631799
16656A5631799m65343p47587n17625j59799o36265l72725k10387k69465j39634
$$ 15631799 15166456 14418869 13901244 13741445 13105180 12732455 12522068 12252603 12112969
16647A2112969o22117m64256m2934l82801k75471k70045k9659m60688K8407l44183
$$ 12112969 11490852 11026596 10983662 10600861 10325390 10055345 10025686 9564998 9593405 9249222
16637I249222k66339j55248k84382o84305N0513j68248j50733j00893j19686l90632
$$ 9249222 8982883 8827635 8543253 7858948 7909461 7741213 7590480 7489587 7369901 6979269
16627F979269J41618j95048j70793K03039l38864l58036l21955K86101n13681
$$ 6979269 7120887 6925839 6755046 6958085 6619221 6261185 5939230 6225331 5711650
16618E711650J80070j93593m5398k66820j73240J33617k42748k07840K57632n01065
$$ 5711650 5891720 5698127 5652729 5385909 5212669 5346286 5103538 4895698 5153330 4652265
16608D652265M44866j06610m16160k8942k81335J98064k96215k526j51453L12563
$$ 4652265 5097131 4990521 4574361 4545419 4264084 4462148 4165933 4163407 4011954 4324517
16598D324517l27125J63189R2952J09393n49046p7035k15446k954j59013J12602
$$ 4324517 3997392 4160581 4253533 4362926 3813880 3736845 3521399 3518445 3359432 3472034
16588C472034L9302j66646K35463k40809j40955j8877K1468n5487k59017L81259
$$ 3472034 3511336 3344690 3580153 3339344 3198389 3179512 3200980 3145493 2886476 3267735
16578C267735j42173m06580L80157r9782k87740O1783m0989o4076j81339R8993
$$ 3267735 3125562 2718982 3099139 2999357 2711617 2773400 2732411 2668335 2486996 2585989
16568B585989q9946m9082K73466k1338l62657l62646L48695j35562J96291l66201
$$ 2585989 2496043 2446961 2720427 2699089 2336432 1973786 2322481 2186919 2383210 2017009
16558B017009J05522K16926j36677P3794j46384K00258l00457j33896j83832K5761
$$ 2017009 2122531 2339457 2202780 2276574 2130190 2330448 2029991 1896095 1712263 1738024
16548A738024M87673k77882j38050Q6542Q0500n50954O07666m33451M19687l02313
$$ 1738024 2225697 1947815 1809765 1896307 1976807 1425853 2033519 1600068 2019755 1717442
16538A717442K62515r9952k11190L19726k48817K25555m56215L71558n10047O7698
$$ 1717442 1979957 1880005 1668815 1988541 1739724 1965279 1509064 1880622 1370575 1438273
16528A438273J63373j23309J88449p6363l13056K02449j15271J35607n4317m32220
$$ 1438273 1601646 1478337 1666786 1590423 1277367 1479816 1364545 1500152 1445835 1013615
16518A013615N18303P4311k51538k7443j72202J94540K33562j86680k67570J67921
$$ 1013615 1531918 1606229 1354691 1327248 1155046 1349586 1583148 1396468 1128898 1296819
16508A296819q3381l33307l0992N83766l29707m5257P5661K88326l33440J97367
$$ 1296819 1213438 880131 849139 1432905 1103198 1057941 1133602 1421928 1088488 1285855
16498A285855k30385K03631m84638L53007j49204J86233k73621K26778j40646
$$ 1285855 1055470 1259101 774463 1127470 978266 1164499 890878 1117656 977010
16489I77010k68285o429N08380l52473J73037r1895Q286K01908m64293O6784K38565
$$ 977010 708725 702296 1210676 858203 1031240 939345 947631 1149539 685246 752030 990595
16478I90595K80954k52606k30912j5230m2341l9076J01833O1568L1605j31764
$$ 990595 1271549 1018943 788031 772801 730460 691384 793217 854785 886390 754626
16468G54626O4897K2221p8211k42054P3521L04559J2362j62569n5501J29233J52415
$$ 754626 819523 841744 763533 521479 595000 899559 911921 749352 693851 823084 975499
16457I75499l80037m4532k33635K59460L03709D28091K68776r0745M3668N0637
$$ 975499 595462 550930 317295 576755 880464 428091 696867 606122 649790 700427
16447G00427K29472j40622r8736K2954Q2551k2254n9028r2550j68578J00012j88060
$$ 700427 929899 789277 690541 713495 796046 773792 714764 622214 453636 553648 365588
16436C65588N00432j25832K5637l23192K24823B37103K90267j2680L62670n8489
$$ 365588 866020 740188 765825 442633 667456 237103 527370 514690 877360 818871
16426H18871k79697j13897L60678o4838k44463n4282M23735k53207R1004j75257
$$ 818871 539174 425277 785955 721117 476654 422372 846107 592900 683904 508647
16416E08647L8237J42696j42963j04363K60345C06025K35004K1164O9927p8905
$$ 508647 546884 689580 546617 442254 702599 306025 541029 562193 632120 553215
16406E53215B28762L03506K33771C20955P6728K9993m3237M43484k20473k61365
$$ 553215 228762 532268 766039 320955 397683 427676 384439 827923 607450 346085
16396C46085K09451N9609q4751K0614B46538L55781k37037o701Q4325j87252L32860
$$ 346085 555536 615145 530394 551008 246538 602319 365282 358581 442906 255654 588514
16385E88514M4636j38572A91940K29391K7770r9098J23949j34245j07437L28966
$$ 588514 633150 494578 191940 421331 449101 350003 473952 339707 232270 561236
16375E61236A13909J10074L22727p7972k28497K09286P6727k30308j1998N6771
$$ 561236 113909 223983 546710 468738 240241 449527 526254 295946 283948 340719
16365C40719P1236M0293j18153m3039R0384J13433k06996K6531A08081L38225
$$ 340719 411955 452248 334095 291056 381440 494873 287877 314408 108081 446306
16355D46306q9371J37873J48020k74447D4379N0408P8788K13338m1844j27053
$$ 446306 356935 494808 642828 368381 44379 94787 173575 386913 345069 218016
16345B18016K99436j50802r6825l3951N37270A18973M50633A20874K34544J29230
$$ 218016 517452 366650 269825 235874 773144 118973 569606 120874 355418 484648
16335D84648a1655E26485A03495J25723J50559n8079P3641O6809I1147J36092
$$ 484648 -11655 526485 103495 229218 379777 321698 395339 462148 91147 227239
16325B27239E8889L23051j26976d7044B20458j3831K47114j96084o122I2730O7895
$$ 227239 58889 381940 254964 -47044 220458 206627 453741 257657 251535 92730 160625
16314A60625K1542d5360B33877M26577A31351J82969m5556J70794j56794c8233
$$ 160625 182167 -45360 233877 660454 131351 314320 268764 439558 282764 -38233
16303B98906e1061B71455q9388j6213a68910E6885J01775k9732J52267j14251
$$ 298906 -51061 271455 182067 165854 -168910 56885 158660 128928 281195 166944
16293A66944K7747a22401A14574J72905r5289G7323l0997N3698b7532I2535K26560
$$ 166944 194691 -122401 114574 287479 192190 77323 46326 100024 -27532 92535 319095
16282C19095J8966q6924G8828N19322A13940a75260a4252B75319H6052h4355R79
$$ 319095 338061 251137 78828 598150 113940 -175260 -14252 275319 86052 -84355 -83376
16271h3376A74371J58009j5703A46566a25120A419M62944E5401Q0701J02603B6290
$$ -83376 174371 332380 316677 146566 -125120 1419 464363 55401 136102 238705 26290
16259A60617L1520J64733E4753Q5188J89942m8973p9806J20402r8585P4501H4864
$$ 160617 192137 356870 54753 139941 329883 280910 201104 321506 222921 297422 84864
16247G9588P8452J28774a68159c8152B12693J82822m9225f1789J8821C35274H2703
$$ 79588 158040 286814 -168159 -38152 212693 395515 346290 -61789 -42968 335274 82703
16235D64707a87736A54994a50343E29628l0233e016r361B50130n7359K08438j01594
$$ 464707 -187736 154994 -150343 529628 499395 -5016 -14377 250130 192771 401209 299615
16224B99615R9760c5783l474D5635j3500L15892c2576A10952b00416B49171e6102
$$ 299615 399375 -35783 -39257 45635 32135 348027 -32576 110952 -200416 249171 -56102
16212a98165C30914l8341A7843L31628m5081j2334B1996c10044e7233A87948a03192
$$ -198165 330914 292573 17843 349471 304390 292056 21996 -310044 -57233 187948 -103192
16200a6307A89877a53785N6448m3133c3612H2859N8490C8472J7692J75875A13867
$$ -16307 189877 -153785 -97337 -140470 -33612 82859 141349 38472 56164 232039 113867
16188a40976D48892A59304l9718b6323K226F6427L01992E0682J59426K4696A4535
$$ -140976 448892 159304 119586 -26323 -24097 66427 368419 50682 210108 234804 14535
16176H0070Q0211l3938c607A11054P2028a10488A89388a89613A35355o4505h4263
$$ 80070 160281 126343 -3607 111054 183082 -110488 189388 -189613 135355 70850 -84263
16164a05751I1071R9973A4691a45010E6055K08066N759f916D7104O4155K35439
$$ -105751 91071 191044 14691 -145010 56055 264121 269880 -6916 47104 111259 346698
16153C46698b01845B64691J64610a11115E18217d9325q0252J5164c4625j8013
$$ 346698 -201845 264691 429301 -111115 518217 -49325 -129577 -114413 -34625 -52638
16143e2638B30484l0875q5215l387b35857C89776a93571b386B20769J70523A60194
$$ -52638 230484 199609 114394 111007 -235857 389776 -193571 -2386 220769 391292 160194
16131B89266r1987l6212a2916D35822A81908l375J72764I9415c56785A49414j514
$$ 289266 197279 161067 -12916 435822 181908 178533 351297 99415 -356785 149414 147900
16120A47900d8602p3371j33950f6236k10311j5937d9077r6905M2854I9201Q3980
$$ 147900 -48602 -121973 -255923 -66236 -276547 -292484 -49077 -145982 -103128 99201 183181
16109A83181c37634g6797B93403A05454N801a12054A50385j1198L41349A28930
$$ 183181 -337634 -76797 293403 105454 111255 -112054 150385 139187 480536 128930
16098C74288c33055A4232h6772J455m6588A20493J55468G1156J44243A06611b3436
$$ 374288 -333055 14232 -86772 -85317 -131905 120493 275961 71156 215399 106611 -23436
16086e6358K1144j661l27198b8206j37986M1597l593C54091i2225I4058Q4723
$$ -56358 -35214 -36875 -364073 -28206 -166192 -124595 -128188 354091 -92225 94058 178781
16075A78781a57909k384m647A31009k6378g4505B43705b24272P1396c4059j50467
$$ 178781 -157909 -160293 -164940 131009 104631 -74505 243705 -224272 -152876 -34059 -184526
16064a84526B5971J84254f5418B5972J95280E6589c7750m8639k88596E5814a10132
$$ -184526 25971 210225 -65418 25972 221252 56589 -37750 -86389 -374985 55814 -110132
16052A98141m1788i3983C4596a17126p191H197J29045e6854B80619I6557i4620
$$ 198141 156353 -93983 34596 -117126 -124317 8197 137242 -56854 280619 96557 -94620
16040H34b58251g5931j01103n0196q0492i403k62555B39494j03913a18202A30479
$$ 834 -258251 -75931 -177034 -227230 -307722 -9403 -271958 239494 135581 -118202 130479
16028d9764p1893o7159n0908h1606J6355C03217F3470a14006p0057C4563c23271
$$ -49764 -121657 -188816 -239724 -81606 -65251 303217 63470 -114006 -184063 34563 -323271
16016A25550c26787B08836n9808J74097b92808c2767B04091b48598B28585d63067
$$ 125550 -326787 208836 149028 323125 -292808 -32767 204091 -248598 228585 -463067
16005A18515a08829A97699B8276K608b8597n2438I2413A0618b83775A3376J2461
$$ 118515 -108829 197699 28276 30884 -28597 -81035 92413 10618 -283775 13376 25837
15994B5837J7598i3548a2913A02211j4608K05514j00027E7106J2353b06323B82658
$$ 25837 43435 -93548 -12913 102211 87603 293117 193090 57106 69459 -206323 282658
15982a1321C19950Q9176j61174n9947b6656C8058J76153F7434a87350k5948H4258
$$ -11321 319950 409126 247952 188005 -26656 38058 214211 67434 -187350 -213298 84258
15970D3678J70429a93366C87629E9774k4823J70574g4022j97875D07721A98499
$$ 43678 214107 -193366 387629 59774 34951 205525 -74022 -271897 407721 198499
15959B13903j2000l7514D8049A9777b41793i6712A21046a98844a6763j08953c95
$$ 213903 201903 164389 48049 19777 -241793 -96712 121046 -198844 -16763 -125716 -395
15947E6050k7148b75952a33960B37063j07630b56051A54119A5807e3825A07078
$$ 56050 28902 -275952 -133960 237063 129433 -256051 154119 15807 -53825 107078
15936A75087a84986l3001B04833c23304A7149c9905j16597f3013o4190A2811M9230
$$ 175087 -184986 -217987 204833 -323304 17149 -39905 -156502 -63013 -127203 12811 62041
15925F2041d0542I5048K8936a97147N6824O7412B06369A9975L24774i5850G3649
$$ 62041 -40542 95048 123984 -197147 -140323 -72911 206369 19975 344749 -95850 73649
15913a92860F9902n585a45311f5858A08756a33451j17099a09416H258b83018K7244
$$ -192860 69902 64317 -145311 -65858 108756 -133451 -250550 -109416 8258 -283018 -255774
15902b55774G2579M04044A53704J2322b58986E6197d6073B86016g4798B22531
$$ -255774 72579 476623 153704 166026 -258986 56197 -46073 286016 -74798 222531
15891a02530M4199j37714n0183A16466b0883m74316A35249B5738i1165c5938F9471
$$ -102530 -58331 -196045 -246228 116466 -20883 -495199 135249 25738 -91165 -35938 69471
15879G4736e501A53003b90974B1704a02741L2615j22699e3828A0714J0832J64706
$$ 74736 -5501 153003 -290974 21704 -102741 -70126 -192825 -53828 10714 21546 186252
15868A86252P344A8636J53242K8629c05129e8958j9558C2583h8737d3671i250
$$ 186252 193596 18636 171878 200507 -305129 -58958 -78516 32583 -88737 -43671 -9250
15856a88815A1578L581c69250g4640O327b3510E4899b9762A95917g1183G3828
$$ -188815 11578 15159 -369250 -74640 -68313 -23510 54899 -29762 195917 -71183 73828
15844a75814r8188M3146E8152b32206A1068b5232E0939e7374j28844Q3506C64209
$$ -175814 -274002 -230856 58152 -232206 11068 -25232 50939 -57374 -186218 -102712 364209
15832c13954A26278e5246E64L26584i9767k4319A19033J99033j25299a63909f589
$$ -313954 126278 -55246 564 327148 -99767 -124086 119033 318066 192767 -163909 -6589
15820a43645q1407J01996I0080a01409k1407E5462f8713k93426c0884j28595m4109
$$ -143645 -225052 -123056 90080 -101409 -122816 55462 -68713 -362139 -30884 -159479 -203588
15809b03588j40428D5853M243i1799B73309d10882a34419F485a23457a7679j12237
$$ -203588 -344016 45853 50096 -91799 273309 -410882 -134419 6485 -123457 -17679 -129916
15798a29916B75776a87604f0967A47450n1787k1578a54866e1360l9616B09548
$$ -129916 275776 -187604 -60967 147450 95663 74085 -154866 -51360 -90976 209548
15787a63832a7786C5608O7349a07495a2257A38397f1851j00119N1546k38461J21666
$$ -163832 -17786 35608 102957 -107495 -12257 138397 -61851 -161970 -110424 -348885 -227219
15776b27219d0514H418J06449a17991K2441F9274d9829k195j56036K1380h7345
$$ -227219 -40514 8418 114867 -117991 -95550 69274 -49829 -52024 -208060 -186680 -87345
15764B0555a19889l15030A03556m8932K7704D0084J84342i8316j62605C09658
$$ 20555 -119889 -434919 103556 54624 82328 40084 224426 -98316 -260921 309658
15753a18799d6466A56996a44787e1698E0493K84645a7964B12096a03212A03661
$$ -118799 -46466 156996 -144787 -51698 50493 335138 -17964 212096 -103212 103661
15742a84985i619m843j90204F1255L3509a80913C5390a59826a9799p8843D36662
$$ -184985 -9619 -14462 -204666 61255 94764 -180913 35390 -159826 -19799 -98642 436662
15730b70953l0803K0937e5189k01911e6356l0489k13135F6031N0659K07226A30355
$$ -270953 -301756 -280819 -55189 -257100 -56356 -86845 -299980 66031 116690 323916 130355
15718A61988i979j23099C43906a00973A22458C5123c9227c876m147j35003A39939
$$ 161988 -9979 -133078 343906 -100973 122458 35123 -39227 -3876 -8023 -143026 139939
15706A08428J62901f7365a0248j37149g528k7201P496p1227B6447f7401A89315
$$ 108428 271329 -67365 -10248 -147397 -7528 -34729 -27233 -98460 26447 -67401 189315
15694A62195a83689h6254D3596K44289e6203K3292A67415B1761b23366I193J54536
$$ 162195 -183689 -86254 43596 287885 -56203 -32911 167415 21761 -223366 9193 163729
15683A63729o4870e5301A9121a76962P1137a2189l39368B04428D3303J27751a66103
$$ 163729 98859 -55301 19121 -176962 -105825 -12189 -351557 204428 43303 171054 -166103
15671a41656A91239a82649a5375D91207A52318a76154A48690c48644a11389A00205
$$ -141656 191239 -182649 -15375 491207 152318 -176154 148690 -348644 -111389 100205
15660B39283E2652M1614a26509C4749M8332D0649a26767A69259m391a14041k5252
$$ 239283 52652 94266 -126509 34749 83081 40649 -126767 169259 164868 -114041 -139293
15649a39293B31593I5141b7756j22155l48561K28575J03939o7688b3615G360J54149
$$ -139293 231593 95141 -27756 -149911 -498472 -269897 -165958 -233646 -23615 7360 161509
15638A61509c19555A21902c0753l41205I8135g4848m46089a36957m0026D1621
$$ 161509 -319555 121902 -30753 -371958 98135 -74848 -520937 -136957 -176983 41621
15627b41085K3056L4845c6438j21143B98247a21435L1325B92719c69217J77192
$$ -241085 -218029 -183184 -36438 -157581 298247 -121435 -90110 292719 -369217 -192025
15617a92025a4793j84741g2910l45559B73929j05664m6438b86596E07077A81128
$$ -192025 -14793 -199534 -72910 -418469 273929 168265 121827 -286596 507077 181128
15606C59488i7899j29614O7346c7868j01691a2605j65416K3357Q159K2071e2157
$$ 359488 -97899 -227513 -160167 -37868 -139559 -12605 -178021 -154664 -146505 -124434 -52157
15594i5219l8856A02743D1613J5436a57890I6445D5174e3741J7313C18992C5936
$$ -95219 -134075 102743 41613 57049 -157890 96445 45174 -53741 -36428 318992 35936
15582a21837F2688K45331j08099d26710e7106p2124A45684b92157A84799f4055
$$ -121837 62688 308019 199920 -426710 -57106 -129230 145684 -292157 184799 -64055
15571A7978J43512p4372R5721J77539b74189M1623d0541B15454a30153N969A85165
$$ 17978 161490 87118 182839 360378 -274189 -232566 -40541 215454 -130153 -124184 185165
15559b971B11570l6064G4737K74293b62043A36367Q8662D9191a05978k6130c5376
$$ -2971 211570 175506 74737 349030 -262043 136367 225029 49191 -105978 -132108 -35376
15547A68945c93339a09314A87731c29951B82824b6093E9068N5856d245A25387
$$ 168945 -393339 -109314 187731 -329951 282824 -26093 59068 114924 -4245 125387
15536H5225a73973G8985a6783D7322B2301K10008J63506a522H495b79063B34622
$$ 85225 -173973 78985 -16783 47322 22301 232309 395815 -1522 8495 -279063 234622
15524A14836K07945b04026H3199h9072c1671D52222A4972O6095a59744A19621
$$ 114836 322781 -204026 83199 -89072 -31671 452222 14972 81067 -159744 119621
15513b37365A667J23361g6908E5174b8147A97218k4532a54242A03075D2244R3340
$$ -237365 1667 125028 -76908 55174 -28147 197218 172686 -154242 103075 42244 135584
15502A35584J15232q2447L47Q1992b12819L5507A40485a12217c6582b708m44130
$$ 135584 250816 168369 168716 250708 -212819 -177312 140485 -112217 -36582 -2708 -446838
15491d46838f5897j11133K633A45801c68945a69051o9022A13477a20592B32112
$$ -446838 -65897 -177030 -174397 145801 -368945 -169051 -238073 113477 -120592 232112
15480d5357A71743K66318I2026b45338a01304B07307d58677A93617b52963G91
$$ -45357 171743 438061 92026 -245338 -101304 207307 -458677 193617 -252963 791
15469A44100g7616n5884K0916H2762A5444b93926H9246h5939m2824F4048a71633
$$ 144100 -77616 -133500 -112584 82762 15444 -293926 89246 -85939 -128763 64048 -171633
15457a36132C468b44673h9012C61843A40690i0773B81713E3162e5673r01k98673
$$ -136132 3468 -244673 -89012 361843 140690 -90773 281713 53162 -55673 -56574 -355247
15446c55247A55400a55316g225k48643A46260j9037b60984C47915C5864b4564
$$ -355247 155400 -155316 -7225 -255868 146260 127223 -260984 347915 35864 -24564
15435f2321J8894A38129K21237a17676A17777b32781A8492M47456r7536F8842
$$ -62321 -43427 138129 359366 -117676 117777 -232781 18492 465948 368412 68842
15424B4039J33192O9962B3563a73663e3400j06907a9556A04979a23412r5730D4941
$$ 24039 157231 227193 23563 -173663 -53400 -160307 -19556 104979 -123412 -219142 44941
15412a25813k64575k8440g5085N512B19861b29325B51636c59580h4361r2908j33462
$$ -125813 -390388 -418828 -75085 -69573 219861 -229325 251636 -359580 -84361 -177269 -310731
15401c10731A47029a94714e7391C3299P9590b1630l0506j09406j35190A52890
$$ -310731 147029 -194714 -57391 33299 112889 -21630 -52136 -161542 -296732 152890
15390A8935a58013B28934e8750r3458C25147b1099A44532J5222a44027j03400
$$ 18935 -158013 228934 -58750 -152208 325147 -21099 144532 159754 -144027 -247427
15380b47427A3020a47401a8129p5458q0706e565H6209e0639I9718m1856n685M7766
$$ -247427 13020 -147401 -18129 -93587 -174293 -5565 86209 -50639 99718 57862 52177 99943
15368I9943j999j5613a50140g220l5189NA46504a62087A34716A4621a05374A36892
$$ 99943 97944 82331 -150140 -7220 -42409 -42404 146504 -162087 134716 14621 -105374 136892
15355A54769k9254M0953K5963e4668A47758m3668c12861a08940A97263B226a9580
$$ 154769 125515 166468 192431 -54668 147758 104090 -312861 -108940 197263 2226 -19580
15343C44681E4318a97616I5317h016j16759A93581K98733A89322b72251E9066
$$ 344681 54318 -197616 95317 -8016 -124775 193581 492314 189322 -272251 59066
15332A28168f0348D36O1293J21364A1767f7802k5814D3245A3288L07176I1920
$$ 128168 -60348 436 61729 183093 11767 -67802 -93616 43245 13288 320464 91920
15320a36679r5960D52575c54822c1401A51090k4633Q1647J06344A34902a41025
$$ -136679 -232639 452575 -354822 -31401 151090 126457 208104 314448 134902 -141025
15309B04561f5196m570C5858N9168a25509B5193M51582B16197a48756H3946i4822
$$ 204561 -65196 -69766 35858 95026 -125509 25193 476775 216197 -148756 83946 -94822
15297a89308E483a27855r6061A61319M107G4476B2805F781K17448C7966J43658
$$ -189308 5483 -127855 -223916 161319 165426 74476 22805 6781 224229 37966 181624
15286A81624j3538J18939O8187j76454P1712a59726B82495D0339a60603m8355
$$ 181624 168086 287025 355212 178758 250470 -159726 282495 40339 -160603 -208958
15276b08958G1614a54638A30947E5038K47776A04818K5559h5093I1022K2828F412
$$ -208958 71614 -154638 130947 55038 302814 104818 130377 -85093 91022 113850 6412
15264B51036m5673K8201f8534j26591G7654K92049a98738f56j30689B32411P7897
$$ 251036 205363 233564 -68534 -195125 77654 369703 -198738 -656 -131345 232411 310308
15253C10308p9480M9479l454E4854M77379K77330R03800m63278N51966j42209
$$ 310308 230828 280307 276853 54854 532233 809563 1713363 1250085 1802051 1659842
15243A659842o15763D12261k0181G5304J22842b75658d3661A48483m3590j1751
$$ 1659842 1044079 412261 392080 75304 198146 -275658 -43661 148483 104893 93142
15233I3142j4022k7676b20198O4078I1971N1776L4321h3545c5417B01190J76976
$$ 93142 79120 51444 -220198 -156120 91971 143747 178068 -83545 -35417 201190 378166
15222C78166a5143B7634b3863A94568M5280F0520K39d1245B70093C893J85479
$$ 378166 -15143 27634 -23863 194568 239848 60520 60759 -41245 270093 3893 189372
15211A89372G531f7204b9581A52423o2303b01092B79173l8366J03370E4137g7052
$$ 189372 7531 -67204 -29581 152423 90120 -201092 279173 240807 344177 54137 -77052
15199C80384a6951r1850B87494E5933a63277D1308l424J46881B4674d13099A266
$$ 380384 -16951 -108801 287494 55933 -163277 41308 37884 184765 24674 -413099 1266
15187A71425b22190k201B48709a0667F07626j94049A16729J250L00511A04579
$$ 171425 -222190 -224391 248709 -10667 607626 413577 116729 117979 418490 104579
15176A24360N15837B77768A09040I150a30092F6776J6274J96068o7414A6529L059
$$ 124360 640197 277768 109040 9150 -130092 66776 83050 279118 211704 16529 19588
15165A9588K2316N9280i5012M7200A81415A779N9024b8909l8856A65429n119b19552
$$ 19588 41904 101184 -95012 -47812 181415 1779 60803 -28909 -67765 165429 160310 -219552
15152b39527A65409a2654B6744b72862h3895A60104a47196I2574b6397j49188
$$ -239527 165409 -12654 26744 -272862 -83895 160104 -147196 92574 -26397 -175585
15142a75585h178I0759Q3592b7485j31181B03633J66010j78414B2838J19309a52417
$$ -175585 -8178 90759 174351 -27485 -158666 203633 369643 191229 22838 142147 -152417
15130a32434j13243d0019H6815N7023K2744J27540B4714L6371J48299D3760J72703
$$ -132434 -245677 -40019 86815 143838 166582 294122 24714 61085 209384 43760 216463
15119B16463p8134K07376A11504C7159K9343A9597J30600J71499B6904b8035a1422
$$ 216463 138329 345705 111504 37159 66502 19597 150197 321696 26904 -28035 -11422
15107B32831l5876b1356j63055C90890A66222i049A52501J73622f7360B2189J28783
$$ 232831 196955 -21356 -184411 390890 166222 -9049 152501 326123 -67360 22189 150972
15096A50972a41272B44607D4199J64886I7919K1917a01306E9202J07028M7435
$$ 150972 -141272 244607 44199 209085 97919 119836 -101306 59202 166230 213665
15086B13665K17600n8267I9881Q6815M3341j5595K35710J2245A50993a74268D16822
$$ 213665 431265 372998 99881 186696 230037 214442 450152 462397 150993 -174268 416822
15074A03975L8262B1902J92810e2030F4410Q6994L4996H7116J24377d2491C27638
$$ 103975 142237 21902 214712 -52030 64410 151404 186400 87116 211493 -42491 327638
15062I3132L7385k8045B1627K95384j12388I0548K07987J05795j79179k8068O1501
$$ 93132 130517 102472 21627 317011 204623 90548 298535 404330 225151 197083 258584
15051B58584R7564p3948f38A99124b3349F01884B79390N9084j13634j0707a00529
$$ 258584 356148 282200 -638 199124 -23349 601884 279390 338474 224840 214133 -100529
15039B89491J11068j11136R4006j00918G0005M5383K3977K99757A03293K16636
$$ 289491 400559 289423 383429 282511 70005 115388 139365 439122 103293 319929
15029C19929j59170J79953j50609K03968D918J69469k7918j268J63405a99467
$$ 319929 160759 340712 190103 394071 4918 174387 146469 145201 308606 -199467
15018d3424B78781E9711K88991K3085a4069A59440J2967J74033j42897K45822
$$ -43424 278781 59711 348702 371787 -14069 159440 172407 346440 203543 449365
15008D49365B12608J75229A63823h6185E28777A49628l3498C9282a534C20829
$$ 449365 212608 387837 163823 -86185 528777 149628 116130 39282 -1534 320829
14997A98745M8904F0350J36715M4931q1164M10Q9446J17844m6780D8162J53082
$$ 198745 247649 60350 197065 241996 160832 161242 250688 368532 321752 48162 201244
14986B01244M2143G6428J24990L4472J34762I0256L30255J26593a52577B00406
$$ 201244 243387 76428 201418 235890 370652 90256 420511 547104 -152577 200406
14975E59971H5781J03397K06885A13594K2001L0501K80267A91441K5883J12205
$$ 559971 85781 189178 396063 113594 135595 166096 446363 191441 217324 329529
14965C29529A27000R4997Q5062j36123M4697J91006o2950A33506L60946E3583
$$ 329529 127000 221997 307059 170936 215633 406639 343689 133506 494452 53583
14954I9467L54170j72949A07159a75351D77082A98093L1795c6800C34855J32448
$$ 99467 453637 280688 107159 -175351 477082 198093 229888 -36800 334855 467303
14944D67303P151G9959J12673n2568C4486J14265R4855h0336A73488K76216M2211
$$ 467303 474454 79959 192632 140064 34486 148751 243606 -80336 173488 449704 491915
14933D91915A22272K27637K31849k83811j31372K42952A68234o1446L95908I9258
$$ 491915 122272 349909 581758 297947 166575 409527 168234 106788 502696 99258
14922D51258j18725N8204J8704N7450j68987L7527k4710N8694F0301L78911j3630
$$ 451258 332533 390737 409441 466891 297904 335431 310721 369415 60301 439212 425582
14911D25582q454j99144J30729J18871k33094b2669C63452l2611J92957A79854
$$ 425582 417128 217984 348713 467584 234490 -22669 363452 330841 523798 179854
14900A44217J14060J87126Q3552p4671L0723j69370A46504M15400B51703J63242
$$ 144217 258277 445403 528955 454284 485007 315637 146504 561904 251703 414945
14890D14945k5603J20623A28696K2558J63918J71156K97156C74993J42810B30294
$$ 414945 389342 509965 128696 151254 315172 486328 783484 374993 517803 230294
14879C38275L0863K17589k26598k0028K34067k37767q217J18158j3012q309j81230
$$ 338275 369138 586727 360129 340101 574168 336401 328184 446342 433330 425021 243791
14868B43791R4589J80631B13205N0037R8830r5429J52184J09000j76304p5633
$$ 243791 338380 519011 213205 263242 362072 266643 418827 527827 351523 275890
14858B75890K14401j66274j41991J67650A67875J36438J19153j8957J32966j62266
$$ 275890 490291 324017 182026 349676 167875 304313 423466 404509 537475 375209
14848C75209J36253j12068k0652J81473j40457M6833j5884o7328M476N68926k97877
$$ 375209 511462 399394 378742 560215 419758 466591 450707 383379 387855 956781 658904
14837F58904j35959j04228j05563o3096J60508R1137j97660C7426Q9022J99111
$$ 658904 522945 418717 313154 250058 410566 501703 304043 37426 126448 325559
14827C25559L75470g249F13565B86577J32881J71110Q8803p8612l5455j0980j06592
$$ 325559 701029 -7249 613565 286577 419458 590568 679371 600759 565304 554324 447732
14816D47732n6053N01165k77968k11598J00296Q1310k57797K71555j21805j23870
$$ 447732 391679 892844 614876 403278 503574 584884 327087 598642 476837 352967
14806C52967M27708l11719K51240k31748J83878k69452K36632m7750J13661k30291
$$ 352967 780675 468956 720196 488448 672326 402874 639506 591756 705417 475126
14796D75126J1867N4096j37861K20449j31636q525K19750k27766J26282q4496
$$ 475126 486993 541089 403228 623677 492041 483516 703266 475500 601782 517286
14786E17286n0780J13404m8922n9078j55778K76019j37020N22278j83583B09759
$$ 517286 466506 579910 530988 471910 316132 592151 455131 977409 793826 209759
14775G91485k48615j32719N9361J10366N2817j05420j6715J47290l16893J30461
$$ 791485 542870 410151 469512 579878 632695 527275 510560 657850 340957 471418
14765D71418M55573l77236K38624k64596J03593j64401K36961J9370j17844n2480
$$ 471418 926991 549755 788379 523783 627376 462975 699936 719306 601462 548982
14755E48982P3721j47695J07118K03019M04711E42707j12426J06288K08479O3015
$$ 548982 622703 475008 582126 785145 1189856 542707 430281 536569 745048 808063
14745H08063r5760n9266J0154L7761K91413j09442o1563k78284K16767j94754
$$ 808063 712303 653037 663191 700952 992365 882923 821360 543076 759843 565089
14735E65089l5481L26846m4931Q8596j92811j20579J32935n8612Q2010J13762
$$ 565089 529608 856454 811523 900119 707308 586729 719664 661052 743062 856824
14725H56824K98621k39031q8252K71066k63830J95493j31140j27655J71379p3149
$$ 856824 1155445 916414 828162 1099228 835398 1030891 899751 772096 943475 870326
14715H70326J07639r7710o1956J43646j15353j40882o7735J56784K1990j42232
$$ 870326 977965 880255 818299 961945 846592 705710 637975 794759 816749 674517
14705F74517J68493K84635k31998j96490K40544j93515K69634J03212j31923j28195
$$ 674517 843010 1127645 895647 699157 939701 746186 1015820 1119032 987109 858914
14695H58914Q3094k14170O06162l82105L0847J08447j11173j42821k48451L61691
$$ 858914 942008 727838 1334000 951895 982742 1091189 980016 837195 588744 950435
14685I50435j69566M52718l19091L53687k05186j74172q0163L99903n01591M33668
$$ 950435 780869 1233587 914496 1268183 1062997 888825 808662 1208565 706974 1140642
14675A140642M5619o770L10399l55725k75461J63813q7880K53678L9756L665K51870
$$ 1140642 1186261 1179491 1489890 1134165 858704 1022517 934637 1188315 1228071 1231736 1483606
14664A483606j47415l02414L4659l7374l3151n0651J39930O6893j70114N66506
$$ 1483606 1336191 1033777 1068436 1031062 997911 947260 1087190 1154083 983969 1550475
14654A550475n80555L21118o5340p2204M92186l59648J11854J26194J0236j42455
$$ 1550475 969920 1291038 1225698 1153494 1645680 1286032 1397886 1524080 1534316 1391861
14644A391861J21397k17246J80911k17380k7070J38093k75226K48509k96574N04173
$$ 1391861 1513258 1296012 1476923 1259543 1232473 1370566 1095340 1343849 1047275 1551448
14634A551448j02651N9224l03605p6005L51716j78937j49516k3627P9174M89769
$$ 1551448 1448797 1508021 1204416 1128411 1480127 1301190 1151674 1128047 1207221 1696990
14624A696990j27026o7531j65747L42284r10j21184o8132J22070J73724n51328
$$ 1696990 1569964 1502433 1336686 1678970 1678060 1556876 1488744 1610814 1784538 1233210
14614A233210K33366j61683L93283l25331N11786l43591J01779j61810K31619
$$ 1233210 1466576 1304893 1698176 1372845 1884631 1541040 1642819 1481009 1712628
14605A712628J04839L6917l39938J57433P5289q0131K80381J52845m1919l49023
$$ 1712628 1817467 1854384 1514446 1671879 1747168 1667037 1947418 2100263 2058344 1709321
14595A709321Q9565K69733k52380Q1450N53026m30764o7763M5452j40245j70591
$$ 1709321 1798886 2068619 1816239 1897689 2450715 2019951 1952188 1997640 1857395 1686804
14585A686804J91083l7315K76954j64069L42883n2754P0671l67230l4647N48357
$$ 1686804 1877887 1840572 2117526 1953457 2296340 2243586 2314257 1947027 1912380 2460737
14575B460737o9752l85932M13561j61775K2587l07308M15214j3598l3857N076
$$ 2460737 2390985 2005053 2418614 2256839 2279426 1972118 2387332 2373734 2339877 2344953
14565B344953M71123n49558M83135K61806k71361K54664R1240j73911m6117K116
$$ 2344953 2816076 2266518 2749653 3011459 2740098 2994762 3086002 2912091 2865974 2868090
14555B868090N30018M43901M71582M57889Q5558J032668J854054L635111Q063557
$$ 2868090 3398108 3842009 4313591 4771480 4857038 5889706 7743760 11378871 19442428
14546A9442428J8818130J2890132B2405017j0202119E790856k232752o28812l10468
$$ 19442428 38260558 51150690 22405017 12202898 5790856 3558104 2929292 2618824
14538B618824k79486j28225j59052m4089L25596k81107K4438p6916P029K27452
$$ 2618824 2339338 2211113 2052061 2007972 2333568 2052461 2076899 1999983 2007012 2234464
14528B234464j59300N93449k3080l24889L88557j03443k02697r627l9690L66818
$$ 2234464 2075164 2668613 2645533 2320644 2709201 2605758 2403061 2393434 2353744 2720562
14518B720562J26906j13330j40666J64244J26302l37720M18873k58756K93798
$$ 2720562 2847468 2734138 2593472 2757716 2884018 2546298 2965171 2706415 3000213
14509C000213m7110J50919q5653K00996o8854p0810J71938N12758p89715K89125
$$ 3000213 2953103 3104022 3018369 3219365 3150511 3079701 3251639 3764397 2974682 3263807
14499C263807K09536O5660j79241n3706L75542l64554K08523P5135J17760r0754
$$ 3263807 3473343 3539003 3359762 3306056 3681598 3317044 3525567 3600702 3718462 3627708
14489C627708N89940m92092J7304L5024R6264q8578L20714O1584L9753J31399
$$ 3627708 4217648 3725556 3742860 3777884 3874148 3785570 4106284 4167868 4207621 4339020
14479D339020k64419J23982l899Q7609Q8219K43124j00921k33749L94549m28784
$$ 4339020 4074601 4198583 4194684 4282293 4370512 4613636 4512715 4278966 4673515 4244731
14469D244731N41296n5123L7967M26819l54381L37127k03999Q9003l1569o7214
$$ 4244731 4786027 4730904 4768871 5195690 4841309 5178436 4974437 5063440 5031871 4964657
14459D964657J52269Q3465P4966J8099J985L55173k61667M91573m22848J45736
$$ 4964657 5116926 5200391 5275357 5293456 5295441 5650614 5388947 5880520 5457672 5603408
14449E603408J44620R8249J43702O4801L67631l42866K11894j01688K89386j58251
$$ 5603408 5748028 5846277 5989979 6054780 6422411 6079545 6291439 6189751 6479137 6320886
14439F320886Q5339M04128k51169J11368K98174r0020N2777K95201K89981J59863
$$ 6320886 6406225 6810353 6559184 6670552 6968726 6878706 6931483 7226684 7516665 7676528
14429G676528l68867L8910M57117o5187K22322k55226j01291O09039N9854K16404
$$ 7676528 7307661 7346571 7803688 7738501 7960823 7705597 7604306 8213345 8273199 8489603
14419H489603l2628M79485J27372J40080l3378L4321K31688j10335K90781l7637
$$ 8489603 8456975 8936460 9063832 9203912 9170534 9204855 9436543 9326208 9616989 9579352
14409I579352l12296Q08264N1852K72071J67678M2326N449P4992K31920J72443
$$ 9579352 9267056 10075320 10127172 10399243 10566921 10609247 10614696 10689688 10921608 11094051
14399A1094051q8386N09007L28229M3818Q8787M36578L06661L50031P2990j16099
$$ 11094051 11005665 11514672 11842901 11886719 11975506 12412084 12718745 13068776 13141766 13025667
14389A3025667K45418K89389Q2507M89187J74464L88985K93567q9165N56994K21161
$$ 13025667 13271085 13560474 13642981 14132168 14306632 14695617 14989184 14900019 15457013 15678174
14379A5678174L09266L54882N29103L58982J86981L27431J57569O05296R5949
$$ 15678174 15987440 16342322 16871425 17230407 17417388 17744819 17902388 18507684 18603633
14370A8603633M64900M85353J68857K08734O96246N22617O82076j39137N27894
$$ 18603633 19068533 19553886 19722743 19931477 20627723 21150340 21832416 21693279 22221173
14361B2221173R71042r0913P17611P90193J70236Q72927P97205J66248N65942
$$ 22221173 23192215 23101302 23818913 24609106 24779342 25652269 26449474 26615722 27181664
14352B7181664N79385R16052P82982K26585J069449J013156Q08385M99918Q86952
$$ 27181664 27761049 28677101 29460083 29686668 30756117 31769273 32577658 33077576 33964528
14343C3964528P31947J014509P99585J313996J125293J066401Q03502J442016
$$ 33964528 34696475 35710984 36510569 37824565 38949858 40016259 40819761 42261777
14335D2261777R85151J352911J392208J726557J030122J456949J757852J525681
$$ 42261777 43246928 44599839 45992047 47718604 48748726 50205675 51963527 53489208
14327E3489208J984928J854233J732753J563242K238575K624407J902424K534767
$$ 53489208 55474136 57328369 59061122 60624364 62862939 65487346 67389770 69924537
14319F9924537K481569K669253K677432L053497K977578L557409L150506L742691
$$ 69924537 72406106 75075359 77752791 80806288 83783866 87341275 90491781 94234472
14311I4234472L752890L878599M456958M216613N093178M971361N019752N802822
$$ 94234472 97987362 101865961 106322919 110539532 115632710 120604071 125623823 131426645
14303A31426645N556664O532982O430245O815191P293330P869430Q610910Q420416
$$ 131426645 136983309 143516291 149946536 156761727 164055057 171924487 180535397 188955813
14295A88955813R060269J0036591R966563J1156727J0752044J2457841J2326747
$$ 188955813 198016082 208052673 218019236 229175963 239928007 252385848 264712595
14288B64712595J2955272J3158852J3996085J4404263J4688049J4773908J4875762
$$ 264712595 277667867 290826719 304822804 319227067 333915116 348689024 363564786
14281C63564786J4441063J4774972J3842041J3446217J2642937J0888599R732903
$$ 363564786 378005849 392780821 406622862 420069079 432712016 443600615 453333518
14274D53333518P946574N932663L627958O47396p4944j381979l668838m486102
$$ 453333518 461280092 467212755 470840713 471488109 471413165 470031186 466362348 461876246
14266D61876246p250078r436470j0665690j2690224j3098273j4634223j5213441
$$ 461876246 454626168 445189698 434524008 421833784 408735511 394101288 378887847
14259C78887847j5795400j5462608j5077635j5424367j4698976j3652430j3436726
$$ 378887847 363092447 347629839 332552204 317127837 302428861 288776431 275339705
14252B75339705j3154741j2646318j2032032j1619165j1340379j0025089r737265
$$ 275339705 262184964 249538646 237506614 225887449 214547070 204521981 194784716
14245A94784716r169638q671890q060549p787368p225134p103396o484688n943110
$$ 194784716 185615078 176943188 168882639 161095271 153870137 146766741 140282053 134338943
14237A34338943n670104n408268n167599n097042n028163m167241l423527l898149
$$ 134338943 128668839 123260571 118092972 112995930 107967767 103800526 100376999 96478850
14229I6478850l787039l913464l096036l373325l243201k895372k336166k956482
$$ 96478850 92691811 88778347 85682311 82308986 79065785 76170413 73834247 70877765
14221G0877765k383622j775349k524324k006612j942308j826821k012634j586480
$$ 70877765 68494143 66718794 64194470 62187858 60245550 58418729 56406095 54819615
14213E4819615j340304j818024j657738j677801j246694j134179o17373j765887
$$ 54819615 53479311 51661287 50003549 48325748 47079054 45944875 45327502 43561615
14205D3561615j156425j112255j112350j488423q61421m94148r91271j414236
$$ 43561615 42405190 41292935 40180585 38692162 37830741 37336593 36345322 34931086
14197C4931086o77174r73109o90159p02830n84445r67250o31865r47452p45264
$$ 34931086 34253912 33280803 32590644 31887814 31303369 30336119 29704254 28756802 28011538
14188B8011538l69845q71083n75913l46208p61158m97886q35284k48367m37551
$$ 28011538 27641693 26770610 26194697 25848489 25087331 24589445 23754161 23505794 23068243
14179B3068243l57760q34329q2924n59825m80540l64755n60198n26437J35722
$$ 23068243 22710483 21876154 21793230 21233405 20752865 20388110 19827912 19301475 19437197
14170A9437197r17767l04263k99459j48666k50456l88995k01533n94715l3536
$$ 19437197 18519430 18215167 17915708 17767042 17516586 17127591 16926058 16331343 16297807
14161A6297807o96491K33885k88600k55843j42526q66222K20189m47881k56274
$$ 16297807 15601316 15835201 15546601 15290758 15148232 14282010 14502199 14054318 13798044
14152A3798044j119l02638l53516l25812O0659p3987o90081L98165q58757L55767
$$ 13798044 13796925 13494287 13140771 12814959 12875618 12801631 12111550 12509715 11650958 12006725
14142A2006725k87410j96219k03314M581m25724j80591J63628k41059j83406N274
$$ 12006725 11719315 11523096 11319782 11324363 10898639 10718048 10881676 10640617 10457211 10462485
14132A0462485k60158j41223k77796k53551k60556n2088o4501l67575K92539j15156
$$ 10462485 10202327 10061104 9783308 9529757 9269201 9217113 9152612 8785037 9077576 8962420
14122H962420l64626j08475l69437n601N88629k54764j11580o13650K79203o4379
$$ 8962420 8597794 8489319 8119882 8114281 8702910 8448146 8336566 7722916 8002119 7937740
14112G937740n73512J59942k14422O0505Q438m1255j314l85690j41661M6054j13837
$$ 7937740 7364228 7524170 7309748 7370253 7378691 7337436 7336122 6950432 6808771 6854825 6740988
14101F740988n5717Q285l91677k5618L1991K29632m33475k53972K25917k9212
$$ 6740988 6685271 6693556 6301879 6276261 6308252 6537884 6104409 5850437 6076354 6047142
14091F047142k05244K1884n1661k47419L89582o04869L5819K72709l4052m99009
$$ 6047142 5841898 5863782 5812121 5564702 5954284 5349415 5385234 5657943 5623891 5124882
14081E124882J69248l434K13829o51880M02794j65851L2719l32100P5660J34605
$$ 5124882 5294130 5290696 5504525 4852645 5255439 5089588 5122307 4790207 4865867 5000472
14071E000472m36877K8585j01747L18568l57120K28355l03461j809J05837m4026
$$ 5000472 4563595 4592180 4490433 4809001 4451881 4680236 4376775 4374966 4480803 4436777
14061D436777O4589l31371K80373k03728m3512L491J23952k15501k72569j17463
$$ 4436777 4501366 4169995 4450368 4246640 4203128 4206619 4330571 4115070 3842501 3725038
14051C725038j92921L28840M50691n78477j47236J85597J18215k92211N64277
$$ 3725038 3532117 3860957 4311648 3733171 3585935 3771532 3889747 3597536 4161813
14042D161813l90451r2881l17668K13056k21370O9517k5193L6229m8827k27547
$$ 4161813 3771362 3678481 3360813 3573869 3352499 3422016 3396823 3433052 3384225 3156678
14032C156678M32871n1297k57469r7611R9491J12178k84674k92969M79354j75516
$$ 3156678 3589549 3538252 3280783 3183172 3282663 3394841 3110167 2817198 3296552 3121036
14022C121036N8492m08282L71816k52109m9130J70854j62368n0671J72613J531
$$ 3121036 3179528 2771246 3143062 2890953 2841823 3012677 2850309 2799638 2972251 2973782
14012B973782k64915q773J4511k03003J94251O3168k23576o8685j15493K90949
$$ 2973782 2708867 2700094 2714605 2511602 2705853 2769021 2545445 2476760 2361267 2652216
14002B652216k02642L1962K27488m23774J52953K59308o27450L71612k34954j4808
$$ 2652216 2449574 2481536 2709024 2285250 2438203 2697511 2070061 2441673 2206719 2191911
13992B191911J72253J39561L95725R56472K108964O470592J6862962K3439621
$$ 2191911 2364164 2503725 2899450 3855922 5964886 12435478 29298440 52738061
13984E2738061k3693000j4490619n785953k490120j040768q64402l14075n02743
$$ 52738061 29045061 14554442 8768489 6278369 5237601 4373199 4059124 3556381
13976C556381j76314k74388r3885M3024l8889k52367l3408J31011p354j23174
$$ 3556381 3380067 3105679 3011794 3054818 3015929 2763562 2730154 2861165 2853811 2730637
13966B730637k01953r5408k2909K58300l61002k37068K95316j92812L03893j78429
$$ 2730637 2528684 2433276 2410367 2668667 2307665 2070597 2365913 2173101 2476994 2298565
13956B298565k10634L13647l15821n3591K08402j70537L01526l72449K77690k59416
$$ 2298565 2087931 2401578 2085757 2032166 2240568 2070031 2371557 1999108 2276798 2017382
13946B017382L83219j56042j89019J67981m70991J64094J80059k14709n2212K59626
$$ 2017382 2400601 2244559 2055540 2223521 1752530 1916624 2096683 1881974 1829762 2089388
13936B089388P4748k30365L30586k56236K47726k58682k03914o3185L2870k33033
$$ 2089388 2164136 1933771 2264357 2008121 2255847 1997165 1793251 1730066 1762936 1529903
13926A529903L60178k60914J55628j83667J09523K77823m89705J02254J58731
$$ 1529903 1890081 1629167 1784795 1601128 1710651 1988474 1498769 1601023 1759754
13917A759754j8020j89289l3925K72619p2100J41818l4549k56035P2822l8511
$$ 1759754 1741734 1552445 1518520 1791139 1719039 1860857 1826308 1570273 1643095 1604584
13907A604584J42210j25324j05682J09547l204p6134q7231l68301K81426N21296
$$ 1604584 1746794 1621470 1515788 1625335 1622131 1545997 1458766 1090465 1371891 1893187
13897A893187l89426K7843j25667q6417L8170j66607M71993k70040L2236n1537
$$ 1893187 1503761 1531604 1405937 1319520 1357690 1191083 1663076 1393036 1425272 1373735
13887A373735M76352m28062J64355l86801K72056M41429k81097k81256j98318
$$ 1373735 1850087 1422025 1586380 1199579 1471635 1913064 1631967 1350711 1152393
13878A152393L92126J68975m78560J01801o9115J56750k03148J09459j05110L61973
$$ 1152393 1544519 1713494 1234934 1336735 1267620 1424370 1221222 1330681 1225571 1587544
13868A587544l44401m5719K27952j76911k18980M9965j03343K8858J28832O0044
$$ 1587544 1243143 1197424 1425376 1248465 1029485 1079450 976107 1004965 1133797 1193841
13858A193841p164J35545O03k06229J53763P8623k95008M8492J28964j32620M9084
$$ 1193841 1186677 1322222 1322825 1116596 1270359 1348982 1053974 1102466 1231430 1098810 1147894
13847A147894r4372K61431m30514J25090J92194l56264M28892o8736k84190L70309
$$ 1147894 1053522 1314953 884439 1009529 1201723 845459 1274351 1205615 921425 1291734
13837A291734K8184L165m23776j29357L2958L58915o6526k03876J06339L9550
$$ 1291734 1319918 1323083 899307 769950 802908 1161823 1095297 891421 997760 1037310
13827A037310k59278N67741k50678j43146k33495J22287M1362L24963N1601n01220
$$ 1037310 778032 1345773 1095095 951949 718454 840741 882103 1207066 1258667 757447
13817G57447J61733l7055M58092l30776l13763K79294K34474k35517r7653L43518
$$ 757447 919180 882125 1340217 1009441 695678 974972 1209446 973929 876276 1219794
13807A219794l08688o7953L10394j58411O9867n21303L56304J33004j90172q7108
$$ 1219794 911106 843153 1153547 995136 1065003 543700 900004 1033008 842836 755728
13797G55728L6643k2660K10572j16327N3255j33444J46041K49145k64479q6492
$$ 755728 792371 769711 980283 863956 917211 783767 929808 1178953 914474 827982
13787H27982R3651j77237J26178R48J98017N939l55826K0957k175J00958r5509
$$ 827982 921633 744396 870574 871522 1069539 1075478 719652 740609 738434 839392 743883
13776G43883k9474K56664p2227J13971K2486Q7640j43617J35228l06992J11786
$$ 743883 714409 971073 898846 1012817 1035303 1122943 979326 1114554 807562 919348
13766I19348J33951l83515Q8198J60337m9617J37155j60578N7601l46288k47578
$$ 919348 1053299 669784 757982 918319 868702 1005857 845279 902880 556592 309014
13756C09014O92954C70932K12014k9947M68495j21259k63161R1159j51480p9883
$$ 309014 1001968 370932 582946 552999 1021494 900235 637074 728233 576753 496870
13746D96870K57197j9788M3864j7118k92752L66538j86965J1637J86423k31938
$$ 496870 754067 734279 778143 761025 468273 834811 647846 659483 845906 613968
13736F13968J79776K12364J20921l24483l40195K40478l02212J43737m7116J90126
$$ 613968 793744 1006108 1127029 802546 462351 702829 400617 544354 497238 687364
13726F87364B99626K91565m8909k161M7812J34537j94577q861K21272l6836j52224
$$ 687364 299626 591191 542282 540121 587933 722470 527893 519032 740304 703468 551244
13715E51244j79421j55916O9133M26510k57738J71565k474J64944P0444k06899
$$ 551244 371823 215907 285040 711550 453812 625377 622903 787847 858291 651392
13705F51392k46155M07386j96072K9207l04103O90253m13236j95016J47771p7343
$$ 651392 405237 812623 616551 645758 341655 1031908 618672 423656 571427 494084
13695D94084L17406j50208j12795j06775N48038j64737M9375n336C37265K37561
$$ 494084 811490 661282 548487 441712 989750 825013 874388 869052 337265 574826
13685E74826M838m4779j99426N35127a30999C75329K85931n1071N8683N232P1062
$$ 574826 579664 534885 335459 870586 -130999 375329 661260 610189 668872 674104 745166
13674G45166l3243B95095J43550J32690o1228J75842j25579O4112j89083j76257
$$ 745166 711923 295095 438645 571335 510107 685949 560370 624482 435399 259142
13664B59142J75802J33533k76707L03884k85302K0199J13713A76612K08409K10549
$$ 259142 434944 568477 291770 595654 310352 330551 444264 176612 385021 595570
13654E95570j02249p5713J49552k01438j00236L04589n2432k09677L42048L68415
$$ 595570 493321 417608 567160 365722 265486 570075 517643 307966 650014 1018429
13644A018429m10326l5975B66456K13533B23429K84893J49281j66014j51488N5447
$$ 1018429 608103 572128 266456 479989 223429 508322 657603 491589 340101 395548
13634C95548K97930l24317J27140L2578k33191L7002J67037j12144J8469j28294
$$ 395548 693478 369161 496301 528879 295688 332690 499727 387583 406052 277758
13624B77758L64431q8611l6105J76733k42169r358B16753o8611Q5738J76693L4785
$$ 277758 642189 553578 517473 694206 452037 442679 216753 148142 233880 410573 445358
13613D45358r5404L33695Q6720n3860C44870C4695M04756P350j30558J01170K90208
$$ 445358 349954 683649 770369 716509 344870 34695 439451 446801 316243 417413 707621
13602G07621j46111j87758K43060B82276R4928J67894k09538q7519K24867L6082
$$ 707621 561510 373752 616812 282276 377204 545098 335560 248041 472908 508990
13592E08990J36880B01065J22120J62702I1833L16374j58237j00223K61958E7771
$$ 508990 645870 201065 323185 485887 91833 408207 249970 149747 411705 57771
13581B25608K00453Q6087L05315F6888M60333J27893C24749J04152A93961J91942
$$ 225608 426061 512148 817463 66888 527221 655114 324749 428901 193961 385903
13571C85903J15077J00279k85866M1508l2344K04842A7370L82920A67407J88797
$$ 385903 500980 601259 315393 356901 324557 529399 17370 400290 167407 356204
13561C56204j52800J39463j37958I7432L57193K32011k47520n9235M8601k06361
$$ 356204 203404 342867 204909 97432 454625 686636 439116 379881 428482 222121
13551B22121Q2237n7503O9926L46915k13297K2584j61142e280D25720A69039J75340
$$ 222121 304358 246855 316781 663696 450399 472983 311841 -5280 425720 169039 344379
13540C44379L249j1061j67566M17029L2060I1424J64590J18445j45347K26095
$$ 344379 347628 336567 169001 586030 618090 91424 256014 374459 229112 455207
13530D55207j13086n2451O3388j55375N7103j26928J17721L7393c3043A54412
$$ 455207 342121 289670 353058 197683 254786 127858 245579 282972 -33043 154412
13519D28121j3217m420A24297J99161L54820k52770m1188A72463M84361A82203
$$ 428121 414904 410484 124297 323458 678278 425508 384320 172463 656824 182203
13508C19227D4896M22159A38041C6686J6388L07260j77886P6466J75456j09379
$$ 319227 44896 467055 138041 36686 53074 360334 182448 258914 434370 324991
13498C24991A09774O4812J96806L3670N1753A46497J61334r1835O07073C30064
$$ 324991 109774 174586 371392 405062 456815 146497 307831 215996 823069 330064
13487C84016p4224L40448A35682A8604K67036o663M5179K89074k30057j86963
$$ 384016 309792 650240 135682 18604 285640 278977 324156 613230 383173 196210
13477A96210J72682A81211J10549O8440r4094K5359J64792j32240m1089L4844
$$ 196210 368892 181211 291760 360200 266106 291465 456257 324017 282928 317772
13467C17772O1283m6087J14451B09794K7684m6332L45874B14373R6421A20359
$$ 317772 379055 332968 447419 209794 237478 191146 537020 214373 310794 120359
13456C26017n7107J7388j39013J19885G3225D271L30395J44660A55926J01350
$$ 326017 268910 286298 147285 267170 73225 4271 334666 479326 155926 257276
13446B57276K22770a54895C80182A71200k6049E9225O9422K05163j44045H6633
$$ 257276 480046 -154895 380182 171200 145151 59225 128647 333810 189765 86633
13435D12921j44964J70763k07157J56283N5637l2824H4629M2879N48145C29275
$$ 412921 267957 438720 231563 387846 443483 410659 84629 127508 675653 329275
13424B37355N5096D0004N84679B91721F8251K00009L00694A40848K96297C9459
$$ 237355 292451 40004 624683 291721 68251 268260 568954 140848 437145 39459
13413A28795J39707m2119b938B20143O7432N0326j65341R488J19213m5191a4769
$$ 128795 268502 226383 -2938 220143 287575 337901 172560 182048 301261 256070 -14769
13401B85288a99304D37786B0001K18796F6484K43231d2090B03331p8016A7567
$$ 285288 -199304 437786 20001 238797 66484 309715 -42090 203331 125315 17567
13390C72054M385L18290A59649P7013K7541M3815o3236E1447N64603B52356K2108
$$ 372054 376439 694729 159649 236662 264203 308018 244782 51447 616050 252356 274464
13379B74464A26661m8406M29521g7059C87861k0986A81444K83576I4546M31659
$$ 274464 126661 78255 507776 -77059 387861 366875 181444 465020 94546 526205
13369E26205P43F6582N7785n9842K08564j26881J24955O13K58829j28554n35j57259
$$ 526205 526948 66582 124367 64525 273089 146208 271163 271776 530605 402051 401516 244257
13357B44257J39388J5986n5148j28448J14395j21957O3883o4192i4974D22048
$$ 244257 383645 399631 344483 216035 330430 208473 272356 208164 -94974 422048
13346A82967Q6389l6611a57312A84737J15753K47915d4126C02262J18659k02600
$$ 182967 269356 232745 -157312 184737 300490 548405 -44126 302262 420921 218321
13336B18321A07072K2814K04551j4156b8538B85912O6831j50157O4895r9261J22939
$$ 218321 107072 129886 334437 320281 -28538 285912 352743 202586 267481 168220 291159
13325B91159o5338L06639B00150q5393J47064C8851J77850R6925A12996K16119
$$ 291159 225821 532460 200150 114757 261821 38851 216701 313626 112996 329115
13315C29115P4161K7196a16322A12502J01448G2158K33777Q3645c7858A49249
$$ 329115 403276 430472 -116322 112502 213950 72158 305935 389580 -37858 149249
13304c3492A88670H1538a67436C71103p8440J5692K40712A10225m3588N4243a0998
$$ -33492 188670 81538 -167436 371103 292663 308355 549067 110225 66637 120880 -10998
13292H6288J07364a09645E8174L57991q2623L2223i7591k30206D75734j30016
$$ 86288 193652 -109645 58174 416165 333542 365765 -97591 -327797 475734 345718
13282C45718F5872L04046C2014K32276J10358k6219b54909D14895H8614H646K74504
$$ 345718 65872 369918 32014 264290 374648 348429 -254909 414895 88614 8646 283150
13271B83150b48403G5601M5342C3196J56629K63444A46806d654j41909C05807
$$ 283150 -248403 75601 120943 33196 189825 453269 146806 -4654 -146563 305807
13260h8233a7693k8511A29910J53826j8388D6663P6087j0661q045J51517o1433
$$ -88233 -17693 -46204 129910 283736 265348 46663 122750 112089 104044 255561 194128
13249A94128N904M17743B28452C8808L8574K00632A06202K05910J39106B11202
$$ 194128 200032 617775 228452 38808 77382 278014 106202 312112 451218 211202
13238G0735J33549L9589K82036b0389F8151I412L05587P0131a78602B63439J38956
$$ 70735 204284 243873 525909 -20389 68151 9412 314999 385130 -178602 263439 402395
13227D02395c75843a0052A59002K70222I9326L77510A83442L0833C5534A4628
$$ 402395 -375843 -10052 159002 429224 99326 476836 183442 214275 35534 14628
13216a88512r598I868L09573B907f2658A65639g2857C9925L68165a70415B35463
$$ -188512 -198110 9868 319441 2907 -62658 165639 -72857 39925 408090 -170415 235463
13204C46691j47574e3890C2685b6155m0727B9971J30108a46097B31482r7572J4772
$$ 346691 199117 -53890 32685 -26155 -66882 29971 160079 -146097 231482 133910 148682
13193A48682e3826E4067J69996l8424a02303H5467Q4435h7549j35284M6840B85481
$$ 148682 -53826 54067 224063 185639 -102303 85467 169902 -87549 -222833 -175993 285481
13181A9553K67209Q4501D2213B0314L97548A07802J81407j16595K95313H84a9418
$$ 19553 286762 371263 42213 20314 417862 107802 289209 172614 467927 884 -19418
13169B24927l8127a96857g7511A54929E2134K44696d4190r0486E35168o4681A90215
$$ 224927 186800 -196857 -77511 154929 52134 296830 -44190 -134676 535168 470487 190215
13157A50257K63380c6481A58523c245k2977j52551n2537C99781D1799P086K75578
$$ 150257 413637 -36481 158523 -3245 -26222 -178773 -231310 399781 41799 48885 324463
13146C24463a0360A27720a39668B22141m1530C9229a58955G4598K76501m6712
$$ 324463 -10360 127720 -139668 222141 180611 39229 -158955 74598 351099 304387
13136C04387a80850b5775C10165A15295A9917a19769C38101C0486I202J57179
$$ 304387 -180850 -25775 310165 115295 19917 -119769 338101 30486 9202 166381
13126A66381a18919B6375M0262j3186J30350o7964K4503c06170A77692Q2096J10450
$$ 166381 -118919 26375 66637 53451 183801 115837 140340 -306170 177692 259788 370238
13115C70238J05196A6761L92534A44870J80472A19365K684g0893l68441g9631
$$ 370238 475434 16761 409295 144870 325342 119365 122049 -70893 -439334 -79631
13104a7626j34527D4712L10604j27399B0237b0057j10649J1487b4076C97010R247
$$ -17626 -152153 44712 355316 227917 20237 -20057 -130706 -119219 -24076 397010 406257
13093D06257a8864A4384L6623J82042c46261a23820j23217J01860O1097A06403
$$ 406257 -18864 14384 51007 233049 -346261 -123820 -247037 -145177 -84080 106403
13082A92715K7569a47043A80519O4638b68722C27606E4336a6843f992I9856j0136
$$ 192715 220284 -147043 180519 245157 -268722 327606 54336 -16843 -6992 99856 89720
13071H9720a29208B356J75163c08673B14901A4016a30366f1311o4335m7806p3593
$$ 89720 -129208 2356 177519 -308673 214901 14016 -130366 -61311 -125646 -173452 -247045
13060b47045a03200A75297h6736B24294M9109M935d53886f723A67361o4586d5214
$$ -247045 -103200 175297 -86736 224294 273403 278338 -453886 -6723 167361 102775 -45214
13048A50746b71125A6426Q6679g6531D03922b20459G468K4136J12246A8239a24459
$$ 150746 -271125 16426 103105 -76531 403922 -220459 7468 31604 143850 18239 -124459
13036G1453a15902B44348p4689a12423A48527K09267D9105L5125K88233N7433
$$ 71453 -115902 244348 169659 -112423 148527 357794 49105 84230 372463 429896
13026D29896A51973L3039I478Q7714M7110k0783L9758J11445g4083D83916H1337
$$ 429896 151973 185012 9478 97192 144302 123519 163277 274722 -74083 483916 81337
13014d2643D29940j88422l9388E8001K51228i9594D83855F7028P4226o1822J38976
$$ -42643 429940 241518 202130 58001 309229 -99594 483855 67028 141254 79432 218408
13003B18408a96725B96560D942K48990d7913j22024A92053m3139c6231C30200
$$ 218408 -196725 296560 4942 253932 -47913 -169937 192053 148914 -36231 330200
12992F9214O7777i0858D1568a16207B24146j00530K97195m7891p9398C0612J23692
$$ 69214 136991 -90858 41568 -116207 224146 123616 420811 372920 293522 30612 154304
12981A54304c1520g11k45379C07548q2295b25586A40036C9338a26834E40636F5075
$$ 154304 -31520 -711 -246090 307548 225253 -225586 140036 39338 -126834 540636 65075
12969B37585n5087a1136k60559F9447J744a20774B72096b5570A4945L70106I0287
$$ 237585 182498 -11136 -271695 69447 71191 -120774 272096 -25570 14945 385051 90287
12957A30604b10358e2579G919d1321B3c97811e6107k97277A43337M3651a9009
$$ 130604 -210358 -52579 7919 -41321 23 -397811 -56107 -353384 143337 186988 -19009
12945b06504A07439Q1417f8448A63761n4792m7533b33161A1792i7918l4239l06846
$$ -206504 107439 188856 -68448 163761 108969 61436 -233161 11792 -97918 -132157 -439003
12934d39003G2804Q7955c4964C54829j75806G1921j6896K68940o9622B4117b2819
$$ -439003 72804 160759 -34964 354829 179023 71921 55025 323965 254343 24117 -22819
12922e765n1323D90738a1669A8979a73166D6281O3719a84919g5183j58666G7880
$$ -5765 -57088 490738 -11669 18979 -173166 46281 110000 -184919 -75183 -233849 77880
12910b1049A83205l5270F3166c22225C57L15700c5344A10291e9270n3689C5932
$$ -21049 183205 147935 63166 -322225 357 316057 -35344 110291 -59270 -112959 35932
12898F6110R7619b8425G1790b45899J8904A23850a74198f2015I7809P135a23533
$$ 66110 163729 -28425 71790 -245899 -226995 123850 -174198 -62015 97809 104944 -123533
12886e6929B65890B0459a91503b2101E6880b39641d1135j89600d1011A01320K26167
$$ -56929 265890 20459 -191503 -22101 56880 -239641 -41135 -230735 -41011 101320 327487
12875C27487j43169a97733n0484A73985O6266a33852C331h8345p682d5299H7939
$$ 327487 184318 -197733 -248217 173985 240251 -133852 3331 -88345 -96027 -45299 87939
12863B79168j07004a39706j71701B18009a08067j35433d6152E2035J57157a94308
$$ 279168 172164 -139706 -311407 218009 -108067 -243500 -46152 52035 209192 -194308
12852a37315H4562J47701b30657A96602P5483A32781L6841l298g3754A61478L770
$$ -137315 84562 232263 -230657 196602 272085 132781 169622 166324 -73754 161478 165248
12841A65248O1937n329a62274A28783N1311a9550k3140J7872B25675j4534B3934
$$ 165248 227185 221856 -162274 128783 180094 -19550 -42690 -24818 225675 211141 23934
12829B37096a2678C2118a20618G4047a08942F4026R3229c5343B93513b04757H0285
$$ 237096 -12678 32118 -120618 74047 -108942 64026 157255 -35343 293513 -204757 80285
12817b37670F2999K94947I2776f0231H8848A2690J0727c6174A26027N7993a90680
$$ -237670 62999 357946 92776 -60231 88848 12690 23417 -36174 126027 184020 -190680
12805c13984A57672P8632K06993A4827e4797b0099G7960b9179j84155D13584a2013
$$ -313984 157672 236304 443297 14827 -54797 -20099 77960 -29179 -213334 413584 -12013
12793h0190A5532J35456j4945C1524L33583B0397F439L9839k2911N1199a19964
$$ -80190 15532 150988 136043 31524 365107 20397 6439 46278 23367 74566 -119964
12781E4000J74604J354C1553g5924J0971E6458j4376O1757J64760F2677J7996
$$ 54000 228604 229958 31553 -75924 -64953 56458 42082 103839 268599 62677 80673
12770H0673a36651B48850N7006j4266B5581P771J61429e5614D0940J18929J14769
$$ 80673 -136651 248850 305856 291590 25581 33352 194781 -55614 40940 159869 274638
12759B74638J02A37161g2748C4443a02479a1672k4246k59241a2232j67988B94243
$$ 274638 274740 137161 -72748 34443 -102479 -11672 -35918 -295159 -12232 -180220 294243
12747A44898J20685E8895J57413k2455j8314b9533A0744P9960J10720b10817e6109
$$ 144898 265583 58895 216308 193853 175539 -29533 10744 90704 201424 -210817 -56109
12735A20841b4621A55466a38928I4802Q9184c2831j73476B551a54199o030d2159
$$ 120841 -24621 155466 -138928 94802 183986 -32831 -206307 2551 -154199 -160229 -42159
12723C20237a12106F6578h9780j94059A7485J47084D3140K51261a759B65789a91472
$$ 320237 -112106 66578 -89780 -283839 17485 164569 43140 294401 -1759 265789 -191472
12711B97459I1233f9964j17391B29204R6404A17705K2061J61098B3733j097E456
$$ 297459 91233 -69964 -187355 229204 325608 117705 139766 300864 23733 22636 5456
12699a9374G5192J93853B7477K38463F0614b53017R6566D06058b08519i9872k3952
$$ -19374 75192 269045 27477 265940 60614 -253017 -156451 406058 -208519 -99872 -123824
12688a23824B1497P440f774B24421p4037k2777g1027C66292o7281q4321L7686
$$ -123824 21497 28937 -6774 224421 150384 127607 -71027 366292 299011 214690 252376
12677B52376i6424A1185P2109Q3628i0216A50275J1447a84001A08940p312D4295
$$ 252376 -96424 11185 83294 166922 -90216 150275 161722 -184001 108940 101628 44295
12665g5682j2550C34468i289C70610J35338E7511B6615K75023A24368k5348N882
$$ -75682 -88232 334468 -9289 370610 505948 57511 26615 301638 124368 99020 104902
12654A04902h364D0674J02325k574K24619Q9883E5936K81341c65521I0435d8721
$$ 104902 -8364 40674 142999 140425 365044 454927 55936 337277 -365521 90435 -48721
12642B90176M0568j01782J89443e8248k50096h1108G9652J56061e7003j9055L2485
$$ 290176 330744 228962 418405 -58248 -308344 -81108 79652 235713 -57003 -76058 -43573
12631d3573A73146J12062E3741J11776P7584K1578o7683F8272J20810M25168B18627
$$ -43573 173146 285208 53741 165517 243101 264679 196996 68272 189082 614250 218627
12619B54547g6462N058l23486B2579K06223F3151d5715K0808k5236r1150C07290
$$ 254547 -76462 -71404 -394890 22579 228802 63151 -45715 -24907 -50143 -141293 307290
12607B50709K1606o1419a62574A7989J85845F4892L6536L3234B2345N99350C6755
$$ 250709 272315 210896 -162574 17989 203834 64892 101428 134662 22345 621695 36755
12595C9921Q6137a33939N704o4432d9752j06198A15925P2556H824P3257k7239
$$ 39921 126058 -133939 -128235 -192667 -49752 -155950 115925 188481 8824 82081 54842
12584E4842Q4209a41668B42090a09201e823j25292a9449j23109C0384b42241A00607
$$ 54842 139051 -141668 242090 -109201 -5823 -131115 -19449 -142558 30384 -242241 100607
12572F2410c01591A43315a2540B49591F2598b77244C9514J38090P9987a17044
$$ 62410 -301591 143315 -12540 249591 62598 -277244 39514 177604 257591 -117044
12561a49437A77154J09879a97012B54843a58314B12109p9705B0079L504Q2290
$$ -149437 177154 287033 -197012 254843 -158314 212109 132404 20079 23583 105873
12551A05873N6679J481Q5060e879l0174J4807C94889C6293a11j79691j02856A79037
$$ 105873 162552 164033 249093 -5879 -36053 -21246 394889 36293 -111 -179802 -282658 179037
12538a11278A4605c14590A60728N1666a37339a5186k70884A20725b35063E4730
$$ -111278 14605 -314590 160728 212394 -137339 -15186 -286070 120725 -235063 54730
12527a7025I7234J20154c0669A16607K3307J44366a0553j18725C6471a54813A21348
$$ -17025 97234 217388 -30669 116607 139914 284280 -10553 -129278 36471 -154813 121348
12515C58616a43312k00244F7243O6181q437Q17K14088l6813b77816e1245k70859
$$ 358616 -143312 -343556 67243 133424 124987 125804 339892 303079 -277816 -51245 -322104
12504c22104P6723A13648E5733J15292f8646A22844b20128A01956B768P9899a14244
$$ -322104 -245381 113648 55733 171025 -68646 122844 -220128 101956 2768 82667 -114244
12492C03679e3206F3045e8173A83161E3120a71771B77050b22535I7159a61846
$$ 303679 -53206 63045 -58173 183161 53120 -171771 277050 -222535 97159 -161846
12481A42927h6781D272L419K59664b10592H5050k3901J26829D6992a23082N1122
$$ 142927 -86781 4272 7691 267355 -210592 85050 61149 187978 46992 -123082 -71960
12470g1960r7890c94C40583a64819C7499K8330a61388I9180j2491e3723l14426
$$ -71960 -169850 -394 340583 -164819 37499 65829 -161388 99180 86689 -53723 -368149
12459c68149A08860R290a54733N9784C04218C9378h1851H2097k1768K71070A07647
$$ -368149 108860 118150 -154733 -94949 304218 39378 -81851 82097 60329 331399 107647
12447C32147c4049j85151A19319b35333A01593J05928o0719a79828C28877b24724
$$ 332147 -34049 -219200 119319 -235333 101593 207521 146802 -179828 328877 -224724
12436a80333A49272b29183G5680a63256j53574d1245B8308i1624j75357J5693
$$ -180333 149272 -229183 75680 -163256 -316830 -41245 28308 -91624 -266981 -251288
12426b51288D8597B3151c11575h5086k741p9690C0599b80688A79399G0931J05397
$$ -251288 48597 23151 -311575 -85086 -87827 -167517 30599 -280688 179399 70931 176328
12415A76328a14541a8722A02373b70491B90766D0071a27554B6510K72476H2427
$$ 176328 -114541 -18722 102373 -270491 290766 40071 -127554 26510 298986 82427
12404a36598A30919a13825k9168J5467A53079O3918B5827J62790A0265d3818l1743
$$ -136598 130919 -113825 -142993 -127526 153079 216997 25827 188617 10265 -43818 -75561
12393g5561j12502f3509c0322m2559b1787A12838l5948a11103j07930j10647A60437
$$ -75561 -188063 -63509 -30322 -72881 -21787 112838 76890 -111103 -219033 -329680 160437
12381B38381d1563r7715n4018j53733B6676P5897l1679J46857j03478a86970c0440
$$ 238381 -41563 -139278 -193296 -347029 26676 102573 70894 217751 114273 -186970 -30440
12369A6088a62437B96412p2532b46611A60447i7820F6497j9061i1816A83351B6216
$$ 16088 -162437 296412 223880 -246611 160447 -97820 66497 47436 -91816 183351 26216
12357c04034R9510A15587B6012b05280A59995A8819P5949c14139c3981J4328D24040
$$ -304034 -204524 115587 26012 -205280 159995 18819 94768 -314139 -33981 -19653 424040
12345a29691B0802e9164m6116K8565l46222B62161h9663j3027B80422B0115h181
$$ -129691 20802 -59164 -105280 -76715 -422937 262161 -89663 -102690 280422 20115 -8181
12333A72325a61390f429j57615C4738d4401C07808a59705f3176r8678j9133c6733
$$ 172325 -161390 -6429 -164044 34738 -44401 307808 -159705 -63176 -161854 -180987 -36733
12321A5769a66385B57663H9173J30399E935R4118a7519A03088J48741j07220C0398
$$ 15769 -166385 257663 89173 219572 5935 100053 -17519 103088 251829 144609 30398
12309c8073A94058K25025a09043c0445k50120H8304a32401B35935L9238D4905
$$ -38073 194058 419083 -109043 -30445 -280565 88304 -132401 235935 275173 44905
12298a03372Q531I7572L56671A30642g1834J5693F3568L70315j5436A26256g1141
$$ -103372 -94841 97572 454243 130642 -71834 -56141 63568 433883 418447 126256 -71141
12286C33918A61758h3831A91889r1112K52466A44456k7696k3774c4386I5353g2072
$$ 333918 161758 -83831 191889 100777 353243 144456 116760 92986 -34386 95353 -72072
12274D22335A27786j9224a01683j1119C01440b0627D48219b88255L4061C95865
$$ 422335 127786 108562 -101683 -112802 301440 -20627 448219 -288255 -254194 395865
12263B69618f3243k8328j21017A17286J64724B5748b29803B10047m8528L41810
$$ 269618 -63243 -91571 -212588 117286 282010 25748 -229803 210047 161519 503329
12253E03329b9661B85173H1599P3077A6314J48518a41818j18656J19646J731m5079
$$ 503329 -29661 285173 81599 154676 16314 164832 -141818 -260474 -140828 -139097 -184176
12242a84176Q3893A94173J02257j7223G9358O7810a33680K4737B18734J13611
$$ -184176 -100283 194173 296430 279207 79358 147168 -133680 -108943 218734 332345
12232C32345j282a21698K6380B51951n8181i8423C54751A55455a29816F16533
$$ 332345 331063 -121698 -95318 251951 193770 -98423 354751 155455 -129816 616533
12221C76141A15971K4440L15448k09392A04066J41946H8841b20773I4382K677
$$ 376141 115971 140411 455859 246467 104066 246012 88841 -220773 94382 97059
12211I7059J98884j13271n5899Q5131J9265a38432G0771K86585l410A327L54057
$$ 97059 295943 182672 126773 211904 231169 -138432 70771 357356 353946 1327 355384
12200C55384G1306K35914r1066J52079n6108r6256G9110r580J69469A3114m735
$$ 355384 71306 307220 216154 368233 312125 215869 79110 69530 238999 13114 8379
12189H379J01661a91734M1964e4396G5693J40699F4104a88296I6641a33819A38412
$$ 8379 110040 -191734 -149770 -54396 75693 216392 64104 -188296 96641 -133819 138412
12177b171N48A8306J32143j3944A4932M79948B02757N5201c15597E6043e398I0338
$$ -2171 -1623 18306 150449 136505 14932 494880 202757 257958 -315597 56043 -5398 90338
12164B80280E6640K40916b84919H6743M3969R7833F6096p097g6982a609k71773
$$ 280280 56640 297556 -284919 86743 130712 228545 66096 58999 -76982 -1609 -273382
12153b73382B60945O7592G6264K6007b94877d710G7273K57576a82663B92714j00209
$$ -273382 260945 328537 76264 102271 -294877 -4710 77273 334849 -182663 292714 192505
12142A92505a82125H7826m0698b76410A99384d2958i584A45698n8843h0504i549
$$ 192505 -182125 87826 47128 -276410 199384 -42958 -9584 145698 86855 -80504 -9549
12130a94821F9440b28410M4978G82J97303b0227D09756F5408b72025a18120r1918
$$ -194821 69440 -228410 -183432 782 198085 -20227 409756 65408 -272025 -118120 -210038
12119b10038A13449A8231b69717e6309G6059B4515e4272q2081e1528j05398p7109
$$ -210038 113449 18231 -269717 -56309 76059 24515 -54272 -136353 -51528 -156926 -234035
12108b34035A03657d0199B70496A20384a10444N4657g648j432D07448H6386h4517
$$ -234035 103657 -40199 270496 120384 -110444 -55787 -7648 -9080 407448 86386 -84517
12096a30194E7814b82083B73883A27810J7461a529A74728b2072I5096K94233E0583
$$ -130194 57814 -282083 273883 127810 145271 -1529 174728 -22072 95096 389329 50583
12084A3329a63704m1133C39339j15907E2631R9225a92187G7113N81731l17939
$$ 13329 -163704 -204837 339339 223432 52631 151856 -192187 77113 658844 340905
12074C40905M27609J132919D20643k08118E4660g8860a14B31149i2865A75739
$$ 340905 768514 1901433 420643 212525 54660 -78860 -114 231149 -92865 175739
12063A8135c0907B24480q2864c32690a296B08613b07634i2768m278A61370e1256
$$ 18135 -30907 224480 141616 -332690 -1296 208613 -207634 -92768 -97046 161370 -51256
12051G5702a48555j21934O7512A0074J91015a34866A00251K9652L808P6657a41350
$$ 75702 -148555 -270489 -202977 10074 201089 -134866 100251 129903 133711 210368 -141350
12039a54675j40195F5111g8647B7943b48207Q0499B03480b17684e5796k70969
$$ -154675 -294870 65111 -78647 27943 -248207 -167708 203480 -217684 -55796 -326765
12029c26765D5391K42975f971A72800C250a06551m15048A96108P9121a79274D0954
$$ -326765 45391 288366 -6971 172800 3250 -106551 -521599 196108 275229 -179274 40954
12017a6364A5776c3280j27718O286q775B47916b66446d4545C5084A3073J34591
$$ -16364 15776 -33280 -160998 -154712 -163487 247916 -266446 -44545 35084 13073 147664
12006A47664k469i7321D41624C6562a44932j8924k5016A748M4158f0835m4352
$$ 147664 145195 -97321 441624 36562 -144932 -163856 -188872 1748 45906 -60835 -105187
11995a05187B55380a39516k18137A2735b92908H5672J58048O3536g460B26839
$$ -105187 255380 -139516 -357653 12735 -292908 85672 243720 307256 -7460 226839
11984B08441H3083B7036d7423a4509B29965a95349G4847c5164p3157E6919a17151
$$ 208441 83083 27036 -47423 -14509 229965 -195349 74847 -35164 -108321 56919 -117151
11972B4201J18129k7255d7870l11370a07043j42799J424B20484e8981B98817j09447
$$ 24201 142330 115075 -47870 -359240 -107043 -249842 -248418 220484 -58981 298817 189370
11961A89370r239K3384d1825E8396R5694a034C94115A26320J23941b66780F3580
$$ 189370 180131 203515 -41825 58396 154090 -1034 394115 126320 250261 -266780 63580
11949A83572N0872d1181n285j78691A25468o2647g4206A45630B5335b17987E5563
$$ 183572 234444 -41181 -46466 -225157 125468 62821 -74206 145630 25335 -217987 55563
11937a53600a5420F7235a86526j29897q0656A40461b22888B14681g9903k63139
$$ -153600 -15420 67235 -186526 -316423 -397079 140461 -222888 214681 -79903 -343042
11927c43042A59112b4694H2943j3263d13914A01475a18654n5652C05195b65259
$$ -343042 159112 -24694 82943 69680 -413914 101475 -118654 -174306 305195 -265259
11916a78370O5073B04137e4611C8399a11922E4494j4955b26245b710B69019c22587
$$ -178370 -113297 204137 -54611 38399 -111922 54494 39539 -226245 -2710 269019 -322587
11904i6607k117j91191g2834l08554D7065J95875G6016o711k5054e4051A45307
$$ -96607 -98724 -289915 -72834 -381388 47065 242940 76016 69305 44251 -54051 145307
11892b4055A151a30518a6700l7798m0148j15813O4720E5542K53581a21697F6609
$$ -24055 1151 -130518 -16700 -54498 -94646 -210459 -145739 55542 309123 -121697 66609
11880C42044A18177h272j0677j63226M8730k23854a26703A990L1168Q1775b26714
$$ 342044 118177 -8272 -18949 -182175 -133445 -357299 -126703 1990 33158 114933 -226714
11868a06337o2805f0467B10297D3954L9208a91F9728g4232B41041d55875J91700
$$ -106337 -169142 -60467 210297 43954 83162 -191 69728 -74232 241041 -455875 -264175
11857b64175b488p4524B31354N6513a06755M3393A23567b00872D3003M0522A3570
$$ -264175 -2488 -77012 231354 287867 -106755 -63362 123567 -200872 43003 83525 13570
11845a08898k5704K7566C9331c30715A18996f5049C06920b30091k21689J90992
$$ -108898 -134602 -107036 39331 -330715 118996 -65049 306920 -230091 -451780 -260788
11835b60788O5603A15220b43765f6755l78461I3933d9106l15843F1358b5994A92974
$$ -260788 -195185 115220 -243765 -66755 -445216 93933 -49106 -364949 61358 -25994 192974
11823A89375a47195e3008E9848h4236o6858A03283c43978H962H37J94656g0665
$$ 189375 -147195 -53008 59848 -84236 -151094 103283 -343978 8962 837 195493 -70665
11811b7260F1592a15004b7255j25363C6103g3392J5714k99856A5572L43392G0864
$$ -27260 61592 -115004 -27255 -152618 36103 -73392 -57678 -357534 15572 358964 70864
11799A5057J13023C5861L0861nk8199a99322A15084a60547K3809C4450J17458
$$ 15057 128080 35861 66722 66717 38518 -199322 115084 -160547 -136738 34450 151908
11788A51908a09036A77068C3258a10504j61781m2599B01089a45316A35811D5403
$$ 151908 -109036 177068 33258 -110504 -272285 -314884 201089 -145316 135811 45403
11777a2144j0413C44929c71425J83696k18896i5181p4131O7405j13006J02125
$$ -12144 -22557 344929 -371425 -187729 -406625 -95181 -169312 -101907 -214913 -112788
11767a12788A02620g1946F5131a18274d820j01691A49521b8094j49241H8021d2964
$$ -112788 102620 -71946 65131 -118274 -4820 -106511 149521 -28094 -177335 88021 -42964
11755I4076B8645a23926D00106a75241d0194C28591H5531J6999b26244h6842A36110
$$ 94076 28645 -123926 400106 -175241 -40194 328591 85531 102530 -226244 -86842 136110
11743B02373g5066q0716I6822m4114Q3768b91850a114A30496g823C5476a09786
$$ 202373 -75066 -155782 96822 52708 136476 -291850 -1114 130496 -7823 35476 -109786
11731A21306b27311D5242J19903cj49335A37497K0931J4616a19788B15506a54588
$$ 121306 -227311 45242 165145 -3 -149338 137497 158428 173044 -119788 215506 -154588
11719A87659a10924L6748C9021a067C812a81860B33748c0347A46297m9086K67768
$$ 187659 -110924 -74176 39021 -1067 3812 -181860 233748 -30347 146297 97211 364979
11708C64979F1524A890O3901a55816B00555L0115o4448o3782J59637o3599j5884
$$ 364979 61524 1890 65791 -155816 200555 230670 166222 102440 262077 198478 182594
11697A82594g6775L0893j15411j31533A36518O0206H9112g3584G9172a50606l7901
$$ 182594 -76775 -45882 -161293 -292826 136518 196724 89112 -73584 79172 -150606 -188507
11686a88507J9532N8351A43192a1121j17505D8104R9443a07898f523A68353P111
$$ -188507 -168975 -110624 143192 -11121 -128626 48104 147547 -107898 -6523 168353 175464
11675A75464F5771K04703j18580b30033E166N8438A6655d8966D3323a18849B40237
$$ 175464 65771 270474 151894 -230033 5166 63604 16655 -48966 43323 -118849 240237
11663C6687a64139H6762J07636d4721G5424i7549E0353J52071e472A55735B4944
$$ 36687 -164139 86762 194398 -44721 75424 -97549 50353 202424 -5472 155735 24944
11651b37898A44539a4106G8796J32376C8023L25896a08216j02661j22427H0753
$$ -237898 144539 -14106 78796 211172 38023 363919 -108216 -210877 -333304 80753
11640b78587I0126a45476H8650b1346o5138B21841m181H6336b6074B6713q608
$$ -278587 90126 -145476 88650 -21346 -86484 221841 217660 86336 -26074 26713 18105
11629A8105K65116K1766j29267H4347K4614L41343j10275C9161K08481p9636N0669
$$ 18105 283221 304987 175720 84347 108961 450304 340029 39161 247642 168006 218675
11618B18675c05220B9893K1395J48299i5574I0694g2153k2797a7177k1250a062
$$ 218675 -305220 29893 51288 199587 -95574 90694 -72153 -94950 -17177 -38427 -1062
11606D03091d3284C1906J91232a70901A99690a44084D011b21167A21226c1821
$$ 403091 -43284 31906 223138 -170901 199690 -144084 4011 -221167 121226 -31821
11595c68972C37582j53969d3239B30809c4505C39905b27373E0631N0315J21205
$$ -368972 337582 183613 -43239 230809 -34505 339905 -227373 50631 100946 222151
11585B22151B2385L52356j17216G1617a34579L0484F4438a18623a9206A8413g1260
$$ 222151 22385 374741 257525 71617 -134579 -104095 64438 -118623 -19206 18413 -71260
11573A42339a19950M9920A05051J89032A23552C3776Q5064l6893j7435a163C23054
$$ 142339 -119950 -70030 105051 294083 123552 33776 118840 81947 64512 -1163 323054
11561h0339p1799I8564A2556J08069K86084j49135j27483c3313A32258j4135M50013
$$ -80339 -152138 98564 12556 120625 406709 257574 130091 -33313 132258 118123 568136
11550E68136A50811a78635m0083A12909p744M10123k05480g4796A34733K7903
$$ 568136 150811 -178635 -218718 112909 105165 515288 309808 -74796 134733 162636
11540A62636G8036k5998O00063f6868A48207p1110a64326d3155A96059o2913c0885
$$ 162636 78036 52038 652101 -66868 148207 77097 -164326 -43155 196059 133146 -30885
11528A47515m1708J95836F6076c5945n7149r8535B82367a00967B92936j30144
$$ 147515 105807 301643 66076 -35945 -93094 -191629 282367 -100967 292936 162792
11518A62792J7270p8035g0414C47300j47567b2227I5591I06J43247K07297G3796
$$ 162792 180062 102027 -70414 347300 199733 -22227 95591 906 144153 351450 73796
11506A25189C7880L3580J2575K09155E4314K46663j37158E6981d0517c599G9535
$$ 125189 37880 71460 84035 293190 54314 300977 163819 56981 -40517 -3599 79535
11494A44913N5767K5386K02164A18036J40571q7798Q3673N4498a65488A154e9288
$$ 144913 200680 226066 428230 118036 258607 170809 254482 308980 -165488 1154 -59288
11482B1488b44403A16599n4998d9636C5629J45536K80890E0669K80715j28804
$$ 21488 -244403 116599 61601 -49636 35629 181165 462055 50669 331384 202580
11472B02580b2626k73307B37334n9078R2606c8877B43180K45225B153a2390j23660
$$ 202580 -22626 -295933 237334 178256 270862 -38877 243180 488405 2153 -12390 -136050
11461a36050R194f2385C83174A53254M9718o3716c991j0566q7866c8363m43401
$$ -136050 -126856 -62385 383174 153254 202972 139256 -3991 -14557 -102423 -38363 -481764
11450d81764B66817I3216b37224B08552F6292b29840D37816R084c02444E2560
$$ -481764 266817 93216 -237224 208552 66292 -229840 437816 446900 -302444 52560
11439B23587E2236a13822A07617a82999B59193a3318A07080m5376d0087F8273
$$ 223587 52236 -113822 107617 -182999 259193 -13318 107080 61704 -40087 68273
11428F2688b64598b6851G697a3881A2372c8179E4975k6350a09672l5971j398i584
$$ 62688 -264598 -26851 7697 -13881 12372 -38179 54975 28625 -109672 -145643 -147041 -9584
11415a92410a2917A05747K6641f1418k67376F7379J50631J8673m3128a62727e6144
$$ -192410 -12917 105747 132388 -61418 -328794 67379 218010 236683 193555 -162727 -56144
11403a82378A8992J01945M6462d9282G7968A6664O3570D904J2312b66547L272
$$ -182378 18992 120937 167399 -49282 77968 16664 80234 4904 17216 -266547 -263275
11392b63275c7180I5110K54493A17358g5219A48302b98535B56422c17321O0945
$$ -263275 -37180 95110 349603 117358 -75219 148302 -298535 256422 -317321 -256376
11382b56376A64510d0836j35711e309B63780b3382A57240J22895a11302M2746
$$ -256376 164510 -40836 -176547 -5309 263780 -23382 157240 280135 -111302 -68556
11372f8556g593F7605Q6447O0033a06645B33896a52030B98824A07905J21059a03853
$$ -68556 -7593 67605 154052 214085 -106645 233896 -152030 298824 107905 228964 -103853
11360b92703C40884A3679K57413c8558l39141g5337Q317j66979C77704a58985
$$ -292703 340884 13679 271092 -38558 -377699 -75337 -67020 -233999 377704 -158985
11349G4255L1853a21860j40043g0174C72269a26329A9574e66330B18855a48487
$$ 74255 106108 -121860 -261903 -70174 372269 -126329 19574 -566330 218855 -148487
11338A23428a49827I1369p287M9789c5783F8733J75861c0042A10540J17031b53653
$$ 123428 -149827 91369 84082 133871 -35783 68733 244594 -30042 110540 227571 -253653
11326A66915m9071J99237a38123c5094A11825h6407D5258a59208J7750G8362a38822
$$ 166915 117844 317081 -138123 -35094 111825 -86407 45258 -159208 -141458 78362 -138822
11314A40315J42374c14552c390A82815B1149K56428a8555A76767A6315a99717
$$ 140315 282689 -314552 -3390 182815 21149 277577 -18555 176767 16315 -199717
11303i8812A75093a08131M9122j53103i8490A642J20855c7950G7819B8222r781
$$ -98812 175093 -108131 -59009 -212112 -98490 1642 122497 -37950 77819 28222 18441
11292A8441b90740A83890d05706a67712A57916a8535l4807j9706L3917j15241
$$ 18441 -290740 183890 -405706 -167712 157916 -18535 -53342 -73048 -39131 -154372
11282a54372j9086f3372j93409A1798a07010A43693b18133C9778a34452P200j51643
$$ -154372 -173458 -63372 -256781 11798 -107010 143693 -218133 39778 -134452 -127252 -278895
11271b78895f8040C0807K7007K83750b53278p2960a269A05016a19576G2416J24900
$$ -278895 -68040 30807 57814 341564 -253278 -326238 -1269 105016 -119576 72416 197316
11260A97316a53542E5584b6121A23746k5158B9337M3662K15906b35018A88473
$$ 197316 -153542 55584 -26121 123746 98588 29337 72999 288905 -235018 188473
11249A6445b85671A20179C4644a2363B00942a2725j34347k21043a68978A50257
$$ 16445 -285671 120179 34644 -12363 200942 -12725 -147072 -368115 -168978 150257
11238b74642B0876M2039b7945E00831b96101H8110a8904B1240b19067F9614i4852
$$ -274642 20876 62915 -27945 500831 -296101 88110 -18904 21240 -219067 69614 -94852
11226b25104J00124K4274j62348J8706e6516A1583M8852L9585c24737E7211J45936
$$ -225104 -124980 -100706 -263054 -244348 -56516 11583 60435 100020 -324737 57211 203147
11215B03147B4605J26526a44138g12B27625i8930A90815D351J65164a91295k2029
$$ 203147 24605 151131 -144138 -712 227625 -98930 190815 4351 169515 -191295 -213324
11204b13324C789b6282j37074F9116a09398B6073R4255a89266O6145A37140a04474
$$ -213324 3789 -26282 -163356 69116 -109398 26073 120328 -189266 -123121 137140 -104474
11192A41200R87b47611d1227H183K0760a38096A08124a18517m5376j01445a01629
$$ 141200 142187 -247611 -41227 8183 28943 -138096 108124 -118517 -163893 -265338 -101629
11180b08442N5601A18189f8831A03981b0139r9947d4989C2266a59657o6025a2798
$$ -208442 -152841 118189 -68831 103981 -20139 -120086 -44989 32266 -159657 -225682 -12798
11168a5599m5612k68679D1145K82283a96325d3372I6586J02996C8681K42771f8664
$$ -15599 -61211 -329890 41145 323428 -196325 -43372 96586 199582 38681 281452 -68664
11156A22450B539J48539n3000B3381Q4856a58072A29754d2819A8646b61338C857
$$ 122450 2539 151078 98078 23381 108237 -158072 129754 -42819 18646 -261338 3857
11144b59341N7693K7957f1710k30123J1947a01834c0206C06800q7547k1142e4111
$$ -259341 -201648 -173691 -61710 -291833 -279886 -101834 -30206 306800 219253 198111 -54111
11132H636c2945I4173b5371j59983A20887f9086D79884a53456B49344j22093J85722
$$ 8636 -32945 94173 -25371 -185354 120887 -69086 479884 -153456 249344 127251 312973
11121C12973a65784B07374H7336J52146a25078A97772m2625F017h4737B26270
$$ 312973 -165784 207374 87336 239482 -125078 197772 155147 6017 -84737 226270
11110D0315D217J28195Q751F0838g0532A64287a92542C19023A48395B2363Q4365
$$ 40315 4217 132412 141163 60838 -70532 164287 -192542 319023 148395 22363 106728
11099A06728a23876C18521C8897K66926h6299A33836J03408C1827K14012J37087
$$ 106728 -123876 318521 38897 305823 -86299 133836 237244 31827 245839 382926
11089C82926E8319J86750F1016K83067A39324K71120A16131n4427P5094c3390
$$ 382926 58319 245069 61016 344083 139324 410444 116131 61704 136798 -33390
11078B46359A17878D9244J85694L06265B34473J44644j83819a7852r3904D66712
$$ 246359 117878 49244 234938 541203 234473 379117 195298 -17852 -111756 466712
11067C98274q5018J81201I4444L07057L29460j15452j42676k10411J81910J14993
$$ 398274 313256 494457 94444 401501 730961 615509 472833 262422 444332 559325
11057E59325J80124B78590M17634j64244L11753j13628M188J04269j39423C40980
$$ 559325 739449 278590 696224 531980 843733 730105 734293 838562 699139 340980
11046G45976K24964j09758j03349j8188J93552l56862P133q0697L95344r9751
$$ 745976 970940 861182 757833 739645 933197 576335 583468 502771 898115 798364
11036G98364q9184k90827K78735J47675j76609K02290k57423K39231p7746J20070
$$ 798364 709180 418353 697088 844763 668154 870444 613021 852252 774506 894576
11026H94576K31387k05622k36377k20734K42489J20241j87711B72975K22334Q4510
$$ 894576 1125963 920341 683964 463230 705719 825960 638249 272975 495309 579819
11016E79819J72924l6198B97204M20955q1640K81383D17928J64702p5309L10010
$$ 579819 752743 716545 297204 718159 636519 917902 417928 582630 507321 817331
11006H17331l07507J13906j91392L42097o3371m2008j18148N39070m17881j26796
$$ 817331 509824 623730 432338 774435 711064 669056 550908 1089978 672097 545301
10996E45301J71319J20642l72591J42677j14317N5916m8137J35350m5637o2594
$$ 545301 716620 837262 464671 607348 493031 548947 500810 636160 590523 527929
10986E27929M82083O4614M8267l26588n7793L89548J07192J1027J16830L14618
$$ 527929 1010012 1074626 1122893 796305 738512 1128060 1235252 1246279 1363109 1677727
10976A677727l05055O91315N02625m72648O12136n4222R1934p4318K7336l91296
$$ 1677727 1372672 2063987 2566612 2093964 2706100 2651878 2743812 2669494 2696830 2305534
10966B305534L4141l93041l94746L89172q96824L27820K37846l3341K49466k19079
$$ 2305534 2339675 1946634 1551888 1941060 1044236 1372056 1609902 1576561 1826027 1606948
10956A606948K23376j64700m38802n6227L26505l92743k03220n017J04964m43200
$$ 1606948 1830324 1665624 1226822 1170595 1497100 1104357 901137 896120 1001084 557884
10946E57884L64590C36138K0164g4750C49625i51A89611H5863J69468c8778a3412
$$ 557884 922474 336138 356302 -74750 349625 -951 189611 85863 255331 -38778 -13412
10934E3296L33734A65621J34227j19786c9644G7527P7512o2885J9474b64349B85053
$$ 53296 387030 165621 299848 180062 -39644 77527 155039 92154 111628 -264349 285053
10922e3284B76233b25374a7277I0614l0663a28015q9059A67193b89464B07880
$$ -53284 276233 -225374 -17277 90614 59951 -128015 -217074 167193 -289464 207880
10911A63457J98126a04996K668B40025a63198G508K05216E2876L3617K76307a1797
$$ 163457 361583 -104996 -102328 240025 -163198 7508 212724 52876 86493 362800 -11797
10899C4775Q922b64939R977J23378D4628b05442A99908a26808K2888o0399o7000
$$ 34775 43697 -264939 -254962 -131584 44628 -205442 199908 -126808 -103920 -164319 -231319
10888b31319J07289q3361C58563a2716j72514A89451E0407J87108b44809b6923
$$ -231319 -124030 -207391 358563 -12716 -185230 189451 50407 237515 -244809 -26923
10877e4183j91868A44885N4909f9734I1675D5353e60451C52874j37040J4267a02026
$$ -54183 -246051 144885 199794 -69734 91675 45353 -560451 352874 215834 230101 -102026
10865d23321J98960A38360d34773C04751e5145j56615A36272K80130c4246C70752
$$ -423321 -224361 138360 -434773 304751 -55145 -211760 136272 416402 -34246 370752
10854b26578A80120F3402b02814A12760a64006r855N6260A49468a10189A4034
$$ -226578 180120 63402 -202814 112760 -164006 -173861 -117601 149468 -110189 14034
10843c8019k17756I7334g9541b1436j21566J6255F9771b55514O3438d666A09766
$$ -38019 -255775 97334 -79541 -21436 -143002 -126747 69771 -255514 -192076 -4666 109766
10831b22438b0549j70845A8948d02862g4862B2975J55250G3275a31910j30313
$$ -222438 -20549 -191394 18948 -402862 -74862 22975 178225 73275 -131910 -262223
10821b62223a10209b0589p7516l23072i5335k6629B32014a890A17559e0843A9548
$$ -262223 -110209 -20589 -98105 -421177 -95335 -121964 232014 -1890 117559 -50843 19548
10809c4850E7202A4532L3202c78089a63602O5527G8425B2366J65977b61579j00312
$$ -34850 57202 14532 47734 -378089 -163602 -98075 78425 22366 188343 -261579 -361891
10798c61891B40097b20145i3017j18337N2781l9858c1712j70023C70120b2224
$$ -361891 240097 -220145 -93017 -211354 -158573 -198431 -31712 -201735 370120 -22224
10787H11g3067j3593j2841n0540A90478d11098a78937A95008b7789j45737l5730
$$ 811 -73067 -86660 -99501 -150041 190478 -411098 -178937 195008 -27789 -173526 -209256
10776b09256K6636A76402A3121J41581K9277H405K19005j9661a0018o3960H4611
$$ -209256 -182620 176402 13121 154702 183979 8405 227410 207749 -10018 -73978 84611
10764D0216a34653K3029C56024C9853b7512G5914D523M1831c90872B7617f5240
$$ 40216 -134653 -111624 356024 39853 -27512 75914 4523 46354 -390872 27617 -65240
10752f933m6538B39418a12688C34790a74024g0726j21544B01127a35687J4726
$$ -6933 -53471 239418 -112688 334790 -174024 -70726 -192270 201127 -135687 -120961
10742a20961B59853d13460J08030B20868c6908O204k85755a43954B00426b99443
$$ -120961 259853 -413460 -305430 220868 -36908 -30704 -316459 -143954 200426 -299443
10731A51264a79564l3737d2170j14272j42380P5056j23247H431g2134j26755J662
$$ 151264 -179564 -213301 -42170 -156442 -298822 -223766 -347013 8431 -72134 -198889 -197227
10720a97227A62729b35556e8257L995A52312b01758N5328K9745C28938B7585i5111
$$ -197227 162729 -235556 -58257 -54262 152312 -201758 -146430 -116685 328938 27585 -95111
10708a08644k4919C6058d2273q4365j94688A44708C6091J16151e15767a85987
$$ -108644 -133563 36058 -42273 -126638 -321326 144708 36091 152242 -515767 -185987
10697g8003K9771B96661b52406D4114J8718a21752M853K9054A86553a37413R264
$$ -78003 -48232 296661 -252406 44114 62832 -121752 -116899 -87845 186553 -137413 -128149
10686a28149A30338J90829E0046f4663j49105b8127q0405m3624d9572c879j26582
$$ -128149 130338 321167 50046 -64663 -213768 -28127 -108532 -152156 -49572 -3879 -130461
10675a30461J9905A65541b15055d8879l05096a3816j84482e9646C46647D4053
$$ -130461 -110556 165541 -215055 -48879 -353975 -13816 -198298 -59646 346647 44053
10664D2336a90376c8370k75993g6623A95652h230j70640A59001F8236P3290a92276
$$ 42336 -190376 -38370 -314363 -76623 195652 -8230 -178870 159001 68236 141526 -192276
10652b02065I4299a60815A41255a05440b8076H9029b44633M4229B29437h6180
$$ -202065 94299 -160815 141255 -105440 -28076 89029 -244633 -200404 229437 -86180
10641D161J03082a2436D1239p557a70340j06305A05682a60345M2673f471B74530
$$ 4161 107243 -12436 41239 33682 -170340 -276645 105682 -160345 -117672 -6471 274530
10629c7960a681A40756b6296r8569B3041d24185b05813b321M16A6832M70741b25228
$$ -37960 -1681 140756 -26296 -124865 23041 -424185 -205813 -2321 -1905 16832 487573 -225228
10616d8120A974b67887B58271C1312K6875a18953B90168c6236l01423e932k44204
$$ -48120 1974 -267887 258271 31312 58187 -118953 290168 -36236 -337659 -5932 -250136
10605b50136A42767c54634C6704a04364k47229e9081j55685A58745c67509O5112
$$ -250136 142767 -354634 36704 -104364 -351593 -59081 -214766 158745 -367509 -302397
10595c02397J0547E1849A3248a8488F093L20182C3580J49111B1293h2808C0107
$$ -302397 -291850 51849 13248 -18488 6093 326275 33580 182691 21293 -82808 30107
10583B02566b75858E9876a48621A17799h2125l3325k77627H9608h6113j0214q2751
$$ 202566 -275858 59876 -148621 117799 -82125 -115450 -393077 89608 -86113 -96327 -179078
10572a79078n1522g5099k05853E9648i9156d016r8307b4125C45851C3380j3671
$$ -179078 -230600 -75099 -280952 59648 -99156 -4016 -102323 -24125 345851 33380 19709
10561A9709b87133P3538l0268f4441r7037F5034J74918b3933j00050A03c00593
$$ 19709 -287133 -213595 -243863 -64441 -161478 65034 239952 -23933 -123983 103 -300593
10549i6315K606k8020A31787e7960B02120a91539q955g9277K5886F4589e6571
$$ -96315 -93709 -121729 131787 -57960 202120 -191539 -200494 -79277 -53391 64589 -56571
10537c02463J17406d0485B85726a20193R089C4722a56672A44969o9174a85780
$$ -302463 -185057 -40485 285726 -120193 -111104 34722 -156672 144969 75795 -185780
10526A45190b09599B4809a00160G980a24289j38771b0573B6971d5254r5419l3149
$$ 145190 -209599 24809 -100160 7980 -124289 -263060 -20573 26971 -45254 -140673 -173822
10515a73822m8493A56141b38036I0036a73394E0581a53927A67668J34363A14467
$$ -173822 -222315 156141 -238036 90036 -173394 50581 -153927 167668 302031 114467
10504e2321l7509A53808a14716p61I6404K16201A5718L826b66879B5288J03422
$$ -52321 -89830 153808 -114716 -115477 96404 312605 15718 19544 -266879 25288 128710
10493A28710g0503C624Q0492b1018j48566K4440e1200d004B24620D3276Q0247
$$ 128710 -70503 3624 84116 -21018 -169584 -145144 -51200 -4004 224620 43276 123523
10482A23523J61084I5864K88701O9914A74821M8378a56359A2384M6513j8268d006
$$ 123523 284607 95864 384565 454479 174821 223199 -156359 12384 58897 40629 -4006
10470a42208B48955H2039a1669I8239a44343a986A01118i7607A95830r4441j7048
$$ -142208 248955 82039 -11669 98239 -144343 -1986 101118 -97607 195830 101389 84341
10459H4341P826a39147A85496c25960c453n3819k13071h4156m7118A8949a19399
$$ 84341 92167 -139147 185496 -325960 -3453 -57272 -270343 -84156 -131274 18949 -119399
10447a52691I2050O7114f2683A23395b97540H2087R4237N5237c19339e2228F8582
$$ -152691 92050 159164 -62683 123395 -297540 82087 176324 231561 -319339 -52228 68582
10435e6694q743k72793B88120a03850d530j50317c5095A37865J12639I4182a40076
$$ -56694 -65437 -338230 288120 -103850 -4530 -154847 -35095 137865 250504 94182 -140076
10423A14870c30931J53611A05666d04818a5055k05488p1517e3940B28260M1548
$$ 114870 -330931 -177320 105666 -404818 -15055 -220543 -292060 -53940 228260 269808
10413B69808b81735A5694a9325m1048j31966M6743A19316i4586G4116h6149L8396
$$ 269808 -281735 15694 -19325 -60373 -192339 -145596 119316 -94586 74116 -86149 -47753
10402d7753k29998A50667b57389D8812K12741b96023D7498g999C01960A04843
$$ -47753 -277751 150667 -257389 48812 261553 -296023 47498 -7999 301960 104843
10391C05314j47997N5925a78821C05703j48997L2177L9324j04929n653P358b49494
$$ 305314 157317 213242 -178821 305703 156706 188883 228207 123278 117625 124983 -249494
10379A49963J20829a48355A61518N6307f9478B88316k8157o3331b68923C61598
$$ 149963 270792 -148355 161518 217825 -69478 288316 260159 196828 -268923 361598
10368A59104Q5909M7283k1239J74384H6178J88653I5478e0829C59588c6884A38439
$$ 159104 245013 292296 271057 445441 86178 274831 95478 -50829 359588 -36884 138439
10356B18758A03066j7662b34437C30340I9961N06543J77626l69896J01853D1616
$$ 218758 103066 85404 -234437 330340 99961 606504 784130 414234 516087 41616
10345g3063B83943J72153q8835K28018j48781A67574P6391N8615o6702p9889k5422
$$ -73063 283943 456096 367261 595279 446498 167574 243965 302580 235878 155989 130567
10334A30567M6810K49484B04367J50883A36981A7547J19083L5529J81308j47708
$$ 130567 177377 426861 204367 355250 136981 17547 136630 172159 353467 205759
10324B05759J09460q1104o0299m0502A8063K87309h3371A06334k5063K1595Q4084
$$ 205759 315219 234115 173816 133314 18063 305372 -83371 106334 81271 102866 186950
10313A86950o0244h6395k50940R8903C30280I0998B6975b22306l0459G2451m455
$$ 186950 126706 -86395 -337335 -238432 330280 90998 26975 -222306 -252765 72451 67996
10302F7996J43407b396A69294h4007I7634m1421J92872a25373j45389F5449a17539
$$ 67996 211403 -2396 169294 -84007 97634 56213 249085 -125373 -270762 65449 -117539
10290b77512A96847D308L29891b68201c6333j53934j17863d8737h870G6922a94325
$$ -277512 196847 4308 334199 -268201 -36333 -190267 -308130 -48737 -8870 76922 -194325
10278D1194b63985E4939h1529k0686L73k74986C87098o9629b50265E8087a58347
$$ 41194 -263985 54939 -81529 -102215 -101842 -376828 387098 317469 -250265 58087 -158347
10266b82330B05198c23739f8225A83535h3712C06050K29929A96846g2514A23507
$$ -282330 205198 -323739 -68225 183535 -83712 306050 535979 196846 -72514 123507
10255I1943j5628b66678i84A24367c10417c6304I6613J81637b3987j76084g8004
$$ 91943 76315 -266678 -984 124367 -310417 -36304 96613 278250 -23987 -200071 -78004
10243B24011q1935c30747a18286j3417c3310l3284B74074a2029j93459C05447
$$ 224011 142076 -330747 -118286 -131703 -33310 -66594 274074 -12029 -205488 305447
10232H4962b42812D8636a68816L664L6345J3518A08524l8747J91140h1555J4854
$$ 84962 -242812 48636 -168816 -165152 -128807 -115289 108524 69777 260917 -81555 -66701
10221f6701G5478K9282b40632g892A85065H8157J94991j1925c36714a05922B48989
$$ -66701 75478 104760 -240632 -7892 185065 88157 283148 271223 -336714 -105922 248989
10209I2151N3090j556o3566g7202A97568b98917p2533a4823k06581o6006i4207
$$ 92151 145241 143685 80119 -77202 197568 -298917 -371450 -14823 -221404 -287410 -94207
10197d07927B38422b09386N6082B45211J24407e1410A48332C0850K46197j33442
$$ -407927 238422 -209386 -153304 245211 369618 -51410 148332 30850 277047 143605
10187A43605A2082b88792a16447C3722b39640M4242H4603a67392A6294b69090
$$ 143605 12082 -288792 -116447 33722 -239640 -195398 84603 -167392 16294 -269090
10176g9974L9045j20800m6397A04011K43309H9067a92176h6468k17475a20966
$$ -79974 -40929 -161729 -208126 104011 347320 89067 -192176 -86468 -303943 -120966
10165a78561A01018b29325m8344e3841E8964c09293F9315c04186B98727C3441
$$ -178561 101018 -229325 -277669 -53841 58964 -309293 69315 -304186 298727 33441
10154d9746p2452j1685G0111a08618B65326i7180c2405l4979n6299k6323p0275
$$ -49746 -122198 -133883 70111 -108618 265326 -97180 -32405 -67384 -123683 -150006 -220281
10143b20281O5383F083b86453E4494j8821b95970n070I8305a06301C7364c44684
$$ -220281 -154898 6083 -286453 54494 35673 -295970 -301040 98305 -106301 37364 -344684
10131A18164a39238L2835A71792a04905I3815a3473m2053j35019c9144j6192o2441
$$ 118164 -139238 -106403 171792 -104905 93815 -13473 -55526 -190545 -39144 -55336 -117777
10120a17777A08266m5121a71236m4629r74h8630A81664p950J246b89565J0733
$$ -117777 108266 63145 -171236 -215865 -216839 -88630 181664 173714 174960 -289565 -278832
10109b78832J23665D8846i0029A55153E6413d17422A1934E952P5522g3603E9211
$$ -278832 -155167 48846 -90029 155153 56413 -417422 11934 5952 81474 -73603 59211
10097A06371i7388M5778C3301c64740i3118A22576N2392J8q7108e8490r3228C39628
$$ 106371 -97388 -51610 33301 -364740 -93118 122576 174968 174986 87878 -58490 -151718 339628
10084A25368F2196b31306J02565A02761i2537B00833O9038b05533b2149q8695
$$ 125368 62196 -231306 -128741 102761 -92537 200833 269871 -205533 -22149 -110844
10074a10844k83060J16565M6797A13372c31733J8062D2371e1044A24110h5606
$$ -110844 -393904 -277339 -230542 113372 -331733 -313671 42371 -51044 124110 -85606
10063b2420j49295E1560h8375B41648a07345M7636l52380A33962a1376A67601
$$ -22420 -171715 51560 -88375 241648 -107345 -59709 -412089 133962 -11376 167601
10052b4375G4461b7446j28719J4314J75j53276F1838a25945B27663a41429d3841
$$ -24375 74461 -27446 -156165 -141851 -141676 -294952 61838 -125945 227663 -141429 -43841
10040b6440G9299b05597A49070b99486A48597a43724A18338A6815N9733a57549
$$ -26440 79299 -205597 149070 -299486 148597 -143724 118338 16815 76548 -157549
10029b88791K2440Q8692Q4864b7575C37154j40749r2447b45445B25770a33738
$$ -288791 -266351 -177659 -92795 -27575 337154 196405 103958 -245445 225770 -133738
10018d9777m58091A5744c03580h4937k01171a03354o9800J9862j43664B6579e9672
$$ -49777 -507868 15744 -303580 -84937 -286108 -103354 -173154 -153292 -296956 26579 -59672
10006h6153b8864m6862m4245I3817c17852D2009O0731d31957f2752G2897d45363
$$ -86153 -28864 -75726 -119971 93817 -317852 42009 102740 -431957 -62752 72897 -445363
9994c4978a6186C99358A80204K5982a25234F7028h7183A39138a69421g0041k46165
$$ -34978 -16186 399358 180204 206186 -125234 67028 -87183 139138 -169421 -70041 -316206
9983c16206h0903r9770e7864C07754b73800E7043d688H8964P8390A3140b7488
$$ -316206 -80903 -180673 -57864 307754 -273800 57043 -4688 88964 167354 13140 -27488
9971b22794A6353a61657I6950P6952a07883m06726d1084B2063d4600E4416a08856
$$ -222794 16353 -161657 96950 173902 -107883 -514609 -41084 22063 -44600 54416 -108856
9959a37990k0703j0480O4592n193A05223d9550j5073J9659k3437n4799f0355j43809
$$ -137990 -158693 -169173 -104581 -109774 105223 -49550 -64623 -44964 -68401 -123200 -60355 -204164
9947b04164C7317c94209A7016e3288K2572D127N68a29004R16B72407E3764A4172
$$ -204164 37317 -394209 17016 -53288 -30716 4127 4695 -129004 -128088 272407 53764 14172
9934b45290a4716k07767i4925l1551B26296b76059J29250b4086F79132a36095
$$ -245290 -14716 -222483 -94925 -126476 226296 -276059 -146809 -24086 679132 -136095
9923f6256C00498c15990l7251j591C12055c4947A88175A8176R2515b40502d0093
$$ -66256 300498 -315990 -353241 -354832 312055 -34947 188175 18176 110691 -240502 -40093
9911A607c95311D232a11477G6819c19588R9904I6251k4429J19957d6679j84615
$$ 1607 -395311 4232 -111477 76819 -319588 -219684 96251 71822 191779 -46679 -231294
9900b31294F2152e0107k05185a5843A47002J46535I4386d0175l46638B6574i2003
$$ -231294 62152 -50107 -255292 -15843 147002 293537 94386 -40175 -386813 26574 -92003
9888b32404a08336J0302E7334P6480a89909A62333n7855K2606m243L9222f3952
$$ -232404 -108336 -98034 57334 133814 -189909 162333 104478 127084 122841 162063 -63952
9876C24075N0347a94361D9077d34484b05045B32131b03955j48645A79156d7162
$$ 324075 374422 -194361 49077 -434484 -205045 232131 -203955 -352600 179156 -47162
9865a8949k68341B3631O0632b6536j09108l9353O5009b8436m2678J5292k30063
$$ -18949 -287290 23631 84263 -26536 -135644 -174997 -109988 -28436 -71114 -55822 -285885
9854b85885A13277d61463J74757i2895o6982N1511K5489j0614l446A56447a90578
$$ -285885 113277 -461463 -286706 -92895 -159877 -108366 -82877 -93491 -96937 156447 -190578
9842c0274l66158B58225A6921J55584b23657k09818E2612b47063p8836O1281e5712
$$ -30274 -396432 258225 16921 172505 -223657 -433475 52612 -247063 -325899 -264618 -55712
9830b36958f5790B28009f906I2975a78608K3676j25418B45411c4581C5738c62093
$$ -236958 -65790 228009 -6906 92975 -178608 -154932 -280350 245411 -34581 35738 -362093
9818f6929A20546a77667B8052K14585m4540i0298k57051A72382a29181j91298
$$ -66929 120546 -177667 28052 242637 198097 -90298 -347349 172382 -129181 -320479
9808c20479I8605c28183h7154B14460g7120D3620c19121i5654C05915h2878j74007
$$ -320479 98605 -328183 -87154 214460 -77120 43620 -319121 -95654 305915 -82878 -256885
9797b56885R9698k1416A9245J24508d31090g7403e033n2674B46136c48187J64081
$$ -256885 -157187 -178603 19245 143753 -431090 -77403 -5033 -57707 246136 -348187 -184106
9786a84106k7494L3433B88048F8181L5878e7810j1033F114a37355j49758C04659
$$ -184106 -211600 -178167 288048 68181 104059 -57810 -68843 6114 -137355 -287113 304659
9774C1467a88548L2933g7639j61823B3194a10540j13148m2173J14200d9229k6521
$$ 31467 -188548 -155615 -77639 -239462 23194 -110540 -223688 -265861 -151661 -49229 -75750
9763g5750J4039k27638A25082D6445J8618a2160l9652m0516m3823j9295M6742
$$ -75750 -61711 -289349 125082 46445 65063 -12160 -51812 -92328 -136151 -155446 -108704
9752a08704j10535A88464I0284N6252i6003A12165g9028j70776E2555j1121M856
$$ -108704 -219239 188464 90284 146536 -96003 112165 -79028 -249804 52555 41434 46290
9741D6290J2507J79611h4383E500J65871G0422J29607a12933m1905m156J3491
$$ 46290 58797 238408 -84383 5500 171371 70422 200029 -112933 -154838 -158994 -145503
9730a45503O610k5318h0107A81842n071g4889k48883l428g5870D0141a33679F8118
$$ -145503 -138893 -164211 -80107 181842 176771 -74889 -323772 -327200 -75870 40141 -133679 68118
9717I2649J4115c3768m81894h0557G9818N7458a69729e2617j70133J1846G2093
$$ 92649 106764 -33768 -515662 -80557 79818 137276 -169729 -52617 -222750 -210904 72093
9705g8848k03733F6331a55233A20199b1640A7013a71344g8307j11635A0414c28160
$$ -78848 -282581 66331 -155233 120199 -21640 17013 -171344 -78307 -189942 10414 -328160
9693h4201a850k0355m61208a29086M878G2a17428b6810C3097a88932i0310k29187
$$ -84201 -1850 -22205 -483413 -129086 -124208 72 -117428 -26810 33097 -188932 -90310 -319497
9681c19497c5668l17049P6320p5630C3679b9237p4109p4465I7060k2398A5430
$$ -319497 -35668 -352717 -276397 -352027 33679 -29237 -103346 -177811 97060 74662 15430
9669a78321F0641c48976H167b47852l0387c2430A64466a43865e509n3323j71828
$$ -178321 60641 -348976 8167 -247852 -278239 -32430 164466 -143865 -5509 -58832 -230660
9658b30660B9175O2682f4268k84430A28759a35036A68333D0635b64254F3736a04851
$$ -230660 29175 91857 -64268 -348698 128759 -135036 168333 40635 -264254 63736 -104851
9646A26840i9005B73946b60702N0194o5840f5099j08871A6276J33146b22706C2589
$$ 126840 -99005 273946 -260702 -210508 -276348 -65099 -173970 16276 149422 -222706 32589
9634d01405a69894K4669r5875A12802c1396j08948b4876A39795O4503b65581H8286
$$ -401405 -169894 -145225 -241100 112802 -31396 -140344 -24876 139795 204298 -265581 88286
9622a66741N835N9995j41050O488N8713h5491A86449q98a16503A07506k1228a27480
$$ -166741 -160906 -100911 -241961 -235473 -176760 -85491 186449 185551 -116503 107506 86278 -127480
9609E3988j1469b23417c7880k43377I4983Q3485q6932a43184j19A69057E0245
$$ 53988 42519 -223417 -37880 -281257 94983 178468 91536 -143184 -143303 169057 50245
9597b6123q331B3663c641j44367B50239B2756a02043c0369b430G6620R3790A8341
$$ -26123 -34454 23663 -3641 -148008 250239 22756 -102043 -30369 -2430 76620 170410 18341
9584e10713J81165B14932c3656c01k09057c2261F3356b20083a1544E5370j3790
$$ -510713 -329548 214932 -33656 -301 -209358 -32261 63356 -220083 -11544 55370 41580
9573D1580b00359G9569A8582b18892i8942A2029L3130K35775b47217J08443f6899
$$ 41580 -200359 79569 18582 -218892 -98942 12029 45159 280934 -247217 -138774 -66899
9561I4608Q7325E1502j4922b68944A45389a77039h2177L0698j37720E6538b00660
$$ 94608 181933 51502 36580 -268944 145389 -177039 -82177 -51479 -189199 56538 -200660
9549H440N1309A2276O6043M8379P967c33735F7302J85317e0753E1862K08326c64671
$$ 8440 59749 12276 78319 126698 134665 -333735 67302 252619 -50753 51862 260188 -364671
9536H1174b96581C8666J20786K05781a57991l6100E510a84675I4632a11539B70254
$$ 81174 -296581 38666 159452 365233 -157991 -194091 5510 -184675 94632 -111539 270254
9524A72654k9739C1137a60406J7782O3590A94002k0692a19778B06279c8847k1547
$$ 172654 142915 31137 -160406 -142624 -79034 194002 173310 -119778 206279 -38847 -60394
9513f0394k20548H2926b39896F8818h1777o9967k7038B3103P3292k636c2063j61535
$$ -60394 -280942 82926 -239896 68818 -81777 -151744 -178782 23103 96395 93759 -32063 -193598
9501a93598J5090H6107a9472H6723M0531a02313p0670k03650B39250a38026A9552
$$ -193598 -178508 86107 -19472 86723 127254 -102313 -172983 -376633 239250 -138026 19552
9489b48951E8123c52546R2574A81295a5547C8280b29281g3374A4876L827f0117
$$ -248951 58123 -352546 -259972 181295 -15547 38280 -229281 -73374 14876 18703 -60117
9477B17139a0635D18744A6866c69394Q3544L2348G2375b55865B58027a03841r3147
$$ 217139 -10635 418744 16866 -369394 -285850 -253502 72375 -255865 258027 -103841 -196988
9466a96988m0489L3181C0299q219a40446M8361A0564f6922k9635A08051A1244
$$ -196988 -237477 -204296 30299 22080 -140446 -92085 10564 -66922 -96557 108051 11244
9454b62909f0918l17645e4074k8835k59310A24230P8808b58192j18355c4982A6464
$$ -262909 -60918 -378563 -54074 -82909 -342219 124230 203038 -258192 -376547 -34982 16464
9442a23861B44090e2626A50701J63171b6612h820j00790D60480E7392L5713B638
$$ -123861 244090 -52626 150701 313872 -26612 -8820 -109610 460480 57392 93105 2638
9430A15736b89445a20424C07477a43496c4283A13057c406l39763h8002q8193j43826
$$ 115736 -289445 -120424 307477 -143496 -34283 113057 -3406 -343169 -88002 -176195 -320021
9419c20021b6738q4025K3555j64657f9667C0535a07512A64718Q1064l6696g8222
$$ -320021 -26738 -110763 -87208 -251865 -69667 30535 -107512 164718 245782 209086 -78222
9407a49208a2235A76065p6713K59287c74539A00206c3303j86258J3001H4489J0706
$$ -149208 -12235 176065 99352 358639 -374539 100206 -33303 -219561 -206560 84489 95195
9396I5195b66594P0527j93020J60797r1490H9429J29595b527m1130B3364J6098
$$ 95195 -266594 -196067 -389087 -228290 -319780 89429 219024 -2527 -43657 23364 39462
9385C9462h746k79488A55492a51701B45085g6890C23084f160j01705A92876g1651
$$ 39462 -8746 -288234 155492 -151701 245085 -76890 323084 -6160 -107865 192876 -71651
9373g4452Q443C1063b76100h2844A0916J0720i0065M1709a6824j9442B3662P1283
$$ -74452 -66009 31063 -276100 -82844 10916 21636 -90065 -48356 -16824 -36266 23662 94945
9361I4945b37030A08838a56223a9518j8139A15501b02145A66703F0763c00985
$$ 94945 -237030 108838 -156223 -19518 -37657 115501 -202145 166703 60763 -300985
9350B65564F6354N5578c46214h6063B71142j16533f0439l00693A54709b31175
$$ 265564 66354 121932 -346214 -86063 271142 154609 -60439 -361132 154709 -231175
9339c7301j57174d6513k04661K6955A23114c51692a11859o0554D9602f388n4833
$$ -37301 -194475 -46513 -251174 -224219 123114 -351692 -111859 -172413 49602 -6388 -61221
9328f1221B24143I3122i4538B08044f8755B00794I6319L2304i0766P283C941b3287
$$ -61221 224143 93122 -94538 208044 -68755 200794 96319 128623 -90766 -83483 3941 -23287
9315I4481h7804p9717B18252c16477a23950l19902c2205C7479c36745F9793A5856
$$ 94481 -87804 -167521 218252 -316477 -123950 -443852 -32205 37479 -336745 69793 15856
9303F1299a77247j56778d4830k65775j54780g124j4101D9220b33903p5811F1129
$$ 61299 -177247 -334025 -44830 -310605 -465385 -7124 -21225 49220 -233903 -309714 61129
9291H4174b18696c4106k02241a5720r9969J3163L860n7700K4056d3926j55224
$$ 84174 -218696 -34106 -236347 -15720 -115689 -102526 -98666 -156366 -132310 -43926 -199150
9280a99150a0901C2947a02827e0202o2729B31736a42799c4196m3027q23j39892
$$ -199150 -10901 32947 -102827 -50202 -112931 231736 -142799 -34196 -77223 -78046 -217938
9269b17938A44385G0157J66836a07807M4072p457j89827m8171I4929p169a03315
$$ -217938 144385 70157 236993 -107807 -63735 -71192 -261019 -309190 94929 87760 -103315
9257C5794J1495R4825a48885f3184A3080b4793o6604L884A21265a21070L7949
$$ 35794 47289 142114 -148885 -63184 13080 -24793 -91397 -87513 121265 -121070 -83121
9246h3121K464E5913c68606K2523I5400N1111M9135c46690A35760j4466a88398
$$ -83121 -80657 55913 -368606 -346083 95400 146511 195646 -346690 135760 121294 -188398
9234A06827K67497A18244a93197F1098A3744L89420a89562B173a54401d4957g582
$$ 106827 374324 118244 -193197 61098 13744 403164 -189562 2173 -154401 -44957 -7582
9222a98366k44422b07676H9679B4226E582i5277a1795j78361C03746b37283i4734
$$ -198366 -442788 -207676 89679 24226 5582 -95277 -11795 -190156 303746 -237283 -94734
9210c01375A73919b22347l7151A83967e2886k31067C7390b63687J08034j7304
$$ -301375 173919 -222347 -259498 183967 -52886 -283953 37390 -263687 -155653 -172957
9200a72957C4646a6462C408J04410b54214c6438A12684C4677f0388j10977g700
$$ -172957 34646 -16462 3408 107818 -254214 -36438 112684 34677 -60388 -171365 -7700
9188A12063c11247E1716e14784a85114g2826B31688a45530C96178A5028J8503
$$ 112063 -311247 51716 -514784 -185114 -72826 231688 -145530 396178 15028 33531
9178C3531J67942a96470O9920G2882B142b64236A41104a12430M5415A70273J5706
$$ 33531 201473 -196470 -126550 72882 2142 -264236 141104 -112430 -67015 170273 185979
9167A85979C0840a64337a2960k87186C4848c07804R9786A06571a52528p6268F5647
$$ 185979 30840 -164337 -12960 -300146 34848 -307804 -208018 106571 -152528 -228796 65647
9155A28721c41923a01195E8858d09750e3881k05782J22996A69539a03193K231
$$ 128721 -341923 -101195 58858 -409750 -53881 -259663 -136667 169539 -103193 -100962
9145a00962g20j91120m2190A85617F8475J98850j23066o0899A7418J4856K8136
$$ -100962 -720 -191840 -234030 185617 68475 267325 144259 83360 17418 32274 60410
9134F0410L7078b87819K3083I1039m0429O3155J8828b95992J03007l3773j70727
$$ 60410 97488 -287819 -264736 91039 50610 113765 132593 -295992 -192985 -226758 -397485
9123c97485A48437E0442j8060K83901A1009O4235K66234j21975A04082a0877k87411
$$ -397485 148437 50442 32382 316283 11009 75244 341478 219503 104082 -10877 -298288
9112b98288j13083B94320j26923B9993a34205j9599j07393B21070a31547A05694
$$ -298288 -411371 294320 167397 29993 -134205 -153804 -261197 221070 -131547 105694
9101a65122B01776A1825O6084a36168A88759c70687A59954a580B12142f4007A60312
$$ -165122 201776 11825 77909 -136168 188759 -370687 159954 -1580 212142 -64007 160312
9089a10950j589B97190b08415A78669m2790b4177j7896j23601B84362g6377j16198
$$ -110950 -112539 297190 -208415 178669 135879 -24177 -42073 -165674 284362 -76377 -192575
9078a92575c7197j42489f9436j8222A46238J97416g9124C18655A50037a7994r3302
$$ -192575 -37197 -179686 -69436 -87658 146238 343654 -79124 318655 150037 -17994 -111296
9067a11296a5512A6013a52302k70246B22137D9029J14095f4323J7334k8330l4898
$$ -111296 -15512 16013 -152302 -422548 222137 49029 163124 -64323 -46989 -75319 -110217
9056a10217H8159A3982d0678j06249q7m793A98289c83288a85709P4037k0048j13345
$$ -110217 88159 13982 -40678 -146927 -147014 -151807 198289 -383288 -185709 -111672 -131720 -245065
9044b45065d0592j9118B56762G7682g8035l98539J02373c6931D9658a35339l01973
$$ -245065 -40592 -59710 256762 77682 -78035 -476574 -374201 -36931 49658 -135339 -437312
9033d37312D6038b90228B15983h8253j33121B62245i9291L2255j65753j18719
$$ -437312 46038 -290228 215983 -88253 -221374 262245 -99291 -67036 -232789 -351508
9023c51508b1252m6764A63094L2961f7764l59114E4108A575J16162c99181J91609
$$ -351508 -21252 -68016 163094 196055 -67764 -426878 54108 1575 117737 -399181 -207572
9012b07572j8548A00642b89091a02859c7578a5499m2838o2219A11426j224J20620
$$ -207572 -226120 100642 -289091 -102859 -37578 -15499 -58337 -120556 111426 110202 230822
9001B30822c676j15019p7232c6145r2523J7762l9593O8387j05533k42906a66130
$$ 230822 -3676 -118695 -195927 -36145 -128668 -110906 -150499 -82112 -187645 -430551 -166130
8989d12189J32585B64688C3825b50724A7877f6319p1155b6212j27951j3267O4600
$$ -412189 -279604 264688 33825 -250724 17877 -66319 -137474 -26212 -154163 -167430 -102830
8978a02830M8181k736l6035o6509c1050o06A15197J82706b22703C68857A039b82972
$$ -102830 -54649 -57385 -93420 -159929 -31050 -31656 115197 297903 -222703 368857 1039 -282972
8965c73130a68884k2176d6561J743k27333A02708K1007a33065O2181b993j91928
$$ -373130 -168884 -191060 -46561 -44818 -272151 102708 123715 -133065 -70884 -2993 -194921
8954a94921r5918J26401K7224B31407E1868i916k47700d4376j16932B1789J90344
$$ -194921 -290839 -164438 -137214 231407 51868 -9916 -257616 -44376 -161308 21789 212133
8943B12133h8388L493c2645B21551K03154k03719o1839N431K90802j03099a16550
$$ 212133 -88388 -84895 -32645 221551 424705 220986 159147 164578 455380 352281 -116550
8931b83944J9566L4816A1225L25821a13464D86002J49811J02752R31066M338524
$$ -283944 -264378 -229562 11225 337046 -113464 486002 635813 738565 1669631 6008155
8921F008155J4548381F865577B112282G93824j20635l18161J15597A34879c1316
$$ 6008155 20556536 6865577 2112282 793824 673189 355028 470625 134879 -31316
8911A61744C2767M2632e2133D73603j31615A34491A3704J16973d04753f1974A19934
$$ 161744 32767 75399 -52133 473603 341988 134491 13704 130677 -404753 -61974 119934
8899a96543B51578A8281c78080a37251j60121g0582l595L4423p8618E3413C179
$$ -196543 251578 18281 -378080 -137251 -297372 -70582 -74177 -39754 -118372 53413 3179
8887a48577j07728J24397A15352R342Q6517a74564E1307c24348A92344f2862k84042
$$ -148577 -256305 -131908 115352 124694 211211 -174564 51307 -324348 192344 -62862 -346904
8876c46904J51371Q4809A40537P0907d160l61825C5409f151A21093c04389C59824
$$ -346904 -195533 -110724 140537 211444 -4160 -365985 35409 -6151 121093 -304389 359824
$$ [...]
##END NTUPLES=NMR SPECTRUM
##END=
