
##TITLE=UV1260_M11_1332-1242_50_7409847_uzryWZN9Gb
##JCAMPDX= 6.0         $$ Bruker NMR JCAMP-DX V2.0
##DATA TYPE= NMR SPECTRUM
##DATA CLASS= NTUPLES
##ORIGIN= BRUKER
##OWNER= Administrator
$$ 1.72 TOPSPIN		Version 2.1
$$ 2013-01-25 00:06:46.273 -0500  Administrator@X
$$ Compression mode = diff/dup
##.OBSERVE FREQUENCY= 400.02188249412
##.OBSERVE NUCLEUS= ^1H
##.ACQUISITION MODE= SIMULTANEOUS (DQD)
##.ACQUISITION SCHEME= undefined
##.AVERAGES= 8
##.DIGITISER RES= 22
##SPECTROMETER/DATA SYSTEM= spect
##.PULSE SEQUENCE= zg30
##.SOLVENT NAME= COFFEE_meoh
##.SHIFT REFERENCE= INTERNAL, COFFEE_meoh, 1, 14.98509
##AUDIT TRAIL= $$ (NUMBER, WHEN, WHO, WHERE, PROCESS, VERSION, WHAT)
$$ ##TITLE= Audit trail, TOPSPIN		Version 2.1
$$ ##JCAMPDX= 5.01
$$ ##ORIGIN= Bruker BioSpin GmbH
$$ ##OWNER= Administrator
$$ $$ E:\/data/COFFEE/nmr/UV1260_M11_1332-1242_50_7409847_uzryWZN9Gb/10/pdata/1/auditp.txt
$$ ##AUDIT TRAIL=  $$ (NUMBER, WHEN, WHO, WHERE, PROCESS, VERSION, WHAT)
(   1,<2013-01-25 00:06:38.116 -0500>,<Administrator>,<X>,<go>,<TOPSPIN 2.1>,
      <created by zg
	started at 2013-01-25 00:05:32.132 -0500,
	POWCHK enabled, PULCHK disabled,
       configuration hash MD5:
       86 BA 57 50 F2 9D 5C 9B 26 00 A9 28 5F 66 2E 89
       data hash MD5: 64K
       03 1A DB 15 3B 80 23 FB 62 D9 AE 0E 1E 27 28 E1>)
(   2,<2013-01-25 00:06:41.179 -0500>,<Administrator>,<X>,<proc1d>,<TOPSPIN 2.1>,
      <Start of raw data processing
       efp LB = 0 FT_mod = 6 PKNL = 1 PHC0 = 0 PHC1 = 0 SI = 32K 
       data hash MD5: 32K
       A1 4C 71 E0 31 62 87 BB 66 BD 08 6B 74 73 DC 58>)
(   3,<2013-01-25 00:06:41.648 -0500>,<Administrator>,<X>,<proc1d>,<TOPSPIN 2.1>,
      <pk PHC0 = 100.6952 PHC1 = 0 
       data hash MD5: 32K
       BF 00 A1 EF BC BB 1E 2A 3B A9 7A E0 59 5E C4 59>)
(   4,<2013-01-25 00:06:41.898 -0500>,<Administrator>,<X>,<proc1d>,<TOPSPIN 2.1>,
      <abs ABSG = 1 
       data hash MD5: 32K
       E9 F5 95 B7 83 4B 12 A8 B2 4D 03 B3 06 56 3D B2>)
(   5,<2013-01-25 00:06:42.038 -0500>,<Administrator>,<X>,<proc1d>,<TOPSPIN 2.1>,
      <abs ABSG = 2 
       data hash MD5: 32K
       0E DF DA AD 6E 2A 00 7B 43 A8 31 09 35 1E 8C 8C>)
(   6,<2013-01-25 00:06:42.179 -0500>,<Administrator>,<X>,<proc1d>,<TOPSPIN 2.1>,
      <abs ABSG = 3 
       data hash MD5: 32K
       9A 73 98 2E 08 3A D6 68 7C CF 8B C2 C2 87 9C 46>)
(   7,<2013-01-25 00:06:42.319 -0500>,<Administrator>,<X>,<proc1d>,<TOPSPIN 2.1>,
      <abs ABSG = 4 
       data hash MD5: 32K
       CF CD 49 F1 44 4B 2E BA FF 85 37 C6 C8 09 D3 4F>)
(   8,<2013-01-25 00:06:42.476 -0500>,<Administrator>,<X>,<proc1d>,<TOPSPIN 2.1>,
      <abs ABSG = 5 
       data hash MD5: 32K
       E1 25 A9 5B 1D B0 32 C1 C8 77 09 E7 15 E9 87 CA>)
$$ ##END=
$$ 
$$ $$ hash MD5
$$ $$ C3 86 A5 DD FC B4 9D E9 98 9C 2B 6F D9 8A 22 84
##$RELAX= 
##$RELAX= 
##$RELAX= 
##$RELAX= 
##$RELAX= 
##$RELAX= 
##$RELAX= 
$$ Bruker specific parameters
$$ --------------------------
##$DU= <E:\>
##$EXPNO= 10
$$ [...]
150 150 150 150 150 150 150 150
##$TP07= 0
##$TPNAME0= <>
##$TPNAME1= <>
##$TPNAME2= <>
##$TPNAME3= <>
##$TPNAME4= <>
##$TPNAME5= <>
##$TPNAME6= <>
##$TPNAME7= <>
##$TPOAL= (0..7)
0.5 0.5 0.5 0.5 0.5 0.5 0.5 0.5
##$TPOFFS= (0..7)
0 0 0 0 0 0 0 0
##$TUNHIN= 0
##$TUNHOUT= 0
##$TUNXOUT= 0
##$USERA1= <user>
##$USERA2= <user>
##$USERA3= <user>
##$USERA4= <user>
##$USERA5= <user>
##$V9= 5
##$VALIST= <valist>
##$VCLIST= <CCCCCCCCCCCCCCC>
##$VD= 0
##$VDLIST= <DDDDDDDDDDDDDDD>
##$VPLIST= <PPPPPPPPPPPPPPP>
##$VTLIST= <TTTTTTTTTTTTTTT>
##$WBST= 1024
##$WBSW= 4
##$XGAIN= (0..3)
0 0 0 0
##$XL= 0
##$YL= 0
##$YMAX_a= 688468
##$YMIN_a= -588125
##$ZGOPTNS= <>
##$ZL1= 120
##$ZL2= 120
##$ZL3= 120
##$ZL4= 120
##$ABSF1= 14.98509
##$ABSF2= -5.573092
##$ABSG= 5
##$ABSL= 3
##$ALPHA= 0
##$AQORDER= 0
##$ASSFAC= 0
##$ASSFACI= 0
##$ASSFACX= 0
##$ASSWID= 0
##$AUNMP= <proc_prof1d_extract_pilot.lims>
##$AXLEFT= 0
##$AXNAME= <>
##$AXNUC= <1H>
##$AXRIGHT= 0
##$AXTYPE= 0
##$AXUNIT= <>
##$AZFE= 0.1
##$AZFW= 0.1
##$BCFW= 0
##$BC_mod= 0
##$BYTORDP= 0
##$COROFFS= 0
##$CY= 15
##$DATMOD= 1
##$DC= 0
##$DFILT= <>
##$DTYPP= 0
##$F1P= 0
##$F2P= 0
##$FCOR= 0.5
##$FTSIZE= 32768
##$FT_mod= 6
##$GAMMA= 0
##$GB= 0
##$INTBC= 1
##$INTSCL= 1
##$ISEN= 128
##$LB= 0
##$LEV0= 0
##$LPBIN= 0
##$MAXI= 10000
##$MC2= 0
##$MEAN= 0
##$ME_mod= 0
##$MI= 0
##$NCOEF= 0
##$NC_proc= -8
##$NLEV= 6
##$NOISF1= 0
##$NOISF2= 0
##$NSP= 0
##$NTH_PI= 0
##$NZP= 0
##$OFFSET= 14.98509
##$PC= 1
##$PHC0= 100.6952
##$PHC1= 0
##$PH_mod= 1
##$PKNL= yes
##$PPARMOD= 0
##$PPDIAG= 0
##$PPIPTYP= 0
##$PPMPNUM= 2147483647
##$PPRESOL= 1
##$PSCAL= 4
##$PSIGN= 0
##$PYNMP= <proc.py>
##$REVERSE= no
##$SF= 400.02
##$SI= 32768
##$SIGF1= 0
##$SIGF2= 0
##$SINO= 400
##$SIOLD= 32768
##$SPECTYP= <>
##$SREGLST= <1H.CDCl3>
##$SSB= 0
##$STSI= 32768
##$STSR= 0
##$SW_p= 8223.68421052631
##$SYMM= 0
##$S_DEV= 0
##$TDeff= 65536
##$TDoff= 0
##$TI= <>
##$TILT= no
##$TM1= 0
##$TM2= 0
##$TOPLEV= 0
##$USERP1= <user>
##$USERP2= <user>
##$USERP3= <user>
##$USERP4= <user>
##$USERP5= <user>
##$WDW= 1
##$XDIM= 32768
##$YMAX_p= 474644973
##$YMIN_p= -669478
##$CURPLOT= <Network HP LaserJet P1505>
##$CURPRIN= <$Network HP LaserJet P1505>
##$DFORMAT= <normdp>
##$LAYOUT= <+/1D_H.xwp>
##$LFORMAT= <normlp>
##$PFORMAT= <normpl>
##$SURQMSG= 1
$$ End of Bruker specific parameters
$$ ---------------------------------
##NTUPLES= NMR SPECTRUM
##VAR_NAME=  FREQUENCY,     SPECTRUM/REAL,   SPECTRUM/IMAG
##SYMBOL=    X,             R,               I
##VAR_TYPE=  INDEPENDENT,   DEPENDENT,       DEPENDENT
##VAR_FORM=  AFFN,          ASDF,            ASDF
##VAR_DIM=   32768,         32768,           32768
##UNITS=     HZ,            ARBITRARY UNITS, ARBITRARY UNITS
##FACTOR=    0.250966925370066, 1,           1
##FIRST=     8223.43324360094, -74582,       -177614
##LAST=      0,             59455,           162459
##MIN=       0,             -669478,         0
##MAX=       8223.43324360094, 474644973,    0
$$ Real data points
##PAGE= N=1
##DATA TABLE= (X++(R..R)), XYDATA
$$ [...]
19534a67839h3679r9788j65485h4754A45976j1426a46305j86111C5546j4004J18450
19523A39992c4368o1953j53897B04110b25115E6536b3871j67565E7070b16162
19512B20322a34225b9879H7580a93942b2973r9084I9390g5490H6570b16k78324
19501b78540a35669c8494r0489k4440A328a95117E3324M06295A33616f9075A14292
19489b27532Q5431d0054j98860A04743c62101a36072e3424k8227D8687I205b56779
19477B86892A3665b37368I0381b41590f3962K3238o1822A80533q4746R1957e0243
19465D9096J02590D3917M8775c86402J26209A46127a30356L8535E85J97280C4110
19453b48344A40462e36052B38154a38957D3058A8832J27353b11612R1648A19134
$$ y = [-167839, -83679, -183467, -348952, -84754, 145976, 134550, -146305, -332416, 35546, 21542, 139992, -34368, -96321, -250218, 204110, -225115, 56536, -23871, -191436, 57070, -216162, 220322, -134225, -29879, 87580, -193942, -22973, -122057, 99390, -75490, 86570, -216, -278540, -135669, -38494, -128983, -153423, 1328, -195117, 53324, 459619, 133616, -69075, 114292, -227532, -142101, -40054, -238914, 104743, -362101, -136072, -53424, -81651, 48687, 9205, -256779, 286892, 13665, -237368, 90381, -241590, -63962, -40724, -102546, 180533, 95787, 187744, -50243, 49096, 151686, 43917, 92692, -386402, -260193, 146127, -130356, -91821, 585, 197865, 34110, -248344, 140462, -536052, 238154, -138957, 43058, 18832, 146185, -211612, -119964, 119134]
19442A6985C409a48135C7998c25889E2157a82387A56801E2747d45514I9407a1382
19430b54134G8960c29305m9658A06940i9277k7790p9567q4695h21l08856L2357
19419b77320A82316C5327P5653J28880a6199k52791D2376f0195k18031a06412
19408G756a86291A44140a31906C23905G2789b98895A58988C3137a5993l4180D264
19396e51761A13050a15407R585F6182b2700A67803a20885k39688e1698k77981
19386c29679Q7085j5921a05281p10F9753L6425h9802n0886D5857L3495a63272
19374E4425c15789H0407J00564I0371J21882h9541l74442a95990E6194f6031j07353
19363a73384A765R3117b40563a15376A63196B163e26748a42845A13133a53164
$$ y = [16985, 3409, -148135, 37998, -325889, 52157, -182387, 156801, 52747, -445514, 99407, -11382, -254134, 78960, -329305, -378963, 106940, -99277, -127067, -206634, -291329, -821, -309677, -277320, 182316, 35327, 110980, 239860, -16199, -268990, 42376, -60195, -278226, -106412, 7756, -186291, 144140, -131906, 323905, 72789, -298895, 158988, 33137, -15993, -50173, 4264, -551761, 113050, -115407, -105822, 66182, -22700, 167803, -120885, -360573, -51698, -329679, -242594, -258515, -105281, -105991, 69753, 106178, -89802, -140688, 45857, 79352, -163272, 54425, -315789, 80407, 180971, 90371, 212253, -89541, -463983, -195990, 56194, -66031, -173384, 1765, 94882, -240563, -115376, 163196, 2163, -526748, -142845, 113133, -153164]
19352b87481F9461e8341C30420c0786A76679J81069b94662J44158J5970O1689
19342g2845j30686B66432J99140b68848N0837c351j35965a3803F9660C0593e1197
19330d0520B2131a7496G2656k4902a07020A9651g9727n5622k38421a80840H0303
19318b07642b0657A43216K93126b25908B41575a88797A28823a20334j26787k15663
19308d62784K01577D42N760b93365A45796f2269B2174K86791F6597J4962J5569
19297I7128m7350a23512A34102a25523j23461A46074a07987D7256d82828N7935
19287d24893P1203C8572a51574B86894p6204G1997d5427A71479H5277b21605O755
19276b14850M6950F0580J81543f9838c0669J3572F722b80989e0440G0612g22k87222
$$ y = [-287481, 69461, -58341, 330420, -30786, 176679, 357748, -294662, -150504, -134534, -72845, -203531, 266432, 465572, -268848, -218011, -3351, -139316, -13803, 69660, 30593, -51197, -40520, 22131, -17496, 72656, 47754, -107020, 19651, -79727, -135349, -373770, -180840, 80303, -207642, -20657, 143216, 436342, -225908, 241575, -188797, 128823, -120334, -247121, -462784, -261207, 442, 6202, -293365, 145796, -62269, 22174, 308965, 66597, 81559, 97128, 49778, -123512, 134102, -125523, -248984, 146074, -107987, 47256, -482828, -424893, -353690, 38572, -151574, 286894, 210690, 71997, -45427, 171479, 85277, -221605, -214850, -167900, 60580, 242123, -69838, -30669, -17097, 6722, -280989, -50440, 70612, -722, -287944]
19264b87944i076k29254g9249k00246A47720l7278C2260P8519d627j04977q9391
19253a98995I939a28486q7260B58623a42856F8659J79538b35931h8149k28665
19243c16814f8411j65710l1735Q6608r7049A86946c59070h8851A43255D7599L7634
19232H5233K41567A06973d224l14784B2825a8446H8696B3249K7044c70272a74729
19220F6989b51388F8079c44323a991k26080c3033H3347Q1067d4925A62350i5928
19208B15065a70857N2674A84638c47193C09515j31598a61363k53454I5876c65943
19197b37288B41378a93674B58679i7219j122h524G2204Q2369C4494a41639j28854
19186b70493L1207C7513M7371h7419r5178E7919c13122j33517J79071G9122g6069
$$ y = [-287944, -9076, -238330, -79249, -279495, 147720, 110442, 32260, 110779, -4627, -109604, -198995, 9939, -128486, -215746, 258623, -142856, 68659, 248197, -235931, -88149, -316814, -68411, -234121, -265856, -179248, -276297, 186946, -359070, -88851, 143255, 47599, 85233, 326800, 106973, -4224, -319008, 22825, -18446, 88696, 23249, 50293, -370272, -174729, 66989, -251388, 68079, -344323, -1991, -228071, -33033, 83347, 164414, -44925, 162350, -95928, 215065, -170857, -118183, 184638, -347193, 309515, 177917, -161363, -414817, 95876, -365943, -237288, 241378, -193674, 258679, -97219, -98341, -8524, 72204, 154573, 34494, -141639, -270493, -239286, 37513, 84884, -87419, -182597, 57919, -313122, -446639, -267568, 79122, -76069]
19174a82910j45762J51731g5938a3055o8941l4788j14552D7526e03124h9689k50537
19163c40226g1902j09106j82882A09089L1720f2730F8216g9074B28652j2767a46043
19151d6104i592j2262C05724a43109n4055A03742h7358B20094O8319j25126J5670
19140A78957G0390A8945L82687a69835k38051g5732F9340L9920K63983E5859a80681
19128a44964B35728e0674J9434A14336C3595K82988h8983K9289k23751J29559
19118a53886f8952n2768d5927k35142J5567G1042J65471B8320J56125a85207E3504
19106a03836j99263A92935I0385H962g5591C8154a53175j1904B30193D4445J34310
19095A78755J9216d08926e3384q7273M896l1447E14L8256m398J24331b17041c2751
$$ y = [-182910, -328672, -176941, -75938, -13055, -81996, -116784, -231336, 47526, -503124, -89689, -340226, -71902, -181008, -363890, 109089, 140809, -62730, 68216, -79074, 228652, 215885, -146043, -46104, -9592, -21854, 305724, -143109, -197164, 103742, -87358, 220094, 288413, 163287, 178957, 70390, 18945, 401632, -169835, -407886, -75732, 69340, 109260, 373243, 55859, -180681, -144964, 235728, -50674, -31240, 114336, 33595, 316583, -88983, -59694, -283445, -153886, -68952, -121720, -45927, -281069, -265502, 71042, 236513, 28320, 184445, -185207, 53504, -103836, -303099, 192935, 90385, 8962, -75591, 38154, -153175, -165079, 230193, 44445, 178755, 197971, -408926, -53384, -140657, -135761, -167208, 514, 38770, 34372, 158703, -217041, -32751]
19082b71800G9110J9756O9349K3666L2528a65204A81503c30392A27769b27945
19071I4652b9852m0003A07694a91702j41177B27029G333a38146C335b33325B40877
19059a58954K0408j64807k3214a6465A95657b36288k29499h2407A30111m1255
19049H8856e9543A85209a172p6893J6034J4129a5742j33196B8876a48895B91377
19037g1919k15029J7657d2549k41612A06053A8338K78509e1511j1802c0440j40398
19026a70838A00768a12220C06328a24987H162N0168J85151a6539k96801h3152
19015F4983h9209P743C64113D8574b05544A32362m6512K7470L32585A7434c60603
19003c1554D6549h3367B1911a5722G0553J33256J9780K8201b47639l70423F456
$$ y = [-271800, 79110, 98866, 168215, 191881, 224409, -165204, 181503, -330392, 127769, -227945, 94652, -29852, -69855, 107694, -191702, -332879, 227029, 7333, -138146, 3335, -233325, 240877, -158954, -138546, -303353, -326567, -16465, 195657, -236288, -465787, -82407, 130111, 88856, -59543, 185209, -1172, -78065, -62031, -47902, -15742, -148938, 28876, -148895, 291377, -71919, -286948, -269291, -42549, -284161, 106053, 18338, 296847, -51511, -63313, -30440, -170838, 100768, -112220, 306328, -124987, 8162, 58330, 243481, -16539, -313340, -83152, 64983, -89209, -81466, 364113, 48574, -205544, 132362, 85850, 113320, 445905, 17434, -360603, -31554, 46549, -83367, 21911, -15722, 70553, 203809, 223589, 251790, -247639, -618062, 6456]
18991b53802I3570d18352A35341e0894B9287c9101A6331d0912j46702k1734B55336
18979b3275j39746e0454A24759b05566f6625B34297a84719m0342G5514a60905
18968c37416A26000f6020F3498d19162A3705a84740j33244i475C3229d3769I5646
18956G9446B3076L78297a06213C33151e12981H0731e0300k21049A8709J7376e11413
18944b13581O6201j15129d9769l44776D0710g5025b6374C8434a08077a2834j12062
18933a24896m96572b3935F4204K6250B113L4697J41918a58949B60988m1590b51286
18921a79960j16146A16169c52938g7677B2443a62241r9494G6719a22877A27732
18910c4997j93658f0325B31673C2225i5549B65541j13988O027a68390O501A28262
$$ y = [-253802, 93570, -418352, 135341, -50894, 29287, -39101, 16331, -40912, -187614, -209348, 255336, -23275, -163021, -50454, 124759, -205566, -66625, 234297, -184719, -225061, 75514, -160905, -337416, 126000, -66020, 63498, -419162, 13705, -184740, -317984, -9475, 33229, -43769, 95646, 79446, 23076, 401373, -106213, 333151, -512981, 80731, -50300, -271349, 18709, 36085, -511413, -213581, -147380, -262509, -49769, -394545, 40710, -75025, -26374, 38434, -108077, -12834, -124896, -621468, -23935, 64204, 90454, 2113, 36810, 178728, -158949, 260988, 219398, -251286, -179960, -296106, 116169, -352938, -77677, 22443, -162241, -261735, 76719, -122877, 127732, -34997, -228655, -60325, 231673, 32225, -95549, 265541, 151553, 157580, -168390, -161889, 128262]
18898b9162E1743Q7723a98063k9320C32707I1190L2788c75204B15747b49986J20340
18887a29646b9539k21542B14950B3283a80539A82876b04100C11749d0771H6254
18876a19059B21128c4104j88130L3550p9278P56J31021m4580N0109q0178b6967
18864a32994D0607a27307k38100a2361B34730h1076a932j60325j2936A59691D1801
18852A17759m2719J5032a54740A34633a14971A29146E3953A0441a41199f9163
18841c71908a07640H5024c00401F177R0752D8393b57932A02050L4656K196b88053
18829B0301g0753k62774A12862j8274a91920c4215q8218j49742B50906J04366
18819C55272A17252a32234C0525K3209j8996Q1785a95764B04571L6799d7862A15473
$$ y = [-29162, 51743, 139466, -198063, -227383, 332707, 91190, 123978, -375204, 215747, -249986, -129646, -29539, -251081, 214950, 23283, -180539, 182876, -204100, 311749, -40771, 86254, -119059, 221128, -34104, -222234, -188684, -267962, -267206, -136185, -180765, -130656, -210834, -26967, -132994, 40607, -127307, -365407, -12361, 234730, -81076, -1932, -162257, -175193, 159691, 41801, 117759, 75040, 90072, -154740, 134633, -114971, 129146, 53953, 10441, -141199, -69163, -371908, -107640, 85024, -300401, 6177, 96929, 48393, -257932, 102050, 136706, 138902, -288053, 20301, -70753, -333527, 112862, 94588, -191920, -34215, -122433, -272175, 250906, 355272, 117252, -132234, 30525, 53734, 34738, 116523, -195764, 204571, 241370, -47862, 115473]
18807C0463M16588H9975D3020a631A23466a19074B53863Q6054c21879a1258B18537
18795b10833B04890R928E5471P1366E3441a80562A97783a0562B17531e46037H9707
18783c9258A00926l9615M3607a45091k1741A25970a41195d1608D578J60277c45628
18771C27110i7736L4721q5536a583o4541l2668D18676A21022b10519k12736c4490
18759a44776O5041o0556m35417e1167A39485f3896A15138a47298G3539a85075
18748i4982C9521g3011J9834o755o5289E4999K9590l1150e6824C8925b31673C17815
18735a21169J337k04902B01630a55575B38948c8491j24822P3211B5796J20612
18725A46408b37596G4175b6817n5169A21353P3428a55192c7686n3888A06571k5220
$$ y = [30463, 447051, 89975, 43020, -1631, 123466, -119074, 253863, 339917, -321879, -11258, 218537, -210833, 204890, 214818, 55471, 126837, 53441, -180562, 197783, -10562, 217531, -546037, 89707, -39258, 100926, 61311, 104918, -145091, -166832, 125970, -141195, -41608, 4578, 164855, -345628, 327110, -97736, -63015, -148551, -1583, -66124, -98792, 418676, 121022, -210519, -423255, -34490, -144776, -79735, -140291, -575708, -51167, 139485, -63896, 115138, -147298, 73539, -185075, -94982, 39521, -73011, -53177, -59932, -125221, 54999, 84589, 53439, -56824, 38925, -231673, 317815, -121169, -119832, -324734, 201630, -155575, 238948, -38491, -163313, -90102, 25796, 146408, -237596, 74175, -26817, -81986, 121353, 194781, -155192, -37686, -91574, 106571, 81351]
18714H1351c9623j25133g8202q5743A96736J10592A03556a51978j27153R9176
18704a79955h2088A32739a76557e1108c957A88053a99572G3178J43659a12905
18693B47856q2496b38605n5705b6903o640j35618j04598M591A07775D4393K65085
18682C09478a64987j89320h7663c3873j31993A23424e2655j71027k4203a11818
18671B31996j7531a61127j91358a29774D6248n787b28667C7287a01552A12122
18660i0389o853l75720g3432j02605A83026b93880J14350A2340a33493B7096g9542
18648a25632k09117C13357j55486a47130k20023J69540H593b38j70739L9904H0491
18636b21715e818r9461A23538J38337g9899m6912C08706E0533P0148a19326A16822
$$ y = [81351, -39623, -164756, -78202, -163945, 196736, 307328, 103556, -151978, -279131, -179955, -82088, 132739, -176557, -51108, -3957, 188053, -199572, 73178, 216837, -112905, 247856, 165360, -238605, -294310, -26903, -33543, -169161, -273759, -269168, 107775, 44393, 309478, -164987, -354307, -87663, -33873, -165866, 123424, -52655, -223682, -247885, -111818, 231996, 214465, -161127, -352485, -129774, 46248, 40461, -228667, 37287, -101552, 112122, -90389, -97242, -472962, -73432, -176037, 183026, -293880, -179530, 12340, -133493, 27096, -79542, -125632, -334749, 313357, 157871, -147130, -367153, -197613, 8593, -238, -170977, -131073, 80491, -221715, -5818, -105279, 123538, 261875, -79899, -126811, 308706, 50533, 120681, -119326, 116822]
18624D7026K64380D4614c88528J48993b4067j47539A21259k1328a40509L8575
18614a01934m25942A39174L6559c1762l9416B7781J01970f3455j8234j68153B41843
18602i7918G8216p961b32076B9893L77246i498A38486a99923A3239K4939b5391
18590A6282M66P0317a18502a0200j30629N0448A85099b73417F6221f6123G9057
18578A86837c52302a6869d919B0809a34434m2798I0238M7740b62275c2002N40
18567c1462l17369O7114A19671J73423a18122c9386a0402p9135j41268d7189E7422
18555A0954c00123I6986c5322j86573j15517a30087N3498C3558g4449A25589b41188
18543f838l01312i5383E5728b9742m6001n4124N7462D08395b82139M7918h4389
$$ y = [47026, 311406, 44614, -388528, -239535, -24067, -171606, 121259, 99931, -140509, -101934, -527876, 139174, 175733, -31762, -71178, 27781, 129751, -63455, -81689, -249842, 241843, -97918, 78216, 70255, -232076, 29893, 407139, -9498, 138486, -199923, 13239, 38178, -25391, 16282, 16748, 87065, -118502, -10200, -140829, -90381, 185099, -273417, 66221, -66123, 79057, 186837, -352302, -16869, -4919, 20809, -134434, -177232, 90238, 137978, -262275, -32002, -31462, -348831, -281717, 119671, 293094, -118122, -39386, -10402, -89537, -230805, -47189, 57422, 10954, -300123, 96986, -35322, -221895, -337412, -130087, -76589, 33558, -74449, 125589, -241188, -6838, -308150, -95383, 55728, -29742, -75743, -129867, -72405, 408395, -282139, -234221, -84389]
18531A42660a69465A7009b06514b5201j51231B38474c22744R7847F7146a22000
18520B43475I7366c41920A14689a59818a4580p3016L9589l19577B9a30162N3336
18509g6826C38306d582l29822B72511a47767A09031A8233b82400O2143j1884c6376
18497i7885b8477k03232n1345h2307l3611k75487D94421A92292B2545a9445B09130
18485H3869e1841F0158J09843a29481r4894K9253A02082J04071a35595k67907
18475d03502I4899k6182k247c169I6686a55224P5991q531G6174a67962A73936
18463B54390a3742q887F6157a51002G1873c97400f7554k50138a05432g557k41334
18452b48891G8381a00071c4404l6717k34420a05976M0473k72147g8498a6181j30438
$$ y = [142660, -169465, 17009, -206514, -25201, -176432, 238474, -322744, -224897, 67146, -122000, 243475, 97366, -341920, 114689, -159818, -14580, -87596, -48007, -367584, 29, -130162, -76826, 338306, -4582, -334404, 272511, -147767, 109031, 18233, -282400, -220257, -232141, -36376, -97885, -28477, -231709, -283054, -82307, -115918, -391405, 494421, 192292, 22545, -19445, 209130, 83869, -51841, 60158, 170001, -129481, -224375, -195122, 102082, 206153, -135595, -403502, 94899, 68717, 66470, -3169, 96686, -155224, -79233, -87764, 76174, -167962, 173936, 254390, -13742, -22629, 66157, -151002, 71873, -397400, -67554, -317692, -105432, -7557, -248891, 78381, -100071, -34404, -71121, -305541, -105976, -65503, -337650, -78498, -16181, -146619]
18441a46619A07142g8557F4814a2279k00337g0457N922C6792A7236a44262p8453
18430b22715M5202D1012j4210K8004J67422K8786j12486o4287l4823f3289A2396
18418A67032a7286n5722J4965C8546b62261O8737e7263b7842l20863C04078g0327
18406a1801H850a0760p5160m2730a8145C7271K27939e4460j78139J03379n8193
18395a87413B9935a01544C00165a327F28339D7146a30232B79250M4219A61332
18384b02923h2120o340B35992a9859j60847Q8435A15012F881M5798b01227d45
18372C4244O2982D2577b15506i5817B1405c4065a3521o6137j7169A73060B1662
18360c3618A30707I56K30800b09791d9366A91040a50830B08902b51717e7146A03421
$$ y = [-146619, 107142, -78557, 64814, -12279, -212616, -70457, -64535, 36792, 17236, -144262, -222715, -177513, 41012, 26802, 54806, 222228, 251014, 138528, 74241, 39418, -63289, 12396, 167032, -17286, -73008, -58043, 38546, -262261, -193524, -57263, -27842, -348705, 304078, -70327, -11801, 8850, -10760, -85920, -128650, -18145, 37271, 265210, -54460, -232599, -129220, -187413, 29935, -101544, 300165, -1327, 628339, 47146, -130232, 279250, 323469, 161332, -202923, -82120, -88460, 235992, -19859, -180706, -92271, 115012, 6881, 52679, -201227, -445, 34244, 97226, 42577, -215506, -95817, 21405, -34065, -13521, -79658, -96827, 173060, 21662, -33618, 130707, 956, 231756, -209791, -49366, 191040, -150830, 208902, -251717, -57146, 103421]
18348G5307j2315a59034m915B21674q9763O4100b6682k4580d152B76325i7926
18336A08467l2877K04079d2171j7682r2733P2061j3967k04162f211j04971J1938
18325i9244j14169g4137A68193g2043D3591b97403C5998K93816a19729j91984
18315c11713a53884A31682d63619i7467J202j60034A32394b99678e7932A8464
18304c74428g6665A72902p1608a87698B60737e4253k78040R7505N1100g5479L5692
18293c9787l227j12776b4767j18933B19727b9869B23452o3047l5616b06479j6255
18282b22734C39624c0518j06008a0061j08457K9121A11509C4464q329J44056M9327
18271B19518R9400b72077a8776l0811R798D6139b21314k0882a8715B0479d68763
$$ y = [75307, 62992, -159034, -163949, 221674, 131911, 196011, -26682, -51262, -4152, 276325, -97926, 108467, 75590, 279669, -42171, -59853, -152586, -80525, -94492, -298654, -6211, -111182, -99244, -213413, -74137, 168193, -72043, 43591, -297403, 35998, 329814, -119729, -311713, -153884, 131682, -463619, -97467, -96265, -256299, 132394, -299678, -57932, 18464, -374428, -76665, 172902, 101294, -187698, 260737, -54253, -332293, -234788, -183688, -75479, -39787, -43014, -155790, -24767, -143700, 219727, -29869, 223452, 160405, 124789, -206479, -222734, 339624, -30518, -136526, -10061, -118518, -89397, 111509, 34464, 26135, 170191, 219518, 318918, -272077, -18776, -49587, -39789, 46139, -221314, -242196, -18715, 20479, -468763]
18259a78080a4016j17104B9357b25408A73019b0937j73738A2875a47947c9986
18248H6622d7597j24926K0715A42005a27113G0651a28021A822h9456j50933O8597
18237a71792J2382A69200b81920B3371J88329b17410k71006G0971J539K7674i9214
18225h0008k29145c7008L86e573n2700b6257C33976a86636B5520R5224b1342n2259
18213g3601j23808A2325K5056b39970b5496j10860I8913a32168k7543b6955n1183
18202g8138j1534o0873N4954B44055h2673A97856b4287B50000a62846B31498d7910
18190A53521H343P6856J12001j5055o9543B7342K36892B3797b06541K3173B16603
18178f6525k31747B32718a79044E8090A0409a14911j09491K1435A28004b95181
$$ y = [-178080, -14016, -131120, 29357, -225408, 173019, -20937, -194675, 12875, -147947, -39986, 86622, -47597, -172523, -151808, 142005, -127113, 70651, -128021, 1822, -89456, -240389, -171792, -159410, 169200, -281920, 23371, 211700, -217410, -488416, 70971, 72510, 100184, -99214, -80008, -309153, -37008, -36622, -5573, -58273, -26257, 333976, -186636, 25520, 120744, -21342, -73601, -197409, 12325, 37381, -239970, -25496, -136356, 98913, -132168, -159711, -26955, -78138, -89672, -150545, -95591, 244055, -82673, 197856, -24287, 250000, -162846, 231498, -47910, 153521, 8343, 85199, 197200, 182145, 112602, 27342, 264234, 23797, -206541, -183368, 216603, -66525, -298272, 232718, -179044, 58090, 10409, -114911, -224402, -202967, 128004, -295181]
18167a7367k763j06894q9863A14080J1493E0363K9528h9334D4414h8897K5949
18156f2948D8805b8306H6950J5794a30735n3730b1342l20465f4866A13851g458
18144a11678M0201j23114f2056j63370B4J94022c51070E6644c327j94383i92C67051
18131g9736K4152D4507B467d58959a79486k1906m9426L6902N1871j7409n2987
18120b32441A79397b53880A7056K47691d2652A93202C7261d20145J98500A4850
18109a14963N0738B99827a32574I0043O642K0170j4963J2826l5690J05373a16249
18097C50598a37140J4800A31799e5984B73990c4652r6450B51053F291K6308J46137
18086A78736b52160A03085b3359B31858b7816k59004E1872a2627o5813l726A80269
$$ y = [-17367, -20130, -127024, -216887, 114080, 125573, 50363, 79891, -89334, 44414, -88897, -62948, 48805, -28306, 86950, 102744, -130735, -184465, -21342, -341807, -64866, 113851, -7458, -111678, -71477, -194591, -62056, -225426, 24, 194046, -351070, 56644, -3327, -197710, -992, 367051, -79736, -55584, 44507, 2467, -458959, -179486, -201392, -250818, -213916, -162045, -179454, -232441, 179397, -253880, 17056, 264747, -42652, 193202, 37261, -420145, -221645, 14850, -114963, -64225, 299827, -132574, 90043, 96685, 116855, 101892, 114718, 79028, 184401, -116249, 350598, -137140, -122340, 131799, -55984, 273990, -34652, -131102, 251053, 6291, 32599, 178736, -252160, 103085, -23359, 231858, -27816, -286820, 51872, -12627, -78440, -82166, 180269]
18074A36987K1512j6473b50102B67991g0149k9553j9655E6188O4518a50083I5516
18062F2138K05354O1575F6937c60002F4243b47587H4425c7880A68141e2907k32810
18051b85717R6017Q436D5747h9852j48668B9859J76538d4404j08490M4425d6118
18039a31678A31854n3726J25172h0276H0245b071k50868O2459A39514a34089o4530
18028a98619N2506A0502J35881b58391A33455K2002a139H6533d9851A8973a22507
18016D393f8304A79514a9918H618a7872H3233a01904j61063f2667O255G8538g3919
18003B85291A6540K83961b561I6276K0363c73835H7786M11866b77218L9569k6640
17992b64289R7919C35798h1158B65375b46246J0056A64730c77431a21665j07880
$$ y = [136987, 158499, 142026, -250102, 267991, -70149, -99702, -119357, 56188, 120706, -150083, 95516, 62138, 267492, 329067, 66937, -360002, 64243, -247587, 84425, -37880, 168141, -52907, -285717, -189700, -181264, 45747, -89852, -238520, 29859, 206397, -44404, -152894, -108469, -46118, -131678, 131854, 78128, 203300, -80276, 80245, -2071, -252939, -190480, 139514, -134089, -198619, -146113, 10502, 146383, -258391, 133455, 155457, -1139, 86533, -49851, 18973, -122507, 4393, -68304, 179514, -19918, 8618, -17872, 83233, -101904, -262967, -62667, -56412, 78538, -73919, 285291, 16540, 300501, -2561, 96276, 116639, -373835, 87786, 499652, -277218, -237649, -264289, -166370, 335798, -81158, 265375, -246246, -236190, 164730, -377431, -121665, -229545]
17982b29545d7209m32579b01090h3298C593J07069a48729k08409d8264j90354
17972b38618A71367m4207o2750K3891b92642e4266A30674b61490a29930F8497
17961e1931a2858M623A08935J4683M7277a94470c2634j62573A13028J86164J2123
17950C11315a4515H3198j8716O715L1165N2917m086c11305C7107O764a17541o2050
17938a79591g3148E7426J69072p262E8336c85032A55490a3107M55j30170f3929
17926f0125j39370E5359a7163F5486J76329d13054A69283F6404a24671j79573
17916c04244A6545e7517k05745e7208A05008a92513a3470o3986C08068J04218
17906D12286E2385Q0165a5755o6051k42506P4684I95c7029A42195c79117a44890
$$ y = [-229545, -47209, -479788, -201090, -83298, 3593, 110662, -148729, -357138, -48264, -238618, 171367, 127160, 64410, 88301, -292642, -54266, 130674, -261490, -129930, 68497, -51931, -12858, -8235, 108935, 123618, 170895, -194470, -32634, -195207, 113028, 299192, 311315, -14515, 83198, 64482, 71197, 102362, 155279, 151193, -311305, 37107, 43871, -117541, -179591, -73148, 57426, 226498, 219236, 58336, -385032, 155490, -13107, -12652, -142822, -63929, -60125, -199495, 55359, -17163, 65486, 241815, -413054, 169283, 66404, -124671, -304244, 16545, -57517, -263262, -57208, 105008, -192513, -13470, -77456, 308068, 412286, 52385, 132550, -15755, -81806, -324312, -249628, 995, -37029, 142195, -379117, -144890]
17894a68988K4399f3418j3628o245R893A39966b38415A95376C1561f6023j69980
17883b36003R7181n8044B0494e5450H7200a21521J1711H2841h7063a6898C78138
17871D8448K73589E1058a43976G3495K73684B3891K3101J56254m8575K41016E8621
17859A85771C4986a9380A85687p2532A1771J33241K01256j16868a52031N4455
17849i7576C3225e3503A61949c28061J01410A90256i1178B24421n7557b6929B01601
17837a44045b3989j15355G2352j4333j5758h7465A62981J26077A02888b06846
17826A64655C3899K38494M7808i9908B69613a69197B28585p2467c2628F8553a30698
17814a25925D17473B7620f8525j43083a6449A14791a22186L8937B8463a81254
$$ y = [-168988, -144589, -63418, -77046, -83291, -73398, 139966, -238415, 195376, 31561, -66023, -236003, -138822, -196866, 20494, -55450, 87200, -121521, -109810, 82841, -87063, -16898, 378138, 48448, 322037, 51058, -143976, 73495, 347179, 23891, 46992, 203246, 154671, 395687, 58621, 185771, 34986, -19380, 185687, 113155, 11771, 145012, 346268, 229400, -152031, -97576, 33225, -53503, 161949, -328061, -226651, 190256, -91178, 224421, 166864, -26929, 201601, -144045, -23989, -139344, 72352, 58019, 42261, -87465, 162981, 289058, 102888, -206846, 164655, 33899, 272393, 320201, -99908, 269613, -169197, 228585, 156118, -32628, 68553, -130698, -125925, 417473, 27620, -68525, -211608, -16449, 114791, -122186, -83249, 28463, -181254]
17803a31719B31787c254A28864d2853p0722d136j21499p5471I0607K373b94966
17791F5798c2854A09304k051K5925K32813A23256J17028r6371g6874H2274i7856
17779c9607R524A89357K36283f7660K7567A9573a01837C18862g9423R910A41570
17767F8659c4360A40553J59475J31840b33012N4216e151k81326a23102C35998
17756a83643C3044P5417J0602f4036j55544A11312J65997j27453J05309c12628
17745E8482j6569a09441G669b41360C1935J28975b76535e0721G0946c3834B29762
17733A87100b4517j15237k1205H5291M5735a39728O0084o8475E553M62104A7598
17721b39170G8553b12769F0103g6320o7590e1058C39086a70292H9358J56157G1384
$$ y = [-131719, 231787, -3254, 128864, -42853, -113575, -4136, -125635, -201106, 90607, 92980, -294966, 65798, -32854, 109304, 107253, 133178, 365991, 123256, 240284, 143913, -76874, 82274, -97856, -39607, -30083, 189357, 425640, -67660, -40093, 19573, -101837, 318862, -79423, -69513, 141570, 68659, -34360, 140553, 300028, 431868, -233012, -178796, -5151, -286477, -123102, 335998, -183643, 33044, 108461, 119063, -64036, -219580, 111312, 277309, 149856, 255165, -312628, 58482, 41913, -109441, 7669, -241360, 31935, 160910, -276535, -50721, 70946, -33834, 229762, 187100, -24517, -139754, -160959, 85291, 131026, -139728, -79644, -148119, 5553, 467657, 17598, -239170, 78553, -212769, 60103, -76320, -143910, -51058, 339086, -170292, 89358, 245515, 71384]
17709B42213i3600c7811B21542a03913m1740E9348P4190c3226h200C6463a24438
17697B9107L78578d2769j05797j23995C24560a26044f2497B18475h240l10477
17687c18717a56314E4190J64298a55900I4767a47631A07531a43677C10776k5283
17677B85493g4405j141A57701J084i1845d649F6136b31421F2713g8115A51279
17665G0661B6513N4262J1771a48608B00011a84325A27754O7918f8338o1580B40621
17653F86386B95335G793h7574B07901c113j8986A13042a0526B58975c68598A7214
17641A4596J56765M5333j04329C4180b13244A0868K22445f0657j1790G6406i7450
17629a44978H4486P3288a928o0244K5608j55862f5943A83898D7080a33469A34144
$$ y = [242213, -93600, -37811, 221542, -103913, -145653, 59348, 133538, -33226, -8200, 36463, -124438, 29107, 407685, -42769, -148566, -272561, 324560, -126044, -62497, 218475, -8240, -318717, -156314, 54190, 218488, -155900, 94767, -147631, 107531, -143677, 310776, 285493, -74405, -75546, 157701, 158785, -91845, -4649, 66136, -231421, 62713, -78115, 151279, 70661, 26513, 80775, 92546, -148608, 200011, -184325, 127754, 195672, -68338, -129918, 240621, 686386, 295335, 7793, -87574, 207901, -3113, -22099, 113042, -10526, 258975, -368598, 17214, 14596, 171361, 216694, 112365, 34180, -213244, 10868, 233313, -60657, -72447, 76406, -97450, -144978, 84486, 157774, -1928, -62172, -36564, -192426, -65943, 183898, 47080, -133469, 134144]
17617D3666j9659K02053B0767a44455o5276A98296h2571k82535B1617L6873i1134
17605C8431J8936a16959F4588b57870J26110D5650J18141K27922j49455q0311
17595A61947j281K5856P903H8772b12724A61974n4841a27769n0854g3960A10637
17583D1114L52644A06689h7402b8604A70283c9014A43810a73547A79046e9418
17572a33685A37972i4425A4804a1632A20366n2890J30473N1049h917m6658A82716
17560A54795J65474r9430a34348A74236n0374i2372J5259F891a09948A19665h0764
17548a7318A33224D5075d7768a4423A8061a40032K0296A51270p3195J37394a9089
17536A14459C8182Q890P6287a36567P676A79077K01305H2488N9672Q5741b1396
$$ y = [43666, 24007, 226060, 20767, -144455, -209731, 198296, -82571, -365106, 21617, 58490, -91134, 38431, 57367, -116959, 64588, -257870, -131760, 45650, 163791, 391713, 242258, 161947, 160666, 186522, 194425, 88772, -212724, 161974, 107133, -127769, -178623, -73960, 110637, 41114, 393758, 106689, -87402, -28604, 170283, -39014, 143810, -173547, 179046, -59418, -133685, 137972, -94425, 14804, -11632, 120366, 67476, 197949, 248998, -8917, -55575, 182716, 154795, 320269, 220839, -134348, 174236, 123862, -92372, -77113, 6891, -109948, 119665, -80764, -17318, 133224, 45075, -47768, -14423, 18061, -140032, -119736, 151270, 78075, 215469, -19089, 114459, 38182, 47072, 123359, -136567, -128891, 179077, 380382, 82488, 142160, 227901, -21396]
17524b765A74496k0034e8549p8054d2517B62653N6287F3961j7121c804E4731j16
17512E4615c25751C24554R7551a30610A67439K51653a10816B71345P3524I7529
17501g1499F68760c6874A59157d5458P97G5894g3853B45399C3645J97684A12868
17489F6867J83784D2785L04032j07812c4053E1079d762m16E09904G6812J40794
17478B17606b28885L7816A59880m0000J11011K75889A13413K24124C3620L7245
17468G0865b41494C98089a32394A32896g1350C1903J4485e322A27602m4929K58226
17457C40899A14626R3936J06437K7268q6836b7246C3885K78435J10443A63318
17446D09129j08359p1591o7200o5796L54741j41130e6106A76795l3710l0215K21504
$$ y = [-2765, 174496, 154462, -58549, -136603, -42517, 262653, 318940, 63961, 46840, -3804, 54731, 54615, -325751, 324554, 422105, -130610, 167439, 419092, -110816, 271345, 344869, 97529, -71499, 668760, -36874, 159157, -45458, -44661, 75894, -73853, 245399, 33645, 231329, 112868, 66867, 250651, 42785, 346817, 239005, -34053, 51079, -4762, -5178, 509904, 76812, 217606, -228885, -191069, 159880, 119880, 230891, 506780, 113413, 337537, 33620, 70865, -241494, 398089, -132394, 132896, -71350, 31903, 46388, -5322, 127602, 82673, 340899, 114626, 208562, 314999, 342267, 255431, -27246, 33885, 312320, 422763, 163318, 409129, 300770, 229179, 161979, 96183, 450924, 309794, -56106, 176795, 143085, 112870, 334374]
17435C34374d9053D39348A48497L13664j92361K75576k00628j33811R2677j36258
17425A67356A0065K99666j27162B3790Q2129K91480j77517N2034p0581M0078J91276
17414D32689a30247B97136a42322B30395i636H3997C7141L45207A02785M342L0998
17403A38125J12329J13572a59612g8236E0360f6915C65403M2864q1908E3215P0250
17392A23465K76682o8806F1434K2739L02622j44190j6867m3021J32413B0474c1760
17380B19259L1359A24409R5451Q8379D7802K96681r3426j24198l6866Q5975a12342
17368D86431m2495h0183B90984J35886A63959J10505J95766A05441Q6014a19188
17357A23135J49143D8151L35345j52926j3365p5384C0898J68690I7182J39999
$$ y = [334374, -49053, 439348, 148497, 462161, 269800, 545376, 344748, 210937, 303614, 167356, 10065, 309731, 182569, 23790, 105919, 397399, 219882, 271916, 201335, 241413, 432689, -130247, 297136, -142322, 230395, -9636, 83997, 37141, 382348, 102785, 107127, 138125, 250454, 364026, -159612, -78236, 50360, -66915, 365403, 408267, 326359, 53215, 123465, 400147, 331341, 61434, 84173, 386795, 242605, 225738, 182717, 315130, 20474, -31760, 219259, 250618, 124409, 219860, 308239, 47802, 344483, 251057, 126859, 89993, 175968, -112342, 486431, 443936, -80183, 290984, 426870, 163959, 274464, 470230, 105441, 191455, -119188, 123135, 272278, 48151, 383496, 230570, 217205, 141821, 30898, 199588, 97182, 237181]
17347B37181a47181f0228F4765J72714J43678p120C577K00262n7538J20211E8118
17335H122K63279D5671N70924A42392l773J02546j12968K47192A83201e4832A6402
17323A82813A1678L7605J19436L37923b046B70436b8367A26474f8313c2721l04992
17312c37713B10918j4800p8297a38013A63299C6766K00460r2035K57503A46435
17301E5733K07837R522q2599j9840n7815M88963A89596H4739K17287b2957B79105
17289B78508R1835r9333J22548Q5542N3989A68212L2819J4819q5075K5420o2394
17278I3801M2433c5127F7574J30835a05443G6651J75866B5918J53339c034A31054
17266A55545K69266k0506d0525E4147K67988P3226j61359p6051L27784k35215
$$ y = [237181, -147181, -60228, 64765, 237479, 381157, 374037, 3577, 203839, 146301, 266512, 58118, 8122, 271401, 45671, 616595, 142392, 138619, 241165, 128197, 375389, 183201, -54832, 16402, 182813, 11678, 49283, 168719, 506642, -2046, 270436, -28367, 126474, -68313, -32721, -337713, 210918, 196118, 117821, -138013, 163299, 36766, 237226, 145191, 402694, 146435, 55733, 263570, 273092, 190493, 170653, 112838, 601801, 189596, 84739, 302026, -22957, 279105, 278508, 370343, 271010, 393558, 479100, 533089, 168212, 201031, 215850, 130775, 156195, 93801, 136234, -35127, 67574, 198409, -105443, 76651, 252517, 25918, 179257, -3034, 131054, 155545, 424811, 404305, -40525, 54147, 322135, 395361, 234002, 157951, 485735, 250520]
17256B50520R774K22626B37735R5967K15809k6765o7023n7858G4957c4330A71849
17244G0526K6011k8704K44085J8510J53503j01198r4422J7003J44373F0726K10466
17233B71192j02094c1575A35944E9704K87556n4301a53803A82519j9245B4673
17222A61785M9226j166K27824E0604J99401l6479L0824J54665M39423c5778B33622
17210C94696L7863Q0177k5018d2298C70152o5881a07673D37724a851C05754L4334
17199C40088a5764F0569M41625j37608Q8721j46767O4776q8871M3587n6008J95448
17188D65472l4315A25356M47584B54426K98654A45253J14067j22030L2103K12588
17178C81981h7175L6103C50268B6689N9330L30008A64683J31398g6367A76716
$$ y = [250520, 260294, 482920, 237735, 333702, 549511, 522746, 455723, 397865, 74957, -34330, 171849, 70526, 96537, 67833, 311918, 330428, 483931, 382733, 288311, 305314, 449687, 60726, 271192, 169098, -31575, 135944, 59704, 347260, 292959, -153803, 182519, 163274, 24673, 161785, 211011, 209845, 437669, 50604, 250005, 213526, 244350, 399015, 838438, -35778, 233622, 394696, 432559, 512736, 487718, -42298, 370152, 304271, -107673, 437724, -1851, 305754, 340088, -15764, 60569, 502194, 364586, 453307, 306540, 371316, 282445, 326032, 270024, 465472, 431157, 125356, 572940, 254426, 553080, 145253, 259320, 137290, 169393, 381981, -87175, -51072, 350268, 26689, 86019, 416027, 164683, 296081, -76367, 176716]
17167B09100K80971K9392j08828p4870A4134K96284c22013I7727i1137B15428
17156a7873D45584j58280O0598J7667N3520l8289K58952k35342k8438p8695J50879
17145D48156J05025j62109J70482j55538R3069M1286j93274j15092J22784j12746
17135B42043J57198A52421J63974n146K49312K2397j27725k00787N8396K14494
17125E27336q816N4450L481f2398B57402l8527O2644k8981n1256k1249L50933
17114E30966B41773O8020A02421M87180I8052M860M32533k43399L96513A12327
17103C83823n1788L25119l22020L63202B02758M0821K0586n9535P4377K89980
17093E68987j19249J36249k17846K16824j38572N1361j14250L16530k30973J20487
$$ y = [209100, 490071, 519463, 410635, 335765, 14134, 310418, -322013, 97727, -91137, 215428, -17873, 445584, 287304, 347902, 365569, 419089, 380800, 639752, 404410, 375972, 297277, 448156, 553181, 391072, 561554, 406016, 499085, 540371, 347097, 232005, 354789, 242043, 399241, 152421, 316395, 311249, 560561, 582958, 455233, 254446, 312842, 527336, 518520, 572970, 576451, -62398, 257402, 218875, 281519, 252538, 201282, 180033, 530966, 241773, 309793, 102421, 589601, 98052, 102912, 535445, 292046, 688559, 112327, 383823, 332035, 657154, 335134, 698336, 202758, 243579, 264165, 204630, 279007, 568987, 449738, 585987, 368141, 584965, 446393, 497754, 383504, 700034, 469061, 589548]
17083E89548J62533j81933A36812K81458J20851j60259J50284j65553J14609L33555
17073H11757L8022m12856N8542k42293L42512k56797M52139C50515M25308j58116
17063F17707J1212o5858K75545k04503l4191J22556k56529k15161K49815r2565
17053D08028M01805C64562O13608l51714j80263L78827l59668J7926N6390K7077
17043E66745L63513m28512J8973k374J0974J7269L01531N0669l16858J60458J6556
17032G58944l28955K47835k78363Q2666N7117K629K61683l80559J92823J64801
17022G80621j27554L3880P9341J73519k17925N0465K50853p9008j82662J56564
17012I18094J91536E49830k7195q5923L74248R028N9880o9900K17036k47789l28454
$$ y = [589548, 752081, 570148, 136812, 418270, 539121, 378862, 529146, 363593, 478202, 811757, 849779, 436923, 495465, 253172, 595684, 338887, 791026, 350515, 775823, 617707, 628919, 563061, 838606, 634103, 599912, 722468, 465939, 250778, 500593, 408028, 809833, 364562, 978170, 626456, 446193, 825020, 465352, 483278, 539668, 566745, 930258, 501746, 520719, 518345, 529319, 546588, 848119, 898788, 581930, 742388, 758944, 429989, 677824, 399461, 482127, 539244, 541873, 803556, 422997, 615820, 780621, 653067, 686947, 766288, 939807, 721882, 772347, 1023200, 944192, 761530, 918094, 1109630, 549830, 522635, 436712, 810960, 819988, 879868, 809968, 1027004, 779215, 450761]
17001D50761K15285Q8728K94603j42475L05250j85208p7190l46965L5168M84130
16991A122087j26582j13211j05993k80649N55981J9410m33593M34682k33755J39744
16981I78121l2837L39360l91796D00468N29548K7659Q2871P5167q4592j37585
16971H93536l3902K59804l35881N43182Q110p3252k43875J08772N3878k85524
16961H94848k287K90310n8384L2421k04563K97061M4562q0634j57766R8104K42929
16950A396601o95441L73112N3673Q7547j65871J61469j24969M76892p8587j11196
16940A373230k85951K21675J58499l9891m31163L04872K64177l91275L74156k19239
16930A329090K1596J71807K7177n5992j1399l4478J02009j44920M7177M2712K01596
$$ y = [450761, 666046, 754774, 1049377, 906902, 1212152, 1026944, 949754, 602789, 637957, 1122087, 995505, 882294, 776301, 495652, 1051633, 1071043, 637450, 1072132, 838377, 978121, 945284, 1284644, 892848, 400468, 930016, 957675, 1040546, 1115713, 1031121, 893536, 859634, 1119438, 783557, 1326739, 1334849, 1261597, 1017722, 1126494, 1180372, 894848, 892561, 1182871, 1124487, 1156908, 952345, 1249406, 1293968, 1213334, 1055568, 1153672, 1396601, 701160, 1074272, 1127945, 1215492, 1049621, 1211090, 1086121, 1563013, 1484426, 1373230, 1087279, 1308954, 1467453, 1427562, 996399, 1301271, 1565448, 1174173, 1548329, 1329090, 1350686, 1522493, 1549670, 1493678, 1482279, 1447801, 1549810, 1404890, 1452067, 1494779, 1696375]
16919A696375m63820N16104m61262O07608k61659J44422o0204q4933j53649j76552
16909A302430N32459K97938J1487l66806K02307j39219L20491m50532N4952L54365
16899B119872m3869l14496J50513J64041j70163j41921P4159K74990l5457j09108
16889A968561J63270K5460K87006k26936l19573O55087n74582O20114j428k2912
16879B574067R7873j44157J47244l26393M21034k82481J94865j24613l0656K192
16869B528975L422L64404l3439m8744R2921j15805j82404L09768R3733L11330
16859C324161K8225k14979K12573K00653j89055K0570L17270k77971L11027K07616
16849C940090j83875l2867J60737J00306j21176j23173O74746l68107K90364k85594
$$ y = [1696375, 1232555, 1748659, 1287397, 1895005, 1633346, 1777768, 1717564, 1632631, 1478982, 1302430, 1834889, 2132827, 2144314, 1777508, 1979815, 1840596, 2161087, 1710555, 1765507, 2119872, 2076003, 1761507, 1912020, 2076061, 1905898, 1763977, 1838136, 2113126, 2077669, 1968561, 2131831, 2157291, 2444297, 2217361, 1897788, 2552875, 1978293, 2598407, 2596979, 2574067, 2671940, 2527783, 2675027, 2348634, 2769668, 2487187, 2682052, 2557439, 2526783, 2528975, 2532397, 2896801, 2863362, 2814618, 2907539, 2791734, 2609330, 2919098, 3012831, 3324161, 3352386, 3137407, 3349980, 3550633, 3361578, 3382148, 3699418, 3421447, 3732474, 3940090, 3756215, 3723348, 3884085, 3984391, 3863215, 3740042, 4414788, 4046681, 4337045, 4051451]
16839D051451J52624J33133o4916N16749p61112Q49053J44627j10185j073J23875
16829E034226m8996L07115J47706M8081k05470K8876N74416k39075K46984j07434
16819E786429K21864K92275K35881j60685M28582N6505o7942J81204k8034K61328
16809G207407k3705J62939K84781J96967L6138M71599M68379j97231J80348K94198
16799I081820K76650L42289K33489L29934L4816J20642P8655M35647M26960J98949
16789A1559851N75401M2419M68811L99281K43737M08181N00085L70114K32024
16780A4799904M18732N98848M37395O31532L48338R57678N83197M38015O75041
16771A9888680J92859R61432P42602R13906P24754R58834R25080L65653J520989
$$ y = [4051451, 4204075, 4337208, 4272292, 4789041, 4027929, 4876982, 5021609, 4911424, 4910351, 5034226, 4985230, 5292345, 5440051, 5488132, 5282662, 5311538, 5885954, 5646879, 5893863, 5786429, 6008293, 6300568, 6536449, 6375764, 6804346, 6860851, 6792909, 6974113, 6946079, 7207407, 7183702, 7346641, 7631422, 7828389, 7864527, 8336126, 8804505, 8607274, 8787622, 9081820, 9358470, 9700759, 9934248, 10264182, 10298998, 10419640, 10498295, 10933942, 11360902, 11559851, 12135252, 12177671, 12646482, 13045763, 13289500, 13697681, 14197766, 14567880, 14799904, 15218636, 15817484, 16254879, 16886411, 17234749, 18192427, 18775624, 19213639, 19888680, 20081539, 21042971, 21785573, 22699479, 23424233, 24383067, 25308147, 25673800, 27194789]
16762B7194789J225735Q66999J598769J099031J269488J233649J765378J518933
16754C7772771J719152J771427J836285K173376J794628K663719K475306K861824
16746E5068488K406441L248921L229064L098260L484705L876191M399645M552019
16738H3363734M444509N098984N343907N247551N820704O391820O403018O383795
16730A28498022P041234P085426O914332O752634O844150O400002O572207N440801
16722A81548808M637030L669480K935855J725189N20204m39769j993553k888812
16714A89714432m211619m599805n632624o528320o441742p093660p344594p071132
16706A40790936o861296p331016o780983o260635o814177n757276n830219n339184
$$ y = [27194789, 28420524, 29287523, 30886292, 31985323, 33254811, 34488460, 36253838, 37772771, 39491923, 41263350, 43099635, 45273011, 47067639, 49731358, 52206664, 55068488, 57474929, 60723850, 63952914, 67051174, 70535879, 74412070, 78811715, 83363734, 87808243, 92907227, 98251134, 103498685, 109319389, 115711209, 122114227, 128498022, 135539256, 142624682, 149539014, 156291648, 163135798, 169535800, 176108007, 181548808, 186185838, 189855318, 192791173, 194516362, 195036566, 194596797, 192603244, 189714432, 185502813, 180903008, 175270384, 168742064, 162300322, 155206662, 147862068, 140790936, 133929640, 126598624, 119817641, 113557006, 106742829, 100985553, 95155334, 89816150]
16698H9816150n043974m478069m521204m053242m324872l125368l292326l722624
16690E7254471k649867k617646l016092k002790k358096k082010j849057j953111
16682C8725802j735819k120354j044624j963599j093925j350531j096515r95966
16674B7324469j108896j011069j059381p97086j032281q04045p47026m43303r77478
16665A9343904n89557p79462l28455p84517o47163j78213p20217m24322m19105
16656A4472893n88647n50791k89369J30437o72386n89693j66661k28240m66272
16647A1051271m26954M237l76836l83527k3990l09200k23345J35086n31210k48141
16637H667391m60721j77733l25351P0129l38255j72140l27162J94370l96763j075
$$ y = [89816150, 84772176, 80294107, 75772903, 71719661, 67394789, 64269421, 60977095, 57254471, 54604604, 51986958, 48970866, 46968076, 44609980, 42527970, 40678913, 38725802, 36989983, 34869629, 33825005, 31861406, 30767481, 29416950, 28320435, 27324469, 26215573, 25204504, 24145123, 23348037, 22315756, 21511711, 20764685, 20321382, 19343904, 18754347, 17974885, 17646430, 16861913, 16214750, 16036537, 15316320, 14891998, 14472893, 13884246, 13333455, 13044086, 13174523, 12502137, 11912444, 11745783, 11517543, 11051271, 10624317, 10628554, 10251718, 9868191, 9844201, 9535001, 9311656, 9446742, 8915532, 8667391, 8206670, 8028937, 7703586, 7773715, 7435460, 7263320, 6936158, 7130528, 6733765, 6732690]
16627F732690L4049j23558j91454j50754j48731m3171l85853J0731p6469k25222
16617E432258p9656l8828n71469K79888j08760j10527j87931m9390K54588q9562
16607D730611m77278K07320k12987j20700l5256K8516j54490N5417n12631m3052
16597C465470L89307k60590n932j6700J10591n34189K95307k12089J52877L6669
16587C420721j68819l21564K15980m15346M44281n08621K22137P4511l02415n3036
16577B607829j47045L11978P1066q2475l415R0238m48515J31077l57133K92637
16567B466242n1704n0267M7738j78467K71518o98673M18619m3718K6638J82910
16557B390836m39202K35914j07796K78366m04836J88501q4575n11053K30713J27531
$$ y = [6732690, 6766739, 6643181, 6451727, 6300973, 6152242, 6109071, 5723218, 5733949, 5657480, 5432258, 5352602, 5313774, 4742305, 5022193, 4913433, 4802906, 4614975, 4565585, 4820173, 4730611, 4253333, 4460653, 4247666, 4126966, 4091710, 4120226, 3965736, 4021153, 3508522, 3465470, 3854777, 3594187, 3588255, 3571555, 3682146, 3147957, 3443264, 3231175, 3384052, 3420721, 3251902, 2930338, 3146318, 2730972, 3175253, 2666632, 2888769, 2963280, 2660865, 2607829, 2460784, 2772762, 2843828, 2761353, 2757938, 2848176, 2399661, 2530738, 2173605, 2466242, 2414538, 2364271, 2412009, 2233542, 2505060, 1806387, 2225006, 2181288, 2207926, 2390836, 1951634, 2187548, 2079752, 2358118, 1953282, 2141783, 2057208, 1546155, 1776868, 1904399]
16547A904399j3294K52077m81107j60730K02582k71253L46149j95893N55117o83082
16537A454965J22422L89027k30087R1264k50026n0697p3774k0835o0805k32472
16527A138982K71576j42871J66278j74877J82586l84797J79164j40030P0383L99446
16517A565840q4628P582k53356J20657k17700j35375L31953k86846N3580K74005
16507A375712k58511m89875M66741j97567J20013L8709J357N8323O158k32623
16497H88437J91224q7314l651L00588n61633K19370q3105M0840K67146k02536
16487I69366K76780j33149l37218R8265k6541j26197L70792k73367o2232L69815
16477A126314j19289j14756l0768q5137j48972J33884K66169j63966k04535N1284
$$ y = [1904399, 1891105, 2143182, 1662075, 1501345, 1703927, 1432674, 1778823, 1582930, 2138047, 1454965, 1577387, 1966414, 1736327, 1827591, 1577565, 1526868, 1453094, 1432259, 1371454, 1138982, 1410558, 1267687, 1433965, 1259088, 1441674, 1056877, 1236041, 1096011, 1166394, 1565840, 1481212, 1488794, 1235438, 1356095, 1138395, 1003020, 1334973, 1048127, 1101707, 1375712, 1117201, 627326, 1094067, 896500, 1016513, 1055222, 1056579, 1114902, 1121060, 888437, 1079661, 992347, 988696, 1289284, 727651, 947021, 863916, 904756, 1171902, 969366, 1246146, 1112997, 775779, 874044, 847503, 721306, 1092098, 818731, 756499, 1126314, 1007025, 892269, 861501, 776364, 627392, 761276, 1027445, 863479, 658944, 710228]
16467G10228K28399K07637E25472M94247m24826p478J30532K42432j53776j37754
16457F68849J31349k83913K19083M0233j4414r83l34605M91585j90468l6043M9564
16446G40237J9974k06656M9392M7498O6913o9648k12925A89225K98494k0673L07961
16435G75007k99917J32761j78749K93263q4231k7304p0491J0430J75801k77709
16425D48861j01017J38033K09916k21900K02056K47135D10317j3978R2432j36533
16415C52238K49042l0985l361j63695K21948B01437K81710K53251C12323Q2653
16405C94976j1560Q6745N4806J38861j87630A29170K34047p191L4448N5685K3366
16394D69525j01624p281A21519L63458j4268P3905J3199A57591K88479L3983j86112
$$ y = [710228, 938627, 1146264, 525472, 1019719, 594893, 587415, 717947, 960379, 806603, 668849, 800198, 516285, 735368, 775601, 761187, 760204, 425599, 917184, 726716, 690673, 740237, 760211, 553555, 602947, 650445, 717358, 647710, 434785, 189225, 487719, 467046, 775007, 475090, 607851, 429102, 722365, 638134, 610830, 540339, 550769, 726570, 448861, 347844, 485877, 695793, 473893, 675949, 923084, 410317, 396339, 488771, 352238, 601280, 570295, 566934, 403239, 625187, 201437, 483147, 736398, 312323, 394976, 383416, 470161, 524967, 663828, 476198, 129170, 363217, 356026, 390474, 446159, 469525, 367901, 360620, 121519, 484977, 470709, 544614, 557813, 157591, 446070, 480053, 293941]
16383B93941A18454L13863j6071j67473L187J37682O6480j78794Q6903J75523
16373E39754B11102L85383j57312J89577J0028B81680j33849M60132k23535j41506
16363B42922N5175n2756J35919j71391K76448m6327j94133J65268j64494H4062
16352C26943j24169J10339o786N6723j41808L28657L6077B49329J28371n4325
16342C23375A3949K95085e574D09455C98N19946j48598F2426J07175J39152a31801
16330D05030A97342G2363M40960k17938N2629a04543B25320b601B9572K96578
16320C26150j05079R3716K4720j67194K42119j63805O7Q093K8508a22164B08777
16308E1161J92579L2797B1419H3O8074A3663K8716b2565C67589A23058M51283
$$ y = [293941, 118454, 432317, 416246, 248773, 251960, 389642, 456122, 277328, 364231, 539754, 211102, 596485, 439173, 628750, 638778, 281680, 147831, 607963, 384428, 242922, 298097, 245341, 381260, 209869, 486317, 439990, 245857, 411125, 246631, 84062, 326943, 202774, 313113, 306327, 363050, 221242, 549899, 585976, 249329, 377700, 323375, 13949, 309034, -5574, 409455, 398, 520344, 371746, 62426, 169601, 308753, -131801, 405030, 197342, 72363, 513323, 295385, 348014, -104543, 225320, -2601, 29572, 326150, 221071, 314787, 339507, 172313, 414432, 250627, 250694, 258787, 287295, -122164, 208777, 51161, 243740, 276537, 21419, 83, 68157, 13663, 42379, -22565, 367589, 123058, 574341]
16297E74341A83922P0065q4294J53655A39850a30350I1909Q7651a49751E5655
16286A57948e5025C30421A29824c12885A42728Q8643D8903L05426H4565J07777
16276A92342K02374j80640J92026I6583N214J2178E6734P3988K06334J01736A04975
16264A31244J02393m5855K80100c3913l4805A09237b72650b3063m0253B439K31654
16253B34093J20335q865A49764J57558j01791h6858j75195A12279N8909L9927
16243B11115J93800j07951G8775J62729o0507p718J35853D2925L42474A59549
16232a68042D8603b87209e3358C07641G1708Q1900K60102A65022J41953A5425
16221H5432J33263p2002R2401R2701Q1157I8471J89242I1938O2599J5372l9420
$$ y = [574341, 183922, 253987, 169693, 323348, 139850, -130350, 91909, 179560, -149751, 55655, 157948, -55025, 330421, 129824, -312885, 142728, 231371, 48903, 354329, 84565, 192342, 394716, 214076, 406102, 96583, 101797, 113975, 56734, 130722, 337056, 438792, 104975, 131244, 233637, 187782, 467882, -33913, -68718, 109237, -272650, -23063, -63316, 2439, 234093, 354428, 345563, 149764, 307322, 205531, -86858, -262053, 112279, 171188, 211115, 404915, 296964, 78775, 241504, 180997, 173279, 309132, 42925, 385399, 159549, -168042, 48603, -287209, -53358, 307641, 71708, 153608, 413710, 165022, 306975, 15425, 85432, 218695, 146693, 239094, 331795, 412952, 98471, 287713, 91938, 154537, 169909, 130489]
16210A30489L3246K82541j51943j1565d3056A46907R6278P8656a40760D36058
16199I6343N0801h2766B32364c53980F5006J14617K68341A07966j8348a34374
16188I7110K4948K70619o2091A63412j3490g9746c2208q0198r945r7785B51820
16176f8536A08862J13329b2414r7580C3482J62629r1309l4058K3891J13630q1598
16165A26667b61179B11551a03335Q667A90775e1326j33435B03719F4119K51064
16155C15183i4166b2112C43560A22307m2344b85217B20777a06747D8689b65480
16144A167h5316A08573J42867D4684F686K07258H5516g4651A87187A9250a42102
16132A05209J35445K8105F5074K8097b9385E5818J46924B7902f0706E3216k1683
$$ y = [130489, 163735, 446276, 294333, 282768, -43056, 146907, 243185, 321841, -140760, 436058, 96343, 147144, -82766, 232364, -353980, 65006, 179623, 447964, 107966, 89618, -134374, 97110, 122058, 392677, 330586, 163412, 149922, -79746, -32208, -112406, -122351, -220136, 251820, -68536, 108862, 222191, -22414, -119994, 33482, 196111, 104802, 70744, 94635, 208265, 126667, -261179, 211551, -103335, -94668, 190775, -51326, -184761, 203719, 64119, 315183, -94166, -22112, 343560, 122307, 79963, -285217, 220777, -106747, 48689, -265480, 1167, -85316, 108573, 251440, 44684, 6686, 213944, 85516, -74651, 187187, 19250, -142102, 105209, 240654, 268759, 65074, 93171, -29385, 55818, 202742, 27902, -60706, 53216, 31533]
16121C1533J79399l6959a70009j67954C02503b08541A2632J17226B1896a12848
16110G3117a6759r0836m7357A72749A7742e4129B10917E8382K45889J39627e9786
16098F2007J02467e2101A20323c282F4875K6601K32348A24908J35763J39725A155
16086B75741j18178i2096E2185a21604m3827B42703n0188R7085H7347C8245i3620
16074C94335A87539c38767A87975c6179I1410O7648a30148p7328a1929n0982a9723
16062a02949r3841e5479j26092e8834j94239J25516a5476q1663k09297e8848b0331
16050c24327a52756I8308b83124B53542e0447J9266A14735C4396b6650k54412
16040b81062i579l0848l3055K3647F4120b20550i4266D96501g256B5798q817a41729
$$ y = [31533, 210932, 173973, -170009, -337963, 302503, -208541, 12632, 129858, 21896, -112848, 73117, -16759, -107595, -154952, 172749, 17742, -54129, 210917, 58382, 304271, 443898, -59786, 62007, 164474, -52101, 120323, -3282, 64875, 91476, 323824, 124908, 260671, 400396, 1155, 275741, 157563, -92096, 52185, -121604, -165431, 242703, 192515, 289600, 87347, 38245, -93620, 394335, 187539, -338767, 187975, -36179, 91410, 159058, -130148, -207476, -11929, -62911, -19723, -102949, -196790, -55479, -181571, -58834, -253073, -127557, -15476, -97139, -306436, -58848, -20331, -324327, -152756, 98308, -283124, 253542, -50447, -31181, 114735, 34396, -26650, -281062, -9579, -40427, -73482, -49835, 64120, -220550, -94266, 496501, -7256, 25798, 16981, -141729]
16027i6101A11568D2517J47846A5727K1671a9475i075l976B49277b13621O0245
16016a53376l8920I1424a30895l9691j4484A31127b7767m7952j31297B32166i7235
16004i7108a5884C73025a52002C62600a27629N4541o7739j21477B28432h5484
15993G3153J62689f0763B8242a69687O8672k0152e7851B370K94805A01175a71118
15981D7988J92628o2413N4537e0943A38317b16195A57390K2922e9898b2726k53037
15970b75763B47277a69183p1685B8303h1706B3078N2044J73651a63674A0279J39369
15959A49648b1444j38116b1631m9944I8508d3101B72626p9450a70831d8626A015
15947d06870J27704j96550A23397o502f20C8437f1687n5396j9272A31376D5460
$$ y = [-96101, 111568, 42517, 190363, 15727, 37398, -19475, -9075, -13051, 249277, -213621, -153376, -192296, 91424, -130895, -170586, -185070, 131127, -27767, -75719, -207016, 232166, -97235, -97108, -15884, 373025, -152002, 362600, -127629, -73088, -140827, -262304, 228432, -85484, 73153, 235842, -60763, 28242, -169687, -101015, -121167, -57851, 2370, 297175, 101175, -171118, 47988, 240616, 178203, 232740, -50943, 138317, -216195, 157390, 180312, -59898, -22726, -275763, 247277, -169183, -240868, 28303, -81706, 23078, 75122, 248773, -163674, 10279, 149648, -21444, -159560, -21631, -71575, 98508, -43101, 272626, 193176, -170831, -48626, 1015, -406870, -279166, -475716, 123397, 116895, -620, 38437, -61687, -117083, -136355, 131376, 45460]
15935a56615I6816h0692a9009H3018O5867a8889q833A72958b1380A207g272k32050
15923b39322F7441a56231A30680C8715Q0825a53358g116j08599D7888e7619j17005
15912a74624l00009E1836i6237J3737o4671j7493I8658h3804M1584J638r8216
15901a38798f8862D2693J2745B1799h6470J5029I3619C1781b26796B33135b61982
15889A06977i0816K3199o9994O0503k84685a13912C0008d8095r9731A58678n7921
15878A00757b60147k9680m1272a16113C08548a51591q8072f3580B57769C2315
15867g7499K6242m45E2413b40990b3885C771a42752A89473a53579A02183j751
15856A00432g0044c2545k04639J17947F3477a59400C58265j52986A8608K55907
$$ y = [-156615, 96816, -80692, -19009, 83018, 148885, -18889, -27722, 172958, -21380, 1207, -7272, -239322, 67441, -156231, 130680, 38715, 119540, -153358, -7116, -115715, 47888, -57619, -174624, -474633, 51836, -96237, -82500, -147171, -164664, 98658, -83804, -42220, -40582, -138798, -68862, 42693, 55438, 21799, -86470, -71441, 93619, 31781, -226796, 233135, -261982, 106977, -90816, -67617, -137611, -77108, -361793, -113912, 30008, -48095, -147826, 158678, 100757, -260147, -289827, -331099, -116113, 308548, -151591, -239663, -63580, 257769, 32315, -77499, -51257, -51702, 52413, -240990, -23885, 3771, -142752, 189473, -153579, 102183, 100432, -70044, -32545, -237184, -119237, 63477, -159400, 358265, 205279, 18608, 274515]
15846B74515c11281O3804d9206G4076M5460A3085i9402A92700b3763D3353P5006
15835A18359L9522c8862A20608L06155a37593B63286a02255j9612b1033F2844
15824g8687A59559a33184L7293C5512f001j43069M8824A30070m8581b6154B8181
15812A6864a59706q8426E4112b40719e2620A21687R9245b1140C7593N9632k7779
15801F9446k2585c0870k12139A66617p9752f6151G4257B2127b1782A52879b70646
15789E0704A5685J91957i2732L1945A4569J63688b03066B65016E9896M9932c21518
15777a26653b1272B10234r2770a59855d7653A7241a28349j74663J47052b0670
15766A9030K63141R7113c7801k05878a4243H3020i5706A64052C2286f8688E0734
$$ y = [274515, -311281, -247477, -49206, 74076, 119536, 13085, -99402, 192700, -23763, 43353, 118359, 157881, -38862, 120608, 426763, -137593, 263286, -102255, -121867, -21033, 62844, -78687, 159559, -133184, -95891, 35512, -6001, -149070, -100246, 130070, 81489, -26154, 28181, 16864, -159706, -248132, 54112, -240719, -52620, 121687, 220932, -21140, 37593, 97225, 69446, 46861, -30870, -243009, 166617, 86865, -66151, 74257, 22127, -21782, 152879, -270646, 50704, 15685, 207642, -92732, -60787, 14569, 178257, -203066, 265016, 59896, 109828, -321518, -126653, -21272, 210234, 117464, -159855, -47653, 17241, -128349, -303012, -155960, -20670, 19030, 282171, 379284, -37801, -243679, -14243, 83020, -95706, 164052, 32286, -68688, 50734]
15754f2108o9246j0030D0892a54795J0943n22098a68833d061j44468a3006A00127
15742c31440a39840j17311L9713j65686A07456d95717C9614a48208k9198P2381
15732a05025C5776e5916C5706b3670k21949J19308j54651a02700l1305K7054A64870
15720a47535A34262G59a57590j91378Q5423A88916A5430b63028A16758J32106
15710B48864b57450G0642M3930a8540l52993b4655j34562B06888C4565b20346
15699f0163k39075A11627a34447F008p70g1598L0307I7152P4973a00023m947d6246
15686a53642A75376A8578b41650h4503K1471j34799A08127c3045H6186a13906
15675f8784k62183c821r642E4480J6330C4696K23851b54244I2880a49598j9227
$$ y = [-62108, -131354, -141384, 40892, -154795, -143852, -665950, -168833, -4061, -148529, -13006, 100127, -331440, -139840, -257151, -217438, -383124, 107456, -495717, 39614, -148208, -177406, -105025, 35776, -55916, 35706, -23670, -245619, -126311, -280962, -102700, -134005, -106951, 164870, -147535, 134262, 759, -157590, -348968, -263545, 188916, 15430, -263028, 116758, 248864, -257450, 70642, 114572, -18540, -371533, -24655, -159217, 206888, 34565, -220346, -60163, -299238, 111627, -134447, 6008, 5238, -71598, -41291, 97152, 172125, -100023, -104970, -46246, -153642, 175376, 18578, -241650, -84503, -63032, -197831, 108127, -33045, 86186, -113906, -68784, -330967, -3821, -13463, 54480, 70810, 34696, 258547, -254244, 92880, -149598, -168825]
15664a68825d2099a8222D6675R3910c46331A95005G6225Q4668A431a91288G9371
15652A72449a3745A64993c48673A8297N3425a10851B24954b09652e9871C51190
15641a404j19453j75035e3913A29925N6300c48606c3319A02999a61500G8209k5819
15630E2390b38332N4700N2431M9927d286A27926a61795C79719A57978A421M63048
15619D64469H2035e5733o9854E8385a15438d3300A14832d9905m6535A20058P3183
15608A93241b13251e8825B01453D0845m447a76972N0045B39974c93875b4360B17195
15596a15588F3737J24779a75447A70088a08148k45204a24216A44114A4899a20083
15585B7332J32977L22187a7127B8873J42543h9424A97528c98195a7127N789k0704
$$ y = [-168825, -42099, -18222, 46675, 140585, -346331, 195005, 76225, 160893, 1431, -191288, 79371, 172449, -13745, 164993, -348673, 18297, 71722, -110851, 224954, -209652, -59871, 351190, -1404, -120857, -295892, -53913, 129925, 186225, -348606, -33319, 102999, -161500, 78209, 52390, -238332, -183632, -131201, -81274, -4286, 127926, -161795, 379719, 157978, 1421, 464469, 82035, -55733, -125587, 58385, -115438, -43300, 114832, -49905, -96440, 120058, 193241, -213251, -58825, 201453, 40845, 36398, -176972, -126927, 239974, -393875, -24360, 217195, -115588, 63737, 188516, -175447, 170088, -108148, -353352, -124216, 144114, 14899, -120083, 27332, 160309, 482496, -17127, 28873, 171416, -89424, 197528, -398195, -17127, -11338, -32042]
15574c2042j7907j69346D15846a25074B03869b93682h7903l0803H697d9815B70333
15562a19549l15458E8424c9086A95533m003h1804d0186A68610D0044b94820e8179
15550B16663j06746O3825a29742K631D5877g0960E9163a23097e5241j07831C37393
15538a55379O8119C70216C9568d6482j47020j56325J31903D2051a73361P8502
15528i4859M6323l0321G0248a20210D18500d1307A65322N6500a87532A22591h6514
15516A30158e8558H3378M2663d421D06122n8368E1770J99194l0238a33711k2812
15505a56523n1409f4107A66566R2298a61242a9075I1047J01870n3040a86647Q0734
15494a05913A20870g9327a1823j09794M3664g977B50932d59046a25744B29782
$$ y = [-32042, -49949, -219295, 415846, -125074, 203869, -293682, -87903, -118706, 8697, -49815, 270333, -119549, -435007, 58424, -39086, 195533, 191530, -81804, -40186, 168610, 40044, -294820, -58179, 216663, 109917, 173742, -129742, -127111, 45877, -70960, 59163, -123097, -55241, -163072, 337393, -155379, -87260, 370216, 39568, -46482, -193502, -349827, -217924, 42051, -173361, -94859, -48536, -78857, 70248, -120210, 418500, -41307, 165322, 221822, -187532, 122591, -86514, 130158, -58558, 83378, 126041, -4421, 406122, 347754, 51770, 250964, 220726, -133711, -156523, -207932, -64107, 166566, 258864, -161242, -19075, 91047, 192917, 139877, -186647, -105913, 120870, -79327, -11823, -121617, -77953, -7977, 250932, -459046, -125744, 229782]
15483e6269J4623j4395m0708H3080a56983A22831b32121n2866A3398J2457J40445
15472A66300p9625m0306L29406j75792b06087C8697r003A1598J82833a25668A11898
15460e9206I1540e7563H2161l066J7629a33256A23859L12024B4192K73718c2968
15448A25839A7975P3003M5341E8240a9753A39215b72639B70870J44766b18625
15437d3398j68438j13229a12040K8449B18839D7744j5240L7577J62064j03338
15427A28807a80527j38587e0481j9786A46465n6711J59319C8659a2105j9472A23651
15415f9424j1222j40674h2566l30822A24146n7612e4037C68948j54599q9505J06962
15404B31806g655k62624K0924J19967p3987f5518j13662H9427i092j22015B422
$$ y = [-56269, -41646, -56041, -96749, 83080, -156983, 122831, -232121, -284987, 13398, 25855, 166300, 86675, 46369, 375775, 199983, -206087, 38697, 29694, 11598, 194431, -125668, 111898, -59206, 91540, -57563, 82161, 79095, 96724, -133256, 123859, 435883, 24192, 297910, -32968, 125839, 17975, 90978, 136319, 58240, -19753, 139215, -272639, 270870, 415636, -218625, -43398, -211836, -325065, -112040, -83591, 218839, 47744, 32504, 70081, 232145, 128807, -180527, -319114, -50481, -70267, 146465, 89754, 249073, 38659, -12105, -31577, 123651, -69424, -80646, -221320, -82566, -413388, 124146, 66534, -54037, 368948, 214349, 124844, 231806, -7655, -270279, -249355, -129388, -203375, -65518, -179180, 89427, -9092, -131107, 2422]
15392A26974A4139J68203p1932c90438D3211J54756q1147K0080J13075A24653
15381e9291k24350A28057b63119a21992A47148a69421H2404d80431G6373j2831
15371F3542a66599A00330J16707n617J60604j47976a71236G5439b85173J0929
15361b74244d4972G587J29628J86194a14159C31086A58422c54356B00583A3668
15350C23201F626J59375a00619B01684l5486b64100A07690g2920c4842E0520c25466
15338a4663G1985b10363l0977A1939K5090J3550J8443k5704L6706K31692k0418
15327B91298B8112M2526L15091a61870j1998I6382J76218a67237C6047a06738
15316b49949h373o8379H5578J1326R0608R8126g6384B21387H5520J21858k8851
$$ y = [126974, 14139, 182342, 110410, -390438, 43211, 197967, 116820, 136900, 249975, 124653, -59291, -283641, 128057, -263119, -121992, 147148, -169421, 82404, -480431, 76373, 63542, -166599, 100330, 217037, 211420, 372024, 224048, -171236, 75439, -285173, -274244, -44972, 7587, 137215, 323409, -114159, 331086, 158422, -354356, 200583, 13668, 323201, 6626, 166001, -100619, 201684, 166198, -264100, 107690, -72920, -34842, 50520, -325466, -14663, 71985, -210363, -241340, 11939, 37029, 50579, 69022, 43318, 80024, 311716, 291298, 28112, 70638, 385729, -161870, -173868, 96382, 272600, -167237, 36047, -106738, -249949, -8373, -76752, 85578, 96904, 187512, 285638, -76384, 221387, 85520, 207378, 178527]
15305A78527h4619q1006C68586A77040a65049D2304a29392K2341A73024J5656
15295A88680A7128M43999A85887p0248J89384g0023k33086G7980g7917C55924
15284H5331Q5146h9809A73232H3963a38265A87537K5544K2418b0761A77691H8556
15272F6389K7873f2223k39686a8701B18388i8590B14864P9343A7139K88085A2617
15260A44947l9490C3538g8094A55050c0441B43832p7283f5916A69055H1887B4437
15248F60732L86755J103827j053937O14247m12307o14269F4606J68420k1046a5046
15237a33150A81565P8228f8853k5647a9456A49249E1027N7578K76379D8089L7514
15226H5603J16715D8850O07973a2433C1944O0895O2043K74921k04375P0146C3427
$$ y = [178527, -84619, -165625, 368586, 177040, -165049, 42304, -129392, -107051, 173024, 188680, 17128, 461127, 185887, 115639, 305023, -70023, -303109, 77980, -77917, 355924, 85331, 170477, -89809, 173232, 83963, -138265, 187537, 213081, 235499, -20761, 177691, 88556, 66389, 94262, -62223, -301909, -18701, 218388, -98590, 214864, 294207, 17139, 305224, 12617, 144947, 105457, 33538, -78094, 155050, -30441, 243832, 166549, -65916, 169055, 81887, 24437, 660732, 1047487, 2151314, 1097377, 1711624, 1299317, 685048, 64606, 233026, 211980, -15046, -133150, 181565, 259793, -68853, -94500, -19456, 149249, 51027, 108605, 384984, 48089, 85603, 202318, 48850, 656823, -12433, 31944, 92839, 154882, 429803, 225428, 295574, 33427]
15214b55979B21599h5381A92616R1632C9794a0554j42003A42429J37517A15212
15203C14168r8276A725e0091F0041R1064n4657b2398j94335P9838B56982a12309
15191B50023d8841B21076p0593E5475P0725Q5539o9095k792P1906C1709K39562
15180B71271G1689J60225p365j262g5302H7268P1842e04610B5653J07592K26148
15169C59393C4968K08277F6074J16312M37725j56155A79714J5729j4560b7496
15158c1813C50808e4396B80782A27156M5817L9992j06356b27380h17A15840J29477
15147B45317J07201E9795B5940J43033A13b79234A75886l1435P4092H0957a07069
15135A98725q5245J60297b7119B67139C1271a24289E32160F0593f7251A01176
$$ y = [-255979, 221599, -85381, 192616, 284248, 39794, -10554, -152557, 142429, 279946, 115212, 314168, 215892, 1725, -50091, 60041, 151105, 96448, -22398, -216733, -136895, 256982, -112309, 250023, -48841, 221076, 150483, 55475, 126200, 211739, 142644, 139852, 211758, 31709, 271271, 71689, 231914, 224549, 223287, -75302, 87268, 159110, -504610, 25653, 133245, 359393, 34968, 243245, 66074, 182386, 620111, 463956, 179714, 195443, 180883, -27496, -31813, 350808, -54396, 280782, 127156, 172973, 212965, 106609, -227380, -817, 115840, 245317, 352518, 59795, 25940, 168973, 113, -279234, 175886, 144451, 218543, 80957, -107069, 198725, 113480, 273777, -27119, 267139, 31271, -124289, 532160, 60593, -67251, 101176]
15124A59956P7481j01443K56791q3829a64719A79458L9630I2586J21997A07114
15113C31403I0389N9726O8910E2266L5279a4244B35524a71748C11520j38241K08022
15102C81301R321j04079a06979A22199N7657L4689d8758n3957C63058a75816B67051
15090A65949F9727d7011E01144A47462Q5684h0542j54413B06737o53j01380h1088
15078B37775o2206K64379M9850n1293d013C21164J11279A62406l5805K09983o2057
15067B74527a05595j94122C20142J39846C170J14463O1552M14687E405J42460
15057A47865k6575M437a49854A38560b8709E91471A12273a6087D00966A14245
15046A30200J36063K79763H7720K24979D7110J88890g7386A62278K0145M0146
$$ y = [159956, 237437, 135994, 392785, 308956, -164719, 179458, 219088, 92586, 214583, 107114, 331403, 90389, 150115, 219025, 52266, 87545, -14244, 235524, -171748, 311520, 173279, 381301, 390622, 286543, -106979, 122199, 179856, 214545, -48758, -102715, 363058, -175816, 267051, 165949, 69727, -47011, 501144, 147462, 233146, -80542, -234955, 206737, 206084, 104704, -81088, 237775, 175569, 439948, 489798, 438505, -4013, 321164, 432443, 162406, 126601, 336584, 274527, -105595, -299717, 320142, 459988, 3170, 117633, 179185, 593872, 5405, 147865, 121290, 125727, -149854, 138560, -28709, 591471, 112273, -16087, 400966, 114245, 130200, 266263, 546026, 87720, 312699, 47110, 236000, -77386, 162278, 182423, 222569]
15036B22569L42663E7079K88639j51347G6556L69721A49844P2280k7225M3699
15026B38598L8209d8668B54562e6412A5551i1648B41771F4264J01379E9390J30155
15015A89545G1256K22214n6200I7879M3599l3159a57205C63530J16749E0442e5629
15003C0613P3443J08355q175D4433J11249J99741J6816J21144a9343E3983j0415
14992D3568Q0607J89195J4808p6121J09331A57736D682J93136K7487K265J00619
14981C28189P0609o3287N4907J04873j44656A51512A3889O19515A49503K58901
14971D08404R242j87150K46895k16056m37J64923D7395J77979L88148B47206J27990
14960C75196J6277m5109n7417m632J7589K42401q5909A90759d500C07350L70915
$$ y = [222569, 565232, 57079, 345718, 194371, 76556, 446277, 149844, 222124, 194899, 238598, 276807, -48668, 254562, -56412, 15551, -91648, 241771, 64264, 165643, 59390, 189545, 71256, 293470, 237270, 97879, 141478, 108319, -157205, 363530, 480279, 50442, -55629, 30613, 104056, 212411, 204236, 44433, 155682, 355423, 372239, 493383, -19343, 53983, 43568, 124175, 313370, 328178, 252057, 361388, 157736, 4682, 197818, 225305, 227570, 328189, 398798, 335511, 390418, 495291, 350635, 151512, 13889, 633404, 149503, 408404, 417646, 230496, 477391, 261335, 260898, 425821, 47395, 225374, 613522, 247206, 375196, 391473, 346364, 288947, 284315, 301904, 544305, 458396, 190759, -4500, 307350, 678265]
14949F78265B83105e2989E96076l1579a17264a1571B783N26426B63518J66581
14939D30099A82283L036K07039M4983B12945J61436M0066j91741L9687O5084j46415
14928A81062J88082O4644J56441G3586L73915j55208L23448K4058p9485q8970
14918D71344A90443L6732J82322J83632j39835k0198I879N94521j59057R662N1931
14907E06936J31437k67136J27432A72788O5297K7060r2171o0972L99919j61492
14897C50429L1467O2020K76605B42499j10116J93543P874l7420p2972K68661l0476
14886D61593j70193K72972A54200J02885A22136K60448J78516k19160j01575N74400
14876H14765k13181k93100r5027K73314k24777L3705L39312k23301r5152M06735
$$ y = [678265, 283105, -52989, 596076, 564497, -117264, -11571, 2783, 529209, 263518, 430099, 182283, 185319, 392358, 437341, 212945, 374381, 414447, 222706, 262393, 327477, 181062, 369144, 433788, 590229, 73586, 447501, 292293, 615741, 639799, 560314, 471344, 190443, 227175, 409497, 593129, 453294, 433096, 9879, 604400, 445343, 455005, 506936, 638373, 371237, 498669, 172788, 238085, 265145, 172974, 112002, 511921, 350429, 381896, 443916, 720521, 242499, 132383, 325926, 333800, 296380, 223408, 492069, 461593, 291400, 564372, 154200, 257085, 122136, 382584, 561100, 341940, 240365, 814765, 601584, 308484, 213457, 486771, 261994, 295699, 635011, 411710, 316558, 723293]
14866G23293o5498K98208k89374k14146M1426K98222C80073q9484J43575J7744
14856D51908K33466C37315P6318j80582K33381j14295K36153N1353n8067G7646
14845D62766J23884l0060k45031L65430K8094j15527k25326L63829k28627K06176
14835G05608C08840M03581j3143C03940J99172M4717j32309j00826K45598L849
14825E64141K99814l21149J61760j62155J36134j16240A26995M54845j1802K89698
14815H59736D28777N07031n3370r926l80712J18392K1384L57988k76219k4314
14805F89031j20114k3522k55840M59230k75906O0437J04932K03676l11322k29490
14795C01112L40123k33051K46108k05224K95425k11488R877l4203B08402N39824
$$ y = [723293, 657795, 956003, 666629, 452483, 493909, 792131, 380073, 290589, 434164, 451908, 685374, 337315, 413633, 233051, 466432, 352137, 588290, 639643, 581576, 77646, 462766, 586650, 556590, 311559, 676989, 705083, 589556, 364230, 728059, 499432, 705608, 308840, 712421, 699278, 303940, 503112, 547829, 415520, 314694, 560292, 564141, 863955, 542806, 704566, 542411, 678545, 562305, 126995, 581840, 570038, 859736, 428777, 935808, 882438, 872512, 491800, 610192, 631576, 989564, 713345, 689031, 568917, 545395, 289555, 748785, 472879, 533316, 638248, 841924, 530602, 301112, 641235, 408184, 654292, 449068, 744493, 533005, 542882, 508679, 208402, 748226]
14785G48226j01543B61926L97763J8928j81415Q8738j37571K37541K12033k70459
14775F27484J82040j81143L4776k29646J59830j75589O4655k2474L14485j26489
14765F47929k05796K42999j54486Q794k0721L81872r024j36511j17630m6387R4029
14754F85068L15170m87075N85043j99562j43252l19622O08136r6806l57415L33505
14744I23190k59484J12591n3301L14386o9947k17766J58983j26354R4350q1042
14734G95606J05752q8499j70353K08992j5355j09073j46714K15524j7767J23545
14724I01658J67101k83221M59611l60748j19524P5319J976J2345k95814K34590
14714G93293J21710k087J58427l94044J29896k8923J92659j05095K752L69699
$$ y = [748226, 646683, 261926, 659689, 678617, 497202, 585940, 448369, 685910, 897943, 627484, 809524, 628381, 663157, 433511, 593341, 417752, 482407, 459933, 774418, 647929, 442133, 685132, 530646, 539440, 518719, 900591, 891567, 755056, 637426, 591039, 685068, 1000238, 513163, 1098206, 898644, 755392, 435770, 1043906, 947100, 589685, 923190, 663706, 776297, 722996, 1037382, 967435, 749669, 908652, 782298, 876648, 795606, 901358, 812859, 642506, 851498, 836143, 727070, 580356, 795880, 778113, 901658, 1068759, 785538, 1245149, 884401, 764877, 840196, 842172, 854517, 558703, 793293, 915003, 912916, 1071343, 677299, 807195, 778272, 970931, 865836, 868588, 1238287]
14704A238287m31505J60543m4933M7497R7824j91370l852M94843k98724k4405
14694A044205K57811j74829l04942J13681M0732M1986j57260L56696k69860k395
14684I45825m9269M58935m93355K28690Q4840L97184p42327J11547K75169k83930
14674I33309N7205j35337N19708j73202n1962m0674L97281k75095j6676j56521
14664A058036J10109N0112J42643m13877K03157r2470L40889k404K83418m72341
14654A207272J05602R7280l57628K75908k72668O02662n12025Q13502m75211o0428
14644A424266j84826j58413K44676K0582k9960J18602P6187k37935J34094l5311
14634A371962L28496j60009m15859L30615j6682O5058K61477j72664M12457n07403
$$ y = [1238287, 806782, 967325, 922392, 969889, 1067713, 876343, 872491, 1367334, 1068610, 1044205, 1302016, 1127187, 822245, 935926, 976658, 1018644, 861384, 1218080, 948220, 945825, 896556, 1355491, 862136, 1090826, 1175666, 1572850, 830523, 942070, 1217239, 933309, 990514, 855177, 1374885, 1201683, 1149721, 1109047, 1506328, 1231233, 1214557, 1058036, 1168145, 1218257, 1360900, 947023, 1150180, 1057710, 1398599, 1396195, 1679613, 1207272, 1312874, 1410154, 1052526, 1328434, 1055766, 1658428, 1146403, 1959905, 1484694, 1424266, 1239440, 1081027, 1325703, 1346285, 1316325, 1434927, 1511114, 1273179, 1407273, 1371962, 1700458, 1540449, 1124590, 1455205, 1438523, 1503581, 1765058, 1592394, 2004851, 1497448]
14624A497448j34830L76002l44574J16964J50780j63801K02965o6200p6484l58008
14614A200262M70477J26127R5343j86420K7150j80398M15064k9065j99865j13885
14604A624790K29128j90333J99210o1341r619j15304K39076j35903l1467K76918
14594B025155J71596J7549m25625J85667Q7813l52085R0756L75384j01503J96902
14584B271609j84246M4947k0308l12139p9551N00600P2005l47695M08310l41482
14574B012050J32169m566L75404P3341J27935N1193k71223j64560J72681K87030
14564B791454K01165k53584M4246l4585J29650K84214K36083R1356K07801K02754
14554C900554J4726L60264L99659N63726J047283J927869L756253Q283401J9656458
$$ y = [1497448, 1362618, 1738620, 1394046, 1511010, 1661790, 1497989, 1700954, 1634754, 1558270, 1200262, 1670739, 1796866, 1892209, 1705789, 1732939, 1552541, 1967605, 1938540, 1738675, 1624790, 1853918, 1663585, 1862795, 1801454, 1791835, 1676531, 1915607, 1779704, 1748237, 2025155, 2196751, 2214300, 1788675, 1974342, 2062155, 1710070, 1800826, 2176210, 2074707, 2271609, 2087363, 2132310, 2112002, 1799863, 1720312, 2220912, 2292917, 1945222, 2353532, 2012050, 2144219, 2139653, 2515057, 2588398, 2716333, 2767526, 2496303, 2331743, 2504424, 2791454, 2992619, 2739035, 2783281, 2748696, 2878346, 3162560, 3398643, 3489999, 3697800, 3900554, 3915280, 4275544, 4675203, 5238929, 6286212, 8214081, 11970334, 20253735, 39910193]
14545C9910193J0802234B3053983A1456085E533573k336361m89208k32820k42384
14537B232800r2315j73869N24420o5991j50049K45189j15022J3849j09764M17643
14527B726891r6677l51534K93163L37783k81579K60692l38768J27221K11236L13241
14517C201669m53154M31327l44340J29456Q2408j76095K86106M3707Q5758O7681
14507C354523j43471J1922j10258J49567N37043k78042j57010O7040K4911J23409
14497C579634j66639K90209p3693l6924J14449K53849R58N787k02146J81101K5004
14486C971589P042q6530L45192n7459M3855J37635n3255K9159r8342J54547K48675
14475D642108m13280L10613J2500J9349j67019K81035J94063K44129l2738j4212
$$ y = [39910193, 50712427, 23053983, 11456085, 5533573, 3197212, 2708004, 2475184, 2232800, 2140485, 1966616, 2491036, 2425045, 2274996, 2520185, 2405163, 2419012, 2309248, 2726891, 2630214, 2278680, 2571843, 2909626, 2628047, 2888739, 2549971, 2677192, 2888428, 3201669, 2748515, 3179842, 2835502, 2964958, 3047366, 2871271, 3157377, 3201084, 3286842, 3354523, 3211052, 3222974, 3112716, 3262283, 3799326, 3521284, 3364274, 3431314, 3456225, 3579634, 3412995, 3703204, 3629511, 3592587, 3707036, 3960885, 3961843, 3967630, 3765484, 3946585, 3971589, 3978631, 3892101, 4237293, 4179834, 4223689, 4361324, 4308069, 4337228, 4238886, 4393433, 4642108, 4228828, 4539441, 4551941, 4571290, 4404271, 4685306, 4879369, 5123498, 5090760, 5076548]
14465E076548L5323j01500O1970L26281j51882k40320P30944k55630J98513k8398
14455E651849k63777K01700K15854Q285j02371J16246N00480j69854j73719L92105
14445F376798j89645L46456k22005L4021K99009j26473L86900L6978R9359j61481
14435F879917O3544L91732m9907K37367j79357O8015K76522l6332K91716L20840
14425H264057p3103q7814J62653K05558k10116K14913L77867j81792J48046N28823
14415I349092K692M3755j32336J86130J29278M66491M01125J4982k20956J27579
14405A0367832K89383J86603J62697K30179J86609M14495k52608K35734L50031
14396A2170955K85300N533M55847o8060O51205j05079L53470J98202L9022L25017
$$ y = [5076548, 5111871, 5010371, 5072341, 5398622, 5246740, 5006420, 5737364, 5481734, 5680247, 5651849, 5388072, 5589772, 5805626, 5813911, 5711540, 5827786, 6328266, 6158412, 5984693, 6376798, 6187153, 6533609, 6311604, 6345625, 6644634, 6518161, 6905061, 6942039, 7041398, 6879917, 6943461, 7335193, 7285286, 7522653, 7343296, 7411311, 7687833, 7651501, 7943217, 8264057, 8190954, 8103140, 8265793, 8471351, 8261235, 8476148, 8854015, 8672223, 8820269, 9349092, 9351784, 9395539, 9263203, 9449333, 9578611, 10045102, 10446227, 10461209, 10240253, 10367832, 10657215, 10843818, 11006515, 11236694, 11423303, 11837798, 11585190, 11820924, 12170955, 12456255, 12461788, 12917635, 12849575, 13500780, 13395701, 13749171, 13947373, 13986395, 14311412]
14386A4311412K73232M12468L11673M2065J47838N74920N7213Q56552k46572K91713
14376A7032514N64014l4738N45247K72302M75305J66441J19639Q33641Q1877N08803
14366B0565045N67812O74644K32061L77477P30574Q5461P15538N37197M87039
14357B4972848N82148N91533M47460R63416K31326Q80869N79337O76008Q14125
14348C0739070Q50920P19035Q29803J129841L05364R91713J115802R00544J234961
14339C8817053Q59882J151012J062385J406217J074862J442473J072911J671107
14331D8557902J427902J441317J541808J665036J958212J697375J953796J818147
14323F2061495K021290K162821K452039K251981K552878K870654K262887L573397
$$ y = [14311412, 14584644, 14997112, 15308785, 15350850, 15498688, 16073608, 16130821, 16987373, 16740801, 17032514, 17596528, 17561790, 18107037, 18379339, 18854644, 19021085, 19140724, 19974365, 20056242, 20565045, 21132857, 21807501, 22039562, 22417039, 23147613, 23233074, 23948612, 24485809, 24972848, 25554996, 26146529, 26593989, 27557405, 27788731, 28669600, 29248937, 29924945, 30739070, 31589990, 32309025, 33138828, 34268669, 34574033, 35565746, 36681548, 37582092, 38817053, 39676935, 40827947, 41890332, 43296549, 44371411, 45813884, 46886795, 48557902, 49985804, 51427121, 52968929, 54633965, 56592177, 58289552, 60243348, 62061495, 64082785, 66245606, 68697645, 70949626, 73502504, 76373158, 78636045, 82209442]
14315H2209442K741688L222104L082337L805580L485493M278260M050819M246681
14307A11122404N076436M544793N362856N275087N844371O108225O454080O829126
14299A56617378P301616P393420P968307Q342385R014644R638966R840824J0353055
14291B26470595J1258352J1496967J1883375J2513774J3223138J3495518J4275645
14284C14617364J4149319J4268698J4838190J4754575J4310063J4520786J3846986
14277D15305981J3447402J2133162J0993182R257153O959721L999675J663751
14270D73760027N22854L62092k228289m031620o249666p875386r661701j1356909
14262D33241402j2648977j3850572j5008579j5315438j5391712j5430031j5925618
$$ y = [82209442, 84951130, 88173234, 91255571, 95061151, 98546644, 102824904, 106875723, 111122404, 116198840, 120743633, 126106489, 131381576, 137225947, 143334172, 149788252, 156617378, 163918994, 171312414, 179280721, 187623106, 196637750, 206276716, 216117540, 226470595, 237728947, 249225914, 261109289, 273623063, 286846201, 300341719, 314617364, 328766683, 343035381, 357873571, 372628146, 386938209, 401458995, 415305981, 428753383, 440886545, 451879727, 461136880, 468096601, 472096276, 473760027, 474282881, 474644973, 472416684, 468385064, 462135398, 454260012, 444598311, 433241402, 420592425, 406741853, 391733274, 376417836, 361026124, 345596093, 329670475]
14255C29670475j5434770j3029946j4301470j3836266j3272414j2630653j1710410
14248B35454546j1289029j0954977j0272242r405537r053184q502769q233161
14241A67743647q130919o692936o999832o223833n802147o106217n252046n198135
14233A17337582n036950m230738m068018m177244m103025l707263l377190l460283
14225H5176871l263820k959801k649495l072325k524966j717466k630145k103378
14217F4255475k270739j819966k538620j521906j126317j790052j669511j873806
14209D9644558p96046j882272o40176j152507j925076j275949q64707r85913j225993
14200C8895919o55715p90033j787239r51685p01656p49086q02151m19424p54118
$$ y = [329670475, 314235705, 301205759, 286904289, 273068023, 259795609, 247164956, 235454546, 224165517, 213210540, 202938298, 193532761, 184479577, 175976808, 167743647, 159612728, 152919792, 145919960, 139696127, 133893980, 127787763, 122535717, 117337582, 112300632, 108069894, 104001876, 99824632, 95721607, 92014344, 88637154, 85176871, 81913051, 78953250, 76303755, 73231430, 70706464, 68988998, 66358853, 64255475, 61984736, 60164770, 57626150, 56104244, 54977927, 53187875, 51518364, 49644558, 48848512, 46966240, 46326064, 45173557, 43248481, 41972532, 41107825, 40121912, 38895919, 38240204, 37450171, 35662932, 34711247, 34009591, 33260505, 32458354, 32038930, 31284812]
14191C1284812j008872j136314m95771n24400q36767p07907m88261m60034o17531
14182B5008955n29482o06149m09263l11950n49339o22832m06445m67249n57334
14173B0548912L220j110426J44483n31755n12590p9000p44985k24142j23142j84854
14163A7185721l35287l12091l70555l6557o10632M20m19291l91040k04802k1398
14153A4484488o14799j04891j15284l6089n57471k84100J86477l27002l86614
14144A2244715m4961l68978l08136M27643m96402l07668K8453n08302K31208j71635
14134A0725937k44483k79244J86565n30948l89716L36751l21179j32926O2392
14125I413149m48385M50381j66038m36208k76772K48864k12667P2295l54359J05307
$$ y = [31284812, 30275940, 29139626, 28643855, 28119455, 27282688, 26574781, 26086520, 25626486, 25008955, 24479473, 23873324, 23464061, 23152111, 22602772, 21979940, 21573495, 21106246, 20548912, 20552132, 19441706, 19586189, 19054434, 18541844, 18462844, 17717859, 17493717, 17370575, 17185721, 16850434, 16538343, 16167788, 16131231, 15520599, 15521019, 15101728, 14710688, 14505886, 14484488, 13869689, 13764798, 13649514, 13613425, 13055954, 12771854, 12958331, 12631329, 12244715, 12199754, 11830776, 11522640, 11950283, 11453881, 11146213, 11174666, 10666364, 10897572, 10725937, 10481454, 10202210, 10388775, 9857827, 9468111, 9804862, 9483683, 9350757, 9413149, 8964764, 9415145, 9249107, 8812899, 8536127, 8784991, 8572324, 8644619, 8290260, 8395567]
14115H395567j89077l24054j62741n1528j57211K70313k74910k81799N9375Q0461
14105G364396j54024m24529P5682p0089p2301N3735k20821J92146l94833K2000
14095F371362j55054k22161M61436o17096J41684j14122N3616l63310n826Q1940
14085E632469L02023j93630l12619k92983L54013m893l19322q8151L60334l84609
14075E052632j49094P2693j04289K81108l44966K712l81045K85066j03513l6561
14065D574743l90605M40132k51744r1386j00038J1900k9364k93908K26806K74381
14055D370917p43701M75966j69523m9647k95724K04122J70111k69121J02982l65334
14045C431048L56889J6611j38749l48176O54205n63305L34922m82127N7748M320
$$ y = [8395567, 8206490, 7882436, 7719695, 7668167, 7510956, 7781269, 7506359, 7224560, 7283935, 7364396, 7210372, 6785843, 6861525, 6791436, 6719135, 6772870, 6552049, 6744195, 6349362, 6371362, 6216308, 5994147, 6455583, 5838487, 5980171, 5866049, 5919665, 5556355, 5550529, 5632469, 5934492, 5740862, 5428243, 5135260, 5489273, 5484380, 5165058, 5076907, 5437241, 5052632, 4903538, 4976231, 4871942, 5153050, 4808084, 4810796, 4429751, 4714817, 4611304, 4574743, 4184138, 4624270, 4372526, 4281140, 4181102, 4193002, 4163638, 3869730, 4096536, 4370917, 3627216, 4103182, 3933659, 3884012, 3588288, 3792410, 3962521, 3693400, 3796382, 3431048, 3787937, 3804548, 3665799, 3317623, 3971828, 3408523, 3743445, 3261318, 3319066, 3323386]
14035C323386K13009k05851j3909l8946J94072j97483p0651K4109J12130M90971
14025C830837q03305O7528l0133j22263J96812k41515p1598J07194k44920L09321
14015B997958k09261R2459q2501k46975J88079L3512l25724o2629L00204j85318
14005B499804J09391j72494O0854r7440L0592k98474J62309L6047L13851l58257
13995B286183o1045k46831J90568J35621K29250k5443J135805L056330O459183
13986A3159621J8414932K1660518k5089337j3996958n294432k395274j433688
13979E025382l66275p37251j79964m47510j03874J02889p4340l37970l56322L70411
13969B895176r9342j95727Q0320k0566j92277J08791l45280O1460L37059n83703
$$ y = [3323386, 3536395, 3330544, 3316635, 3277689, 3471761, 3274278, 3203627, 3227736, 3339866, 3830837, 3027532, 3095060, 3064927, 2942664, 3139476, 2897961, 2826363, 2933557, 2688637, 2997958, 2788697, 2881156, 2798655, 2551680, 2739759, 2773271, 2447547, 2384918, 2685122, 2499804, 2609195, 2436701, 2497555, 2400115, 2430707, 2132233, 2294542, 2330589, 2644440, 2286183, 2225138, 1978307, 2168875, 2304496, 2533746, 2508303, 3644108, 6700438, 13159621, 31574553, 53235071, 28145734, 14148776, 8854344, 6459070, 5025382, 4659107, 3921856, 3741892, 3294382, 3190508, 3293397, 3219057, 2881087, 2524765, 2895176, 2795834, 2600107, 2680427, 2659861, 2467584, 2576375, 2231095, 2292555, 2629614, 2045911]
13959B045911K08185J53644l02014m8866l3642L5765K17803K9039k08075K4214
13949B121964J46316k78602p9124K12233R1688l0889J55837j51240l53704K94676
13939B129155m52648L34577m364m51597L69305P114J8503k17222J37920k0782
13929A849961l70583N46379l34301k98618M94958q5206j69056L70664j83224J17376
13919A938350k94240j80583Q4882N6248k7394P3700j74175J05458k81340N09037
13909A809943l1667j72062j51589K31852j83801o9547j13298J26438J33505n23459
13899A056315L56073l5416J31042j32007l42087K22281q2440J40474j6267K18702
13889A516670J4692j82872j2155j42340j43706L30829j86192L3918J58306j59746
$$ y = [2045911, 2254096, 2407740, 2105726, 2056860, 2023218, 2058983, 2276786, 2305825, 2097750, 2121964, 2268280, 1989678, 1910554, 2122787, 2214475, 2183586, 2339423, 2188183, 1834479, 2129155, 1676507, 2011084, 2006720, 1555123, 1924428, 1931542, 1950045, 1732823, 1870743, 1849961, 1479378, 2025757, 1691456, 1392838, 1887796, 1802590, 1633534, 2004198, 1820974, 1938350, 1644110, 1463527, 1548409, 1604657, 1577263, 1650963, 1476788, 1582246, 1300906, 1809943, 1778276, 1606214, 1454625, 1686477, 1502676, 1433129, 1319831, 1446269, 1579774, 1056315, 1412388, 1376972, 1508014, 1376007, 1033920, 1256201, 1173761, 1314235, 1297968, 1516670, 1531362, 1348490, 1336335, 1193995, 1050289, 1381118, 1194926, 1228844, 1387150, 1227404]
13879A227404o9445K4072J71655l49725P7954q3426P9425J64238j98761J11261
13869A154652j28807L90824m31210j78214M85094J47776l68505N1389K84361p2053
13859A335307r6987l31641K3108P847K12112k70709K8376L84777m60068J33799
13849I65921L11555j88282k09305K41329R8983j70431r971R7337r2463k08956
13839H35717J98362j25325M1737M4176K18740j40875l0745m0357K46852j36463
13829A111819L22526k96938l10200m962L13352k27342m1883J70681j88733J36887
13819I85207k43807K15598J43443R0855j36932j44405j63937K12221J51484E39167
13808H22012j63058K3622K7883N02429m01368q9284k7153j23247M89105O6591
$$ y = [1227404, 1157959, 1182031, 1353686, 1003961, 1081915, 998489, 1077914, 1242152, 1043391, 1154652, 1025845, 1416669, 985459, 807245, 1292339, 1440115, 1071610, 1122999, 1407360, 1335307, 1238320, 906679, 929787, 937634, 1149746, 879037, 907413, 1292190, 832122, 965921, 1277476, 1089194, 879889, 1121218, 1220201, 1049770, 1039799, 1137136, 1044673, 835717, 1034079, 908754, 950491, 994667, 1213407, 1072532, 1041787, 1001430, 1248282, 1111819, 1434345, 1137407, 827207, 822245, 1135597, 908255, 866372, 1037053, 848320, 985207, 741400, 956998, 1100441, 1191296, 1054364, 909959, 746022, 958243, 1109727, 539167, 822012, 658954, 682576, 710459, 1212888, 811520, 722236, 695083, 571836, 1060941, 1127532]
13798A127532m00030m5271J73593M0481M4356k05080p5777J79733k21171J98525
13788H16891P9698r224J50986j10779Q7239k32253l2469j40972J25860K69221
13778A004198j38992r8267J40471l88204P44788n23718K04671j91423j47809L14926
13768I20641C55160L70965P5851k25853J16534o7350K60870j92617Q9832J13721
13758H97113m01717K88201K35598D09837J36569P5866M1415K6692O2816m9351
13748G03844l20915L23413j31242L68417l90924K23773j96246K89723m25798N5661
13738D99706J45836K76041k08616L26370j34667B77733K17074L07969j34032k4986
13728F43758L3226j77384J25954k5211J39673j98676O9771r850L60591m73095
$$ y = [1127532, 727502, 682231, 855824, 896305, 940661, 735581, 659804, 839537, 618366, 816891, 896589, 887365, 1038351, 927572, 1014811, 782558, 750089, 609117, 734977, 1004198, 865206, 766939, 907410, 519206, 1263994, 740276, 944947, 753524, 605715, 920641, 355160, 726125, 801976, 576123, 692657, 625307, 886177, 693560, 783392, 897113, 495396, 783597, 1019195, 409837, 546406, 622272, 663687, 690379, 753195, 703844, 382929, 706342, 575100, 943517, 552593, 776366, 580120, 869843, 444045, 499706, 645542, 921583, 712967, 1039337, 904670, 277733, 494807, 802776, 668744, 643758, 676984, 499600, 625554, 600343, 740016, 541340, 611111, 601261, 961852, 488757]
13718D88757K5536N2678K34028C60092J94818J3488M0728J80620l61336R7957
13708E26367k53881L12503K52783l28428J20392L45945m80752O2138J6621L1503
13698F05191K7994j65667N1729k3089P6413J59845K457k22965J83143k02765n7076
13687D35210N9470L14510k64550B61143P0519J28093J51997j6838B75276L94082
13677F69358j41343N3197o5450j5484K73149l45951J21572m1676B26282L28512
13667E54794K55176k04314k98803Q9916l4839p9357J65726J00595J41633q2901
13657F07626A95104M67743B29458K9038N5163J03556J27185o3833J60508p1925
13647E69150K600n2464B19992A06282P18288q9204H8087O14797n0229A69394J36242
$$ y = [488757, 514293, 566971, 800999, 360092, 554910, 568398, 609126, 789746, 428410, 526367, 272486, 584989, 837772, 509344, 629736, 975681, 494929, 557067, 573688, 605191, 633185, 467518, 519247, 496158, 572571, 732416, 734873, 511908, 695051, 492286, 435210, 494680, 809190, 544640, 261143, 331662, 459755, 611752, 594914, 275276, 669358, 528015, 581212, 515762, 500278, 773427, 427476, 549048, 507372, 226282, 554794, 809970, 605656, 306853, 396769, 361930, 282573, 448299, 548894, 690527, 607626, 195104, 662847, 229458, 258496, 313659, 417215, 544400, 480567, 641075, 569150, 571750, 519286, 219992, 106282, 824570, 735366, 88087, 702884, 652655, 169394, 305636]
13636C05636J38679R7155K01605k88126R8462n5119k08709R3193q4143K97023
13626E95656k37872K12763K02033l28421J11215p7061j40474k0903J06841j30678
13616B93099R9953A30466N56220l42880O8954A94133K11564J44234j87016p8967
13606B83948r3369O31522B83114M3623j29168N50628l36968L6095j19732A20378
13595B15079j9200K34025j61320R189l9374N18404B39348J75202j90336J99773
13585D23987A95477L83279j49006n5736M5902j7037E3567J87255J40186j66564
13575B14444M09589B14008L72408k51005o608A07039J06516J39100p7251K42676
13565E18080M9357k82081O723J19656J93122B86108r5213K12401j30631P4516
$$ y = [305636, 444315, 541470, 743075, 454949, 553411, 498292, 289583, 382776, 298633, 595656, 357784, 570547, 772580, 444159, 555374, 478313, 337839, 316936, 423777, 293099, 393052, 130466, 686686, 343806, 412760, 194133, 405697, 549931, 362915, 283948, 190579, 822101, 283114, 326737, 197569, 748197, 411229, 447324, 327592, 120378, 215079, 195879, 429904, 268584, 277773, 238399, 756803, 239348, 414550, 224214, 423987, 195477, 578756, 429750, 374014, 419916, 402879, 53567, 240822, 381008, 214444, 624033, 214008, 586416, 335411, 328803, 107039, 213555, 352655, 275404, 518080, 567437, 285356, 292079, 411735, 604857, 286108, 190895, 403296, 272665, 347181]
13555C47181J40336L75103m02485j19383q0971N4645A6934M01658j46889J12792
13545C84495j63579k2697l8425j2656J36373R7574j6008K2896K4825l5385p4390
13534C03023j18746L80318j81775k9234l1698J12187J3856A60528N6900N99628
13524H17056c2191D84978A69796K28699r8851E2783K43175n974j9461O8232A2431
13512C72168A74240m1569J50512o8848i6371C82199A82737K2679J25178j05556
13502B25038K92979r2613p6862j712P4326g0660A13879L10479j51361q6701l8528
13491A47768P8275b0938I0627L82600k11004a57104D2529O02631l19699G3643
13480B24965o4037H0149P7961j0134E7514L05J34102J02464a71490C12638A12267
$$ y = [347181, 487517, 862620, 460135, 340752, 259781, 314426, 16934, 418592, 271703, 384495, 220916, 198219, 159794, 147138, 283511, 381085, 365077, 387973, 412798, 377413, 303023, 184277, 564595, 382820, 353586, 321888, 434075, 447931, 160528, 217428, 817056, -32191, 484978, 169796, 398495, 299644, 52783, 295958, 289984, 270523, 338755, 12431, 372168, 174240, 132671, 283183, 214335, -96371, 382199, 182737, 205416, 330594, 225038, 518017, 425404, 348542, 346830, 421156, -70660, 113879, 424358, 272997, 186296, 147768, 226043, -20938, 90627, 473227, 262223, -157104, 42529, 645160, 325461, 73643, 224965, 160928, 80149, 158110, 147976, 57514, 57819, 191921, 294385, -171490, 312638, 112267]
13468B16520J23141j48919R5316n3001k7238b732B20523r9151l2963R299J81922
13457B79630c3295B92549a1844A15195J38805L15794B83651k4277A12750R2051
13447B04801K67724R799J16270B83277j25442J90366J78400l1230J1806k09837
13437B97340j39862J42472A2076N1480K1437L43742F8779K88334K4271J5132A6239
13425B13694i9923d5604G5636j6087K69364J86363A90930G5739j8363J49206F0121
13413B63669o2164G8329K4863C4279R0848N38179k56673A7407O11662A20323a11868
13401D72286j34047f6414D3793K8362a35083a6617G1855O4002n2068K40714D1151
13389A28531J62827r7730K7914H6516L81819A8348N10272l4947a55912a3466B76936
$$ y = [216520, 339661, 190742, 286058, 233057, 205819, -2732, 220523, 121372, 88409, 97708, 279630, -33295, 292549, -11844, 115195, 254000, 569794, 283651, 259374, 112750, 204801, 472525, 482324, 598594, 283277, 157835, 348201, 526601, 495371, 507177, 297340, 157478, 299950, 12076, 63556, 84993, 428735, 68779, 357113, 381384, 396516, 16239, 213694, -99923, -45604, 75636, 59549, 328913, 515276, 190930, 75739, 57376, 206582, 60121, 263669, 201505, 78329, 103192, 34279, 125127, 663306, 406633, 17407, 629069, 120323, -111868, 472286, 338239, -66414, 43793, 72155, -135083, -16617, 71855, 135857, 83789, 324503, 41151, 128531, 291358, 193628, 221542, 86516, 468335, 18348, 528620, 493673, -155912, -13466, 276936]
13377C00774P9471A22282Q0578B3604L53686J18021A52008L0950L4196J89953
13367D07107H6717N1212J61646A38768o5813K11224I7354J26605J83578l8837
13357C68700k1613r1759K85042A65950J10526h3036C94998A19997l3278J55640
13347B42359R3695m7540R7657I5989J77795J84836K5367J9508o4000c3134D11178
13335C33357j51582P4755F9485J48633j04758a9395A66576J93422j04055a5366
13324F2568K68429H7211L3746f7450C8722K21728J86376j78332O3287q3497A904
13312B89806g0595B88100f6801K5603B18982P6672J69579a09129B48210q1368
13302A66842J09024E4817a97473a6848p7461F4924J842L73264g4759k66181B8397
$$ y = [300774, 380245, 122282, 202860, 23604, 377290, 495311, 152008, 182958, 217154, 407107, 86717, 137929, 299575, 138768, 72955, 284179, 97354, 223959, 407537, 368700, 347087, 255328, 540370, 165950, 276476, -83036, 394998, 119997, 86719, 242359, 336054, 288514, 386171, 95989, 273784, 458620, 483987, 503495, 439495, -33134, 411178, 333357, 181775, 256530, 69485, 218118, 113360, -19395, 166576, 359998, 255943, -15366, 62568, 330997, 87211, 120957, -67450, 38722, 260450, 446826, 268494, 331781, 248284, 1904, 289806, -70595, 288100, -66801, -41198, 218982, 295654, 465233, -109129, 248210, 166842, 275866, 54817, -197473, -16848, -94309, 64924, 66766, 440030, -74759, -340940, 28397]
13290A38737j1889d0722k60606A14391J81901A01191K92272b85903C01221o7080
13280B34141l1411A478K36741K4143n9252a32667d0283A96137J771G5517a91890
13268B55829k2836J90215b4036N97H7009Q0512d1143D20781j92465F2588L26613
13257C89201j31463f3210A29200K60051A43933g1888A29156h2736A22661e4285
13246A13105j2326P5058G3804N4815b119H9701P0844g1172B88749k4361K5069
13235B89457J0551A27405K27872D7358K0235M1114L8693D7004L30773A42575c08844
13223D38133j71655j20250K9641M1234H7767J03205g9440A08444R073b62402E5680
13211F1432J08549m6760m3060k0370K0183J8399g0048C20440b51868O9673g8499
$$ y = [138737, 126848, -40722, -301328, 114391, 296292, 101191, 393463, -285903, 301221, 234141, 202730, 1478, 238219, 262362, 203110, -132667, -40283, 196137, 197908, 75517, -191890, 255829, 232993, 423208, -24036, -23439, 87009, 167521, -41143, 420781, 228316, 62588, 389201, 257738, -63210, 129200, 389251, 143933, -71888, 129156, -82736, 122661, -54285, 113105, 100779, 175837, 73804, 128619, -2119, 89701, 160545, -71172, 288749, 264388, 289457, 300008, 127405, 355277, 47358, 67593, 108707, 147400, 47004, 377777, 142575, -308844, 438133, 266478, 146228, 175869, 217103, 87767, 190972, -79440, 108444, 117517, -262402, 55680, 61432, 169981, 123221, 80161, 59791, 79974, 98373, -70048, 320440, -251868, -182195, -78499]
13199A13784A9635a41180B01956I0440K4295b14208B6328a3865M446k34003E960
13187C68106E5161Q6849o2017C8791J68835D2861J44932c4498B02575h5159C91795
13175A27497n2070J69930L2279a20282I7030J33265J09009a5485G5024B9191J19260
13164A48451J96861j40663h996D25197c4116B64068b73839D2485R3609K1635L20126
13153D77855k09076C6153J40091R0210F331b68588B01722b12056A37610N6884
13143A94494B2144d9722B18104r5173O088D2632J55958o2023c02196h183C48658
13131h0704A05747K06105F1069J20153J75772b9914o3696L5850A8901M2339K8758
13120H9998J40296C7050J33609J17237j10795D1585R9900K15552a44632A34414
$$ y = [113784, 19635, -141180, 201956, 90440, 114735, -214208, 26328, -13865, -9419, -243422, 5960, 368106, 55161, 142010, 79993, 38791, 207626, 42861, 187793, -34498, 202575, -85159, 391795, 127497, 75427, 245357, 277636, -120282, 97030, 230295, 339304, -15485, 75024, 29191, 148451, 345312, 204649, -8996, 425197, -34116, 264068, -273839, 42485, 136094, 157729, 477855, 268779, 36153, 176244, 266454, 6331, -268588, 201722, -212056, 137610, 194494, 22144, -49722, 218104, 122931, 129019, 42632, 198590, 136567, -302196, -8183, 348658, -80704, 105747, 311852, 61069, 181222, 356994, -29914, -93610, -57760, 18901, 61240, 89998, 230294, 37050, 170659, 287896, 177101, 41585, 141485, 357037, -144632, 134414]
13109B763J33573E7067B4092c9448B66983H5943B578J87320c49124A40317K99341
13098D39658b8198D44838a25518j81406B22774G8427L35170a49281A4757K89636
13088C04393h9506H3862K35418g2213k9313j11525A75588a65926N3644k44214
13078c56496A71847a31632J8393H5611a09745A39948a51851B39019f2381B29696
13067A66216r327K1435I707a94571H2832N1816J0608a64730A51231K89977j78333
13056B62875I7088f3370C26734o4072a2216C44915D9581a0305C15476j24815I2589
13044a13187C012J86841G2842J99775a23593A84873q0172a07576H0427A7077J10829
13033A27906P2510n1079a04856B02766C4879M9014C596K26708A7939a06449C38723
$$ y = [2763, 136336, 57067, 24092, -39448, 266983, 85943, 2578, 189898, -349124, 140317, 439658, -28198, 444838, -125518, -306924, 222774, 78427, 413597, -149281, 14757, 304393, -89506, 83862, 319280, -72213, -101526, -213051, 175588, -165926, -112282, -356496, 171847, -131632, -113239, 85611, -109745, 139948, -151851, 239019, -62381, 229696, 166216, 156889, 178324, 9707, -194571, 82832, 134648, 145256, -164730, 151231, 441208, 262875, 97088, -63370, 326734, 262662, -12216, 344915, 49581, -10305, 315476, 190661, 92589, -113187, 3012, 189853, 72842, 272617, -123593, 184873, 104701, -107576, 80427, 17077, 127906, 200416, 149337, -104856, 202766, 34879, 83893, 3596, 230304, 17939, -106449, 338723]
13021c1413q1491B77948c7357l4891M786A41419c51074B23079A01570J32428g2112
13009A52699J86550a24798B34234j01984k8072g5383m8047B87621H0077K19610
12999B99687A32997J08723F4803L086B4237b72634m1978C2632J34300a40128B13537
12987d1392C07059p5266C0687d0938k13915b7602B97492C401J08053l752a33222
12975a81616f3526b0927F0607j840p688Q0734c85737D09288H0739f5684A94499
12963b80167d9479j46569Q8010B46430L627I0248a17532D0620L9162h4138A40383
12951a09242A8466b48754L4890G4136k6428e8692n0672c2012B59221F2344N1627
12940A13971J15547k2192g5288l9762k0943F015J36720K2165l9244O636b1796
$$ y = [-31413, -112904, 277948, -37357, -72248, -67462, 141419, -351074, 223079, 101570, 233998, -72112, 152699, 339249, -124798, 234234, 132250, 104178, -75383, -123430, 287621, 80077, 299687, 132997, 241720, 64803, 67889, 24237, -272634, -314612, 32632, 166932, -140128, 213537, -41392, 307059, 231793, 30687, -40938, -254853, -27602, 297492, 3401, 111454, 107702, -133222, -181616, -63526, -20927, 60607, 58767, 51079, 131813, -385737, 409288, 80739, -65684, 194499, -280167, -49479, -196048, -108038, 246430, 250057, 90248, -117532, 40620, 79782, -84138, 140383, -109242, 18466, -248754, -213864, 74136, 47708, -58692, -109364, -32012, 259221, 62344, 113971, 229518, 207326, -75288, -115050, -135993, 6015, 142735, 164900, 125656, 132292, -21796]
12928E1504a16296A11011J68262a36684j6015M4527j35210F9226a47692G0897
12917A89682H8760J0260J20046g1232k01887B98621f656A08827l4001a30956F4042
12905B04634a66213g692m1091A17255h3120C28422b28824I3680K31577a1562n6975
12894f8537E065d0702q7629C88597a82164r0256B45605J7671B3633K33379A13436
12882B6785K08714g0387F6714B4529d0441p8143C45427j16547c43548B26861M6633
12871B73494E7053J12149k5666m7035L14889j03141A27355B0659C767M55591j94360
12860B64998A11194K5131a24515j31138C66579b444A63073d28045d9429J1071
12850c8358k8439D1665b5720A77049R2792G2891a08585C8357N6197K7758M923
$$ y = [51504, -116296, 111011, 279273, -136684, -152699, -108172, -243382, 69226, -147692, 70897, 189682, 88760, 99020, 219066, -71232, -273119, 298621, -6656, 108827, 74826, -130956, 64042, 204634, -166213, -7692, -48783, 117255, -83120, 328422, -228824, 93680, 325257, -11562, -68537, 5065, -40702, -128331, 388597, -182164, -272420, 245605, 263276, 23633, 257012, 113436, 26785, 235499, -70387, 66714, 24529, -40441, -118584, 345427, 228880, -343548, 226861, 273494, 57053, 169202, 143536, 96501, 411390, 308249, 127355, 20659, 3767, 459358, 264998, 111194, 136325, -124515, -255653, 366579, -2444, 163073, -428045, -49429, -38358, -66797, 41665, -25720, 177049, 269841, 72891, -108585, 38357, 94554, 122312, 127235]
12839A27235a44115B1206a4031B40035J30501b23278c4918R602B25842d301m5545
12828d9846I1178j8474a28180D8892A0865a01075o2400B3393Q7025I132K27004
12817B36136c59601a3642A5926c07076a5581l8907A53958a09057J1938J8318A91555
12805A8062a25830D1978J55029g9970B344L4827J47632e4758j24455g1510D30214
12793a55363m070m3829C7520a14189k29639H4870A7646a88326j736d181A17176
12781A66246J08242b20772J0230A4668c63194c8745q4062A20597d851A07714L4632
12770A42346H441a05956l6170c8851j09593E2398e4166r8132A13713g1094l662
12759g4756l66015a53777A41219a9377k2462A34814c9779k01185c9231F9274a15563
$$ y = [127235, -144115, 21206, -14031, 240035, 370536, -223278, -34918, -25316, 225842, -4301, -49846, 91178, 72704, -128180, 48892, 10865, -101075, -163475, 23393, 110418, 9132, 236136, -359601, -13642, 15926, -307076, -15581, -54488, 153958, -109057, -97119, -78801, 191555, 18062, -125830, 41978, 197007, -79970, 2344, 37171, 184803, -54758, -179213, -71510, 430214, -155363, -159433, -203262, 37520, -114189, -343828, 84870, 17646, -188326, -190062, -4181, 117176, 166246, 274488, -220772, -210542, 14668, -363194, -38745, -122807, 120597, -4851, 107714, 142346, 8441, -105956, -142126, -38851, -148444, 52398, -54166, -152298, 113713, -71094, -74756, -440771, -153777, 141219, -19377, -41839, 134814, -39779, -240964, -39231, 69274, -115563]
12747h424H0565J5530b1375B2139k01K63967A29307A7027a32928d6686a943m7792
12735d9735A38552L28604m4054A63211C2544b31314e6043C42926a37430B61213
12724D3008J03410G777i9040C2200a83590B68239I3223a14717r3644D1902D574
12712f2206b0143A14161m3628d4383a9094j37589C81276j30a71204A46994B0459
12700C5040e394j6697B58429g6610C42073F58L4679K73777B6585b36288C6662
12688A4025c04357A32440c12159d4731r260a97B76022c0021B09071A6310J78061
12677A94371P5599i7247C39502a62369A73882h4573A82835b344p4840q5421B07836
12665E6388b63169f5620A9954i6686A05591J64143A22187J59993M5733G2533K55742
$$ y = [-8424, 80565, 96095, -21375, 22139, 21938, 285905, 129307, 17027, -132928, -46686, -1943, -49735, 138552, 467156, 423102, 163211, 32544, -231314, -56043, 342926, -137430, 261213, 43008, 146418, 7777, -99040, 32200, -183590, 268239, 93223, -114717, -208361, 41902, 4574, -62206, -20143, 114161, 70533, -44383, -19094, -156683, 381276, 381146, -171204, 146994, 20459, 35040, -5394, -22091, 258429, -76610, 342073, 658, 35337, 309114, 26585, -236288, 36662, 14025, -304357, 132440, -312159, -44731, -53991, -197, 276022, -30021, 209071, 16310, 194371, 269970, -97247, 339502, -162369, 173882, -84573, 182835, -2344, -77184, -162605, 207836, 56388, -263169, -65620, 19954, -96686, 105591, 269734, 122187, 282180, 327913, 72533, 328275]
12654C28275A1600J78446L14627k42021o7517D8671b22635j74081h0897D8233
12643F6085b17078H1721a41085H5143J03478m7799q916K07377g5127B47152D2307
12631A46357m1125k8968j8272K73113N3846a46693a2195p367A59578d488D3082
12619A39257J98356j47446d1036p5408D5271K99959i2361I5315f5074B200f3777
12607a34727L7421B5840Q7011K07165g8754b3681C3838c1525A00870N0357a28181
12595F6370B3883I760N7868e22327a16120o1031E971e1972j60422E5954K58394
12584C14348a35424A2873c02529A81765i6587q4371N2801A14115a14293A58175
12573A51428G1680J47744c45400H7294J13347E9552N6598O1749n1566i4798k3766
$$ y = [328275, 11600, 190046, 504673, 262652, 195135, 48671, -222635, -396716, -80897, 48233, 66085, -217078, 81721, -141085, 85143, 188621, 140822, 131906, 339283, -75127, 247152, 42307, 146357, 105232, 76264, 57992, 331105, 384951, -146693, -12195, -19562, 159578, -4488, 43082, 139257, 337613, 190167, -41036, -116444, 45271, 345230, -92361, 95315, -65074, 2200, -63777, -134727, -97306, 25840, 112851, 320016, -78754, -23681, 33838, -31525, 100870, 151227, -128181, 66370, 23883, 9760, 67628, -522327, -116120, -177151, 5971, -51972, -212394, 55954, 314348, -135424, 12873, -302529, 181765, -96587, -180958, -128157, 114115, -114293, 158175, 151428, 71680, 219424, -345400, 87294, 200641, 59552, 116150, 177899, 126333, -94798, -118564]
12562a18564A95033n2409o8990g8605A08738b094A40724I952b47195P4020N4105
12551a19070A11924J75711A14967O6497m4129d59932A54562K89881g8486J5942
12541f2544R609G5777a68016A03543k4483g476l75696b3676A6194c33901e760
12529E3906J33788i7690L3101A42257J93729N8010c6167B60963b39775D9706J12062
12518A61768J09331c32103C0842j1719i18j09856j68014d0984k31729H2719Q1640
12507A64359o2806J0991l0239d6081j8066A97525I6944b7097g620A88884C3425
12495a74898k19012E5783J18651a30735H7670L4434e6878A97326K34334j88086
12485B43574l6914E649K6259e0382K4997j35479f8433k1433C09567j36772k5795
$$ y = [-118564, 195033, 142624, 73634, -78605, 108738, -2094, 140724, 9952, -247195, -173175, -119070, 111924, 287635, 114967, 181464, 137335, -459932, 154562, 444443, -78486, -62544, -52935, 75777, -168016, 103543, 79060, -7476, -383172, -23676, 16194, -333901, -5760, 53906, 187694, -97690, -64589, 142257, 335986, 393996, -36167, 260963, -239775, 49706, 161768, 271099, -332103, 30842, 19123, -918, -110774, -278788, -40984, -272713, 82719, 164359, 101553, 112544, 82305, -46081, -64147, 197525, 96944, -27097, -7620, 188884, 33425, -174898, -393910, 55783, 174434, -130735, 87670, 122104, -56878, 197326, 431660, 243574, 206660, 5649, 31908, -50382, -25385, -160864, -68433, -89866, 309567, 172795, 147000]
12474A47000b75720E7265b8903I0194b18246B4860J39081K9236h3327o8877J3212
12463a38992c7137l0662D4257P8542P3707H3543a0788j37950A10121E3038d7945
12451a12013D4306d5752k36249i9613A22055k5670B856c7228A60489a33781H693
12439b34220A20244f2910C9596d69396A30065K38927H7879b00349D19732b59456
12428c46400A13486a8759A07199A8520P8809b50619R4420a1162p7388M333j78736
12417b62953a16476k69694H0492b11987C84043f8379B37887m6708Q2747b18914
12406d8993B81813F6314K01576a12236k7872D55159A619J13277e869j62290H2085
12394B14526J63132a20948K706B1131J96962N955q0541b36499A91459c34115I6277
$$ y = [147000, -275720, 57265, -28903, 90194, -218246, 24860, 163941, 193177, -83327, -152204, -138992, -37137, -67799, 44257, 122799, 196506, 83543, -10788, -148738, 110121, 53038, -47945, -112013, 44306, -45752, -282001, -99613, 122055, 96385, 2856, -37228, 160489, -133781, 8693, -234220, 120244, -62910, 39596, -469396, 130065, 368992, 87879, -200349, 419732, -259456, -346400, 113486, -18759, 107199, 18520, 97329, -250619, -156199, -11162, -88550, -84217, -262953, -116476, -386170, 80492, -211987, 384043, -68379, 237887, 191179, 273926, -218914, -48993, 281813, 66314, 267890, -112236, -140108, 455159, 1619, 114896, -5869, -168159, 82085, 214526, 377658, -120948, -118242, 21131, 218093, 224048, 143507, -236499, 191459, -334115, 96277]
12382a54048f8606I1006P8815a39929G9370g1549A71512G4914g007A05872K39217
12371C45089c35084K0778J56432A20958h4952b3123A16695C6204J1609K8775d2288
12359F6117K60722b77635A72504J65334j43301A0904b8407k6855J9813D0599A9492
12347b7853j10323A56761D7249J80618B5706L18869m3529L8124G2473c8560q5817
12336a24377B1101J11081B2932J89448d851j53925F2235a85873B57598a14062
12325c9890J8473l18117a04849j9132q7012R1552j87585I147a4346k73214H6434
12313a01328k00167A83818G747a06832P479C29125g7048l4640M7654B56148a20661
12301b86559E4882c41193G0944k1531J14528K3551b26242K6392C11716b27261
$$ y = [-154048, -68606, 91006, 169821, -139929, 79370, -71549, 171512, 74914, -7007, 105872, 345089, -335084, -314306, -157874, 120958, -84952, -23123, 116695, 36204, 47813, 76588, -42288, 66117, 326839, -277635, 172504, 337838, 194537, 10904, -28407, -55262, -35449, 40599, 19492, -27853, -138176, 156761, 47249, 227867, 25706, 344575, 301046, 339170, 72473, -38560, -124377, 21101, 132182, 22932, 212380, -4851, -158776, 62235, -185873, 257598, -114062, -39890, -21417, -339534, -104849, -123981, -210993, -119441, -307026, 9147, -14346, -287560, 86434, -101328, -301495, 183818, 7747, -106832, -99353, 329125, -77048, -111688, -64034, 256148, -120661, -286559, 54882, -341193, 70944, 49413, 163941, 187492, -226242, -199850, 311716, -227261]
12290I6725l4092g2283K2545B27743a2379a622k85252B7163K88405j22490J97689
12279C90767e3123H8199a8979B68035a49336G5175P7419a98306B02003b31506
12268A2788o259O6250K25624j25344p9093a53387B56243J26482I782M89553A23464
12256A74868a22563B87587B343O5150g8572C72701a84110Q8865f109F7751a89969
12244d1057j40264A43743m3242M056b7831B0511e8652A14476a25355a4092E03199
12232C50758H3652a315A5105Q0869J10488I7210g059C45926G2039J92118J75272
12221D39429a03980B91983j44295a01141A44080J28478H9147a79798B78061o7431
12211B10630A158L9922J17478K80555f8026A23766m9442L178a34679A72613b39288
$$ y = [96725, 62633, -72283, -49738, 227743, -12379, -1622, -286874, 27163, 315568, 193078, 390767, -53123, 88199, -18979, 268035, -149336, 75175, 152594, -198306, 202003, -231506, 12788, 6529, 72779, 298403, 173059, 93966, -153387, 256243, 382725, 9782, 499335, 123464, 174868, -122563, 287587, 2343, 67493, -78572, 372701, -184110, -95245, -6109, 67751, -189969, -41057, -181321, 143743, 100501, 104557, -27831, 20511, -58652, 114476, -125355, -14092, 503199, 350758, 83652, -1315, 15105, 95974, 206462, 97210, -7059, 345926, 72039, 264157, 439429, -103980, 291983, 147688, -101141, 144080, 272558, 89147, -179798, 278061, 210630, 1158, 41080, 158558, 439113, -68026, 123766, 74324, 77502, -134679, 172613, -239288]
12199C54421H7730J56557H9532N10702A07487K89856j91356l9797J78360H2581
12188A08629b09610C14319n20D3933a0642k79245A09253b67590e2496G6531c45186
12176A81760H4783b5256C87551b78920A75122d9054C32495j62194E7209M13348
12166D70557m5862A03165b00702B48787g9151j49658A28186R4514J20420n5733
12156B87387a67719B82011a08565A64509f8954l07282E808J55430f3567F5387
12145A47424B8670b03590g4635A86270k4350O8541C6446e7605A82908K1457b0883
12133b30651C8851b4617l3540B01763q1309J11335c60465a25053L4311B29420
12122B6207N045d1886i124q9106k9606K3269B50966e838A34295c4977I8590J15628
$$ y = [354421, 87730, 244287, 89532, 600234, 107487, 397343, 205987, 166190, 344550, 82581, 108629, -209610, 314319, 313799, 43933, -10642, -289887, 109253, -267590, -52496, 76531, -345186, 181760, 84783, -25256, 387551, -278920, 175122, -49054, 332495, 170301, 57209, 470557, 424695, 103165, -200702, 248787, -79151, -228809, 128186, 222700, 343120, 287387, -167719, 282011, -108565, 164509, -68954, -376236, 5808, 161238, -63567, 65387, 147424, 28670, -203590, -74635, 186270, 161920, 230461, 36446, -57605, 182908, 204365, -20883, -230651, 38851, -24617, -58157, 201763, 120454, 231789, -360465, -125053, -90742, 229420, 26207, 31252, -41886, -9124, -98230, -127836, -104567, 250966, -5838, 134295, -34977, 98590, 214218]
12110B14218h780o4654l4914A04035a09679H4771c03763A74781O444N4156A02915
12098B11525q9845c2094A61266c6120B79130H4963b1046m0074B901P8545b34176
12086b19470A30336l8240j643e8552r5369B48873b77601j05212J07798J0597O6465
12075a97953B8085M737P5467b26393A45141L44487O68531P30411G74780C31590
12064h120B71807a77349A97805m1652C3081e158k16628k7885A38111a44193D00052
12052a76932h4248k39586J54487k8128E8060M0879j0386a09249H498h4998M230
12041h0768j26450M6564K9957B49d9161A85648G4589i3903A90302J4797a54129
12029C305J38947H523b2819l44258k7924d9870j585B82458g1428k93997H8918
$$ y = [214218, -8780, -73434, -108348, 104035, -109679, 84771, -303763, 174781, 181225, 235381, 102915, 211525, 121680, -32094, 161266, -36120, 279130, 84963, -21046, -61120, 2901, 81446, -234176, -219470, 130336, 92096, 90453, -58552, -153921, 248873, -277601, -382813, -275015, -264418, -197953, 28085, 32822, 108289, -226393, 145141, 489628, 1158159, 1888570, 774780, 331590, -8120, 271807, -177349, 197805, 156153, 33081, -5158, -221786, -249671, 138111, -144193, 400052, -176932, -84248, -323834, -169347, -197475, 58060, 98939, 88553, -109249, 8498, -84998, -80768, -207218, -160654, -130697, 249, -49161, 185648, 74589, -93903, 190302, 205099, -154129, 3305, 142252, 8523, -22819, -367077, -395001, -49870, -51455, 282458, -71428, -365425, 88918]
12017A22963b05575C6265b38686B29268G8586a2962p8795p7455B3321b1758C1358
12005a24810D0958i2873F4366c4290k60186f3568H9445a85737A70833J00709j32203
11994A39339E4585c9128n5357A01619a15428B04440a97182j62951D3848N3434
11984I7282a37764j20629d5862j2462a7739k11542A8835H801c7087C0969K09599
11973B40568d9320F5301f4193a7802C5347b2425A10485j7646K20028E7019J98789
11962B55808b3114A86388P0932b23304A76487e4993D8043B0966K20665k5361b96973
11950E08667b79959A07450c601r0772j95647a18754n1433B12078D4252A6283J52747
11939A69030a32790A13069e4461A45831B7326b13332I9610J69284a19752a0181
$$ y = [122963, -205575, 36265, -238686, 229268, 78586, -12962, -91757, -169212, 23321, -21758, 31358, -124810, 40958, -92873, 64366, -34290, -294476, -63568, 89445, -185737, 170833, 271542, 139339, 54585, -39128, -94485, 101619, -115428, 204440, -197182, -360133, 43848, 97282, -137764, -258393, -45862, -58324, -17739, -229281, 18835, 8801, -37087, 30969, 240568, -49320, 65301, -64193, -17802, 35347, -22425, 110485, 92839, 312867, 57019, 255808, -23114, 186388, 257320, -223304, 176487, -54993, 48043, 20966, 241631, 216270, -296973, 508667, -279959, 107450, -3601, -94373, -290020, -118754, -170187, 212078, 44252, 16283, 169030, -132790, 113069, -54461, 145831, 27326, -213332, 99610, 268894, -119752, -10181]
11928G9943R5639b78562E8138a08542B64368a12263M6945A78514k6568b42253
11917C28954A53495J82825B6633j0138c7926D8776a95316f8551k23588A41377
11906d9076k14203i9856C85743A53579e143B1193a00677j2592E2806K63780c07947
11894d7240J3569A70506k6965B7743b34307D2170M7722D779a79747d9925H7096
11882c04768I3579a12500A8088b33396k45588G8848d935k2719A49305f0081A95431
11870E5185c23239i081l0295A7495d01088A03210a4828A29115g9576H3732A7966
11858h112p3456m4523j10315B41594o6095a93970j93190h6772I9532J04063a42651
11846g4361A11507h9930q9548b0951k21169L1167J04309m5718a0057A35541A1960
$$ y = [79943, 175582, -278562, 58138, -108542, 264368, -112263, -65318, 178514, 151946, -242253, 328954, 153495, 336320, 26633, 16495, -37926, 48776, -195316, -68551, -292139, 141377, -49076, -263279, -99856, 385743, 153579, -5143, 21193, -100677, -113269, 52806, 316586, -307947, -47240, -33671, 170506, 143541, 27743, -234307, 42170, 89892, 4779, -179747, -49925, 87096, -304768, 93579, -112500, 18088, -233396, -478984, 78848, -4935, -27654, 149305, -60081, 195431, 55185, -323239, -9081, -39376, 17495, -401088, 103210, -14828, 129115, -79576, 83732, 17966, -8112, -81568, -126091, -236406, 241594, 175499, -193970, -387160, -86772, 99532, 203595, -142651, -74361, 111507, -89930, -179478, -20951, -242120, -210953, -106644, -152362, -10057, 135541, 11960]
11834B31510a61497A87809h7726A31253h6768F7667l1614j826b27596B01760n1566
11823A50194M251A2092g4823l17617i8695G6054L7896R9417A2262J52428a65075
11811a9394A39614b43114R6524F7162A3352d1538A17549a17652K0312A1105a64728
11799a46875A7680O8272a00720j41875H9922b39519e9560l68834E2603L3044J50224
11788B35871A05010J0283b09245M2130m451i111E4042L3361Q9421a25791r0744
11777b16535q5733J14596j18156E9297A7032M5634J6826C0532a85761A49283b36902
11765h1001k46601A40847J93537f8480A79700a08027l6291l1889B0789L1455b68026
11753a14010B1138e7092I7085a70260A71882B5935h1623C2783L9472C1670j0409
$$ y = [231510, -161497, 187809, -87726, 131253, -86768, 67667, 36053, 34227, -227596, 201760, 150194, 154445, 12092, -74823, -392440, -98695, 76054, 113950, 213367, 12262, 164690, -165075, -19394, 139614, -243114, -146590, 67162, 13352, -41538, 117549, -117652, -97340, 11105, -164728, -146875, 17680, 85952, -100720, -242595, 89922, -239519, -59560, -428394, 52603, 85647, 235871, 105010, 115293, -209245, -167115, -171566, -9111, 54042, 87403, 176824, -125791, -216535, -302268, -187672, -305828, 59297, 17032, 62666, 79492, 30532, -185761, 149283, -236902, -81001, -327602, 140847, 334384, -68480, 179700, -108027, -144318, -176207, 20789, 52244, -268026, -114010, 21138, -57092, 97085, -170260, 171882, 25935, -81623, 32783, 72255, 31670, 21261]
11742B1261c44908C16336a81561e6029G7860k2093c21808A41487a42641c1918
11731g2467A58047e1514l33060J61591e7237I7945O2955a37408l6808Q7051J3236
11720g3929B5149J3481j5931K48206C0127b64717h8288A77960a34261A71849b04892
11708C6029b56749A30378M8926J4008a22249D2081f9686G4146K48147I1204d6054
11696B54357K5547q7267a74999E2209N3773b23088I4483a12170r3944A5951N1827
11685F7778j6299a1339F157M6079L1514a89338O8381K9888A26059a5130E3528
11673A54887c718A37412K9143J38750d6416k39173J38677B12275b60482I8557
11662C6360j3647K1352c8536j39523j03014c6799A69663H1022d440H9918N4316
$$ y = [21261, -344908, 316336, -181561, -56029, 77860, 55767, -321808, 141487, -142641, -31918, -72467, 158047, -51514, -384574, -222983, -57237, 97945, 160900, -137408, -174216, -87165, -73929, 25149, 38630, 22699, 270905, 30127, -264717, -88288, 177960, -134261, 171849, -204892, 36029, -256749, 130378, 179304, 193312, -122249, 42081, -69686, 74146, 322293, 91204, -46054, 254357, 279904, 192637, -174999, 52209, 105982, -223088, 94483, -112170, -206114, 15951, 67778, 51479, -11339, 6157, 52236, 83750, -189338, -120957, -91069, 126059, -15130, 53528, 154887, -3718, 137412, 166555, 305305, -46416, -285589, -146912, 212275, -260482, 98557, 36360, 22713, 44065, -38536, -178059, -281073, -36799, 169663, 81022, -4440, 89918, 144234]
11651A44234N1738c05913a51429d8816r5604A19595P9888g1025D5206d09934A32985
11639e9935j22083A8862e7681R696k28565g4736J8833j4925j24602G7553a83118
11627A08988q913b97373k8591F9677G657a7981J175r2469M5819f52k77003R1438
11615a86217B93356a13392p5748A5209c8404A73734A0451c14368M0300F7623B7040
11603I7441c6846j10490k61987F0179b81496d599G0875M1488j9167a01100B501
11591B57334a00943A17940J73452a1265m4587k5643j2315A47329F5791b6403B60051
11579a76121A43045A4027C059d0893J8014k09654k01646B1849M7869e6376B98575
11567g0829B74077E1647J5960b48175K8576C0585f0215J2478C71311A11234b2204
$$ y = [144234, 195972, -305913, -151429, -48816, -144420, 119595, 199483, -71025, 45206, -409934, 132985, -59935, -182018, 18862, -57681, -47985, -276550, -74736, -55903, -70828, -195430, 77553, -183118, 108988, 100075, -297373, -325964, 69677, 7657, -17981, -16806, -109275, -63456, -652, -277655, -186217, 293356, -113392, -189140, 15209, -38404, 173734, 10451, -314368, -274068, 67623, 27040, 97441, -36846, -147336, -409323, 60179, -281496, -4599, 70875, 112363, 93196, -101100, 2501, 257334, -100943, 117940, 291392, -11265, -55852, -81495, -93810, 147329, 65791, -26403, 260051, -176121, 143045, 14027, 3059, -40893, -22879, -232533, -434179, 21849, 69718, -56376, 298575, -70829, 274077, 51647, 67607, -248175, -219599, 30585, -60215, -47737, 371311, 111234, -22204]
11555e7645o7851e24k83513B82736n903K69642b645F7644a00411B95299j29136
11544A66163m0189K36386h1395A59135N3640a76659C7888c52756a357A77049E7386
11532A22076n3611i7589f643B98580b15334F2709a11000G2739h9202D3993K7947
11521G1940J73272r6866b39168L7499B62831M7629b48831d9720I7078K759M823
11510A04660g2634B06558J6698c9197k9866D83720A04858a64349B77188q7553
11500A89635a08555B64386b06602D53738A48818a24891k98186B21510c4641H0053
11489c5333L694F2326J15441O724K04833A06635g2284j94278H0979K01217L71494
11478F53690E5058b5412C51694J19746a63006H0295Q8633H0272b0716A05016K72771
$$ y = [-57645, -125496, -524, -284037, 282736, 276833, 546475, -2645, 67644, -100411, 295299, 166163, 125974, 362360, -81395, 159135, 212775, -176659, 37888, -352756, -1357, 177049, 57386, 122076, 68465, -97589, -6643, 298580, -215334, 62709, -111000, 72739, -89202, 43993, 71940, 245212, 148346, -239168, -201669, 262831, 310460, -248831, -49720, 97078, 99837, 104660, -72634, 206558, 223256, -39197, -69063, 483720, 104858, -164349, 277188, 189635, -108555, 264386, -206602, 453738, 148818, -124891, -423077, 221510, -34641, 80053, -35333, -31639, 62326, 177767, 184491, 389324, 106635, -72284, -266562, 80979, 282196, 653690, 55058, -25412, 351694, 471440, -163006, 80295, 168928, 80272, -20716, 105016, 377787]
11467C77787g5771A75991q134F0712a58081e2484D16751a24049B49816J63487
11457D13303b9721A01473O0151j5837m7027k9441j1314N261b17090j22574d9792
11445f9500K5138C2134K09957B114J95255o5044B7126q760J77488D9702j9308
11434C0394b71577A49519f5127k43912J48969P1850j25940D18850C6552a54849
11423E1270L39635j06492h0902C3344b86084e0666A51180g9193E4656m379J95012
11412B45289b20904A0799b06869A34909c05219a22819n3061A06674a37295N2626
11402h4669A3623K15159a30137e7090j64720A41486N3978G6021b19071D1522g1405
11390c09981i3285F8647i4255j24572i3939c8156m8914k8016o9003m1460A8752
$$ y = [377787, -75771, 175991, 167857, 60712, -158081, -52484, 416751, -124049, 249816, 413303, -29721, 101473, 161624, 145787, 98760, 69319, 58005, 63266, -217090, -339664, -49792, -69500, -44362, 32134, 242091, 2114, 197369, 132325, 27126, 18366, 195854, 49702, 30394, -271577, 149519, -65127, -309039, -160070, -88220, -214160, 418850, 36552, -154849, 51270, 390905, 284413, -80902, 33344, -286084, -50666, 151180, -79193, 54656, 50277, 245289, -220904, 10799, -206869, 134909, -305219, -122819, -175880, 106674, -137295, -84669, 13623, 228782, -130137, -57090, -221810, 141486, 195464, 76021, -219071, 41522, -71405, -309981, -93285, 68647, -94255, -218827, -93939, -38156, -87070, -115086, -184089, -225549, 18752]
11378d67847a6245A24542h8807l5938O0287j33961A97940n0659B9400b65285r6508
11367c61793B46550c23096A33241Q1633C3980j2874L983b11397B87788g4731l62750
11356d37481F0374a4150n9965r2179j05186A73331a14503r4245Q8392A07340a21592
11344b8141B19609j07137b65411i247A87014a01388a4532D0776M2041N7621g8678
11332F9109a21412c2203l3380b4409m8018A33406b42000B91234A15895b40717
11321B2077a37398b9528A19925a99250c1879k04813P3685J9784j09093j50541
11311d02857J37898J30317J8238r1852A54317B1104J25877E2521a02173o249k35097
11300c43519R1506B51573A04742b11315C29426a06303l50969E2675J06908i1572
$$ y = [-467847, -16245, 124542, -88807, -124745, -64458, -198419, 197940, 147281, 29400, -265285, -361793, 246550, -323096, 133241, 214874, 33980, 21106, 25089, -211397, 287788, -74731, -437481, 60374, -14150, -74115, -166294, -271480, 173331, -114503, -208748, -120356, 107340, -121592, -28141, 219609, 112472, -265411, -9247, 187014, -101388, -14532, 40776, 82817, 140438, -78678, 69109, -121412, -32203, -65583, -24409, -72427, 133406, -242000, 291234, 115895, -240717, 22077, -137398, -29528, 119925, -199250, -31879, -236692, -163007, -143223, -252316, -402857, -264959, -134642, -116404, -208256, 154317, 21104, 146981, 52521, -102173, -108422, -343519, -252013, 251573, 104742, -211315, 329426, -106303, -457272, 52675, 159583, -91572]
11289c7400b640A16671b00727B67497a09525j9704j3289m4804A61210a97487C3235
11277a78110c1924C81318f2426k24547d0636F8716J1971k4378c9884j51587A56635
11265b89018d5982j198A28449a33140c4757j94029j42937i2410A00499n335b59079
11253i2888g370E2616b42491A70940a66873j9309A5467a52497F1925e069A33072
11241A5424b25946J05075j17541c2616B14861A74a63643H6144N1404n0437c5812
11229a55873D7884J14579F7579a74506K2069M8549j24866B32266b25792R6569
11219a29223A1995K67794b14129o9682B03590a98176k0222Q3674j18751G7954
11208B01632j1973D804K111J82561b3368i364B5951c81565b7898k00118j21367
$$ y = [-37400, -2640, 116671, -200727, 267497, -109525, -129229, -142518, -187322, 161210, -197487, 33235, -178110, -31924, 381318, -62426, -286973, -40636, 68716, 80687, 56309, -39884, -191471, 156635, -289018, -45982, -47180, 128449, -133140, -34757, -228786, -371723, -92410, 100499, 95164, -259079, -92888, -7370, 52616, -242491, 170940, -166873, -186182, 15467, -152497, 61925, -5069, 133072, 15424, -225946, -120871, -238412, -32616, 214861, 174, -163643, 86144, 137548, 87111, -35812, -155873, 47884, 162463, 67579, -174506, -152437, -103888, -228754, 232266, -225792, -129223, 11995, 279789, -214129, -283811, 203590, -198176, -218398, -134724, -253475, 77954, 201632, 189659, 4804, 6915, 189476, -23368, -9364, 25951, -381565, -27898, -228016, -349383]
11197c49383J44725a3849B36067a80224a8257o667q772k78030f1715l6869K2921
11186g5663A5686R7529a4023B59187a81163f5624A10677M2302c48129E08461a74473
11174b81279a7173j68034g3869j3208k61090I3611J51145b45955Q0649k46752
11164d12058c3571m6127m3721d137j51649j76414B63033C3349c32790R614f6093
11152A00691a27857H7523a91330d9877k2431A90097J05511A5312R9495h3341A90192
11140C0595a141H8056l1166M3604b5164k40001A33293a6152j26777A15545c5067
11128a75577E6310b4403A4233J13065m3464R4474b03501i7554b7845B27842J93249
11117D21091A41297M26205b9045C8478J24255d7527I2147K18593A43018o9541
$$ y = [-349383, -204658, -13849, 236067, -180224, -18257, -24924, -33696, -311726, -61715, -98584, -75663, 15686, 113215, -14023, 259187, -181163, -65624, 110677, 152979, -348129, 508461, -174473, -281279, -17173, -185207, -73869, -87077, -348167, 93611, 244756, -245955, -165306, -412058, -33571, -79698, -123419, -4137, -155786, -332200, 263033, 33349, -332790, -323176, -66093, 100691, -127857, 87523, -191330, -49877, -72308, 190097, 295608, 15312, 114807, -83341, 190192, 30595, -1141, 88056, 56890, 100494, -25164, -265165, 133293, -16152, -142929, 115545, -35067, -175577, 56310, -24403, 14233, 127298, 83834, 178308, -203501, -97554, -27845, 227842, 421091, 141297, 567502, -29045, 38478, 162733, -47527, 92147, 310740, 143018, 73477]
11107G3477K73574q802b9460B88184m2115B9815N888N6603d9350C20337a70242
11095i0041B16008r0959a0002p6819B25709m1943C7262a80233A56855L1532l8035
11084A50352K2475B633K16522m0971Q6454a34527A63141K03712a2013A70404J97022
11073C67426r0140j22226L49858A91839L95124B45765L24724A86861J2626K74475
11063D73962r7836C8725M36434J00234K20311j84023k76021j04270r8631O50334
11053G83093l16148N9113r7005P66K50724J27630k22694K1753A59110M69524J49724
11042G78358j19081q9204N3365J98650p0504K5500r8165J9079j08440j54167j3609
11031D21782K30518n182j52367J39582k8966B57577K56081K96838l25883k1965
$$ y = [73477, 347051, 338249, -29460, 288184, 246069, 29815, 35703, 92306, -49350, 320337, -170242, -90041, 216008, 125049, -10002, -86821, 225709, 183766, 37262, -180233, 156855, 188387, 150352, 172827, 2633, 219155, 178184, 264638, -134527, 163141, 366853, -12013, 170404, 367426, 277286, 155060, 504918, 191839, 586963, 245765, 570489, 186861, 199487, 473962, 376126, 38725, 475159, 575393, 795704, 611681, 335660, 231390, 132759, 783093, 466945, 526058, 429053, 429819, 680543, 808173, 585479, 607232, 159110, 628634, 778358, 659277, 570073, 623438, 822088, 751584, 777084, 678919, 697998, 589558, 435391, 421782, 652300, 647118, 494751, 634333, 605367, 257577, 513658, 810496, 484613, 462648]
11021D62648J50718K57196B91204L03194M2128j28039L8706L2860K63326k17291
11011F26088R8104l29584Q7506J78087k3643j95813B01456K20535J4117P3697
11001E09805j34465L67559O7719p5859k87457L76610m9998l19250K30354B81851
10990F45422q0547K49139k15644j50728K49058K48280K27725n4500D94473L18110
10980H12583N8092K99092L15744r6801J87482O60600J09681J51711R4945j54303
10970B438826j87912K57908n30983M8805l51455m07883J8424N5976k61822j22467
10960I57417L92661J19888m11813M95397l07283L2271q9390m78492L57932j50242
10950I18346l06779j44231l2424M9174K1367A71457J56802A40772J48450A15467
$$ y = [462648, 613366, 870562, 291204, 594398, 636526, 508487, 547193, 580053, 843379, 626088, 724192, 394608, 482114, 660201, 636558, 440745, 201456, 421991, 436108, 509805, 375340, 742899, 810618, 734759, 447302, 823912, 773914, 454664, 685018, 281851, 645422, 564875, 814014, 598370, 447642, 696700, 944980, 1172705, 1118205, 494473, 812583, 870675, 1169767, 1485511, 1388710, 1576192, 2236792, 2346473, 2498184, 2593129, 2438826, 2250914, 2508822, 1977839, 2026644, 1675189, 1267306, 1285730, 1341706, 1079884, 957417, 1350078, 1469966, 1058153, 1553550, 1246267, 1278538, 1189148, 710656, 1068588, 918346, 611567, 467336, 434912, 484086, 505453, 171457, 328259, 140772, 289222, 115467]
10939H8279a06242I4922P5424J4517J28008A28566B9318c6786C88290h9326B74340
10927C7698L1406J08122l9088b6602l0869D3537Q2281k1421b0222D59K44144j04810
10915A39793e2823p7268A68196H3241a8993A76182E2308j7495J6976b0456C6396
10903B02541a00958A9793P022L92015A87642e4553l55955J91285A12926b9473
10892F775b0074i402A10013a59972A75780e2049A22122i2762j59469q9721e7732
10880a31109l3418N4845B56813a08708B13326b11056i5277m0666A25306h1689
10869c81122O9269g1463k17396G7518c4178B4396c193o1100k50041a41637e8128
10857E8641j8065J39304b1696l30203b5165H2680R9227E1007i0832r5689C58858
$$ y = [88279, -106242, 94922, 170346, 184863, 312871, 128566, 29318, -36786, 388290, -89326, 274340, 37698, 69104, 177226, 138138, -26602, -57471, 43537, 125818, 104397, -20222, 459, 244603, 139793, -52823, -130091, 168196, 83241, -18993, 176182, 52308, 34813, 51789, -20456, 36396, 202541, -100958, 19793, 26815, 418830, 187642, -54553, -410508, -219223, 112926, -29473, 6775, -20074, -9402, 110013, -159972, 175780, -52049, 122122, -92762, -252231, -341952, -57732, -131109, -164527, -109682, 256813, -108708, 213326, -211056, -95277, -135943, 125306, -81689, -381122, -311853, -71463, -288859, 77518, -34178, 24396, -3193, -64293, -314334, -141637, -58128, 58641, 40576, 179880, -21696, -351899, -25165, 82680, 181907, 51007, -90832, -186521, 358858]
10845E9822G394G91J89661a34356A64480k7407m5796a90292c2854A54714g4003
10833B5592J27978e7683A42889h6114C84544h4334B13291I7668j290g0262a3264
10821H9676k626b9595J3449A289J2468i7180A70885c6323k12460J10516B810a74852
10808b7332k5238G9619a61262j46389k518A45692c45234C58166A42592a02803
10797A68322a34622B81060d91178J96035O9897A08332a38677b0844j37598e9940
10786h1556J4650B42856b22635i1342m15668K12880R5212B57559q9774E3292c4221
10774A9694b3849j25079M9060D97562c30774h3690A56317a58928p3343J09594
10764a22677M7876j93825a5992q8466b7661k91040Q7996j2505K7677A68305a64978
$$ y = [59822, 7394, 791, 190452, -134356, 164480, 137073, 91277, -190292, -32854, 154714, -74003, 25592, 153570, -57683, 142889, -86114, 384544, -84334, 213291, 97668, 96378, -70262, -13264, 89676, 87050, -29595, -16146, 1289, 13757, -97180, 170885, -36323, -248783, -138267, 2810, -174852, -27332, -52570, 79619, -161262, -307651, -310169, 145692, -345234, 358166, 142592, -102803, 168322, -134622, 281060, -491178, -295143, -225246, 108332, -138677, -20844, -158442, -59940, -81556, -66906, 242856, -222635, -91342, -507010, -294130, -198918, 257559, 167785, 53292, -34221, 19694, -23849, -148928, -99868, 497562, -330774, -83690, 156317, -158928, -232271, -122677, -74801, -268626, -15992, -104458, -27661, -318701, -230705, -243210, -215533, 168305, -164978]
10752a65096I1965R9597f7867A13842a34064B87168a21676B84400D2172c64490
10741a29065G9536a70674L6823d6711o209k02676J06399j13618A26642a19082
10730I2158J18963h0622a7301p6213j53396A77935F8814J34218b47983B10986
10719i4831B93996i1600B05581a79600b7481I2592a81310g938j14520k58843J22234
10708b59067a6334n82118g9719j91114A11162d0586q2408B03125P4685b59621
10697d60200A2693N8059a26273O479C9843a36026k73940a6020r4363K3395K5151
10686f1837G9562l1096a87068B6810b87996A41513b87263J25093b4562A93854
10675B9857a03367k37818F5247a63220A1125a33344B78239A11354K03699b349
$$ y = [-165096, 91965, 191562, -67867, 113842, -134064, 287168, -121676, 284400, 42172, -364490, -129065, 79536, -170674, -133851, -46711, -52920, -255596, -149197, -262815, 126642, -119082, 92158, 211121, -80622, -17301, -93514, -246910, 177935, 68814, 203032, -247983, 210986, -94831, 293996, -91600, 205581, -179600, -27481, 92592, -181310, -7938, -122458, -381301, -259067, -16334, -598452, -79719, -270833, 111162, -40586, -122994, 203125, 277810, -259621, -460200, 12693, 70752, -126273, -119794, 39843, -136026, -409966, -16020, -110383, -86988, -61837, 79562, 48466, -187068, 26810, -287996, 141513, -287263, -162170, -24562, 193854, 29857, -103367, -341185, 65247, -163220, 11125, -133344, 278239, 111354, 315053, -2349]
10664h6667A0584K08846b5022p5238B24722a10194D957a24603m6080f5415m4378
10653a09793l06170f3708j73306B4856c775o0577k92746A01991a68169N0870I1083
10641B51350m730q0345d52324b21695a0585k00849j32848J53901B69801b37951
10630i6508a4530l70283G8779g678n2144k39797B09711b18665N8062K6858b3808
10618A9432d8655j15868c2737j04301C11989a44127l8436b6697q175m1893B14364
10606h2547j6619j74777A08147a12169C01067A7814c6930q6552a6067k11436r8690
10595c26193A92516n5093n5080b37203R3103j60788C59174f9494k3112c0639m62555
10584d93194a94396O3993H880R5287e1671e002j42033a5653A53048J13352r5756
$$ y = [-86667, 10584, 219430, -25022, -100260, 224722, -110194, 4957, -124603, -170683, -65415, -109793, -415963, -63708, -237014, 24856, -3775, -64352, -357098, 101991, -168169, -117299, 91083, 251350, 246620, 166275, -452324, -221695, -10585, -211434, -344282, -190381, 269801, -237951, -96508, -14530, -384813, 78779, -7678, -59822, -299619, 209711, -218665, -160603, -133745, -23808, 19432, -48655, -164523, -32737, -137038, 311989, -144127, -182563, -26697, -34872, -76765, 214364, -82547, -99166, -273943, 108147, -112169, 301067, 17814, -36930, -123482, -16067, -227503, -326193, 192516, 137423, 82343, -237203, -144100, -304888, 359174, -69494, -92606, -30639, -493194, -194396, -130403, 8880, 104167, -51671, -5002, -147035, -15653, 153048, 266400, 170644]
10573A70644C4272i8632a7678q3951k2028A6701J96761c53213P1257g9788r1297
10562a71085k8310E1325a38643D9228j7345b23361L5480o2592A21245h1251C5343
10550B48730a38121f2741A07775c83298H0856a01728A48753a54634k6001o2940
10540b43575M0760j10077A47643Q1488b21144R5802G7609i8896a8167A7106d3944
10528b5542j33268B4211c44820I1810c62005B67406H4113b28339b6932G2038C0781
10516A22820m0236L1589g2117F5490N7964l634J49828a31441F291c42875A6500
10504A73791J09281a11396m8440A12285n3361J62091q2731a09725j9143G8080
10493a27699l37835a51203A40698a74600E840K02832E4663d53121d8939a8070
$$ y = [170644, 34272, -98632, -17678, -101629, -123657, 16701, 213462, -353213, -281956, -79788, -171085, -199395, 51325, -138643, 49228, 31883, -223361, -187881, -250473, 121245, -81251, 35343, 248730, -138121, -62741, 107775, -383298, 80856, -101728, 148753, -154634, -180635, -243575, -202815, -312892, 147643, 229131, -221144, -125342, 77609, -98896, -18167, 17106, -43944, -25542, -158810, 24211, -344820, 91810, -362005, 267406, 84113, -228339, -26932, 72038, 30781, 122820, 82584, 114173, -72117, 65490, 123454, 119820, 269648, -131441, 6291, -342875, 16500, 173791, 283072, -111396, -159836, 112285, 58924, 221015, 138284, -109725, -128868, 78080, -127699, -465534, -151203, 140698, -174600, 5840, 208672, 54663, -453121, -48939, -18070]
10482e0010A20436d75277C63752A72562N3015g9886A99130O5313a21672e646o4312
10471f9958c0304m4722j32563A92800c581B73334G7524J4856l9413J0322d25326
10459a47110a2018A8966K85045c5267B7606K31331F8605M2443D1812b89705B11675
10447a99333d818A13007h5110l1185A35209D3812A8580J30057a42396k038j20762
10436b65196a26014F6879a02254D7130b7475G7401b57314N2171F5102i592m5401
10425e4993k3937B60396b99214J39846G718L40314a61685g7548E077P5150e1033
10413g7875j25379B56086E9296M7913k5922a98187i5643r5705B22213D1450O0822
10402A02272a05989d4237E473K1286K7418H281a76451C93700b53933B75194a04813
$$ y = [-50010, 120436, -475277, 363752, 172562, 225577, -79886, 199130, 264443, -121672, -5646, -69958, -30304, -75026, -207589, 192800, -3581, 273334, 77524, 92380, 52967, 63289, -425326, -147110, -12018, 18966, 304011, -35267, 27606, 258937, 68605, 111048, 41812, -289705, 211675, -199333, -4818, 113007, -85110, -116295, 135209, 43812, 18580, 148637, -142396, -144434, -265196, -126014, 66879, -102254, 47130, -27475, 77401, -257314, -205143, 65102, -9592, -54993, -78930, 260396, -299214, -159368, 7718, 348032, -161685, -77548, 5077, 80227, -51033, -77875, -203254, 256086, 59296, 107209, 81287, -198187, -95643, -191348, 222213, 41450, 102272, -105989, -44237, 5473, 26759, 54177, 8281, -176451, 393700, -253933, 275194, -104813]
10390d0785A35570J0469M7818c0584j08979a2106B06075h1747B78081A14501h7047
10378H9330P8347O9199K5866I1247C9285L87987j09161p267q9706j7310K94162
10367D97990A94321K43885l0348k2186j84046H9472L64394a33596B58332Q435
10357B66767a34564B34222b65007C82637J52747E9734L17555K13608j30967i463
10346C72522j29123A8188M08666K0974H4077A0716a90084B90588G4082J47723
10336B21805b4931j9703B95438j39761d50522F2690P6785b17279a5315I1541a6612
10324c11m8154C50953A27855B9021L5690A995N4970f9883C10250a4574A31687
10312B82059j24579K5479H7319a19908j47739B73323g8427B11119L036c6540k46495
$$ y = [-40785, 135570, 146039, 193857, -30584, -139563, -12106, 206075, -81747, 278081, 114501, -87047, 89330, 167677, 236876, 262742, 91247, 39285, 427272, 318111, 310844, 221138, 203828, 497990, 194321, 438206, 407858, 385672, 201626, 89472, 453866, -133596, 258332, 266767, -134564, 234222, -265007, 382637, 535384, 59734, 377289, 590897, 459930, -9463, 372522, 243399, 18188, 426854, 447828, 84077, 10716, -190084, 290588, 74082, 221805, -24931, -44634, 295438, 155677, -450522, 62690, 139475, -217279, -15315, 91541, -16612, -311, -48465, 350953, 127855, 29021, 64711, 1995, 56965, -69883, 310250, -14574, 131687, 282059, 157480, 182959, 87319, -119908, -267647, 273323, -78427, 211119, 214155, -36540, -283035]
10301b83035B30312g2855B59994A04854a19275d9343C58704c96884G7120c43606
10290e8973j02713E0843b56626K9619e4018I9813K19530d3725A87486g6104J2682
10279f3422A44997J17098b63340C2291R0532K41463A56420d4031j21874F2693
10268A93300F8529b38090d9953m016H3148P0752m1632A7177a84394A82302R9239
10257B81541I6720L47634a27164e9676F0609J64508i0030B84922i1699j01074
10247a92773A73237i0319j03053K2863f5867a2876r8363L1680n919B0940m829
10236A6111d2809l8590B9845c3068m41527F7225c0467C2450a36383L6049a052
10224d26196b5224m2298B03125l3375h7871A56165n3123b39569o1127J08433g6970
$$ y = [-283035, 230312, -72855, 259994, 104854, -119275, -49343, 358704, -396884, 77120, -343606, -58973, -161686, 50843, -256626, -227007, -54018, 99813, 319343, -43725, 187486, -76104, -63422, 144997, 262095, -263340, 32291, 122823, 364286, 156420, -44031, -165905, 62693, 193300, 68529, -238090, -49953, -53969, 83148, 153900, 112268, 17177, -184394, 182302, 281541, 96720, 444354, -127164, -59676, 60609, 225117, -90030, 284922, -91699, -192773, 173237, -90319, -193372, -170509, -65867, -12876, -111239, -79559, -85478, 20940, 16111, -42809, -81399, 29845, -33068, -474595, 67225, -30467, 32450, -136383, -100334, -1052, -426196, -25224, -67522, 203125, 169750, -87871, 156165, 103042, -239569, -300696, -192263, -76970]
10212a04564j06745e0329o3800A50185c36221a07122e903C6361d06963f0799r8263
10201a59062P5573C8301b08080j29176a19497a6628j16205b7117C4335g8520E5508
10189b28055C9337K09862i6363m0996C4502b37887a02041p9311Q5185A23658m9711
10178G3947b26521F2409B8662G559b16271R1467b7072D2126l919b37495g4667
10166b30950a9745j40705a7091k38132B09769a24230K5029A22758a01253J1853
10156h9400j50486j55069b1951k86192a5766k53944L1186c6215E4596b31053M512
10145b26541e831l18174G5261a33322j78427i7836j6712B35415b82593A99910
10134a70836O4084C8400c118A16688b06966A96867a34168l1068A26082b47218
$$ y = [-104564, -211309, -50329, -114129, 150185, -336221, -107122, -5903, 36361, -406963, -60799, -159062, -83489, 38301, -208080, -337256, -119497, -16628, -132833, -27117, 34335, -78520, 55508, -228055, 39337, 249199, -96363, -137359, 34502, -237887, -102041, -181352, -96167, 123658, 73947, -226521, 62409, 28662, 7559, -216271, -124804, -27072, 42126, 38207, -237495, -74667, -230950, -19745, -160450, -17091, -255223, 209769, -124230, -99201, 122758, -101253, -89400, -239886, -394955, -21951, -308143, -15766, -269710, -238524, -36215, 54596, -231053, -226541, -5831, -324005, 75261, -133322, -311749, -97836, -114548, 235415, -282593, 199910, -170836, -106752, 38400, -3118, 116688, -206966, 196867, -134168, -165236, 126082, -247218]
10123A980d8758r1627N8276g514m76245D1590J73547a50118f9874k44811c5064
10111b68374C6043i4152l05539C5932b82608J28772j11737A40114a83364a5829
10100G892J48593k3852A2965N5665g8020A17634b3886j09968k5428G3682E172
10088A58039p4235c8391G8375d71624A22977J67173a30300B45122b66173B8808
10077A64366b97341N2805A6705K9658h735r8110d8608H3114J41290c25110D8570
10065d1299D7550a5119l2540m1302I8438Q4116b18342h939j92548q3752A94658
10053F889c4337E1903M1469A881a27146p6965B57126A6222J03322a07882E9941
10041b29819O3299b5695k21938d9161k92876D028Q8312a37848j83670e0697K2963
$$ y = [1980, -48758, -140385, -82109, -7514, -483759, 41590, 215137, -150118, -69874, -314685, -35064, -268374, 36043, -94152, -399691, 35932, -282608, -153836, -265573, 140114, -183364, -15829, 7892, 156485, 132633, 12965, 68630, -78020, 117634, -23886, -133854, -159282, 73682, 5172, 158039, 83804, -38391, 78375, -471624, 122977, 290150, -130300, 245122, -266173, 28808, 164366, -297341, -244536, 16705, 46363, -8735, -106845, -48608, 83114, 224404, -325110, 48570, -41299, 47550, -15119, -47659, -88961, 98438, 182554, -218342, -8939, -201487, -285239, 194658, 6889, -34337, 51903, 93372, 1881, -127146, -204111, 257126, 16222, 119544, -107882, 59941, -229819, -166520, -25695, -247633, -49161, -342037, 4028, 92340, -137848, -321518, -50697, -27734]
10030b7734j59734C14383E0937c96268i3471j07352H1375n21C555a44892p7930
10019b22822q2904J36415Q4343J1121A29055a91727c4089A27156A1802K7062J24016
10008A62880c29102G8666j1161K9322A122a59389O0393M7305C3583d25334C00618
9996C6302b44062c6091E5656c4315j67778f5108k46972a34586j55498a43666g497
9984E454O4059M06828i7580D2145a32736I2458i9913k869l9733C6639A4106J96807
9972B10913a83385l02543b1544I0306B3027K249f4053J1112B79482b66204G3229
9960a43840A39336c81751C27468D62a5389p8617H4331j5582J70603j16510g1227
9948f3255m7761K0589p750k37493A34421b35412A8653J19994o5174b50833A73821
$$ y = [-27734, -187468, 314383, 50937, -396268, -93471, -200823, 81375, 80854, 3555, -144892, -222822, -305726, -169311, -84968, -73847, 129055, -191727, -34089, 127156, 11802, 38864, 162880, -329102, 78666, 67505, 96827, 1122, -159389, -98996, -51691, 33583, -425334, 300618, 36302, -244062, -36091, 55656, -34315, -202093, -65108, -312080, -134586, -290084, -143666, -7497, 5454, 69513, 476341, -97580, 42145, -132736, 92458, -99913, -102782, -142515, 36639, 14106, 210913, -183385, -485928, -21544, 90306, 23027, 25276, -64053, -52941, 279482, -266204, 73229, -143840, 139336, -381751, 327468, 462, -15389, -94006, 84331, 68749, 239352, 122842, -71227, -63255, -111016, -90427, -98177, -335670, 134421, -235412, 18653, 138647, 73473, -250833, 173821]
9936B35113h9892q8621A76814e7819a5264k15344F5424b38350g0943C8557a72443
9924a75775H3308d6391k07938a10133F0295b72210L9252J02502n4881J3506p7109
9913b48940C22119a37161A20723b77942A97467d10046i11C0359b13334j1899j35821
9902c61054d5879j04421J2410n3264d1960C2471f9747A70484B8243b174A78226
9890F1858j2142c1514A45654h8319B35196f2499k24831j67296c398E7193i9945
9878C9050A4015e8254j60549b6332j92587H649c49051J21457N8986g6770k02700
9867b79470A04446b172E1799M0563d718I556P8522A123a87916j47081c64I0153
9854a73974k46258f9308l60226a51m91535h3237c3950H1187a33792a7088l66616
$$ y = [235113, -89892, -178513, 176814, -57819, -15264, -230608, 65424, -238350, -70943, 38557, -172443, -175775, 83308, -46391, -254329, -110133, 60295, -272210, -232958, -130456, -185337, -171831, -248940, 322119, -137161, 120723, -277942, 197467, -410046, -911, 30359, -213334, -225233, -361054, -45879, -150300, -137890, -191154, -41960, 32471, -69747, 170484, 28243, -2174, 178226, 61858, 49716, -31514, 145654, -88319, 235196, -62499, -287330, -454626, -3398, 57193, -99945, 39050, 14015, -58254, -218803, -26332, -218919, 8649, -349051, -227594, -168608, -76770, -279470, 104446, -2172, 51799, 92362, -4718, 9556, 88078, 1123, -187916, -334997, -364, 90153, -173974, -420232, -69308, -429534, -151, -491686, -83237, -33950, 81187, -133792, -17088, -383704]
9843c83704P1660c3065j87896g2397j97795A1220b52519M1740j91163A35370a9125
9831a91245K7465A62549k6680a94646D3209J66919a16338n784H3236a39950B16948
9819D9918J48085P7549a87868A17787a3066F3336a77738j55948h3622C7132d49129
9807D43086a25607j02242L7522e8792n6903r2723L9144k6933p4219A52129J03846
9796B55975d0471m3179k90891d6485j52055i1653k64026h4403A46591h5635o6304
9785a51939B5727a23937N5567A25830c3553c482A87590E9774K18054E5914b30083
9773D6246b33986a15366D9891a95536i6593K5895m7339e0449B11294i5233A20522
9761i4887k5071l9961j91992g8834K2363b4846A92000a61022A02706b8413k19537
$$ y = [-383704, -312044, -33065, -220961, -72397, -270192, 11220, -252519, -210779, -401942, 135370, -19125, -191245, -163780, 162549, 135869, -194646, 43209, 210128, -116338, -122122, 83236, -139950, 216948, 49918, 198003, 275552, -187868, 117787, -13066, 63336, -177738, -333686, -83622, 37132, -449129, 443086, -125607, -227849, -190327, -58792, -115695, -208418, -169274, -196207, -270426, 152129, 255975, -40471, -83650, -374541, -46485, -198540, -91653, -355679, -84403, 146591, -85635, -151939, 25727, -123937, -68370, 125830, -33553, -3482, 187590, 59774, 277828, 55914, -230083, 46246, -233986, -115366, 49891, -195536, -96593, -70698, -118037, -50449, 211294, -95233, 120522, -94887, -119958, -159919, -351911, -78834, -56471, -24846, 192000, -161022, 102706, -28413, -247950]
9750b47950a20708q3864F9748J53432b7327D4597a29649b5384F8214j4528J45147
9739A98833C4727a28965B4898b07935e0076A69893G188a5435k48117J27981b5376
9727c1245k8229R477I3586A1190a30632f1013j11100p5594F2449a48629q8929
9716b37558b190j44224a5503A3075J15467j2476a42701A10548a68544C73152b40151
9704e69994A25209k9743b04451j1064c5096k54756i8852c3861J1361C15811b84680
9692b03137O9115c1515l2685n237G3289a18485m524D23955G5209b65912C5415
9680C16815a40917H593b52695C4985K42310p6311a31821j7288a3900k74542g557
9668H2900b50911E8279g0073B9808J20150c16444A16879m3606L4155O6387A9768
$$ y = [-247950, -120708, -204572, 69748, 223180, -27327, 44597, -129649, -25384, 68214, 53686, 198833, 34727, -128965, 24898, -207935, -50076, 169893, 7188, -15435, -263552, -135571, -25376, -31245, -59474, -49997, 93586, 11190, -130632, -61013, -172113, -247707, 62449, -148629, -237558, -2190, -146414, -15503, 13075, 128542, 116066, -142701, 110548, -168544, 373152, -240151, -569994, 125209, 95466, -204451, -215515, -35096, -289852, -98852, -33861, -22500, 315811, -284680, -203137, -134022, -31515, -64200, -69437, 73289, -118485, -123009, 423955, 75209, -265912, 35415, 316815, -140917, 8593, -252695, 34985, 277295, 200984, -131821, -149109, -13900, -288442, -7557, 82900, -250911, 58279, -70073, 29808, 149958, -316444, 116879, 73273, 107428, 173815, 19768]
9656b62800J05984B45336a43303B78357c7924c228j05313k07549J12331B99810
9645E14579a42881E0026i5855C32051b89738J42980N8679B00967D0446J19994
9635A60440c44265a33540A06867c0458o7694o373p8808j58646k0722B33887c27242
9623I014e8589p7979B66362a08908k4143j43983a07841n6109k34858a65846G9834
9611c13804h0369j41922a4810j20595l79656J03277g7769j63124n1887A18532
9600a40761q1139i2776A90564a2524I6432i1930A99548N6902a73520F8091J27706
9589A95797m1087a49182A11125d30621b09771k39728F0797a5100p579l21959J42215
9578b02423k46154J14896A3764i6432G3877a30625E7189i9264B28492E8647B662
$$ y = [-262800, -156816, 245336, -143303, 278357, -37924, -3228, -108541, -316090, -203759, 299810, 514579, -142881, 50026, -95855, 332051, -289738, -146758, -88079, 200967, 40446, 160440, -344265, -133540, 106867, -30458, -98152, -104525, -183333, -341979, -362701, 233887, -327242, 9014, -58589, -136568, 266362, -108908, -133051, -277034, -107841, -163950, -398808, -165846, 79834, -313804, -80369, -222291, -14810, -135405, -515061, -411784, -77769, -240893, -292780, 118532, -140761, -221900, -92776, 190564, -12524, 96432, -91930, 199548, 256450, -173520, 68091, 195797, 154710, -149182, 111125, -430621, -209771, -449499, 60797, -15100, -22679, -344638, -202423, -448577, -333681, 13764, -96432, 73877, -130625, 57189, -99264, 228492, 58647, 2662]
9566c09666L5529L2205G7785g0214A13877d03648b197G421b84238J18301k32003
9555c97940C5742c92852a451I471J41756b65517A03897D9747k2441b51282J15377
9544a35905I3096a62120P9714m3872b816H9752a57040I7729d2968l266m8636C42590
9531A00748i2656k91734a03284A09081a65293j21247q2532i4301J4338C7181d99112
9519D8146a16161j35018B4848b8222k79600a38129j07084a3496p4828j13577m25936
9508f27837h357d071j70997C0913c88013B7376b64552c7722l14400A6070J3078
9497B9148d09098R3543d5717D2865b76640A78257C0396a96540a2017k4366q0182
9486a16565m5101I0403b49480g7927q2008p4059B020a92734e371m9826k16862
$$ y = [-309666, -274137, -241932, 77785, -70214, 113877, -403648, -2197, 7421, -284238, -165937, -397940, 35742, -392852, -1451, 9471, 151227, -265517, 103897, 49747, 27306, -251282, -135905, 93096, -162120, -82406, -126278, -2816, 89752, -157040, 97729, -42968, -46234, -94870, 342590, 100748, -92656, -384390, -103284, 109081, -165293, -286540, -369072, -94301, -79963, 37181, -499112, 48146, -116161, -251179, 24848, -28222, -307822, -138129, -245213, -13496, -88324, -201901, -627837, -8357, -4071, -175068, 30913, -388013, 27376, -264552, -37722, -352122, 16070, 29148, -409098, -315555, -45717, 42865, -276640, 178257, 30396, -196540, -12017, -36383, -116565, -161666, 90403, -249480, -77927, -159935, -233994, 2020, -192734, -5371, -55197, -272059]
9475b72059o8389c1699I6728M43947a50760C00858j06767c7193j5600l12767a63468
9463h2986K2883k86659J67737A35551M0758h7101j64571i5020J0051o1280A25589
9451A35517a60354l128K1839B92780E6508c57260G349K21470d8272B996a57379
9439a26581C9984J35043g7900a2717j44516l1701I663J39545a86751A29526H067
9427a25520b2114o7664F3354E958a17192r554B09380a25868K7896L1312J5941
9416e0719j34797C19158A2617a22653A62896h9354j79575j48059M1869P0115a8858
9404b42914B30338p0236c2040l09779f229j44991A9605J07368k4364a9742j46521
9393a66263C55998A63519G9087d11293J99722A21499f2974C1552J20050L3254
$$ y = [-272059, -340448, -31699, 96728, 540675, -150760, 300858, 194091, -37193, -52793, -365560, -163468, -82986, -60103, -346762, -179025, 135551, 176309, -87101, -251672, -95020, -84969, -146249, 125589, 135517, -160354, -163482, -141643, 292780, 56508, -357260, 7349, 228819, -48272, 2996, -157379, -126581, 39984, 175027, -77900, -12717, -157233, -188934, 9663, 149208, -186751, 129526, 8067, -125520, -22114, -89778, 63354, 5958, -117192, -126746, 209380, -125868, -97972, -66660, -50719, -185516, 319158, 12617, -122653, 162896, -89354, -268929, -416988, -375119, -305004, -18858, -242914, 230338, 160102, -32040, -341819, -6229, -151220, 19605, 126973, 102609, -19742, -166263, 355998, 163519, 79087, -411293, -211571, 121499, -62974, 31552, 151602, 184856]
9383A84856m9031b30351d2568J9161o4027B56242f369j40793H9973c60714a72755
9371f9130B49842b20566G6968b66891N6255A64218d74897A61303a46083H9778
9360b57048I5686K064J00810A8638l465i2443j45899C85348a5466j07657A89446
9348A91851a98445O4173D0530b05218K1440A11202J9863a39966j9131d3817B26571
9336D7183e3101j50218F3475f8540p5320c573k4145A7372h8670a044j28018K0664
9324a08398A17848n3135j3078L1703B6155J30752g7834A48584k8200c7524l26360
9313c63884A4558a00710k07922D4902k0528e55732E3319J80141e56508E2559Q7885
9302A40444a54393j63441a44067J4814f0600B35642d0295l3517L3023E0461a46053
$$ y = [184856, 135825, -230351, -42568, -23407, -87434, 256242, -6369, -147162, 89973, -360714, -172755, -69130, 249842, -220566, 76968, -266891, -210636, 164218, -474897, 161303, -146083, 89778, -257048, 95686, 97750, 198560, 18638, 15173, -92443, -238342, 385348, -15466, -123123, 189446, 191851, -198445, -134272, 40530, -205218, -183778, 111202, 131065, -139966, -159097, -43817, 226571, 47183, -53101, -203319, 63475, -68540, -143860, -3573, -27718, 17372, -88670, -1044, -129062, -108398, 117848, 64713, 51635, 83338, 26155, 156907, -77834, 148584, 120384, -37524, -363884, 14558, -100710, -308632, 44902, 24374, -555732, 53319, 233460, -556508, 52559, 140444, -154393, -317834, -144067, -129253, -60600, 235642, -40295, -73812, -40789, 50461, -146053]
9290h7140l6395e6921A25559a06693C29153A37834b15241b1942G1107f2356j28167
9279a90523a6181A60986h9678p0678J2049h702r3511j63281a4620n9582j66948
9268b41150K8530d6342A22723L4159b28373A09351e25361G6994b52880f5130r339
9257g4469A75970f2797l0237A26671b21805N6470B33379d144j3656k0938e832
9245A58723b14286B33405F8170a64450K7730A25104a83220m3650H4282A8108K7323
9234D5431b75463M9034O8493B13501f9100J0902C268b79293c7334I1080c61159
9222c19620A4542b9989g39H0687k6675b50679f527j19394j00625a8696k99055
9211c17751h4692k14907m3179g5889E83P2955I486b97550g3391M408C6922g7456
$$ y = [-87140, -123535, -56921, 125559, -106693, 329153, 137834, -215241, -21942, 71107, -62356, -190523, -16181, 160986, -89678, -160356, -148307, -8702, -102213, -265494, -14620, -74202, -241150, -212620, -46342, 122723, 156882, -228373, 109351, -525361, 76994, -252880, -65130, -74469, 175970, -62797, -93034, 126671, -221805, -165335, 233379, -4144, -17800, -38738, -5832, 158723, -214286, 233405, 68170, -164450, -136720, 125104, -183220, -226870, 84282, 18108, 45431, -275463, -226429, -157936, 213501, -69100, -58198, 3268, -279293, -37334, 91080, -361159, -319620, 14542, -29989, -739, 80687, 54012, -250679, -6527, -125921, -226546, -18696, -317751, -84692, -299599, -342778, -75889, 583, 73538, 9486, -297550, -73391, -68983, 36922, -77456]
9198I0284d31003a18110l3503j88569J11864J05516A39427n6390B3464b96915
9187f4899A1354c42342f5628j9090g328k23981O4203c4012j43034M7225j07877
9176b37698Q7267A9057J84414c76547J4359B1014J87559G9623b26044a11219B61673
9164d9233l0954G7450d5518p0175D05473b22350a02600F9393a30709j56459C4603
9152a74966a4396p0559b2119A77867h2263m8245A35298a3315j57373p5361C98870
9140e8143K4715j06830e2347r6470A34820b41834F4897g3937H1530a81313D3472
9128A15289a35547A38352f9101j41671c6806k83358A88670k4508b39125H9284
9117d522A82682a40797B02453a03592p6790p6233L999E4601J44944c55330M6191
$$ y = [90284, -431003, -118110, -151613, -340182, -228318, -122802, 139427, 83037, 23464, -296915, -64899, 11354, -342342, -65628, -84718, -7328, -231309, -167106, -34012, -177046, -129821, -237698, -150431, 19057, 203471, -376547, -362188, 21014, 208573, 79623, -226044, -111219, 261673, -49233, -80187, 77450, -45518, -115693, 405473, -222350, -102600, 69393, -130709, -287168, 34603, -174966, -14396, -84955, -22119, 177867, -82263, -130508, 135298, -13315, -170688, -246049, 398870, -58143, -33428, -140258, -52347, -148817, 134820, -241834, 64897, -73937, 81530, -181313, 43472, 115289, -135547, 138352, -69101, -210772, -36806, -320164, 188670, 164162, -239125, 89284, -4522, 182682, -140797, 202453, -103592, -180382, -256615, -252616, 54601, 199545, -355330, -309139]
9106c09139A49482b67695A4252L2309b48195e872j097B93169F1629b04160A23361
9094c56D94c31936P8182C337e9985k7367r2950C21868a26866L7291o9035j4882
9082a73492A50957K53296A97602r8667J51084d2033m8473q6350B13508b65894
9071a08127I1597M4921n7057a03987L1907p3996A49345b96456M0339m6520R7173
9060b05464O1000d3904k02261R6423m8836m0420J01415N191c5995k58997B94526
9048d86804a91966j4036D6350B445a19138j71144e9626A17847d29985d9003C68286
9036i0535j72418i6755H5717B3228J96540b89664J16051E39409a49359A03840
9025A48513b34618c0213r3500P872A11924M0350Q3562d25460F6971g2349n3168
$$ y = [-309139, 149482, -267695, 14252, 46561, -248195, -5872, -6969, 293169, 61629, -204160, 123361, -356, 494, -331936, -253754, 3337, -59985, -87352, -180302, 321868, -126866, -89575, -158610, -173492, 150957, 404253, 197602, 98935, 250019, -42033, -90506, -176856, 213508, -265894, -108127, 91597, 136518, 79461, -103987, -72080, -146076, 149345, -296456, -256117, -302637, -205464, -144464, -43904, -246165, -149742, -198578, -238998, -137583, -132392, -35995, -294992, 294526, -486804, -191966, -206002, 46350, 2445, -119138, -290282, -59626, 117847, -429985, -49003, 368286, -90535, -262953, -96755, 85717, 23228, 219768, -289664, -173613, 539409, -149359, 103840, 148513, -234618, -30213, -123713, -115841, 111924, 152274, 235836, -425460, 66971, -72349, -125517]
9014a25517A21154d80640a69124j65423a48683A83544a88583P5476G3350N5788
9004A29138R0123a30014q8504H8581b14686A19976i9918p5526M3665A52568P6351
8993B28919M9478h9364A07043l3893a63126B1408f5284j46328k0955B8200M7083
8982G5283b80839C14366h7296K9534A8490i936E683c79987a85962j78165f1802
8970a46297M7446o6289L7156A98738c10088n5090c9817A69689D491c53326J25954
8959b27372F3772a65940A7772c02466a11267r6968d8962l92319F004c2350A09870
8947a73133I8809d56485A86411E8167A0219J57492b2322H86g7383j85959a30458
8935b43230B60872L54713a01938j83190A89531a81557o5398a03804A69707J16974
$$ y = [-125517, 121154, -480640, -169124, -334547, -148683, 183544, -188583, -113107, 73350, 129138, 219261, -130014, -218518, 88581, -214686, 119976, -99918, -175444, -131779, 152568, 228919, 278397, -89364, 107043, 73150, -163126, 21408, -65284, -211612, -232567, 28200, 75283, -280839, 314366, -87296, -57762, 18490, -9936, 5683, -379987, -185962, -364127, -61802, -146297, -98851, -165140, -127984, 198738, -310088, -365178, -39817, 169689, 4491, -353326, -227372, 63772, -165940, 17772, -302466, -111267, -208235, -48962, -441281, 6004, -32350, 109870, -173133, 98809, -456485, 186411, 58167, 10219, 167711, -22322, 886, -77383, -263342, -130458, -243230, 260872, 615585, -101938, -285128, 189531, -181557, -246955, -103804, 169707, 286681]
8925B86681j5597L78504J221178M056267J6287031D895739A499216E12461k3545
8916D88916K8255k27416I1454N7327c2175A86943q5915j7961L10720j17092m0086
8905B36609a26040k5308n4101Q7146L8212j20018k59593b3131A31384l9839c2753
8893A74356o0214a57920p2395B24995a97210E2237b8248j08766A98189c4574p5267
8882a09841L0131j65330O3848N5486j43934i850m32308E642J26607b63474C6225
8870d54128D1156Q9895a46946D09205h9183H8099k8689b52494D7965g3911b9609
$$ y = [286681, 271084, 649588, 1870766, 5927033, 22214064, 4895739, 1499216, 512461, 488916, 517171, 289755, 91454, 148781, -32175, 186943, 101028, 83067, 393787, 276695, 236609, -126040, -151348, -205449, -118303, -80091, -200109, -459702, -23131, 131384, 91545, -32753, 174356, 114142, -157920, -230315, 224995, -197210, 52237, -28248, -137014, 198189, -34574, -109841, -79710, -245040, -181192, -125706, -269640, -9850, -442158, 5642, 132249, -263474, 36225, -454128, 41156, 131051, -146946, 409205, -89183, 88099, 59410, -252494, 47965, -73911, -29609]
$$ [...]
##END NTUPLES=NMR SPECTRUM
##END=
