
##TITLE=UV1263_M12_1292-1216_5_7414465_SWiK2NhbUS
##JCAMPDX= 6.0         $$ Bruker NMR JCAMP-DX V2.0
##DATA TYPE= NMR SPECTRUM
##DATA CLASS= NTUPLES
##ORIGIN= BRUKER
##OWNER= Administrator
$$ 1.72 TOPSPIN		Version 2.1
$$ 2013-01-25 18:55:12.061 -0500  Administrator@X
$$ Compression mode = diff/dup
##.OBSERVE FREQUENCY= 400.02188249412
##.OBSERVE NUCLEUS= ^1H
##.ACQUISITION MODE= SIMULTANEOUS (DQD)
##.ACQUISITION SCHEME= undefined
##.AVERAGES= 8
##.DIGITISER RES= 22
##SPECTROMETER/DATA SYSTEM= spect
##.PULSE SEQUENCE= zg30
##.SOLVENT NAME= COFFEE_meoh
##.SHIFT REFERENCE= INTERNAL, COFFEE_meoh, 1, 14.98509
##AUDIT TRAIL= $$ (NUMBER, WHEN, WHO, WHERE, PROCESS, VERSION, WHAT)
$$ ##TITLE= Audit trail, TOPSPIN		Version 2.1
$$ ##JCAMPDX= 5.01
$$ ##ORIGIN= Bruker BioSpin GmbH
$$ ##OWNER= Administrator
$$ $$ E:\/data/COFFEE/nmr/UV1263_M12_1292-1216_5_7414465_SWiK2NhbUS/10/pdata/1/auditp.txt
$$ ##AUDIT TRAIL=  $$ (NUMBER, WHEN, WHO, WHERE, PROCESS, VERSION, WHAT)
(   1,<2013-01-25 18:55:03.982 -0500>,<Administrator>,<X>,<go>,<TOPSPIN 2.1>,
      <created by zg
	started at 2013-01-25 18:53:57.951 -0500,
	POWCHK enabled, PULCHK disabled,
       configuration hash MD5:
       86 BA 57 50 F2 9D 5C 9B 26 00 A9 28 5F 66 2E 89
       data hash MD5: 64K
       24 36 59 67 23 A0 F5 3A B6 BF 68 1A 7C B4 65 E3>)
(   2,<2013-01-25 18:55:07.061 -0500>,<Administrator>,<X>,<proc1d>,<TOPSPIN 2.1>,
      <Start of raw data processing
       efp LB = 0 FT_mod = 6 PKNL = 1 PHC0 = 0 PHC1 = 0 SI = 32K 
       data hash MD5: 32K
       86 9C BF E2 30 DF 69 AF 4D 98 EC 45 EA 53 E7 37>)
(   3,<2013-01-25 18:55:07.514 -0500>,<Administrator>,<X>,<proc1d>,<TOPSPIN 2.1>,
      <pk PHC0 = 99.81079 PHC1 = 0 
       data hash MD5: 32K
       F3 B6 8C 7A 99 C2 D9 75 9F 57 18 E7 11 5E 5E 73>)
(   4,<2013-01-25 18:55:07.732 -0500>,<Administrator>,<X>,<proc1d>,<TOPSPIN 2.1>,
      <abs ABSG = 1 
       data hash MD5: 32K
       61 EE 6A 27 BC 0A C6 F6 F6 B2 70 59 E3 B1 33 0D>)
(   5,<2013-01-25 18:55:07.873 -0500>,<Administrator>,<X>,<proc1d>,<TOPSPIN 2.1>,
      <abs ABSG = 2 
       data hash MD5: 32K
       E7 4E 28 29 4F 48 60 2B 5B BD 73 34 EC 02 F1 01>)
(   6,<2013-01-25 18:55:08.029 -0500>,<Administrator>,<X>,<proc1d>,<TOPSPIN 2.1>,
      <abs ABSG = 3 
       data hash MD5: 32K
       16 B1 1C E2 8A D5 16 B7 DA 56 37 7F 62 69 65 0D>)
(   7,<2013-01-25 18:55:08.170 -0500>,<Administrator>,<X>,<proc1d>,<TOPSPIN 2.1>,
      <abs ABSG = 4 
       data hash MD5: 32K
       B1 C8 65 AB 11 DA D5 6A 51 69 A2 A1 94 9F 6D E3>)
(   8,<2013-01-25 18:55:08.326 -0500>,<Administrator>,<X>,<proc1d>,<TOPSPIN 2.1>,
      <abs ABSG = 5 
       data hash MD5: 32K
       06 A9 47 EA AC FB 50 24 59 89 2D 53 97 47 9E 6A>)
$$ ##END=
$$ 
$$ $$ hash MD5
$$ $$ 65 42 0F 76 8A EF E3 27 7F 4E 36 C6 D2 98 3C D2
##$RELAX= 
##$RELAX= 
##$RELAX= 
##$RELAX= 
##$RELAX= 
##$RELAX= 
##$RELAX= 
$$ Bruker specific parameters
$$ --------------------------
##$DU= <E:\>
##$EXPNO= 10
$$ [...]
150 150 150 150 150 150 150 150
##$TP07= 0
##$TPNAME0= <>
##$TPNAME1= <>
##$TPNAME2= <>
##$TPNAME3= <>
##$TPNAME4= <>
##$TPNAME5= <>
##$TPNAME6= <>
##$TPNAME7= <>
##$TPOAL= (0..7)
0.5 0.5 0.5 0.5 0.5 0.5 0.5 0.5
##$TPOFFS= (0..7)
0 0 0 0 0 0 0 0
##$TUNHIN= 0
##$TUNHOUT= 0
##$TUNXOUT= 0
##$USERA1= <user>
##$USERA2= <user>
##$USERA3= <user>
##$USERA4= <user>
##$USERA5= <user>
##$V9= 5
##$VALIST= <valist>
##$VCLIST= <CCCCCCCCCCCCCCC>
##$VD= 0
##$VDLIST= <DDDDDDDDDDDDDDD>
##$VPLIST= <PPPPPPPPPPPPPPP>
##$VTLIST= <TTTTTTTTTTTTTTT>
##$WBST= 2048
##$WBSW= 25
##$XGAIN= (0..3)
0 0 0 0
##$XL= 0
##$YL= 0
##$YMAX_a= 629665
##$YMIN_a= -538113
##$ZGOPTNS= <>
##$ZL1= 120
##$ZL2= 120
##$ZL3= 120
##$ZL4= 120
##$ABSF1= 14.98509
##$ABSF2= -5.573092
##$ABSG= 5
##$ABSL= 3
##$ALPHA= 0
##$AQORDER= 0
##$ASSFAC= 0
##$ASSFACI= 0
##$ASSFACX= 0
##$ASSWID= 0
##$AUNMP= <proc_prof1d_extract_pilot.lims>
##$AXLEFT= 0
##$AXNAME= <>
##$AXNUC= <1H>
##$AXRIGHT= 0
##$AXTYPE= 0
##$AXUNIT= <>
##$AZFE= 0.1
##$AZFW= 0.1
##$BCFW= 0
##$BC_mod= 0
##$BYTORDP= 0
##$COROFFS= 0
##$CY= 15
##$DATMOD= 1
##$DC= 0
##$DFILT= <>
##$DTYPP= 0
##$F1P= 0
##$F2P= 0
##$FCOR= 0.5
##$FTSIZE= 32768
##$FT_mod= 6
##$GAMMA= 0
##$GB= 0
##$INTBC= 1
##$INTSCL= 1
##$ISEN= 128
##$LB= 0
##$LEV0= 0
##$LPBIN= 0
##$MAXI= 10000
##$MC2= 0
##$MEAN= 0
##$ME_mod= 0
##$MI= 0
##$NCOEF= 0
##$NC_proc= -8
##$NLEV= 6
##$NOISF1= 0
##$NOISF2= 0
##$NSP= 0
##$NTH_PI= 0
##$NZP= 0
##$OFFSET= 14.98509
##$PC= 1
##$PHC0= 99.81079
##$PHC1= 0
##$PH_mod= 1
##$PKNL= yes
##$PPARMOD= 0
##$PPDIAG= 0
##$PPIPTYP= 0
##$PPMPNUM= 2147483647
##$PPRESOL= 1
##$PSCAL= 4
##$PSIGN= 0
##$PYNMP= <proc.py>
##$REVERSE= no
##$SF= 400.02
##$SI= 32768
##$SIGF1= 0
##$SIGF2= 0
##$SINO= 400
##$SIOLD= 32768
##$SPECTYP= <>
##$SREGLST= <1H.CDCl3>
##$SSB= 0
##$STSI= 32768
##$STSR= 0
##$SW_p= 8223.68421052631
##$SYMM= 0
##$S_DEV= 0
##$TDeff= 65536
##$TDoff= 0
##$TI= <>
##$TILT= no
##$TM1= 0
##$TM2= 0
##$TOPLEV= 0
##$USERP1= <user>
##$USERP2= <user>
##$USERP3= <user>
##$USERP4= <user>
##$USERP5= <user>
##$WDW= 1
##$XDIM= 32768
##$YMAX_p= 470368241
##$YMIN_p= -720771
##$CURPLOT= <Network HP LaserJet P1505>
##$CURPRIN= <$Network HP LaserJet P1505>
##$DFORMAT= <normdp>
##$LAYOUT= <+/1D_H.xwp>
##$LFORMAT= <normlp>
##$PFORMAT= <normpl>
##$SURQMSG= 1
$$ End of Bruker specific parameters
$$ ---------------------------------
##NTUPLES= NMR SPECTRUM
##VAR_NAME=  FREQUENCY,     SPECTRUM/REAL,   SPECTRUM/IMAG
##SYMBOL=    X,             R,               I
##VAR_TYPE=  INDEPENDENT,   DEPENDENT,       DEPENDENT
##VAR_FORM=  AFFN,          ASDF,            ASDF
##VAR_DIM=   32768,         32768,           32768
##UNITS=     HZ,            ARBITRARY UNITS, ARBITRARY UNITS
##FACTOR=    0.250966925370066, 1,           1
##FIRST=     8223.43324360094, 23453,        -43128
##LAST=      0,             152633,          -44047
##MIN=       0,             -720771,         0
##MAX=       8223.43324360094, 470368241,    0
$$ Real data points
##PAGE= N=1
##DATA TABLE= (X++(R..R)), XYDATA
$$ [...]
19543a15458B52257A06912i004m7873k60285B2246m268c6778k24212A61605Q1378
$$ -115458 252257 106912 -9004 -56877 -317162 22246 17978 -36778 -260990 161605 242983
19532B42983b5037D236Q1085a50409j22915J07959k31421a7157j91266g0857A23088
$$ 242983 -25037 4236 85321 -150409 -273324 -165365 -396786 -17157 -208423 -70857 123088
19520a2966A17747c3491j13588d2645I012M9078a35518a0569j22680f5944C2328
$$ -12966 117747 -33491 -147079 -42645 9012 58090 -135518 -10569 -133249 -65944 32328
19508a77214L0327A8219d6957k27853o5634i4487j21098c6917A23408g4527j30516
$$ -177214 -146887 18219 -46957 -274810 -340444 -94487 -215585 -36917 123408 -74527 -205043
19497b05043m5587P5085d6799j71210H1897b2538j86359P3761O6736j86525l1898
$$ -205043 -250630 -175545 -46799 -218009 81897 -22538 -208897 -135136 -68400 -254925 -286823
19486b86823A14949N06999A81828b80166j28115O4737i2261K1929L0534A31099
$$ -286823 114949 621948 181828 -280166 -408281 -343544 -92261 -70332 -39798 131099
19475a57116B3111a92350k02250e8526k50008J18692B9715b93561J05096k9502
$$ -157116 23111 -192350 -394600 -58526 -308534 -189842 29715 -293561 -188465 -217967
19465b17967D5076a35539j06517H3234R2953a18061D19472b83687P6106A29031
$$ -217967 45076 -135539 -242056 83234 176187 -118061 419472 -283687 -207581 129031
19454c88131C70586a14912k3569n1658O7995K2979A04369b40984A67329M3988
$$ -388131 370586 -114912 -138481 -190139 -122144 -99165 104369 -240984 167329 211317
19444B11317a70013f1420A27434P333c4640o1590M5985A39833l2718a21788B08683
$$ 211317 -170013 -61420 127434 134767 -34640 -96230 -50245 139833 107115 -121788 208683
19432H2979P861g1436A33840a55773C65421a01866h970k2595A00238h5057B7047
$$ 82979 90840 -71436 133840 -155773 365421 -101866 -8970 -31565 100238 -85057 27047
19420a76296B14397c11920E3676b63726A69231o2746b40010L7b6307B6894a34386
$$ -176296 214397 -311920 53676 -263726 169231 106485 -240010 -239973 -26307 26894 -134386
19408h163A30988J19947M0131a55956L2429m032d0545k6909m680k39241B02135
$$ -8163 130988 250935 291066 -155956 -123527 -127559 -40545 -67454 -72134 -311375 202135
19396c15311j7949h1273L4454q4416O2179r1739A88559L1536b36080a13963k39064
$$ -315311 -333260 -81273 -46819 -131235 -69056 -160795 188559 220095 -236080 -113963 -353027
19385c53027a50345m4799g2584B49151E4444f2410l0513q3582C5556a16980A98226
$$ -353027 -150345 -195144 -72584 249151 54444 -62410 -92923 -176505 35556 -116980 198226
19373a30314B98241A06255h260j80689a9263G4504d04879a11328j85365O9890
$$ -130314 298241 106255 -8260 -188949 -19263 74504 -404879 -111328 -296693 -226803
19363b26803E8125b22345a0611n3588B55157a70850C30399D8835e09472A9650
$$ -226803 58125 -222345 -10611 -64199 255157 -170850 330399 48835 -509472 19650
19352B52262c78160B39831b83001B6175A0787h3108G5388b13271J01360A57340
$$ 252262 -378160 239831 -283001 26175 10787 -83108 75388 -213271 -111911 157340
19341b31872j53271a59703d3381D9051A0409f7326K5219k27463a9524F9903b43345
$$ -231872 -385143 -159703 -43381 49051 10409 -67326 -42107 -269570 -19524 69903 -243345
19329B2444e14635H3455a03629M458j10427A50040b21895L0397g7607A74240h7381
$$ 22444 -514635 83455 -103629 -99171 -209598 150040 -221895 -191498 -77607 174240 -87381
19317A4575b39383B05088c09309h083l75540J84711C0450b20054A58343n2195
$$ 14575 -239383 205088 -309309 -8083 -383623 -198912 30450 -220054 158343 106148
19307A06148e5700A82270a81461E8788L7123c92613A55773D0327J21403E9027
$$ 106148 -55700 182270 -181461 58788 95911 -392613 155773 40327 161730 59027
19296a79344E9369b31447a4817A22574a37674k62970C17483A03634b23235C0695
$$ -179344 59369 -231447 -14817 122574 -137674 -400644 317483 103634 -223235 30695
19285b87179C0263a82746A8919i1389k62400B5039i0772c1825D66637a23387e1353
$$ -287179 30263 -182746 18919 -91389 -353789 25039 -90772 -31825 466637 -123387 -51353
19273a63417k63465b04505Q6086J3205C28715a54180e7065J4431j60908d1850
$$ -163417 -426882 -204505 -118419 -105214 328715 -154180 -57065 -42634 -203542 -41850
19262c8308C3906a88231J8071C9557i1818A00851J20036C2460b95795M0440h8333
$$ -38308 33906 -188231 -170160 39557 -91818 100851 220887 32460 -295795 -255355 -88333
19250C0008J77431a14538k75144a01623d8764B6160J37114c74384J85654d0919
$$ 30008 207439 -114538 -389682 -101623 -48764 26160 163274 -374384 -188730 -40919
19239G1101l111c1098F0925a39200Q3A26745o2758e9912A31300a09656D819c6337
$$ 71101 67990 -31098 60925 -139200 -139117 126745 63987 -59912 131300 -109656 4819 -36337
19226a2637k44072j8776J36607j59258a29216A15646d5960j06919B56021b68182
$$ -12637 -256709 -275485 -138878 -298136 -129216 115646 -45960 -152879 256021 -268182
19215b74611k03335B68716o9750a1764l82340P9064a04060c0072C07036A07784
$$ -274611 -477946 268716 198966 -11764 -394104 -315040 -104060 -30072 307036 107784
19204B20320l9415B4375K63869A2534a10713l97222c9056B43635a79914E7517
$$ 220320 180905 24375 288244 12534 -110713 -507935 -39056 243635 -179914 57517
19193A6898c21093a17819j07356j6186B17649C7292b64101R5559A85920a50220
$$ 16898 -321093 -117819 -225175 -241361 217649 37292 -264101 -168542 185920 -150220
19182C1983h4427A91692F6351b66187J3775d6655J904k73953A05424J6430K31293
$$ 31983 -84427 191692 66351 -266187 -252412 -46655 -44751 -318704 105424 121854 353147
19171C53147a50614H8422L31573c11539f62I4826J02329e3331A07294A8637J02377
$$ 353147 -150614 88422 419995 -311539 -662 94826 197155 -53331 107294 18637 121014
19160A21014a24913J9414j01607A71767F0357o46f9404A74587H2525c99836h8361
$$ 121014 -124913 -105499 -207106 171767 60357 59711 -69404 174587 82525 -399836 -88361
19148d43977A73423d9189D05878f3393r2785B298b01722h3729m08625A65155D0386
$$ -443977 173423 -49189 405878 -63393 -156178 2298 -201722 -83729 -492354 165155 40386
19136b47265R4903A90101E3888J8357a67856n9443C19512A0345M4323b15894b9780
$$ -247265 -152362 190101 53888 72245 -167856 -227299 319512 10345 54668 -215894 -29780
19124b35261d0l0197n9974A18082F880a29925d7290p9748D2316a0180j0957j245
$$ -235261 -40 -30237 -90211 118082 6880 -129925 -47290 -127038 42316 -10180 -21137 -22382
19112b2382j59071P229A22098R6907a85513l1350f2022l62508F4680a45172j4906
$$ -22382 -181453 -174224 122098 219005 -185513 -216863 -62022 -424530 64680 -145172 -160078
19101a60078n1302B8631h9669a1042n8716q9571I3044j750a97491n0645B87359
$$ -160078 -211380 28631 -89669 -11042 -69758 -159329 93044 91294 -197491 -248136 287359
19089b4087B01791a38601k0330K1355c3306B60564g8113G6014g6970j61087k17727
$$ -24087 201791 -138601 -158931 -137576 -33306 260564 -78113 76014 -76970 -238057 -455784
19078d55784a53266A20023D5511A4949b9445A12825a21840n866A55271o9495b85449
$$ -455784 -153266 120023 45511 14949 -29445 112825 -121840 -127706 155271 85776 -285449
19066A3862h9053k16049J37277C11245a74723c9810A32185b29979A55717E9687
$$ 13862 -89053 -305102 -167825 311245 -174723 -39810 132185 -229979 155717 59687
19055A00690B8285c7535j03507k9606F3017q209b28974B04933c28014i1104B57993
$$ 100690 28285 -37535 -141042 -170648 63017 54808 -228974 204933 -328014 -91104 257993
19043a90599I4902K64262D1092J19657K8476D5253a23308m4535B92238a48538
$$ -190599 94902 359164 41092 160749 189225 45253 -123308 -167843 292238 -148538
19032C61428g4959m3579L8179A8137a76669A14544e630l83959A37098L2540e6814
$$ 361428 -74959 -118538 -80359 18137 -176669 114544 -5630 -389589 137098 169638 -56814
19020a93992N7774b1926k7971D2115g5559l08496J72782H3179a51474j4654l6302
$$ -193992 -136218 -21926 -49897 42115 -75559 -384055 -211273 83179 -151474 -166128 -202430
19009b02430B8920h0632c2300j03369l2316A01398b93211E5363j3555J07481d4560
$$ -202430 28920 -80632 -32300 -135669 -167985 101398 -293211 55363 41808 149289 -44560
18997i154j64267A98337h2669E7576a91808A48810b71985i0911n0263B86854j41466
$$ -9154 -173421 198337 -82669 57576 -191808 148810 -271985 -90911 -141174 286854 145388
18986A45388C39a17228M7692M468j98931q2105C76458a89472R1683K9824A66268
$$ 145388 339 -117228 -69536 -65068 -263999 -346104 376458 -189472 -97789 -67965 166268
18974c98B12919a80764A15214J0785a40082H3543C868a12012K5366H5623a23986
$$ -398 212919 -180764 115214 125999 -140082 83543 3868 -112012 -86646 85623 -123986
18962b0517j04880J9558d9081k94070d0437A71971K3202i1010j58685b6995j41255
$$ -20517 -125397 -105839 -49081 -343151 -40437 171971 195173 -91010 -249695 -26995 -168250
18951a68250n1562H4617a09073J3753C50269a3172r4361A68437j5123b65422A33715
$$ -168250 -219812 84617 -109073 -95320 350269 -13172 -107533 168437 153314 -265422 133715
18939a63439n8114H880M4885c3334j4676I7340D1038c1305j28223k53086B78049
$$ -163439 -221553 8880 53765 -33334 -48010 97340 41038 -31305 -159528 -412614 278049
18927A33841D4943d79304a24926m9981k7100N7501A38508j6353n3479a9776n6400
$$ 133841 44943 -479304 -124926 -174907 -202007 -144506 138508 122155 68676 -19776 -76176
18916g6176j167B11638E8791J34294l1888o7457a8510k03545Q3740a9945F0403
$$ -76176 -77343 211638 58791 193085 161197 93740 -18510 -222055 -138315 -19945 60403
18904A81688j2027F0849a58448B44718a67618m607N344Q3199k979L007b2915B32490
$$ 181688 169661 60849 -158448 244718 -167618 -172225 -166881 -83682 -86661 -83654 -22915 232490
18891d8524j40408B03541E0417M0638h0142j22433a8942j31801b7844j91016k0328
$$ -48524 -188932 203541 50417 91055 -80142 -202575 -18942 -150743 -27844 -218860 -239188
18880b39188a10730j2580c9140k65404h3357H4698d41820a5247j11143j31504
$$ -239188 -110730 -123310 -39140 -304544 -83357 84698 -441820 -15247 -126390 -257894
18870b57894A35942a80667O3683l5076e4701J3464j27127k15104a34279c9974
$$ -257894 135942 -180667 -116984 -152060 -54701 -41237 -168364 -383468 -134279 -39974
18859a87574A45150b2797D7712J30794L5719b3371A40871d93987C29341a96262
$$ -187574 145150 -22797 47712 178506 214225 -23371 140871 -493987 329341 -196262
18848B6008b39685B8473A73O9943d67828E4547J8257M2583b50361a2569C387a04056
$$ 26008 -239685 28473 173 70116 -467828 54547 72804 115387 -250361 -12569 3387 -104056
18835A06873H47J614a05146b5676I5487K7716a9619E7524N9932a05984j73117
$$ 106873 847 2461 -105146 -25676 95487 123203 -19619 57524 117456 -105984 -279101
18824b79101A4264N9396d3456j7832B3049a29037E38809A08127b52905B71967
$$ -279101 14264 73660 -43456 -61288 23049 -129037 538809 108127 -252905 271967
18813A75392G5568N1415h9275B60038o4960b07938A25208e0372j69378g5932c1875
$$ 175392 75568 126983 -89275 260038 195078 -207938 125208 -50372 -219750 -75932 -31875
18801B12135b13691M0301j72120R8647a18279b9157B16545d7028p6879j3732a8157
$$ 212135 -213691 -173390 -345510 -246863 -118279 -29157 216545 -47028 -123907 -137639 -18157
18789E5469Q559a49962E5986a09729G6339a45732n5120a6857r4763B06808j01404
$$ 55469 64028 -149962 55986 -109729 76339 -145732 -200852 -16857 -111620 206808 105404
18778A05404D7a17563e8707k3226k8891M0045C9551c1504q2852j61659g78B8153
$$ 105404 47 -117563 -58707 -81933 -110824 -70779 39551 -31504 -114356 -276015 -778 28153
18765a13433r1748C132i053p4676A54490l0402J6320h5610n9331d9849B44297
$$ -113433 -205181 3132 -9053 -83729 154490 124088 140408 -85610 -144941 -49849 244297
18753A38692a57830r2377g5347B39289d49183h1087l6637r4344O1301A28828b65665
$$ 138692 -157830 -250207 -75347 239289 -449183 -81087 -117724 -212068 -150767 128828 -265665
18741b62130a09122c4894A15113b42813C6917a69694B54152a73495j3564j1137
$$ -262130 -109122 -34894 115113 -242813 36917 -169694 254152 -173495 -187059 -198196
18731a98196d3931j87791B0475J62272F8901f507A14874C8104J1663a56579A22715
$$ -198196 -43931 -231722 20475 182747 68901 -6507 114874 38104 49767 -156579 122715
18719B4131i6498M7449B7222N2066d17586C9826c43602d9901j3969B93732g0673
$$ 24131 -96498 -49049 27222 79288 -417586 39826 -343602 -49901 -63870 293732 -70673
18707f352k74426J10702k65271O6943G7208b01307p9061p150c887o4222K8918
$$ -6352 -280778 -170076 -435347 -368404 77208 -201307 -280368 -287518 -3887 -68109 -39191
18696c9191H1745a35699M7435l57401B57934G513d2901A94125D0530e5401L444
$$ -39191 81745 -135699 -88264 -445665 257934 7513 -42901 194125 40530 -55401 -51957
18685e1957j8265m0047b1492A89395a58181a329B684c14166l44254c1028B40210
$$ -51957 -70222 -110269 -21492 189395 -158181 -1329 2684 -314166 -658420 -31028 240210
18673a54708A13017a5236B4471J17732a71192b0147k81527D82442a45005M1288
$$ -154708 113017 -15236 24471 142203 -171192 -20147 -301674 482442 -145005 -103717
18663a03717H8203c08887f1872D5506J76612b45323L1711A86537d65081J87615
$$ -103717 88203 -308887 -61872 45506 222118 -245323 -213612 186537 -465081 -277466
18653b77466M878h0524o4160C3893K2050i3413K5385C8850a28726B08164I8155
$$ -277466 -272588 -80524 -144684 33893 55943 -93413 -68028 38850 -128726 208164 98155
18641A36823c6229k04889J19891B06013b77753A37224B9409K02227b8280j95936
$$ 136823 -36229 -241118 -121227 206013 -277753 137224 29409 231636 -28280 -224216
18631b24216A59187b289j69574e6351k1314E2903M2636Q0818b62063e2355B28756
$$ -224216 159187 -2289 -171863 -56351 -77665 52903 95539 176357 -262063 -52355 228756
18619a15156A20301b23889f6627M263A63853C1613c5094C56353b16896j66446
$$ -115156 120301 -223889 -66627 -62364 163853 31613 -35094 356353 -216896 -383342
18609c83342a37016F6717e9469k8251j63799f7666j95378f7781A15676f5177A43319
$$ -383342 -137016 66717 -59469 -87720 -251519 -67666 -263044 -67781 115676 -65177 143319
18597B20912a1848k21946r9128b2050B44243f7775C0038b35302A44001o3024d90996
$$ 220912 -11848 -233794 -332922 -22050 244243 -67775 30038 -235302 144001 80977 -490996
18585C9866a34943A12111l1290a6668k01051a4053k00517D2540d0914o9186l00588
$$ 39866 -134943 112111 80821 -16668 -217719 -14053 -214570 42540 -40914 -110100 -410688
18574d10688d396A01697f5566k24116p1190H0041d0195B0533b65972F1111j5237
$$ -410688 -4396 101697 -65566 -289682 -360872 80041 -40195 20533 -265972 61111 45874
18563D5874M4723g1871B23560A1711b12497j1093j0106A24160j9016L8261a93603
$$ 45874 90597 -71871 223560 11711 -212497 -223590 -233696 124160 105144 143405 -193603
18551a9997p3370l8373J1604A69497c33588e6647k5515d274H2445a87679B68908
$$ -19997 -93367 -131740 -120136 169497 -333588 -56647 -82162 -4274 82445 -187679 268908
18539b56301P1642D0349d5846j98472o794P4304R853p3490k85980a6190B2421
$$ -256301 -184659 40349 -45846 -244318 -251112 -176808 -166955 -240445 -526425 -16190 22421
18527B16967b84542B2275d3114j14052A04125f7793j42939I0105a62020j83009
$$ 216967 -284542 22275 -43114 -157166 104125 -67793 -210732 90105 -162020 -345029
18517c45029A69442i789k14776A35782D336J70289b50474a19197j09953d4705
$$ -345029 169442 -9789 -224565 135782 4336 174625 -250474 -119197 -229150 -44705
18506B7328J94664c8146q593j83031a5572k35399A5053J52798d517j32893r180
$$ 27328 221992 -38146 -46739 -229770 -15572 -250971 15053 167851 -4517 -137410 -146590
18495a46590l2274j3210A22056a58003j5814d7157b2945j15683C98002A8500K94698
$$ -146590 -178864 -192074 122056 -158003 -173817 -47157 -22945 -138628 398002 18500 313198
18484C13198d13620D377K40342l2319B0217g0625a5661k10847A48171b61189g2374
$$ 313198 -413620 4377 244719 212400 20217 -70625 -15661 -226508 148171 -261189 -72374
18472A7350b740B2580c7238m061A59814J32681F825J07065f7860G3866j6866h408
$$ 17350 -2740 22580 -37238 -41299 159814 292495 6825 113890 -67860 73866 57000 -8408
18459B3838J24484b84631A48791B0103J74408p1215d4277B1098L0398g9677M24
$$ 23838 148322 -284631 148791 20103 194511 123296 -44277 21098 51496 -79677 -79253
18448g9253q8573B03583a51857B48638a78088N7039j44749J10318M9074A80656
$$ -79253 -167826 203583 -151857 248638 -178088 -121049 -265798 -155480 -106406 180656
18437E5639b99360D7832L8111J27759G3577i2852E6150e9884o2943F1675K18119
$$ 55639 -299360 47832 85943 213702 73577 -92852 56150 -59884 -122827 61675 279794
18426B79794g8383o416A55870f5010A89330K95082a82378c3921A48996o8877F440
$$ 279794 -78383 -84799 155870 -65010 189330 484412 -182378 -33921 148996 80119 6440
18414g7641B97019A26030I405c24557B14226r5600a18554b5291l6204A41772a03211
$$ -77641 297019 126030 9405 -324557 214226 118626 -118554 -25291 -61495 141772 -103211
18402B62084f0896r231F9802C4078J82312b96325J46656l6371M7402E8900d6155
$$ 262084 -60896 -70127 69802 34078 216390 -296325 -149669 -186040 -138638 58900 -46155
18390a35743o8271A61204a03479o560F8426A9940b39529A15234g996j40059b6490
$$ -135743 -204014 161204 -103479 -110039 68426 19940 -239529 115234 -7996 -148055 -26490
18378a48532K1751M9324C63041A58617J2000q4124i2617B6385J37638a08970k8716
$$ -148532 -126781 -77457 363041 158617 170617 86493 -92617 26385 164023 -108970 -137686
18367a37686A52927J27417q6092G6385a80214j51496e4412j88729e037C6286f572
$$ -137686 152927 280344 194252 76385 -180214 -331710 -54412 -243141 -5037 36286 -6572
18355b72833A54550p4695f6839K1917C1887a12605d8546o5667J8001A95532c37337
$$ -272833 154550 79855 -66839 -44922 31887 -112605 -48546 -114213 -96212 195532 -337337
18343D1046a51626F422O097b76280J35569j31424M2348F2379K86335j52647C8591
$$ 41046 -151626 6422 12519 -276280 -140711 -272135 -229787 62379 348714 196067 38591
18331A3273a45288F7212L9269b83134b5668j1199A40471b41473D07812b37990
$$ 13273 -145288 67212 106481 -283134 -25668 -36867 140471 -241473 407812 -237990
18320A95421a63230B19429h7997m344i03r4219d1606r3089l06263e3236j24547
$$ 195421 -163230 219429 -87997 -92341 -903 -95122 -41606 -134695 -440958 -53236 -177783
18309a77783e5029J9798k46732e8025j10441n4343n6390g3144A15812b53884D0060
$$ -177783 -55029 -35231 -281963 -58025 -168466 -222809 -279199 -73144 115812 -253884 40060
18297b54560C4559K26044A19049C6140b77296K9317d9031J714F8917B7060d25890
$$ -254560 34559 260603 119049 36140 -277296 -247979 -49031 -47317 68917 27060 -425890
18285b22528o6811Q8670D2189J19251r42b21803h2407c9679o7194j43341I888
$$ -222528 -289339 -200669 42189 161440 160498 -221803 -82407 -39679 -106873 -250214 9888
18273B7336c34715J01916D4277A2168a65921j37375e8760j97821a5444B9414a03057
$$ 27336 -334715 -232799 44277 12168 -165921 -303296 -58760 -256581 -15444 29414 -103057
18261a37779L6706d0045D4243J16729O9539a42119d9393A48935F4507e9427B71595
$$ -137779 -101073 -40045 44243 160972 230511 -142119 -49393 148935 64507 -59427 271595
18249d39732a23680C44535c19417a25565L398d1089j55747A1745a02247C3829
$$ -439732 -123680 344535 -319417 -125565 -122167 -41089 -196836 11745 -102247 33829
18238a89265D12410H8952a97086C65503b53230g8465j05809A35949h7609B4426
$$ -189265 412410 88952 -197086 365503 -253230 -78465 -184274 135949 -87609 24426
18227H48K5254c58370J09597B34254E2239a1089B39354c73440e6540A95419G7079
$$ 848 26102 -358370 -248773 234254 52239 -11089 239354 -373440 -56540 195419 77079
18215C7550a93872E9050a70742A02155a85396A29007E6685g1984k35223k00726
$$ 37550 -193872 59050 -170742 102155 -185396 129007 56685 -71984 -307207 -507933
18205e07933a0936o5545k48624a1069A10022g4066k35650a03746j01846j8689
$$ -507933 -10936 -76481 -325105 -11069 110022 -74066 -309716 -103746 -205592 -224281
18195b24281J02720B63521q2822b3932j11946j17009J25704j83989b6248A37652
$$ -224281 -121561 263521 180699 -23932 -135878 -252887 -127183 -311172 -26248 137652
18184b92156h3426I8746J68733b23832m2559C4637e3085r7943j7896M8913C06032
$$ -292156 -83426 98746 267479 -223832 -266391 34637 -53085 -151028 -168924 -120011 306032
18172c33953J24031a6430D27282b39059J14501j18102B48931f5241H0754B2002
$$ -333953 -209922 -16430 427282 -239059 -124558 -242660 248931 -65241 80754 22002
18161d4836j89726A83103K0000I5388g6117a3842A45910B6848P0798d07581C2397
$$ -44836 -234562 183103 203103 95388 -76117 -13842 145910 26848 97646 -407581 32397
18149A67002J9022E8617M68110a52670F7246c04632A73947f9249q8214l5423c3215
$$ 167002 186024 58617 526727 -152670 67246 -304632 173947 -69249 -157463 -192886 -33215
18137c1119B35113a63581d9465B38357d2570A25929b56756Q6728G642b07466j24234
$$ -31119 235113 -163581 -49465 238357 -42570 125929 -256756 -170028 7642 -207466 -331700
18126c31700F8988p92f1163H2297c08247f3454j19024g2144B01894b61150h7233
$$ -331700 68988 68196 -61163 82297 -308247 -63454 -182478 -72144 201894 -261150 -87233
18114a98748B31267a90677J8105A97854A1003l59J52988a83595f4895b8188A12400
$$ -198748 231267 -190677 -172572 197854 11003 10644 163632 -183595 -64895 -28188 112400
18102C26680h4549j8799D7923a61133A00108b20681l1654P4045D40984A20233
$$ 326680 -84549 -103348 47923 -161133 100108 -220681 -252335 -178290 440984 120233
18091a23871k29245a03819B4750J1060G180a23856M090a9207B26813H8146c65838
$$ -123871 -353116 -103819 24750 35810 7180 -123856 -119766 -19207 226813 88146 -365838
18079b88194c8132C7363d3762j06347A67604m0494l0419a60932A21513J9704g0032
$$ -288194 -38132 37363 -43762 -150109 167604 127110 96691 -160932 121513 141217 -70032
18067A04517a16574A70470n5695J33207e5858G3420c51464a57745A44280c1918
$$ 104517 -116574 170470 114775 247982 -55858 73420 -351464 -157745 144280 -31918
18056I6593b3577F8076a09790A11046J40757H0921h2268b7064j0210j85405h657
$$ 96593 -23577 68076 -109790 111046 251803 80921 -82268 -27064 -37274 -222679 -8657
18044A60156p6868J86176C1506a87058j78116H3647J77890a07532a5629n0622
$$ 160156 83288 269464 31506 -187058 -365174 83647 261537 -107532 -15629 -66251
18034f6251j81688B38659A07884L24073c606j31352e126m3637o8037E1809d9031
$$ -66251 -247939 238659 107884 431957 -3606 -134958 -5126 -48763 -116800 51809 -49031
18022A13791f3620J4462j29205f6935B35268b2106m54557C38789E2774K39142
$$ 113791 -63620 -49158 -178363 -66935 235268 -22106 -476663 338789 52774 291916
18012B91916j04647n2491M8632q3065a95380F2825b01146F8241a73065j86376
$$ 291916 187269 134778 183410 100345 -195380 62825 -201146 68241 -173065 -359441
18002c59441A6044M077d7304k19449g0600m52413C39070F6897e2270n0136l04048
$$ -359441 16044 20121 -47304 -266753 -70600 -523013 339070 66897 -52270 -102406 -406454
17991d06454O1330G5733a17616B61526a77502B75622e3141A43456b57818a13817
$$ -406454 -345124 75733 -117616 261526 -177502 275622 -53141 143456 -257818 -113817
17980c00772a01464C07064A00047a56346H8361R576a63437C9912g3899k9842k41232
$$ -300772 -101464 307064 100047 -156346 88361 97937 -163437 39912 -73899 -103741 -344973
17969c44973i7576q4571N5469j41653E113R0703b62971A61845b58708F236K65964
$$ -344973 -97576 -182147 -126678 -268331 5113 95816 -262971 161845 -258708 6236 272200
17958B72200a44891L1416a8328o4905j00298f0754j40647A02507b99783B1545
$$ 272200 -144891 -113475 -18328 -83233 -183531 -60754 -201401 102507 -299783 21545
17947h218l361m7796A61357E7538c37382A61486c6920j68589H6740N169a12019
$$ -8218 -11579 -59375 161357 57538 -337382 161486 -36920 -205509 86740 91909 -112019
17935C35311j52578b64837J7726F3640g180m316r8465D46a9640C52981m2601a51981
$$ 335311 182733 -264837 -247111 63640 -7180 -11496 -109961 446 -19640 352981 310380 -151981
17922D15754c7564q2116I7076b9896j41121F7098a4126j64866P8708c7382G6948
$$ 415754 -37564 -119680 97076 -29896 -171017 67098 -14126 -178992 -100284 -37382 76948
17910E9765e7867B65992c53700A89655G0207a01979I8316a5142G8280C3563A572
$$ 59765 -57867 265992 -353700 189655 70207 -101979 98316 -15142 78280 33563 1572
17898D3253b20053A51583F3985e5864n2378A59474b698B86711a22178C73392E26
$$ 43253 -220053 151583 63985 -55864 -108242 159474 -2698 286711 -122178 373392 526
17886c4927D36089c48700O8422a15923E0087A5580p409N8149d0340j7433B11621
$$ -34927 436089 -348700 -280278 -115923 50087 15580 8171 66320 -40340 -57773 211621
17874C8800K8309K89569C4908b7503k28093K4083I7374M7037b04050B47074m4906
$$ 38800 67109 356678 34908 -27503 -255596 -231513 97374 144411 -204050 247074 202168
17863B02168C5413b24361C8118j1224O4552b15991E0172c8422o6357L4133j84529
$$ 202168 35413 -224361 38118 26894 91446 -215991 50172 -38422 -104779 -70646 -255175
17852b55175B93903B8109h8631c5194q0945k8958B50146b74299c4921A59776i5285
$$ -255175 293903 28109 -88631 -35194 -116139 -145097 250146 -274299 -34921 159776 -95285
17840B8816b31320E321J52209c0046F3676b18189c5435A01186h9627B25710I3055
$$ 28816 -231320 5321 157530 -30046 63676 -218189 -35435 101186 -89627 225710 93055
17828A078h1207j19120k3600C08855a96189h2122H4214b06835D3508a4010k20065
$$ 1078 -81207 -200327 -223927 308855 -196189 -82122 84214 -206835 43508 -14010 -234075
17817b34075g2477B14985H2457l5777R2823b96378F5933a44940B43390a44742
$$ -234075 -72477 214985 82457 46680 139503 -296378 65933 -144940 243390 -144742
17806a91570A51373J66549g7442A79922J30845E3586d38143B32373i7465M1659
$$ -191570 151373 317922 -77442 179922 310767 53586 -438143 232373 -97465 -55806
17796e5806b1128A13584a35273j13667E1817a87725c5485J1185A08219P6407G2288
$$ -55806 -21128 113584 -135273 -248940 51817 -187725 -35485 -24300 108219 184626 72288
17784c13226B20856r998M8028d92928A63455a48227M8403C5281K1288f7032j72414
$$ -313226 220856 210858 258886 -492928 163455 -148227 -99824 35281 56569 -67032 -239446
17773b39446e4443C19757A8762a84474f0511a216j31315A03582a4260I5562c4348
$$ -239446 -54443 319757 18762 -184474 -60511 -1216 -132531 103582 -14260 95562 -34348
17761A80720c2704I4196c1858l2560A99064D8751N4951J71484b0335C93608b49607
$$ 180720 -32704 94196 -31858 -64418 199064 48751 103702 275186 -20335 393608 -249607
17749B9960J55244a59781c1615A33206o2877i0936k61981h3527A87178I3368b20446
$$ 29960 185204 -159781 -31615 133206 70329 -90936 -352917 -83527 187178 93368 -220446
17737A74191P1002A11439N9397q5330e1876A4227J30007h9507H0033a40413B87001
$$ 174191 245193 111439 170836 85506 -51876 14227 144234 -89507 80033 -140413 287001
17725c22556a21895N2579j36902O2217B28626a6964j30100C1341a31589A24910
$$ -322556 -121895 -69316 -206218 -144001 228626 -16964 -147064 31341 -131589 124910
17714a55952K4559C48868e5472I3229l2626f5933n919b9276o6502C49341b8999
$$ -155952 -131393 348868 -55472 93229 60603 -65933 -71852 -29276 -95778 349341 -28999
17702B05314o1797a41798e5034l68894a17609A622K3552L8397b86188h0791o0824
$$ 205314 143517 -141798 -55034 -423928 -117609 1622 25174 63571 -286188 -80791 -141615
17691a41615A61432p9850a24612F9579c8920e33A49321J89332b01606a7224A85209
$$ -141615 161432 81582 -124612 69579 -38920 -533 149321 338653 -201606 -17224 185209
17679H2521b54231c9500A17821M0797j1446l2830b86844D792K23614a08254A19119
$$ 82521 -254231 -39500 117821 158618 147172 114342 -286844 4792 228406 -108254 119119
17667A04426e3220j77600l0171B39215D4190a18012m7790B07048C8521K26053
$$ 104426 -53220 -230820 -260991 239215 44190 -118012 -165802 207048 38521 264574
17657B64574b18642B4205i9936E7972b81877A27840J46084i70k854B55953Q0368
$$ 264574 -218642 24205 -99936 57972 -281877 127840 273924 -970 -3824 255953 336321
17646C36321a64817A95734k8342G0647J32378l7727d8270h438k837A0316J19387
$$ 336321 -164817 195734 167392 70647 203025 165298 -48270 -8438 -11275 10316 129703
17635A29703K4117G4797N583k1878M7592f5678a4089m2768C6599M670a22960a3
$$ 129703 153820 74797 80380 58502 106094 -65678 -14089 -56857 36599 41269 -122960 -13
17622E1024h9315B93945d1541A85014q6059m2166J06521o5701a05765k6995m1359
$$ 51024 -89315 293945 -41541 185014 98955 56789 163310 97609 -105765 -132760 -174119
17611a74119C08743b15285A94174a19948j75145i2469A04209O3182n6131j729
$$ -174119 308743 -215285 194174 -119948 -295093 -92469 104209 167391 111260 109531
17601A09531a41915r830C82843a36061b9903j5763k15523A453Q875f624A82005
$$ 109531 -141915 -151745 382843 -136061 -29903 -45666 -261189 1453 10328 -6624 182005
17589B69452b04027d8049o647B0904b3213k20537H7718a92252H9363b14391E2041
$$ 269452 -204027 -48049 -54696 20904 -23213 -243750 87718 -192252 89363 -214391 52041
17577B35887D7308b86073a37843A94639b44833A76890D3918a53184e6680D33999
$$ 235887 47308 -286073 -137843 194639 -244833 176890 43918 -153184 -56680 433999
17566d7322A31295e2610j8327j59919D59149f7334A92744g8362j3900C30880e7026
$$ -47322 131295 -52610 -70937 -230856 459149 -67334 192744 -78362 -92262 330880 -57026
17554B26479a3489C21900k7033a8550A5241J52093b11555D4251K70263M3621b68180
$$ 226479 -13489 321900 294867 -18550 15241 167334 -211555 44251 314514 358135 -268180
17542B05787b35599O5890N1954C19823A04585C3120K8264L14664D0585f2325A70354
$$ 205787 -235599 -169709 -117755 319823 104585 33120 61384 376048 40585 -62325 170354
17530c6133B44999A7117K8703O2526J8590M7340a12260B87564C2075a69254B47616
$$ -36133 244999 17117 45820 108346 126936 174276 -112260 287564 32075 -169254 247616
17518a77653D6530b43171B86354A01455J94715D3361i33H3894R6030J91044H5018
$$ -177653 46530 -243171 286354 101455 296170 43361 -933 83894 179924 370968 85018
17506C92794o082F2042a05590C0541b36780C15164j20046q8271N8608k3509h8759
$$ 392794 386712 62042 -105590 30541 -236780 315164 195118 106847 165455 141946 -88759
17494D2351b7742B8735a98775g954n7227A65437J30825q4362D3706P5304K51367
$$ 42351 -27742 28735 -198775 -7954 -65181 165437 296262 211900 43706 119010 370377
17483C70377a78792B07304J16789q3125O3815b40297n368F09465b42250B39647
$$ 370377 -178792 207304 324093 240968 304783 -240297 -245665 609465 -242250 239647
17472D61867q8428j83707L9874G9488K24936b7739A98217d13758B49991j13320
$$ 461867 373439 189732 229606 79488 304424 -27739 198217 -413758 249991 136671
17462A36671g452j17329C5116g2507o970o2897A99653G0942K72126b9602D04740
$$ 136671 -7452 -124781 35116 -72507 -79477 -142374 199653 70942 343068 -29602 404740
17450B1005a2297A84171H5421J44249J6287i0304J2114A7971L54879I3211k9836
$$ 21005 -12297 184171 85421 229670 245957 -90304 -78190 17971 372850 93211 63375
17439F3375L53294C8708K978M52877B43495A07690J05760L08883a8883A13736
$$ 63375 416669 38708 41686 494563 243495 107690 213450 522333 -18883 113736
17428D49966j59778K23520A12102J43649g0472A58085J50683m5373J72439j70241
$$ 449966 290188 513708 112102 255751 -70472 158085 308768 263395 435834 265593
17418B65593A2349J44409K77295n0158q4762a452j01083k2A71113C0416j4524
$$ 265593 12349 156758 434053 383895 299133 -1452 -102535 -102557 171113 30416 15892
17407A5892L09062K99261A14302k1269J26382e4363D46422a9045F8328J5149L9269
$$ 15892 324954 624215 114302 93033 219415 -54363 446422 -19045 68328 83477 122746
17396A22746K93450G3932J54039J44553O3879b966r9125J2460A27000N8998L38877
$$ 122746 416196 73932 227971 372524 436403 -2966 -102091 -89631 127000 185998 524875
17385E24875B56668g9256B73247p0347E7403h2657B26782l4514l0668J29636q5383
$$ 524875 256668 -79256 273247 202900 57403 -82657 226782 192268 161600 291236 205853
17374B05853j6716f8281B28476m3479J2497j0016K19557j73753a06053A67154
$$ 205853 189137 -68281 228476 184997 197494 187478 407035 233282 -106053 167154
17363A51519l8088K24273a2308A17825l0125M8263n1357g4662B65868i194A61744
$$ 151519 113431 337704 -12308 117825 87700 135963 84606 -74662 265868 -9194 161744
17351B62095F6098K9976j7235K48309j39699L54035k40699J4974d3148B57298
$$ 262095 66098 96074 78839 327148 187449 541484 300785 315759 -43148 257298
17340B93343i3096A48239d828D9260A6991K35777A21154m3320h0969m1605A14502
$$ 293343 -93096 148239 -4828 49260 16991 252768 121154 77834 -80969 -122574 114502
17328a82902E69100a11024A45286l5268a28460C57446A46719l237k1847L37727
$$ -182902 569100 -111024 145286 110018 -128460 357446 146719 143482 121635 459362
17318D59362G383J4420L57534E068K30870B6922j1289L74681L99F628b88051f3115
$$ 459362 7383 21803 379337 5068 235938 26922 15633 390314 390713 6628 -288051 -63115
17305A2750J65701j084M9416n1903h8447A96990e2927j37552A51669K75824j82710
$$ 12750 178451 177367 226783 174880 -88447 196990 -52927 -190479 151669 427493 244783
17294B44783j5445J52616A3248J2973M11069j37221A47176a27728A16630J97610
$$ 244783 229338 381954 13248 26221 437290 300069 147176 -127728 116630 314240
17284C14240A32655f5775B58274c7998H8234m1647L91071p971A28656j6347a54098
$$ 314240 132655 -65775 258274 -37998 88234 46587 437658 429687 128656 112309 -154098
17272A42366D2127J65251a93951D26330F1506a4056C52803J3323b6199k1883A79238
$$ 142366 42127 207378 -193951 426330 61506 -14056 352803 366126 -26199 -48082 179238
17260A19838K16637k7338D2409J82483G1340J81459j01141M538E5339I842i4711
$$ 119838 336475 309137 42409 224892 71340 252799 151658 156196 55339 9842 -94711
17248C15285j47108l892E4166M6326m3638J57305G0243Q5078b24825B28678C9574
$$ 315285 168177 164285 54166 100492 56854 214159 70243 155321 -224825 228678 39574
17236D10091o2569Q1903j76523F2674k0901J08971c7887B0912Q4898J96352a01695
$$ 410091 347522 429425 252902 62674 41773 150744 -37887 20912 105810 302162 -101695
17224B07890R1565J7455H6980L20589A42238N0152F8191c7956B60839P9125l3140
$$ 207890 299455 316910 86980 407569 142238 192390 68191 -37956 260839 339964 306824
17213C06824M7339l4433a48166B00338b9092B4437b7683A48677b7254A76365K30034
$$ 306824 354163 319730 -148166 200338 -29092 24437 -27683 148677 -27254 176365 406399
17202D06399H7254i3779A28807h847C88267b8080D38930l5607q8170C8424J84656
$$ 406399 87254 -93779 128807 -8847 388267 -28080 438930 403323 315153 38424 223080
17191B23080F1930J78658c4787D75500Q8383j5293A63253K65771k9317j93099
$$ 223080 61930 240588 -34787 475500 563883 548590 163253 429024 399707 206608
17181B06608n5942J15839L09936j03652A41974K25462I1887J50765i131C26335
$$ 206608 150666 266505 576441 472789 141974 367436 91887 242652 -9131 326335
17170B15984P8912a01416E14540A92382K35529A27260L63812B41566J55975j58994
$$ 215984 294896 -101416 514540 192382 427911 127260 491072 241566 397541 238547
17160B38547m9204G5804e3998C27112K0865F9731L60699E0648L75801J06824j10465
$$ 238547 189343 75804 -53998 327112 347977 69731 430430 50648 426449 533273 422808
17149D22808A94618K98273j59299J34421K87884j30722j46927q2782j09988q9109
$$ 422808 194618 492891 333592 468013 755897 625175 478248 395466 285478 196369
17139A96369g4945B05410O381J40449j3774q5500e0161A83630p4111L46130K6030
$$ 196369 -74945 205410 211791 352240 338466 252966 -50161 183630 109519 455649 481679
17128D81679j78579K46663b7065B1833N22774B17953P2811K04668J66532C00715
$$ 481679 303100 549763 -27065 21833 544607 217953 290764 495432 661964 300715
17117g8665E58236j66297j7736q000K5904j08003K43806A78006K3351a63909E10426
$$ -78665 558236 391939 374203 366203 392107 284104 527910 178006 201357 -163909 510426
17105C36033r8681J6391K04531K64822k74211Q7027k20238Q6785r1770G6663J19625
$$ 336033 237352 253743 458274 723096 448885 535912 315674 402459 310689 76663 196288
17094A96288J62654k6569P8338A38244L58973K20044C27526J63357P4931E3537
$$ 196288 358942 332373 410711 138244 497217 717261 327526 490883 565814 53537
17083B40738J29000K65593B34094M98088k60562j52720L74207j9833B74152J70834
$$ 240738 369738 635331 234094 732182 471620 318900 693107 673274 274152 444986
17073D44986j24560N13635h331B80932M49721l28554J17483k18448J94017j66062
$$ 444986 320426 834061 -8331 280932 730653 402099 519582 301134 495151 329089
17063C29089J98726A63376N40363j33576m624j17662K31327j03352o6453j35251
$$ 329089 527815 163376 703739 570163 565539 447877 679204 575852 509399 374148
17053C74148J19676p8351k0K99665C44128L70471j08828O9049L9786j27679L97669
$$ 374148 493824 415473 415453 715118 344128 714599 605771 674820 714606 586927 984596
17042I84596C72639J55396L63386A78357M31107N9703J17160l13982J75670n3389
$$ 984596 372639 528035 891421 178357 609464 669167 786327 472345 648015 594626
17032E94626R3347o4471J70531j50262k39116M55002j35367l342o0320J09245
$$ 594626 687973 623502 794033 643771 404655 859657 724290 720948 660628 769873
17022G69873j61535L5764N5579K52287l27604J81578j48586J68509k3207J10453
$$ 769873 608338 644102 699681 951968 624364 805942 657356 825865 802658 913111
17012I13111m15998K24318K0920l13488K18214J48727p763o1167j78849O7403
$$ 913111 497113 721431 742351 428863 647077 795804 788041 726874 548025 615428
17002F15428J99272N8613R4004j97001p1975K4186k53536L09866m3205o2079K78098
$$ 615428 814700 873313 967317 770316 698341 722527 468991 778857 735652 673573 951671
16991I51671j87100j8144K8940m8871K92034l33781j89180N90615k43317J70698
$$ 951671 764571 746427 775367 726496 1018530 684749 495569 1086184 842867 1013565
16981A013565l58548Q4613J62581K83952k43263J78602M3339l34926j26817j46695
$$ 1013565 655017 739630 902211 1186163 942900 1121502 1164841 829915 703098 556403
16971E56403L64266k30679l814J25724l3135J48442O3152j63992K84812J46997
$$ 556403 920669 689990 686176 811900 778765 927207 990359 826367 1111179 1258176
16961A258176q4063j48481r6048N935J73503n6799O8657Q4834m07384O14155m80856
$$ 1258176 1174113 1025632 929584 935519 1109022 1052223 1120880 1205714 798330 1412485 931629
16950I31629M07413o21188J29575R8329J09737l5246J14717m5462n0695J36662
$$ 931629 1339042 717854 847429 945758 1055495 1020249 1134966 1089504 1038809 1175471
16940A175471J1844o2451J14277l44315L75400K59192l19038j88198N07043k6965
$$ 1175471 1187315 1124864 1239141 894826 1270226 1529418 1210380 1022182 1529225 1502260
16930A502260l2907j50749n5118q4847K7886P1108R1394k71539J83179P741K37376
$$ 1502260 1469353 1318604 1263486 1178639 1206525 1277633 1369027 1097488 1280667 1288408 1525784
16919A525784J33168j00435l1264l9916J53736j97167L87867l61197k4642L7755
$$ 1525784 1658952 1558517 1527253 1487337 1641073 1443906 1831773 1470576 1445934 1483689
16909A483689J42433J43061r8828j78285K03147N7084N7239L0367n612r3175o9991
$$ 1483689 1626122 1769183 1670355 1492070 1695217 1752301 1809540 1839907 1834295 1741120 1671129
16898A671129K03014j35408Q4648K66171j69408J68661n2104K9329P3281p6058
$$ 1671129 1874143 1738735 1823383 2089554 1920146 2088807 2036703 2066032 2139313 2063255
16888B063255k43986M03932p7818J07297j58470K30196m56598L78841L03798j50419
$$ 2063255 1819269 2223201 2145383 2252680 2094210 2324406 1867808 2246649 2550447 2400028
16878B400028l43523R8624J35950N42857l35127P2950j75105j96465M99602k96477
$$ 2400028 2056505 2155129 2291079 2833936 2498809 2571759 2396654 2200189 2699791 2403314
16868B403314K91087J04473k86708J09865j30794K71133J09089K48791l30452
$$ 2403314 2694401 2798874 2512166 2622031 2491237 2762370 2871459 3120250 2789798
16859B789798n2561J57819L29859k75743K70554J60345j81135O8422J48170J65204
$$ 2789798 2737237 2895056 3224915 2949172 3219726 3380071 3198936 3267358 3415528 3580732
16849C580732q1320J87592n2399k42472K68465L5646l310M25789l42380O6033
$$ 3580732 3499412 3687004 3634605 3392133 3660598 3696244 3692934 4118723 3776343 3842376
16839C842376k9150K13106M19509o7292J5442K21262r0880m645j80858m5393M80468
$$ 3842376 3813226 4026332 4445841 4378549 4393991 4615253 4524373 4519728 4338870 4293477 4773945
16828D773945n9748o0440K09440L11973k98734K12067M98301k33622L27520J26419
$$ 4773945 4714197 4653757 4863197 5175170 4876436 5088503 5586804 5353182 5680702 5807121
16818E807121q6148J58005J51084M26205o9645O2234K92742m7966K98242j04135
$$ 5807121 5720973 5878978 6030062 6456267 6386622 6448856 6741598 6693632 6991874 6887739
16808F887739M12384k04890L30281J5212L59101N87054p5022Q0095L56145K18650
$$ 6887739 7300123 7095233 7425514 7440726 7799827 8386881 8311859 8391954 8748099 8966749
16798H966749k41465L86927L48042K94859J10087M17196J49391M61948K6361K27626
$$ 8966749 8725284 9112211 9460253 9755112 9865199 10282395 10431786 10893734 10920095 11147721
16788A1147721M03161L45109L00301o046Q95901O20877K26243L88725N40051r7372
$$ 11147721 11550882 11895991 12196292 12190246 13086147 13707024 13933267 14321992 14862043 14764671
16778A4764671M55351O78700L11235J003048L62912Q02742J04458J048381P36316
$$ 14764671 15220022 15898722 16209957 17213005 17575917 18378659 18483117 19531498 20267814
16769B0267814L41677P96537J076768N18004J031661O17295J330093P38473J501672
$$ 20267814 20609491 21406028 22482796 23000800 24032461 24649756 25979849 26718322 28219994
16760B8219994M83037J657656J174347J118349K072434J120281J644302J577099
$$ 28219994 28703031 30360687 31535034 32653383 34725817 35846098 37490400 39067499
16752C9067499J798637J951549K096040K336644J926694K539283K939232K760277
$$ 39067499 40866136 42817685 44913725 47250369 49177063 51716346 54655578 57415855
16744E7415855L339328L074102L220350L809877L969095M017932L867627M860603
$$ 57415855 60755183 63829285 67049635 70859512 74828607 78846539 82714166 87574769
16736H7574769N119662N045910N464872N585893N358820O178783N565186O331496
$$ 87574769 92694431 97740341 103205213 108791106 114149926 120328709 125893895 132225391
16728A32225391N868888O013487N692207N398721M704125M421650K949773K952709
$$ 132225391 138094279 144107766 149799973 155198694 159902819 164324469 167274242 170226951
16720A70226951J500505R28905m90377j086396k028841l173354l348222m505947
$$ 170226951 171727456 172656361 172165984 171079588 169050747 165877393 162529171 158023224
16712A58023224n243913n306987n654824o176830n805093o240546n875027n783238
$$ 158023224 152779311 147472324 141817500 135640670 129835577 123595031 117720004 111936766
16704A11936766n890651n477088n406081n035422m922345m099026m642928l690342
$$ 111936766 106046115 100569027 95162946 90127524 85205179 81106153 76463225 72772883
16696G2772883l858848l694636l278641l346041k760107k657362l218158k039695
$$ 72772883 68914035 65219399 61940758 58594717 55834610 53177248 49959090 47919395
16688D7919395k122914k371764k386475j539991j471528j766685j759143j265097
$$ 47919395 45796481 43424717 41038242 39498251 38026723 36260038 34500895 33235798
16680C3235798j475546j421096j017736j610900p99076j196149j230432p24220
$$ 33235798 31760252 30339156 29321420 27710520 26911444 25715295 24484863 23760643
16672B3760643o20680q81388p54594p36078j007902p98927p00714l65623m89689
$$ 23760643 23139963 22258575 21503981 20767903 19760001 18961074 18260360 17894737 17405048
16663A7405048q01465m05625n57679j50250o22727o12468o01891j84437k11569
$$ 17405048 16603583 16197958 15640279 15490029 14867302 14254834 13652943 13468506 13256937
16654A3256937r50874M0540j57915p77467k47860k64150n40166J43114n37471
$$ 13256937 12306063 12346603 12188688 11411221 11163361 10899211 10359045 10502159 9964688
16645I964688k09204k16619l60120m45901L08714m37426l29425l92535j04249
$$ 9964688 9755484 9538865 9178745 8732844 9041558 8604132 8274707 7882172 7777923
16636G777923J48626k42509l18676j52319M3660l83965p5208m0694l38646p8095
$$ 7777923 7926549 7684040 7365364 7213045 7256705 6872740 6797532 6756838 6418192 6340097
16626F340097j86227J28581N174j99631l22968j4648j01710r3245k34222k65460
$$ 6340097 6153870 6282451 6287625 6087994 5765026 5750378 5648668 5555423 5321201 5055741
16616E055741O6881l62249K11663l3203l53954K51333n73953K85152l31771K35461
$$ 5055741 5122622 4760373 4972036 4938833 4584879 4836212 4262259 4547411 4215640 4451101
16606D451101l28071k46116K20838N9171m32337M06253k26124k4711k51922O4400
$$ 4451101 4123030 3876914 4097752 4156923 3724586 4130839 3904715 3880004 3628082 3692482
16596C692482j56152k46910L13652k43524o7130J28783L3533m30655Q6616l56602
$$ 3692482 3536330 3289420 3603072 3359548 3292418 3421201 3454734 3024079 3110695 2754093
16586B754093L11812j56627K15404j99814m41738K01022o0909o0318K08709j33317
$$ 2754093 3065905 2909278 3124682 2924868 2483130 2684152 2623243 2562925 2771634 2638317
16576B638317n62992Q71289l75731K02412k41580n8502j11866j99728K40089K3838
$$ 2638317 2075325 2946614 2570883 2773295 2531715 2473213 2361347 2161619 2401708 2425546
16566B425546k53855Q8902P2613l4596q7412J1712k51669J5096k9086L59914k19473
$$ 2425546 2171691 2260593 2333206 2298610 2211198 2222910 1971241 1986337 1957251 2317165 2097692
16555B097692k19534O8437R666l04063J03405L50290k65794k41223M70451k82948
$$ 2097692 1878158 1946595 1956261 1652198 1755603 2105893 1840099 1598876 2069327 1786379
16545A786379K18266l34923m0440J90354m8049k25488O9177O3182j3211L00041
$$ 1786379 2004645 1669722 1629282 1819636 1771587 1546099 1615276 1678458 1665247 1965288
16535A965288n17224N8432K09759j41969k99296K20721J94985l25235j61798L60239
$$ 1965288 1448064 1506496 1716255 1574286 1274990 1495711 1690696 1365461 1203663 1563902
16525A563902m35347J02709J05090N9519l4379m13618O86212m86021j16246L96675
$$ 1563902 1128555 1231264 1336354 1395873 1361494 947876 1634088 1148067 1031821 1428496
16515A428496J22890R9197k48355l2801l71372M09884j20926k97867J33751K0239
$$ 1428496 1551386 1650583 1402228 1369427 998055 1407939 1287013 989146 1122897 1143136
16505A143136m1827m6623M4149k01631J39392k58735K43846m9453L92597n68870
$$ 1143136 1101309 1054686 1098835 897204 1036596 777861 1021707 972254 1364851 795981
16495G95981N3215J53135P3071K09512m62454J24864j13782L73679j87989r3613
$$ 795981 849196 1002331 1075402 1284914 822460 947324 833542 1207221 1019232 925619
16485I25619j25102L03202k00937m06277Q78535n88123K09962J40599p6723j85948
$$ 925619 800517 1103719 902782 496505 1375040 786917 996879 1137478 1060755 874807
16475H74807J69624k77326N9429j11330J10304j50266M60539l71740M7449K51379
$$ 874807 1044431 767105 826534 715204 825508 675242 1135781 764041 811490 1062869
16465A062869J99999n61215J91674j90531R3706k75993K14632O4653k29540N10329
$$ 1062869 1262868 701653 893327 702796 796502 520509 735141 799794 570254 1080583
16455A080583m58342L46523q5846k23784J80171j75585j36672M79093k36556m9581
$$ 1080583 622241 968764 882918 659134 839305 663720 527048 1006141 769585 720004
16445G20004q7675J87227j85064M0511K9143k1251N47802E78190J41524J50492
$$ 720004 632329 819556 634492 675003 704146 682895 1230697 578190 719714 870206
16435H70206k70087l0697j85106L32627p4240j06919K0728o337m960J7695B80627
$$ 870206 600119 569422 384316 716943 642703 535784 556512 550175 545215 562910 280627
16423I08466j73720k57156K2723J12154j0529j07414k21752J20911M80602l77134
$$ 908466 734746 477590 500313 612467 601938 494524 272772 393683 874285 497151
16413D97151K72774n7127k81589l9150L94161l26347k21154N01849C20445J457
$$ 497151 769925 712798 431209 392059 786220 459873 238719 740568 320445 321902
16403C21902L24178L1236o0913p2332L65513C67352j09989K20855m5286K54574
$$ 321902 646080 677316 616403 544071 909584 367352 257363 478218 432932 687506
16393F87506l28666j75791j6594P5016L54175k76587Q1637M09423C21395O3794
$$ 687506 358840 183049 166455 241471 595646 319059 400696 810119 321395 385189
16383C85189N0678M3127j36614J59878K6777o2310m196j39609J14885m440k3100
$$ 385189 435867 478994 342380 502258 529035 466725 462529 322920 437805 433365 410265
16372D10265O6520r6375L5112L05048j73093r7410j56447F3148L84442B12816
$$ 410265 476785 380410 415522 720570 547477 450067 293620 63148 447590 212816
16361C01132j29579q999n7937J05762j733K60706A1123J92935L15645j4295r9974
$$ 301132 171553 162554 104617 210379 208646 469352 11123 204058 519703 505408 405434
16350D05434j60893q5513K43770j09793m7482J24439n8407J72528A43638Q3333
$$ 405434 244541 159028 402798 293005 245523 369962 311555 484083 143638 226971
16340B26971L0033E8158J08533J66487J42533d3572F12875B48624J86650F7268
$$ 226971 257004 58158 166691 333178 475711 -43572 612875 248624 435274 67268
16329D07120A99776k380K07659m10r23A50588K06435e0831C49863n3421n2069
$$ 407120 199776 197396 405055 404645 403722 150588 357023 -50831 349863 296442 244373
16318B44373j5649A3152M10489A35426J13888K987L073M19643C33486f8212A01992
$$ 244373 228724 13152 423641 135426 249314 252301 255374 675017 333486 -68212 101992
16306D62020j82861B8204K42649A13227L74250j87438J36417B7882M17097J8435
$$ 462020 279159 28204 270853 113227 487477 300039 436456 27882 444979 463414
16296D63414k22749e1235G3241J80341o6226F4853P9129k3362L08083L7645F139
$$ 463414 240665 -51235 73241 253582 187356 64853 143982 120620 428703 466348 6139
16284D6307L52369n7225D5522J91637K031a6637j1353A8611L31234K19877j75488
$$ 46307 398676 341451 45522 237159 239190 -16637 -27990 18611 349845 569722 394234
16273C94234A2397J61675J91979j54385m685N4594J59497C4362J18691O6151J1676
$$ 394234 12397 174072 366051 211666 206981 261575 421072 34362 153053 219204 230880
16262B30880a4629A14741J48568g0013D66158a11915B64386L6458d4396C38870
$$ 230880 -14629 114741 263309 -70013 466158 -111915 264386 300844 -44396 338870
16251A8082K2614A7561J45867J84140B4345M70205a7437j17179C61127A24876
$$ 18082 40696 17561 163428 347568 24345 494550 -17437 -134616 361127 124876
16240b4578B11259p0233L39419j81743a08079B71542J48326j15172D817b1844
$$ -24578 211259 141026 480445 298702 -108079 271542 419868 304696 4817 -21844
16229A10334M6698c63590C75283B5852R4810n7976J35820l5879L0269R0867g7011
$$ 110334 157032 -363590 375283 25852 120662 62686 198506 162627 192896 283763 -77011
16217B11525r8414J2189a04408B01570G1840e6940B37206q3074N6214G522J53562
$$ 211525 113111 125300 -104408 201570 71840 -56940 237206 154132 210346 7522 161084
16206A61084a26669A80841J35050a62948A70465p7402J70489a03592E5441N11375
$$ 161084 -126669 180841 315891 -162948 170465 93063 263552 -103592 55441 566816
16196E66816c913l8651a7182k02690A83200O6743J27060j78916a50544E8323K89057
$$ 566816 -3913 -42564 -17182 -219872 183200 249943 377003 198087 -150544 58323 347380
16185C47380F5414K1082h053A58681P0211A10417b3498m3605B59802o6052b11766
$$ 347380 65414 86496 -8053 158681 228892 110417 -23498 -67103 259802 193750 -211766
16173A90165a64779D7817J77426c25894p7066a8745j71123A44126r855n2567J32816
$$ 190165 -164779 47817 225243 -325894 -402960 -18745 -189868 144126 134271 81704 214520
16162B14520N844P1546A34583K0954o1432b41612A26100i5230A07499O2260b64275
$$ 214520 220364 291910 134583 155537 94105 -241612 126100 -95230 107499 169759 -264275
16150d25175F3687b6977H5297M152P5157K26133b77866B15703K13860c37755d2537
$$ -425175 63687 -26977 85297 89449 164606 390739 -277866 215703 429563 -337755 -42537
16138B91349a08921R397d149j15870A68707p1170D1208e7599D9191a23088M5024
$$ 291349 -108921 -99524 -4149 -120019 168707 97537 41208 -57599 49191 -123088 -78064
16127g8064D9964b16445E0466a78073N6402B94302d9281A18684b7320A70386A8232
$$ -78064 49964 -216445 50466 -178073 -121671 294302 -49281 118684 -27320 170386 18232
16115D12169a13678H2624L1980M88621h3795H3182C4059h5029e612B1861J79206
$$ 412169 -113678 82624 114604 603225 -83795 83182 34059 -85029 -5612 21861 201067
16104B01067C6663g1136L3607C90945J41630E6420J4237K86364b18955B46620
$$ 201067 36663 -71136 -37529 390945 532575 56420 70657 357021 -218955 246620
16093H8247L8881q593J07803D7653K48245B1228J34256K1448a70590K3052k90001
$$ 88247 127128 118535 226338 47653 295898 21228 155484 176932 -170590 -147538 -437539
16082d37539A70746l6059d01528c5639A40640a26912C25111p4256D1897L0397
$$ -437539 170746 134687 -401528 -35639 140640 -126912 325111 250855 41897 72294
16072G2294h2132m2014D7457M6889J49643A3690i5372n4148A45235J15450b15592
$$ 72294 -82132 -124146 47457 94346 243989 13690 -95372 -149520 145235 260685 -215592
16060B57490a90969E9893b29916C41329A36669B3239d53779A30089B9332d8460
$$ 257490 -190969 59893 -229916 341329 136669 23239 -453779 130089 29332 -48460
16049b0868k74448J03380C71145j29013n9212d445k6491q9547m6647B20356I6484
$$ -20868 -295316 -191936 371145 242132 182920 -4445 -30936 -120483 -167130 220356 96484
16037g8094I1366J30811B3796c13633O4121A33860K4077a46292G6021P6550b3417
$$ -78094 91366 222177 23796 -313633 -249512 133860 157937 -146292 76021 152571 -23417
16025b39757c1857B35994a27809c1709n9308d0930C30600c5580B9599b8642q6598
$$ -239757 -31857 235994 -127809 -31709 -91017 -40930 330600 -35580 29599 -28642 -115240
16014a15240A40576a42956C45351H1676C2823a74879B69596d0620A41129j2479
$$ -115240 140576 -142956 345351 81676 32823 -174879 269596 -40620 141129 128650
16004A28650L1025k0596a1942n5985c1906A93870p7082g6393j4668K5485j15838
$$ 128650 159675 139079 -11942 -67927 -31906 193870 116788 -76393 -91061 -65576 -181414
15993a81414D62315o2397A80291m7395a44220I2632a14278L0327B86879D3671
$$ -181414 462315 399918 180291 132896 -144220 92632 -114278 -83951 286879 43671
15982A36300K07448j15670J91563i2496I4940K6883D6783Q7993J24765a69757
$$ 136300 343748 228078 419641 -92496 94940 121823 46783 134776 259541 -169757
15971b63343L0288e2205k41209R6381B1530Q7959K54550C692K3066M3501K7585
$$ -263343 -233055 -52205 -293414 -197033 21530 109489 364039 3692 26758 70259 97844
15960I7844b17691e4602G6021b10815c2935B86471b35272d7011n147n4638a6633
$$ 97844 -217691 -54602 76021 -210815 -32935 286471 -235272 -47011 -52158 -106796 -16633
15948D6330f5347n6055m6153I9513R047B7773J61107b33774B15692f983m7394
$$ 46330 -65347 -121402 -167555 99513 108560 27773 188880 -233774 215692 -6983 -54377
15937e4377l22989O3830E29K80920b66463N9049O7096m7088j11176Q6379A06734
$$ -54377 -377366 -313536 529 281449 -266463 -207414 -140318 -187406 -298582 -212203 106734
15925a27059M0344p4603D918b1049C28562j8749a20187M2724c5579p9606k3883
$$ -127059 -86715 -161318 4918 -21049 328562 309813 -120187 -77463 -35579 -115185 -139068
15914a39068j40067a7791j42646e4495q7179N1534A53548b17326C091J66295f235
$$ -139068 -279135 -17791 -160437 -54495 -141674 -90140 153548 -217326 3091 169386 -6235
15902a01376A57526f9558B7355K65075q0600a13093A18882A5566h6332P903l13850
$$ -101376 157526 -69558 27355 292430 211830 -113093 118882 15566 -86332 -78429 -392279
15891c92279C39883i0473L647C9950j4895h0349A93222g9869a4336l05567g3902
$$ -392279 339883 -90473 -86826 39950 25055 -80349 193222 -79869 -14336 -319903 -73902
15879b37502A16335a44610k7309E9571J1384a75873A25563k2227b9591q150q436
$$ -237502 116335 -144610 -171919 59571 70955 -175873 125563 103336 -29591 -37741 -46177
15868d6177J8517n7906G9668r861b32573k0711D79520b0268j50441E1689A5636
$$ -46177 -27660 -85566 79668 69807 -232573 -253284 479520 -20268 -170709 51689 15636
15856A84823n2202d5867A99412a70037B29496k0839K0111A5916N8205h1836A80405
$$ 184823 132621 -45867 199412 -170037 229496 208657 228768 15916 74121 -81836 180405
15844h2182q5878d8861l21040A92813a95702R1862l2429A19499K1000c5777B47809
$$ -82182 -168060 -48861 -369901 192813 -195702 -103840 -136269 119499 140499 -35777 247809
15832b68850A20007A8857a26130b2801k8323m4028A94033a80030C3027b35104
$$ -268850 120007 18857 -126130 -22801 -51124 -95152 194033 -180030 33027 -235104
15821a23922A0366g3254A43111F0332a09746M6039C8540d7951A58873b20834f879
$$ -123922 10366 -73254 143111 60332 -109746 -63707 38540 -47951 158873 -220834 -6879
15809f4736o4471O2512k59857C03983a60948p1515a15716l2896e780j62844D74890
$$ -64736 -129207 -66695 -326552 303983 -160948 -232463 -115716 -148612 -5780 -168624 474890
15797F7340J07646a72032F0487a58315a0872j50053n9284H9281J40678a69949
$$ 67340 174986 -172032 60487 -158315 -10872 -160925 -220209 89281 229959 -169949
15786g6913B25663E380i0180k6151C10165c2949A30375E9705a98371q4926A52077
$$ -76913 225663 5380 -90180 -116331 310165 -32949 130375 59705 -198371 -283297 152077
15774I8504J20366J232c47181f7062j51708f1146a7596j9605l0982k33470j30612
$$ 98504 218870 220102 -347181 -67062 -218770 -61146 -17596 -37201 -68183 -301653 -432265
15763d32265i1993q479r2258L7731B11861E1364b29912A67192B8340M2935a88558
$$ -432265 -91993 -100472 -192730 -154999 211861 51364 -229912 167192 28340 71275 -188558
15751d4578K1197H0262R4796M8573a33211N7347k45159A95320l6848N7394C4325
$$ -44578 -23381 80262 175058 223631 -133211 -75864 -321023 195320 158472 215866 34325
15739a87080h1174j87917P2029B41727A6198i2513J3075H602J99034a48205A53515
$$ -187080 -81174 -269091 -197062 241727 16198 -92513 -79438 8602 207636 -148205 153515
15727B83345f6439B21618a88083a0878k8168D1001i2671A48084a35595l40505
$$ 283345 -66439 221618 -188083 -10878 -39046 41001 -92671 148084 -135595 -476100
15717d76100B80740a96146k9373o7137K3800B77625B5447c9622k42519F8692L8381
$$ -476100 280740 -196146 -225519 -292656 -268856 277625 25447 -39622 -282141 68692 107073
15706A07073Q1791n4213d38806M4363F8185J15731b41372C2146J16298b7698r332
$$ 107073 188864 134651 -438806 -394443 68185 183916 -241372 32146 148444 -27698 -37030
15695c7030F1208f65l0821l51525E8000N5806L13516j77478K6729a27835C5689
$$ -37030 61208 -665 -31486 -383011 58000 113806 427322 249844 276573 -127835 35689
15683a38465F1911c69764J06830g4468q568j80278d4439j0904A5189c08953e8128
$$ -138465 61911 -369764 -262934 -74468 -83036 -263314 -44439 -55343 15189 -308953 -58128
15671A1622Q5070a5320p2161H5751J01194g1586k5953K4199b1784o2017k3033
$$ 11622 96692 -15320 -87481 85751 186945 -71586 -97539 -73340 -21784 -83801 -106834
15660a06834k58173a3672A13771f5483A01479a79542c3919l09043g5441A72278
$$ -106834 -365007 -13672 113771 -65483 101479 -179542 -33919 -342962 -75441 172278
15649c15233A54188R1675h271m4710k9781A53770b13901A14320a00941A51889
$$ -315233 154188 245863 -8271 -52981 -82762 153770 -213901 114320 -100941 151889
15638b12489h6241A48601k7046e4301j33776B02145l6788a95892N0042O0617P348
$$ -212489 -86241 148601 121555 -54301 -188077 202145 165357 -195892 -145850 -85233 -77885
15627g7885j15673g3517j04231A24994a83882H1091d99791F4342I971c5358M029
$$ -77885 -193558 -73517 -177748 124994 -183882 81091 -499791 64342 9971 -35358 -31329
15616c1329B1646b8196k20141I014D417a57169b1700A20277a18034G5973k6168
$$ -31329 21646 -28196 -248337 9014 4417 -157169 -21700 120277 -118034 75973 49805
15605D9805j6596a16672N6652j45724A52996d43954a16754a5114B79658c8029
$$ 49805 33209 -116672 -60020 -205744 152996 -443954 -116754 -15114 279658 -38029
15594g3516C04722r0338c52679b596A61881a79861n2390A01042c4778l01775A66567
$$ -73516 304722 214384 -352679 -2596 161881 -179861 -232251 101042 -34778 -336553 166567
15582a50205m1196k19945a85966K0480C54780C9585K39471a86643Q4948j49853
$$ -150205 -191401 -411346 -185966 -165486 354780 39585 279056 -186643 -101695 -251548
15572b51548L206J07797q7321B5357L2870Q4303f0225k51869C69633A08533c29649
$$ -251548 -248342 -140545 -227866 25357 58227 142530 -60225 -312094 369633 108533 -329649
15560E17274A81618k6501a72037A12959J79019a46653O9065B21953D0894P4195
$$ 517274 181618 155117 -172037 112959 291978 -146653 -77588 221953 40894 115089
15550A15089a47357G8011M44033c5738k55210a34783e3503m4629B9848J29541
$$ 115089 -147357 78011 522044 -35738 -290948 -134783 -53503 -98132 29848 159389
15540A59389h2770K9817C13188A47608o7767L00572B0997b30730B00852c5971
$$ 159389 -82770 -52953 313188 147608 79841 380413 20997 -230730 200852 -35971
15529f9055C03834a1547j8827j4595I8225j0869C2310A5700P971P8558j5796a59152
$$ -69055 303834 -11547 -30374 -44969 98225 87356 32310 15700 23671 102229 86433 -159152
15516D7595L1154J51623b48113C0035O5032D5223j8081b01448A96033d3244c903
$$ 47595 78749 230372 -248113 30035 95067 45223 27142 -201448 196033 -43244 -3903
15504B04738c12185a31912K1956j16986A45890a96429c9800B46598h8952m5288
$$ 204738 -312185 -131912 -109956 -226942 145890 -196429 -39800 246598 -88952 -134240
15494a34240B27441a29429A00781i1254B18740f099D0213e320q0099D2032a75012
$$ -134240 227441 -129429 100781 -91254 218740 -6099 40213 -5320 -85419 42032 -175012
15482a93881j54429A40810a71585g2416F5679I072a61911k037C3348b01135a0166
$$ -193881 -348310 140810 -171585 -72416 65679 9072 -161911 -163948 33348 -201135 -10166
15470h6491j46038b8759G1187a28060k2901j68902C5698Q1715f9882j7476j95218
$$ -86491 -232529 -28759 71187 -128060 -150961 -319863 35698 117413 -69882 -87358 -282576
15459b82576H6882h3353A49455d1424j14063L4852k31207B3340a73240l1259B07589
$$ -282576 86882 -83353 149455 -41424 -155487 -120635 -351842 23340 -173240 -204499 207589
15447b7381B47736r5659i3538D32630A28752e2905q8961j815B30985I3598g7071
$$ -27381 247736 152077 -93538 432630 128752 -52905 -141866 -143681 230985 93598 -77071
15435c8698C5228L7083Q8171c41130D0045a43334A68862i408l6808D8113K02754
$$ -38698 35228 72311 160482 -341130 40045 -143334 168862 -9408 -46216 48113 250867
15424B50867O1636F316P8935Q3907e3826a9718H9597M5043a62405c9231n5211
$$ 250867 312503 6316 85251 169158 -53826 -19718 89597 134640 -162405 -39231 -94442
15413i4442D11472f1573j31498O2478r5076A09267a813B88410a48586q0773H4970
$$ -94442 411472 -61573 -193071 -130593 -225669 109267 -1813 288410 -148586 -229359 84970
15401A778J05413D0335L66515D7562J84371b03810k13443A66492o80B1905d52065
$$ 1778 107191 40335 406850 47562 231933 -203810 -417253 166492 165812 21905 -452065
15389A33496J5097F8120a85831L7578A19504b98074a14687A50260P9408a56260
$$ 133496 148593 68120 -185831 -148253 119504 -298074 -114687 150260 229668 -156260
15378a14570k58011c4675n417B13948a36087l033B05045E7405a52975B00054o1966
$$ -114570 -372581 -34675 -40092 213948 -136087 -139120 205045 57405 -152975 200054 138088
15367A38088a75641f3603k86727C18520c89434d184D92203j08523a35988H9161
$$ 138088 -175641 -63603 -350330 318520 -389434 -4184 492203 383680 -135988 89161
15356c8532D2640a35784B02493r9076a24300I2099c2549C05973a8393A74107q0848
$$ -38532 42640 -135784 202493 103417 -124300 92099 -32549 305973 -18393 174107 93259
15345I3259l8989f0548I1823L1665J7405N9236a12963J5152J1079B6389K339a39662
$$ 93259 54270 -60548 91823 123488 140893 200129 -112963 -97811 -86732 26389 28728 -139662
15332e5212G563J33122J89239G5728J76767a11347j59345C89056A89698a88719
$$ -55212 7563 140685 329924 75728 252495 -111347 -270692 389056 189698 -188719
15321i1276A83273d3776j72264c8351H3860J88242J03441d7263J6499C6495b03664
$$ -91276 183273 -43776 -216040 -38351 83860 272102 375543 -47263 -30764 36495 -203664
15309A35598A1988O6038B8529L93472F2419a23107M9310a4082m8330k8447A72525
$$ 135598 11988 78026 28529 422001 62419 -123107 -73797 -14082 -62412 -90859 172525
15297G5718J04171D0652c0661A07746c2094j00353D336K57233o9449b54895A05490
$$ 75718 179889 40652 -30661 107746 -32094 -132447 4336 261569 192120 -254895 105490
15285C7836c6759A36032D6518K53847G5466B8176F308Q523d58507J71419B39791
$$ 37836 -36759 136032 46518 300365 75466 28176 6308 14831 -458507 -287088 239791
15273a40091c5192C85704j75372G6006a9718C93465A51245a0209F1702d3292A03817
$$ -140091 -35192 385704 210332 76006 -19718 393465 151245 -10209 61702 -43292 103817
15261a64198c1611A60454e3378J575q8441a8081E2777K09874G8473N9280e869
$$ -164198 -31611 160454 -53378 -51803 -140244 -18081 52777 262651 78473 137753 -5869
15249E62555O93612n8638l45198R27959E68661B45145j7316d08465B09848A9531
$$ 562555 1256167 1197529 852331 1780290 568661 245145 227829 -408465 209848 19531
15238A60594L3380a16100B61248k4576a61330B84796E6870b03539f1507J2825
$$ 160594 193974 -116100 261248 236672 -161330 284796 56870 -203539 -61507 -48682
15228d8682A73810a95065E30a4862p9606B4308N0436L205K5426f4958F8916O2562
$$ -48682 173810 -195065 530 -14862 -94468 24308 74744 77949 103375 -64958 68916 131478
15216A31478J18422K7825P6614j66770r1417J16064E1697L50176D4895J65490
$$ 131478 249900 277725 354339 187569 96152 212216 51697 401873 44895 210385
15206B10385E9323a75591C46560E5669o712P2581h8066H4453j6291K42408b2883
$$ 210385 59323 -175591 346560 55669 48957 121538 -88066 84453 68162 310570 -22883
15194G7933N7198j6232J69294a43893A39274e0693A78246q7848M9064C6241a14209
$$ 77933 135131 118899 288193 -143893 139274 -50693 178246 90398 139462 36241 -114209
15182A13043L31845f319j03548A03672o511L31733A06828K57907j52836H0653
$$ 113043 444888 -6319 -109867 103672 97161 428894 106828 364735 211899 80653
15171a30352B19349a67847C5956R1756B5827J01916a52310M3088q2707D81038
$$ -130352 219349 -167847 35956 127712 25827 127743 -152310 -109222 -191929 481038
15160F12276k34754a4278D2428g7138A85514M6923p4729a56125H6735a3790A75727
$$ 612276 377522 -14278 42428 -77138 185514 232437 157708 -156125 86735 -13790 175727
15148B44273l061j877o1621b13178A03353j1845K1074a22258B53773o1096e909
$$ 244273 241212 239335 177714 -213178 103353 91508 112582 -122258 253773 192677 -5909
15136B2272J25378g8048A69616n9571N7025o9736a46653J2068B26740A11822b0972
$$ 22272 147650 -78048 169616 110045 167070 97334 -146653 -134585 226740 111822 -20972
15124C02267Q5477A87795F1604J58748p0683l4287b00112G2073J15183b3416j1332
$$ 302267 387744 187795 61604 220352 149669 115382 -200112 72073 187256 -23416 -34748
15113c4748C18189H8789k1617J85714A15823m8250a2565A63355L5137E5704M2264
$$ -34748 318189 88789 67172 252886 115823 67573 -12565 163355 198492 55704 97968
15102I7968m5535k3805J16454g909A80124l2159e6910D4768b7952A50282M81109
$$ 97968 52433 28628 145082 -7909 180124 147965 -56910 44768 -27952 150282 631391
15091F31391B01974f1426D35917j16554E7102J85181n0154b78993D1144g45B44302
$$ 631391 201974 -61426 435917 319363 57102 242283 192129 -278993 41144 -745 244302
15079A42102J19147K01398B21044D2275a7340n4332A98677K74124d2405l09336
$$ 142102 261249 462647 221044 42275 -17340 -71672 198677 472801 -42405 -351741
15069c51741A54047J06621E0876a88317b0755j86894B23096C7076N0157a42428
$$ -351741 154047 260668 50876 -188317 -20755 -207649 223096 37076 87233 -142428
15058A47173q465L60395j70991H5680b09172B47836j15028R021J12302j22351
$$ 147173 138708 499103 328112 85680 -209172 247836 132808 141829 254131 131780
15048A31780L5128k8793J32193N6101j00763F6062R2106e4893C45066B0847Q1635
$$ 131780 166908 138115 270308 326409 225646 66062 158168 -54893 345066 20847 102482
15037A02482K09121a86604A26561b95932F73002k49374I5603K3996c0435A52210
$$ 102482 311603 -186604 126561 -295932 673002 423628 95603 119599 -30435 152210
15026A28852n2905A0122J80913D9613L6468K73547f6453A2246L283J97204d3021
$$ 128852 75947 10122 191035 49613 86081 359628 -66453 12246 15529 212733 -43021
15014B03980g0730a3662A98168Q7360n4435r284J23081R8206j37031j41455a39385
$$ 203980 -70730 -13662 198168 285528 231093 221809 344890 443096 306065 164610 -139385
15002B07747B9867a72873A54390K16240J95198G1908a41345B00181N376l7296
$$ 207747 29867 -172873 154390 370630 565828 71908 -141345 200181 205557 168261
14992A68261P4095K9438R8251j61757O7738n1901J50119J57156A10390L15536
$$ 168261 242356 271794 370045 208288 276026 224125 374244 531400 110390 425926
14982D25926A61371a76793C57244r1878j00142J27547a20862A41579J11183G3428
$$ 425926 161371 -176793 357244 265366 165224 292771 -120862 141579 252762 73428
14971F2361J12761J70676J38219j49760J6603A51066N11876k04390j01683M1192
$$ 62361 175122 345798 484017 334257 350860 151066 662942 458552 356869 398061
14961C98061j14657A36007K64910H5495K58073Q182A22264J06176K25421j15459
$$ 398061 283404 136007 400917 85495 343568 351750 122264 228440 453861 338402
14951C38402J28605j97966r6356J8730J93939A88974n9295L45492q784j42155
$$ 338402 467007 269041 172685 191415 385354 188974 129679 475171 466387 324232
14941C24232h0831C00229A24531J31150D1191N41580j98339H9867K40460j20022
$$ 324232 -80831 300229 124531 255681 41191 582771 384432 89867 330327 210305
14931B10305K59397J5155A92108a70412C50718A29071P5087l2047M5028N9618
$$ 210305 469702 484857 192108 -170412 350718 129071 204158 172111 217139 276757
14921B76757Q8938J34250r4438k79j10943H3810N5772J98592L62432B73637j24356
$$ 276757 365695 499945 405507 405228 294285 83810 139582 338174 700606 273637 149281
14910A49281K48296j19853j22265N904M67014B69057j23867L6693C0620M36252
$$ 149281 397577 277724 155459 161363 628377 269057 145190 181883 30620 466872
14900D66872d7139B00049K63270q5776k2230j45166M1518r0399l665b4626C1605
$$ 466872 -47139 200049 463319 377543 355313 210147 251665 161266 157601 -24626 31605
14888D25585F6564M46891a8791A17012L74402B39580K20685p5594K7603F8639
$$ 425585 66564 513455 -18791 117012 491414 239580 460265 384671 412274 68639
14877A70090L34503j8524j28034A16647N02596A89614K24442R0644k25813K11306
$$ 170090 504593 486069 358035 116647 619243 189614 414056 504700 278887 490193
14867D90193j91495J09757r5443K5635K82854B77484M24221k86774J412r1214
$$ 490193 298698 408455 313012 338647 621501 277484 701705 414931 416343 325129
14857C25129m985J22330B13005K77696j00111j31784K35977B36005K82649B55153
$$ 325129 320144 442474 213005 490701 390590 258806 494783 236005 518654 255153
14846B61626K98497k70888j36305K05520k8327K48455B34224J89897K1167j46571
$$ 261626 560123 289235 152930 358450 330123 578578 234224 424121 445288 298717
14836B98717J56507j47236J59453B04097O9971Q3215K72151k13803J30882r7102
$$ 298717 455224 307988 467441 204097 274068 357283 629434 415631 546513 449411
14826D49411j88825P4427A39685M45715k0733Q656o1385J9595B60141K42697J08112
$$ 449411 260586 335013 139685 585400 564667 573323 511938 531533 260141 502838 610950
14815F10950k43144K99934l01252r2887M0375q622j40217L56908k53838K47162
$$ 610950 367806 667740 366488 273601 313976 305354 165137 522045 268207 515369
14805E15369j07593L6418n0651O0421r6734O0232j92354K16853n289B11915K02078
$$ 515369 407776 444194 393543 453964 357230 417462 225108 441961 436672 211915 413993
14794D13993J47645k11419R1752R2410j01811M68009C87134L02681C15603J78023
$$ 413993 561638 350219 441971 534381 432570 900579 387134 689815 315603 493626
14784D93626J69966C22536L44872j72612j11882m7430K49392Q0744o5501J1549
$$ 493626 663592 322536 667408 494796 382914 335484 584876 665620 600119 611668
14774F11668j16325K63100m7974k13301O3111L6118K2565B92285J63719L7628
$$ 611668 495343 758443 710469 497168 560279 596397 618962 292285 456004 493632
14764D93632Q6800m914k14445M50314l11510K61633p7117j46415k03592K00983
$$ 493632 580432 575518 361073 811387 499877 761510 684393 537978 334386 535369
14754E35369K055j04593K60874k0475k9555j82306L51154j39863j67914Q8947
$$ 535369 537424 432831 693705 673230 643675 461369 812523 672660 504746 593693
14744E93693J36P106J54848l28380L03238k74601J74197J56665R0631m31959N40038
$$ 593693 593829 600935 755783 427403 730641 456040 630237 786902 877533 445574 985612
14733I85612j13227N2465m46709K69759j19614O8432J20524m6309k64302L93593
$$ 985612 872385 924850 478141 747900 628286 696718 817242 770933 506631 900224
14723I00224R631j69140j20765J07854r785O5549K93830n37866J6064J6344J64654
$$ 900224 909855 740715 619950 727804 718019 783568 1077398 539532 555596 571940 736594
14712G36594R5894N5434k79043m1049m1217L85921l65863N14350l03385m6762
$$ 736594 832488 887922 608879 567830 526613 912534 546671 1061021 757636 710874
14702G10874q6703M35114k66740Q0096C19472M12965J62863p5917R1937l37662
$$ 710874 624171 1059285 792545 872641 319472 732437 895300 819383 911320 573658
14692E73658K12563k28381M71068k33053N4879R0250l37519M09157n2274j32450
$$ 573658 786221 557840 1028908 795855 850734 940984 603465 1012622 960348 827898
14682H27898L00308k67616J96859J24503k23183J83036k04363n6474J55081k30757
$$ 827898 1128206 860590 1057449 1181952 958769 1141805 937442 880968 1036049 805292
14672H05292Q4233L13431r9625j76883R2705j49473j0668J42115k69745J00501
$$ 805292 889525 1202956 1103331 926448 1019153 869680 859012 1001127 731382 831883
14662H31883L83575m21082O2581m6742j088L98162l35436L16139k60399L73775
$$ 831883 1215458 794376 856957 810215 809127 1207289 871853 1187992 927593 1301368
14652A301368k87662O2585J00505n06521K10825L45490k48259M5334K44817p0650
$$ 1301368 1013706 1076291 1176796 670275 881100 1226590 978331 1023665 1268482 1197832
14642A197832j19779j95156K68984k1147J13007J04288l68074L94925L6845j49785
$$ 1197832 1078053 882897 1151881 1130734 1243741 1348029 979955 1374880 1411725 1261940
14632A261940J84522l18098L79193k55706J49052l41172L07276k86215R761j49092
$$ 1261940 1446462 1128364 1507557 1251851 1400903 1059731 1367007 1080792 1090553 941461
14622I41461L64632k95022K76358M4532J07454j75929J08212j50456N2827M19956
$$ 941461 1306093 1011071 1287429 1331961 1439415 1263486 1371698 1221242 1274069 1694025
14612A694025o3908r6204q920J87986k36706R4957j72482J06613L6450l2546p4466
$$ 1694025 1630117 1533913 1524993 1712979 1476273 1571230 1398748 1505361 1541811 1509265 1434799
14601A434799J09820k77922J35450P3895j41044m092J49205K72689l17426K33440
$$ 1434799 1544619 1266697 1402147 1476042 1334998 1330906 1480111 1752800 1435374 1668814
14591A668814j30691K43624r965q2401J08724j13397J68411J28448q8646j48708
$$ 1668814 1538123 1781747 1771782 1689381 1798105 1684708 1853119 1981567 1892921 1744213
14581A744213l23456K41898J54818J01926J29770k80180R9598J30212O410o0955
$$ 1744213 1420757 1662655 1817473 1919399 2049169 1768989 1868587 1998799 2005209 1944254
14571A944254j85104K76352j0924k21422L60846K4914J94734j98100k12893j5540
$$ 1944254 1759150 2035502 2024578 1803156 2164002 2188916 2383650 2185550 1972657 1957117
14561A957117L83085R5865k60194J58015J85904N18566J01162N0016J04892M43734
$$ 1957117 2340202 2436067 2175873 2333888 2519792 3038358 3139520 3189536 3294428 3738162
14551C738162K06852J142678J253589L391978Q071028K1624899J3404401B0049036
$$ 3738162 3945014 5087692 6341281 9733259 17804287 39429186 52833587 20049036
14542G573495l766071j151029o15289j62914o1203j39001K01272l40863M44035
$$ 7573495 3807424 2656395 2041106 1878192 1816989 1677988 1879260 1538397 1982432
14533A982432l02265J89247K55292j42006J0250M2052N0040K5645K97854j62601
$$ 1982432 1680167 1869414 2124706 1982700 1992950 2035002 2085042 2110687 2408541 2245940
14523B245940j09839q698j3171p9840N26854k52479j05164K61505j10555P6642
$$ 2245940 2136101 2127403 2114232 2034392 2561246 2308767 2203603 2465108 2354553 2431195
14513B431195R4154k46135L54206R8310k63068L31995r0900j73570j9474K91479
$$ 2431195 2525349 2279214 2633420 2731730 2468662 2800657 2709757 2536187 2516713 2808192
14503B808192j33848K86677O9034l46344R1440l04166K46606J29073j35694m5703
$$ 2808192 2674344 2961021 3030055 2683711 2775151 2470985 2717591 2846664 2710970 2665267
14493B665267M90159J18439l3305J11522k72830K72125l24656P8804J69968K98002
$$ 2665267 3155426 3273865 3240560 3352082 3079252 3351377 3026721 3105525 3275493 3573495
14483C573495l2501l6716l54346N07006p0091p369j72117M07925k87241N47484
$$ 3573495 3540994 3504278 3149932 3656938 3586847 3579478 3407361 3815286 3528045 4075529
14473D075529k76634J2242J33686M7658J33948n2066J99001k84889J64855m5670
$$ 4075529 3798895 3811137 3944823 3992481 4126429 4074363 4273364 3988475 4153330 4107660
14463D107660J23495L0409N5449J27734j76163K01418R6890J42108o3823l2193
$$ 4107660 4231155 4261564 4317013 4444747 4268584 4470002 4566892 4709000 4645177 4612984
14453D612984j94772M02724K21451k2416j15141L04753J52334j84758J4102K62725
$$ 4612984 4418212 4820936 5042387 5019971 4904830 5209583 5361917 5177159 5191261 5453986
14443E453986j16723K09433P6986J3343j7812j42623O13067l33444L15862K0329
$$ 5453986 5337263 5546696 5623682 5637025 5619213 5476590 6089657 5756213 6072075 6092404
14433F092404j42982K76428J21377k00158N58241j41006j33806L54503m7980L36839
$$ 6092404 5949422 6225850 6347227 6147069 6705310 6564304 6430498 6785001 6737021 7073860
14423G073860q8535K00990q5788j6820K07022L07694j82581K95215K21294j29870
$$ 7073860 6985325 7186315 7100527 7083707 7290729 7598423 7415842 7711057 7932351 7802481
14413G802481L28948J79824n675P2636J26705J85810j84294j80376N03443M73190
$$ 7802481 8131429 8311253 8305578 8378214 8504919 8690729 8506435 8326059 8829502 9302692
14403I302692K9051J05215K04653j03715K20809Q4020K34308M0712M56789J54115
$$ 9302692 9331743 9436958 9641611 9537896 9758705 9842725 10077033 10117745 10574534 10728649
14393A0728649N245K23185K02144L51634K14534K7191O22653j59293L04708p3074
$$ 10728649 10733894 10957079 11159223 11510857 11725391 11752582 12375235 12215942 12520650 12447576
14383A2447576n6724P09578J11435L93935k59178O47872L21645Q9355O80208q2189
$$ 12447576 12390852 13100430 13211865 13605800 13346622 13994494 14316139 14405494 15085702 15003513
14373A5003513K11665L25069N05326o1795N73160K90601L35068J4090Q83388J52404
$$ 15003513 15215178 15540247 16045573 15983778 16556938 16847539 17182607 17196697 18080085 18232489
14363A8232489M14865O70336m6445Q04125M50198P40143Q5888O18317N66898N66575
$$ 18232489 18647354 19317690 19271245 20075370 20525568 21265711 21351599 21969916 22536814 23103389
14353B3103389L53241N19907N77995M58339Q03761K36195J196760N73360N55486
$$ 23103389 23456630 23976537 24554532 25012871 25816632 26052827 27249587 27822947 28378433
14344B8378433P87086P55968R09270N57542Q27552P56616J483467O95519R68084
$$ 28378433 29165519 29921487 30830757 31388299 32215851 32972467 34455934 35151453 36119537
14335C6119537P33613J731806N19806J011925J691911J256528J245564J419531
$$ 36119537 36853150 38584956 39104762 40116687 41808598 43065126 44310690 45730221
14327D5730221J098012J720530J993199J296951J862375K094121J505390K220907
$$ 45730221 46828233 48548763 50541962 51838913 53701288 55795409 57300799 59521706
14319E9521706K244334K424835K070413K605696K514466L020795L115178K772839
$$ 59521706 61766040 64190875 66261288 68866984 71381450 74402245 77517423 80290262
14311H0290262L468895L308853L675218L748502M387199M053524M763483N092156
$$ 80290262 83759157 87068010 90743228 94491730 98878929 102932453 107695936 112788092
14303A12788092M985338N832564N753349O551881O405070P285158P671616P599427
$$ 112788092 117773430 123605994 129359343 135911224 142316294 149601452 157273068 164872495
14295A64872495Q887487R248284R562048J0617666J0377056J1612255J2293599
$$ 164872495 173759982 183008266 192570314 203187980 213565036 225177291 237470890
14288B37470890J2837201J3586030J4090204J4775502J5262089J5709501J6185195
$$ 237470890 250308091 263894121 277984325 292759827 308021916 323731417 339916612
14281C39916612J6158711J6366453J6142648J5581003J5107693J3780753J2844078
$$ 339916612 356075323 372441776 388584424 404165427 419273120 433053873 445897951
14274D45897951J0362738P782303L912190J901765N11294o45098k036756m458968
$$ 445897951 456260689 464042992 467955182 469856947 470368241 469723143 467686387 463227419
14266D63227419o855224r280048j1509882j3050142j4367432j5523948j6082136
$$ 463227419 456372195 447092147 435582265 422532123 408164691 392640743 376558607
14259C76558607j6535838j6658093j6531938j5554771j4731327j5081089j4630365
$$ 376558607 360022769 343364676 326832738 311277967 296546640 281465551 266835186
14252B66835186j3954639j2919537j2182703j1956787j1256158j0241301j0146747
$$ 266835186 252880547 239961010 227778307 215821520 204565362 194324061 184177314
14245A84177314r129209q188843p961777q052804p255946p099319o409841n353536
$$ 184177314 175048105 166859262 158897485 150844681 143588735 136489416 130079575 124726039
14237A24726039n556608n539130n040555m787802m574504l857500l293027l985784
$$ 124726039 119169431 113630301 108589746 103801944 99227440 95369940 92076913 88091129
14229H8091129l609803l455195l317977l317158k648090k522139k644927k576055
$$ 88091129 84481326 81026131 77708154 74390996 71742906 69220767 66575840 63999785
14221F3999785j800131k189217k374805j956989k156802j606085j653724j293998
$$ 63999785 62199654 60010437 57635632 55678643 53521841 51915756 50262032 48968034
14213D8968034q09164j803831j551797j920298j066645j170856r4653j267984
$$ 48968034 48158870 46355039 44803242 42882944 41816299 40645443 40550790 39282806
14205C9282806j879551j060753j162242j134579m85969o15634j119009p96193
$$ 39282806 37403255 36342502 35180260 34045681 33559712 32944078 31825069 31028876
14197C1028876r74511p54634q10379n04615o62275j036090o62273p64052p2038
$$ 31028876 30054365 29299731 28489352 27984737 27322462 26286372 25624099 24860047 24788009
14188B4788009q51753n76078o81058n94181L6932n96280m86516p03133l23093
$$ 24788009 23936256 23360178 22679120 22084939 22121871 21525591 21039075 20335942 20012849
14179B0012849m62242n33073l408o41055j67848q29319r5195n068m86446l49089
$$ 20012849 19550607 19017534 19014126 18373071 18205223 17375904 17280709 17275641 16789195 16440106
14169A6440106l63971q7916n35569m67622j95406k42763k82362k00359k34503
$$ 16440106 16076135 15988219 15452650 14985028 14789622 14546859 14264497 14064138 13829635
14160A3829635k92251l61456N9819l91803m21205J74577l07310l13634j97987
$$ 13829635 13537384 13175928 13235747 12843944 12422739 12597316 12290006 11976372 11778385
14151A1778385k26493l11251k9975j68112n5594k93964n00640L2528p8164j96971
$$ 11778385 11551892 11240641 11210666 11042554 10986960 10692996 10192356 10224884 10146720 9949749
14141I949749l13990M4648k86068l76287K26349p9757j1101l46013K78246m74758
$$ 9949749 9635759 9680407 9394339 9018052 9244401 9164644 9153543 8807530 9085776 8611018
14131H611018Q3364m72517j57666K93043l96896j70688M9997j06830k28533k15418
$$ 8611018 8694382 8221865 8064199 8357242 7960346 7789658 7839655 7732825 7504292 7288874
14121G288874J1526L34114o75445J45652j09268k17769J07729m09385N9650m371
$$ 7288874 7300400 7634514 6959069 7104721 6995453 6777684 6885413 6476028 6535678 6531307
14111F531307J7743l66348j16539J74698k6573k77326q9792K26842l12338L27657
$$ 6531307 6549050 6182702 6066163 6240861 6214288 5936962 5847170 6074012 5761674 6089331
14101F089331m18330J78946k81344J6682o4172Q8995p1819n03698K02365j90640
$$ 6089331 5671001 5849947 5568603 5585285 5521113 5610108 5538289 5034591 5236956 5046316
14091E046316K21444k80920J54372m46307J84407k06490L66159j81927j98109
$$ 5046316 5267760 4986840 5141212 4694905 4879312 4672822 5038981 4857054 4658945
14082D658945J17414m01455M3249p9251k8167K11339l07034J80844J9156Q268
$$ 4658945 4776359 4374904 4418153 4338902 4310735 4522074 4215040 4395884 4415040 4423308
14072D423308m21938J53847r2337m32282N72188o47356N17199k12403K15923k14518
$$ 4423308 4001370 4155217 4062880 3630598 4202786 3555430 4072629 3860226 4076149 3861631
14062C861631l11567K03790o5773j38378K66565M9839o3527j94633j47666J2257
$$ 3861631 3550064 3753854 3688081 3549703 3816268 3866107 3802580 3607947 3460281 3472538
14052C472538l83899N14276j98857K27198k65239K3001j70647n9584N8416l56719
$$ 3472538 3088639 3602915 3404058 3631256 3366017 3389018 3218371 3158787 3217203 2860484
14042B860484L85676j12392l09457P1752M11468o60541R4306j90160N60846L2675
$$ 2860484 3246160 3133768 2824311 2896063 3307531 2646990 2741296 2551136 3111982 3144657
14032C144657l01043r8482j25568K85386O1001l09054M15046m33834l82598L92291
$$ 3144657 2843614 2745132 2619564 2904950 2965951 2656897 3071943 2638109 2255511 2647802
14022B647802k82668K99539k89056L31995k43960q2619l4047l41543K24609m6276
$$ 2647802 2365134 2664673 2375617 2707612 2463652 2381033 2346986 2005443 2230052 2183776
14012B183776K25778L9286l02085J36582k30310K13817m3626Q7045k48768k6397
$$ 2183776 2409554 2448840 2146755 2283337 2053027 2266844 2223218 2310263 2061495 2035098
14002B035098M2420K22333k85693p8635q9590r282L29276n13203M41939k13793
$$ 2035098 2077518 2299851 2014158 1935523 1845933 1836651 2165927 1652724 2094663 1880870
13992A880870K11470k89621O82988L39773K167682N551707J8872812K3600205
$$ 1880870 2092340 1802719 2485707 2825480 4993162 10544869 29417681 53017886
13984E3017886k6254557A2290270m701614k014914r45710j085762j21096j23090
$$ 53017886 26763329 12290270 7588656 5573742 4628032 3542270 3421174 3298084
13976C298084J681j43368o84910K53397m62780K21786l37783M01228k33612q0580
$$ 3298084 3299765 3156397 2471487 2724884 2262104 2483890 2146107 2547335 2313723 2233143
13966B233143p7440k97535J31903J36124l50435q5867M31188O0309r8432K3099
$$ 2233143 2155703 1858168 1990071 2126195 1775760 1689893 2121081 2181390 2082958 2106057
13956B106057k98901L4057K50986l27743L06525q17988M78124m57R6944l09568
$$ 2106057 1807156 1841213 2092199 1764456 2070981 1252993 1731117 1730660 1827604 1518036
13946A518036J50880n1417j0547r1776j13987M61836o4489k03571k47885J88948
$$ 1518036 1668916 1617499 1606952 1515176 1401189 1863025 1798536 1594965 1347080 1536028
13936A536028L64042r6965J65263k51276k70207J43558K7037j44507J14418k50402
$$ 1536028 1900070 1803105 1968368 1717092 1446885 1590443 1617480 1472973 1587391 1336989
13926A336989j4933N6453K7313k3789j42783L22377j84664L79929p04947J38466
$$ 1336989 1322056 1378509 1405822 1382033 1239250 1561627 1376963 1756892 1051945 1190411
13916A190411j61632N75650n9505j66737j02178J79247l00831Q2310Q7663N8687
$$ 1190411 1028779 1604429 1544924 1378187 1276009 1455256 1154425 1236735 1324398 1383085
13906A383085q3429l30850K12881P452J28235K46865l60857K06486l7634m13925
$$ 1383085 1299656 968806 1181687 1189139 1317374 1564239 1203382 1409868 1372234 958309
13896I58309K55632J79109k07637m7714j28L2866l15048O59410n85950J42102
$$ 958309 1213941 1393050 1185413 1137699 1137571 1170437 855389 1514799 928849 1070951
13886A070951m8703K06105k18300L90199j16098j13537K62721J4082l65038M36147
$$ 1070951 1022248 1228353 1010053 1400252 1284154 1170617 1433338 1447420 1082382 1518529
13876A518529o33456M33838j27533k85279m039K02040J77308l94093J87533l24072
$$ 1518529 885073 1318911 1191378 906099 902060 1104100 1281408 887315 1074848 750776
13866G50776K37179O261j32126k5959L61835p9777l98950J27753K5976K27138
$$ 750776 987955 994216 862090 836131 1197966 1118189 719239 846992 872968 1100106
13856A100106L1754k59482j19925j77555M10399j58908L41417n16137J21121p9106
$$ 1100106 1131860 872378 752453 574898 985297 826389 1167806 651669 772790 693684
13846F93684L25564j06567p7650j02993K26595J03867k95477o4494K36299k41763
$$ 693684 1019248 912681 835031 732038 958633 1062500 767023 702529 938828 697065
13836F97065Q2653k46316L30819k03557K23906j49083P0091M0187q7828K98286
$$ 697065 779718 533402 864221 660664 884570 735487 805578 845765 757937 1056223
13826A056223k48707K29500l26894P8928O3675q3313K06908o7879l88447K31370
$$ 1056223 807516 1037016 710122 789050 852725 769412 976320 908441 519994 751364
13816G51364K88368Q0582m35733L17698k87498P0161J6802j78380L03385J3429
$$ 751364 1039732 1120314 684581 1002279 714781 784942 801744 623364 926749 940178
13806I40178k97188J92118k2378l02935J52334J99787j65398K02677k02597K47900
$$ 940178 642990 835108 812730 509795 662129 861916 696518 899195 696598 944498
13796I44498N3027m80824M19468k08050j64542J92842j15093m9093R527k152L75951
$$ 944498 997525 516701 936169 728119 563577 756419 641326 592233 601760 599608 975559
13785I75559A95273K91620M36201l92686j18858M14414l55486L5048J90287J04407
$$ 975559 195273 486893 923094 530408 411550 825964 470478 505526 695813 800220
13775H00220l32422J39063o107q9236k5542l941M9273L53754k95243J43050j3265
$$ 800220 467798 606861 600754 511518 485976 482035 531308 885062 589819 732869 719604
13764G19604L024k59667R4021B49188M35526j7941j16367j1851n0695L32283C52062
$$ 719604 722628 462961 556982 249188 684714 666773 550406 538555 487860 820143 352062
13752E58551L3624J91422k02782L0942n7325j40877L97524j45193K13400D31929
$$ 558551 592175 783597 580815 611757 554432 413555 811079 665886 879286 431929
13741H73869q8545l22321p5306Q7482K41232o0354j83329J54420n4648J12679
$$ 873869 785324 463003 387697 475179 716411 656057 472728 627148 572500 685179
13731F85179p3923N7957j3030j56954M8209k1762j54721K78916B93577K53321
$$ 685179 611256 669213 656183 499229 547438 525676 370955 649871 293577 546898
13721E46898k43596L00937J35021k22981j14565J77513n4038L8200J74623j96480
$$ 546898 303302 604239 739260 516279 401714 579227 525189 563389 738012 541532
13711E41532r6615j10291R3151q4542L74836j43054j32743j20964J39578L32369
$$ 541532 444917 334626 427777 343235 718071 575017 442274 321310 460888 793257
13701G93257j65262j1212L9937k31363L15310C41642L46973B98899K22349J17356
$$ 793257 627995 616783 656720 425357 740667 341642 688615 298899 521248 638604
13691F38604k47347M1677q2345L53321k39169J15955K40012j47267j96896j43664
$$ 638604 391257 432934 350589 703910 464741 580696 820708 673441 476545 332881
13681C32881J1770Q8350o2852A11254P16932r296l50027j54036L21304k04604
$$ 332881 344651 433001 370149 111254 828186 818890 468863 314827 636131 431527
13671D31527j44563L73784k63626K04112j80741K2947l882q3141a17450G38327
$$ 431527 286964 660748 397122 601234 420493 443440 439558 356417 -117450 738327
13660E57898j1241K041r9837O2153L2186B32555l54K30747j90075j03502L05484
$$ 557898 546657 548698 448861 511014 543200 232555 232201 462948 272873 169371 474855
13649D74855A66167K55116j46895q7701O6588D2387L7709K8876L93515A63725
$$ 474855 166167 421283 274388 186687 253275 42387 80096 108972 502487 163725
13638D87524A83686L97578j99992j05452K29113M6521j31499j52161j855L06147
$$ 487524 183686 581264 381272 275820 504933 551454 419955 267794 265939 572086
13628E72086B04451M0810n4122q8673N27690j98052Q6713p7013A61810K30800
$$ 572086 204451 245261 191139 102466 630156 432104 518817 441804 161810 392610
13618C92610A27223J29748j3041K83421J79411B76764K02691K15966G6411K65655
$$ 392610 127223 256971 243930 527351 706762 276764 479455 695421 76411 342066
13608C42066J69894q966q5p970f251C46330L35504k35598j15439A12878K27155
$$ 342066 511960 502994 502909 494939 -6251 346330 681834 446236 330797 112878 340033
13597C40033q5196J49658c7700B848K62913A17696K74551j89103k4961J94071
$$ 340033 254837 404495 -37700 2848 265761 117696 392247 203144 178183 372254
13587C72254O8108o8894N370j43856H6186K41761J14068o4270F2952J23368K08770
$$ 372254 440362 371468 376838 232982 86186 327947 442015 377745 62952 186320 395090
13576C95090A29656F4547J69607m3038J39473j53476o9294K54636o6140j41113
$$ 395090 129656 64547 234154 191116 330589 177113 107819 362455 296315 155202
13566A55202K43086j2886a32173B15183O8245E3930K10441c159B60662J02096
$$ 155202 398288 385402 -132173 215183 283428 53930 264371 -3159 260662 362758
13556C62758e0277B66713k0843P9804j28361K84478l4247j20129N8334A80301
$$ 362758 -50277 266713 245870 325674 197313 481791 447544 327415 385749 180301
13545C38136K03511r1484A14858M36025B49607I5769M11704B17761R2025e390
$$ 338136 541647 450163 114858 550883 249607 95769 507473 217761 309786 -5390
13534I7842L66103A25903P0696J04184a8410D39233J7813l3026j47637k9567A9418
$$ 97842 463945 125903 196599 300783 -18410 439233 457046 424020 276383 246816 19418
13522B76835K02098r0029j06250j09254J00029F8407L22179A273K23051p0778
$$ 276835 478933 388904 282654 173400 273429 68407 390586 1273 224324 153546
13512A53546L04220l9059k9094j86825H5654R3028K84895A72306J84543k6121
$$ 153546 457766 418707 389613 202788 85654 178682 463577 172306 356849 330728
13502C30728E9840P9880J77153D1007Q7141J00047D1444N1969R944K70796o4170
$$ 330728 59840 139720 316873 41007 128148 228195 41444 93413 103357 374153 309983
13491C09983A16351a021B94933J36132O3468A54840o3106K40286c5332B43507
$$ 309983 116351 -1021 294933 431065 494533 154840 91734 332020 -35332 243507
13480a93835A15083K34118m1801a68774I1644J36958H9121M4793F5484K0666K68754
$$ -193835 115083 349201 307400 -168774 91644 228602 89121 133914 65484 86150 354904
13469C54904A64192G1712a3565D01966A81930K3817H6457n543J87643D8286J61317
$$ 354904 164192 71712 -13565 401966 181930 205747 86457 80914 268557 48286 209603
13458B09603A03355a1975D4028a25194B44802A21555K6504K67311R8310k20426
$$ 209603 103355 -11975 44028 -125194 244802 121555 148059 415370 513680 293254
13448B93254l8940j14332M2805R640r4804J13456o003J32878j60194J43374P0487
$$ 293254 254314 139982 182787 192427 97623 211079 205076 337954 177760 321134 391621
13437C91621A41364J04925l6275b86B88550n2836N4243l556j30193K77477C2286
$$ 391621 141364 246289 210014 -286 288550 235714 289957 286401 156208 433685 32286
13425B33227j02819M72190a35342I6795J39425R571A10624f5693B30845K19450
$$ 233227 130408 602598 -135342 96795 236220 245791 110624 -65693 230845 450295
13415D50295B08752A8318K68938n7201F9880e1951A65863M4409D8864J12576Q713
$$ 450295 208752 18318 287256 230055 69880 -51951 165863 210272 48864 161440 170153
13404A70153o0440J50237L23762A97556Q9397c6565A14112M402R2034c13041E09877
$$ 170153 109713 259950 583712 197556 286953 -36565 114112 118514 210548 -313041 509877
13392C43641K67436B86565k4438k2738D1287K26942j30906O2050k7537J02557
$$ 343641 611077 286565 262127 239389 41287 268229 137323 199373 171836 274393
13382B74393m1971j193M83692B94828I7864J48414E5421L35278H0791K10934j28355
$$ 274393 232422 231229 714921 294828 97864 246278 55421 390699 80791 291725 163370
13371A63370O6350a13909C45861j09666E8848K14118H6140i9282A29595f9196
$$ 163370 229720 -113909 345861 236195 58848 272966 86140 -99282 129595 -69196
13360A28503N6883a89836q7872f9801B23789f6763C39999n1915j4101b59497B65108
$$ 128503 185386 -189836 -277708 -69801 223789 -66763 339999 288084 273983 -259497 265108
13348F35281A81276L14220m7443A35760o134M33518d311C78823J61653D3802J93194
$$ 635281 181276 495496 448053 135760 129626 563144 -4311 378823 540476 43802 236996
13337B36996J94184A01650D6337R9822D4106M1851J83006I4650Q3712b3970H954
$$ 236996 431180 101650 46337 146159 44106 85957 268963 94650 178362 -23970 8954
13325B08248J0409q3792K87175G3720L13969a36711A05440J86729k0597J32753
$$ 208248 218657 134865 422040 73720 387689 -136711 105440 292169 271572 404325
13315D04325j08408A09056K68498j22695P5099h1135D3421K38478b4710B03734
$$ 404325 295917 109056 377554 254859 329958 -81135 43421 281899 -24710 203734
13304a44056A38933J4640m1521P8150J15035l2299B6364L72797A73241H1764K27812
$$ -144056 138933 153573 112052 190202 305237 272938 26364 399161 173241 81764 309576
13293C09576A50603R6856B3838M5876K54182A25813l7376J06966n5126K6436i3297
$$ 309576 150603 247459 23838 69714 323896 125813 88437 195403 140277 166713 -93297
13281C6585a52597A83113c9064g827j01639M173B59712q7454k1340G0328P9988
$$ 36585 -152597 183113 -39064 -7827 -109466 -105293 259712 172258 150918 70328 150316
13270A50316a29971A90645J48187a47206D16525j92483O8432j4303a18627C52119
$$ 150316 -129971 190645 338832 -147206 416525 224042 292474 278171 -118627 352119
13259B01737G7605R9013n0346E1243Q5256a32315E793J62784e9625A41598J9421
$$ 201737 77605 176618 126272 51243 136499 -132315 5793 168577 -59625 141598 161019
13248A61019K35348A30583K07284E2201O6754b1436F9202M8627k1782b63662A56387
$$ 161019 396367 130583 337867 52201 118955 -21436 69202 117829 96047 -263662 156387
13236a34159F4561J11705a2187I562J74609e712H3150R7170a01458A85027H3176
$$ -134159 64561 176266 -12187 9562 184171 -5712 83150 180320 -101458 185027 83176
13224h2158J2955I0168J5462L40695B0067K62440c9360j2305B17963m4715O2655
$$ -82158 -69203 90168 105630 446325 20067 282507 -39360 -51665 217963 173248 235903
13213B35903a14949A56818d0860j30749B39293j02453h4759A18245M9693B4787
$$ 235903 -114949 156818 -40860 -171609 239293 136840 -84759 118245 167938 24787
13202b74023M1318K3018F6051K26149F2000A4675N5115b8980B14600h6833j71997
$$ -274023 -232705 -209687 66051 292200 62000 14675 69790 -28980 214600 -86833 -258830
13191b58830A13217a31899A28093a74692j968M6570F8461J78988g8252o4929G1595
$$ -258830 113217 -131899 128093 -174692 -176660 -130090 68461 247449 -78252 -143181 71595
13179b8650C03884d48558C26170a10186n5285c6268A34981J51847j11743b2616
$$ -28650 303884 -448558 326170 -110186 -165471 -36268 134981 286828 175085 -22616
13168a13606p2837A22123D8971J87797q591a05774d1417B61236D4470J23126b9765
$$ -113606 -186443 122123 48971 236768 228177 -105774 -41417 261236 44470 167596 -29765
13156D18882A27645J43997I6055f2052B53395a03137n9333j36496a6102B59278
$$ 418882 127645 271642 96055 -62052 253395 -103137 -162470 -298966 -16102 259278
13145a8751B2132J28171Q6571E355J15919K3234m4843e7514C19848C3545K30573
$$ -18751 22132 150303 236874 5355 121274 144508 99665 -57514 319848 33545 264118
13134B64118a68959F0172b94926A45573f0158a7116k45850B60387j21835b73609
$$ 264118 -168959 60172 -294926 145573 -60158 -17116 -262966 260387 138552 -273609
13123A91024f4415j28817A52056l4253b6968B07107p1073h5682a438E8647R8624
$$ 191024 -64415 -193232 152056 117803 -26968 207107 136034 -85682 -1438 58647 157271
13112A57271J0525a1558F8048g0116k28074a44547D5443J59604J92506G776J58144
$$ 157271 167796 -11558 68048 -70116 -298190 -144547 45443 205047 397553 7776 165920
13101A65920K4391J20678a04551B14753l2186a34999O6574m7274B17743d6201
$$ 165920 190311 310989 -104551 214753 182567 -134999 -68425 -115699 217743 -46201
13090B09780q1184b17878A6048K37123G8404a46756f6979o6858j90638D27589
$$ 209780 128596 -217878 16048 253171 78404 -146756 -66979 -133837 -324475 427589
13079B6345a3235F4982a31986A75733A1675M21536A29460J8288G695K27884j12427
$$ 26345 -13235 64982 -131986 175733 11675 433211 129460 147748 7695 235579 123152
13068A23152l1607C1465h3539H8783J57391f6648C86829A4517L58082a5524A58742
$$ 123152 91545 31465 -83539 88783 246174 -66648 386829 14517 372599 -15524 158742
13056a67273B94210h2896e424C42460G1052O8070o79b4688o9277o042C2005B750
$$ -167273 294210 -82896 -5424 342460 71052 139122 138443 -24688 -93965 -100007 32005 2750
13043B99920c93276H0754J89218D5075J29770d5854C7282n66O2219g7773C68782
$$ 299920 -393276 80754 269972 45075 174845 -45854 37282 36716 98935 -77773 368782
13031B62696H8574B7560c05247a27979I1787h5462J8498B97426j26914j5453a2323
$$ 262696 88574 27560 -305247 -127979 91787 -85462 -66964 297426 170512 155059 -12323
13019f7335A13388O7573B2516L53239A02334L57388e131B2153F962J73487H1364
$$ -67335 113388 180961 22516 375755 102334 459722 -5131 22153 6962 180449 81364
13007e789A54358h684C44035j29206K0669c78833C82289j68381a78778C92119
$$ -5789 154358 -8684 344035 214829 235498 -378833 382289 213908 -178778 392119
12996E0194M8976h4615C15084e5582l1871C84352D9001J21442b43552R4195F3961
$$ 50194 99170 -84615 315084 -55582 -87453 384352 49001 170443 -243552 -149357 63961
12984A30061M992b37081B70992A33122L0053o3232L6358a3525j66164E5176a42142
$$ 130061 135053 -237081 270992 133122 163175 99943 136301 -13525 -179689 55176 -142142
12972B69481J409J67002j87320h2461A37829L6431e390j91381L7615A84322a15953
$$ 269481 270890 437892 250572 -82461 137829 174260 -5390 -196771 -159156 184322 -115953
12960A22244a13319j46864E4969J82346j5298M1523a44828P1230E6176L64512
$$ 122244 -113319 -260183 54969 237315 222017 263540 -144828 -73598 56176 420688
12950D20688B03846F3947n583b4901B05168d1630k2415j3078G9861d4624p5292
$$ 420688 203846 63947 58364 -24901 205168 -41630 -64045 -77123 79861 -44624 -119916
12939a19916a6716B07074k4981p3461a15793c8867j99692A90508a67405A74627
$$ -119916 -16716 207074 182093 108632 -115793 -38867 -238559 190508 -167405 174627
12928B2394b7143l29229A57117l151d5034A3784b86269A59862k822F5693K09573
$$ 22394 -27143 -356372 157117 153966 -45034 13784 -286269 159862 157040 65693 275266
12917B75266m6968m3527e1908I6634M927J38056a92707I7974d4077r73E9904a50651
$$ 275266 228298 184771 -51908 96634 101561 239617 -192707 97974 -44077 -45050 59904 -150651
12904D16498a11779B6046R9482n398J1601j9539a06772J1674D7265a484A85786
$$ 416498 -111779 26046 125528 120130 131731 112192 -106772 -95098 47265 -1484 185786
12892a571A16945B9015a41050A29042J86143a038A94309a15184c9672E3706J59284
$$ -1571 116945 29015 -141050 129042 315185 -1038 194309 -115184 -39672 53706 212990
12881B12990m1646g9718A00104a28610I6426J44175E2156O3585k5525B6802J6590
$$ 212990 171344 -79718 100104 -128610 96426 240601 52156 115741 90216 26802 43392
12870D3392a07812B10783g5884B9631a06628a7173j01712A26748J52822f6553
$$ 43392 -107812 210783 -75884 29631 -106628 -17173 -118885 126748 279570 -66553
12859A39464g1651m4120d3616k65573l56396c1907C18703i7538j0809A33571L8789
$$ 139464 -71651 -115771 -43616 -309189 -665585 -31907 318703 -97538 -108347 133571 172360
12848A72360B3728M0714a26870I9961a82619I8941b4663G5055a99323e5477A16798
$$ 172360 23728 64442 -126870 99961 -182619 98941 -24663 75055 -199323 -55477 116798
12836i913F567K49844e4766l8980A69122C9634a2065j86803G102J81829b82032
$$ -9913 6567 256411 -54766 -93746 169122 39634 -12065 -198868 7102 188931 -282032
12824G1818a16504A8577a72866F9460e0332l207m3880C0317a25302L7370B35736
$$ 71818 -116504 18577 -172866 69460 -50332 -53539 -97419 30317 -125302 -87932 235736
12812a28454B05554o5376a59120O541C1162P6307P0509d0227L895A80798g1997
$$ -128454 205554 140178 -159120 -152579 31162 107469 177978 -40227 -36332 180798 -71997
12800C30917g7974n9170q6010A65559O7541E791b32753C5949b1596j82429j59531
$$ 330917 -77974 -137144 -223154 165559 233100 5791 -232753 35949 -21596 -204025 -363556
12789c63556A44340G0743J3026N8827k8174Q4710D0317e8797l50216a22381d2851
$$ -363556 144340 70743 83769 142596 114422 199132 40317 -58797 -409013 -122381 -42851
12777A09794b03472N8520j5037A67956L3189I1059K01247b2635e351o2958E0906
$$ 109794 -203472 -144952 -159989 167956 201145 91059 292306 -22635 -5351 -68309 50906
12765a834k05529H9065e037A84194a63304P8568A05792c6199G1382N3177J25904
$$ -1834 -207363 89065 -5037 184194 -163304 -84736 105792 -36199 71382 124559 250463
12754B50463J85845M9778C5225b25946C90035A21236c73261C59386a39275E1597
$$ 250463 436308 486086 35225 -225946 390035 121236 -373261 359386 -139275 51597
12743c1881A27386e8094b1585C05860a24135l0287f7424L364o4757Q972k5271
$$ -31881 127386 -58094 -21585 305860 -124135 -154422 -67424 -64060 -128817 -119845 -145116
12732a45116A52395b63215H7813j9997i2980E10482d07561B08577e9071C3961
$$ -145116 152395 -263215 87813 67816 -92980 510482 -407561 208577 -59071 33961
12721B45133a72038h4047A44131a01226H1629J17243d09034B29344r6860J86656
$$ 245133 -172038 -84047 144131 -101226 81629 198872 -409034 229344 132484 319140
12711C19140j19056B325J17203q38Q7194N3829o1698H3686J26576R1772D8617
$$ 319140 200084 2325 119528 118690 205884 259713 198015 83686 210262 302034 48617
12699c9093A52759b16268f7038D9629O3095h2939c6158A43189f2871a5814A42827
$$ -39093 152759 -216268 -67038 49629 112724 -82939 -36158 143189 -62871 -15814 142827
12687f9975A76947A9494K99928A38490a23531B9814J66105b68701C02981J7258
$$ -69975 176947 19494 319422 138490 -123531 29814 195919 -268701 302981 320239
12677C20239b3652n1888j9645j04605c6630E754J21517b6768B68554J7852A34522
$$ 320239 -23652 -75540 -95185 -199790 -36630 5754 127271 -26768 268554 286406 134522
12665C91252H741K93338n2105q8518R8336K0205D228a86832e8541C79188A08956
$$ 391252 8741 302079 249974 161456 259792 279997 4228 -186832 -58541 379188 108956
12653a53626g1482A19863a7605B25987J16407a00379k6185q1297N3091L6301E3407
$$ -153626 -71482 119863 -17605 225987 342394 -100379 -126564 -207861 -154770 -118469 53407
12641H0415O3444a78421A97210K10865c5961A84021G0213C1599O5039f3931E7857
$$ 80415 143859 -178421 197210 408075 -35961 184021 70213 31599 96638 -63931 57857
12629a88782C50804H315K70722R3571r8449H6535a6121j06532A32431n4716J2630
$$ -188782 350804 8315 279037 372608 274159 86535 -16121 -122653 132431 77715 90345
12618I0345j9769K72574a14962A0154a21912o3119B94727r6673g8180k89051A27993
$$ 90345 70576 343150 -114962 10154 -121912 -185031 294727 198054 -78180 -367231 127993
12606E5176i2174c9285B37105a03550L51E8505k2854J57902K86515C4587K51843
$$ 55176 -92174 -39285 237105 -103550 -103199 58505 35651 193553 480068 34587 286430
12595B86430a45828G5835M0050F627P7986m899J1995d8668C7488C072J35621d2067
$$ 286430 -145828 75835 115885 6627 84613 79714 91709 -48668 37488 3072 138693 -42067
12582c66636P1941H5055m0199b04861A34169b40104B26696q8234c27838D09755
$$ -366636 -294695 85055 44856 -204861 134169 -240104 226696 138462 -327838 409755
12571a04195C8255K32763g852B3676K82801G5506P9298N4469J95918b26080a06071
$$ -104195 38255 271018 -7852 23676 306477 75506 154804 209273 405191 -226080 -106071
12559f1769d709m035j17522C49299c04543a34059B55810c9397j5894J1259J5546
$$ -61769 -4709 -8744 -126266 349299 -304543 -134059 255810 -39397 -55291 -44032 -28486
12548b8486H1997d8387E1076g3972A43065A0174K94835C9905G057a33434A25800
$$ -28486 81997 -48387 51076 -73972 143065 10174 305009 39905 7057 -133434 125800
12536B7643J99660i3632C36040A61122J5501b61931a19199p6835F0065a7660k93837
$$ 27643 227303 -93632 336040 161122 176623 -261931 -119199 -196034 60065 -17660 -311497
12525c11497D4796i0956j74669J30627A2948h0286a087k64753A06723c9174R557
$$ -311497 44796 -90956 -265625 -134998 12948 -80286 -1087 -265840 106723 -39174 -29617
12514b9617m7513r1704j4221B24006c92549C16742c848B00785A866L8783M3280
$$ -29617 -77130 -168834 -183055 224006 -392549 316742 -3848 200785 1866 40649 83929
12503H3929a71161A375b13534C0795i0140A1817L7359L05083b15849C3309d8241
$$ 83929 -171161 1375 -213534 30795 -90140 11817 49176 354259 -215849 33309 -48241
12491a32685b5879B4038a61013l7857P1650j3329C75005a17715J9790a522k54048
$$ -132685 -25879 24038 -161013 -198870 -127220 -140549 375005 -117715 -97925 -1522 -255570
12480b55570A70379K857k84a28216F2260c1952A13429J1154a6414j02429k6157
$$ -255570 170379 173236 172952 -128216 62260 -31952 113429 124583 -16414 -118843 -145000
12469a45000A08871j1327B7482K30968j15146c03454A67288h1824B52786j9215
$$ -145000 108871 97544 27482 258450 143304 -303454 167288 -81824 252786 233571
12459B33571K3964A12131a92794P4862M7207j78796A94816B4337i8756A44783
$$ 233571 257535 112131 -192794 -117932 -70725 -249521 194816 24337 -98756 144783
12448b49290o636e8257f08o3630H2990J22877a2418F9766a57114J5182a547E6867
$$ -249290 -255926 -58257 -608 -64238 82990 205867 -12418 69766 -157114 -141932 -1547 56867
12435e5355a478E1648b53222J08657F2497a55693A31404b40227c8230a7093C25937
$$ -55355 -1478 51648 -253222 -144565 62497 -155693 131404 -240227 -38230 -17093 325937
12423B01284a12836e4338l5345A51114h3687k79362I6279f7612J8087n9297I2406
$$ 201284 -112836 -54338 -89683 151114 -83687 -363049 96279 -67612 -49525 -108822 92406
12411A34705J66230D0581J21373m7998J2642C3686a53344O6424b2633j45270n1549
$$ 134705 300935 40581 161954 113956 126598 33686 -153344 -86920 -22633 -167903 -219452
12400b19452j13306J46143F3690L05948B2334e8954m56041B5103c32745B55199
$$ -219452 -332758 -186615 63690 369638 22334 -58954 -514995 25103 -332745 255199
12389b15714L5659A33599a54993e6437D293a38010R072j54396D9474K53633b12372
$$ -215714 -180055 133599 -154993 -56437 4293 -138010 -128938 -283334 49474 303107 -212372
12377C336J63537n0496i4471B67748e3459B51079G8682b17376B35259k5212J06003
$$ 3336 166873 116377 -94471 267748 -53459 251079 78682 -217376 235259 210047 316050
12366C16050j35275A3065Q3794J29447D2961g6724j39696A46721l8779J43897
$$ 316050 180775 13065 96859 226306 42961 -76724 -216420 146721 107942 251839
12356B51839b92699D2082h784q87C43205j18980q3074h8824A48544c10161h3063
$$ 251839 -292699 42082 -8784 -9671 343205 224225 141151 -88824 148544 -310161 -83063
12344B3162P7219b8036G148g3377p4702r376N5395A12306a10706E05615A22886
$$ 23162 100381 -28036 7148 -73377 -148079 -157455 -102060 112306 -110706 505615 122886
12332A09302a56955C55502a37973I575b88779J13600n4765j2212i9594C26d4524
$$ 109302 -156955 355502 -137973 9575 -288779 -175179 -229944 -242156 -99594 326 -44524
12320G2075m481P4097B7719a17636A03025J25193c13686b0913A18047R2101f2825
$$ 72075 67594 141691 27719 -117636 103025 228218 -313686 -20913 118047 210148 -62825
12308e2487H4726h185A52175i6512j89595A76308K0552a14347A57503f3181j20150
$$ -52487 84726 -8185 152175 -96512 -286107 176308 196860 -114347 157503 -63181 -183331
12297a83331A72816a47906I0193a6667A78013H4209K5189A653L27689A17190b29566
$$ -183331 172816 -147906 90193 -16667 178013 84209 109398 1653 329342 117190 -229566
12285e7953A4908K28292a55448G4954e522A34133H647a0426B58146J53954j05547
$$ -57953 14908 243200 -155448 74954 -5522 134133 8647 -10426 258146 412100 306553
12274C06553J22182R8375k61148n7058r5070a88231A33112i0783A11294m3450
$$ 306553 428735 527110 265962 208904 113834 -188231 133112 -90783 111294 67844
12264F7844L07501A86796j2032F094a23209A62295a5446A733c1067Q1G6706o973
$$ 67844 375345 186796 174764 6094 -123209 162295 -15446 1733 -31067 -30986 76706 69733
12252F9733c3983B08890L2920a43654A32586M4897O5989J2266J94022H4715N8976
$$ 69733 -33983 208890 241810 -143654 132586 177483 243472 255738 449760 84715 143691
12241A43691k9477c21402J54469G8860N666K953R6185K50249j00422h2770B07149
$$ 143691 114214 -321402 -166933 78860 84526 87479 183664 433913 333491 -82770 207149
12229B39312C4400c5626A52886N4588J1920J10561i438B41236O275b5824G2521
$$ 239312 34400 -35626 152886 207474 219394 329955 -9438 241236 247511 -25824 72521
12217B60924a29658a2547n9836B68329a91861d1496j9601C1919O5188C0867K82962
$$ 260924 -129658 -12547 -72383 268329 -191861 -41496 -61097 31919 97107 30867 313829
12206C13829A29882K10713j24581P9074A30648b8464j01324E4832J50740R0785
$$ 313829 129882 340595 216014 295088 130648 -28464 -129788 54832 205572 296357
12196B96357i4132A59021a00838C32863j61442j9000P717J08450j26576a07230
$$ 296357 -94132 159021 -100838 332863 171421 152421 160138 268588 142012 -107230
12185D5657a1445A06193b40165C58978H9216K59972B5421N04403B39782K32378
$$ 45657 -11445 106193 -240165 358978 89216 349188 25421 529824 239782 472160
12175D72160e4887E32997A80793p2330K63429L0729A73868a49083A03061R6456
$$ 472160 -54887 532997 180793 108463 371892 402621 173868 -149083 103061 199517
12165A99517K74674A36820d6167j04199C94442g1134r505H4000i3194A28047c1209
$$ 199517 474191 136820 -46167 -150366 394442 -71134 -80639 84000 -93194 128047 -31209
12153C23040a05807B39012a29125C16859e4997A64423a19220d1670D5822M43834
$$ 323040 -105807 239012 -129125 316859 -54997 164423 -119220 -41670 45822 489656
12143D89656G091K81651A5199b7148A54646f4488A4393h0965A02758M1899r142
$$ 489656 7091 288742 15199 -27148 154646 -64488 14393 -80965 102758 144657 135515
12132A35515R9361H3781f19k12919P2971A6601c1456A06171D2490a2735A50121
$$ 135515 234876 83781 -619 -213538 -140567 16601 -31456 106171 42490 -12735 150121
12120A2767c1367F2238a91255j34531A64992e3300G1063P4889a67856B52830D5485
$$ 12767 -31367 62238 -191255 -325786 164992 -53300 71063 145952 -167856 252830 45485
12108a65431I5590a24838B06210g7304K4066C30969E4554b57155M9904O4747C96150
$$ -165431 95590 -124838 206210 -77304 -53238 330969 54554 -257155 -207251 -142504 396150
12096a59925g086q0961B77308f9221k4260j64243g410l4116q5198C8553j9046
$$ -159925 -7086 -88047 277308 -69221 -93481 -257724 -7410 -41526 -126724 38553 19507
12085A9507f1644r2690k51742f4730B1275N3716l208L75936B06406a53164A79852
$$ 19507 -61644 -154334 -406076 -64730 21275 74991 71783 447719 206406 -153164 179852
12073A477641L14523A94056J65009j67096b53476A59162M0543b39599l2707O9909
$$ 1477641 1792164 194056 359065 191969 -253476 159162 199705 -239599 -272306 -202397
12063b02397O9103C01676c55132E2905O8508a96749A07929c3923C6889K11079
$$ -202397 -133294 301676 -355132 52905 121413 -196749 107929 -33923 36889 247968
12053B47968D8791i4277k526F2297d8183k16863d8137j0381o5903C3833c17669
$$ 247968 48791 -94277 -96803 62297 -48183 -265046 -48137 -58518 -124421 33833 -317669
12041a38337l24838f6190j67374g5072r8540E1532h2277B6020Q0147N6628c76733
$$ -138337 -463175 -66190 -233564 -75072 -173612 51532 -82277 26020 106167 162795 -376733
12029A00663J33458a70802q4190a14364B05848m1614F872a72762K5159B49849
$$ 100663 234121 -170802 -254992 -114364 205848 164234 6872 -172762 -147603 249849
12018a56875r2487b0195l64822A59799h9849c3733o7303j51845H7170a76443A52560
$$ -156875 -249362 -20195 -385017 159799 -89849 -33733 -101036 -252881 87170 -176443 152560
12006a37724K2016j4594E693a42639A01276J11103F721J33401J72401a80826I6883
$$ -137724 -115708 -130302 5693 -142639 101276 212379 6721 140122 312523 -180826 96883
11994B01608a16516j19800B35863b41992i7469I2324b48055N4995A51466K9i0917
$$ 201608 -116516 -236316 235863 -241992 -97469 92324 -248055 -193060 151466 151495 -90917
11982B15261G8026f8774m9321k16353b7385H4938H854K41677b15879R3737k1865
$$ 215261 78026 -68774 -118095 -334448 -27385 84938 8854 250531 -215879 -122142 -144007
11971a44007N3347k49612a06424k8961A88854b8365j20784o7886A65218b07844
$$ -144007 -90660 -340272 -106424 -135385 188854 -28365 -149149 -217035 165218 -207844
11960a15984N1074p4164a8101H7230f1707I1693h9031H3222a92664L1767A42093
$$ -115984 -64910 -139074 -18101 87230 -61707 91693 -89031 83222 -192664 -160897 142093
11948A67439Q9266a04890B32323O9979e5766a1145D45708b2903A24167N1407c48219
$$ 167439 256705 -104890 232323 302302 -55766 -11145 445708 -22903 124167 175574 -348219
11936e3315C34672c3109k11022D528L3047J41647j6180G3153K58458j05661b06211
$$ -53315 334672 -33109 -244131 4528 37575 179222 163042 73153 331611 225950 -206211
11924c47975A9178a84772E3731A473R4265i3592A044h4082G4166c2242J4522j61282
$$ -347975 19178 -184772 53731 1473 95738 -93592 1044 -84082 74166 -32242 -17720 -179002
11912a79002A94470j4813M4816K3031d0021B28009n9619e557k60381A18400l6151
$$ -179002 194470 179657 224473 247504 -40021 228009 168390 -5557 -265938 118400 82249
11901H2249d9625j76572a8678j49072d0951B75309g8464b3141E9661h377D8513
$$ 82249 -49625 -226197 -18678 -167750 -40951 275309 -78464 -23141 59661 -8377 48513
11889b77990J19687F0137b67288h2675K7793D3692a38800A8223a35049K4160L9727
$$ -277990 -158303 60137 -267288 -82675 -54882 43692 -138800 18223 -135049 -110889 -71162
11878g1162r1594j72425a39221A55111P487o454l9769A4372P217K1662a90052
$$ -71162 -162756 -335181 -139221 155111 162598 156144 116375 14372 21589 43251 -190052
11866a87814H1900b13299j85536J79586b3381j1961A7312a85039a7278B8079b50002
$$ -187814 81900 -213299 -398835 -219249 -23381 -35342 17312 -185039 -17278 28079 -250002
11854b18570B46569c5287A61852E270a34451D07315b24362B18713q298G9781L09992
$$ -218570 246569 -35287 161852 5270 -134451 407315 -224362 218713 210415 79781 389773
11843C89773b40759A11756f4771n1027F397a65785j45457a42508j82834D1220
$$ 389773 -240759 111756 -64771 -115798 6397 -165785 -311242 -142508 -325342 41220
11832e37236A61850p66a12200j39123B68132b0999l8114m57251b09072B82499
$$ -537236 161850 161084 -112200 -251323 268132 -20999 -59113 -516364 -209072 282499
11821A96613c16446Q0530a06814C6899b77076j150f6A34713n663A3723c31489
$$ 196613 -316446 -235916 -106814 36899 -277076 -278226 -66 134713 129050 13723 -331489
11809a77083E2237J66669c2126l4404C6614K67338b71563K1174B8219C355L8542
$$ -177083 52237 218906 -32126 -66530 36614 303952 -271563 -250389 28219 3355 41897
11798D1897b83037f1253k962l63636a28531N4362B32607b10507H5625N8622o4421
$$ 41897 -283037 -61253 -64215 -427851 -128531 -74169 232607 -210507 85625 144247 79826
11787G9826j5375K720j1028K6507a95975A55813E0722a79921A61296d0181k1891
$$ 79826 64451 67171 56143 82650 -195975 155813 50722 -179921 161296 -40181 -62072
11776f2072l4105G8712C209N890R2334H637K49069r0246j6457N8676p1736d1415
$$ -62072 -96177 78712 3209 9099 101433 8637 257706 167460 151003 209679 137943 -41415
11763a5642I167a18432J8517j24092B08889a32961j22208e3462j77596f3502j48831
$$ -15642 9167 -118432 -99915 -224007 208889 -132961 -255169 -53462 -231058 -63502 -212333
11752b12333A02506Q1575b24796A60657g0577r013j07913j2170f7702A86347k6845
$$ -212333 102506 184081 -224796 160657 -70577 -79590 -187503 -199673 -67702 186347 159502
11741A59502a40990f5287A03985b19201A6690L41121a49479l3122A98402a53541
$$ 159502 -140990 -65287 103985 -219201 16690 357811 -149479 -182601 198402 -153541
11730a45875A14210D4386J11438b05057C03809r8888n3536L8837b90579A8954
$$ -145875 114210 44386 155824 -205057 303809 204921 151385 190222 -290579 18954
11719a00949G2009b92062j64665a49695B9106K06050h4004C59152b31702A61156
$$ -100949 72009 -292062 -456727 -149695 29106 235156 -84004 359152 -231702 161156
11708b62585e9694A63795D8393K15526e50318A47686J14979f1591o4572B29466
$$ -262585 -59694 163795 48393 263919 -550318 147686 262665 -61591 -126163 229466
11697I1610K28353f7648I3087d1540k54162B44066a3616j5866B97239F6437c8726
$$ 91610 319963 -67648 93087 -41540 -295702 244066 -13616 -29482 297239 66437 -38726
11685a10319J3162D1318N9209a49174A32437h0301B5690Q8359a89888E3395J38394
$$ -110319 -97157 41318 100527 -149174 132437 -80301 25690 114049 -189888 53395 191789
11674A91789J76465a06019M1740k38065A22264M2211a36006D12085C4387a09409
$$ 191789 368254 -106019 -64279 -302344 122264 164475 -136006 412085 34387 -109409
11663F3514K1512Q8260L7364Q318n9247a12483I2090K84029G4940a85518i1721
$$ 63514 85026 173286 210650 218968 159721 -112483 92090 376119 74940 -185518 -91721
11651A17221m978a91929P0425l1106P5572C29571r9879L58591b9130E28c9926
$$ 117221 112243 -191929 -121504 -152610 -77038 329571 229692 588283 -29130 528 -39926
11639B63485a13068j34298e0398B33723f6520K4394j08951H5127A4197b05971
$$ 263485 -113068 -247366 -50398 233723 -66520 -42126 -151077 85127 14197 -205971
11628e0633j28160A28903b53035A00809p148a08955B20038c098A58897d7098n32033
$$ -50633 -178793 128903 -253035 100809 93661 -108955 220038 -3098 158897 -47098 -579131
11617e79131B98105a63969B90916D4765J88525E9692J62467f3088n9415J0593
$$ -579131 298105 -163969 290916 44765 233290 59692 222159 -63088 -122503 -111910
11607a11910N3264C66604i7628d5817B75222a69509b5299B87093m8314C4035J59973
$$ -111910 -58646 366604 -97628 -45817 275222 -169509 -25299 287093 238779 34035 194008
11596A94008H1713P5079d06344J57091D07637b1223o5720J7523K6236E4846R0178
$$ 194008 81713 156792 -406344 -249253 407637 -21223 -86943 -69420 -43184 54846 145024
11585A45024n6371e1890B40013b4422j50469O8914L4516B8357c11128h2594j82318
$$ 145024 88653 -51890 240013 -24422 -174891 -105977 -71461 28357 -311128 -82594 -264912
11574b64912A82441b6436A79516G6515e6711B20409m9540J40424k9977I0115O4303
$$ -264912 182441 -26436 179516 76515 -56711 220409 170869 311293 281316 90115 154418
11563A54418J03693a5945k73222d4331B5708e8994k18523A59739b43495K8282
$$ 154418 258111 -15945 -289167 -44331 25708 -58994 -277517 159739 -243495 -215213
11553b15213c0588q672k19056C28874F6274K38675P107G3532J5991f7485C10765
$$ -215213 -30588 -39260 -258316 328874 66274 304949 312056 73532 89523 -67485 310765
11541a15419d4871K450E5472i5909g967F4433J22751e6790B21001O4725I2890
$$ -115419 -44871 -42421 55472 -95909 -7967 64433 187184 -56790 221001 285726 92890
11529b5253B63210R458E4341a20698e2043B18696p6074J67347A141K99095j2867
$$ -25253 263210 272668 54341 -120698 -52043 218696 142622 309969 1141 300236 287369
11518B87369a72706q5009p5695D03584a82065C25097A01997L8490R1210m9039
$$ 287369 -172706 -257715 -333410 403584 -182065 325097 101997 140487 231697 182658
11508A82658H358M46276a1364j74371G3696L3188j5453j5211a50878c7883k09834
$$ 182658 8358 454634 -11364 -185735 73696 106884 91431 76220 -150878 -37883 -247717
11497b47717J9629C23793n1746B6597g4545A89432G6280c4340D48009G8167O4493
$$ -247717 -228088 323793 272047 26597 -74545 189432 76280 -34340 448009 78167 142660
11486A42660j7201i8633A20899a43810B60171a39486D01264r6139G0686N0712
$$ 142660 125459 -98633 120899 -143810 260171 -139486 401264 305125 70686 121398
11476A21398m6517J704J93063q5138n8362d0494Q471A23243P9399M2394K2118
$$ 121398 74881 76585 269648 184510 126148 -40494 -32023 123243 202642 245036 267154
11465B67154A26463Q3647j8501a36940C1548J40533C5734j6586J98531m0364k3013
$$ 267154 126463 210110 191609 -136940 31548 172081 35734 19148 217679 177315 154302
11454A54302O7092m0785A4681M10126D3310a61620A13334K19463e7490A00977
$$ 154302 221394 180609 14681 424807 43310 -161620 113334 332797 -57490 100977
11443B05891b18593b1712B89868B1263N6159b127j56318B9653K51479g1471G8174
$$ 205891 -218593 -21712 289868 21263 77422 -2127 -158445 29653 281132 -71471 78174
11431E2153c65342a43557f2888o294j78750C86715b7262B82927i3085B40092j17255
$$ 52153 -365342 -143557 -62888 -69182 -247932 386715 -27262 282927 -93085 240092 122837
11420A22837O7887k025q0110c77817A3563g0352A56732P1154a23914a7615A25986
$$ 122837 190724 188699 108589 -377817 13563 -70352 156732 227886 -123914 -17615 125986
11408a80911c9153k4174l1181A09988a92049i0374B75084g4435f235C444b39804
$$ -180911 -39153 -63327 -94508 109988 -192049 -90374 275084 -74435 -6235 3444 -239804
11396A9086N306b57172k1472a35923D6874b62039h2929d1348j04767B32775a60923
$$ 19086 24392 -257172 -278644 -135923 46874 -262039 -82929 -41348 -146115 232775 -160923
11384A18255C5384f0853j34090j08781P4441f2818p8887E4453h7202B02965O0939
$$ 118255 35384 -60853 -194943 -303724 -229283 -62818 -141705 54453 -87202 202965 263904
11373B63904q4769h1418E4b66595d4160o4697p6046f1927k36074c92E3915J10089
$$ 263904 179135 -81418 54 -266595 -44160 -108857 -184903 -61927 -298001 -392 53915 164004
11361A64004c01252a21053K6127A31869a70919f300j19076M4194m2399j95914
$$ 164004 -301252 -121053 -94926 131869 -170919 -6300 -125376 -81182 -123581 -319495
11351c19495A14920g2233k41673A323g0238q0132G5726a6410B08646l1360p122
$$ -319495 114920 -72233 -313906 1323 -70238 -150370 75726 -16410 208646 177286 170164
11340A70164K12252h3493k56158A03026A8847d17768b07761j5673A05852M3552
$$ 170164 382416 -83493 -339651 103026 18847 -417768 -207761 -223434 105852 149404
11330A49404h8089j65773A46485a86459a3554A86494e1043n22816A97762h7297
$$ 149404 -88089 -253862 146485 -186459 -13554 186494 -51043 -573859 197762 -87297
11319a70184A34527L24240f7613o5956e3284A79691p2514m5509K35758c0857j47160
$$ -170184 134527 458767 -67613 -133569 -53284 179691 107177 61668 297426 -30857 -178017
11308a78017C8952h4763j30683b656l6463r1696m6379b5411E7615N1058f9890
$$ -178017 38952 -84763 -215446 -2656 -39119 -130815 -177194 -25411 57615 108673 -69890
11296D8563g7383k9214j374G3808a40656n0425b8455a755k95393H1600a0723F9097
$$ 48563 -77383 -106597 -107971 73808 -140656 -191081 -28455 -1755 -297148 81600 -10723 69097
11283a86031H9006k1791C1368R1886k8175A0427a27507L6227F003e5859j46399
$$ -186031 89006 67215 31368 123254 95079 10427 -127507 -91280 6003 -55859 -202258
11272b02258g938E5258O7713H447h565C30732f7196r8863I8807e4994j89484B09291
$$ -202258 -7938 55258 122971 8447 -8565 330732 -67196 -166059 98807 -54994 -244478 209291
11259C36798I1047R9134E2210K8655g1073L5001B8754b04280A65896b66342q5475
$$ 336798 91047 190181 52210 80865 -71073 -36072 28754 -204280 165896 -266342 -351817
11248c51817C6289Q4703K67196a70350A46440c24895a53143D68358a15559E8663
$$ -351817 36289 120992 388188 -170350 146440 -324895 -153143 468358 -115559 58663
11237i2681C43872a89232C4058h04l98400i0967j99411A38622J58499g8872L5521
$$ -92681 343872 -189232 34058 -804 -399204 -90967 -290378 138622 297121 -78872 -43351
11226d3351E9789N0929a31711A43276b75051G6292N0957f6295j14038M6058d709
$$ -43351 59789 110718 -131711 143276 -275051 76292 127249 -66295 -180333 -134275 -4709
11214G3068B2901a66081l1049R0934j95477Q4097q4364P5301a2451l83975a68383
$$ 73068 22901 -166081 -197130 -106196 -301673 -217576 -301940 -226639 -12451 -396426 -168383
11202I6318P7026d7623k13565k1616d032m8464B90821K9251a92560c1076j53396
$$ 96318 173344 -47623 -261188 -282804 -4032 -52496 290821 320072 -192560 -31076 -184472
11191a84472l3733c3956j57470F0030C442i2105O404n6411K4236M3185o4768A04916
$$ -184472 -218205 -33956 -191426 60030 3442 -92105 -85701 -142112 -117876 -74691 -139459 104916
11178A18759J10782b21917Q2402I4487p215n387a13381j86367O2710j23338C3331
$$ 118759 229541 -221917 -139515 94487 87272 81885 -113381 -299748 -237038 -360376 33331
11166A16779c2948E3141N3370b6110j79445A76678K98466B32604a81982k73702
$$ 116779 -32948 53141 106511 -26110 -205555 176678 475144 232604 -181982 -455684
11156d55684c9183o3449B39297c72805B8381A3704J73759c58107R6649i7712M2861
$$ -455684 -39183 -102632 239297 -372805 28381 13704 187463 -358107 -261458 -97712 -54851
11145e4851C13835b0841H9877j5393b45569B16978c80616B36298F0187h158j39785
$$ -54851 313835 -20841 89877 74484 -245569 216978 -380616 236298 60187 -8158 -147943
11134a47943A37618c2898A74786c10511c7319B524i9014r9373C02213f9241B39944
$$ -147943 137618 -32898 174786 -310511 -37319 2524 -99014 -198387 302213 -69241 239944
11122a35261H0897a11551B58567A26598R5671r6393h294A53802F5790K1009g0229
$$ -135261 80897 -111551 258567 126598 222269 125876 -8294 153802 65790 86799 -70229
11110A53857P6575a0638E518O4114b13749E2019J52212a3018C72130A75696o3615
$$ 153857 230432 -10638 5518 69632 -213749 52019 204231 -13018 372130 175696 112081
11099A12081K26677p3308A00187K06753A00028K623N4924J15201n0545J09881
$$ 112081 338758 265450 100187 306940 100028 102651 157575 272776 222231 332112
11089C32112p6521j03576E4413O5679J70437B7644K58432a47246H5226J19518
$$ 332112 255591 152015 54413 120092 290529 27644 286076 -147246 85226 204744
11079B04744L04540B2456M6865M3453J50907j8429G6876J24562J74506A67663
$$ 204744 509284 22456 69321 112774 263681 245252 76876 201438 375944 167663
11068C25036K3256J7588A02846Q2802O33349B36066O2108L91083k32962A30795
$$ 325036 348292 365880 102846 185648 818997 236066 298174 689257 456295 130795
11057F46932k84557K16071j61285R4182l4857j90613N57813K23067k50688l53431
$$ 646932 362375 578446 417161 511343 476486 285873 843686 1066753 816065 462634
11047D62634J75071k33112K68509J11798P2796o3466L5675l98195L1656K42137
$$ 462634 637705 404593 673102 784900 857696 794230 829905 431710 463366 705503
11037G05503m8214J78874j29533r0872K25808A72152N30664J92920D24366K04002
$$ 705503 657289 836163 706630 615758 841566 172152 702816 895736 424366 628368
11027F28368l49j11390J065M10604k83526P1413p6653r6280O2512J91655j47475
$$ 628368 628019 516629 517694 928298 644772 716185 639532 543252 605764 797419 649944
11016F49944k30525J63548A24057O88943l00365J4426j67772L03919j74381K84087
$$ 649944 419419 582967 124057 813000 512635 527061 359289 663208 488827 772914
11006G72914B64046M75156j06377p6393j53539n2550J51015K06841n3846J7042
$$ 772914 264046 739202 632825 556432 402893 350343 501358 708199 654353 671395
10996F71395j15084o4846P1504K9649p8595o3254J61672J1378k97593L15217L68391
$$ 671395 556311 491465 562969 592618 514023 450769 612441 623819 326226 641443 1009834
10985A009834M0877k29401r481j00503L42691J93965K47506J74857l03936M01078
$$ 1009834 1050711 821310 811829 711326 1054017 1247982 1495488 1670345 1366409 1767487
10975A767487o6416L45827J65212K83192k2720K35132j85797j51447l59117k45014
$$ 1767487 1701071 2046898 2212110 2495302 2472582 2707714 2521917 2370470 2011353 1766339
10965A766339n9426m26374M47346r2035j13949l56240J35569L02658k02489K87932
$$ 1766339 1706913 1280539 1727885 1635850 1521901 1165661 1301230 1603888 1401399 1689331
10955A689331K593l4106n57786J06375l67319q4667B68490q7368J99596p7237
$$ 1689331 1691924 1657818 1100032 1206407 839088 754421 268490 181122 380718 303481
10945C03481L46063k63070M0029q1015J42648B19777k5852H5940J6878J76024
$$ 303481 649544 386474 426503 345488 488136 219777 193925 85940 102818 278842
10935B78842J3717g8434A06165N56610B2506J48987g9816j80060B48739a43654
$$ 278842 292559 -78434 106165 662775 22506 171493 -79816 -259876 248739 -143654
10924c21023l4027B07513J91756a63999b7247m5167D71583A11829K21680B0708
$$ -321023 -355050 207513 399269 -163999 -27247 -72414 471583 111829 333509 20708
10913A85930C6469a60632b9302r2736p993A07257p463c8331j58902M4016k3704
$$ 185930 36469 -160632 -29302 -122038 -130031 107257 99794 -38331 -197233 -153217 -176921
10902a76921B33357I2728e6870j15653B8570g5095K8531I5393f2380j12225d0407
$$ -176921 233357 92728 -56870 -172523 28570 -75095 -46564 95393 -62380 -174605 -40407
10890B6451a28510p671b2383q8379A5840O8222b4649k720B04050b61454K1144
$$ 26451 -128510 -136181 -22383 -110762 15840 84062 -24649 -27369 204050 -261454 -240310
10879b40310e294k7076A12859a03448A42591a45307D4237L1913K34728c2975q4119
$$ -240310 -5294 -32370 112859 -103448 142591 -145307 44237 76150 310878 -32975 -117094
10868a17094j61125C90740i8683A07761E2354B2378c2146B28423c00429H5535
$$ -117094 -278219 390740 -98683 107761 52354 22378 -32146 228423 -300429 85535
10857a31282A86989D6818a85543A47100b25576J3896j00108B07848j7107E1549
$$ -131282 186989 46818 -185543 147100 -225576 -211680 -311788 207848 190741 51549
10846D9873a54517J5943q2954e3379k17087F9280a08716n1447j16661a6770E5353
$$ 49873 -154517 -138574 -221528 -53379 -270466 69280 -108716 -160163 -276824 -16770 55353
10834B45358i3201H7432A0521L2729b2219C93078b72687P5685C55210A00704J35719
$$ 245358 -93201 87432 10521 43250 -22219 393078 -272687 -197002 355210 100704 236423
10823B36423a546H5603J13482B3516M6794c91983j86746J47900J60946b8149j23606
$$ 236423 -1546 85603 199085 23516 70310 -391983 -578729 -430829 -269883 -28149 -151755
10812a51755A07237a8571k17657d3415r4193G6967b88010J04232G3093a26282
$$ -151755 107237 -18571 -236228 -43415 -137608 76967 -288010 -183778 73093 -126282
10801e0370A73546F17e4066n1755m1118l6435N0933I5559Q4290L3261i8289H0606
$$ -50370 173546 617 -54066 -105821 -146939 -183374 -132441 95559 179849 213110 -98289 80606
10788B42350G5994g3284A48734d526A11651P3923b00956A83207h1988a9919j94025
$$ 242350 75994 -73284 148734 -4526 111651 185574 -200956 183207 -81988 -19919 -213944
10777b13944m4457R2542C12114b21161P6759A53058l7793A279K4909i9720B48557
$$ -213944 -258401 -165859 312114 -221161 -144402 153058 115265 1279 26188 -99720 248557
10765a46309B05450a25185A59926c01490d9206B17224A8587b64634a12627A10020
$$ -146309 205450 -125185 159926 -301490 -49206 217224 18587 -264634 -112627 110020
10754b16615k04595e4622C1885b53987D6970K28172i850n71742a21683A12412
$$ -216615 -421210 -54622 31885 -253987 46970 275142 -9850 -581592 -121683 112412
10743B86652C104K37384G5141a49761D293h5706c952B50882c97433a52347k14477
$$ 286652 3104 240488 75141 -149761 4293 -85706 -3952 250882 -397433 -152347 -366824
10732c66824a23033B63957C0636O5660a03079k06371A37149d41790a47630c7313
$$ -366824 -123033 263957 30636 96296 -103079 -309450 137149 -441790 -147630 -37313
10721d9525A54335c38931d4879k7111J8776A30753b0432k11160k6775M2150B9371
$$ -49525 154335 -338931 -44879 -71990 -53214 130753 -20432 -231592 -258367 -216217 29371
10709b41596I9411a90734q4039B12666a04361d1608k13518I5397c35264f1171
$$ -241596 99411 -190734 -274773 212666 -104361 -41608 -255126 95397 -335264 -61171
10698a58385B81531A19114B5039b50151A10706i8423j4276j67963J20338l2491
$$ -158385 281531 119114 25039 -250151 110706 -98423 -112699 -280662 -160324 -192815
10688a92815A1509b56656E3M0644A696a2616j40703D3410f4426E7352J2647b20790
$$ -192815 11509 -256656 53 40697 1696 -12616 -153319 43410 -64426 57352 69999 -220790
10675B0331c43366O51a17872A29051J28141a19864j37971d532n2646p6079d5861
$$ 20331 -343366 -342715 -117872 129051 257192 -119864 -257835 -4532 -57178 -133257 -45861
10663a24970d1418l1395j68402R5272A1740d5164A07358b13524j34830C68490
$$ -124970 -41418 -72813 -241215 -145943 11740 -45164 107358 -213524 -348354 368490
10652a5353r0298A55913a52344J0788H7652J70122a57258m1093N1127o57j98639
$$ -15353 -105651 155913 -152344 -141556 87652 257774 -157258 -198351 -147224 -147881 -346520
10641c46520d5685D4928f8013A80838b40513i6389B5898a17161d5124k32375B71359
$$ -346520 -45685 44928 -68013 180838 -240513 -96389 25898 -117161 -45124 -277499 271359
10629a07594A43188E5277Q9611a75686r2659O826R1107q5368J13423o7895B0910
$$ -107594 143188 55277 144888 -175686 -268345 -261519 -170412 -255780 -142357 -210252 20910
10617a66872A55021c94926J50437A42524e420m1866A33418b42485e0195o3181
$$ -166872 155021 -394926 -244489 142524 -5420 -47286 133418 -242485 -50195 -113376
10607a13376A58479g9067A00734c72767C1649A0751b37598A45533c7100B03891
$$ -113376 158479 -79067 100734 -372767 31649 10751 -237598 145533 -37100 203891
10596b86296K856I6547B3230a90440Q8452B60615B2300b08105A93642K3213c12396
$$ -286296 -283440 96547 23230 -190440 -101988 260615 22300 -208105 193642 216855 -312396
10584B01743k4815G5022C2898e1441j56945P6891C7069a07536a2207n5406a7561
$$ 201743 176928 75022 32898 -51441 -208386 -131495 37069 -107536 -12207 -67613 -17561
10572B63357a17203k09446C5902a77827f9502B08169N897G7273e1478k09087B05490
$$ 263357 -117203 -326649 35902 -177827 -69502 208169 214066 77273 -51478 -260565 205490
10560c04704E1630J57673h8758B55015b39260C6443J06256e4783B21657I6512
$$ -304704 51630 209303 -88758 255015 -239260 36443 142699 -54783 221657 96512
10549a25396H523K82892j15611D3728h762a000j15706j14763A79809a76367n9344
$$ -125396 8523 291415 175804 43728 -8762 -1000 -116706 -231469 179809 -176367 -235711
10538b35711I2997a01370M3272j2295A9988j897b6961k4240A31206o2516c00523
$$ -235711 92997 -101370 -58098 -70393 19988 18091 -26961 -51201 131206 68690 -300523
10526a28160p7798f1202k50493E2459J46354a74301C7872D318a15498K9266m6105
$$ -128160 -205958 -61202 -311695 52459 198813 -174301 37872 4318 -115498 -86232 -132337
10515a32337M5952A94662G8960L58533a78760B74876g5355B26210G8996a62214
$$ -132337 -86385 194662 78960 437493 -178760 274876 -75355 226210 78996 -162214
10504c8855j84939G7279b3064j23698M6809A34938f1879A21467f3636J7561l38958
$$ -38855 -223794 77279 -23064 -146762 -99953 134938 -61879 121467 -63636 -46075 -385033
10493c85033A24033e2443j48087e7409H1930l0043L59263A1986g5879m8084F0689
$$ -385033 124033 -52443 -200530 -57409 81930 51887 411150 11986 -75879 -123963 60689
10481A97576L58683m6346A94524b36620A23666l5346a40921F15774E5481L5504
$$ 197576 556259 509913 194524 -236620 123666 88320 -140921 615774 55481 90985
10471I0985c4096k21538g2045j2613b9531A26252e40819b242H2305a81408J5763
$$ 90985 -34096 -255634 -72045 -84658 -29531 126252 -540819 -2242 82305 -181408 -165645
10460a65645A40502J14684e8336A09273e8522q309B25900c03388J15641D56206
$$ -165645 140502 255186 -58336 109273 -58522 -66831 225900 -303388 -187747 456206
10449B10905a56391q5077c8623r9011N2752B52489a75667r320B27648I4786b7757
$$ 210905 -156391 -241468 -38623 -137634 -84882 252489 -175667 -184987 227648 94786 -27757
10437I0970L0108d5628a4076B51118L7254c82331D0224a92069C4139g7245o778
$$ 90970 121078 -45628 -14076 251118 288372 -382331 40224 -192069 34139 -77245 -84023
10426h4023F2681d8324j13292b1137l7860r0329A34763a18637c9924E5361J96121
$$ -84023 62681 -48324 -161616 -21137 -58997 -149326 134763 -118637 -39924 55361 251482
10415B51482a8260C53624c4622j86210a6897D3963j1065K680c52417a09783i95
$$ 251482 -18260 353624 -34622 -220832 -16897 43963 32898 35578 -352417 -109783 -995
10403a772m3926k07609a18666p1621A33214P4386a96115g3438D7422f8253C86389
$$ -1772 -45698 -253307 -118666 -190287 133214 207600 -196115 -73438 47422 -68253 386389
10391C27363m6271A07592b1889A85983l6561c19677a36922B6349J25947i9257
$$ 327363 281092 107592 -21889 185983 149422 -319677 -136922 26349 152296 -99257
10380B55995p766p2133c3209p4519C17380b43790g8333D8729L06566j05579J16034
$$ 255995 248229 176096 -33209 -107728 317380 -243790 -78333 48729 355295 249716 365750
10369C65750j03403A09971L94516J2794B55566J12246A07500J25292o4955N3607
$$ 365750 262347 109971 504487 517281 255566 367812 107500 232792 167837 221444
10359B21444L87083k56100G4472a16975B33724o5996g574B79824J66809B19668
$$ 221444 608527 352427 74472 -116975 233724 167728 -7574 279824 446633 219668
10348F76792j40941j08546j95821K48036j64487J92639j06587P2557D5908K14240
$$ 676792 535851 427305 231484 479520 315033 507672 401085 473642 45908 260148
10338B60148n6061H9718L40616A43158h8793B91744J24354J1442B07567a4880
$$ 260148 204087 89718 430334 143158 -88793 291744 416098 427540 207567 -14880
10327F3152h7706p9254C45171d3260G4681K78192a4840D27769D4700b10636A11587
$$ 63152 -87706 -166960 345171 -43260 74681 352873 -14840 427769 44700 -210636 111587
10315I4791a6574F5685J2858k5070K7487b67911C09154c8408B5881J76751A1001
$$ 94791 -16574 65685 78543 53473 80960 -267911 309154 -38408 25881 202632 11001
10303a96683h6630b8760d123A31464B2297J66234d2365C19199a58908B71853D0819
$$ -196683 -86630 -28760 -4123 131464 22297 188531 -42365 319199 -158908 271853 40819
10291b84672N039K8655B20367e1922l7525k85196f5764j08817c1210j89945A13098
$$ -284672 -279633 -250978 220367 -51922 -89447 -374643 -65764 -174581 -31210 -221155 113098
10279H5073H192a69554g5423B11340d03600J17919A11688J00681P1820f5885A32267
$$ 85073 8192 -169554 -75423 211340 -403600 -285681 111688 212369 284189 -65885 132267
10267B76544q0690d5390I4294K3271a6212E2446K08755J04532A65752L79903B1383
$$ 276544 195854 -45390 94294 117565 -16212 52446 261201 365733 165752 545655 21383
10255A50249d4180H5842b43333B24263J3226D2461b51664J20004d8817G9896O3898
$$ 150249 -44180 85842 -243333 224263 237489 42461 -251664 -131660 -48817 79896 143794
10244A43794a34164L4122C7244a141A36709D8569d18633A342L29533b34888a01734
$$ 143794 -134164 -100042 37244 -1141 136709 48569 -418633 1342 330875 -234888 -101734
10232a45631K2181A60076G2413K68325A5347d4815A22588d6319b1722A10262d8858
$$ -145631 -123450 160076 72413 340738 15347 -44815 122588 -46319 -21722 110262 -48858
10220A85970C0716c04335e1874A24043a16884k62917O3794g3620k33885B54935
$$ 185970 30716 -304335 -51874 124043 -116884 -379801 -316007 -73620 -307505 254935
10209b80269J11508j85944J65280B01814b8528k17497H4332a96008d1459j12184
$$ -280269 -168761 -354705 -189425 201814 -28528 -246025 84332 -196008 -41459 -153643
10199a53643j42373c3334B12740a40479p4403O0207k67194B8817F67a5229j29325
$$ -153643 -296016 -33334 212740 -140479 -214882 -154675 -421869 28817 667 -15229 -144554
10188a44554q9818e9256J460b4697A5088J82701g8714j27509B74372j08440R5199
$$ -144554 -234372 -59256 -57796 -24697 15088 197789 -78714 -206223 274372 165932 261131
10177B61131f6648k6367C88399a02637l03471B1601R8053b85031b2986k41794
$$ 261131 -66648 -93015 388399 -102637 -406108 21601 119654 -285031 -22986 -264780
10167b64780a4631A14472a93222D3995K56356j25141g9824o5547k28196J10891
$$ -264780 -14631 114472 -193222 43995 300351 175210 -79824 -145371 -373567 -262676
10157b62676G6320J74362a49306A65769d13890a5792j43836c8469B33342b9008
$$ -262676 76320 250682 -149306 165769 -413890 -15792 -159628 -38469 233342 -29008
10146A87291J36533d1704j25708A16972a78338k72313J98449A75364a23823A62573
$$ 187291 323824 -41704 -167412 116972 -178338 -450651 -252202 175364 -123823 162573
10135a96261n060A58463b65168A92162b75568r9562J53659j35622a51686O8828
$$ -196261 -201321 158463 -265168 192162 -275568 -375130 -221471 -357093 -151686 -82858
10125h2858k53786J22361j4311K3819J7616f3209C126c02062d0511k02025E4120
$$ -82858 -336644 -214283 -228594 -204775 -187159 -63209 3126 -302062 -40511 -242536 54120
10113h1083b9846F4867d87482D31266a44312B45290a80946e2141B28098K8320
$$ -81083 -29846 64867 -487482 431266 -144312 245290 -180946 -52141 228098 256418
10103B56418c34487b0933n326a2999l36241Q6520c5832j4237j64042A49171a00085
$$ 256418 -334487 -20933 -26259 -12999 -349240 -262720 -35832 -50069 -214111 149171 -100085
10091a06464g860A4461M0689b09511A64172c2256j09390a8178j90931L1729I5209
$$ -106464 -7860 14461 55150 -209511 164172 -32256 -141646 -18178 -209109 -177380 95209
10079A54370m4689f4262C9286c12602H2085a92935R0046j28507a2703C7610f6106
$$ 154370 109681 -64262 39286 -312602 82085 -192935 -102889 -231396 -12703 37610 -66106
10067A10806B2411c38637J39800B11785n027a68959a571j46459B67928A29825
$$ 110806 22411 -338637 -198837 211785 206758 -168959 -1571 -148030 267928 129825
10056a28587k95355A36563g8481n076c0226a4775j57262D3539a16792c010j6468
$$ -128587 -423942 136563 -78481 -83557 -30226 -14775 -172037 43539 -116792 -3010 -19478
10045a9478k96936B33472c06827f9802p9333N6499C69074i1626A623d00205e5802
$$ -19478 -316414 233472 -306827 -69802 -149135 -92636 369074 -91626 1623 -400205 -55802
10033b97835L0664k2868a32733e9065O530B31529I2913f4582j22773c7879F5107
$$ -297835 -267171 -290039 -132733 -59065 -52535 231529 92913 -64582 -187355 -37879 65107
10021a71029k4136J4588A24784h586F7411A2598a43428k2507j01429a10670A01281
$$ -171029 -195165 -180577 124784 -8586 67411 12598 -143428 -165935 -267364 -110670 101281
10009A3341O3164a61175P8906j43173D5192b39833B22583c57594J74538k2311
$$ 13341 76505 -161175 -82269 -225442 45192 -239833 222583 -357594 -183056 -205367
9999b05367B49609k5443C2120J0651c42283E826M4306a82717B93130a60814o200
$$ -205367 249609 224166 32120 42771 -342283 5826 50132 -182717 293130 -160814 -167014
9988a67014A71295a09388I8157a63374n3465A52963P6106A14284d5035l8471j92452
$$ -167014 171295 -109388 98157 -163374 -216839 152963 229069 114284 -45035 -83506 -275958
9977b75958a13386k28287a18780j16998j25138e4886q8257c9516k0516j12202
$$ -275958 -113386 -341673 -118780 -235778 -360916 -54886 -143143 -39516 -60032 -172234
9967a72234d1847E8577e60013b69659C78770A01442J8568m8732b76813l05320
$$ -172234 -41847 58577 -560013 -269659 378770 101442 120010 71278 -276813 -582133
9957e82133c7264j03602e6253a7516I0754a45074A35300o1109b59333N3296E3380
$$ -582133 -37264 -140866 -56253 -17516 90754 -145074 135300 74191 -259333 -206037 53380
9945C24924a74493P0371A0240c9627j04665H6206h2072j17113c0028j28888P2992
$$ 324924 -174493 -104122 10240 -39627 -144292 86206 -82072 -199185 -30028 -158916 -85924
9934h5924o0742O8146j90317O9690G7109M8554a75588D4230h0796q8560E8077
$$ -85924 -146666 -78520 -268837 -199147 77109 125663 -175588 44230 -80796 -169356 58077
9922A45143b3721C2495c00288F6371a24653j71001j91155D29217k02599a22409
$$ 145143 -23721 32495 -300288 66371 -124653 -295654 -486809 429217 226618 -122409
9911a00143A13678P1774p7816K11494A56151e02389B05080C4203d02957A1732
$$ -100143 113678 185452 107636 319130 156151 -502389 205080 34203 -402957 11732
9900b24985e9444A45900K39913a8603l85608a15191B0632a93535D7658L9422g6089
$$ -224985 -59444 145900 385813 -18603 -404211 -115191 20632 -193535 47658 87080 -76089
9888e4158D17051A6278K68013a08082o6442K7249H7889a57651C28257b3394k15180
$$ -54158 417051 16278 284291 -108082 -174524 -147275 87889 -157651 328257 -23394 -238574
9877b38574h9276j50059C0459P9652R8350a82379A70340H3639e36020b36788A71215
$$ -238574 -89276 -239335 30459 110111 208461 -182379 170340 83639 -536020 -236788 171215
9865b81203h7495c5004k15014P0812e5959B01357d9046k52123B6924d1715j93148
$$ -281203 -87495 -35004 -250018 -179206 -55959 201357 -49046 -301169 26924 -41715 -234863
9854b34863k4931B02414a42852P0185A06887i9102D2351f5154j35063A92347b1008
$$ -234863 -259794 202414 -142852 -72667 106887 -99102 42351 -65154 -200217 192347 -21008
9842a53144f7590j17144A66536J1966b56097I2956h8612M3565P484A39641f4421
$$ -153144 -67590 -184734 166536 178502 -256097 92956 -88612 -45047 -37563 139641 -64421
9830c6056A99123p8974J8443c708B5620c16468C23059B4906a18394j38405M8673
$$ -36056 199123 120149 138592 -3708 25620 -316468 323059 24906 -118394 -256799 -208126
9819b08126J1407R5777l5701j1008f6680l7576F8879C2481N1150l3153g6961k61355
$$ -208126 -196719 -100942 -136643 -147651 -66680 -104256 68879 32481 83631 50478 -76961 -338316
9807c38316h4139B92412A9083b08751o1310G8914b14080i7211A17599g9498n9789
$$ -338316 -84139 292412 19083 -208751 -270061 78914 -214080 -97211 117599 -79498 -139287
9796a39287A48759a43690a1233B5759C258R8080b26878k928M982M1388A44259
$$ -139287 148759 -143690 -11233 25759 3258 101338 -226878 -229806 -224824 -183436 144259
9784c75116a22406k20565b9880k19811h9697L4829j71274M8686j90619e8282m7117
$$ -375116 -122406 -342971 -29880 -249691 -89697 -54868 -226142 -177456 -368075 -58282 -105399
9773a05399A20730g6655b0797j63816M6995q1406a2701o7531C4662E929M0172
$$ -105399 120730 -76655 -20797 -184613 -137618 -219024 -12701 -80232 34662 5929 46101
9762D6101A3128J60515d8473A50289A6050a57836j34324a0442A29567d7076m07914
$$ 46101 13128 173643 -48473 150289 16050 -157836 -292160 -10442 129567 -47076 -454990
9751d54990c8675A06992J48053h6042j15583A49643J9542B9106b73441a0434B12506
$$ -454990 -38675 106992 255045 -86042 -201625 149643 169185 29106 -273441 -10434 212506
9739D6392b49271J24177j35266a24994l6535G4327a80234j7385n3020H7544h4615
$$ 46392 -249271 -125094 -260360 -124994 -161529 74327 -180234 -197619 -250639 87544 -84615
9727b61360A75215a02347j37544O452j63089G1795P1957O8492A624c09722A45973
$$ -261360 175215 -102347 -239891 -233439 -396528 71795 143752 212244 1624 -309722 145973
9715b17029a01410p1455A57659K64923b76509R6810e3207C4048a68784O9402c9782
$$ -217029 -101410 -172865 157659 422582 -276509 -179699 -53207 34048 -168784 -99382 -39782
9703b99224A02459C7739b93717G8264e5740B2618a77458L7364K3435A93809m0044
$$ -299224 102459 37739 -293717 78264 -55740 22618 -177458 -140094 -116659 193809 153765
9692A53765b24551l1527J05508A98374b57097J04354H8518J53120o5910c05476
$$ 153765 -224551 -256078 -150570 198374 -257097 -152743 88518 241638 175728 -305476
9681a91388O7973o9831A42966b82448i9501M0158q6170A59257a98567g4165B8129
$$ -191388 -123415 -193246 142966 -282448 -99501 -59343 -145513 159257 -198567 -74165 28129
9669a04211D818a4178A76278a44986j30579F0044a75131A90628n2207l5321b8023
$$ -104211 4818 -14178 176278 -144986 -275565 60044 -175131 190628 138421 103100 -28023
9657A42412M5559d6861Q218C21c817B64824b63022D6674b70899k4396C9110b09659
$$ 142412 187971 -46861 -38643 321 -3817 264824 -263022 46674 -270899 -295295 39110 -209659
9644a10088j05840B10465g8734j77127h828p8830A79235f5410j08672B59366h6083
$$ -110088 -215928 210465 -78734 -255861 -8828 -87658 179235 -65410 -174082 259366 -86083
9632a54834A38293b26253d9447A66958a01830C57294e4659n1584B22246b12595
$$ -154834 138293 -226253 -49447 166958 -101830 357294 -54659 -106243 222246 -212595
9621A27062b93373E6344a50091k13503J66303i7277G5686a42261K8548G8925a0275
$$ 127062 -293373 56344 -150091 -363594 -197291 -97277 75686 -142261 -113713 78925 -10275
9609f5005k29421i6911m9427m5981h7802j41757B6017L60081d0294k03698m8837
$$ -65005 -294426 -96911 -146338 -192319 -87802 -229559 26017 386098 -40294 -243992 -292829
9598b92829A06113O0749d97663K22358A96630J8200f1529m28865A00730m7012
$$ -292829 106113 166862 -497663 -275305 196630 214830 -61529 -490394 100730 53718
9588E3718a52886B5080a44909j5345G425K7713L0486J03088r71J8478K2683F8757
$$ 53718 -152886 25080 -144909 -160254 7425 35138 65624 168712 167741 186219 208902 68757
9575a28942F8428f0436q22m33372A38415D1561a25927J7077B84767d4011m2184
$$ -128942 68428 -60436 -61258 -494630 138415 41561 -125927 -108850 284767 -44011 -86195
9564h6195K665j04577A71566C0058c22611b101p181k40814a5844A90873k075b17911
$$ -86195 -83530 -188107 171566 30058 -322611 -2101 -9282 -250096 -15844 190873 188798 -217911
9551b9078C3624g0190l5405C9438j7096J227M25667A35057b10038P4045A2154
$$ -29078 33624 -70190 -105595 39438 22342 23569 449236 135057 -210038 -135993 12154
9539B97809c7835I4621f9125n879C6138J56704C1115L51936c7671j11943A63604
$$ 297809 -37835 94621 -69125 -75004 36138 192842 31115 383051 -37671 -149614 163604
9527a43127A71995b17092f8204C3675P3526N000a07427A53493K9207D3958L8124
$$ -143127 171995 -217092 -68204 33675 107201 112201 -107427 153493 182700 43958 82082
9516H2082b54130c6164A36613J39875F4318a23200K2152C6786a79394b9405c209
$$ 82082 -254130 -36164 136613 276488 64318 -123200 -101048 36786 -179394 -29405 -3209
9504a67384G9381d6182m6909k07983b0469A66681l6414e5220H5249a50143k3954
$$ -167384 79381 -46182 -93091 -301074 -20469 166681 130267 -55220 85249 -150143 -174097
9493a74097j05422A52379b35301H050a58357n869M7891K3271F1288c82564a2079
$$ -174097 -279519 152379 -235301 8050 -158357 -164226 -116335 -93064 61288 -382564 -12079
9481A9528a50340A31977c4262G1280c45612A78173f8275l69576O8700D9237a11495
$$ 19528 -150340 131977 -34262 71280 -345612 178173 -68275 -437851 -369151 49237 -111495
9469B6139i7542B37443a09255k53256O3575B0698N6884d06705I1250A2493J1340
$$ 26139 -97542 237443 -109255 -362511 -298936 20698 77582 -406705 91250 12493 23833
9458B3833B051a60452B99c03226A290L3450g0095k55817R9201C5010d9743C0179
$$ 23833 2051 -160452 299 -303226 1290 34740 -70095 -325912 -226711 35010 -49743 30179
9445A94518c36097a29785d8307l1495k33923i5453C5571K85023h8860D7813b06701
$$ 194518 -336097 -129785 -48307 -79802 -313725 -95453 35571 320594 -88860 47813 -206701
9433b73343D7265J51994c34390A23833d5867q8234k62238a44011e2877k40110
$$ -273343 47265 199259 -334390 123833 -45867 -134101 -396339 -144011 -52877 -292987
9423b92987j0781J47639H117a14885A21923f6999L2523m51194C3221a02988k53339
$$ -292987 -303768 -156129 8117 -114885 121923 -66999 -34476 -485670 33221 -102988 -356327
9412c56327a15694k6609l2857b3116k87387J06944M4613A41967C5712a58940f9272
$$ -356327 -115694 -142303 -175160 -23116 -310503 -203559 -158946 141967 35712 -158940 -69272
9400h2998e694A70777K0720a08394j55964g6011C1068d04413J87400b3815j0430
$$ -82998 -5694 170777 191497 -108394 -264358 -76011 31068 -404413 -217013 -23815 -34245
9389c4245q0722h478c222j29547C211J22168c80467J5801R7767O8760B14567M0571
$$ -34245 -114967 -8478 -3222 -132769 3211 125379 -380467 -364666 -266899 -198139 214567 255138
9377B55138c6789D2850c3333A3665J8825J06871h5852n227l106A83111b84406
$$ 255138 -36789 42850 -33333 13665 32490 139361 -85852 -91079 -94185 183111 -284406
9365b28874c6840l14074I7074j1043c88012f8636j04744l07271d097k3758B25376
$$ -228874 -36840 -350914 97074 86031 -388012 -68636 -173380 -480651 -4097 -27855 225376
9353g4757b219j71768A34426g7718F8390J07539H3918O9241i5416C370f6533l0850
$$ -74757 -2219 -173987 134426 -77718 68390 175929 83918 153159 -95416 3370 -66533 -97383
9341i7383B0326a10659a9345l01342d235k02147Q271j20661i6721C22747b59145
$$ -97383 20326 -110659 -19345 -320687 -4235 -206382 -198111 -318772 -96721 322747 -259145
9329H7831c7978l57898a74042m2768l8859M7886j69462C5987c02680i5446A60735
$$ 87831 -37978 -395876 -174042 -216810 -255669 -207783 -377245 35987 -302680 -95446 160735
9317A91576f2300q6920c1234A92285c2957D53343c817l71703A95821M36c14571
$$ 191576 -62300 -149220 -31234 192285 -32957 453343 -3817 -375520 195821 196257 -314571
9305A05938D6786a68972J6785j9654h438j99088j36574B8023b14843B22938j08439
$$ 105938 46786 -168972 -152187 -171841 -8438 -207526 -344100 28023 -214843 222938 114499
9294A14499C8693M36706a67425B22381F9006a08476K3204c8602H8439a40889j0462
$$ 114499 38693 475399 -167425 222381 69006 -108476 -85272 -38602 88439 -140889 -151351
9283a51351g144k5390A17496a20913J3477A78759M3011Q1041M5904A37648P102
$$ -151351 -7144 -32534 117496 -120913 -107436 178759 221770 302811 348715 137648 144750
9272A44750b91539h4336K7045J3909A84196a86109A07738b58207B1066g8065k85813
$$ 144750 -291539 -84336 -57291 -43382 184196 -186109 107738 -258207 21066 -78065 -363878
9261c63878D0743M0490J38423a66193G180g3029A15671a88874g226A82208A7781
$$ -363878 40743 81233 219656 -166193 7180 -73029 115671 -188874 -7226 182208 17781
9249d5515k01269O1835A26219C0024c30740C49891D9666a00705b2794l03358A1292
$$ -45515 -246784 -184949 126219 30024 -330740 349891 49666 -100705 -22794 -326152 11292
9237i17j97038p0837A48488b08012C0270a14221p31B46769B2596Q8501f5225h173
$$ -917 -197955 -268792 148488 -208012 30270 -114221 -114952 246769 22596 111097 -65225 -8173
9224a66043A41754b81115D5091o435F511a62319B34466h3387C58381A78321g9409
$$ -166043 141754 -281115 45091 38656 6511 -162319 234466 -83387 358381 178321 -79409
9212C29025a84935j50343A29234c00085C8933a03058D9722a72310A77588B1960
$$ 329025 -184935 -335278 129234 -300085 38933 -103058 49722 -172310 177588 21960
9201d4286k36869a07531o3111A98099F6798K3139J49811A13018c9954O246A79877
$$ -44286 -281155 -107531 -170642 198099 66798 89937 239748 113018 -39954 -33708 179877
9189f2984A90152a38187n0031N2163b1769D92731b30835O8307j8690M8404l39798
$$ -62984 190152 -138187 -188218 -136055 -21769 492731 -230835 -162528 -181218 -132814 -472612
9178d72612a90022e896B12562k0005j6976b18396F7519O1853b12653r1194R3588
$$ -472612 -190022 -5896 212562 192557 175581 -218396 67519 129372 -212653 -303847 -210259
9167b10259L6954B45226c84018a0900p103n4837j24641B44053I9749d5451F324
$$ -210259 -173305 245226 -384018 -10900 -18003 -72840 -197481 244053 99749 -45451 6324
9155a6890H2573a29274d3642m32358J91157D6933b851A42010b38007I3581b41845
$$ -16890 82573 -129274 -43642 -476000 -284843 46933 -2851 142010 -238007 93581 -241845
9143b8718p8361k918r7798l69439b03097a5823A2579d2953D0560J9363e8386b7188
$$ -28718 -107079 -109997 -207795 -577234 -203097 -15823 12579 -42953 40560 59923 -58386 -27188
9130A87209c679I335a91349I1335a33772j11185B55960a83797P275k554a051p1361
$$ 187209 -3679 9335 -191349 91335 -133772 -244957 255960 -183797 -176522 -179076 -1051 -72412
9118g2412A66947g4049j90661A40275b27886p4909D2633b69812G821l12K24163
$$ -72412 166947 -74049 -264710 140275 -227886 -302795 42633 -269812 7821 7509 231672
9107B31672r7353K24780b12442R2790N8854B9232Q990J73601e2157E2342a19139
$$ 231672 134319 359099 -212442 -119652 -60798 29232 38222 211823 -52157 52342 -119139
9095a06069K7773l29229F9465d73163H0933e3989D0558c87830c3219A20614a00992
$$ -106069 -78296 -407525 69465 -473163 80933 -53989 40558 -387830 -33219 120614 -100992
9083a70380B02400l7103J19749e902r7884k67268a811k60046J14754L5120j80454
$$ -170380 202400 165297 285046 -5902 -103786 -371054 -1811 -261857 -147103 -111983 -292437
9072b92437q6077d4613A82914H7925a80375e6385r9200P6219o4477j37233h0759
$$ -292437 -378514 -44613 182914 87925 -180375 -56385 -155585 -79366 -143843 -281076 -80759
9060A20669D8951a27409j63263a44543C2844J7543a07496j39822L1478j0320J11377
$$ 120669 48951 -127409 -290672 -144543 32844 50387 -107496 -247318 -215840 -226160 -114783
9049a14783A0273a32573A24756a60790a0634E2084e1535F9135a84787n3935j8998
$$ -114783 10273 -132573 124756 -160790 -10634 52084 -51535 69135 -184787 -238722 -257720
9038b57720J16288C8960b7658A62722D458J81313b230k6301m875j09655c587j23227
$$ -257720 -141432 38960 -27658 162722 4458 185771 -2230 -28531 -33406 -143061 -3587 -126814
9026a26814m13576i5591B03810N1435e45I0565c19709J30186j01338a20889L4017
$$ -126814 -540390 -95591 203810 255245 -545 90565 -319709 -189523 -290861 -120889 -86872
9015h6872K9612q7742p0963j73959A72823a98548H9854c52203A22353K8433a76584
$$ -86872 -57260 -145002 -215965 -389924 172823 -198548 89854 -352203 122353 150786 -176584
9003H4088J14998c2010j59296m5753j33325a51243B09981d6124A02393C0685b9028
$$ 84088 199086 -32010 -191306 -237059 -370384 -151243 209981 -46124 102393 30685 -29028
8991D4095P2859h5581A0011b16841b4169C2356d4705I3700b52697g6367j11774
$$ 44095 116954 -85581 10011 -216841 -24169 32356 -44705 93700 -252697 -76367 -188141
8980a88141j6573J01585j08573A52829b15524j06947h8431k56589a65162K4773
$$ -188141 -204714 -103129 -211702 152829 -215524 -322471 -88431 -345020 -165162 -140389
8970a40389k10296a28796A7850J29548a34952j20379k5222J8058c5834A80193
$$ -140389 -350685 -128796 17850 147398 -134952 -255331 -280553 -262495 -35834 180193
8959A68346e2692k43048l1467A83601Q293a4400k07918B74034D0538e1880j12463
$$ 168346 -52692 -295740 -327207 183601 191894 -14400 -222318 274034 40538 -51880 -164343
8948a64343L1727o9705j36094B71129C3674L4710e0457D9285N588c44823A12129
$$ -164343 -132616 -202321 -338415 271129 33674 68384 -50457 49285 54873 -344823 112129
8936A08436c6041l2300E16437A65796p2949K24561b59255m792i8944j52010B07501
$$ 108436 -36041 -68341 516437 165796 92847 317408 -259255 -264047 -98944 -250954 207501
8924A02749L11657J369775O602544J2703310D031765A335531E31570j98548p5001
$$ 102749 414406 1784181 8386725 21090035 4031765 1335531 531570 333022 258021
8915B58021q8704K75237A81546G8165f5627B19561n912L61118G2099d2444k48622
$$ 258021 169317 444554 181546 78165 -65627 219561 213649 574767 72099 -42444 -291066
8904b91066A73087b1713j09538a7974A36339n9027d90919B02193H7502K18577
$$ -291066 173087 -21713 -131251 -17974 136339 77312 -490919 202193 87502 306079
8894C06079I0479J98302r682Q492J72027A74445i9514k44202a36810m6917F1873
$$ 306079 90479 288781 279099 287591 459618 174445 -99514 -343716 -136810 -183727 61873
8882a20908A8499J54859i5489A19497d21303A55624a3972A952c75488E8879a55493
$$ -120908 18499 173358 -95489 119497 -421303 155624 -13972 1952 -375488 58879 -155493
$$ [...]
##END NTUPLES=NMR SPECTRUM
##END=
