
##TITLE=UV1264_M12_1292-1216_10_7414641_7FibY5G672
##JCAMPDX= 6.0         $$ Bruker NMR JCAMP-DX V2.0
##DATA TYPE= NMR SPECTRUM
##DATA CLASS= NTUPLES
##ORIGIN= BRUKER
##OWNER= Administrator
$$ 1.72 TOPSPIN		Version 2.1
$$ 2013-01-25 20:20:32.609 -0500  Administrator@X
$$ Compression mode = diff/dup
##.OBSERVE FREQUENCY= 400.02188249412
##.OBSERVE NUCLEUS= ^1H
##.ACQUISITION MODE= SIMULTANEOUS (DQD)
##.ACQUISITION SCHEME= undefined
##.AVERAGES= 64
##.DIGITISER RES= 22
##SPECTROMETER/DATA SYSTEM= spect
##.PULSE SEQUENCE= noesygpps1d.comp
##.SOLVENT NAME= COFFEE_meoh
##.SHIFT REFERENCE= INTERNAL, COFFEE_meoh, 1, 14.96111
##AUDIT TRAIL= $$ (NUMBER, WHEN, WHO, WHERE, PROCESS, VERSION, WHAT)
$$ ##TITLE= Audit trail, TOPSPIN		Version 2.1
$$ ##JCAMPDX= 5.01
$$ ##ORIGIN= Bruker BioSpin GmbH
$$ ##OWNER= Administrator
$$ $$ E:\/data/COFFEE/nmr/UV1264_M12_1292-1216_10_7414641_7FibY5G672/12/pdata/1/auditp.txt
$$ ##AUDIT TRAIL=  $$ (NUMBER, WHEN, WHO, WHERE, PROCESS, VERSION, WHAT)
(   1,<2013-01-25 20:20:26.750 -0500>,<Administrator>,<X>,<go>,<TOPSPIN 2.1>,
      <created by zg
	started at 2013-01-25 20:08:57.140 -0500,
	POWCHK enabled, PULCHK disabled,
       configuration hash MD5:
       86 BA 57 50 F2 9D 5C 9B 26 00 A9 28 5F 66 2E 89
       data hash MD5: 64K
       9C 3A 45 FE 75 4D 58 B6 D0 52 60 02 30 77 68 54>)
(   2,<2013-01-25 20:20:29.828 -0500>,<Administrator>,<X>,<proc1d>,<TOPSPIN 2.1>,
      <Start of raw data processing
       efp LB = 0.3 FT_mod = 6 PKNL = 1 PHC0 = 0 PHC1 = 0 SI = 128K 
       data hash MD5: 128K
       0B 7E 3B D6 0A F5 4E E8 37 1D 60 D2 F9 DF 7B 91>)
(   3,<2013-01-25 20:20:30.859 -0500>,<Administrator>,<X>,<proc1d>,<TOPSPIN 2.1>,
      <pk PHC0 = -80.53528 PHC1 = 0 
       data hash MD5: 128K
       88 A1 53 D3 EB 32 7E 3F 64 37 EF C7 34 81 91 28>)
(   4,<2013-01-25 20:20:31.500 -0500>,<Administrator>,<X>,<proc1d>,<TOPSPIN 2.1>,
      <abs ABSG = 1 
       data hash MD5: 128K
       30 90 EA 31 4B 92 A1 E4 EE 52 8B 17 A7 AC 5A A7>)
(   5,<2013-01-25 20:20:31.672 -0500>,<Administrator>,<X>,<proc1d>,<TOPSPIN 2.1>,
      <abs ABSG = 2 
       data hash MD5: 128K
       D5 77 0E 8D D9 02 9A 4F 73 FF 1C 2D CE 2F F6 09>)
(   6,<2013-01-25 20:20:31.875 -0500>,<Administrator>,<X>,<proc1d>,<TOPSPIN 2.1>,
      <abs ABSG = 3 
       data hash MD5: 128K
       7C B4 50 53 10 0D 63 33 8A 2E A0 13 AD 21 5D F6>)
(   7,<2013-01-25 20:20:32.078 -0500>,<Administrator>,<X>,<proc1d>,<TOPSPIN 2.1>,
      <abs ABSG = 4 
       data hash MD5: 128K
       0A F9 72 83 FF 8E DB 7F 41 DE 48 98 7A A7 78 7B>)
(   8,<2013-01-25 20:20:32.281 -0500>,<Administrator>,<X>,<proc1d>,<TOPSPIN 2.1>,
      <abs ABSG = 5 
       data hash MD5: 128K
       81 B8 1D 13 CA 5E B3 C9 72 7E 4F B1 3A 7E 3C 5B>)
$$ ##END=
$$ 
$$ $$ hash MD5
$$ $$ A9 63 DA 9F 63 73 BB 12 F1 98 D5 93 19 C0 83 30
##$RELAX= 
##$RELAX= 
##$RELAX= 
##$RELAX= 
##$RELAX= 
##$RELAX= 
##$RELAX= 
##$RELAX= 
$$ Bruker specific parameters
$$ --------------------------
##$DU= <E:\>
##$EXPNO= 12
$$ [...]
##$TP07= 0
##$TPNAME0= <>
##$TPNAME1= <>
##$TPNAME2= <>
##$TPNAME3= <>
##$TPNAME4= <>
##$TPNAME5= <>
##$TPNAME6= <>
##$TPNAME7= <>
##$TPOAL= (0..7)
0.5 0.5 0.5 0.5 0.5 0.5 0.5 0.5
##$TPOFFS= (0..7)
0 0 0 0 0 0 0 0
##$TUNHIN= 0
##$TUNHOUT= 0
##$TUNXOUT= 0
##$USERA1= <user>
##$USERA2= <user>
##$USERA3= <user>
##$USERA4= <user>
##$USERA5= <user>
##$V9= 5
##$VALIST= <valist>
##$VCLIST= <CCCCCCCCCCCCCCC>
##$VD= 0
##$VDLIST= <DDDDDDDDDDDDDDD>
##$VPLIST= <PPPPPPPPPPPPPPP>
##$VTLIST= <TTTTTTTTTTTTTTT>
##$WBST= 2048
##$WBSW= 25
##$XGAIN= (0..3)
0 0 0 0
##$XL= 0
##$YL= 0
##$YMAX_a= 6419068
##$YMIN_a= -12438906
##$ZGOPTNS= <>
##$ZL1= 120
##$ZL2= 120
##$ZL3= 120
##$ZL4= 120
##$ABSF1= 14.96111
##$ABSF2= -5.597072
##$ABSG= 5
##$ABSL= 3
##$ALPHA= 0
##$AQORDER= 0
##$ASSFAC= 0
##$ASSFACI= 0
##$ASSFACX= 0
##$ASSWID= 0
##$AUNMP= <proc_prof1d_extract.lims>
##$AXLEFT= 0
##$AXNAME= <>
##$AXNUC= <1H>
##$AXRIGHT= 0
##$AXTYPE= 0
##$AXUNIT= <>
##$AZFE= 0.1
##$AZFW= 0.1
##$BCFW= 0
##$BC_mod= 0
##$BYTORDP= 0
##$COROFFS= 0
##$CY= 15
##$DATMOD= 1
##$DC= 0
##$DFILT= <>
##$DTYPP= 0
##$F1P= 0
##$F2P= 0
##$FCOR= 0.5
##$FTSIZE= 131072
##$FT_mod= 6
##$GAMMA= 0
##$GB= 0
##$INTBC= 1
##$INTSCL= 1
##$ISEN= 128
##$LB= 0.3
##$LEV0= 0
##$LPBIN= 0
##$MAXI= 10000
##$MC2= 0
##$MEAN= 0
##$ME_mod= 0
##$MI= 0
##$NCOEF= 0
##$NC_proc= -2
##$NLEV= 6
##$NOISF1= 0
##$NOISF2= 0
##$NSP= 0
##$NTH_PI= 0
##$NZP= 0
##$OFFSET= 14.96111
##$PC= 1
##$PHC0= -80.53528
##$PHC1= 0
##$PH_mod= 1
##$PKNL= yes
##$PPARMOD= 0
##$PPDIAG= 0
##$PPIPTYP= 0
##$PPMPNUM= 2147483647
##$PPRESOL= 1
##$PSCAL= 4
##$PSIGN= 0
##$PYNMP= <proc.py>
##$REVERSE= no
##$SF= 400.020009593599
##$SI= 131072
##$SIGF1= 0
##$SIGF2= 0
##$SINO= 400
##$SIOLD= 131072
##$SPECTYP= <>
##$SREGLST= <1H.CDCl3>
##$SSB= 0
##$STSI= 131072
##$STSR= 0
##$SW_p= 8223.68421052631
##$SYMM= 0
##$S_DEV= 0
##$TDeff= 65536
##$TDoff= 0
##$TI= <>
##$TILT= no
##$TM1= 0
##$TM2= 0
##$TOPLEV= 0
##$USERP1= <user>
##$USERP2= <user>
##$USERP3= <user>
##$USERP4= <user>
##$USERP5= <user>
##$WDW= 1
##$XDIM= 131072
##$YMAX_p= 483019944
##$YMIN_p= -12558
##$CURPLOT= <Network HP LaserJet P1505>
##$CURPRIN= <$Network HP LaserJet P1505>
##$DFORMAT= <normdp>
##$LAYOUT= <+/1D_H.xwp>
##$LFORMAT= <normlp>
##$PFORMAT= <normpl>
##$SURQMSG= 1
$$ End of Bruker specific parameters
$$ ---------------------------------
##NTUPLES= NMR SPECTRUM
##VAR_NAME=  FREQUENCY,     SPECTRUM/REAL,   SPECTRUM/IMAG
##SYMBOL=    X,             R,               I
##VAR_TYPE=  INDEPENDENT,   DEPENDENT,       DEPENDENT
##VAR_FORM=  AFFN,          ASDF,            ASDF
##VAR_DIM=   131072,        131072,          131072
##UNITS=     HZ,            ARBITRARY UNITS, ARBITRARY UNITS
##FACTOR=    0.0627417313425164, 1,          1
##FIRST=     8223.62146879497, -576,         -59046
##LAST=      0,             1762,            -59259
##MIN=       0,             -12558,          0
##MAX=       8223.62146879497, 483019944,    0
$$ Real data points
##PAGE= N=1
##DATA TABLE= (X++(R..R)), XYDATA
$$ [...]
67908 91942 90173 88714 87693 87182 86997 86613 85717 84687 84143 84084 83930 83383 82858 83022 84124 85782 87172
67891 87172 87527 86685 85156 83598 82450 82080 82689 83764 84207 83652 83167 83927 85583 86777 87010 87002 87268 87374
67873 87374 86874 86083 85550 85446 85787 86574 87306 87061 85647 84196 84002 85035 86069 86058 84992 83567 82522
67856 82522 82275 82830 83850 84837 85295 84911 83826 82671 82013 81758 81355 80531 79385 77841 75631 73010 70926
67839 70926 70126 70435 71148 71755 72031 71832 71233 70606 70271 70289 70802 72201 74610 77473 80036 82060 83753
67822 83753 85269 86638 88040 89706 91583 93383 94909 96105 96872 97087 96764 95997 94787 93077 90857
67807 90857 88105 84808 81272 78237 76380 75664 75390 74875 73951 72852 71791 70745 69574 68308 67282
67792 67282 66925 67315 67994 68242 67624 66456 65779 66603 68917 71553 73307 74037 74355 74505 74089 72875 71254
67775 71254 69714 68350 67143 66338 66288 67129 68679 70346 71220 70867 70162 70670 72856 75482 77187 78059 79127
67758 79127 80840 82727 84186 84884 84650 83688 82843 82919 83692 84148 83757 83030 82721 83003 83569 84131 84559 84822
67740 84822 84995 85157 85239 85080 84641 83947 82880 81310 79373 77341 75241 72954 70683 68984 68180 68036 68067
67723 68067 67944 67506 66724 65840 65306 65364 65836 66412 67020 67769 68683 69652 70472 70762 69948 67698 64497 61617
67705 61617 60313 60921 62707 64542 65694 66070 65929 65536 65018 64340 63422 62379 61604 61372 61399 61097 60389 59932
67687 59932 60325 61336 62237 62701 63023 63482 63869 63741 62964 61865 60986 60777 61405 62732 64444 66232 67896
67670 67896 69375 70687 71815 72617 72943 72867 72730 72884 73428 74165 74719 74702 73939 72569 70963 69566 68866 69300
67652 69300 70875 72938 74584 75312 75111 74095 72491 70937 70179 70294 70588 70450 69883 69050 67860 66401
67636 66401 65324 65277 66231 67722 69489 71412 73160 74440 75443 76527 77563 78125 78219 78323 78671 79004 79045
67619 79045 78768 78112 76937 75530 74762 75392 77318 79697 81694 83026 83948 84860 85879 86723 87001 86597 85732
67602 85732 84726 83799 83024 82384 81953 81944 82373 82630 81815 79725 77181 75077 73437 71835 70364 69568 69534 69702
67584 69702 69617 69330 68960 68389 67599 66940 66779 67127 67751 68382 68767 68828 68837 69090 69267 68494 66374 63708 61889
67565 61889 61626 62408 63138 63134 62575 62200 62648 64057 66069 67968 68822 68005 65935 63987 63171 63027 62346 60876
67547 60876 59713 59911 61311 62997 64327 65159 65510 65543 65672 66184 66810 67014 66658 66091 65669 65462 65411 65479 65560
67528 65560 65408 64765 63527 61891 60407 59742 60156 61209 62113 62425 62332 62313 62688 63466 64433 65231 65495 65059
67510 65059 64073 62854 61692 60856 60683 61337 62364 62819 62180 61036 60506 61005 61947 62656 63053 63307 63366 63262
67492 63262 63441 64250 65339 66118 66662 67551 68902 70130 70697 70601 69983 68835 67351 66107 65569 65619 65781 65662
67474 65662 65086 64135 63241 62938 63289 63837 64287 64837 65585 66007 65533 64405 63433 62958 62589 62031 61702 62226 63528
67455 63528 64745 65001 64178 62960 62218 62292 62829 63274 63501 63865 64707 65943 67207 68224 68891 69100 68761 68087
67437 68087 67614 67748 68432 69438 70706 72055 72722 71799 69297 66328 63985 62430 61345 60734 60769 61131 61200
67420 61200 60873 60676 60967 61478 61751 61738 61803 62300 63193 63995 64234 64078 64244 65065 66017 66572 67065 67989 68849 68669
67400 68669 67609 67042 67701 68708 68868 68102 67026 65892 64775 64207 64651 65551 65767 64950 63833 63146 62901
67383 62901 62838 62950 63292 63691 63938 64093 64415 65097 66080 66986 67328 67068 66866 67459 68735 69795 69996 69628 69428
67364 69428 69723 70286 70791 71124 71306 71345 71241 71050 70869 70728 70426 69590 68051 66219 64879 64491 64765 65071
67346 65071 65205 65559 66502 67768 68649 68775 68485 68343 68477 68625 68793 69484 71134 73503 75857 77661 78894
67329 78894 79750 80332 80715 81063 81427 81521 80922 79547 77826 76379 75618 75674 76440 77562 78525 78993 79089 79214 79683
67310 79683 80608 81927 83219 83700 82975 81806 81604 82869 84621 85643 85767 85551 85178 84426 83476 82929 82924 82879
67292 82879 82289 81359 80625 80336 80385 80561 80677 80646 80570 80622 80812 81022 81229 81504 81854 82278 82830 83397 83688 83769 84271
67271 84271 85458 86366 85706 83646 81835 81484 82227 83106 83810 84429 84787 84745 84669 84897 85123 84945 84671 84887 85470
67252 85470 85776 85691 85802 86473 87376 88015 88263 88196 87836 87274 86766 86514 86501 86574 86580 86413 86125 85954 86093 86435 86690
67231 86690 86694 86510 86342 86487 87233 88570 90052 91123 91549 91471 91197 91063 91288 91802 92318 92687 92990 93210 93113
67212 93113 92591 91859 91145 90552 90424 91372 93485 95855 97381 97842 97792 97702 97733 98105 98986 100009 100480 100165 99484
67193 99484 98972 98965 99748 101366 103186 104215 104148 103723 103846 104702 105892 107044 108004 108732 109350 110127 111165 112195
67175 112195 112886 113228 113445 113630 113673 113510 113267 113100 112960 112639 112126 111833 112283 113552 115190 116747 118104 119149
67157 119149 119518 119071 118416 118470 119465 120758 121604 121809 121595 121214 120819 120543 120527 120961 122003 123500 124915 125837
67139 125837 126448 127202 128139 128892 129324 129702 130186 130605 130823 130926 130947 130836 130903 131790 133616 135522 136531 136759
67121 136759 137362 139270 142264 145292 147396 148238 148029 147299 146774 147128 148506 150293 151694 152632 153782 155595
67105 155595 157625 159133 160027 160768 161679 162884 164697 167329 170178 172123 172788 172951 173489 174427 175298 175915
67089 175915 176358 176675 177023 177727 178743 179418 179302 178934 179254 180423 181812 183036 184376 186083 187846 189184
67073 189184 189935 190232 190382 190977 192649 195375 198297 200648 202639 205009 207871 210521 212428 213859 215271
67058 215271 216547 217310 217717 218376 219495 220696 221795 223263 225532 228263 230772 233002 235491 238444 241359
67043 241359 243729 245688 247721 250062 252642 255411 258424 261686 265089 268432 271414 273801 275767 277944
67029 277944 280910 284636 288521 291922 294575 296674 298697 301032 303631 306122 308373 310791 313861 317521
67015 317521 321259 324755 328145 331625 335122 338474 341746 345206 349070 353362 357891 362253 365996 369003
67001 369003 371764 375146 379796 385705 392282 398833 405027 410992 416981 423002 428824 434348 439757 445200
66987 445200 450502 455423 460163 465328 471362 478194 485441 492758 499954 507049 514396 522407 530976 539401
66973 539401 547162 554577 562372 570831 579750 588995 598572 608250 617725 627283 637681 649122 660825
66960 660825 671935 682479 693037 703798 714437 724811 735380 746878 759695 773551 787694
66949 787694 801542 815155 828942 843004 857129 871398 886243 901748 917518 933500 950345
66938 950345 968441 987130 1005496 1023566 1042079 1061404 1081359 1101838 1122834 1143982 1164853
66927 1164853 1185806 1207883 1231702 1256902 1282707 1308506 1333931 1358960 1384053 1409672 1435638
66916 1435638 1461493 1487520 1514661 1543310 1572842 1602557 1632392 1662399 1692236 1721667 1751084
66905 1751084 1781028 1811559 1842460 1873683 1905145 1936427 1967107 1997141 2026601 2055364 2083402
66894 2083402 2111041 2138471 2165272 2190830 2215009 2238096 2260402 2282244 2303933 2325225 2345085
66883 2345085 2362640 2378225 2392924 2407143 2420229 2431433 2440585 2447696 2452540 2455056 2455760 2455322 2453800
66870 2453800 2450577 2445061 2437251 2427575 2416277 2403079 2387575 2369905 2350859 2331275 2311481 2291355
66858 2291355 2270631 2248942 2225880 2201367 2175801 2149544 2122414 2094016 2064471 2034390 2004155
66847 2004155 1973692 1943055 1912778 1883299 1854286 1824914 1794822 1764573 1735100 1706772 1679067
66836 1679067 1651033 1621980 1591846 1561192 1531003 1502211 1474995 1448502 1421638 1394312 1367605
66825 1367605 1342549 1319002 1295954 1272635 1248967 1225160 1201342 1177654 1154364 1131771 1110127
66814 1110127 1089635 1070323 1051852 1033580 1014895 995516 975689 956202 937988 921378 905783
66803 905783 890312 874650 859091 843840 828686 813433 798351 783981 770622 758027 745510
66792 745510 732416 718744 705298 693001 681987 671537 660906 649979 639109 628582 618337
66781 618337 608028 597302 586200 575303 565255 556123 547463 539034 531035 523615 516606 509940 503875
66768 503875 498409 492888 486649 479765 472677 465370 457554 449485 441899 435112 428816 422841 417368 412203
66754 412203 406601 400293 394081 388868 384626 380821 377298 374045 370560 366399 362128 358758 356234 353401
66740 353401 349630 345535 341747 337839 333053 327496 321998 317170 313081 309547 306306 303145 300131 297439
66726 297439 294747 291336 287090 282809 279101 275580 271752 268077 265355 263540 261992 260528 259269 257723
66712 257723 255130 251700 248484 245880 243202 239952 236534 233322 229908 225933 222032 219278 217967 217390
66698 217390 216582 214978 212678 210373 208807 208003 207229 205802 203706 201415 199516 198558 198735 199520 199990 199617
66682 199617 198346 196004 192437 188333 185059 183186 181855 180119 178246 177120 176938 177166 177297 176998 175926
66667 175926 174149 172409 171228 170033 167971 165369 163504 162942 162905 162428 161375 160023 158324 156147 153860
66652 153860 152165 151362 151086 150755 150088 149105 147846 146317 144779 143768 143565 143801 143933 143941 144106 144210 143659 142480
66634 142480 141456 141016 140670 139939 139160 138777 138487 137782 136781 135792 134517 132583 130557 129456 129355 129339 128839
66617 128839 128164 127614 126958 126042 125223 124841 124752 124683 124571 124291 123471 121943 120130 118743 118251 118645 119435 119869
66599 119869 119528 118774 118280 118089 117559 116307 114741 113437 112378 111117 109477 107785 106506 105811 105437 104952
66583 104952 104185 103389 102891 102719 102721 102864 103105 103171 102812 102197 101699 101415 101266 101441 102209 103349 104273 104748 105024
66564 105024 105197 105017 104459 103927 103635 103252 102464 101514 100860 100578 100414 100204 99955 99648 99176 98405 97221 95690
66546 95690 94184 93138 92627 92431 92571 93385 94910 96489 97319 97224 96700 96295 96110 95818 95066 93912 92856
66529 92856 92358 92356 92430 92338 92169 92043 91959 91902 91791 91360 90416 89251 88421 88101 87989 87858 87785 87748 87464 86848 86271
66508 86271 86129 86401 86800 87042 86846 85980 84587 83184 82133 81342 80692 80415 80754 81472 82048 82267 82318 82421
66490 82421 82579 82666 82582 82366 82226 82389 82782 82996 82671 81873 81006 80422 80206 80224 80269 80178 79889 79439 78990 78859 79320
66469 79320 80215 80916 80951 80537 80260 80317 80372 80080 79407 78476 77458 76648 76287 76292 76454 76820 77534 78354 78862 79186
66449 79186 79934 81237 82412 82842 82747 82708 82867 82928 82673 82066 81105 79957 79071 78813 79076 79465 79709 79706 79374 78784
66429 78784 78247 78029 78081 78296 78862 80014 81536 82752 83077 82419 81110 79655 78484 77778 77428 77197 76900
66412 76900 76495 76088 75800 75490 74710 73254 71697 71037 71644 72902 74020 74842 75592 76150 75989 74786 72828
66395 72828 70861 69672 69676 70648 71910 72923 73738 74777 76254 77901 79211 79888 80089 80246 80597 80948 80929
66378 80929 80387 79374 77949 76286 74921 74464 74992 75967 76798 77256 77427 77579 78066 78964 79753 79767 79062 78417
66360 78417 78374 78682 78842 78725 78364 77598 76400 75317 75089 75820 76821 77332 77247 77126 77518 78306 78792 78491 77639
66341 77639 76677 75546 73930 72048 70655 70242 70770 72120 74109 75907 76246 74742 72542 71203 71218 71957
66325 71957 72658 73010 73056 72975 72903 72760 72395 71958 71804 71919 71885 71596 71563 72191 73249 74317 75307 76136 76394 75910
66305 75910 75321 75531 76754 78480 80167 81508 82261 82358 82168 82253 82811 83557 84057 84027 83455 82587 81657 80613
66287 80613 79356 78267 77991 78589 79372 79726 79586 78966 77763 76347 75593 75750 75965 75478 74650 74120 73697 72976
66269 72976 72431 72768 73582 73820 73467 73632 74858 76345 77124 77124 76815 76550 76599 77185 78083 78674 78716 78679 79017 79506
66249 79506 79554 78948 78065 77532 77759 78581 79333 79415 78749 77553 75910 73967 72338 71759 72335 73507 74732 75817
66231 75817 76700 77433 78379 79903 81755 83130 83425 82679 81352 80066 79442 79699 80362 80750 80819 81121 81969 83034
66213 83034 83774 83872 83314 82380 81552 81023 80380 79156 77572 76256 75405 74780 74376 74439 74838 75127 75303 75818 76799
66194 76799 77899 79060 80662 82650 84229 84813 84745 84660 84670 84525 84133 83445 82209 80380 78603 77818 78378
66177 78378 79732 80997 81768 82442 83682 85491 87011 87538 87446 87568 87916 87717 86695 85467 84542 83740 82969
66160 82969 82765 83541 84832 85801 86058 85569 84276 82391 80617 79466 78611 77523 76524 76567 77978 79961 81411
66143 81411 81902 81852 82004 82809 84092 85222 85669 85398 84719 83997 83588 83834 84867 86493 88343 89990 90965
66126 90965 90950 90136 89176 88606 88496 88732 89338 90309 91347 92012 92143 92051 92337 93423 95070 96477 97077 97115 97049
66107 97049 96639 95229 92953 90960 90222 90651 91644 92841 94030 94874 95295 95735 96551 97445 97922 98020 98146 98389
66089 98389 98464 98251 97969 97895 98158 98673 99060 98788 97683 96137 94689 93625 93113 93307 94022 94640 94741 94568
66071 94568 94523 94566 94524 94683 95475 96763 98005 98995 99881 100466 100164 98879 97444 96841 97168 97630 97410 96378
66053 96378 95090 94285 94424 95518 97187 98781 99652 99632 99268 99309 99893 100486 100675 100713 101136 102103 103352 104532
66035 104532 105367 105653 105359 104664 103856 103317 103591 105068 107532 110348 113203 116191 119110 121302 122597 123816
66019 123816 125748 127962 129246 129019 127779 126352 125256 124726 124806 125392 126448 128068 130060 131750 132700 133375
66003 133375 134569 136382 138355 140463 143187 146566 149957 152973 156001 159421 162880 165819 168290 170751
65989 170751 173235 175213 176217 176277 175739 174893 173794 172255 170043 167150 163827 160306 156612 152823 149342
65974 149342 146629 144624 142704 140362 137807 135701 134376 133537 132712 131721 130579 129250 127858 126964 127175
65959 127175 128349 129583 130143 130205 130540 131715 133736 136202 138554 140337 141462 142179 142767 143445 144593 146665
65943 146665 149666 153017 156188 159169 162047 164493 166111 167096 168022 169097 170061 170828 171765 173173 174843
65928 174843 176278 177215 177844 178657 180100 182253 184772 187186 189211 190809 192171 193816 196444 200397 205283
65913 205283 210305 214819 218479 221161 223095 224820 226503 227481 227007 225454 224163 223904 224009 223368 221891
65898 221891 220486 219783 219374 218425 216647 214445 212251 210008 207303 203852 199736 195312 190983 186969 183100
65883 183100 178905 174074 168879 163983 159841 156439 153618 151420 150034 149526 149680 149981 149828 148989 147846
65868 147846 146989 146578 146332 146056 145791 145516 145152 144880 144929 144962 144295 142916 141733 141464 141860 142366 142970 143861 144792
65849 144792 145443 146004 146726 147240 147102 146807 147453 149328 151528 153076 153864 154358 154911 155589 156336 157074 157833 158825
65831 158825 160195 161770 163325 165022 167300 170397 174241 178667 183412 188058 192326 196283 199906 202718
65817 202718 204404 205526 206907 208303 208411 206402 202917 199302 196325 193872 191481 188821 185874 182860
65803 182860 179964 177136 174347 171891 170091 168752 167302 165479 163574 162029 161147 161098 161778 162698 163480 164446
65787 164446 166279 169138 172619 176503 180918 185758 190736 196193 203022 211340 219825 226927 232299 236614
65773 236614 240333 243206 244722 244520 242407 238357 232547 225309 217242 209318 202475 196829 191663 186551
65759 186551 182133 179448 178792 179718 181951 185744 191282 198208 205964 214450 224184 235824 249467 264383
65745 264383 279489 294095 308076 321327 333315 343313 350883 355929 358353 357803 353757 345925 334697
65732 334697 321198 306706 291954 277024 261805 246382 231154 216884 204471 194219 185389 176978
65720 176978 168978 162328 157566 154135 151238 148719 146666 144697 142309 139712 137721 136832 136777 136917 136730
65705 136730 135934 134501 132714 131107 130224 130273 130865 131184 130757 130039 129892 130507 131266 131765 132365 133513 135089
65688 135089 136805 138772 141089 143274 144737 145697 147139 149891 154049 159161 164608 169991 175565 182227
65674 182227 190730 201000 212425 224587 237383 250798 265036 280610 297695 315450 332491 347925
65662 347925 361508 373061 382454 390019 396181 400599 402475 401939 400362 398978 397924 396976 396423 396534 396863
65647 396863 396956 397357 398951 401404 403197 403228 401494 397921 391437 380898 366439 349281 330536 310899
65633 310899 291262 272736 255792 239980 224858 210747 198199 187140 177121 168252 161212 156193
65621 156193 152368 148772 145392 143009 142021 141775 141095 139292 136563 133593 131006 129188 128368 128501 129017 129002
65605 129002 127956 126283 124779 123721 122762 121726 121014 121055 121631 122040 121801 120991 120105 119754 120376 121984 124266
65588 124266 127049 130472 134554 138900 143156 147531 152401 157585 162623 167820 174378 183192 194010 206126
65574 206126 219401 234015 249548 265171 280722 296783 313248 328484 340543 348971 354794 358802
65562 358802 360428 358450 352241 342150 329105 314257 298782 283526 268771 254468 240574 227030
65550 227030 213671 200572 188441 178300 170603 164830 159993 155434 151098 147243 144043 141467 139459
65537 139459 138159 137832 138525 139907 141519 143083 144510 145718 146542 146747 146086 144554 142616 140896 139472
65522 139472 137766 135373 132684 130425 128846 127731 126862 126046 124945 123479 122245 121944 122452 123024 123341 123698
65506 123698 124167 124303 123897 123381 123194 123315 123664 124378 125303 125803 125609 125417 126077 127494 128899 129973 131127
65489 131127 132791 134997 137669 140800 144199 147374 149883 151648 152871 153749 154311 154478 154192 153481 152342
65474 152342 150672 148475 146085 143903 141918 139782 137382 134973 132693 130430 128372 127182 127183 127714 127765 127048
65458 127048 126049 125215 124582 124091 123750 123358 122445 120748 118649 116984 116406 116892 117877 118900 119998 121349 122744
65441 122744 123894 125173 127396 130583 133572 135363 136388 137808 139857 141626 142447 142742 143244 143856 143738
65426 143738 142426 140590 139530 139892 141011 141665 141347 140425 139125 137132 134567 132674 132701 134331 135984 136667
65410 136667 136858 137536 138989 140825 142556 143800 144305 144222 144254 145161 147074 149391 151361 152766 154062 155783
65394 155783 157800 159378 160109 160463 161083 161793 161808 160840 159419 158023 156551 154922 153697 153591 154542 155685
65378 155685 156218 156071 155745 155783 156362 157260 158142 158920 159857 161291 163377 166104 169344 172710 175498 177132 177797
65361 177797 178460 180171 183420 188261 194765 202918 212115 221220 229452 236960 244260 251365 257824 263319
65347 263319 267609 270000 269618 266498 261788 256603 251186 245505 239994 234990 229919 223901 217084 210614
65333 210614 205242 200588 195923 191006 185959 180951 176454 173313 171894 171355 170316 168324 166169 164676
65319 164676 163569 161837 158932 155268 151617 148440 145883 143962 142424 140675 138293 135596 133359 131958
65305 131958 131092 130347 129645 129126 128969 129493 131016 133383 136003 138574 141412 144774 148191 150897 152652 153727
65289 153727 154263 154150 153471 152593 151761 150951 150186 149690 149568 149539 149130 148091 146568 144923 143383 141904 140445
65272 140445 139287 138910 139541 141007 142951 144889 146114 146011 144608 142528 140351 138430 137246 137247 138118 138907
65256 138907 139219 139621 140465 141165 141336 141826 143573 145894 147099 146635 145575 144967 144707 144216 143301 142032 140494
65239 140494 139009 138031 137575 137254 137009 137204 137831 138272 138141 137739 137386 136902 136132 135436 135128 134890 134224 133213
65221 133213 132359 131873 131563 131179 130554 129554 128268 127186 126912 127748 129626 132209 134831 136605 136980 136198
65205 136198 135047 134183 133747 133459 132996 132406 132189 132744 133643 133829 132711 130860 129436 129168 130044 131630 133282
65188 133282 134285 134272 133619 133140 133325 134025 134827 135490 135998 136474 137202 138494 140276 141878 142526 142105 141269 140689
65170 140689 140468 140389 140426 140587 140542 140015 139534 140113 141942 144001 145347 146233 147429 148947 150105 150587 150753 151030
65152 151030 151622 152724 154416 156363 158248 160474 163882 168725 174526 180977 188325 196687 205509 214032
65138 214032 221893 229134 235993 242804 249633 255875 260681 263993 266705 269620 272660 275314 277365 278873
65124 278873 279849 280307 280327 279813 278491 276436 274274 272458 270547 267482 262494 255594 247429 238899 230731
65109 230731 223141 215964 209137 202853 197152 191640 185874 179850 173987 168730 164274 160527 157302 154639
65095 154639 152853 152049 151694 151041 149963 148980 148469 148219 147904 147587 147557 147916 148469 148857 148794 148354 147935 147781 147721
65076 147721 147719 148293 149782 151473 152271 152242 152640 154221 156310 157810 158390 158331 157865 157170 156502 155914 155158 154188
65058 154188 153328 152774 152412 152330 152886 153944 154703 154721 154500 154602 154765 154448 153750 153177 152857 152516 151940 151012 149655
65039 149655 148115 146950 146287 145506 144101 142388 140902 139583 138118 136650 135531 134771 134319 134418 135012 135275
65023 135275 134530 133306 132589 132296 131489 130069 129209 129881 131718 133722 135496 137370 139679 142236 144401 145549
65007 145549 145688 145631 146353 148138 150472 152659 154330 155525 156541 157617 158554 158861 158537 158407 159308 161078
64991 161078 162818 163974 164778 165649 166629 167471 168112 168914 170473 173031 176125 178991 181302 183132 184341 184641
64975 184641 184268 183762 182882 180681 177079 173362 170461 167767 164524 161417 159489 158296 156616 154591 153610
64960 153610 154163 155197 155711 155684 155254 154287 153105 152490 152498 152231 151219 150066 149335 148749 148004 147459 147407 147393 146907
64941 146907 146109 145343 144541 143665 143137 143280 143838 144502 145314 146127 146368 145885 145399 145433 145462 144856 144115 144278 145431
64922 145431 146665 147255 147127 146395 145272 144317 144004 143982 143434 142172 140798 139857 139471 139781 141024 143050 145348
64905 145348 147710 150303 152934 154978 156374 158169 161558 166736 173040 179857 186869 193636 199614 204771
64891 204771 209793 215389 221494 227357 232418 236938 241605 246500 250712 253115 253406 252140 249891 246791
64877 246791 242881 238419 233598 228352 222804 217634 213508 210291 207311 204409 202251 201455 201777 202404 202713
64862 202713 202501 201707 200254 198088 195189 191620 187668 183721 179832 175683 171252 167246 164435 162739 161401
64847 161401 159996 158780 158037 157560 156892 155705 153842 151404 148917 147095 146237 146112 146439 147132 148019 148797
64831 148797 149422 150135 150974 151641 152120 152942 154554 156765 159038 160998 162477 163499 164509 166129 168367 170491
64815 170491 172057 173617 176007 179418 183624 188704 194824 201616 208348 214574 220080 224396 226932 227556
64801 227556 226654 224764 222433 220051 217359 213493 208145 202428 197932 195107 193210 191633 190544 190192 190333
64786 190333 190491 190317 189649 188614 187661 187060 186535 185784 185149 185189 185831 186645 187784 189819 192655 195485 197935
64769 197935 200530 203787 207533 211393 215340 219466 223726 228191 233120 238513 243965 249142 254010 258572
64755 258572 262832 267127 271961 277416 283106 288705 293944 298098 300174 299840 297521 293479 287485 279729
64741 279729 271312 263359 256088 249138 242351 235859 229865 224694 220706 217815 215486 213495 212261 212063
64727 212063 212413 212667 212922 213736 215160 216544 217342 217823 218922 221428 225294 229782 234361 239183 244390 249287
64711 249287 252858 254991 256439 257545 257758 256525 253880 249905 244491 238053 231667 225880 220032 213430
64697 213430 206594 200615 195725 191400 187624 185140 184341 184583 184837 184646 184228 183904 183673 183368 183165 183699 185461
64680 185461 188184 191212 194346 197895 201913 206088 210480 215684 221875 228356 234426 240125 245555 250029
64666 250029 252599 253176 252505 251131 248894 245425 240798 235725 231257 228066 225861 223703 221069 218348 216193
64651 216193 214852 214302 214511 215227 215953 216507 217277 218617 220427 222592 225343 228793 232600 236568 241124 246751
64635 246751 253344 260586 268436 276693 284559 291244 296639 300790 303186 303315 301602 298974 295680 291288
64621 291288 285679 279279 272371 264948 257217 249598 242178 234903 228358 223631 221112 219971 219008 217568
64607 217568 215477 212706 209600 207090 206150 206950 208691 210348 211546 212778 214732 217431 220171 222309 223887
64592 223887 225431 227416 230102 233581 237666 241939 246162 250486 255103 259940 264861 269875 274953 279961
64578 279961 284939 290066 295077 299160 301743 302957 303059 301963 299774 297165 294571 291476 287196 281938
64564 281938 276336 270276 263087 254773 246317 238760 232645 228217 225356 223265 220892 217829 214375 210822
64550 210822 207295 204274 202508 202190 202646 203013 202920 202543 202441 203310 205403 208170 210783 212915 214543 215229
64534 215229 214273 211678 208358 205276 202806 200955 199716 199075 198955 199212 199450 199090 198075 197240 197413 198329
64518 198329 198993 198927 198345 197347 195828 194220 193415 193746 194745 196049 197781 199948 202326 205207 209374 214917
64502 214917 220841 226334 231726 237608 243622 248844 252999 256628 260226 263703 266497 267866 267271 264858
64488 264858 261438 257827 254425 251558 249726 249190 249643 250613 251848 253012 253438 252699 251150 249408 247458
64473 247458 244716 240889 236356 231791 227723 224443 222014 220357 219505 219672 220958 223119 225877 229198 232945
64458 232945 236437 238857 240092 240755 241199 240917 239244 236485 233875 232373 231824 231569 231583 232518 234604 237027
64442 237027 238783 239869 241243 243745 247427 251876 256775 262050 267830 274487 282551 292436 304229 317739
64428 317739 332679 348951 366878 387075 410029 436084 466053 501513 544005 594157 652111
64417 652111 718636 794949 880981 974049 1069559 1162929 1251013 1332351 1406632 1473902 1533772
64406 1533772 1584908 1625041 1651565 1662618 1658056 1639460 1609100 1568783 1519413 1461035 1393062
64395 1393062 1315036 1227937 1134816 1039799 946583 857934 776041 702466 637701 581317 532663
64384 532663 491127 455912 426105 401015 380072 362569 347884 335819 326175 318146 310782 304006
64372 304006 298509 294558 291465 288310 284598 280097 274594 268111 261007 253752 246850 240873 236097 232160
64358 232160 228548 225265 222502 219944 217259 215141 214848 216540 218988 221256 223757 227227 231427 235421
64344 235421 238460 240108 240094 238613 236319 233561 230082 225911 221918 218896 216549 214064 211435 209532 208943
64329 208943 209296 209754 209908 210122 211147 213390 216562 220104 223698 227022 229327 230037 229753 229895 231191 233162
64313 233162 235181 237069 238413 238321 236526 233962 231536 228917 225235 220419 215168 210075 205455 201638 198685
64298 198685 196101 193398 190679 188185 185746 183310 181549 181145 181741 182390 182809 183481 184694 186282 188204
64283 188204 190630 193368 195934 198338 201248 205159 209770 214321 218269 221661 225147 229566 235130 240970
64269 240970 245765 248809 250247 250463 249605 247741 245148 242400 240193 239023 238942 239794 241567 244116 246501
64254 246501 247323 246028 243365 240189 236414 231657 226269 221001 216055 211257 206833 203217 200254 197418
64240 197418 194743 192839 191938 191586 191320 191145 191277 191904 193236 195285 197609 199622 201148 202337 203295 204227
64224 204227 205636 207745 209877 211174 211767 212491 213473 213901 213345 212476 212123 212277 212434 212341 211950 211146 210024
64207 210024 209141 208940 209080 208740 207602 206163 204953 203725 201750 199010 196745 196430 198199 200807 203257
64192 203257 205914 209701 214880 221238 228922 238161 248400 258608 268412 278032 287010 293936 297769 298743
64178 298743 297607 294574 289458 282373 273863 264655 255549 247203 239732 232837 226472 220950 216220 211620
64164 211620 206779 202272 198861 196427 194241 192052 190276 189142 188268 187294 186571 186954 188988 192374 196133
64149 196133 199307 201640 203657 205979 208574 210794 212184 213096 214360 216341 218471 219789 219861 219051 217923
64134 217923 216631 214990 212971 210971 209604 209301 209984 211084 211994 212618 213352 214493 215910 217386 219037
64119 219037 221149 223841 227128 231129 235915 241281 246989 253104 259789 266766 273248 278489 282309 285109
64105 285109 287484 289668 291332 292141 292573 293819 296636 300661 305231 310450 316874 324310 331533 337207 340717
64090 340717 342126 341814 340251 337730 334241 329763 324612 319194 313500 307199 300237 293057 286232 280126
64076 280126 274839 270187 265848 261767 258279 255538 253070 250304 247363 244873 243138 242058 241705 242359 243882
64061 243882 245603 246955 247864 248490 249028 249808 251129 252886 254748 256736 259260 262570 266568 271121 276093
64046 276093 281145 286073 291384 297900 305727 314219 323064 332695 343326 354274 364605 373878 381760
64033 381760 387495 390415 390719 389156 386088 381433 375507 369390 364242 360438 357526 354943 352701 351303
64019 351303 350966 351088 350633 348898 345682 340910 334591 327177 319551 312477 306335 301313 297426 294313 291444
64004 291444 288660 286140 283808 281294 278619 276378 275020 274402 274276 274682 275544 276442 277232 278444 280590 283455
63988 283455 286533 289785 293406 297136 300510 303698 307484 312345 317978 323808 329558 335314 341419 348335
63974 348335 356186 364360 371987 379074 386817 396474 408102 420639 433163 445728 458992 473345 488626
63961 488626 504624 521567 540031 560510 583205 608223 635912 667050 702749 744190 792365
63950 792365 848142 912645 987481 1074499 1175322 1291102 1422576 1570135 1733719 1912523
63940 1912523 2104755 2307920 2519679 2738391 2962355 3188406 3411566 3626109 3826449
63931 3826449 4006962 4162026 4287238 4380407 4440729 4467360 4459476 4417318 4342152 4235221 4097838
63920 4097838 3932908 3745739 3542989 3331197 3116157 2902639 2693877 2491675 2297485
63911 2297485 2113313 1941549 1784278 1642773 1517070 1405760 1306660 1218033 1138884 1068223
63901 1068223 1004829 948072 898200 855225 818051 785300 756471 731536 709759 689787 670937
63890 670937 653557 637926 623357 608875 594483 581326 570556 562293 555877 550973 548039 547567 549324
63877 549324 552809 558233 566350 577322 590435 605192 622076 641864 664572 689498 715870 743084
63865 743084 770650 798489 827143 857170 888306 919463 949494 977737 1003949 1028021 1049693
63854 1049693 1068222 1082346 1090912 1093758 1091849 1086327 1077385 1064226 1046325 1024616 1000984 976469
63842 976469 950344 921324 889236 855012 819485 783037 746308 710327 675631 641973 609231
63831 609231 578064 549344 523335 499681 477809 457199 437725 419886 404250 390527 377744
63820 377744 365412 353834 343105 332741 322777 314356 308397 304225 300285 295820 291148 286651 282292
63807 282292 278011 273886 269889 265953 262316 259343 257049 255069 253048 250833 248459 246156 244167 242403
63793 242403 240501 238376 236346 234514 232555 230369 228459 227222 226358 225330 223996 222367 220335 218136
63779 218136 216486 215633 214842 213523 212301 212086 212528 212518 212014 212208 213755 215782 216975 216917 216094 215166 214591
63762 214591 214526 214804 215116 215293 215236 214809 214129 213739 214050 214727 215140 215235 215482 216117 216981 218008 219282 220717 222248
63743 222248 224249 227111 230433 233240 235075 236330 237499 238686 239860 241041 242155 243162 244282 245618
63729 245618 246754 247421 248357 250636 254177 257883 261384 265562 271005 276930 282266 286960 291507 295798 299241
63714 299241 301603 303022 303478 302883 301501 299714 297476 294445 290561 286139 281579 277306 273843 271525 270281
63699 270281 269902 270352 271529 273021 274497 276160 278369 280980 283467 285607 287692 290126 293178 297021 301548
63684 301548 306117 309882 312476 314062 314734 314365 313163 311876 310995 310059 308265 305724 303702 303480 305214
63669 305214 307979 310636 312505 313530 314193 315178 316744 318359 319144 318731 317414 315430 312498 308280 303012
63654 303012 297362 291828 286563 281680 277356 273626 270322 267345 264907 263462 263410 264682 266554 268104 269070
63639 269070 270093 271845 274104 276076 277587 279524 282916 287843 293497 299163 304928 311346 318567 326035
63625 326035 333159 340162 348000 357490 368706 381193 394442 408142 422354 437613 454502 473022
63613 473022 492761 513856 537232 563512 592185 622353 653807 686661 720113 752265 781014
63602 781014 804605 821519 830817 832920 829625 823083 814932 806213 797491 788886 780405 772284 764542 756106
63588 756106 744925 729322 709138 685555 660236 634682 609919 586392 564219 543587 524755
63577 524755 507713 492299 478707 467551 459283 453863 450999 450294 451096 452638 454677 457737 462576 469556
63563 469556 478528 488956 500026 510982 521559 531954 542402 553171 564901 578424 594056 611626
63551 611626 631485 654965 683392 717080 755731 799213 846887 895877 940718 975387 996004
63540 996004 1002028 995644 980482 960558 939450 919713 902828 889671 880696 875375 871723 867113 859907
63527 859907 849955 837298 820958 799579 773020 742676 710328 677216 644195 612056 581404 552634
63515 552634 526216 502635 481825 463050 445631 429563 415232 402840 392371 383772 376776 370641
63503 370641 364467 357895 351367 345657 341188 337772 334874 332119 329574 327634 326687 326850 327807 328867 329321
63488 329321 328939 328055 327104 326258 325596 325359 325826 327141 329471 333093 338066 343994 350352 356798 362845 367628
63472 367628 370481 371599 371645 370877 369118 366413 363124 359432 355236 350567 345609 340437 335229 330649 327375
63457 327375 325234 323410 321584 320228 319690 319634 319666 319905 320690 322318 325363 330682 338581 348349 359026 370421
63441 370421 383066 397494 413926 432570 453972 479173 509366 544806 583574 621659 654708
63430 654708 679910 696580 705571 708588 707734 705140 702767 702438 705790 714098 728218 748638 775288
63417 775288 807299 843279 881881 921721 960741 996139 1025290 1046548 1059206 1063292 1059866 1051224
63405 1051224 1040190 1028872 1018113 1007974 998436 989410 980085 968574 952616 930785 902937 869811
63393 869811 832803 794190 756606 721622 689216 658986 631249 606358 583808 562985 544258
63382 544258 528211 514310 501617 490583 482670 478192 475964 475252 476622 480375 485584 491450 498471
63369 498471 507471 518413 530962 545365 561965 580512 600703 622740 646763 672533 700336 731346
63357 731346 766156 803576 841695 879463 916345 951068 981725 1006752 1024974 1035314 1037599 1033457
63345 1033457 1025431 1015351 1004200 993043 982934 973962 965259 955816 944500 929573 909373 883665
63333 883665 853657 820723 785875 750371 715833 683557 654354 629086 608497 592405 579977
63322 579977 571151 566958 567809 571769 574886 573065 563796 547035 525071 501162 477690 455449 434668
63309 434668 416160 401028 389495 380590 373132 366656 361194 356451 351721 346731 342093 338529 335866
63296 335866 333289 330425 327615 325140 322802 320416 318095 315862 313555 311351 309741 308747 307787 306576 305441
63281 305441 304450 303138 301638 301065 301902 302829 302231 300289 298481 297508 296911 296439 296502 297263 298329 299396 300363
63264 300363 300895 300871 301202 303096 306358 309413 311255 312385 313577 314775 315782 317105 319346 322255 325061
63249 325061 327482 329967 333204 337639 343214 349340 355461 361776 369034 377475 386512 395703 405544 416907
63235 416907 430014 444401 459676 475919 493355 511902 531093 550480 570106 590420 611561
63224 611561 632880 653432 672788 691103 708639 725706 742893 760803 779440 798274 816876
63213 816876 835079 852552 868665 882741 893979 901209 903353 900301 892838 881587 866457 847280
63201 847280 824531 799294 772914 746807 722140 699413 678591 659768 643458 630220 620326 613803
63189 613803 610473 610011 612337 617900 627159 639758 654655 671024 688574 707079 726306 746438 767866
63176 767866 790242 812316 833105 852819 872350 892221 912337 932387 952059 970929 988336
63165 988336 1003379 1015063 1022696 1026113 1025306 1019933 1009463 993650 972550 946269 915238 880656
63153 880656 844135 806962 770106 734687 701675 671167 642736 616499 593096 572579 554214
63142 554214 537535 522717 509701 497955 487478 479035 472729 467278 461555 456110 452245 450118 448738
63129 448738 447468 446496 445916 445336 444556 443946 443973 444842 446708 449702 453611 457933 462427 467294 472650 478141
63113 478141 483220 487609 491319 494375 496765 498648 500503 502891 505986 509351 512309 514529 516212 517742
63099 517742 519412 521403 523800 526476 529094 531160 532025 531139 528731 526079 524469 523870 523248 522292 522021 523226
63083 523226 525073 526007 525684 525163 525313 525875 526254 526610 527703 529958 533065 536428 539800 543493 548081 553864
63067 553864 560507 567263 573720 580450 588767 599689 613113 628096 643900 660579 678684 698851
63055 698851 721827 748419 778929 812751 848837 886506 925636 966411 1009208 1054425 1101832
63044 1101832 1150170 1197920 1244466 1290146 1335247 1379454 1422312 1463745 1504098 1544061 1584558
63033 1584558 1626163 1668444 1710167 1750157 1787543 1821239 1849780 1871802 1886167 1891514 1886321 1869825
63021 1869825 1842598 1806012 1761508 1710552 1654890 1596467 1537115 1478419 1421645 1367828 1318119
63010 1318119 1273988 1236664 1206400 1182728 1165391 1154620 1150531 1152898 1161569 1176526 1197289 1222826
62998 1222826 1252213 1284943 1320453 1357878 1396478 1435788 1475235 1514189 1552619 1591046 1629634
62987 1629634 1667869 1705367 1742170 1777771 1810507 1838483 1860536 1875823 1883113 1881231 1869812 1848932
62975 1848932 1818394 1778153 1729207 1673376 1612294 1547206 1479608 1411290 1343672 1277681 1214401
62964 1214401 1155262 1101245 1052263 1007612 966838 929870 896423 865672 836767 809549 784476
62953 784476 761712 740542 719906 699420 679576 661026 643936 627960 612600 597612 583291
62942 583291 570224 558510 547458 536433 525732 516112 507720 500118 493189 487213 482094 477285 472603
62929 472603 468360 464576 460839 457139 454059 451831 449981 448205 446856 446158 445658 444892 443980 443097 441974
62914 441974 440401 438663 437007 435199 433020 430684 428402 426072 423738 421715 419883 417602 414799 412432
62900 412432 411293 411022 410944 411174 412221 414057 416293 418706 420896 422005 421640 420601 419940 419721 419477 419364
62884 419364 419896 420825 421267 420853 420051 419418 419156 419234 419328 418863 417646 416210 414971 413497 411307 408911 407181
62867 407181 406018 404609 402820 401344 400439 399490 398041 396498 395508 395197 395264 395407 395476 395483 395581 395904 396491 397434
62849 397434 398805 400217 400931 400731 400261 400099 399989 399493 398814 398369 397986 397257 396240 395134 393705 391819 390145
62832 390145 389517 389857 390513 391266 392204 392985 393250 393485 394453 395951 397087 397627 398091 398641 398970 399285 400352 402438
62814 402438 405176 408540 412958 418262 423557 428432 433418 438870 444180 448580 452121 455531 459582 464849
62800 464849 471612 479684 488548 497675 506506 514521 521960 530194 540608 553243 567257 582453 599505
62787 599505 618920 640902 666156 695618 729215 766019 805954 850304 900184 955439 1015454
62776 1015454 1080095 1149266 1222313 1298280 1376046 1453741 1528736 1598758 1662513 1718910 1766284
62765 1766284 1802776 1826932 1837744 1834781 1818612 1790549 1751721 1703042 1646100 1583213 1516258
62754 1516258 1446261 1374426 1302601 1232290 1164071 1098502 1036728 979528 926571 877301 831911
62743 831911 790787 753644 719943 689610 662705 638922 618105 600596 586339 574177 562890
62732 562890 552551 543972 537119 530963 524807 518989 514252 510988 509163 508525 508800 509914 511972 514884
62718 514884 518320 522223 527023 533112 540484 549144 559355 571175 584315 598954 616124 636730 660595
62705 660595 687075 716213 748599 784456 823637 866411 913550 965622 1022680 1084612 1151279
62694 1151279 1222336 1297317 1375821 1457179 1539875 1621610 1699845 1771983 1835248 1886960 1925198
62683 1925198 1948978 1957775 1951059 1928455 1890398 1838706 1776401 1706619 1631550 1552566 1471247 1389783
62671 1389783 1310246 1233921 1161503 1093462 1029961 970846 916091 865960 820497 779241 741721
62660 741721 707851 677565 650473 626235 604870 586339 570128 555541 542037 529091 516199
62649 516199 503415 491417 480674 470975 462079 454233 447593 441744 436418 432151 429467 427855 426400
62636 426400 425124 424768 425317 425598 424541 422225 419541 417265 415595 414184 412486 410292 407928 405826 404100
62621 404100 402784 402141 402284 402767 403074 403361 404194 405704 407569 409751 412642 416374 420468 424402 428201 432298
62605 432298 437076 442677 449144 456646 465547 476159 488430 502176 517683 535785 557147 581829
62593 581829 609690 640699 674443 709821 745803 782223 819247 856246 891680 923841 951201
62582 951201 972431 986845 994753 996644 992087 980186 961204 936914 909088 878355 844965 810072
62570 810072 775537 742601 711303 681308 652873 626753 603235 581650 561116 541666 524243
62559 524243 509497 496982 485763 475412 466031 457601 449873 442785 436549 431319 427113 423962 421760
62546 421760 420056 418385 416802 415755 415459 415749 416458 417485 418465 418854 418566 418193 418382 419190 420187 421015 421743
62529 421743 422873 425084 428830 434045 440320 447374 455305 464424 475089 487736 502889 520927 541827
62516 541827 565211 590788 618823 650085 685130 723630 764609 807363 851906 898352 945992
62505 945992 993033 1037138 1076292 1109460 1136493 1157144 1170223 1174151 1168506 1154609 1134452 1109496
62493 1109496 1080815 1049923 1018859 989542 963241 940428 920889 904293 891022 882219 878713 880156
62481 880156 885574 894436 906602 921273 936495 949855 959519 964703 965475 962265 955428 945081 931086
62468 931086 912940 889893 861729 829590 795568 761275 727159 693323 660435 629489 601036
62457 601036 575088 551470 530057 510952 494643 481577 471412 463120 456011 450125 445451 441550
62445 441550 438305 436308 435919 436599 437734 439450 441990 445032 448345 452418 457568 463009 467761 471835 475455
62430 475455 477656 476993 473436 468343 462716 456628 450272 444204 438347 431958 424912 418004 411665 405387
62416 405387 398853 392762 388016 384742 382493 380711 378703 375856 372326 368950 366198 363801 361614 360139
62402 360139 359836 360519 361779 363367 364870 365778 366315 367473 369674 372036 373605 374765 376659 379588 382765
62387 382765 385464 387738 390067 392898 396583 401305 406897 412963 419247 425809 432928 440886 449712 458995
62373 458995 468172 477152 486474 496713 507937 519902 532577 546252 561254 577791 596070 616470
62361 616470 639558 665888 695763 729365 767216 810235 858974 912886 970664 1031029 1092662
62350 1092662 1153417 1210285 1260449 1302161 1334618 1357458 1370719 1375039 1371672 1362181 1347814 1328793
62338 1328793 1304320 1273705 1237482 1197175 1154250 1109867 1065493 1022906 983322 947006 913900
62327 913900 884087 857405 833140 810487 789073 768846 749738 731547 713848 695961 677368
62316 677368 658218 639072 620141 601271 582652 564958 548620 533541 519674 507373 496934
62305 496934 488289 481384 476295 472735 469943 467390 465183 463536 462319 461397 460912 460945 461373 462304 464071 466426
62289 466426 468369 469391 470418 472821 476763 481121 484899 488079 491082 493997 496601 498842 500986 503225
62275 503225 505294 506736 507713 509296 512590 517665 523772 530535 538449 548255 560391 575157 592784 613189
62261 613189 636210 662256 692175 726406 764910 808101 856952 911722 971281 1034131 1099197
62250 1099197 1164904 1228201 1285554 1334754 1375109 1406238 1427581 1439001 1441160 1435131 1421961 1402367
62238 1402367 1376376 1343440 1303402 1257257 1206693 1153261 1098620 1045187 995630 951407 912260
62227 912260 877236 845886 818498 795566 777110 762288 749736 738445 728146 718676 709442 699981
62215 699981 690593 681737 672931 663000 651414 638782 625979 613366 600997 588968 577369 566306
62203 566306 556201 547662 540862 535348 530669 526864 524210 522846 522847 524346 527244 531026 535173 539684 544952
62188 544952 551208 558344 566265 575184 585383 596783 608846 620966 632784 644058 654364 663192
62176 663192 670347 676020 680414 683637 686218 689516 695286 704806 718565 736685 759416 787164 820162
62163 820162 858107 900121 945061 991787 1038901 1084271 1125219 1159516 1186038 1204438 1214603
62152 1214603 1216917 1212781 1204126 1192029 1175976 1154714 1127775 1096093 1061249 1024446 986420 948183
62140 948183 911349 877339 846508 818509 793462 772275 755659 743211 733705 725982 719391 713718
62128 713718 709002 705251 702181 699501 697649 697846 701025 706894 714479 723440 734419 747948 763236 778137
62114 778137 790277 798309 802323 803208 801846 799055 795984 793876 793105 792709 791059 786828 779349 768717
62100 768717 756052 743298 732222 723570 717415 713985 713649 716225 720837 726624 733322 741074 749886 759380
62086 759380 769000 778386 787558 796682 805818 815103 825117 836659 849970 864552 879969 896516 914811
62073 914811 935006 956709 979395 1002522 1025462 1047768 1069532 1091239 1113256 1135661 1158469
62062 1158469 1181879 1206296 1232091 1258998 1285539 1309361 1328450 1341967 1349942 1352662 1350679 1344938
62050 1344938 1336217 1324511 1309287 1290234 1267334 1240382 1208923 1172838 1132755 1089891 1045658
62039 1045658 1001287 957534 914740 873324 834041 797545 763894 732762 704045 677968 654746
62028 654746 634407 616893 602011 589340 578354 568548 559349 550182 540956 532233 524527 517548 510524
62015 510524 503197 496156 490220 485781 482729 480647 479054 477748 477015 477393 479238 482621 487514 493826 501286
62000 501286 509474 517980 526458 534573 541966 548182 552633 554926 555310 554525 553031 550634 546992 542106 536059
61985 536059 528623 519542 509039 497721 486248 475324 465696 457697 450943 444852 439336 434700 431021
61972 431021 428037 425501 423291 421244 419185 417026 414690 412131 409623 407707 406584 405903 405434 405527 406443
61957 406443 407713 408769 409999 412454 416613 421994 427878 433856 439725 445455 451346 457836 465175 473656
61943 473656 483927 496471 510912 526430 542846 560633 579843 599760 619741 639787 660037
61932 660037 680323 700483 720532 740111 758237 774050 787479 798792 807782 813839 816582 816009
61920 816009 812173 805233 795859 785158 774016 762809 751938 742381 735356 731576 731278 734929 743201
61907 743201 755854 771205 787495 804533 823138 842917 861521 876368 886347 891485 891876 887702
61895 887702 879640 868420 854284 837505 818986 799643 779620 758906 738392 719362 702156 686221
61883 686221 671398 658193 646762 636493 626779 617401 608023 598133 587786 577736 568535 560076 552316
61870 552316 545865 541460 539283 539075 540549 543421 547386 552274 558009 564420 571470 579639 589587 601417
61856 601417 614824 630004 647765 668589 692238 718486 747515 779191 812602 846879 882028
61845 882028 918383 955469 991842 1025828 1056082 1081629 1101767 1115957 1123689 1124662 1119216 1108371
61833 1108371 1093361 1075406 1056043 1037230 1020865 1008357 1000697 998465 1001511 1009038 1020283 1034768
61821 1034768 1051611 1068987 1084721 1097179 1105255 1107757 1103376 1091288 1071599 1045282 1013887 979148
61809 979148 942460 904629 866159 827693 790125 754499 721922 693280 668666 647162 627536
61798 627536 609253 592722 578565 566829 556938 548265 540566 533857 528034 522859 518345 514824 512451
61785 512451 510830 509353 507712 505758 503120 499464 495180 491380 489046 488315 488560 488891 488583 487480 486116
61770 486116 485201 484847 484427 483265 481294 479109 477587 477422 478697 480803 482962 484834 486518 488130 489669
61755 489669 491197 492828 494508 496022 497123 497454 496541 494283 491323 488567 486440 484966 484295 484504 484989
61740 484989 484792 483659 482216 480966 479694 478065 476280 474832 474009 473863 474291 474871 475069 474917 475233 476879
61724 476879 479941 483757 487493 490634 493236 495875 499032 502414 505134 506737 507755 509089 511109 513501
61710 513501 515730 517425 518397 518416 517049 513920 509307 504235 499636 495545 491476 487317 483445 480105 477295
61695 477295 475082 473392 471492 468438 464232 459953 456572 454191 452573 451677 451246 450435 448422 445199 441415
61680 441415 437615 433832 429757 425219 420654 417023 414945 413974 413100 411903 410682 409597 408385 407090 406313
61665 406313 406343 406532 405934 404291 402170 400441 399787 400335 401518 402485 402786 402592 402371 402618 403594 404894 405520
61648 405520 405084 404696 405916 408919 412537 415969 419461 423242 426929 430340 433884 437681 441092 443535 444938
61633 444938 445014 443070 439125 434378 429894 425585 421123 417030 413980 411625 409046 406018 403097 400760 399106
61618 399106 398074 397331 396254 394550 392624 390899 389225 387388 385650 384169 382341 379406 375414 370991
61604 370991 366484 361888 357308 352829 348187 343101 337742 332465 327397 322714 318921 316318 314479 312747
61590 312747 310931 309141 307418 305985 305344 305467 305366 304109 301950 299841 298249 297097 296448 296431 296655 296421
61574 296421 295449 293945 292221 290717 289983 290020 289969 289083 287675 286499 285610 284603 283594 283068 283003 283025 283357 284696
61556 284696 287149 289995 292604 294912 296937 298449 299290 299573 299544 299572 300081 301066 301902 302146 302302 303251 305113
61539 305113 307273 309317 311304 313324 315403 317679 320060 321912 322789 323275 324378 326229 328126 329641 330793
61524 330793 331219 330216 327879 325347 323584 322479 321336 319681 317439 314917 312841 311862 311836 312066 312292 312884
61508 312884 313953 314941 315385 315508 315747 316103 316274 316075 315433 314286 312788 311413 310610 310404 310437 310331 310023 309804
61490 309804 309948 310276 310366 310253 310494 311317 312205 312709 313117 313736 314111 313806 313536 314484 316645 318819 320222 321144
61472 321144 321874 322052 321475 320723 320454 320638 320868 320934 320727 320070 319057 318226 318000 318251 318669 319301 320417 321975
61454 321975 323453 324168 323827 322948 322617 323520 325277 326994 328288 329364 330357 331300 332684 335214 338745 342121
61438 342121 344455 346097 348050 350868 354513 358853 363739 368777 373527 377931 382219 386289 389459 391058
61424 391058 391240 391021 391436 392746 394623 396912 399836 403474 407435 411186 414296 416305 416849 416178 415019
61409 415019 413637 411506 408309 404698 401558 398994 396620 394387 392430 390471 388109 385500 383092 380902
61395 380902 378706 376688 375207 374095 372875 371520 370379 369520 368858 368723 369528 370970 372253 373017 373371 373202
61379 373202 372302 371118 370543 370902 371898 373487 375952 379001 381697 383565 385100 386918 388968 390832 392280
61364 392280 393323 394152 395171 396761 398956 401631 404795 408358 411997 415822 420769 427547 435468 443239
61350 443239 450699 458889 468514 479262 490479 501473 511164 518554 523738 527621 530643 532737 534483
61337 534483 537016 540561 544155 547080 549475 551250 551666 550505 548573 546431 543621 539750 535386 531239
61323 531239 527330 523581 520369 517863 515617 513506 512236 512212 512742 513162 513997 516098 519318 522993 527200
61308 527200 532509 538857 545617 552662 560579 569908 580674 592373 603807 613265 619594 622970 624086
61295 624086 622899 618933 612644 605646 599397 594150 589291 584250 578858 573120 567004 560495 553808 547418
61281 547418 541714 536729 532413 529107 527423 527681 529722 533169 537457 541800 545740 549697 554415 559799
61267 559799 564947 569422 573863 579190 585770 593520 602164 611192 620228 629699 640505 652740 665199
61254 665199 676377 685420 692056 696345 698780 699971 699950 698361 695400 691820 687825 682859 676808 670497
61240 670497 664531 658525 651993 645261 638920 633039 627422 622012 616631 611124 606235 603459 603305 604430
61226 604430 605246 605721 606887 609188 612142 615147 617819 619947 621829 624332 628047 632743 638064 644162 651023
61211 651023 657709 663028 666601 668710 669573 669388 668652 667817 667015 666699 668025 671872 677866 685051 693225 703071
61195 703071 715330 730361 748095 767791 788124 807920 826457 842915 856302 866429 874165 880106
61183 880106 883814 885033 884755 884164 883286 881684 879640 877459 874266 868888 861520 853245 844224 833769 822006
61168 822006 810081 798594 787058 775046 762731 750109 736788 722857 708974 695347 681627
61157 681627 668136 656110 646196 637608 629508 622491 617889 616068 616233 617677 620449 624601 629286 632868
61143 632868 633764 631100 624870 615835 605388 595153 586235 578749 572215 566385 561495 557924 556081 556531
61129 556531 559628 564880 571268 578359 586609 596423 607654 620299 634883 651575 669578 687971 706738
61116 706738 726389 747081 768703 791423 815438 840421 865688 890669 914837 937570 958584
61105 958584 978145 996457 1013165 1027807 1040195 1049845 1055550 1056158 1051506 1042195 1028939 1012600 994288
61092 994288 974716 953770 931295 907899 884417 860986 837264 813241 789374 766294 744855
61081 744855 725995 709951 695925 682960 670801 659587 649284 639926 631819 625005 619052 613758
61069 613758 609427 606063 603180 600931 600405 602030 604613 606923 609339 612861 617311 621796 626486 632588
61055 632588 640749 650453 660875 671554 682494 694322 708038 723972 741409 759755 779432 800984
61043 800984 824093 848308 873983 901599 930795 960946 991993 1023934 1056361 1089435 1124384
61032 1124384 1161980 1201485 1242142 1284672 1329985 1377396 1425480 1473673 1521663 1568462 1614022
61021 1614022 1661032 1713294 1772903 1840522 1917310 2004485 2101583 2207250 2321641 2447002 2587424
61010 2587424 2750236 2946517 3188024 3484867 3848665 4296447 4849021 5528370 6361290
61001 6361290 7383317 8634025 10152065 11980246 14157483 16658868 19304383 21737187
60993 21737187 23550371 24500223 24636334 24245734 23684245 23248676 23144105 23467568 24142662
60984 24142662 24870254 25211832 24801221 23530659 21568243 19222383 16787143 14467735
60976 14467735 12379680 10570220 9038606 7758062 6695568 5819892 5100952 4510875
60968 4510875 4027237 3632385 3309924 3044159 2822038 2633276 2469441 2325017 2198228
60959 2198228 2088410 1993088 1909195 1835841 1773626 1722110 1680059 1647267 1623691 1607071 1593437
60948 1593437 1579946 1565831 1551067 1535771 1520593 1506106 1491959 1477697 1463789 1450576 1436907
60937 1436907 1421247 1403510 1384403 1363671 1340584 1315554 1289591 1262627 1233987 1204147 1174381
60926 1174381 1144964 1115333 1085779 1057370 1030320 1003932 978078 953267 929363 905765 882881
60915 882881 861989 843439 826290 809866 794487 780522 767865 756478 746470 737542 729349 722308
60903 722308 717028 713067 709396 705975 703581 702061 700164 697332 694331 691720 688852 684925 680009 674511
60889 674511 668503 662181 656251 651251 646911 642573 637836 632504 626420 619668 612632 605566 598387 590956
60875 590956 583355 575843 568769 562478 557045 552199 547664 543329 539019 534539 530177 526599 523883 521340
60861 521340 518754 517029 516884 517583 517793 517076 515635 513253 509741 505989 503310 501841 500665 499361 498236
60846 498236 497092 494954 491373 487093 483157 480021 477616 475566 473194 469920 465752 460970 455574 449636
60832 449636 443917 439272 435611 432317 429556 428225 428568 429740 430894 431928 433024 434219 435659 437655
60818 437655 440236 442982 445366 446915 447294 446731 446100 445981 445880 444983 443383 441821 440592 439533 438769 438517
60802 438517 438341 437602 436513 435770 435331 434630 433847 433657 433644 432271 428873 424503 420363 416395 412016 407327
60786 407327 402899 399019 395779 393365 391693 390110 387934 385079 381921 378901 376389 374548 373140 371782
60772 371782 370486 369573 369106 368953 369392 370984 373672 376544 378751 380255 381586 383281 385625 388488 391343
60757 391343 393815 396201 399001 402088 404877 407175 409255 411211 412983 414941 417617 420754 423469 425493
60743 425493 427495 429917 432195 433409 433034 430807 426573 420690 414097 407515 400929 394074 387012 380071
60729 380071 373617 368057 363601 359866 356180 352391 348917 345936 343170 340665 339053 338567 338342 337264 335299
60714 335299 333470 332587 332373 331920 330835 329757 329635 330570 331655 332039 331789 331506 331507 331742 332134 332523 332609 332412
60696 332412 332465 333077 333900 334751 336307 339103 342344 344763 346404 348497 351652 355309 359057 363394 368821
60681 368821 375059 381500 387819 393904 399805 405914 412558 419249 424905 428899 431391 432746 433269 433392 433346
60666 433346 432669 430816 428098 425166 421801 417327 412175 407727 404459 401514 398434 395994 394740 393956 392847
60651 392847 391681 390937 390300 389466 389185 390427 392976 395694 397783 398952 398747 396633 392739 387934 383149
60636 383149 378908 375295 372013 368646 365147 361886 359145 356950 355542 355446 356753 358811 360925 362945 364857
60621 364857 366359 367234 367725 368156 368520 368806 369278 370060 370824 371287 371684 372388 373377 374383 375255 375919 376307 376621
60603 376621 377313 378498 379616 379928 379177 377680 376111 375236 375448 376428 377647 379134 381271 383919 386461 388716
60587 388716 390983 393011 393906 393471 392794 392899 393493 393692 393421 393389 394122 395662 397882 400503 403043 405340 408069
60570 408069 412374 419081 428400 440056 453467 468055 483594 499962 516508 532154 546201 558440
60558 558440 568272 574449 576087 573483 567640 559629 550711 542269 534968 528486 522646 518237 516162 516290
60544 516290 517940 521079 526318 533926 543601 555155 568866 585180 604474 626969 652310 679122
60532 679122 705258 728558 747383 760772 768396 770323 766762 758329 746527 733454 720649 708486
60520 708486 696809 685654 675081 664861 654914 645807 638402 633119 629818 628211 628141 629601 632604 636916
60506 636916 642000 647639 654621 664339 677686 694813 715936 741728 772834 809722 853108 903579
60494 903579 960399 1021571 1085563 1152074 1220355 1287508 1349359 1402622 1445466 1476447 1493845
60483 1493845 1496088 1482288 1452526 1408106 1351474 1285597 1213558 1138802 1065072 995423 931434
60472 931434 873623 822075 776325 735281 698080 664814 635885 610996 589352 570473 554170
60461 554170 539871 526663 513965 501752 490277 479985 471451 464873 459642 454809 449882 444939 440193
60448 440193 435778 431744 427949 424234 420915 418759 418086 418235 418305 418138 418152 418552 419132 419632 419842 419543 418723
60431 418723 417670 416576 415359 414162 413597 414018 414813 414888 413708 411545 408991 406634 404986 404279 404384 405105
60415 405105 406360 407959 409554 411053 412685 414423 415702 416049 415673 415228 415286 416136 417630 419052 419672 419690
60399 419690 420090 421343 422913 424297 425756 427597 429485 431022 432360 433672 434726 435601 437168 440037 443557
60384 443557 446633 449060 451265 453209 454455 455138 456102 458052 461057 464587 467655 469347 469785 470183 471459
60369 471459 473241 474700 475731 476628 477264 477502 477910 479095 480657 481763 482497 483737 485876 488573 491666
60354 491666 495440 500054 505540 512399 521384 532519 544795 556894 567798 576885 583961 589087 591955
60341 591955 591715 587891 581174 572803 563571 554009 544961 537067 530037 523369 517515 513348 510638 508115
60327 508115 505109 502159 499823 497733 495115 491657 487659 483829 480974 479381 478440 477371 476288 476115 477575
60312 477575 480803 485795 492564 500897 510603 522003 535680 551796 570167 590887 614263 640112
60300 640112 667433 694480 718657 736874 747074 749394 745151 734838 718002 695063 668246 640498
60288 640498 614182 590900 571579 556097 543324 532067 521906 513056 505759 499922 495118 490879
60276 490879 487132 484183 482058 480143 477816 475081 472145 468798 464876 461008 458143 456411 455122 453751
60262 453751 452315 450898 449510 448401 447941 448180 448938 450194 451918 453784 455588 457622 460058 462380 464147
60247 464147 465832 467979 469934 470548 469961 469432 469381 468852 467221 465307 464204 463879 463492 462531 461185 460069
60231 460069 459948 461311 463865 466729 469280 471553 473790 476039 478192 480051 481331 481983 482479 483442 485150
60216 485150 487733 491496 496455 501860 506861 511503 516466 522065 528184 534845 541973 548756 554178 558183
60202 558183 561618 565124 568861 573083 577972 582887 586701 588980 590081 590226 589441 588357 587919 588047 587604
60187 587604 585936 583552 581019 578150 574696 571039 567722 564861 562344 560050 557696 555007 552182 549632
60173 549632 547285 544822 542507 540939 540006 539030 537977 537472 537446 536842 535081 532854 531074 529910 529306 529550
60157 529550 530812 532780 535197 538055 540943 543015 544104 545159 547007 549370 551574 553572 555673 557803
60143 557803 559641 561145 562498 563904 565726 568463 572271 576878 582148 588263 595123 602107 608685 614817
60129 614817 620509 625440 629301 632096 633920 634789 634842 634386 633730 633282 633554 634539 635359 635232 634561 634236 634092
60112 634092 633147 631307 629672 628929 628561 627999 627509 627451 627448 626795 625052 622002 617747 613108 609137 605952 602753
60095 602753 599190 595926 593676 592535 592510 593802 596259 599346 602877 607014 611474 615705 619904 624685 629523
60080 629523 632830 634004 634172 634346 634050 632428 629534 625736 620824 614535 607181 599119 590442 581716 574001
60065 574001 567493 561097 554045 546917 540421 534259 528091 522528 518102 514171 509952 505868 502816 500763
60051 500763 499170 498178 498260 499166 500239 501441 503131 505146 506962 508519 510184 512182 514630 517706 521258
60036 521258 524704 527728 530433 532406 532553 530569 527728 525330 523114 520104 516274 512303 508257 503601
60022 503601 498223 492503 486639 480685 474978 469878 465404 461597 458672 456316 453548 449973 446458 443801
60008 443801 441533 438867 436058 433783 431915 429956 428104 426797 425778 424694 424047 424421 425217 425351 424840
59993 424840 424544 424731 425119 426023 428199 431614 435476 439364 443284 446724 448835 449605 449890 450220 450406 450290
59977 450290 449966 449310 448122 446772 445868 445346 444630 443656 442939 442704 442773 443267 444579 446559 448461 449791 450652
59960 450652 451289 451896 452805 454256 455962 457330 458019 457899 456799 454882 452935 451726 451297 451367 451946 452908 453514
59943 453514 453133 452068 450880 449450 447562 445870 445127 444780 443519 441131 438791 437541 437448 438244 439811 441926
59927 441926 444312 446991 449997 452925 455524 458501 462829 468326 473830 478764 483785 489833 497189 505334
59913 505334 513102 519268 523761 527996 533139 538385 541939 543411 544085 544953 545685 545664 544856 543397 541287 538825
59897 538825 536538 534420 531967 529211 526985 525996 526183 527072 528217 529235 530077 531290 533515 536795 540842
59882 540842 545667 551268 557033 562344 567536 573391 579830 585987 591380 596053 599751 602004 602921 602853 601386
59867 601386 597817 592702 587727 583896 580927 578565 577204 576799 576324 574973 573112 571504 570358 569617 569540
59852 569540 570477 572528 575798 580617 587323 596091 606769 618254 628160 634082 635419 633462 629802 625487
59838 625487 621604 619494 619831 622068 624931 626959 626684 623228 617037 609419 601330 593210 585735 579647 574721
59823 574721 569930 564854 559981 555497 550898 546227 542632 541063 541122 541685 542103 542359 542603 542896 542958 542042 539574
59806 539574 535979 532230 528640 524893 521233 518602 517297 516445 515122 513161 510609 507303 503433 499727
59792 499727 496670 494201 492426 491753 491966 492000 491143 489681 487996 485875 483262 480909 479547 478952 478422 477745
59776 477745 477197 476981 477156 477806 478963 480612 482865 485712 488573 490721 492281 494159 496862 500057 503347
59761 503347 506716 510010 512856 515430 518465 522056 525223 527140 528214 529473 531477 534257 537771 541943
59747 541943 546608 551655 556877 561669 565440 568408 571286 574169 576519 578336 580354 582764 584725 585549
59733 585549 585479 584838 583344 580919 578405 576767 576105 575908 575716 575040 573352 570791 568379 566987 566426 565943
59717 565943 565095 563762 561831 559353 556615 553772 550824 548177 546662 546662 547718 549226 550953 552678 554005
59702 554005 554899 555863 557239 558774 560035 560801 560984 560776 560809 561500 562382 562888 563530 565058 566642 566493 564586
59685 564586 563053 563266 564141 564204 563816 564050 564644 564511 563442 561928 559864 556703 552408 547209 540958 533834
59669 533834 527195 522440 519246 516031 512028 507945 504597 501885 499283 496664 494417 493125 493125 494158 495638
59654 495638 497447 500120 504021 508787 513848 518875 523382 526556 528019 528241 527768 526614 524845 523037 521490
59639 521490 519651 516933 513545 509966 506326 503021 501144 501311 502560 503352 503244 502751 502012 500615 498531
59624 498531 496253 494078 491889 489582 487124 484407 481536 478937 476678 474093 470703 467098 464254 462365
59610 462365 461046 460252 460225 460835 461794 463304 465717 468681 471351 473346 474916 476366 477905 479869 482401
59595 482401 485044 487171 488658 489653 490017 489662 489147 489176 489607 489674 489161 488711 488921 489644 490244 490112 488973 487081
59577 487081 485097 483460 481936 480056 477850 475855 474469 473580 472703 471413 469848 468758 468622 468662 467465
59562 467465 464819 462267 461382 462140 463456 464654 465722 466628 467193 467423 467440 467391 467832 469665 473086 477056 480490
59545 480490 483620 487505 492638 498819 506135 515167 526270 539531 555613 575808 600398 626771 649554
59532 649554 663270 665636 658602 646279 632251 618979 608626 602752 601073 601807 603670 606521 609917
59519 609917 612515 613608 613936 614037 612895 609361 603941 597970 591669 584215 575238 565205 554731 544453
59505 544453 535148 527055 519436 511665 504296 498198 493208 488676 484866 482607 481745 481083 479832 478285 477072
59490 477072 476550 476819 477641 478359 478463 478145 477891 477859 478099 478929 480483 482359 484335 486937 490592 494763 498691
59473 498691 502490 506622 510725 513925 516047 517677 519252 520836 522555 524515 526479 528253 530124 532428
59459 532428 535096 538141 542017 546934 552475 558520 565776 574580 583916 592533 600318 607588 613874 618652
59445 618652 622493 626102 628708 628789 625968 620859 613544 603901 593248 583962 577160 572129 568152 565480
59431 565480 564090 562880 560893 558604 557361 558063 560718 564809 569828 575823 583528 593686 606288 620791
59417 620791 636884 654642 674094 695132 717767 742346 769467 799099 828597 851742 861659 856036
59405 856036 838835 816428 793331 772141 755369 745144 742081 746060 756858 771881 784346 786594
59393 786594 775704 754542 727937 699764 673089 650279 631968 617430 606296 598598 593205 588169
59381 588169 582994 579011 577179 576993 577789 579476 581635 583496 585290 588154 592250 596441 600243 604477 609458
59366 609458 614106 617750 621360 626008 631203 635716 639169 642114 645325 649643 655657 662922 670208 677007
59352 677007 684092 692308 701724 712261 724151 737280 750970 764890 779360 794415 809345 823510
59340 823510 836757 848677 858355 865216 869337 870624 868588 863237 855358 845587 834077 821276 808060
59327 808060 794715 780681 765748 750728 736635 723886 712592 702800 694217 686373 679203 672788
59315 672788 666613 660034 653407 647763 643409 639936 637481 636592 636802 636867 636765 638073 641901 647876 655765
59300 655765 666679 681592 699343 716743 730037 736103 733391 722593 706009 686082 664894 644526
59288 644526 626556 611107 597584 586358 578402 573321 569406 565965 564028 564324 566188 569076 573542
59275 573542 579901 587317 595111 603776 613915 625271 637495 650639 664186 676810 687888 698090
59263 698090 707834 716302 722670 726957 728914 727484 722393 715112 707208 698863 689839 680753 672329 664516
59249 664516 657342 651573 647459 643942 640227 637176 635963 636289 637057 638024 639623 641933 644967 649301 655224
59234 655224 661796 667728 672764 677402 681858 686011 689677 692195 692500 690368 686819 682604 677264 670485
59220 670485 663340 657137 651955 647367 643677 641174 638870 635365 630575 625499 620665 615760 610488 604881
59206 604881 599098 593592 589066 585619 582428 578842 575209 572145 569751 568085 567471 567636 567529 566852 566768 568157
59190 568157 570113 571227 571543 572081 573222 574736 576795 579719 583137 586422 589586 592950 596437 599998 604073
59175 604073 608797 613420 617436 621627 627027 633511 640303 647243 654583 662254 670280 679235 689196 698890
59161 698890 706954 713369 718594 722040 722700 720763 717193 712099 704790 695318 684790 674215 663967 654273
59147 654273 645330 636952 628774 620705 612777 604906 597215 590087 583449 576723 569924 563873 558761 553572
59133 553572 547803 542654 539435 537783 536661 536159 536924 538589 540312 542324 545468 549582 553794 558187 563778
59118 563778 570921 578939 587351 596460 606700 618200 630867 644165 657045 668813 679812 690675
59106 690675 701301 711158 719964 727462 733212 737382 740975 744424 746757 747045 745798 743824 740665 735529
59092 735529 729160 723385 719242 716657 715390 714995 714392 712782 710651 708734 706393 702275 696135 688800 680764
59077 680764 672108 663452 655636 648590 641642 634780 628617 623399 618995 615528 612979 610564 607481 603858
59063 603858 600059 595673 590355 585068 581229 578917 577088 575124 573010 570474 567209 563753 561061 559404
59049 559404 558474 558051 557767 556972 555789 555411 556295 557071 556543 555639 555838 556733 557034 557029 557927 559411 560109 560169 561203
59030 561203 563693 566504 569101 572341 576909 582632 589542 598029 607845 618494 630594 645146 661320
59017 661320 676573 689197 699274 707007 711834 713530 712761 710113 705826 700686 695888 691840 688238 685324
59003 685324 683768 683412 683621 684860 688338 693934 699982 705357 710349 715280 719732 723417 726427 728374 728635
58988 728635 727698 726859 726294 724743 721358 716558 710894 704559 698357 693743 691312 690337 690193 691154 693564 697309
58972 697309 702386 708962 716783 725530 735677 747724 760697 772835 783813 794857 806550 818091
58960 818091 828824 838922 848154 855532 860661 864101 865951 865326 861561 854675 844380 830103 812531
58947 812531 793821 775704 758329 741323 724873 709459 695614 684190 675789 669723 664608 659992
58935 659992 656228 652906 648927 644315 640425 638021 636505 635275 634489 634197 634040 634006 634209 633896 632142 629592
58919 629592 627900 627331 626613 625288 624318 623942 622936 620726 618508 617541 617903 619634 623394 629081 635255 640918
58903 640918 646732 653776 662341 672540 684707 698430 712372 725767 738997 752256 765020 777349
58891 777349 790346 804734 820339 837538 857624 880895 905716 930224 953642 975217 993376
58880 993376 1006976 1016310 1022000 1023963 1022155 1017178 1009329 998050 983061 965181 945616 925433 906047
58867 906047 888945 874398 861581 850265 841079 833806 826995 819790 812643 805700 798012 789017 779333
58854 779333 769428 758956 748039 737668 728128 718560 708764 699882 692540 685851 679061 672587 666654
58841 666654 660505 653861 647543 641740 635299 627690 619990 612895 605506 597369 590039 585130 582176 579795
58827 579795 577693 576148 574807 573391 572606 573090 574461 576433 579712 584618 589970 594559 598638 602859 606905
58812 606905 610332 613627 617175 620194 621948 623102 624695 626578 627870 628094 627003 624280 620291 616192
58798 616192 612486 608516 603998 599746 596119 592188 587314 582133 577118 571777 566389 562831 562236 563252
58784 563252 563981 564363 565301 566830 568651 571234 574913 578962 582900 587522 593216 598513 601788 603245 603751
58769 603751 602929 600038 595749 591375 587208 583097 579817 578274 578015 577919 577703 577542 577026 575807 574478 573662
58753 573662 573024 572275 572163 573250 574690 575494 576083 577364 579213 581148 583534 586827 590519 594075 598054
58738 598054 603159 609104 615484 622723 631040 639552 647591 655763 664576 673255 681183 689212 698125 706996
58724 706996 714481 720590 725774 729587 731801 733726 736767 740683 744761 749629 756302 764407 772876 781458
58710 781458 790044 797506 802675 805587 806490 804749 800046 793395 785452 775166 761643 745958 729437
58697 729437 711557 691502 670531 650729 632485 615212 599553 586703 576316 567106 558891 552161
58685 552161 546280 540037 533489 527599 522569 518008 514133 511369 509379 507776 506970 507131 507382 507286 507934 510253
58669 510253 513631 517602 523294 531531 541154 551131 562708 577232 593208 607745 619662 628950 634573
58656 634573 635366 632208 626977 620194 611774 603025 595588 589256 582970 577015 572228 568211 564476 562044
58642 562044 561542 561079 558591 555054 552739 551516 549810 548093 548236 550085 551805 553172 555547 558858 561401
58627 561401 562488 562804 562416 560950 559330 558969 559580 560048 560810 563024 566164 569024 572302 577464 583839 589666
58611 589666 595178 601571 607655 610913 611547 612183 613695 614544 614146 613611 612993 611014 607903 605558 604491 603286
58595 603286 601333 599356 597160 593661 589443 586557 585613 585685 587116 591506 598714 606752 614958 624470 635256
58580 635256 645612 655047 664827 675119 684303 691685 698243 704205 708503 711227 714117 718176 723169 729801
58566 729801 739713 752977 768186 785438 806549 831774 858865 885893 912528 938089 960912 980234
58554 980234 996409 1008895 1016420 1019339 1019365 1016877 1011110 1003040 995133 987983 980137 971436 963351 955484
58540 955484 945008 930541 913750 896283 877959 858834 840307 823121 806694 791203 777945
58529 777945 767089 757537 749432 744173 741542 739624 738034 738358 740854 743647 745759 748018 750331 751092
58515 751092 750020 748670 747432 745000 741450 738720 737218 735074 731579 728238 725569 722106 717583 713874
58501 713874 711583 708858 704798 701012 698562 696355 693766 691849 690759 688969 686294 684740 685172 686114 686996
58486 686996 689488 694334 699993 705729 712970 722271 732087 741977 753879 768588 783941 798021 811212
58473 811212 823665 833745 840564 845175 847775 846660 841326 833724 825108 814731 802940 792275 783996
58460 783996 776758 770225 766650 767213 770086 773902 779829 788425 797746 806461 815631 825420 833213 836965
58446 836965 837507 835822 831302 824463 818031 813286 808503 802827 798396 796728 796422 796407 797915 801175 803741
58431 803741 804447 805574 808867 812852 816417 821437 829279 838167 846581 855859 866846 877311 885331 891837
58417 891837 897295 899473 897313 893517 890342 886280 879806 872826 867158 860989 852296 842758 834954 828587
58403 828587 822618 818161 816022 814252 811397 809472 810667 813850 817216 821492 827552 833757 838664 843551
58389 843551 849412 854457 857331 859678 862696 864558 864210 864225 866717 869866 871817 874532 880307 887743 894625
58374 894625 901511 909109 915568 919917 924843 932501 940888 947793 954794 963712 972783 980248 988191 998883
58360 998883 1010657 1021279 1031889 1043783 1054890 1063408 1071287 1080160 1087657 1091926 1095818 1102119 1108512
58347 1108512 1111888 1113855 1117248 1121071 1123807 1127943 1136040 1145855 1154481 1163793 1176655 1191314 1204852
58334 1204852 1218690 1235296 1252847 1268606 1284237 1302247 1320352 1334873 1346505 1357405 1365969
58323 1365969 1370066 1372154 1375644 1379453 1381460 1383632 1388185 1392552 1394186 1396504 1403889 1414513 1424304 1434251
58309 1434251 1447259 1461636 1474527 1488213 1506067 1525631 1542631 1558459 1576812 1596333 1613626
58298 1613626 1630110 1648829 1667935 1684412 1700649 1720119 1740418 1758093 1776319 1799796 1825903
58287 1825903 1849272 1871435 1897438 1926413 1954269 1982358 2014655 2049471 2082689 2116032 2153383
58276 2153383 2192288 2228053 2262875 2301796 2343112 2382157 2421090 2465238 2513170 2560216 2608349
58265 2608349 2662516 2720670 2777651 2835458 2899320 2967295 3034387 3103035 3178306 3256509 3330168
58254 3330168 3400619 3474077 3549292 3621310 3693430 3772623 3856941 3940392 4026283 4122349 4226744
58243 4226744 4332747 4443127 4565425 4697341 4831904 4972758 5128493 5296167 5466956
58234 5466956 5643957 5837213 6045288 6259728 6483684 6727485 6989805 7262678 7551148
58225 7551148 7867594 8210607 8570744 8953301 9373102 9830693 10317063 10838098 11409824
58216 11409824 12033494 12701508 13424401 14224983 15110106 16077332 17145134 18345488 19691533
58207 19691533 21186751 22862107 24768257 26936762 29390248 32188668 35425925 39191036
58199 39191036 43586642 48786114 55023885 62541701 71614158 82629944 96083122 112491411
58191 112491411 132399352 156440157 185277169 219466506 259394312 305001788 354789694
58184 354789694 404512239 447119586 474953483 483019944 470903831 442169590 402304289
58177 402304289 356884169 310584408 266738356 227234260 192783841 163395252 138719159
58170 138719159 118196148 101178643 87073045 75386474 65679394 57555880 50710509
58163 50710509 44927664 40023366 35827022 32214848 29108588 26429916 24090594 22028162
58155 22028162 20212304 18609674 17174319 15876150 14707382 13655673 12697937 11823535
58147 11823535 11036677 10331760 9690044 9103018 8575664 8104283 7673503 7277231 6920402
58138 6920402 6597506 6290708 5992466 5710326 5446721 5193405 4948715 4721343 4513211
58129 4513211 4315851 4126944 3953688 3796665 3646695 3501008 3366994 3246647 3132400
58120 3132400 3021537 2920026 2828650 2739523 2649998 2566653 2491984 2420077 2348756 2283388 2225176
58109 2225176 2167832 2109240 2054745 2005654 1955901 1903395 1853586 1808611 1763649 1717102 1673720
58098 1673720 1634580 1594425 1552118 1513516 1480781 1448799 1415319 1384761 1358751 1332616 1304715
58087 1304715 1279871 1260141 1241305 1221849 1206227 1195520 1183723 1167185 1149409 1132877 1114448
58076 1114448 1092677 1071561 1052994 1033106 1009987 987624 968422 949068 927671 907860 891891
58065 891891 876452 859292 843531 831540 820785 809454 800170 794439 789196 782323 775870 770548 762900
58052 762900 751419 739858 730990 722454 712157 702427 695316 688780 680835 672821 665591 657232 647330
58039 647330 638621 631771 623507 612613 602704 596244 590842 584282 578103 573160 566742 557384 547807 539887
58025 539887 531289 520243 509179 500457 492801 485040 479061 475921 473195 469240 466025 464879 463517 460273
58011 460273 457206 456072 455176 453081 451468 451465 451168 449626 449234 451177 452641 451653 450662 452063 454063 454382
57995 454382 454312 455567 456589 455477 453473 452198 450500 447218 444067 442647 441512 439161 436931 435954 434234
57980 434234 429783 423886 418413 412771 406278 400567 396760 393143 388439 384405 382447 380758 377760 375184
57966 375184 374610 374127 371887 369975 371079 373860 375328 375539 376411 377958 379101 380354 382363 383536 382218
57951 382218 379628 377795 376310 373842 371061 369291 368035 366546 366113 368142 371637 375073 378977 384261
57937 384261 390021 395517 402347 412021 423334 434682 446916 461067 475257 486851 495941 503797 509586
57924 509586 511562 510052 506419 500491 491797 481987 473246 465447 457388 449544 443113 437639 432104 427162
57910 427162 423861 421425 418634 416146 415098 414723 413662 412291 411432 410066 406757 402086 397424 392569 386814
57895 386814 380999 376197 371770 367046 363518 362906 364317 365710 366927 368849 370857 371714 371923 372757 373966
57880 373966 374693 375476 376944 377660 375848 372310 369188 366723 363663 360080 357287 355510 353865 352147 350792
57865 350792 349709 348878 349282 351544 354617 357419 360585 364979 369898 374564 379823 386311 392507 396831 400145
57850 400145 403881 407223 408647 408840 409404 409882 408686 405841 402205 397195 390063 382404 376513 372052 367028
57835 367028 361281 356250 352024 347486 342872 339469 337178 334875 332716 331623 331060 329824 328538 328816 330439
57820 330439 331874 333132 335512 338942 342101 344887 348196 351484 353051 352487 350459 346398 339063 329325
57806 329325 319881 312121 305480 299754 295695 293324 291877 291455 292609 294493 295665 296622 299234 303681 308142
57791 308142 311500 314209 316558 318304 319980 322497 325438 327787 330076 333631 338026 341693 344850 349229
57777 349229 354865 359818 363376 366979 371450 375643 378458 380094 380723 379942 378072 376185 374367 371600 367546
57762 367546 362783 357238 350334 342720 335910 330085 324222 318427 313967 310940 308133 305426 304051 304156
57748 304156 304451 304728 306443 310099 314211 317545 320425 323182 325311 326851 328666 330643 331492 331008 330702
57733 330702 331532 332768 333690 334512 335014 334216 332301 330996 331174 331704 331447 330700 329907 328665 326875 325199 323525
57716 323525 320532 315681 310156 305074 300277 295629 291833 289012 285976 281922 277492 273377 269278 265121
57702 265121 261821 259829 258165 255856 253205 250840 248715 246838 245742 245391 244772 243358 241834 240724 239570
57687 239570 238208 237497 237867 238369 238170 237938 238803 240915 243946 248111 253827 261133 270261 282125 297674
57672 297674 317474 342356 373671 412441 459088 514378 579572 654676 736333 816789 884212
57661 884212 925374 931353 902587 848130 779715 706848 636121 571907 516101 468558 428916 397232
57649 397232 372607 352737 335682 321007 308783 298747 290893 285484 281887 278691 275488 273181 272095
57636 272095 271279 270236 269712 270028 270187 269518 268744 268523 268292 267451 266393 265481 264266 262539 260900 259496 257570
57619 257570 255004 252862 251535 249821 246833 243452 240844 238892 237072 235478 233868 231156 227166 223667
57605 223667 222376 223020 224494 226665 229751 233037 235554 237150 237797 236937 234717 232701 232042 231960 231224 230040
57589 230040 229064 227676 224897 221243 218057 215599 213224 210952 209480 208957 208885 208908 208769 207998 206541 205143
57573 205143 204228 203059 200827 197806 194669 191582 188827 187261 187033 186817 185454 183447 181725 180043 177972
57558 177972 176402 176408 177384 177890 177782 177999 178759 179481 180116 181090 182253 183193 184252 185940 187675 188423 188280 188207
57540 188207 188547 189106 190328 193018 196980 201116 204713 207563 209151 209047 208018 207497 207891 208447 208697 208974
57524 208974 209452 209723 209513 209025 208480 207935 207541 207503 207866 208754 210384 212402 213758 213902 213561 213708 214404 215303
57506 215303 216497 217953 218937 219002 218837 219102 219166 218202 216793 216037 215657 214463 212336 210268 208649 206931 204941
57489 204941 203259 202203 201482 200865 200269 199380 198109 197202 197395 198259 198837 199086 199585 200237 200473 200482 200936 201670
57471 201670 201938 201851 202249 203144 203587 203206 202670 202413 202032 201212 200348 199933 200077 200648 201177 200771 199001 196820
57453 196820 195666 195761 196129 196159 196095 196084 195878 195598 195805 196614 197514 198175 198736 199366 200231 201721 203909 206007 207232
57434 207232 207900 208718 209324 208742 207133 205910 206065 207423 209459 211698 213354 213802 213631 214205 215992 218194
57418 218194 220038 221435 222386 222804 223012 223451 223874 223748 223343 223326 223477 223099 222650 223479 225685 227670 228253 227972
57400 227972 227788 227745 227583 227591 228089 228781 229276 229695 230334 231276 232566 234161 235587 236355 236842 237951 239804 241591
57382 241591 242843 243967 245358 246951 248926 251895 255962 260292 263934 266476 267865 268388 268955 270515 272970
57367 272970 275347 277031 278140 278879 279537 280931 283617 286687 288658 289610 291040 293496 295937 297785 299956
57352 299956 303088 306216 308153 309034 309617 310181 311000 312878 316159 319961 323230 325861 328108 329785 330926
57337 330926 332382 334802 337627 339941 341735 343504 345170 346259 346778 347173 347762 348741 350356 352595 355114
57322 355114 357808 360852 363858 365863 366703 367596 369595 372220 374456 376512 379655 384537 390411 395892 400011
57307 400011 402781 405070 407748 410814 413759 416679 420234 424439 428528 432331 436653 441740 446483 449975
57293 449975 452893 456445 460821 465611 470957 477172 483806 490239 496839 504574 513732 523825 534418 545237
57279 545237 555759 565576 574988 584549 594227 603597 612522 621016 628736 635297 640860 645912 650656 655093
57265 655093 659286 663096 666108 668310 670330 672514 674417 675823 677519 680238 683528 686690 690260 695386
57251 695386 702038 709040 715766 722724 730414 738590 746808 754936 762939 770872 779174 788346 798177 807884
57237 807884 817111 826272 835770 845370 854545 863092 871289 879645 888585 898260 908700 920127 932768
57224 932768 946277 959834 973115 986764 1001547 1017402 1033681 1049914 1065975 1081910 1097975
57213 1097975 1114396 1130675 1145647 1158687 1170419 1181895 1193688 1206229 1220162 1235503 1251070
57202 1251070 1265682 1279602 1294024 1309578 1326110 1343455 1361518 1379953 1398685 1418391 1439543
57191 1439543 1461296 1482371 1502832 1523933 1546331 1569493 1592843 1616372 1639948 1663020 1685411
57180 1685411 1707654 1730201 1752810 1774879 1795917 1815636 1834099 1851752 1868724 1884232 1897451
57169 1897451 1909032 1920988 1934829 1950314 1966132 1981258 1995525 2009481 2023836 2038712 2053424
57158 2053424 2067345 2080783 2094480 2108483 2122308 2136039 2150362 2165371 2180232 2194331 2208101
57147 2208101 2222421 2237694 2253752 2270106 2286060 2301060 2315241 2329351 2344119 2360023 2377577
57136 2377577 2397241 2418928 2442148 2466656 2492500 2519401 2546741 2574220 2601948 2629827 2657473
57125 2657473 2684963 2712987 2742016 2771906 2802571 2834576 2868822 2906080 2947044 2992273 3041797
57114 3041797 3095181 3152255 3213524 3279903 3352699 3434120 3527204 3635004 3760244 3906027 4076381
57103 4076381 4275974 4510102 4785705 5112369 5502347 5970347 6533837 7213118 8030539
57094 8030539 9009619 10174509 11548390 13150065 14990553 17071599 19385123 21911815
57086 21911815 24619819 27465573 30396040 33349556 36255537 39036064 41609354 43890887
57078 43890887 45791042 47215853 48077557 48311230 47886550 46809788 45121780 42897496
57070 42897496 40243424 37286121 34154293 30964314 27814549 24784675 21935011 19306262
57062 19306262 16921762 14790982 12911877 11272597 9854336 8634802 7590509 6697953
57054 6697953 5934878 5281398 4720006 4234889 3811738 3438156 3104181 2802836 2530429
57045 2530429 2285546 2066989 1872632 1700103 1547536 1412976 1293760 1187240 1091747 1006336
57035 1006336 930287 863582 807381 763249 732247 715112 712770 726520 758695 812684 888762
57024 888762 976672 1053683 1094297 1084656 1028397 940400 837171 731852 633322 546099 471135
57013 471135 407928 355864 313570 278484 248248 221997 199703 180934 164881 150913 138417
57002 138417 126625 115152 104290 94287 84804 75419 66231 57639 49983 43681 39172 36407 34828
56989 34828 34142 34774 37501 43126 52476 65949 82771 101192 119391 135591 147440 152488 149782
56976 149782 140442 126433 109535 91599 74687 60178 48222 38458 30785 25243 21816 20655 21939
56963 21939 25349 30442 37725 48514 63453 82014 103687 128539 155798 182512 204262 216971
56951 216971 218232 208163 189689 167183 144065 121878 101470 83834 69391 57676 48539 42769
56939 42769 40817 41923 45357 51657 61728 75526 92706 113907 140220 171570 206119 240447
56927 240447 269540 287650 291018 280032 258184 229276 196417 162851 131930 105666 84043 65994
56915 65994 50603 37459 26534 17945 11517 6663 2914 220 -1570 -3081 -4651 -5734 -5680 -4787 -3890
56900 -3890 -3229 -2465 -1548 -724 285 2408 6414 12465 20442 30283 42056 56072 72847 92633 115116
56885 115116 139750 165970 192497 216611 234721 243945 243347 234312 220050 204248 189478 176698
56873 176698 166176 158348 153628 152109 153963 159644 169227 182122 198075 218082 243790 276329 316200
56860 316200 363810 419248 481131 545390 604696 649512 671536 667809 641886 601039 552700 503087
56848 503087 457130 417911 386363 362309 345567 335838 332589 335965 347224 367528 397073 436183
56836 436183 486365 549249 625262 714047 814445 921410 1022912 1102133 1144500 1143664 1102744
56825 1102744 1031924 944459 852233 762975 680835 608548 547950 499068 460611 431833 412960
56814 412960 403808 403339 411058 427845 454893 492618 540989 600023 668879 743981 817629 878423
56802 878423 914393 917984 889452 835831 766848 691526 616889 547582 485912 432823 388919 354211
56790 354211 327501 307174 292620 284127 281718 285168 294924 311749 335419 364816 399172 437656
56778 437656 477118 511274 532993 537446 523653 494347 454719 410256 364860 320845 280076 244157
56766 244157 213586 187772 166034 147927 132778 119858 109000 100192 92715 85700 79387 74604
56754 74604 71057 67436 63387 59983 57893 56344 54374 52033 49812 47869 46357 45592 45437 45245 44740
56739 44740 44129 43193 41314 38770 36877 36356 36530 36611 36775 37417 38320 39207 40311 41747 43075 44034 44933
56722 44933 45879 46422 46455 46629 47371 48273 48979 49751 50592 50763 49929 49026 49228 50582 52245 53386 53382 51992 50029
56703 50029 49061 49643 50515 50275 49046 47738 46533 45198 44290 44702 46206 47576 48235 48926 50586 53209
56687 53209 56014 58300 59902 61048 61973 62788 63773 65478 68072 70738 72333 72711 72694 72717 72303 71116 69750
56670 69750 69008 69027 69568 70576 71984 73352 74154 74242 73995 74273 75992 79090 82051 83312 83098 82958 83567
56653 83567 84129 84065 83947 84307 84759 84944 85336 86442 88040 89812 91876 94200 96327 98212 100429 103094
56637 103094 105505 107338 109076 110716 111299 110482 109389 108929 108358 106581 103885 101219 98666 95856 93239
56622 93239 91617 90850 90096 89023 87927 87008 86357 86191 86305 85781 84076 81928 80464 79861 79597 79387 79154
56605 79154 78669 78023 77901 78617 79448 79685 79644 79850 79916 79179 77853 76637 75736 75095 74963 75347 75645 75773 76895
56586 76895 79926 83931 87211 89423 91460 93700 95623 96903 97747 98317 98778 99621 101024 102239 102506 102282
56570 102282 102626 103753 105057 106235 107520 109200 111614 115145 119453 123457 126995 131644 138721 147093
56556 147093 154288 159197 162437 164696 166237 167675 169652 171836 173546 175184 177771 181204 184295 186384
56542 186384 187677 188135 187452 186098 185030 184268 182965 180932 178874 176978 174578 171425 168212 165520 163251
56527 163251 161327 160047 159510 159472 159892 160913 162238 163295 163939 164276 163937 162363 159679 156505 153097 149522
56511 149522 146337 144087 142314 140087 137386 134962 133083 131395 129873 128854 128289 127937 128027 128693 129112 128431
56495 128431 127280 127034 127815 128564 128985 129924 131773 133856 135570 136873 137542 137227 136391 135991 136020 135611 134668
56478 134668 134131 134384 134657 134296 133526 132682 131806 131283 131714 132873 133811 134252 134874 136014 137155 137923 138580 139293
56460 139293 139832 140181 140549 140754 140558 140537 141575 143498 145305 146614 147661 148100 147290 145829 145196 145630 145851
56443 145851 145252 144873 145778 147767 150135 152433 154054 154402 153944 153934 154692 155323 155465 155942 157262 158817 160092
56426 160092 161370 162651 163179 162651 161768 161070 160406 159981 160490 161616 161833 160531 159097 158972 159838 160668 161443
56409 161443 162725 164361 165634 166224 166264 165988 165870 166445 167506 168099 167691 166693 165634 164684 164241 164964 166764
56392 166764 168706 170304 171996 174002 175688 176492 176544 176077 175154 174300 174350 175364 176674 178198 180528 183476
56376 183476 185878 187284 188540 190170 191438 191631 191103 190438 189682 188974 188873 189509 190424 191624 193673 196369
56360 196369 198577 199806 200749 201863 202791 203606 205070 207014 208007 207463 206663 206774 207204 206893 206002 205254 204589
56343 204589 203518 202034 200432 198939 197937 197692 197531 196420 194631 193585 193813 194495 195310 197047 199852
56328 199852 202686 205254 208750 213832 219490 224778 229942 234899 238446 240226 241831 244566 247540 249281
56314 249281 249956 250664 251730 252956 254479 256267 257782 259053 260904 263382 265321 266258 267244 269002 271011
56299 271011 273325 277238 282856 287977 290992 293107 296087 299573 302506 305542 309957 315362 320527 325456
56285 325456 330826 336302 341142 345656 350530 355586 360490 365652 371166 376125 380362 385479 392658 400887
56271 400887 408941 417581 427919 439146 450018 461356 474852 490354 506482 523051 540846 559863
56259 559863 579821 601763 627163 656087 688156 724607 767441 817017 872333 933244 1000678
56248 1000678 1075185 1156942 1246712 1345044 1450821 1561931 1676860 1794389 1912522 2029122
56238 2029122 2142711 2251104 2350066 2434975 2503271 2553924 2585479 2596331 2586302 2556502 2508309
56227 2508309 2443838 2366549 2279947 2186246 2087216 1985123 1881717 1777773 1675006 1576837
56217 1576837 1485522 1400039 1318601 1241789 1171256 1106853 1047267 992271 942161 896072 852957
56206 852957 813210 777458 744994 715285 689491 668301 649800 631834 615063 601223 589835
56195 589835 579270 569652 561814 554661 546585 538538 532695 528880 525202 521407 518592 516340 513160 509382
56181 509382 506739 505451 504387 503634 504175 505426 505772 505198 504933 505097 505273 506645 510699 516277 520740 523616
56165 523616 526498 529944 533352 537294 542985 549785 556163 562761 571552 582289 592728 602208 612132 623164
56151 623164 634812 647612 662931 680652 699673 720486 744854 773495 806655 846291 894863
56140 894863 952732 1019667 1097975 1190737 1297246 1413041 1533476 1653799 1766782 1864752
56130 1864752 1944700 2008704 2060031 2102194 2140681 2180570 2221281 2256766 2281242 2292209 2289101
56119 2289101 2273408 2250363 2226305 2203182 2178031 2147236 2107784 2055150 1984854 1897251 1797690
56108 1797690 1691824 1583970 1479475 1384107 1300285 1227200 1164821 1114259 1074390 1042128 1016241
56097 1016241 997178 983294 971356 960818 953460 948785 944104 939311 937091 937978 939616 941257 944561
56084 944561 949522 954086 958378 964779 973215 980812 986822 993512 1001621 1009470 1017036 1026365 1037395 1048009
56070 1048009 1058644 1072066 1088091 1103478 1117505 1132671 1149402 1165371 1180650 1198097 1217778
56059 1217778 1236407 1253125 1270374 1288286 1303915 1317011 1330843 1346264 1360694 1373882 1388747
56048 1388747 1405548 1421406 1436631 1455138 1477435 1499747 1521295 1545626 1573276 1600229 1625357
56037 1625357 1652243 1681728 1710012 1736348 1765247 1798559 1832644 1865941 1902046 1942595 1984435
56026 1984435 2026494 2072002 2121155 2169241 2214962 2262937 2315127 2367703 2419407 2474716 2535472
56015 2535472 2597642 2659718 2725855 2797342 2869633 2941400 3017665 3100422 3185426 3271881 3365562
56004 3365562 3468342 3574589 3682093 3796210 3918930 4044854 4172777 4309920 4459396
55995 4459396 4615043 4774152 4943303 5125790 5315910 5512162 5723176 5953621 6197533
55986 6197533 6452867 6728761 7030431 7351221 7688292 8051612 8448473 8874308 9328306
55977 9328306 9822317 10364361 10950097 11581311 12275433 13045670 13890635 14815909 15846056
55968 15846056 17002499 18291430 19728563 21353694 23206266 25312950 27718476 30504277
55960 30504277 33761410 37579279 42086468 47473746 53959119 61776696 71236495 82758047
55952 82758047 96814362 113888186 134508078 159249269 188633299 223036314 262518069
55945 262518069 306138238 350760175 390475363 417995138 427720348 418328137 392942502
55938 392942502 357120065 316489069 275429410 236801065 202130308 171941909 146160983
55931 146160983 124440244 106307399 91225027 78675265 68225545 59512353 52206706
55924 52206706 46032428 40789803 36326710 32502657 29199611 26340126 23865264 21708957
55916 21708957 19811857 18140260 16669934 15366385 14198184 13153289 12224016 11389575
55908 11389575 10629164 9938281 9316238 8750112 8225999 7744118 7308046 6909621 6538051
55899 6538051 6193790 5880339 5591717 5320352 5068377 4839343 4627269 4425027 4235411
55890 4235411 4063225 3904423 3753412 3613245 3488338 3374621 3266933 3168887 3085139 3010327
55880 3010327 2935428 2859198 2784360 2708749 2629623 2551261 2479006 2410284 2339532 2267199 2196253
55869 2196253 2124953 2050977 1978026 1910601 1846603 1782177 1719398 1662145 1608849 1556259 1505977
55858 1505977 1460484 1417127 1372814 1330420 1293905 1261303 1229144 1199407 1175207 1153620 1129817
55847 1129817 1104690 1081659 1059419 1034690 1009025 986201 965585 944287 923125 904483 886987
55836 886987 868254 850185 835710 822904 808088 792207 778493 766319 753009 739404 728050
55825 728050 718030 706982 696077 687727 680390 670799 659422 648807 638578 626947 615071 605095
55813 605095 595897 585538 575722 569070 564126 557990 551797 548630 548004 547443 547609 550820 556151 561017 566138
55798 566138 574041 583935 592698 599590 605398 608427 606117 599520 591729 583022 571968 559965 550121 542597
55784 542597 535329 528161 521880 514336 502124 485517 467744 450396 433549 419126 409575 403983 399738
55771 399738 397374 399579 406111 413736 420479 425912 428059 424493 416331 407264 398831 390150 381493 374142
55757 374142 367211 358601 348886 340496 333329 324900 314571 304037 293915 283553 274001 267427 263478
55744 263478 259666 255325 251917 249574 246807 243639 241728 241238 240617 239515 238911 238440 236613 233686 231489
55729 231489 230533 229922 229705 230379 230518 227943 223092 218378 214637 210992 207658 205653 204190 201567 198444
55714 198444 197140 197915 199053 200347 203249 207676 211827 215144 218477 221476 222896 223375 224748 226620 226672
55699 226672 224353 221196 217533 212121 205071 198092 191673 185116 179364 176552 176397 176205 174848 173749 173638
55684 173638 173486 173209 174345 177250 180371 182958 185984 189827 193554 196916 200519 203680 204693 203606 202185
55669 202185 200902 198537 194975 191644 188886 185716 182535 181211 181940 182812 183080 184066 186229 188178 189391
55654 189391 191177 194022 196552 198183 200358 204122 208546 212376 215288 216841 216229 213683 210237 205849
55640 205849 199699 192345 185233 178113 169630 160592 153772 149964 147100 143833 141146 139697 138433 136821
55626 136821 135793 135441 134307 131964 129812 128427 126643 124217 122757 122852 122778 121304 119461 118319 117281
55611 117281 115801 114575 113800 112395 110149 108552 108302 107997 106386 103971 101389 98371 95282 93479 93033
55596 93033 92303 90843 90399 91739 92869 91915 89655 87705 86230 84988 84643 85389 86044 86036 86523 88145 89526
55579 89526 89573 89408 90326 91512 91577 90865 90523 90545 90444 90659 91714 92928 93388 93335 93474 93841 94294 95103 96226
55560 96226 97098 97786 99058 100718 101428 100825 100110 99809 98830 96648 94512 93368 92479 91311 90859 91708 92581
55543 92581 92362 91957 92607 93897 94919 95966 97495 98720 98783 98164 97658 97119 96409 96226 96767 96918 96008 94976
55525 94976 94596 94056 92630 91183 90610 90253 89377 88686 88681 87978 85151 81177 78269 77183 77227 77946 79169 80233
55507 80233 80658 80965 81587 81856 81142 80004 79020 77636 75428 73403 72659 72778 72814 72855 73341 73934 74313 74998
55489 74998 76128 76580 75561 73938 72754 71700 70448 70104 71715 74430 76673 78046 78667 77935 75688
55474 75688 73511 73028 73763 74234 74220 74366 74496 74020 73182 72394 71242 69647 68868 69713 70809 70449 69135 68456
55456 68456 68483 68287 68062 68536 68951 67912 65850 64590 64734 65400 66193 67440 68651 68723 67748 66960 66828 66694
55438 66694 66214 65700 65140 64289 63614 63844 64782 65778 67019 68958 70873 71498 70827 69896 69090 68100 67222 67150
55420 67150 67671 68055 68538 69966 72187 74253 76031 78100 80201 81281 81099 80363 79368 77897 76401 75771
55404 75771 75793 75163 73295 71033 69412 68709 68706 68882 68457 67191 65986 65750 65947 65369 64052 63206 63450 64274
55386 64274 65087 65727 66073 66152 66394 66923 67006 66199 65366 65369 65417 64173 61946 60214 59353 58517 57409 56472 55416
55367 55416 53387 50707 48912 48820 49935 51795 54456 57522 60194 62525 65303 68457 70884 72086 72699
55352 72699 73155 73124 72638 72489 73038 73578 73296 72144 70573 69179 68587 68874 69190 68752 67996 67806 68011 67827
55334 67827 67451 67855 69104 70193 70476 70016 68756 66820 65449 66012 67958 69371 69711 70338 72003 73547
55318 73547 73748 72978 72238 71731 71245 70941 71058 71572 72632 74551 76957 78771 79339 78890 77708 75830 73700
55301 73700 72130 71292 70641 70013 69819 69960 69702 68953 68614 69206 70131 70679 70870 70870 70488 69755 69192 69104 69258 69590
55281 69590 70478 71984 73514 74523 75014 75155 74984 74605 74084 73198 71942 71111 71511 72782 73878 74541 75196
55264 75196 75623 75067 73739 72861 72932 73203 73160 73248 73711 73912 73472 73055 73373 74177 74778 74873 74488 73716 72880 72342
55244 72342 71986 71475 71045 71297 72176 72980 73382 73575 73492 72855 71956 71379 71023 70492 70301 71341 73174 74296
55226 74296 74257 74064 74263 74178 73457 72790 72481 71818 70574 69758 69997 70474 70385 70280 70946 71942 72275 71779 70959 70228
55206 70228 70060 71135 73489 76079 77816 78470 78206 77082 75600 74820 75167 75828 75937 75664 75601 75812 76116
55189 76116 76572 77096 77276 77067 76948 77017 76745 76068 75793 76354 77094 77367 77395 77411 76955 75805 74694 74281 74189 73878
55169 73878 73709 74280 75393 76466 77392 78295 79064 79758 80757 81906 82272 81494 80572 80529 81096 81521 81869 82554
55151 82554 83297 83569 83498 83377 82835 81479 79923 79179 79340 79699 79791 79520 78684 77302 76116 75931 76644 77581
55133 77581 78467 79325 79824 79597 79025 78897 79393 79987 80226 80033 79419 78465 77501 76865 76636 76839 77607 78807 79975
55114 79975 80960 82149 83589 84508 84235 83160 82170 81546 81033 80601 80550 81061 82074 83335 84278 84300 83480 82604
55096 82604 82199 82130 82375 83399 85304 87321 88744 89647 90182 89977 88928 87842 87475 87527 87374 87190 87548 88419
55078 88419 89411 90498 91682 92343 91824 90401 88956 87975 87386 86990 86440 85309 83861 83247 84215 86084 87662
55061 87662 88629 89288 89550 89125 88313 87700 87387 87236 87432 88022 88345 87850 87092 87084 87998 89313 90713 91959 92362
55042 92362 91489 90058 89094 88539 87729 86865 86715 87081 86924 86065 85476 85643 85893 85666 85427 85714 86133 85899 84886
55023 84886 83752 83332 84076 85699 87279 88095 88337 88612 88966 88975 88621 88321 88135 87734 87215 87183 87832 88614 89020
55004 89020 89081 88860 88077 86641 85098 84157 84033 84493 85322 86502 88070 89967 92003 93905 95439 96434 96757
54987 96757 96457 95943 95620 95274 94245 92446 90756 90118 90682 92064 93922 95818 97167 97892 98689 100041
54971 100041 101389 101919 101732 101511 101379 100886 99951 99041 98502 98314 98395 98717 99244 100190 101958 104318 106092 106339
54953 106339 105546 104953 105005 105238 105339 105476 105710 105904 106087 106220 105800 104471 102913 102284 102765 103396 103340 102666 101947
54934 101947 101740 102387 103656 104629 104656 104304 104727 106253 108362 110922 114504 119356 124884 130396 135771 141297
54918 141297 147428 154687 163086 171510 178241 182260 183602 182630 179634 175104 169660 163553 156776 149605
54904 149605 142499 135566 128876 123164 119311 117046 115065 112686 110599 109640 109618 109795 109907 110164 110661 111276
54888 111276 111971 112848 113976 115274 116538 117634 118765 120378 122679 125601 129440 134896 141942 149254 155587
54873 155587 161218 167056 172684 176487 177713 177232 176021 173986 170620 165968 160458 154482 148549 143212
54859 143212 138449 133609 128303 122888 117893 113509 109866 107259 105731 104852 104109 103299 102479 101909 101917 102328
54843 102328 102145 100490 97825 95554 94392 93910 93657 93794 94296 94473 93859 92974 92723 93437 94800 96223 97057
54826 97057 96983 96463 96289 96509 96395 95696 95162 95379 95814 95660 95138 95194 96221 97673 98862 99605 100076 100378 100387
54807 100387 99906 98948 97867 97110 96912 97328 98389 99914 101361 102253 102679 102993 103159 102867 102210 101752 101897
54790 101897 102619 103678 104652 104939 104379 103813 104357 106169 108496 110779 112948 114721 115587 115655 115691 116120 116798
54773 116798 117886 119983 123039 126090 128665 131666 136208 142202 148729 155302 162052 168928 175335 180534
54759 180534 184093 186047 186715 186179 183958 179615 173678 167420 161635 156146 150550 144811 138986 133144 127836
54744 127836 123935 121607 120018 118455 117137 116539 116544 116751 117076 117529 117767 117418 116618 115869 115642 116325 118157
54727 118157 120950 124213 127804 132065 137141 142619 148121 153738 159623 165585 171321 176491 180328 181811
54713 181811 180703 177928 174459 170251 164663 157590 149788 142360 136152 131300 127209 123315 119970 118041
54699 118041 117607 117795 118056 118711 119857 120636 120265 119100 117921 116778 115295 113636 112340 111470 110606 109537
54683 109537 108363 107162 106056 105475 105828 107019 108558 109952 110737 110543 109502 108294 107415 106697 105813 104811
54667 104811 103868 102948 102161 101999 102774 104147 105591 106880 107814 108052 107702 107505 107880 108261 107977 107291 106896 106825
54649 106825 106628 106217 105797 105274 104518 103943 103966 104081 103371 101961 101126 101746 103278 104512 104885 104869 105313 106558
54631 106558 107977 108456 107507 105782 104324 103547 103219 103102 103107 103025 102682 102270 102117 102205 102324 102592 103365 104603 105698
54612 105698 106085 105811 105464 105641 106450 107438 108105 108477 108921 109488 109880 110143 110788 111917 112783 112695 111982 111605 112094
54593 112094 113251 114593 115693 116304 116502 116549 116402 115720 114531 113466 113005 112935 112876 112867 113026 113143 113029 112858 112780
54574 112780 112666 112609 113044 113901 114277 113599 112488 111844 111691 111713 112241 113664 115332 116142 116002 115774 115936 116253
54556 116253 116559 116891 116903 116126 114849 113921 113707 114055 115132 117211 119647 121219 121702 122061 122781 123181 122899
54539 122899 122912 124132 125802 126400 125781 125347 126085 127311 127683 126830 125500 124365 123326 122179 121404 121681 122719
54522 122719 123273 122560 121048 119508 117926 116053 114490 114293 115557 117189 118179 118425 118272 117937 117626 117641 118017
54505 118017 118389 118430 118180 117856 117605 117507 117534 117519 117465 117790 118876 120390 121505 121856 121911 122342 123391 124898 126526
54486 126526 127809 128341 128131 127634 127339 127475 128058 128989 130124 131385 132741 133994 134828 135316 136053 137408 138883
54469 138883 139668 139628 139276 138941 138518 137920 137201 136251 134925 133587 133011 133518 134536 135143 134888 134063 133383 133322
54451 133322 133634 133648 133211 132939 133257 133660 133507 133090 133139 133477 133087 131562 129724 128584 128292 128323 128161 127606 126829
54432 126829 126296 126334 126716 127033 127390 128247 129566 130664 131019 130763 130292 129872 129716 129962 130354 130376 129965 129760 130437
54413 130437 131926 133359 133679 132449 130324 128628 128165 128641 129466 130717 132707 134981 136569 137206 137524 137962
54397 137962 138209 137952 137538 137596 138408 139789 141161 141728 141073 139732 138698 138291 137990 137404 136778 136372 135914 135071
54379 135071 134094 133713 134511 136422 138612 139976 140158 139958 140347 141294 142116 142709 143601 144911 146178 147356 149010
54362 149010 151154 152786 153170 152936 153327 154723 156438 157743 158703 160138 162911 167024 171345 174554 176365
54347 176365 177463 178296 178507 177619 175677 173022 169925 166613 163237 159669 155806 152076 149110 146904 144916
54332 144916 143019 141633 140834 140176 139598 139681 140617 141695 142204 142168 141789 140955 139761 138859 138652 138699 138376 137634
54314 137634 136702 135669 134859 134925 135948 136994 137220 136887 136649 136420 135768 134956 134692 135061 135493 135609 135437 134969
54296 134969 134226 133591 133442 133536 133397 133194 133520 134333 134830 134542 133971 133892 134467 135288 135997 136605 137347 138336 139332
54277 139332 139870 139777 139453 139417 139621 139427 138349 136679 135321 134978 135498 136075 136185 136120 136453 137187 137836 138198 138523
54258 138523 138951 139347 139821 140865 142760 145227 147818 150134 151650 151954 151419 151023 151180 151313 150903 150295 149953
54241 149953 149543 148406 146607 144875 143702 142901 141929 140398 138499 137057 136740 137092 136986 136282 136189 137470
54225 137470 139117 139625 138928 138151 137906 137882 137949 138577 139991 141674 142948 143634 144035 144572 145383 145994 145568 143866
54207 143866 141735 140232 139516 139036 138532 138263 138456 139048 139875 140636 140832 140189 138940 137358 135365 133126 131577
54190 131577 131609 132983 134747 136457 138197 139656 140174 139780 139298 139264 139433 139507 139587 139753 139834 139800 139763 139481 138524
54171 138524 137092 135930 135197 134205 132726 131783 132484 134482 136267 136701 135790 134205 132650 131659 131485 131971
54155 131971 132661 133087 132938 132202 131293 130865 131235 132083 132855 133381 133824 134161 134068 133482 133032 133582 135245 137131
54137 137131 138273 138653 139028 139844 140798 141490 141997 142469 142679 142441 142191 142591 143695 144951 145906 146487 146691 146519
54119 146519 146204 146064 146066 145928 145640 145527 145735 146108 146596 147385 148500 149641 150535 151128 151344 151092 150656 150693 151545
54100 151545 152806 153839 154462 154918 155366 155727 155898 155852 155584 155179 154946 155230 156009 156783 156955 156329 155236 154269
54082 154269 153984 154765 156792 159956 163898 168329 173372 179459 186843 195322 204451 213839 223127 231688 238482
54067 238482 242288 242358 238977 233246 226136 217953 209002 200375 193407 188358 184267 180292 176603 173794 172013
54052 172013 171046 170745 170982 171514 172276 173475 175165 177125 179394 182364 185995 189521 192517 195769 200435
54037 200435 206664 213681 220865 228083 235100 241457 246997 252059 257025 261996 266816 271161 274708 277471
54023 277471 279794 281816 283273 284085 284717 285630 286846 288375 290468 292871 294497 294623 293961 293661 293633 292789
54007 292789 290669 287847 284870 281734 278377 274722 270206 264201 257126 250363 244846 240330 236124 231845
53993 231845 227343 222595 217871 213500 209359 205144 201107 197841 195368 193222 191449 190656 190798 190790 189687
53978 189687 187666 185584 184129 183611 183917 184369 184203 183429 182737 182401 181882 180704 179093 177578 176600 176634 177995
53961 177995 180198 182215 183626 184881 186213 187099 187165 186871 186851 187270 188282 190373 193647 197367 200846 204315
53945 204315 208310 212644 216535 219493 221624 223419 225631 229030 233874 239793 246345 253305 260495 268030
53931 268030 276861 288239 302356 318330 335756 354996 375168 392979 404816 409511 408311 402985
53919 402985 395126 386618 379181 373296 368619 365400 364562 366395 370129 374892 380244 385662 390312 393646
53905 393646 395666 396432 395867 394130 391647 388673 385301 381883 378857 376116 373125 369726 366222 362589 358236
53890 358236 352763 346374 339354 331667 323365 314930 306912 299567 293046 287517 282743 277979 272658 267038
53876 267038 261899 257773 254645 252134 249692 246831 243502 240184 237356 234907 232257 229086 225722 222726
53862 222726 220223 217794 215041 212119 209567 207666 206150 204569 202762 200946 199478 198575 198076 197470 196412
53847 196412 195228 194597 194636 194750 194575 194554 195153 195940 196012 195174 194102 193484 193498 194110 195229 196411 196948 196572 195805
53828 195805 195366 195415 195554 195424 195089 194895 195090 195638 196369 197254 198374 199652 200829 201855 203055 204703 206632
53811 206632 208500 210264 212165 214409 217191 220808 225335 230215 234601 238211 241580 245438 250091 255412
53797 255412 261103 266820 272259 277253 281678 285254 287634 288806 289265 289692 290488 291585 292600 293180 293255 292975
53781 292975 292374 291217 289263 286547 283242 279332 274639 269187 263437 258100 253634 249801 245822 241212
53767 241212 236449 232498 229678 227412 225180 223121 221345 219225 216055 212197 208907 207033 206247 205593 204402
53752 204402 202691 200998 199837 199106 198156 196661 195148 194337 194200 194124 193833 193582 193560 193641 193815 194321 195295 196655
53734 196655 198359 200310 201987 202766 202770 202892 203688 204687 205036 204528 203712 203264 203516 204385 205554 206821 208349
53717 208349 210351 212514 214087 214677 214649 214650 215085 216194 218164 220815 223447 225427 226796 228122 229926 232443
53701 232443 235679 239405 243223 246928 250661 254493 258069 260955 263193 265245 267499 270057 272772 275142
53687 275142 276379 276172 275348 275209 275990 276488 275516 273383 271448 270472 269964 269155 268032 267099 266547 266143 265815
53670 265815 265787 266001 265813 264605 262513 260296 258563 257402 256672 256327 256366 256777 257626 258960 260385 260982 260049
53653 260049 257973 256093 255517 256181 257154 257693 257788 257811 257992 258363 258971 259895 261058 262194 263039 263543 263953 264690
53635 264690 265945 267325 268128 268192 268256 269197 271064 273241 275346 277445 279448 280986 282130 283553 285599 287689
53619 287689 289181 290471 292634 296166 300685 305729 311225 317092 322942 328468 333786 339240 345089 351518
53605 351518 358627 366210 373755 380847 387370 393151 397609 400066 400387 399177 397347 395582 394094 392640
53591 392640 390732 388056 384852 381805 379407 377497 375603 373694 372268 371581 371093 370008 368189 366199 364553
53576 364553 363284 362171 360949 359233 356681 353426 350109 347392 345615 344823 344720 344671 344292 344107 345014 346959
53560 346959 348887 350214 351580 353610 355679 356688 356528 356004 355725 355896 356828 358684 360770 362007 362183 362098
53544 362098 362438 363223 364345 365865 367610 369241 370918 373230 376282 379567 382999 387273 392735 398592 403955
53529 403955 409225 415755 424328 434474 445161 455698 466024 476548 487788 499955 512829 526088
53517 526088 539630 553551 567950 582886 598355 614357 631253 650007 671593 695892 721517
53506 721517 747005 771927 796661 821464 846140 870379 893990 916905 939258 961365 983318
53495 983318 1004711 1025049 1044372 1063200 1081977 1100832 1119774 1138679 1157062 1174322 1190524
53484 1190524 1206672 1223849 1242105 1260493 1278202 1295380 1312702 1330416 1348141 1365371 1381653
53473 1381653 1396221 1408053 1416743 1423021 1427926 1431533 1432925 1431361 1427001 1420398 1411673 1400510 1386800
53460 1386800 1371141 1354625 1338159 1321900 1305445 1288576 1271568 1254555 1236864 1217481 1196204
53449 1196204 1173961 1151897 1130392 1109048 1087418 1065660 1044536 1024764 1006362 988890 972445
53438 972445 958001 946418 937452 930236 924347 919814 916362 913510 911352 910463 910962 912468 915043 919286
53424 919286 925232 932030 939133 947084 956593 967561 979669 993305 1009123 1027029 1046303 1066485
53412 1066485 1087583 1109677 1132937 1157789 1184453 1212483 1241355 1271379 1303375 1337511 1373117
53401 1373117 1409733 1447791 1488104 1531183 1577180 1626034 1677312 1730189 1783891 1838113 1892923
53390 1892923 1948446 2004735 2061759 2119292 2176818 2233680 2289333 2343422 2395593 2445374 2492353
53379 2492353 2536563 2578486 2618511 2656373 2691250 2722271 2748796 2770417 2787070 2799133 2807023
53368 2807023 2810620 2809295 2802332 2788916 2767968 2738725 2701654 2658189 2609490 2556230 2499763 2442454
53356 2442454 2386024 2330154 2273482 2215648 2157706 2101008 2046502 1994831 1946159 1899873 1855111
53345 1855111 1811602 1769366 1727757 1685657 1642767 1599997 1558307 1517864 1478627 1441165 1406365
53334 1406365 1374629 1345745 1319370 1295336 1273705 1254744 1238608 1224804 1212125 1199390 1186161
53323 1186161 1172607 1158872 1144894 1130804 1117182 1104711 1093637 1083683 1074439 1065707 1057474 1049836
53311 1049836 1043238 1038592 1036671 1037294 1039549 1042910 1047641 1053892 1061036 1068477 1076615 1086309 1097657 1110112
53297 1110112 1123717 1139370 1157688 1178265 1200379 1223845 1248816 1275233 1302981 1332215 1363028
53286 1363028 1394773 1426069 1455495 1482226 1506162 1527705 1547349 1565310 1581469 1595631 1607683
53275 1607683 1617384 1624147 1627242 1626261 1621426 1613511 1603436 1591832 1578816 1564057 1546926 1526749 1503318
53262 1503318 1477388 1450342 1423015 1395022 1365582 1334800 1303616 1272610 1241483 1209883 1178205
53251 1178205 1147241 1117400 1088609 1060767 1033918 1008028 982813 957787 932437 906493 880156
53240 880156 853934 828217 803134 778868 755816 734261 714076 694977 676962 660359 645506
53229 645506 632545 621412 611835 603399 595768 588772 582184 575489 568067 559668 550553 541100 531338 520907
53215 520907 509472 497108 484316 471699 459650 448242 437341 426820 416764 407502 399342 392272
53203 392272 385961 380029 374181 368088 361416 354117 346538 339143 332279 326249 321282 317178 313133 308258
53189 308258 302275 295659 289331 284302 281203 279684 278421 276187 272922 269493 266539 263954 261425 258968
53175 258968 256815 255122 253873 252780 251292 249065 246496 244402 243043 241819 240085 237966 236200 235452
53161 235452 235869 237000 237957 237969 237011 235731 234688 233881 233125 232487 232064 231583 230590 229022 227374 226278 225989
53144 225989 226246 226638 227079 227739 228425 228444 227586 226939 227894 230260 232182 232255 231044 230080 230079 230825 232145 234011
53126 234011 235903 237060 237426 237632 237890 237674 236780 236030 236447 238076 240043 241575 242581 243394 244235 244963 245203
53109 245203 244749 243871 243024 242218 240925 238774 236088 233462 231015 228438 225733 223499 222347 222223 222510 222622
53093 222622 222327 221605 220477 219114 217935 217409 217731 218738 220107 221513 222655 223352 223694 223975 224329 224562
53077 224562 224483 224270 224232 224255 223855 222894 221932 221634 222033 222640 223102 223337 223142 222188 220592 219084 218256 217914 217499
53058 217499 216921 216538 216437 216224 215591 214645 213586 212520 211768 211886 212957 214238 215026 215644 216962 218970 220508
53041 220508 220652 219855 219301 219434 219641 219263 218371 217393 216424 215276 214047 213131 212617 212077 211218 210412 210196 210435
53023 210435 210498 210295 210548 211792 213500 214566 214429 213417 212268 211639 211849 212663 213428 213751 213985 214673 215709
53006 215709 216518 216970 217536 218429 219132 219066 218350 217611 217307 217488 217988 218563 218953 219042 218899 218609 218181 217718 217490
52987 217490 217684 218219 218918 219780 220898 222232 223555 224626 225388 226014 226795 227842 228974 229979 230851 231596
52971 231596 231960 231714 231179 231037 231502 232068 232292 232490 233371 235121 237110 238399 238419 237275 235581 233926 232511
52954 232511 231318 230466 230039 229585 228293 225922 223233 221274 220510 220800 221777 222833 223091 222039 220175 218612
52938 218612 217992 218048 218152 217966 217533 217056 216757 216769 217013 217169 216778 215491 213430 211347 210127 209981 210339 210658
52920 210658 211002 211553 212023 212065 211969 212269 212730 212506 211459 210675 211228 212827 214160 214322 213492 212406 211621 211326
52902 211326 211433 211643 211580 211051 210149 209127 208287 207968 208395 209380 210355 210908 211247 211894 212975 214037 214687 215062
52884 215062 215516 216024 216201 215808 214952 213902 212981 212604 213019 213953 214808 215346 215903 216818 218007 219265 220691
52867 220691 222508 224698 227086 229631 232308 234787 236514 237141 236797 235952 235119 234512 233806 232406 230131 227564
52851 227564 225491 224062 222635 220395 217058 213095 209406 206587 204419 202289 200185 198884 198898 199621 199974
52836 199974 199613 198980 198432 197959 197716 198077 198994 199895 200467 201101 202233 203627 204616 204808 204306 203513 202949 203011
52818 203011 203623 204317 204858 205524 206557 207722 208787 210135 212372 215479 218826 221894 224396 225737 225108
52803 225108 222522 219243 216671 215009 213403 211232 208804 206817 205527 204584 203424 201720 199629 197753
52789 197753 196748 196858 197802 199082 200300 201277 202099 203018 204111 204968 205074 204590 204410 205104 206041 205977 204497
52772 204497 202476 201071 200624 200712 200905 201146 201491 201820 201894 201594 200989 200251 199558 199091 198994 199216 199437 199384 199295 199808
52752 199808 201216 203004 204361 205020 205362 205819 206558 207625 208954 210187 210927 211310 211962 213203 214662 215897
52736 215897 216977 218125 219106 219482 219432 219773 221067 222950 224568 225494 226047 226721 227548 228136 228195 227752 226829 225337
52718 225337 223515 222098 221533 221231 220130 218007 215695 214024 213104 212702 212633 212520 211856 210751 210088 210479 211447
52701 211447 212126 212394 212787 213559 214395 214876 214849 214468 214232 214778 216203 217796 218743 218844 218225 216884 215108 213907
52683 213907 214187 215572 216752 216955 216520 216134 216197 216911 218239 219620 220270 219878 218662 216914 215068 213993
52667 213993 214298 215310 215635 214944 214356 214810 215948 217005 217926 218966 219903 220477 221126 222570 224919 227737
52651 227737 230701 233597 235886 236924 236606 235425 234007 232821 232109 231735 231307 230691 230142 229668 228756 227191
52635 227191 225698 225132 225333 225440 225204 225337 226586 229033 232256 235650 238490 240211 240682 239927 237723 234013
52619 234013 229640 226013 223856 222747 221962 221259 220690 220222 219920 220076 220816 221776 222418 222444 221850 220918 220266 220462
52601 220462 221312 221950 221954 221945 222688 223988 225036 225581 226093 226812 227342 227401 227436 228105 229426 230777 231632 232046 232517
52582 232517 233574 235402 237627 239468 240375 240574 240764 241175 241209 240257 238710 237736 237967 238812 239247 238951 238281
52565 238281 237425 236222 234875 234203 234732 235872 236428 235842 234554 233281 232363 231818 231557 231305 230721 229878 229371
52548 229371 229628 230324 230817 230965 231085 231191 230846 229884 228761 227879 226997 225750 224490 224079 224890 226397 227764
52531 227764 228470 228414 227839 227328 227453 228165 228753 228639 228041 227647 227839 228486 229318 230195 231107 232123 233333 234585
52513 234585 235481 235880 236354 237720 240096 242831 245463 248255 251460 254449 256171 256403 255947 255496 254816 253387
52497 253387 251341 249262 247281 245056 242703 241080 240790 241363 241919 242290 242917 243761 244033 243211 241774 240578
52481 240578 239918 239595 239582 240058 240883 241648 242397 243788 246157 248742 250338 250650 250543 250866 251519 252019 252620 254212
52463 254212 257059 260237 262620 264073 265187 266124 266364 265660 264614 263908 263322 262064 259986 257944 256713
52448 256713 255923 254453 251816 248746 246297 244661 243194 241415 239556 238069 236999 236086 235265 234772 234890
52433 234890 235784 237399 239300 240756 241281 241046 240512 239869 239086 238354 238082 238484 239493 240993 242786 244459
52417 244459 245767 247078 248961 251341 253647 255787 258344 261718 265790 270669 276971 284955 294080 303919
52403 303919 314655 325835 335223 340063 339417 334541 327194 318446 309034 299789 291294 283751 277416 272618
52389 272618 269205 266590 264595 263703 264209 265623 267174 268386 268921 268455 267182 266025 265901 267000 269013
52374 269013 271641 274549 277316 279887 282737 286188 289920 293545 297191 300897 303946 305609 306270 306985 307983
52359 307983 308517 308198 307573 307183 306943 306824 307318 308576 309753 309954 309513 309667 311154 313684 316615 319559 322372
52342 322372 325032 327571 329818 331367 332256 333530 336455 341115 346342 351239 356280 362653 370935 380732
52328 380732 391297 402067 412868 423966 435922 449131 463514 478727 494451 510320 525856
52317 525856 540808 555449 570187 584975 599430 613505 627707 642523 657864 673236 688324
52306 688324 703287 718481 733964 749327 764044 777924 790996 803054 813677 822897 831417 839794
52294 839794 847614 853941 858355 861047 861961 860566 856738 851346 845592 839994 834288 828102 821454 814785
52280 814785 808824 804310 801530 800128 799563 799765 801129 803836 807416 811211 815247 820446 827755 837079 847254
52265 847254 857101 866235 874815 882998 891065 899746 909772 921111 933163 945664 958836 972558 986047
52252 986047 998712 1010828 1022971 1035087 1046403 1055924 1062801 1066637 1067841 1067360 1065706 1062593 1057855
52239 1057855 1052217 1046587 1040987 1034908 1028466 1022383 1016826 1011032 1004295 996723 988827 980900 973187 966233
52225 966233 960659 956667 953891 951626 949203 946495 944184 943250 944005 945794 947700 949338 950958 953120 956415
52210 956415 961193 967258 973969 980710 987146 993030 998143 1002563 1006718 1010871 1014809 1018302 1021748 1026069
52196 1026069 1031903 1039016 1046489 1053445 1059662 1065536 1071442 1077178 1082072 1085518 1087239 1087187 1085518 1082602
52182 1082602 1078691 1073604 1067098 1059589 1052016 1044849 1037701 1030183 1022646 1015686 1009320 1003179 997258 991943
52168 991943 987402 983437 979990 977366 975907 975653 976329 977423 978386 979096 980055 981802 984127 986227 987636
52153 987636 988551 989263 989718 989837 989793 989702 989458 989171 989452 990803 992874 994724 995696 995730 994953 993429 991300 988833
52135 988833 986271 983921 982293 981777 982199 983191 985108 989060 995787 1004988 1016088 1029186 1044703 1062489
52121 1062489 1081970 1102984 1125732 1149823 1174074 1197521 1220128 1242262 1263946 1284965 1305277
52110 1305277 1324909 1343708 1361533 1378368 1393935 1407577 1419053 1429177 1439075 1448859 1457581 1464497
52098 1464497 1469834 1474190 1477692 1479947 1480363 1478238 1472913 1464260 1452906 1439691 1425004 1408954 1392097
52085 1392097 1375613 1360609 1347392 1335603 1324952 1315630 1307999 1302110 1297742 1294736 1293027 1292380 1292496
52072 1292496 1293518 1296104 1300771 1307409 1315638 1325331 1336445 1348618 1361386 1374594 1388133 1401420
52060 1401420 1413657 1424623 1434746 1444393 1453583 1462410 1471098 1479439 1486649 1492060 1495554 1497096 1496305
52047 1496305 1492849 1486938 1479076 1469577 1458578 1446239 1432594 1417491 1401061 1384070 1367503 1351948
52035 1351948 1337631 1324746 1313218 1302261 1290730 1278084 1264764 1251553 1238763 1226130 1213377
52024 1213377 1200734 1188778 1177709 1166916 1155564 1143597 1131730 1120427 1109461 1098752 1088956
52013 1088956 1080545 1072717 1064119 1054589 1045339 1037244 1029625 1021042 1010686 998537 984567 968459 950144
52000 950144 930246 909907 890266 872040 855338 839888 825504 812321 800451 789525 778737
51989 778737 767438 755540 743330 731015 718569 705958 693273 680535 667511 653896 639661
51978 639661 625077 610405 595797 581529 568135 556184 546041 537893 531815 527712 525344 524546 525285
51965 525285 527433 530671 534760 539669 545255 550980 556189 560474 563549 565020 564651 562763 559968 556477
51951 556477 551957 546167 539490 532751 526713 521878 518603 517229 518032 521061 526095 532877 541351 551551
51937 551551 563337 576457 590812 606178 621511 635065 645610 653136 657934 659420 656653 649821
51925 649821 640455 630036 619065 607643 596287 585760 576545 568984 563648 561173 561774 565283 571601
51912 571601 580965 593612 608968 624917 637947 644601 643293 634938 622014 607196 592570 579359
51900 579359 567885 557844 548717 539806 530097 518679 505557 491659 477880 464548 451965 440869
51888 440869 431833 424596 418538 413581 410124 408295 407799 408429 410283 413499 418191 424588 432774 442267 452266
51873 452266 462312 472288 481687 489397 494479 496875 497059 495225 491140 484751 476701 468147 460083 452870
51859 452870 446574 441707 439272 439713 441998 444303 445613 446253 446732 446667 445204 442097 437875 433149 428230
51844 428230 423352 418737 414314 409669 404537 399219 394436 390827 388570 387315 386479 385781 385520 386165 387663
51829 387663 389415 390989 392531 394202 395497 395533 394001 391478 388765 386239 383964 382101 380922 380576 381059
51814 381059 382339 384352 386929 389845 392821 395401 396969 397148 396086 394209 391810 389137 386699 385058
51800 385058 384254 383792 383278 382763 382382 382021 381504 380763 379557 377438 374368 371127 368612 366876 365353 363954
51784 363954 363322 363820 364817 365320 365001 364177 363116 361901 360891 360703 361518 362832 364275 366429 370432 376755
51768 376755 384707 393174 401611 410173 419073 428000 436099 442375 446156 447284 445966 442521 437335 430931
51754 430931 423826 416275 408387 400541 393411 387388 382267 377789 374167 371671 369835 367708 365008 362652
51740 362652 361924 363354 366532 370717 375472 380930 387581 395549 403936 411118 415877 418162 418734 418405 417842
51725 417842 417726 418612 420546 422942 424770 424914 422707 418447 413289 408500 404889 402872 402540 403335 404105 404011
51709 404011 403231 402389 401594 400645 400065 401104 404429 409186 413606 416275 416757 415443 413113 410533 408257 406850
51693 406850 407133 409737 414231 419038 422462 423681 422657 419506 414397 407917 401092 394864 389655 385452
51679 385452 382163 379872 378810 379146 380746 383093 385445 387194 388259 389188 390696 392990 395704 398625 402240
51664 402240 407225 413495 420056 425729 429654 431183 429879 425974 420593 415296 411458 410096 411966 417573
51650 417573 427043 439874 454526 468339 478364 482648 480734 473182 461164 446519 431410 417309
51638 417309 404544 393063 383214 375370 369277 364373 360533 357938 356434 355633 355595 356755 359035 361544
51624 361544 363353 364210 364403 364263 363987 363634 363124 362429 361803 361566 361597 361342 360440 359074 357615 356240 355022
51607 355022 354144 353773 353855 354199 354693 355410 356640 358813 362151 366432 371353 377163 384601 394054 404957 415971
51591 415971 425340 431111 431777 427379 419787 411448 403899 397623 392891 390093 389297 390100 392195 395905 402091
51576 402091 411604 424667 440352 456700 471842 485367 498503 512812 528669 544892 559563 571152
51564 571152 579310 585160 591046 599866 614265 635982 665512 702138 744172 789132 833841 874855
51552 874855 909400 936089 954684 965253 967754 962309 949417 929687 903672 872156 836402 797854
51540 797854 757728 717104 677265 639640 605390 575188 549308 527673 509734 494540 481152
51529 481152 469073 458269 448838 440617 433202 426382 420497 416138 413404 411670 410235 409042 408533 408978
51515 408978 410235 412098 414456 417066 419433 421056 421577 420639 417880 413302 407446 401066 394811 389315 385234
51500 385234 382819 381564 380583 379283 377461 374992 371832 368333 365151 362681 360850 359486 358572 358048 357700
51485 357700 357411 357225 356998 356312 355019 353629 352750 352270 351475 349923 347876 345825 343931 342048 340048 337961
51469 337961 335905 334018 332367 330897 329536 328385 327652 327348 327168 326769 326066 325243 324596 324437 324987 326191
51453 326191 327705 329307 331350 334647 339746 346406 353889 361732 370095 379436 390118 402378 416201
51440 416201 430687 443652 452522 456089 455390 452786 450372 449157 449083 449157 447713 443197 435090 424090 411596
51425 411596 399186 388271 379651 373215 368412 365037 363271 362983 363484 364158 364972 366106 367504 369108 371207
51410 371207 374090 377391 380181 381788 382383 382779 383740 385370 387048 388048 388350 388693 389699 391196 392634
51395 392634 393923 395506 397689 400351 403403 407220 412335 418840 426302 434376 443483 454791 469392 487558
51381 487558 509032 534037 563612 598696 639240 684580 734348 788235 844703 900455 951639
51370 951639 995377 1030109 1054969 1069426 1073475 1067649 1052603 1028838 996963 958070 913658 865315
51358 865315 814637 763395 713456 666396 623340 585204 552760 526060 503966 484806 467689
51347 467689 452861 440621 430299 420623 410887 401323 392466 384530 377463 371215 365801 361209 357361
51334 357361 354096 351194 348522 346113 344002 342002 339719 336832 333402 329993 327423 326123 325683 325249 324500
51319 324500 323884 323854 324339 325332 327409 330990 335385 339401 342850 346679 351426 356267 359928 361969 362773 362731
51303 362731 361938 360445 358374 355877 353253 350893 348816 346478 343332 339510 335617 331988 328496 325124
51289 325124 322390 321010 321191 322346 323574 324502 325638 327797 331191 335277 339426 343424 347247 350676 353398
51274 353398 355244 356119 355943 354932 353801 353358 353979 355642 358322 361987 366179 369889 372039 372175 370788
51259 370788 368935 367376 365911 363748 360584 357118 354306 352384 350876 349391 348020 347048 346666 346995 348057
51244 348057 349598 351149 352329 352916 352604 351051 348393 345490 343309 342016 340895 339246 337168 335261 333767
51229 333767 332453 331349 331057 331910 333177 333769 333673 334056 335789 338415 340814 342408 343334 343881 344264 344778 345739
51212 345739 347352 349824 353386 357868 362495 366500 369803 372819 375849 379008 382430 385940 388687 389708
51198 389708 388929 387130 384927 382307 379263 376214 373571 371287 369148 367188 365534 364106 362759 361573
51184 361573 360793 360655 361347 362971 365343 367961 370352 372355 374000 375303 376304 377189 378211 379503 380943
51169 380943 382145 382631 382197 381151 380026 379079 378261 377614 377404 377748 378329 378596 378202 377262 376316 375955 376259 376722
51151 376722 376908 377028 377483 378027 377940 377042 375836 374460 372147 368253 363393 359006 355924 353829 351971 349997
51135 349997 348066 346505 345485 344904 344491 344062 343659 343507 343990 345553 348296 351630 354760 357575 360577 363772
51119 363772 366282 367553 368423 370238 373217 376488 379652 383415 388424 394122 399232 402964 405396 406934
51105 406934 407899 408540 409101 409718 410359 410872 411075 410830 410107 408987 407647 406349 405342 404668 404132 403562 403031
51088 403031 402705 402579 402549 402635 402886 403133 403117 402875 402707 402718 402653 402329 401966 401984 402572 403592 404795 406093 407649
51069 407649 409647 411888 413817 415257 416958 419952 424371 429478 435049 442183 452273 465464 480474
51056 480474 495551 509159 520107 527944 533563 539084 546823 558247 573455 591076 608719 624246
51044 624246 637010 647609 656323 662168 663670 660171 652127 640636 627210 613689 601619 591352
51032 591352 581911 571767 559742 545553 530056 515027 502213 492342 485143 480237 477617 477188 478330
51019 478330 480349 483205 487449 493428 500743 508519 516051 523078 529527 535263 540319 545313 551223 558437
51005 558437 566324 574141 582216 591676 602960 615172 627110 638507 649939 661909 674382 686890
50993 686890 698712 709134 717880 725178 731120 735266 737233 737476 737030 736685 736870 738180 741360 746611 753299
50978 753299 760385 766827 771736 774874 777348 781400 789144 801555 818657 840234 866154 896352 930799
50965 930799 969337 1011454 1056510 1104334 1155272 1209426 1266030 1323772 1381413 1437938 1492428
50954 1492428 1544161 1592701 1637635 1678374 1714449 1745807 1772577 1794773 1812571 1826754 1838627
50943 1838627 1849627 1861237 1874848 1890903 1907903 1922723 1932389 1935734 1933533 1927400 1918687 1908024
50931 1908024 1895399 1880397 1862478 1841188 1816173 1786972 1752880 1713230 1667992 1618004 1564399
50920 1564399 1507948 1449264 1389609 1330941 1274874 1221933 1172151 1126001 1084207 1046763 1012810
50909 1012810 981667 953526 928884 907581 888741 871460 855314 840266 826382 813660 801923
50898 801923 790884 780437 770871 762554 755421 749050 743377 738948 736158 734443 732753 730817 729437 729383
50884 729383 730491 732104 733964 736264 739136 742606 746834 751905 757538 763471 769987 777536 785975 794893
50870 794893 804610 816091 829621 844320 859365 875095 892468 911955 933485 957075 982933 1011204
50858 1011204 1042214 1076828 1116072 1160483 1210248 1265886 1328260 1397769 1473885 1555727 1643042
50847 1643042 1736602 1837538 1946112 2061111 2180692 2303755 2430103 2559112 2688675 2815559
50837 2815559 2936231 3047120 3144873 3227259 3293673 3344343 3379462 3399653 3406876 3404077 3394079
50826 3394079 3379434 3363097 3348355 3337962 3333892 3337783 3350652 3371894 3399089 3428922 3457731 3481171
50814 3481171 3494325 3492918 3474386 3437744 3383004 3310951 3222920 3120343 3004719 2878149 2743558
50803 2743558 2604238 2463606 2325419 2193458 2070442 1957565 1855372 1764534 1685357 1617106
50793 1617106 1558586 1509210 1468967 1437511 1413881 1397027 1386027 1379718 1376669 1375750 1376424 1378236 1380265
50780 1380265 1381313 1380518 1377621 1372712 1365898 1357288 1347156 1335948 1324008 1311322 1297532 1282113 1264566
50767 1264566 1244614 1222411 1198456 1173174 1146725 1119408 1092036 1065662 1041105 1019031 1000094
50756 1000094 984442 971234 959407 948994 941045 936070 933302 931846 931970 934693 940526 949185 960333
50743 960333 974106 991021 1011701 1036598 1065759 1099008 1136473 1178627 1225579 1276733 1331481
50732 1331481 1389842 1451953 1517157 1584087 1651544 1718903 1785869 1852238 1917758 1981815 2043346
50721 2043346 2101366 2155342 2204651 2247805 2282622 2307028 2319419 2318876 2305937 2283157 2254177 2222168
50709 2222168 2189671 2159592 2135134 2118319 2109341 2107709 2113214 2125285 2142214 2161877 2182640 2202682
50697 2202682 2218723 2226604 2223273 2207568 2179115 2137561 2083434 2019106 1948144 1873865 1798900 1725679
50685 1725679 1656482 1592826 1535335 1484497 1441190 1406256 1379803 1361259 1349986 1345605 1347844 1356481
50673 1356481 1371511 1393158 1421516 1456170 1496048 1539447 1584219 1628176 1669536 1707054 1739872
50662 1739872 1767524 1790123 1808361 1823203 1835631 1846571 1856720 1866236 1874778 1881988 1887858 1892557
50650 1892557 1896167 1898828 1901124 1904205 1909537 1918552 1932327 1951406 1975862 2005500 2039867 2078244
50638 2078244 2119900 2164404 2211314 2259534 2307366 2353375 2396835 2437212 2473844 2506672 2537015
50627 2537015 2567102 2598685 2631729 2663207 2686252 2691508 2671600 2625834 2560716 2485936 2410016
50616 2410016 2338909 2276621 2225433 2185713 2156542 2136959 2126428 2124297 2129304 2139688 2153422 2168212
50604 2168212 2181427 2190219 2191790 2183822 2164971 2135060 2094746 2044999 1986951 1922117 1852613 1781024
50592 1781024 1709945 1641457 1576921 1517163 1462661 1413359 1368525 1327251 1289224 1254700 1223644
50581 1223644 1195222 1168366 1142595 1118146 1095667 1076083 1060403 1049075 1041520 1036646 1033816 1033037
50569 1033037 1034449 1038146 1044482 1053879 1065961 1079339 1092861 1106952 1123212 1142604 1164544 1188070
50557 1188070 1213506 1242356 1275508 1312122 1350630 1390356 1431524 1473811 1515622 1555141 1591576
50546 1591576 1625110 1656129 1685088 1712840 1740397 1768378 1797244 1828126 1862802 1902620 1947850
50535 1947850 1998298 2054036 2115131 2181221 2252107 2328681 2412565 2504648 2604487 2711372 2825418
50524 2825418 2946982 3075085 3206917 3339104 3469150 3595429 3715975 3827688 3926788 4009758
50514 4009758 4073762 4116573 4136712 4133853 4108771 4062621 3996368 3911066 3808607 3692049 3565326
50503 3565326 3432938 3299927 3171737 3053537 2949288 2861373 2791093 2739504 2707688 2696261
50493 2696261 2704844 2732113 2776087 2833906 2901337 2972852 3042274 3103051 3148045 3170061 3163665 3126854
50481 3126854 3061029 2969729 2857707 2730670 2594721 2455379 2317067 2183240 2056438 1938072
50471 1938072 1828617 1728266 1637217 1555437 1482624 1418406 1362149 1312601 1268436 1229373 1196121
50460 1196121 1168939 1146948 1129237 1115876 1107063 1101763 1098097 1094834 1091791 1088967 1086148 1083427 1081429
50447 1081429 1080790 1081844 1084795 1089771 1096660 1105271 1115562 1127220 1139182 1150213 1159951 1168782 1176777
50434 1176777 1183549 1189312 1195323 1202856 1212267 1223302 1235753 1249477 1264250 1279972 1296634 1313918
50422 1313918 1331350 1349058 1367830 1388118 1409677 1432637 1458370 1488650 1524330 1565271 1611147
50411 1611147 1661796 1717127 1777251 1842327 1911715 1983534 2055507 2125963 2193563 2256667 2313815
50400 2313815 2364611 2409227 2447034 2476252 2494818 2500951 2493110 2470329 2432861 2381988 2319219 2246368
50388 2246368 2166307 2082716 1998729 1916500 1838291 1767141 1705723 1654974 1614442 1583742 1563261
50377 1563261 1553646 1555090 1567040 1588144 1616280 1648717 1682280 1713460 1738670 1754693 1759089 1750468
50365 1750468 1728708 1694931 1651025 1599032 1541028 1479295 1416186 1353766 1293716 1237319 1185104
50354 1185104 1136592 1090973 1048136 1008618 972652 939899 910312 884670 863865 848090 836959
50343 836959 830008 826751 826640 829424 835356 844766 857599 873358 890876 907722 920400 925976 923701
50330 923701 914925 901797 886445 870926 857047 845904 837817 832727 830382 830236 831627 834207 838037
50317 838037 843251 849786 857228 864630 870668 874452 876228 877063 877876 879105 881040 883839 887105 890040 892344
50302 892344 894525 897045 899590 901601 903255 905408 908658 912884 917685 922815 928050 932953 936965 939662
50288 939662 940893 940990 940995 942410 946318 952617 960074 967026 972072 974584 975081 975095 976174 978837 982690 987499
50272 987499 993610 1001153 1009321 1016925 1023371 1028618 1032411 1034169 1033700 1031563 1028600 1025450 1022582 1020395
50258 1020395 1019050 1018415 1018334 1018780 1019736 1021288 1023967 1028729 1036436 1047562 1062390 1081160 1103840 1130110
50244 1130110 1159700 1192366 1227329 1263122 1298313 1332102 1363985 1393427 1420438 1446071 1471560
50233 1471560 1496910 1520776 1541546 1557872 1568124 1570162 1562213 1543796 1515737 1479715 1438035 1393364
50221 1393364 1348126 1304132 1262914 1226088 1195022 1170145 1150653 1134576 1118900 1100141 1075703
50210 1075703 1045183 1010346 973879 938241 905333 876454 852035 831581 814162 799001 785584
50199 785584 773513 762560 752746 744078 736292 729082 722471 716589 711124 705434 699325 693331 687982 683126
50185 683126 678241 673111 667853 662559 657384 652809 649265 646493 643796 640977 638560 636979 636082 635699 636109
50170 636109 637453 639102 640217 640849 641895 644024 647060 650468 653958 657519 661330 665862 671652 678678
50156 678678 686169 693506 701170 710423 721932 734960 747984 759832 770017 778269 784287 788196 790926
50143 790926 793662 796828 799898 802469 805364 810442 819304 832436 849643 871032 897339 929429 967768
50130 967768 1012324 1062602 1117575 1175836 1236143 1297773 1360044 1421563 1480440 1535603 1587731
50119 1587731 1638657 1689904 1741865 1793963 1844895 1892543 1934000 1966016 1985459 1989615 1976748
50108 1976748 1946976 1902565 1846965 1783358 1714070 1641055 1566471 1492605 1421440 1354513 1293039
50097 1293039 1237927 1189540 1147547 1111042 1078800 1049511 1022102 996171 972166 950969 933121
50086 933121 918493 906656 897396 890760 886743 885039 885047 886098 887844 890480 894404 899477 904808 909402
50072 909402 912826 915079 916209 916433 916357 916434 916218 914732 911616 907418 902598 896897 890087 882883 876475 871287
50056 871287 866634 861617 855939 849867 843782 838041 833091 829366 826962 825530 824753 825004 827325 832542 840392
50041 840392 849692 859325 868974 879068 890242 902732 915979 928932 941038 952844 965192 977965
50029 977965 990181 1001302 1011685 1021473 1029787 1035565 1038685 1039699 1038943 1036656 1033694 1031253 1029754 1028636
50015 1028636 1027482 1026928 1028270 1032569 1040424 1052420 1069377 1091918 1119657 1150862 1183267 1215410
50003 1215410 1247071 1278360 1308904 1338396 1367524 1397558 1428961 1460901 1492033 1520978 1545711
49992 1545711 1563156 1570053 1564236 1545007 1512809 1469042 1415983 1356335 1292696 1227506 1163214 1102023
49980 1102023 1045440 994294 949108 910042 876493 847250 821388 798809 779663 763492 749348
49969 749348 736700 725789 716904 709530 702508 695001 687229 680281 675250 672445 671328 671233 672132 674586
49955 674586 679033 685401 693439 703041 713971 725619 737398 749042 760018 768904 774177 775835 775686
49942 775686 775691 776275 776340 774449 769752 762208 752439 741266 729067 715661 700852 684896 668346 651860
49928 651860 636326 622726 611422 601875 593448 586225 580676 576795 574144 572554 572217 573051 574510 576117
49914 576117 577819 579740 581956 584688 588365 593357 599792 607660 616800 626735 636884 647216 658458
49901 658458 671377 685863 700836 714969 727327 737418 744972 749918 752499 753099 751830 748357 742272
49888 742272 733536 722527 709847 696304 682808 669812 656885 643353 629450 616381 605039 595113
49876 595113 585705 576439 567613 559662 552873 547425 543269 540107 537809 536658 536917 538348 540528 543507
49862 543507 547760 553593 560826 569000 577742 587146 597904 610730 625367 640571 655267 669212 682070
49849 682070 692551 699368 702792 704385 705300 705547 704720 702441 697995 690505 680004 667742 655110 642723
49835 642723 630794 619769 610118 601918 595112 589903 586485 584585 583614 583233 583570 584979 587747 591929
49821 591929 597426 604314 613040 624002 636915 650844 664865 678411 690990 702032 711182 718499
49809 718499 724202 728473 731544 733591 734327 732923 728634 721476 712307 702369 692667 683553 674803 666201
49795 666201 657874 649936 642099 634095 626302 619448 613753 608849 604511 600927 598212 596209 594878 594360
49781 594360 594473 594633 594438 593938 593255 592492 592184 593243 596091 600292 605311 611191 618132 625813 633454 640286
49765 640286 645661 649088 650596 650894 650893 651148 651703 652109 651487 649066 644873 639451 632791 624126 613121 600769
49749 600769 588601 577435 567332 558387 550936 545138 540801 537570 535013 532707 530515 528640 527225
49736 527225 526149 525355 524991 525084 525500 526502 528739 532251 536018 539197 542393 546996 553470 561020 568877
49721 568877 577192 586561 597189 608682 620224 630786 639442 645660 649341 650772 650686 650005 649035 647006
49707 647006 642816 636208 627973 619149 610400 602096 594561 588042 582655 578360 574943 572098 569641 567560
49693 567560 565879 564814 565057 567340 571362 575702 579328 582809 587446 593525 600095 606345 612480 619243
49679 619243 627180 636516 647299 659509 673209 688478 704839 720850 734704 745210 751950 754819
49667 754819 754062 750651 745994 741204 737037 734339 733765 734950 736571 737331 736272 732197 723815 711042 695527
49652 695527 679291 663323 647912 633716 621570 611452 602545 594500 588060 584187 582947 583558 585258
49639 585258 587802 591177 595125 599017 602105 603801 603809 602147 599086 595000 590222 585045 579828 574894 570264
49624 570264 565701 561165 557079 553931 551715 549958 548226 546420 544697 543351 542722 542910 543579 544243 544797
49609 544797 545562 546808 548456 550274 552118 553845 555184 555886 555999 555902 556050 556650 557573 558585 559657 560912
49593 560912 562299 563524 564451 565346 566523 567894 569152 570293 571696 573726 576433 579543 582423 584150 583997
49578 583997 582120 579663 577987 577777 578864 580765 583230 586227 589557 592826 596014 599857 605368 613008
49564 613008 622539 633508 645380 657196 667722 676200 682653 687322 690278 691704 691940 690870 687863
49551 687863 682877 677171 672293 668694 665819 663281 661265 660027 659594 659836 660287 660080 658705 656734 655242
49536 655242 654614 654470 654612 655407 657266 660426 665255 672108 680809 690768 701713 713810 727194 742041
49522 742041 759022 778738 800282 820950 837781 849214 855363 857428 857112 856015 855102 854917 856226
49509 856226 859872 865837 872946 879653 884615 886515 884168 877344 866983 854312 840183 825445 811219
49496 811219 798217 786318 775275 765391 756980 749627 742577 735620 729131 723520 719121 716277 714973
49483 714973 714579 714463 714731 715892 717968 720388 722673 724731 726526 727932 728971 729838 730631 731299 731917 732766
49467 732766 734068 735805 737774 739701 741339 742568 743407 743902 744090 744003 743506 742169 739592 735944 731878 727825
49451 727825 723720 719489 715385 711619 708047 704490 701101 698135 695616 693386 691205 688707 685716 682803
49437 682803 681018 680778 681527 682866 685408 689951 696306 703640 711665 720798 731364 743250 756160 769607
49423 769607 782939 796066 809834 824684 838881 849021 852754 850531 844782 838164 832833 830300 831057
49410 831057 834497 839668 845906 852559 858718 863878 868673 874339 881554 890174 899977 911078 923491 936812
49396 936812 950592 964709 979100 993373 1006985 1019663 1031300 1041445 1049253 1054127 1056173 1055820
49384 1055820 1053203 1048203 1040952 1031947 1021648 1010361 998601 987249 977072 968290 960845 954898 950828
49371 950828 948819 948647 949857 952089 955280 959609 965049 970848 975666 978404 978863 977544 975059 971820 967942
49356 967942 963129 956868 949043 940243 931305 922776 915013 908451 903352 899558 896997 896181 897577 900493
49342 900493 903295 904917 905632 906111 906213 905056 901992 897095 890911 884068 877085 870256 863706 857718 852987
49327 852987 850356 850219 852152 855208 858617 862275 866519 871402 876385 880901 885114 889824 895645 902582
49313 902582 910430 919265 929319 940632 953102 966774 981892 998709 1017392 1037891 1059493 1080318
49301 1080318 1097545 1108600 1112402 1109568 1101478 1089250 1073568 1055228 1035462 1015671 997028 980366
49289 980366 966171 954450 944770 936617 929662 923578 917890 912316 907179 903106 900387 898953 898922 900730
49275 900730 904548 909916 916153 922832 929610 935911 941149 945192 948322 950885 953222 955687 958233 960118
49261 960118 960611 960144 960150 961556 964072 967528 973169 982620 995706 1010396 1025018 1039325 1052738 1062654
49247 1062654 1065825 1061173 1050239 1035007 1016431 995313 973423 952887 934861 919302 905707 893638
49235 893638 882941 873969 867482 863948 863071 864226 867044 871263 876392 882095 888742 897067 907305 919008
49221 919008 931539 944313 956641 967929 978121 987546 996254 1003867 1010123 1015111 1018876 1021250 1022332
49208 1022332 1022868 1023927 1026441 1031090 1038251 1047746 1058983 1071638 1085972 1102155 1119502 1136792 1153269
49195 1153269 1168977 1184197 1198932 1213013 1226302 1238617 1249721 1259608 1268602 1276965 1284624 1291492
49183 1291492 1297870 1304243 1310853 1317903 1326153 1336838 1350900 1368682 1390435 1416672 1447816 1484108
49171 1484108 1526141 1574479 1627567 1680113 1724737 1755844 1771879 1774455 1766725 1752960 1738160 1726364
49159 1726364 1719040 1715535 1714735 1715705 1717111 1717204 1714903 1710597 1705648 1701355 1698421 1697081 1697463 1699797 1704283
49144 1704283 1710854 1719222 1729182 1740542 1752742 1765028 1777341 1790543 1805387 1821616 1838512 1855811
49132 1855811 1873408 1890681 1907091 1923278 1940462 1958662 1976485 1992992 2008808 2024959 2041544
49121 2041544 2058282 2075575 2094020 2113260 2132283 2150865 2169948 2190659 2213665 2239638 2269650
49110 2269650 2304856 2346372 2395977 2456344 2529249 2612475 2698395 2777054 2842924 2900004 2959192
49099 2959192 3027887 3100116 3157107 3179455 3160911 3112022 3051250 2992026 2936266 2877747 2810316
49088 2810316 2733513 2652376 2573670 2502646 2442088 2392652 2353357 2322299 2297752 2278762 2264682
49077 2264682 2254471 2246950 2241424 2237377 2233643 2228699 2222130 2215110 2208975 2203769 2198772 2193949 2190002 2187074
49063 2187074 2184240 2180498 2175728 2170427 2164986 2159486 2153894 2148206 2142608 2137595 2133585 2130360 2127278 2124237
49049 2124237 2121986 2121206 2121687 2122794 2124426 2127141 2131647 2138628 2148752 2162173 2177896 2193995 2208523
49036 2208523 2220036 2227501 2230419 2229407 2226369 2223687 2223000 2224584 2227629 2231075 2234339 2237437 2240523 2243398
49022 2243398 2245522 2246424 2246098 2245130 2244413 2244530 2245365 2246524 2248193 2251203 2256099 2262406 2269124 2275732 2282489
49007 2282489 2290031 2298985 2309724 2322017 2334933 2347452 2359234 2370592 2381793 2392596 2402401 2410610
48995 2410610 2416932 2421604 2425309 2428639 2431618 2433829 2434884 2434653 2433251 2431024 2428394 2425599 2422789 2420450
48981 2420450 2419230 2419017 2418658 2417112 2414578 2411920 2409345 2406342 2402651 2398460 2393682 2387913 2381287 2374630
48967 2374630 2368492 2362674 2356981 2351788 2347534 2344241 2341953 2341091 2341852 2343752 2346352 2350106 2355857 2363627
48953 2363627 2372478 2381501 2390498 2399766 2409782 2421128 2434265 2449082 2464893 2480933 2496797 2512542
48941 2512542 2528856 2547144 2568880 2594480 2623057 2653585 2686043 2721059 2758726 2798436 2839941
48930 2839941 2883891 2930990 2981030 3033190 3086862 3141696 3197168 3252926 3309629 3368679 3430819
48919 3430819 3495357 3560889 3626217 3690386 3752498 3812120 3869564 3925312 3979412 4031792 4082676
48908 4082676 4132110 4179318 4223265 4263913 4302465 4340317 4378112 4415637 4452180 4486925 4519426
48897 4519426 4549831 4578551 4605857 4631987 4657224 4681337 4703146 4721250 4735142 4745153 4751442
48886 4751442 4753772 4752310 4747893 4741132 4731723 4719003 4702858 4683853 4662655 4639465 4613760 4584443
48874 4584443 4550510 4511681 4468240 4420389 4368165 4312022 4253039 4192413 4131009 4069493 4008510
48863 4008510 3948567 3890009 3833272 3778849 3726842 3676753 3627899 3580003 3533473 3489283 3448440
48852 3448440 3411213 3376926 3344757 3314687 3287394 3263425 3242960 3226195 3213385 3204357 3198489 3195182
48840 3195182 3193997 3194446 3196272 3199949 3206265 3215318 3226514 3239617 3255056 3272934 3292466 3312772 3333620
48827 3333620 3354975 3376433 3397645 3418864 3440527 3462615 3484881 3507308 3529846 3552064 3573691
48816 3573691 3595371 3618287 3643029 3669111 3695500 3721232 3745721 3768944 3791453 3813924 3836637
48805 3836637 3859508 3882565 3906158 3930765 3956751 3984266 4013235 4043402 4074344 4105322 4135229
48794 4135229 4163085 4188688 4212487 4234724 4255024 4273060 4289255 4304489 4319267 4333428 4346476
48783 4346476 4357838 4366706 4371789 4371498 4364723 4351716 4334056 4313385 4290161 4263933 4234637 4203023
48771 4203023 4169766 4134794 4097784 4058811 4018023 3975056 3929223 3880349 3829241 3777322 3725780
48760 3725780 3674874 3624160 3573619 3524340 3477689 3433955 3392483 3353053 3316288 3282551 3251255
48749 3251255 3221661 3193620 3166968 3140862 3114526 3088424 3064131 3043230 3026639 3014645 3006945
48738 3006945 3002717 3000957 3000665 3000607 2999425 2996410 2991891 2986563 2980792 2975008 2970237 2967537 2967016 2967950 2969770
48723 2969770 2972427 2975927 2980034 2984517 2989242 2993842 2997554 2999525 2999333 2997286 2994310 2991370 2988888 2986797
48709 2986797 2985059 2983805 2983054 2982766 2983301 2985279 2988730 2992871 2996999 3001158 3005592 3010015 3013867 3016998 3019745
48694 3019745 3022671 3026471 3031615 3037720 3043643 3048544 3052413 3055242 3056425 3055639 3053778 3052291 3051953 3052979
48680 3052979 3055765 3060503 3066217 3071167 3074306 3075663 3075335 3072941 3068172 3061167 3052145 3041265 3029009 3016035
48666 3016035 3002323 2987031 2969613 2950730 2931597 2912629 2893096 2872037 2849103 2824312 2797223
$$ [...]
##END NTUPLES=NMR SPECTRUM
##END=
