
##TITLE=UV1266_M12_1292-1216_30_7414685_ONE5TAF8Cc
##JCAMPDX= 6.0         $$ Bruker NMR JCAMP-DX V2.0
##DATA TYPE= NMR SPECTRUM
##DATA CLASS= NTUPLES
##ORIGIN= BRUKER
##OWNER= Administrator
$$ 1.72 TOPSPIN		Version 2.1
$$ 2013-01-25 18:19:09.129 -0500  Administrator@X
$$ Compression mode = diff/dup
##.OBSERVE FREQUENCY= 400.02188249412
##.OBSERVE NUCLEUS= ^1H
##.ACQUISITION MODE= SIMULTANEOUS (DQD)
##.ACQUISITION SCHEME= undefined
##.AVERAGES= 8
##.DIGITISER RES= 22
##SPECTROMETER/DATA SYSTEM= spect
##.PULSE SEQUENCE= zg30
##.SOLVENT NAME= COFFEE_meoh
##.SHIFT REFERENCE= INTERNAL, COFFEE_meoh, 1, 14.98509
##AUDIT TRAIL= $$ (NUMBER, WHEN, WHO, WHERE, PROCESS, VERSION, WHAT)
$$ ##TITLE= Audit trail, TOPSPIN		Version 2.1
$$ ##JCAMPDX= 5.01
$$ ##ORIGIN= Bruker BioSpin GmbH
$$ ##OWNER= Administrator
$$ $$ E:\/data/COFFEE/nmr/UV1266_M12_1292-1216_30_7414685_ONE5TAF8Cc/10/pdata/1/auditp.txt
$$ ##AUDIT TRAIL=  $$ (NUMBER, WHEN, WHO, WHERE, PROCESS, VERSION, WHAT)
(   1,<2013-01-25 18:18:59.462 -0500>,<Administrator>,<X>,<go>,<TOPSPIN 2.1>,
      <created by zg
	started at 2013-01-25 18:17:51.951 -0500,
	POWCHK enabled, PULCHK disabled,
       configuration hash MD5:
       86 BA 57 50 F2 9D 5C 9B 26 00 A9 28 5F 66 2E 89
       data hash MD5: 64K
       0C EA 10 89 EF 51 0E 0B 68 8A F7 01 77 5F 5F 9C>)
(   2,<2013-01-25 18:19:03.962 -0500>,<Administrator>,<X>,<proc1d>,<TOPSPIN 2.1>,
      <Start of raw data processing
       efp LB = 0 FT_mod = 6 PKNL = 1 PHC0 = 0 PHC1 = 0 SI = 32K 
       data hash MD5: 32K
       16 D1 06 C9 F6 7E 73 23 8E 5E 82 31 24 58 28 1C>)
(   3,<2013-01-25 18:19:04.473 -0500>,<Administrator>,<X>,<proc1d>,<TOPSPIN 2.1>,
      <pk PHC0 = 99.60754 PHC1 = 0 
       data hash MD5: 32K
       D9 B9 67 C0 38 07 CE 28 71 4E 88 D3 38 72 F1 B3>)
(   4,<2013-01-25 18:19:04.767 -0500>,<Administrator>,<X>,<proc1d>,<TOPSPIN 2.1>,
      <abs ABSG = 1 
       data hash MD5: 32K
       34 F4 07 68 B6 0E 1C 9B E1 68 F4 1A BD 35 89 A6>)
(   5,<2013-01-25 18:19:04.906 -0500>,<Administrator>,<X>,<proc1d>,<TOPSPIN 2.1>,
      <abs ABSG = 2 
       data hash MD5: 32K
       52 98 B8 E4 EA A0 9A FB 1E C2 43 3B 38 8B EB 7E>)
(   6,<2013-01-25 18:19:05.060 -0500>,<Administrator>,<X>,<proc1d>,<TOPSPIN 2.1>,
      <abs ABSG = 3 
       data hash MD5: 32K
       79 7A 5B 12 86 F8 2D 09 1E DC 50 A3 46 DD F0 36>)
(   7,<2013-01-25 18:19:05.215 -0500>,<Administrator>,<X>,<proc1d>,<TOPSPIN 2.1>,
      <abs ABSG = 4 
       data hash MD5: 32K
       12 F9 8C 1B A0 5C 06 12 65 86 CB 18 CC DB 6F CB>)
(   8,<2013-01-25 18:19:05.370 -0500>,<Administrator>,<X>,<proc1d>,<TOPSPIN 2.1>,
      <abs ABSG = 5 
       data hash MD5: 32K
       97 3E 6E 0B DB B3 BF 65 6E D9 8C AD A6 BD 92 CF>)
$$ ##END=
$$ 
$$ $$ hash MD5
$$ $$ 57 27 DB D1 38 F2 F0 2D 95 61 B0 96 49 38 78 72
##$RELAX= 
##$RELAX= 
##$RELAX= 
##$RELAX= 
##$RELAX= 
##$RELAX= 
##$RELAX= 
$$ Bruker specific parameters
$$ --------------------------
##$DU= <E:\>
##$EXPNO= 10
$$ [...]
150 150 150 150 150 150 150 150
##$TP07= 0
##$TPNAME0= <>
##$TPNAME1= <>
##$TPNAME2= <>
##$TPNAME3= <>
##$TPNAME4= <>
##$TPNAME5= <>
##$TPNAME6= <>
##$TPNAME7= <>
##$TPOAL= (0..7)
0.5 0.5 0.5 0.5 0.5 0.5 0.5 0.5
##$TPOFFS= (0..7)
0 0 0 0 0 0 0 0
##$TUNHIN= 0
##$TUNHOUT= 0
##$TUNXOUT= 0
##$USERA1= <user>
##$USERA2= <user>
##$USERA3= <user>
##$USERA4= <user>
##$USERA5= <user>
##$V9= 5
##$VALIST= <valist>
##$VCLIST= <CCCCCCCCCCCCCCC>
##$VD= 0
##$VDLIST= <DDDDDDDDDDDDDDD>
##$VPLIST= <PPPPPPPPPPPPPPP>
##$VTLIST= <TTTTTTTTTTTTTTT>
##$WBST= 2048
##$WBSW= 25
##$XGAIN= (0..3)
0 0 0 0
##$XL= 0
##$YL= 0
##$YMAX_a= 668535
##$YMIN_a= -569463
##$ZGOPTNS= <>
##$ZL1= 120
##$ZL2= 120
##$ZL3= 120
##$ZL4= 120
##$ABSF1= 14.98509
##$ABSF2= -5.573092
##$ABSG= 5
##$ABSL= 3
##$ALPHA= 0
##$AQORDER= 0
##$ASSFAC= 0
##$ASSFACI= 0
##$ASSFACX= 0
##$ASSWID= 0
##$AUNMP= <proc_prof1d_extract_pilot.lims>
##$AXLEFT= 0
##$AXNAME= <>
##$AXNUC= <1H>
##$AXRIGHT= 0
##$AXTYPE= 0
##$AXUNIT= <>
##$AZFE= 0.1
##$AZFW= 0.1
##$BCFW= 0
##$BC_mod= 0
##$BYTORDP= 0
##$COROFFS= 0
##$CY= 15
##$DATMOD= 1
##$DC= 0
##$DFILT= <>
##$DTYPP= 0
##$F1P= 0
##$F2P= 0
##$FCOR= 0.5
##$FTSIZE= 32768
##$FT_mod= 6
##$GAMMA= 0
##$GB= 0
##$INTBC= 1
##$INTSCL= 1
##$ISEN= 128
##$LB= 0
##$LEV0= 0
##$LPBIN= 0
##$MAXI= 10000
##$MC2= 0
##$MEAN= 0
##$ME_mod= 0
##$MI= 0
##$NCOEF= 0
##$NC_proc= -8
##$NLEV= 6
##$NOISF1= 0
##$NOISF2= 0
##$NSP= 0
##$NTH_PI= 0
##$NZP= 0
##$OFFSET= 14.98509
##$PC= 1
##$PHC0= 99.60754
##$PHC1= 0
##$PH_mod= 1
##$PKNL= yes
##$PPARMOD= 0
##$PPDIAG= 0
##$PPIPTYP= 0
##$PPMPNUM= 2147483647
##$PPRESOL= 1
##$PSCAL= 4
##$PSIGN= 0
##$PYNMP= <proc.py>
##$REVERSE= no
##$SF= 400.02
##$SI= 32768
##$SIGF1= 0
##$SIGF2= 0
##$SINO= 400
##$SIOLD= 32768
##$SPECTYP= <>
##$SREGLST= <1H.CDCl3>
##$SSB= 0
##$STSI= 32768
##$STSR= 0
##$SW_p= 8223.68421052631
##$SYMM= 0
##$S_DEV= 0
##$TDeff= 65536
##$TDoff= 0
##$TI= <>
##$TILT= no
##$TM1= 0
##$TM2= 0
##$TOPLEV= 0
##$USERP1= <user>
##$USERP2= <user>
##$USERP3= <user>
##$USERP4= <user>
##$USERP5= <user>
##$WDW= 1
##$XDIM= 32768
##$YMAX_p= 470256218
##$YMIN_p= -737504
##$CURPLOT= <Network HP LaserJet P1505>
##$CURPRIN= <$Network HP LaserJet P1505>
##$DFORMAT= <normdp>
##$LAYOUT= <+/1D_H.xwp>
##$LFORMAT= <normlp>
##$PFORMAT= <normpl>
##$SURQMSG= 1
$$ End of Bruker specific parameters
$$ ---------------------------------
##NTUPLES= NMR SPECTRUM
##VAR_NAME=  FREQUENCY,     SPECTRUM/REAL,   SPECTRUM/IMAG
##SYMBOL=    X,             R,               I
##VAR_TYPE=  INDEPENDENT,   DEPENDENT,       DEPENDENT
##VAR_FORM=  AFFN,          ASDF,            ASDF
##VAR_DIM=   32768,         32768,           32768
##UNITS=     HZ,            ARBITRARY UNITS, ARBITRARY UNITS
##FACTOR=    0.250966925370066, 1,           1
##FIRST=     8223.43324360094, 67683,        -207967
##LAST=      0,             -42,             -42764
##MIN=       0,             -737504,         0
##MAX=       8223.43324360094, 470256218,    0
$$ Real data points
##PAGE= N=1
##DATA TABLE= (X++(R..R)), XYDATA
$$ [...]
$$ plain form
19535 -306066 -186398 157799 13407 220077 -224486 -54888 -290794 -153487 -293162 -95655
19524 -203904 117088 -37238 -132687 -21719 -73242 79062 277092 190261 10768 -347851 -250033
19513 -250033 91440 -22835 -282325 226873 -5651 -5977 -116894 280273 154650 -172412 -73133
19501 -46066 23098 -146432 107804 -185380 284339 -118032 -226545 64759 -98574 -70345
19491 -70345 545 -240610 332546 -251780 2738 19620 337070 -136240 -83086 -216470 -331021
19480 -331021 2980 -78427 -216782 -59204 -205969 25245 -283419 113853 120958 245249 90505
19468 312159 -211426 -256782 -267534 -378 69387 23785 182302 11534 -22020 67328 -88029
19456 -234769 -115435 222939 126336 -58270 -45247 -377387 -227867 56392 -196527 -79656
$$ packed form
19535c06066J19668A57799A3407K06670b24486e4888k35906J37307j39675i5655
19524b03904A17088c7238r5449b1719n1523G9062J98030q6831A0768c47851R7818
19513b50033I1440b2835k59490B26873e651l26j10917B80273j25623a72412g3133
19501d6066B3098a46432A07804a85380B84339a18032j08513F4759i8574K8229
19491g0345E45b40610C32546b51780B738J6882L17450a36240N3154j33384j14551
19480c31021B980g8427j38355e9204j46765B5245b83419A13853P105J24291I0505
19468C12159b11426m5356j0752c78F9387B3785J58517A1534b2020F7328h8029
19456b34769a15435B22939r6603e8270J3023l32140J49520E6392a96527g9656
$$ plain form
19445 333541 -219366 -241814 -338707 -55318 -184703 168561 176719 -22047 -233241 125253 272140
19434 272140 -380788 70092 -206101 -271922 -227809 387506 153237 21364 -226358 -303353
19424 -303353 -111912 -180271 -451554 -322487 -214754 -35268 29880 220208 -230495 -160381
19414 -160381 -125323 280835 -153705 -193337 266673 -42334 178275 -273980 44351 -93890
19403 12905 178053 86094 104888 22720 -168735 -420475 333307 -466371 -224769 49289
19392 -2474 -106903 -38916 -72003 -49082 112941 -300351 324236 34954 94165 -83137 -75817
19381 -75817 -334239 60328 -338077 33087 -279931 30050 303002 -48155 -233701 -88553 298259
19369 -170175 191725 -85444 -237190 60169 -39794 92030 -83723 -291539 -228900 -241306 -81618
$$ packed form
19445C33541b19366k2448r6893e5318j29385A68561Q158b2047k11194A25253J46887
19434B72140c80788G0092b06101o5821M4113C87506A53237B1364b26358p6995
19424c03353a11912o8359k71283J29067J07733c5268B9880J90328b30495P0114
19414a60381L5058B80835a53705l9632B66673d2334A78275b73980D4351i3890
19403A2905J65148H6094J8794B2720a68735k51740C33307d66371b24769D9289
19392b474j04429c8916l3087K2921A12941c00351C24236C4954N9211h3137P320
19381g5817k58422F0328c38077C3087b79931C0050K72952d8155j85546h8553B98259
19369a70175A91725h5444j51746F0169c9794I2030h3723k07816O2639j2406h1618
$$ plain form
19357 43291 -296258 -136999 -67318 215518 189681 -93157 -258737 -181906 -170303 -81067 -297992
19346 -297992 -23609 -217299 180169 -110404 -130888 -10281 -30064 -94659 -286805 57126 -383638
19334 -56818 119874 -122295 -233009 42905 -150233 -164436 -162375 36278 132207 -100646 -172491
19323 -172491 -40312 -321575 -306882 -44968 -260193 137494 144174 13276 61232 -56391 -46603
19312 -46603 -351348 -101370 105876 300108 -312178 103492 61125 -45341 64147 -405624
19301 -22995 38879 4079 -131259 -247702 -36039 -48621 104796 -164221 -161908 22424 -48602
19289 136934 191329 238978 -295166 -156522 35828 28104 414951 -152468 -422776 25726 -197932
19277 36884 198763 -75613 28037 -280830 -132918 -83005 -220589 -119632 39760 6169 68436
$$ packed form
19357D3291b96258a36999f7318B15518k5837i3157j65580P6831J1603h1067k16925
19346b97992b3609j93690A80169a10404k0484a0281j9783o4595j92146E7126c83638
19334e6818A19874a22295j10714D2905a50233j4203K061C6278R5929a00646p1845
19323a72491d0312k81263J4693d4968k15225A37494O680A3276M7956e6391R788
19312d6603l04745a01370A05876J94232c12178A03492m2367d5341F4147d05624
19301b2995C8879D079a31259j16443c6039j2582A04796a64221K313B2424d8602
19289A36934N4395M7649b95166J38644C5828p724L86847a52468k70308B5726a97932
19277C6884J61879g5613B8037b80830a32918M9913j37584J00957C9760F169O2267
$$ plain form
19266 68436 -6154 50435 -230476 10652 11044 -411559 -125891 34178 387934 -196619 -246427
19255 -246427 -304083 148956 278860 -111116 -282124 -161587 -228625 -69439 -20147 -216128
19245 -216128 70102 37424 -26140 -365172 125374 -465925 61591 167528 -442123 -163686
19234 -140735 -111745 -134886 -103094 -66747 -115639 125663 -195596 68918 -306100 137178 252979
19223 252979 68437 -440732 -92672 13852 -145846 -84065 52438 -26159 -195523 68519 -37825
19211 -33083 -78505 -121377 -9696 3266 -126129 -67667 86892 217490 -68533 -132377 -72347 -187110
19199 -187110 106833 -356135 59874 50428 71320 2022 -439299 -176922 -243116 -180192 -176920
19188 -176920 -453039 104539 -72013 194623 123224 16644 89026 -72731 80197 -125070 -403752
$$ packed form
19266F8436f154E0435b30476A0652L92d11559a25891C4178L53756a96619m9808
19255b46427n7656A48956J29904a11116j71008J20537o7038f9439b0147j95981
19245b16128G0102l2678b6140l39032A25374d65925F1591J05937d42123a63686
19234a40735K8990k3141L1792L6347m8892A25663a95596F8918c06100A37178J15801
19223B52979F8437d40732i2672A3852a45846O1781E2438b6159j69364F8519c7825
19211c3083m5422m2872i696C266a26129N8462H6892J30598f8533o3844O0030j14763
19199a87110A06833c56135E9874r446K0892B022d39299a76922o6194O2924L272
19188a76920k76119A04539g2013A94623p1399A6644P2382g2731H0197a25070k78682
$$ plain form
19177 -403752 -114824 84815 133694 35032 -122179 4281 -173122 -31300 87021 52889 -102069
19165 146403 -31424 4290 -150527 -274284 10353 -397408 -87851 213777 -154253 -211376 -245475
19154 -245475 86942 -197173 19824 -189200 -99587 -49862 357069 -87906 32473 56050 12686
19142 -164815 -3643 246726 -179638 -130005 -54809 38940 -162232 204364 6995 -361866 -5298
19130 -604564 -105174 151474 -98518 -138005 -299920 -213684 -122300 114907 -268442 301753
19119 -454831 158906 -177124 -72736 -136092 -7186 -233529 -159971 -93790 -235932 22070 173922
19108 173922 -207351 -10089 -19991 -27955 -224166 133915 -90721 -318040 -280623 -108509 112896
19096 -108354 123655 35457 -58855 379290 -37816 45298 340619 -162598 250269 -44324
$$ packed form
19177d03752a14824H4815M8879C5032a22179D281a73122c1300H7021l4132a02069
19165A46403c1424D290a50527j23757A0353c97408h7851B13777a54253n7123l4099
19154b45475H6942a97173A9824a89200Q9613M9725C57069h7906C2473K3577A2686
19142a64815c643B46726a79638M9633e4809C8940a62232B04364F995c61866e298
19130f04564a05174A51474i8518l9487j61915Q6236R1384A14907b68442C01753
19119d54831A58906a77124g2736o3356g186k26343P3558O6181j42142B2070J51852
19108A73922b07351a0089r902p964j96211A33915i0721k27319L7417a08509A12896
19096a08354A23655C5457e8855C79290c7816D5298K95321a62598B50269d4324
$$ plain form
19085 -98228 45699 -66467 -53403 -40130 15069 -79848 11870 198478 200957 21867 167441
19074 167441 165395 49554 -155073 311163 104632 290328 224066 242089 -19400 -292797 -113026
19062 -396399 -119007 149145 -40690 -148426 31203 220820 104928 137479 -218739 241258
19051 -95756 -66317 -153269 313205 124170 168125 204389 -212709 -213231 64260 116684 -179831
19039 2494 -143484 91802 -178006 -26587 -125096 218127 -38775 -73832 130401 413346 -144808
19027 -25425 45797 -14634 129288 -107903 -157092 161385 223553 341842 73093 -454000 32975
19015 61891 195887 99303 268094 -45735 -225674 -29385 -66716 -188363 241530 -54415 -25588
19003 -252894 -191797 -250568 45612 -19414 -30727 -10707 -114600 326006 -161887 -445271 -146216
$$ packed form
19085i8228D5699f6467J3064J3273A5069g9848A1870J86608K479B1867J45574
19074A67441k046D9554a55073C11163A04632J85696o6262J8023a9400k73397a13026
19062c96399a19007A49145d0690j07736C1203J89617A04928L2551b18739B41258
19051i5756K9439q6952C13205A24170M3955L6264b12709n22F4260N2424a79831
19039B494a43484I1802a78006b6587r8509B18127c8775l5057A30401K82945a44808
19027b5425D5797a4634A29288a07903m9189A61385O2168J18289G3093d54000C2975
19015F1891J33996r6584J68791d5735j79939b9385l7331j21647B41530e4415b5588
19003b52894O1097n8771D5612a9414j1313a0707j03893C26006a61887k83384a46216
$$ plain form
18991 -60249 -201386 60674 369735 -323646 72294 207969 36096 158949 -252333 -212042
18981 -212042 106058 61897 -126610 -260628 -272114 -27990 -168426 -133711 -667421 14463
18970 -26870 -182903 -284740 -15452 -211830 -113266 -130864 -109968 -109743 -230835 -134280 -351712
18959 -351712 124873 79511 -158442 70702 -129765 150085 -109849 125034 393674 65 40443
18948 40443 -121270 -208312 -216275 74460 -65766 -382 -205232 185265 228680 -296501 -281650
18937 -281650 -265114 135742 -281418 -174782 25373 -18853 329132 37156 -57506 -145396 51196
18925 -108296 90311 -228622 119614 -104588 -339382 -245000 -166372 102214 -67569 36072
18914 -110153 45591 23582 -238532 -20594 -243693 167150 81218 -365475 4325 249380 -146408
$$ packed form
18991f0249j41137F0674L09061c23646G2294J35675C6096J22853b52333M0291
18981b12042A06058m4161a26610j34018j1486b7990j40436L4715n33710A4463
18970b6870j56033j01837a5452j96378R8564j7598K0896K25j21092R6555k17432
18959c51712A24873m5362a58442G0702a29765A50085a09849A25034K68640F5M0378
18948D0443a21270q7042p963G4460f5766c82k04850A85265M3415b96501J4851
18937b81650J6536A35742b81418J06636B5373a8853C29132C7156e7506q7890E1196
18925a08296I0311b28622A19614a04588k34794R4382P8628A02214f7569C6072
18914a10153D5591k2009b38532b0594k23099A67150H1218c65475D325K45055a46408
$$ plain form
18902 -337047 -117330 67500 -145853 155865 -260678 -6899 -63571 205131 164477 167080 -42809
18890 328185 105599 160988 -208287 -235571 -38751 87982 187053 -43927 -329672 366449 -119662
18878 -168668 -224098 326948 -210557 39342 122813 -447087 -145227 72091 -17102 -165840
18868 -165840 -134840 -77602 -337772 -251939 -47506 262623 -125667 -289210 -407643 133301
18857 1448 -73305 43050 109129 -5119 -132913 -105339 -232005 156330 -124338 187216 -30875
18845 331594 391684 27181 17401 16557 106476 -115290 -118194 -194671 288136 -20896 -78984 -134567
18833 -134567 -276472 -46272 -153683 172078 -253763 5666 -257012 -436616 167691 -152975
18822 -273220 -302209 -94369 156085 -77899 38965 -16646 264321 -28533 -111026 -129008 104960
$$ packed form
18902c37047a17330F7500a45853A55865b60678f899n6672B05131m0654K603d2809
18890C28185A05599N5389b08287k7284c8751H7982R9071d3927k85745C66449a19662
18878a68668n5430C26948b10557C9342Q3471d47087a45227G2091a7102j48738
18868a65840L1000N7238k60170Q5833d7506B62623a25667j63543j18433A33301
18857A448g3305D3050O6079e119j27794K7574j26666A56330a24338A87216c0875
18845C31594O0090B7181r780q44Q9919a15290k904p6477B88136b0896n8088n5583
18833a34567j41905d6272j07411A72078b53763E666b57012j79604A67691a52975
18822b73220k8989i4369A56085g7899C8965a6646B64321b8533q2493j7982A04960
$$ plain form
18810 -180498 312611 71572 160350 -23295 -317679 -215378 312351 -189043 225516 -163685
18799 -35814 -77546 77918 -45339 25089 -8753 -50577 -150341 -95613 -360716 -126901 -356872
18788 -356872 186424 151881 -162572 -193890 -224049 -156571 -122166 -307096 -166085 -163876 -290002
18777 -290002 -142595 -259861 -326608 -148890 -314642 -172750 -44626 -197851 211401 -49927
18766 -203201 157703 -196975 254563 265344 60949 -5293 -453201 -561558 35576 -82222 357980
18754 -116151 -66285 -220341 190462 130734 57902 -195258 384415 -32970 -15655 -77043 -305115
18743 -305115 83068 -49812 -136964 -119672 105509 -118024 60951 231629 -107277 432986
18732 -359 -143893 -135010 136219 -557 51497 -34447 -123791 -236566 -246876 123064 127232 90197
$$ packed form
18810a80498C12611G1572Q8778b3295k94384J02301C12351a89043B25516a63685
18799c5814m1732G7918d5339B5089h753m1824r9764N4728k65103a26901k29971
18788c56872A86424l4543a62572l1318l0159O7478L4405j84930J41011K209j26126
18777b90002a42595j17266o6747a48890j65752J41892d4626j53225B11401d9927
18766b03201A57703a96975B54563J0781F0949e293m47908j08357C5576h2222C57980
18754a16151M9866j54056A90462n9728E7902a95258C84415c2970a5655o1388k28072
18743c05115H3068d9812q7152J7292A05509a18024F0951J70678a07277D32986
18732c59j43534Q883A36219e57E1497c4447q9344j12775j0310A23064M168l7035
$$ plain form
18720 90197 -359179 -149646 -148181 -264588 152369 8152 -342658 -232294 62268 39530 -127159
18708 -5983 385959 63957 -117102 80664 -7771 7593 -53117 -7610 -165781 -452202 -232812
18697 -232812 44208 82313 -148200 -503623 -145300 -67954 25678 -71756 -65910 13773 -31292
18685 -211622 1981 -109676 -556826 -147608 -275696 211852 -76483 89734 27922 -250814
18674 411304 -78807 -132546 450543 27241 213515 11518 77167 -74698 -26682 -18531 -148043
18663 -148043 -102386 56712 139893 230733 -117935 21432 -352294 -298965 -24869 177132 -213428
18651 -157284 -68243 105127 70850 -97341 -24501 35877 -231886 -366558 -83347 125566 102721
18640 102721 102317 -160746 -243553 458394 -173341 85907 -261934 16566 -291592 -267684 56138
$$ packed form
18720I0197c59179a49646J465j16407A52369H152c42658J10364F2268k2738a27159
18708e983C85959F3957a17102H0664g771G593e3117g610j58171k86421K19390
18697b32812D4208L8105a48200l55423a45300f7954B5678g1756N846A3773c1292
18685b11622A981a09676m47150a47608j28088B11852g6483H9734B7922b50814
18674D11304g8807n3739D50543B7241J86274A1518O5649g4698b6682Q151j29512
18663a48043M5657E6712Q3181R0840a17935B1432c52294N3329b4869A77132b13428
18651a57284f8243A05127l4277i7341b4501C5877b31886j34672h3347A25566k2845
18640A02721m04a60746q2807D58394a73341H5907b61934A6566b91592K3908E6138
$$ plain form
18628 -147986 4050 197324 144005 -236080 186148 -56749 385974 -37094 -228465 -277168 -23186
18616 -571657 282483 -219733 -169959 30763 -79149 76349 -2781 -86570 -262877 102862 -6691
18604 123259 -1687 -153 -164977 -91549 38857 -210270 -125723 -284814 -112870 -24309 -250098
18593 -250098 -279292 -73033 255999 15082 -214999 105664 -176457 -156930 129803 -194103
18582 2713 -48413 27614 -143043 176265 -3187 -2810 29514 -83388 360496 250345 -88706 116272
18569 269623 -93876 -112470 -504262 -183191 162188 85317 190189 -91760 -166050 382152
18558 168128 154579 -80920 -25534 -182263 32625 -147567 -144942 197402 -135554 43370 243140
18547 243140 -138740 -488837 -348186 454893 140269 -10309 188302 -117908 -25440 12574
$$ packed form
18628a47986D050J93274n3319b36080A86148e6749C85974c7094j91371m8703b3186
18616e71657B82483b19733M9774C0763g9149G6349b781q3789j76307A02862f691
18604A23259a687a53j64824P3428C8857b10270Q4547j59091a12870b4309k25789
18593b50098k9194g3033B55999A5082b14999A05664a76457J9527A29803a94103
18582B713d8413B7614a43043A76265c187L77B9514h3388C60496j10151h8706A16272
18569B69623i3876j8594l91792a83191A62188p6871J04872i1760p4290C82152
18558A68128j3549h0920b5534j56729C2625a47567K625A97402a35554D3370J99770
18547B43140a38740l50097J40651D54893A40269a0309A88302a17908b5440A2574
$$ plain form
18536 -117696 140912 -480487 -88106 -9070 -182190 125763 -8589 58188 98587 84784 27407
18524 -20843 -308950 -227177 6720 -116764 -214698 -267399 -124714 -233989 -159091 92298 -67900
18512 137557 -188760 270682 -20318 -221701 40878 -49694 -89229 -78755 -34394 -117922 208899
18500 -241825 110737 -7127 46293 -279366 -203018 28009 -5861 20338 -20508 -357177 79481
18488 -82525 124847 -132541 -173182 -65251 138797 163218 22843 220578 152959 71536 -60831
18476 105849 -517784 59793 -140421 -292917 -162686 -103198 141874 84621 92361 -29885 217013
18464 -40170 -77168 -92281 221410 64769 252653 75136 283061 -188385 76270 -159766 -52318
18452 -167294 49295 -233678 -108350 -9474 -584868 -178849 -127918 312728 -122109 -185316
$$ packed form
18536a17696A40912d80487h8106i070j73120A25763h589E8188M0399j3803B7407
18524b0843k88107Q1773F720a16764r7934n2701a24714j09275P4898I2298f7900
18512A37557a88760B70682b0318k01383D0878d9694l9535J0474c4394q3528B08899
18500b41825A10737g127D6293b79366P6348B8009e861B0338b0508l36669G9481
18488h2525A24847a32541m0641f5251A38797K4421B2843J97735o7619G1536f0831
18476A05849e17784E9793a40421j52496J30231N9488A41874n7253P740b9885B17013
18464d0170l6998j5113B21410F4769J87884G5136K07925a88385G6270a59766e2318
18452a67294D9295b33678a08350i474n75394a78849N0931C12728a22109o3207
$$ plain form
18442 -185316 443902 -175390 -119938 132670 -256796 158553 -158248 -42700 -390189 325262
18431 79381 -97012 -219870 -83019 -58651 5639 -77048 43250 -129714 97040 150493 -11191
18419 -228941 134788 99096 21012 -21578 -190545 -352356 46275 218077 105534 -59410
18408 -170393 -48859 -98117 339931 83027 -234038 -217976 328383 -113825 482810 -42066
18397 -116882 328388 -247116 -105600 -168899 -340921 -72825 88082 -300068 -20590 20246
18386 91184 160983 106856 -227243 -108677 -93103 7729 2727 43057 88962 -113433 237016
18374 -286454 55518 23088 -106716 176491 91155 241755 188469 217855 -167199 152190
18363 -1362 -23669 79524 -69284 65299 -271707 39076 -169652 -138135 -270448 -98301 -81130
$$ packed form
18442a85316D43902a75390N5452A32670b56796A58553a58248d2700l47489C25262
18431G9381i7012j22858h3019K4368E639g7048D3250a29714I7040N3453a1191
18419b28941A34788l5692B1012b1578j68967j61811D6275J71802A05534e9410
18408a70393d8859m9258C39931H3027b34038J6062C28383a13825D82810d2066
18397a16882C28388b47116a05600o3299j72022g2825H8082c00068b0590B0246
18386I1184O9799n4127b27243a08677J5574G729B727M0330M5905a13433B37016
18374b86454E5518B3088a06716A76491q5336J50600n3286K9386a67199A52190
18363a362k2307G9524f9284F5299b71707C9076a69652L1517j32313i8301J7171
$$ plain form
18352 -81130 154680 -59562 -58296 278646 -89552 97713 25186 32910 -53164 143209 -266682
18340 6881 -88629 -241096 104576 216077 -75819 57790 282484 -138072 -400563 136748
18329 -191603 -29433 -117821 99811 171235 -86963 -64973 -47351 -83539 -152090 -365121 -266745
18318 -266745 -294177 -397823 93277 30473 11553 -6723 82023 139756 -8169 -71200 -119733 33517
18305 -89840 -168383 15472 -27015 112226 303148 -34922 199162 -406754 -41460 -32455 -219166
18294 -219166 8721 107802 141646 -65638 -60298 234219 102216 -22546 80409 253979 -67180
18282 43571 285934 -93875 35874 -108739 -48932 -84961 -232787 -175601 -111256 -371242 -49374
18270 -175981 -141034 28998 -32653 198182 -22053 -61219 -136549 228247 -244251 -125401 -258144
$$ packed form
18352h1130A54680e9562J266B78646h9552I7713B5186P724e3164A43209b66682
18340F881h8629j52467A04576J11501g5819E7790K24694a38072k62491A36748
18329a91603b9433q8388I9811P1424h6963K1990J7622l6188o8551k13031R8376
18318b66745k7432j03646I3277C0473A1553f723H2023N7733h169o3031m8533C3517
18305h9840p8543A5472b7015A12226J90922c4922A99162d06754d1460R005j86711
18294b19166H721R9081L3844f5638N340B34219A02216b2546H0409J73570f7180
18282D3571K42363i3875C5874a08739d8932l6029j47826N7186O4345k59986d9374
18270a75981L4947B8998c2653A98182b2053l9166p5330B28247b44251J18850j32743
$$ plain form
18259 -258144 142975 -251198 -153078 180477 173994 -451130 -230686 147964 -235188 -264824
18249 -264824 -108667 -215476 -237447 -485100 -252943 -120120 -345535 -164533 315914 273992
18239 273992 -183599 -54602 -114683 -162792 -159712 -214649 -54520 -230089 -334728 -173244 197455
18227 69243 -314284 -50902 27720 -136971 -156461 -176281 -12968 174498 78577 -76988 -111844
18216 -111844 45207 -17778 8664 -35323 256131 207439 -154380 -209119 235759 120489 -182868
18204 155720 162354 -326751 -210640 66005 -73816 -37513 -120822 -33494 -115921 -270537 135744
18192 -77696 158012 -43833 -494289 -173754 191350 144261 -34854 -24868 229649 32554 54224
18181 54224 19106 -165349 2159 -43112 82644 290452 113463 -143151 -196422 -267039 323833
$$ packed form
18259b58144A42975b51198R8120A80477o483d51130K20444A47964b35188k9636
18249b64824a08667j06809k1971k47653K32157a20120k25415a64533C15914m1922
18239B73992a83599e4602o0081m8109L080n4937e4520j75569j04639J61484A97455
18227F9243c14284e0902B7720a36971j9490j9820a2968A74498G8577g6988l4856
18216a11844D5207a7778H664c5323B56131m8692a54380n4739B35759j15270a82868
18204A55720O634c26751J16111F6005g3816L6303q3309c3494q2427j54616A35744
18192g7696A58012d3833m50456a73754A91350m7089c4854R986B29649C2554K1670
18181E4224A9106a65349B159d3112H2644K07808A13463a43151n3271p0617C23833
$$ plain form
18169 -26806 -168109 201856 517545 384171 -39298 -111043 -206242 46791 219219 265602 -289181
18157 -141581 227631 -151416 -61121 -199180 23450 30605 295094 103287 -286439 -53046
18146 -99564 -155967 66338 -152267 205880 155127 -50768 -168981 1328 -261842 -40856 198099
18134 -258796 37051 13476 -218937 -54946 91209 -465849 -299783 -388417 468727 38201 -271999
18122 -83737 186777 194414 300945 138991 -241772 36515 147363 -359980 -58188 176388
18111 -133963 -232221 -19 -65890 -175893 -157305 -153045 -47947 308293 -344262 -311240 -271418 -10910
18098 -189888 -308760 -86035 94087 125682 -223562 -317117 -23018 244151 37046 -123756 -71279
18087 -71279 22552 195232 -111705 -160446 -2200 119739 94125 93040 -193191 -473141 -168709
$$ packed form
18169b6806j41303B01856L15689j33374c9298p1745r5199D6791J72428M6383b89181
18157a41581B27631a51416f1121j38059B3450P155K64489A03287b86439e3046
18146i9564n6403F6338a52267B05880n0753e0768j18213A328b61842d0856A98099
18134b58796C7051A3476b18937e4946I1209d65849J66066q8634D68727C8201b71999
18122h3737A86777P637J06531A38991b41772C6515J10848c59980e8188A76388
18111a33963r8258a9o5871j10003J8588M260d7947C08293c44262L3022L9822a0910
18098a89888j18872h6035I4087L1595b23562r3555b3018B44151C7046a23756N2477
18087g1279B2552J72680a11705m8741b200A19739k5614j085a93191k79950a68709
$$ plain form
18075 -175934 -53602 61396 -185823 -45703 -39964 46513 108564 92704 -68040 -30093 -65689
18064 -65689 185152 148355 82821 75273 367859 -260122 289639 34956 -203847 -210481 -478
18052 346621 94512 5405 71014 -77081 -312691 -12753 -14950 -82978 247258 207501 38581
18040 230709 -299750 55808 -195601 -127472 -146967 65606 -35025 -5890 -139587 -564036 71622
18028 10882 70915 -32617 122684 209947 85413 -130668 -29404 -89294 -232068 389159 169421
18016 228046 174367 -128477 20504 210635 147650 -135161 -113342 -217810 -341649 -123622
18005 -31645 -281262 270365 -77373 53223 281912 -76434 -214001 127372 -299120 -125913
17994 41439 -158642 -58742 171804 -150175 45981 -40650 -36901 511702 117445 -332386 -202165
$$ packed form
18075a75934e3602F1396a85823d5703N739D6513O2051j5860f8040c0093l5596
18064f5689A85152l6797o5534p548K92586b60122B89639C4956b03847o634d78
18052C46621I4512E405O5609g7081k35610a2753k197o8028B47258l9757C8581
18040B30709b99750E5808a95601O8129j9495F5606c5025e890j33697m24449G1622
18028A0882O0033c2617A22684Q7263H5413a30668b9404n9890j42774C89159A69421
18016B28046n3679a28477B0504J90131o2985a35161K1819j04468j23839a23622
18005c1645k49617B70365g7373E3223K28689g6434j37567A27372b99120a25913
17994D1439a58642e8742A71804a50175D5981d0650L749E11702A17445c32386J30221
$$ plain form
17983 -202165 -42941 -141002 170174 -164125 -41169 111124 -151061 355775 -192988 280672
17972 -89381 -246155 244112 -356481 -458311 366526 -204428 253013 -191285 -101669 -27339
17961 -99010 -129331 -367493 -398328 -52251 -331610 -116899 -231677 -87213 9372 -32532 21292
17949 25260 75545 -227960 135137 225715 22047 75534 -84453 -65237 163144 -19162 27629
17937 133157 33250 -68184 -183743 162758 -80372 -50482 40148 233720 -277071 123291
17926 29146 81209 86322 -262565 -20051 -129096 56794 -87957 -49796 72979 -241863 -50640
17914 300693 -245061 257745 181018 128111 195614 34656 404215 132988 -210753 -45024
17903 31630 -113220 262309 -31117 221961 -201037 -62817 -49793 92896 4518 -212703 -103672
$$ packed form
17983b02165d2941r8061A70174a64125d1169A11124a51061C55775a92988B80672
17972h9381j56774B44112c56481j01830C66526b04428B53013a91285Q9616b7339
17961i9010l0321k38162l0835e2251k79359a16899j14778h7213I372c2532B1292
17949B5260N0285b27960A35137R0578B2047N3487h4453J9216A63144a9162B7629
17937A33157C3250f8184j15559A62758h0372K9890D0148J93572b77071A23291
17926B9146N2063N113b62565b0051j09045E6794h7957L8161G2979b41863e0640
17914C00693b45061B57745p6727n2907O7503C4656L69559A32988b10753d5024
17903C1630a13220B62309c1117B21961b01037f2817J3024I2896D518b12703a03672
$$ plain form
17891 52664 -33757 4734 -169177 62187 -228196 -254665 -122610 -280927 -126102 152870 -13150
17879 -94752 -84703 -134832 258085 -44023 -141876 -11858 26056 52683 -214909 63274 -74297
17867 148894 -6921 -412952 31214 176802 -121128 99350 212457 -102576 202051 -79647
17856 -173802 18747 -276970 -138130 117319 -144275 -144871 -35293 4193 2532 -214582 82379
17844 -136677 60714 -27593 -77585 344573 -174889 6969 172668 -254029 -212629 -115744 68331
17832 -172124 -49034 -145544 117066 -5264 -311761 36181 -1897 48584 -163764 -124448 -42544
17820 81711 -189576 58484 -88128 125841 -36260 -97323 -95564 552182 23984 47387 -5984
17808 -20900 -247863 65841 59594 -44545 -179701 416704 210757 -228757 93347 103417 -293691
$$ packed form
17891E2664c3757D734a69177F2187b28196k6469a22610j58317a26102A52870a3150
17879i4752J0049n0129B58085d4023r7853a1858B6056K6627b14909F3274g4297
17867A48894f921m06031C1214J45588a21128I9350J13107a02576B02051g9647
17856a73802A8747b76970a38130A17319a44275n96c5293D193j661b14582H2379
17844a36677F0714b7593m9992C44573a74889F969J65699b54029M1400R6885F8331
17832a72124d9034r6510A17066e264l06497C6181a897D8584a63764L9316d2544
17820H1711a89576E8484h8128A25841c6260o1063J759E52182B3984K3403e984
17808b0900k26963F5841o247d4545j35156D16704k05947b28757I3347J0070b93691
$$ plain form
17796 239152 -147966 -381766 -16226 258369 -92643 14039 -124722 -184918 111095 -175085
17785 -100199 -39872 194687 11883 -38453 57707 -343983 -134718 -170472 74118 -33813 77410
17773 -118311 -125894 36756 199984 399343 -70395 72076 165944 -41714 -99436 -33982 78681
17761 34359 134484 10989 156528 11721 76770 -223343 195187 44183 283636 265228 -130295
17749 282836 -24685 -7811 27784 -71109 49173 55577 -173380 202628 -223725 -60433 32053
17737 16627 -155556 119173 -8589 44587 188565 114638 50575 121421 28501 -66144 53582
17725 -38196 33857 -37219 47678 -45465 325449 13980 83024 274035 -387321 110626 -57657
17713 -66586 -156964 -224921 -136116 171789 -66630 193605 -279663 -359145 17297 -165410 18866
$$ packed form
17796B39152a47966k33800a6226B58369i2643A4039a24722o0196A11095a75085
17785a00199c9872A94687A1883c8453E7707c43983a34718l5754G4118c3813G7410
17773a18311p583C6756J63228J99359g0395G2076R3868d1714n7722c3982G8681
17761C4359J00125A0989J45539A1721O5049b23343A95187D4183K39453j8408a30295
17749B82836b4685g811B7784g1109D9173O404a73380B02628b23725f0433C2053
17737A6627a55556A19173h589D4587J43978p3927E0575P0846B8501f6144E3582
17725c8196C3857c7219D7678d5465C25449A3980O9044J91011c87321A10626e7657
17713f6586r0378o7957Q8805A71789f6630A93605b79663p9482A7297a65410A8866
$$ plain form
17701 35063 -249895 -145886 338688 -190008 -33434 -268348 72811 -12261 -22869 -149877
17691 -149877 257593 -82476 481463 111929 105916 -168619 5539 -47566 -260569 26419 189847
17680 189847 77127 -342147 220663 613715 -204669 -300747 -173783 272092 124783 190266
17670 190266 -114729 -106600 -66044 -6746 203470 333831 399100 420814 352433 15044 286977
17659 286977 93651 -262606 -21050 -70901 112650 -67852 131110 -85755 59109 -243326 9096
17647 101122 -140693 -241785 44648 -295258 -125547 20249 13181 -145760 144653 69141
17636 -43581 -164395 2628 -155838 7759 43903 -209686 -168896 -114779 -114945 75765 164648 163056
17624 163056 237629 147563 164340 -162768 -133527 213844 -55265 52702 227648 443662 112549
$$ packed form
17701C5063b49895J04009C38688a90008c3434k34914G2811a2261j0608j27008
17691a49877B57593h2476D81463A11929o013a68619E539d7566k13003B6419J63428
17680A89847G7127c42147B20663L93052b04669r6078J26964B72092A24783O5483
17670A90266a14729Q129M0556f746B03470J30361O5269K1714o8381A5044K71933
17659B86977I3651b62606b1050m9851A12650f7852A31110h5755E9109b43326I096
17647A01122a40693j01092D4648b95258a25547B0249p068a45760A44653F9141
17636d3581j20814B628a55838G759L6144b09686M0790N4117j66G5765Q8883j592
17624A63056P4573r0066J6777a62768K9241B13844e5265E2702J74946K16014A12549
$$ plain form
17612 308050 38605 282284 -247531 362135 154082 -11682 -146 -124703 -16098 131613 88220
17601 88220 254805 31332 -353883 136081 24519 76166 102747 -35078 -182975 -79059 134542
17589 113045 169269 293115 -263422 367010 -156152 -9158 152658 -216954 195866 -213986
17578 128382 148164 17617 -178896 43413 -158585 -103616 7102 126292 145645 -28043 47813
17566 -66462 211407 201443 33553 71971 126673 244244 580 7519 373599 220291 99784 -87727
17553 17044 -217664 -51150 16359 403215 43287 -115187 237677 38981 220083 -137934
17542 -331997 -341334 303997 -158190 -53272 128537 121408 45766 -210752 -168164 203552 -5873
17530 300412 183795 289637 271767 19308 -78974 -103319 -96935 -74564 139996 84755 263563
$$ packed form
17612C08050C8605K43679b47531C62135A54082a1682a46j24557a6098A31613m3393
17601H8220J66585C1332c53883A36081B4519N1647K6581c5078j47897g9059A34542
17589A13045N6224J23846b63422C67010a56152i158A52658b16954A95866b13986
17578A28382J9782A7617a78896D3413a58585N4969G102J19190J9353b8043D7813
17566f6462B11407r964C3553L8418N4702J17571E80O939L66080j53308I9784h7727
17553A7044b17664e1150A6359L86856D3287a15187B37677C8981J81102a37934
17542c31997r337C03997a58190e3272A28537p129D5766b10752M2588B03552e873
17530C00412j16617J05842j7870A9308g8974k4345O384K2371A39996n5241J78808
$$ plain form
17519 263563 -168938 -104388 -248439 13253 69796 137909 83205 -50102 -86251 276074 -36800
17507 -53629 -64136 148544 232177 289377 48617 14762 66188 30874 -23285 -40034 -152559
17496 -152559 124330 374202 234303 -54006 -66949 66526 -41953 -77551 194524 45617 6790
17484 12938 371901 -66178 199182 125869 52927 -144747 -158983 259475 136648 48300 63750
17473 63750 383338 452997 242345 -118139 20856 275038 256415 -67849 -14202 54708 -52570
17461 -266880 -90803 -68383 62905 -88107 -43548 262331 -1259 188855 159537 253758 311622
17450 311622 224799 170215 174194 92984 516803 279603 170431 90978 111261 251611 238092
17439 238092 389048 197766 310217 247381 307100 69396 111566 259365 117927 383566
$$ packed form
17519B63563a68938O4550j44051A3253N6543O8113n4704e0102l6149B76074c6800
17507e3629j0507A48544Q3633N7200D8617A4762N1426C0874b3285j6749j12525
17496a52559A24330K49872j39899e4006j2943F6526d1953l5598A94524D5617F790
17484A2938L58963f6178A99182p3313E2927a44747j4236B59475j22827D8300J5450
17473F3750L19588O9659k10652a18139B0856K54182j8623f7849a4202E4708e2570
17461b66880i0803K2420F2905h8107d3548B62331a259A88855k9318R4221N7864
17450C11622q6823n4584L979q1210M23819k37200j09172p9453K0283J40350j3519
17439B38092J50956j91282J12451o2836N9719F9396M2170J47799A17927K65639
$$ plain form
17429 383566 121899 223082 153650 411385 300691 476498 -137059 439573 74777 461377
17419 461377 148728 76424 346359 458426 261206 -11231 297765 118382 -99101 72930
17408 383961 5380 309666 222892 123387 195085 4318 161057 281049 -70608 268316 -52602
17396 86304 202457 105564 -7015 169017 136635 -69915 398776 -40007 -36336 194701 -152322
17384 -68008 68396 393756 431164 -216280 491699 221477 298589 115103 106600 447930 12206
17372 -1960 97317 203128 296631 168735 318794 168061 5667 146477 23074 -80313 17462
17360 267433 120619 -43263 99372 425607 -50664 137679 428081 61071 453001 304549
17350 304549 167625 -171446 -71493 -10326 100675 426459 292256 211956 444629 -231903
$$ packed form
17429C83566A21899J01183o9432K57735j10694J75807a37059D39573G4777L86600
17419D61377A48728p2304K69935J12067j97220a1231B97765A18382i9101G2930
17408C83961E380L04286q6774r9505P1698D318J56739J19992g0608B68316e2602
17396H6304J16153r6893g015A69017l2382f9915C98776d0007L671A94701a52322
17384f8008F8396L25360L7408b16280D91699B21477P7112A15103q503L41330A2206
17372a960I7317J05811R3503j27896J50059j50733E667J40810B3074h0313A7462
17360B67433A20619d3263I9372L26235e0664A37679K90402F1071L91930j48452
17350C04549j36924a71446g1493a0326A00675L25784j34203q0300K32673b31903
$$ plain form
17339 53772 89965 21965 -135505 298981 223100 111508 -20963 438696 150721 172125 124098
17328 124098 -31317 221635 407339 -43835 170090 97112 224595 84100 213259 80358
17317 71931 -143345 288426 174455 65070 216312 142053 -201577 -249991 8385 38212 175758
17306 175758 -73802 348537 365415 219705 91093 195549 392979 -72229 -150995 108938
17295 167366 289084 390236 126965 243887 139107 298756 -96046 193664 71361 133438
17285 133438 184722 -83003 435714 111490 312971 79294 190757 399549 -299237 204630
17274 383522 12343 135628 184024 20273 165401 455010 -44009 -107932 81188 211274 318017
17263 318017 126450 53412 -50330 150278 -212373 331941 292584 339531 -5652 191486 -73939
$$ packed form
17339E3772L6193B1965a35505B98981p5881A11508b0963D38696A50721K1404m8027
17328A24098c1317B21635J85704d3835A70090p2978J27483H4100J29159H0358
17317G1931a43345B88426j13971F5070J51242p4259b01577m8414H385K9827J37546
17306A75758g3802C48537J6878j45710I1093J04456J97430g2229p8766A08938
17295A67366J21718J01152A26965J16922j04780J59649i6046A93664G1361O2077
17285A33438N1284h3003D35714A11490K01481G9294J11463K08792b99237B04630
17274C83522A2343J23285M8396B0273J45128K89609d4009o3923H1188J30086J06743
17263C18017A26450E3412e0330A50278b12373C31941l9357M6947e652A91486g3939
$$ plain form
17251 -183486 176747 701116 241208 327981 135066 108353 69701 62646 243673 412385
17241 412385 57821 3277 63955 205460 -36845 161812 453570 -211899 -119126 185776 391520
17230 391520 -81197 248461 342037 215015 570107 529432 102596 321795 34129 912 409549
17219 409549 262786 68630 181647 293457 322167 185418 115558 323584 31516 160154
17209 160154 25435 218064 280951 -48623 471566 -141895 69738 144577 504942 322806
17199 322806 301670 87533 504794 513363 195660 132294 64440 745904 307557 42763 161404
17188 161404 100750 323886 387888 52181 -55219 216651 147327 196303 336375 175422 197538
17177 197538 393732 182198 392147 198711 68611 296074 129440 268921 258417 240204
$$ packed form
17251a83486A76747N24369B41208Q6773A35066k6713l8652p055J81027J68712
17241D12385E7821C277O0678J41505c6845A61812K91758b11899R2773A85776K05744
17230C91520h1197B48461R3576j27022L55092m0675A02596K19199C4129I12M08637
17219D09549j46763F8630J13017J11810K8710j36749o9860K08026C1516J28638
17209A60154B5435J92629O2887d8623D71566a41895F9738P4839L60365j82136
17199C22806k1136H7533M17261Q569A95660o3366F4440O81464C07557D2763J18641
17188A61404o0654K23136O4002E2181e5219B16651o9324M8976J40072j60953K2116
17177A97538J96194A82198K09949j93436F8611K27463A29440J39481j0504j8213
$$ plain form
17167 240204 222055 113733 380037 419283 119664 327275 7833 77300 594389 357014
17157 357014 184421 149639 458112 342801 508350 454505 445891 203360 511325 304562
17147 304562 425202 517519 361957 339930 164798 528340 137494 385222 311016 182096
17137 182096 179936 162952 507946 274139 318254 141896 244638 496321 348566 527717
17127 527717 367529 193795 207781 -51723 187252 397832 322566 236617 212798 591326
17117 591326 313133 309742 223447 677904 519803 596878 461671 507368 424094 463376 428822
17106 428822 389679 324765 364740 282404 468838 351396 252150 660544 530877 355428
17096 355428 206034 570512 367836 204143 404430 541793 764191 436561 180428 498791
$$ packed form
17167B40204j8149j08322K66304L9246A19664K07611G833O9467N17089k37375
17157C57014j72593l4782L08473j15311J65549n3845q614B03360L07965k06763
17147C04562J20640R2317j55562k2027A64798L63542A37494K47728p4206j28920
17137A82096k160j6984L44994k33807M4115A41896J02742K51683j47755J79151
17127E27717j60188j73734J3986e1723A87252K10580p5266q5949k3819L78528
17117E91326k78193l391q6295M54457j58101P7075j35207M5697q3274L9282l4554
17106D28822l9143o4914L9975q2336J86434j17442r9246M08394j29667j75449
17096C55428j49394L64478k02676j63693K00287J37363K22398l27630A80428L18363
$$ plain form
17086 498791 221606 381470 548669 513108 613312 397867 497957 232696 566160 166099
17075 824199 464514 372477 198948 -58530 461069 642956 660419 294277 537377 735418
17065 735418 719484 213693 238774 612653 509995 476911 539157 659466 586810 573017 562367
17054 562367 593676 355169 531377 578278 550690 333296 415557 517578 458282 285095
17044 285095 502597 765144 742038 984695 663564 537814 744201 486093 541325 597472
17034 597472 633487 439621 325638 743957 778184 591141 435001 627636 563021 737915
17024 737915 867193 363827 495978 628574 773410 376212 685965 546648 917716 504220
17014 504220 770136 782082 819420 459471 560696 669712 516244 154246 117347 805544
$$ packed form
17086D98791B21606J59864J67199l5561J00204k15445J00090B32696L33464A66099
17075H24199l59685r2037j73529e8530D61069J81887J7463B94277K43100J98041
17065G35418j5934B13693K5081L73879j02658l3084O2246J20309p2656j3793j0650
17054E62367L1309k38507J76208M6901k7588k17394Q2261J02021n9296j73187
17044B85095K17502K62547k3106K42657l21131j25750K06387k58108N5232N6147
17034E97472L6015j93866j13983M18319L4227j87043j56140J92635o4615J74894
17024G37915J29278C63827J32151J32596J44836C76212L09753j39317L71068m13496
17014E04220K65916J1946L7338l59949J01225J09016j53468A54246l6899O88197
$$ plain form
17004 805544 443178 478230 602617 568968 511341 796070 974053 374141 569712 1072939
16994 1072939 735235 967631 733642 901731 666297 1075436 668933 824278 608519
16985 608519 819615 992750 495130 683590 949646 777473 1050492 969613 851233 1061636
16975 1061636 878260 1087440 855714 903355 1023771 1056547 1137472 676158 945180 986264
16965 986264 1036987 951251 945363 942289 1296709 753428 1172775 931506 1106861 1143351 1296114
16954 1296114 1129395 1081907 948048 962730 1178617 1337162 1287987 1326173 1101663 1333833
16944 1333833 1173931 1364538 998880 902252 1279299 1271091 1465131 1177824 1556547 1485699
16934 1485699 1326330 1246400 1427965 1321231 1212311 1207253 1330202 1257081 1406519 1125073
$$ packed form
17004H05544l62366L5052J24387l3649n7627K84729J77983C74141J95571N03227
16994A072939l37704K32396k33989J68089k35434M09139m06503J55345k15759
16985F08519K11096J73135D95130J88460K66056j72173K73019q0879j18380K10403
16975A061636j83376K09180k31726M7641J20416L2776Q0925m61314K69022M1084
16965I86264N0723q5736n888l074L54420n43281M19347k41269J75355L6490J52763
16954A296114j66719m7488j33859J4682K15887J58545m9175L8186k24510K32170
16944A333833j59902J90607l65658r6628L77047q208J94040k87307L78723p0848
16934A485699j59369p9930J81565j06734j08920n058J22949p3121J49438k81446
$$ plain form
16924 1125073 1393079 1626213 1433822 1407385 1576372 1627635 1411632 1453898 1509087 1261103
16914 1261103 1362702 1348621 2007788 1479427 1332212 1755088 1838122 2009728 1745154 1702427
16904 1702427 1601562 1696216 1876159 1949501 1965984 1736056 1787122 1827121 1905464 1913391 1796438
16893 1796438 1922939 1527780 1684403 2022300 1872678 2199878 2096009 2147251 2571990 2181481
16883 2181481 2059062 2069739 2215051 1935744 2317241 2345110 2333635 2426563 2705012 2267085
16873 2267085 2390707 2870277 2125097 2655293 2803950 2559551 2932340 2907296 3176327 2637642
16863 2637642 2656949 3091371 2562955 2471502 2825600 2842530 3112697 3193751 3154350 3103968
16853 3103968 3219218 3282188 3649889 3619948 3562671 3706375 3790776 3499348 3722828 3832602
$$ packed form
16924A125073K68006K33134j92391k6437J68987N1263k16003M2266N5189k47984
16914A261103J01599j4081O59167n28361j47215M22876Q3034J71606k64574m2727
16904A702427j00865R4654J79943P3342J6483k29928N1066L9999P8343P927j16953
16893A796438J26501l95159J56623L37897j49622L27200j03869N1242M24739l90509
16883B181481j22419J0677J45312k79307L81497K7869j1475R2928K78449m37927
16873B267085J23622M79570p45180N30196J48657k44399L72789k5044K69031n38685
16863B637642J9307M34422n28416r1453L54098J6930K70167Q1054l9401n0382
16853C103968J15250O2970L67701k9941n7277J43704Q4401k91428K23480J09774
$$ plain form
16843 3832602 3469448 3843872 4115522 4025968 4077406 4213879 4147989 4386315 4322714 4362651
16833 4362651 4703106 4271543 4723992 4885618 4952576 4715888 4649282 4849610 5309868 5230410
16823 5230410 5902477 5541192 5644395 5985282 5318195 5940197 6142996 6044744 6379892 6111201
16813 6111201 6437947 6715381 6918337 6743433 7235143 7282625 7315626 7473125 7192798 7870537
16803 7870537 8206334 7974489 8460576 8249196 8750662 8703288 9131499 9441361 9416944 10038949
16793 10038949 9895707 10163668 10670907 10759629 11136339 11244035 11577176 11888661 12226819
16784 12226819 12429425 13173500 13149971 13884031 14102967 14556020 15097264 15250325 15949983
16775 15949983 16374559 16647422 17282243 17957541 18507657 19315324 19873483 20347672 21227128
$$ packed form
16843C832602l63154L74424K71650q9554N1438J36473o5890K38326o3601L9937
16833D362651L40455m31563M52449J61626O6958k36688o6606K00328M60258p9458
16823E230410O72067l61285J03203L40887o67087O22002K02799r8252L35148k68691
16813F111201L26746K77434K02956j74904M91710M7482L3001J57499k80327O77739
16803G870537L35797k31845M86087k11380N01466m7374M28211L09862k4417O22005
16793A0038949j43242K67961N07239Q8722L76710J07696L33141L11485L38158
16784A2226819K02606P44075k3529P34060K18936M53053N41244J53061O99658
16775A5949983M24576K72863O34821O75298N50116Q07667N58159M74189Q79456
$$ plain form
16766 21227128 21853597 22660937 23373529 24298050 25341665 26029014 27408500 28013157 29210432
16757 29210432 30385209 31654612 32939002 34532201 36048794 37409908 39172111 40930375
16749 40930375 42890332 44507768 46949570 49462988 51601392 54216040 57292271 59898245
16741 59898245 62633987 66144963 69800735 73569284 77818823 81634120 86116100 90605926
16733 90605926 95695598 100909402 106237106 112220623 118027143 124281166 130114795 136272069
16725 136272069 142741884 148780117 154773338 160211411 165853140 170392453 174089732 177353696
16717 177353696 179636661 180726752 181117570 180551574 179005356 176371886 173003037 168694409
16709 168694409 163684881 158598664 152503576 146440345 140039701 133880198 127870880 121267598
$$ packed form
16766B1227128O26469Q07340P12592R24521J043615O87349J379486O04657J197275
16757B9210432J174777J269403J284390J593199J516593J361114J762203J758264
16749D0930375J959957J617436K441802K513418K138404K614648L076231K605974
16741E9898245K735742L510976L655772L768549M249539L815297M481980M489826
16733I0605926N089672N213804N327704N983517N806520O254023N833629O157274
16725A36272069O469815O038233N993221N438073N641729M539313L697279L263964
16717A77353696K282965J090091L90818n65996j546218k633470l368849m308628
16709A68694409n009528n086217o095088o063231o400644o159503o009318o603282
$$ plain form
16701 121267598 115079658 109385275 103843690 98434261 92940479 87975400 83287964 79009295
16693 79009295 74865276 71098159 67861889 63739878 60797761 57799751 54833353 52085735
16685 52085735 49513822 47218130 44811949 43211599 41218544 39188772 37426580 35765837
16677 35765837 34584634 32724462 31578492 30499614 28783235 27820117 26882819 25742278
16669 25742278 24700193 23970757 23319079 22045970 21430110 20618597 20006452 19169707 18845031
16660 18845031 18012755 17391974 16652448 16392004 15964078 15303785 14593663 14081660 14073796 13469467
16650 13469467 13092882 12711983 12379037 12054143 11863577 11752277 11226435 10818960 10696102
16641 10696102 10225509 10078012 9437539 9542689 9127907 9182721 8790024 8777136 8631926 8297399
$$ packed form
16701A21267598o187940n694383n541585n409429n493782m965079m687436m278669
16693G9009295m144019l767117l236270m122011k942117k998010k966398k747618
16685E2085735k571913k295692k406181j600350j993055k029772j762192j660743
16677C5765837j181203j860172j145970j078878j716379r63118r37298j140541
16669B5742278j042085p29436o51678j273109o15860q11513o12145q36745l24676
16660A8845031q32276o20781p39526k60444m27926o60293p10122n12003p864o04329
16650A3469467l76585l80899l32946l24894j90566j11300n25842m07475j22858
16641A0696102m70593j47497o40473J05150m14782N4814l92697j2888j45210l34527
$$ plain form
16631 8297399 7923526 7770824 7840871 7606796 7586486 7381431 7186287 7048900 6726088 6494355
16621 6494355 6469750 6479963 6446253 6320028 6010872 5571848 5894275 5936035 5562434 5523052
16611 5523052 5118293 5129285 5211464 5265063 4976485 4732322 4764889 4540632 4636130 4234362
16601 4234362 4407216 4579487 4200266 4402912 3813832 4261474 4011658 3914288 3816811 3931280
16591 3931280 3609277 3535649 3680981 3322278 3372286 3313671 3273596 3368430 3586054 3167276
16581 3167276 3162892 3089588 2975999 3143186 3061410 2940028 2841553 2864490 2953999 3041173 2740743
16570 2740743 2784370 2595570 2592752 2547388 2670254 2491330 2580886 2043618 2585510 2158999
16560 2158999 2713838 2396476 2402152 2432372 2144077 2037665 2199955 2173861 2281777 2045144
$$ packed form
16631H297399l73873j52702P0047k34075k0310k05055j95144j37387l22812k31733
16621F494355k4605J0213l3710j26225l09156m39024L22427M1760l73601l9382
16611E523052m04759J0992Q2179N3599k88578k44163L2567k24257R5498m01768
16601D234362J72854J72271l79221K02646n89080M47642k49816r7370r7477J14469
16591C931280l22003p3628J45332l58703N0008n8615m0075R4834K17624m18778
16581C167276m384p3304j13589J67187q1776j21382r8475K2937Q9509Q7174l00430
16570B740743M3627j88800k818m5364J22866j78924Q9556n37268N41892m26511
16560B158999N54839l17362N676L0220k88295j06412J62290k6094J07916k36633
$$ plain form
16550 2045144 2081797 2079459 2122675 2273189 1913552 1855315 1988490 2043142 1906609 1824037 1778267
16539 1778267 1502848 2112568 1655752 1687361 2085624 1691471 2053585 1895731 1705296 1775376
16529 1775376 1900930 1629640 1686612 1393696 1577447 1598755 1419642 1699589 1504509 1672737
16519 1672737 1283598 1273765 1715587 1028258 1442655 1458622 1288826 1327038 1315657 1144001
16509 1144001 1431678 1493222 1365588 994690 1425527 1222670 1062893 1157771 1265572 1495265
16499 1495265 1450077 1322533 1224738 1523634 1137011 1233984 1049403 1403991 1011683 1168186
16489 1168186 1059048 908569 1020052 1152158 885409 1124892 591179 1174825 717775
16480 717775 1111201 1087938 1144505 945404 881014 947418 945365 1152259 962689 857524 869848
$$ packed form
16550B045144L6653k338M3216J50514l59637n8237J33175N4652j36533q2572m5770
16539A778267k75419O09720m56816L1609L98263l94153L62114j57854j90435P0080
16529A775376J25554k71290N6972k92916J83751K1308j79113K79947j95080J68228
16519A672737l89139r833M41822o87329M14397J5967j69796L8212j1381j71656
16509A144001K87677O1544j27634l70898M30837k02857j59777R4878J07801K29693
16499A495265m5188j27544r7795K98896l86623R6973j84581L54588l92308J56503
16489A168186j09138j50479J11483J32106k66749K39483n33713N83646m57050
16480G17775L93426k3263N6567j99101o4390O6404k053K06894j89570j05165J2324
$$ plain form
16469 869848 972177 654039 868212 1018437 393798 647594 940409 719892 878924 901995
16459 901995 1035162 560830 1076005 974528 1024220 904902 764588 826989 815171 698530
16449 698530 836907 887106 791303 621426 868321 521701 463975 1116316 818607 565784
16439 565784 469262 501233 843563 791480 270273 645946 718007 737876 439364 794292
16429 794292 674483 460874 863393 483880 691189 471728 843035 557120 652830 893926
16419 893926 674521 720240 444167 703906 864932 395065 584776 482843 857722 656435
16409 656435 457695 531777 771911 858256 229134 423844 471319 414773 787581 466454
16399 466454 651507 393477 405809 790848 183491 380368 492621 473863 567007 620798
$$ packed form
16469H69848J02329l18138K14173J50225C93798K53796K92815k20517J59032K3071
16459I01995J33167m74332N15175j01477M9692j19318j40314O2401j1818j16641
16449F98530J38377N0199r5803j69877K46895l46620n7726O52341k97709k52823
16439E65784r6522L1971L42330n2083B70273L75673P2061J9869k98512L54928
16429G94292j19809k13609M02519l79513K07309k19461L71307k85915R5710K41096
16419H93926k19405M5719k76073K59739J61026C95065J89711j01933L74879k01287
16409F56435j98740P4082K40134Q6345B29134J94710M7475n6546L72808l21127
16399D66454J85053k58030J2332L85039A83491J96877J12253j8758R3144N3791
$$ plain form
16389 620798 244178 368488 730282 225682 580562 492717 291176 534002 705900 372652
16379 372652 427135 238078 641205 467927 306958 571108 603992 796490 307259 491128
16369 491128 371972 193548 170750 437768 234484 288032 329908 285472 -46384 710156
16358 244409 368945 672699 311245 76240 408635 426049 303943 357191 371909 181452
16347 700685 480171 646702 125619 130831 527874 279996 240503 212342 265078 486673
16337 486673 200350 109015 459156 533059 225296 398701 216252 182446 354717 22155
16326 448494 32777 383951 363300 392226 451207 441654 708850 228918 35698 77633 443891
16315 443891 268676 -48848 361404 460661 266143 291132 357115 160717 588744 165673
$$ packed form
16389F20798B44178J24310L61794B25682L54880q7845k01541K42826J71898l33248
16379C72652N4483j89057M03127j73278j60969K64150L2884J92498C07259J83869
16369D91128j19156j78424k2798K67018k03284N3548M1876m4436d6384G10156
16358B44409J24536L03754C11245G6240L32395J7414j22106N3248J4718A81452
16347G00685k20514J66531A25619N212L97043k47878l9493k8161N2736K21595
16337D86673B00350r1335L50141P3903B25296J73405j82449l3806J72271B2155
16326D48494C2777L51174k0651K8926N8981r553K67196B28918C5698M1935L66258
16315D43891j75215d8848C61404R9257j94518K4989O5983A60717M28027A65673
$$ plain form
16304 328629 467441 329450 32715 190532 330166 271645 73552 188206 360652 262570
16294 262570 366107 310233 299311 363836 117987 209170 110059 259160 121918 503189
16284 503189 114244 73466 101867 467135 309734 143711 48042 349919 337953 257751
16274 257751 260197 88121 172569 171673 258037 323659 161567 244473 261633 62474 -56143 412029
16261 340619 23317 350396 -3185 183276 217088 -36792 364136 39960 91064 303463 12659
16249 546651 118664 214982 169072 324695 -75095 150794 199067 397883 -441102 -73599
16238 374538 461515 75426 359508 195851 439783 138847 254104 310931 271507 707851
16228 707851 -88766 18754 150303 160422 224398 91908 94744 41648 -265193 26171 231494
$$ packed form
16304C28629J38812j37991C2715J57817J39634n8521G3552J14654J72446r8082
16294B62570J03537n5874j0922O4525A17987R1183r9111J49101A21918L81271
16284E03189A14244m0778K8401L65268j57401A43711D8042L01877j1966q0202
16274B57751K446H8121Q4448q96Q6364O5622A61567Q2906J7160F2474e6143D12029
16261C40619B3317L27079c185A83276L3812c6792C64136C9960N1104K12399A2659
16249E46651A18664R6318m5910J55623g5095A50794M8273J98816d41102g3599
16238C74538Q6977G5426K84082j63657K43932A38847J15257N6827l9424M36344
16228G07851h8766A8754J31549J0119O3976I1908K836D1648b65193B6171K05323
$$ plain form
16217 231494 91284 100342 17923 -229081 -158447 222425 -12484 457293 189187 276200 97278
16205 100361 279275 -47323 73607 266665 85741 134154 -86625 157822 341353 129538
16194 -38484 73540 355143 118014 122854 97043 390290 402853 -215734 -228887 -6578 345585
16182 -81362 -32040 -33501 152885 -3138 292166 -60501 -311019 208144 218564 73959 83826
16171 83826 -98730 503706 67361 170452 198447 105426 68725 148224 200568 283671 369358
16160 369358 230593 406152 252878 -30010 232353 17349 129774 59715 174483 322165
16150 322165 158437 163095 -140766 399849 327524 371497 -139640 -141041 -43925 118486 107050
16139 107050 -99331 126236 37806 133004 188098 4815 166521 -256595 -85386 148293 -81481
$$ packed form
16217B31494I1284R058A7923b29081P0634B22425a2484D57293A89187Q7013I7278
16205A00361J78914d7323G3607J93058H5741M8413h6625A57822J83531A29538
16194c8484G3540K81603A18014M840k5811K93247J2563b15734j3153f578C45585
16182h1362c2040j461A52885c138B92166f0501k50518B08144J0420G3959R867
16171H3826i8730E03706F7361J03091K7995r3021l6701P9499N2344Q3103Q5687
16160C69358j38765J75559j53274c0010B32353A7349J12425E9715J14768J47682
16150C22165A58437M658a40766C99849p2325M3973a39640j401d3925A18486j1436
16139A07050i9331A26236C7806R5198N5094D815J61706b56595h5386A48293h1481
$$ plain form
16127 -231003 -225315 136603 -250599 85467 243981 -125144 -27750 66426 -80384 -40968 100573
16115 198172 -4941 322701 -28553 -193148 49299 390917 -10477 -248500 -354386 46200 171330
16104 171330 -88067 -13478 367919 295152 -35511 -144457 226449 -163428 -22499 -194513
16094 -194513 362212 174013 79355 -96725 92806 221317 -44906 114489 -243676 -32549
16083 18 17157 260276 163734 149201 71180 76335 63512 250314 136738 44197 -383119 224409
16070 350354 310736 -377573 -228958 79233 -53397 -77540 -323697 33932 -132487 -53138 -215564
16059 -215564 146742 193987 -164547 -205848 -21858 -73812 161957 -286246 -12318 323052
16048 -21164 -71288 -90945 -48940 -73689 323868 -43399 -87520 318326 83496 156228 108773
$$ packed form
16127b31003N688A36603b50599H5467J58514a25144b7750F6426h0384L9416A00573
16115A98172d941C22701b8553j64595D9299L41618a0477k38023j05886D6200J25130
16104A71330h8067a3478C67919p2767c5511j08946B26449a63428b2499j72014
16094a94513C62212A74013G9355i6725I2806J28511d4906A14489b43676c2549
16083A8J7139K43119r6542j4533G1180N155j2823J86802j13576D4197c83119B24409
16070C50354l9618c77573J48615G9233e3397k4143k46157C3932a32487e3138j62426
16059b15564A46742M7245a64547m1301b1858n1954A61957b86246a2318C23052
16048b1164n0124j9657M2005k4749C23868d3399m4121C18326H3496P2732m7455
$$ plain form
16037 108773 -323440 38750 -37010 141658 152803 65502 -13689 -81213 -276428 -19624 127855
16025 19939 109950 164952 -109874 -144510 -105605 -623 65954 242633 43188 -148184 -226486
16014 -226486 74572 -162821 -13474 17157 29185 34699 94145 -79072 -219337 9200 -322853
16002 227074 13575 -72917 -206764 -142752 -1926 58851 215516 -126739 -102957 -182093 -213365
15991 -213365 77630 -250701 -294487 -25895 -111284 -36998 46344 26151 263870 140445 388748
15980 388748 223067 213623 82322 -72794 57513 -88988 96730 316168 44758 -9832 -95876
15969 -95876 -48523 193323 10156 252222 -283059 102543 208589 173057 -246332 220373
15958 118412 99346 245495 -14131 12197 -294310 -239019 -63919 -159246 167476 209909 -195165
$$ packed form
16037A08773c23440C8750c7010A41658J1145F5502a3689o7524j95215a9624A27855
16025A9939R0011N5002a09874l4636L8905f23F5954J76679D3188a48184p8302
16014b26486G4572a62821a3474A7157J2028N514N9446g9072j40265I200c22853
16002B27074A3575g2917j33847O4012a926E8851J56665a26739K3782p9136l1272
15991b13365G7630b50701m3786b5895q5389c6998D6344k0193K37719j23425K48303
15980C88748j65681r444H2322g2794E7513h8988I6730K19438D4758i832q6044
15969i5876M7353A93323A0156K42066b83059A02543J06046l5532b46332B20373
15958A18412j9066J46149a4131A2197b94310N5291f3919r5327A67476M2433a95165
$$ plain form
15946 -140957 59251 -1678 -4540 160639 -10995 -214752 -20860 -19585 117979 81681 -235196
15934 231820 72103 55535 -186461 -101401 -7529 19573 185958 -102428 -53113 -326555 -153864
15922 132451 -380518 -68091 -153797 -51524 -109117 -128720 97249 36536 -185747 202407 78525
15910 -32712 -487201 -222338 -64636 -89601 261963 -170070 128913 66583 209456 -57269
15899 -96292 84264 -104092 41617 -9226 245761 -309644 -55693 -70620 216813 211114 10502
15887 -26989 126872 27760 141502 52038 -13368 154860 352284 179652 -178141 40645
15876 -89258 -122641 -428864 104449 153040 -60152 -39360 57783 -364230 -51547 -99955 -334349
15865 -334349 -164951 -120016 -60898 -33668 15081 -142537 -292494 192815 301645 335394
$$ packed form
15946a40957E9251a678k862A60639a0995k03757b0860J275A17979l6298b35196
15934B31820G2103j6568a86461Q5060g529A9573J66385a02428M9315k73442a53864
15922A32451c80518f8091q5706e1524n7593j9603I7249C6536a85747B02407G8525
15910c2712m54489b22338f4636k4965B61963a70070A28913o2330J42873e7269
15899i6292H4264a04092D1617i226B45761c09644e5693j4927B16813n699A0502
15887b6989A26872B7760J13742E2038a3368A54860J97424j72632a78141D0645
15876h9258l3383l06223A04449M8591f0152K0792E7783c64230e1547m8408k34394
15865c34349a64951M4935N9118K7230A5081a42537j49957A92815J08830L3749
$$ plain form
15855 335394 -152011 282821 165332 -17729 -84922 -87191 -135146 36329 -158532 -115881 -23214
15843 208491 -27856 194603 -113745 188971 -3823 228796 145661 188587 103646 -140186 26449
15831 -62994 -911 -137208 33365 -97306 -19942 261463 -28547 -38593 157205 -57659 -90916
15820 -90916 -113346 69318 -75795 142112 -165184 -134315 -270403 -152401 -35138 -30542 -270135
15809 -270135 -103790 -67057 170057 -252153 277075 272453 -329609 -207260 178981 45676
15798 -111008 255441 -32441 -264703 -37263 -38315 -7782 42466 -196568 401194 63058 -365253
15786 119313 -1115 374872 -238205 157996 101761 -74012 -431227 76363 -234914 -27893 122059
15774 69351 -130363 83144 -154202 86635 101824 -151939 221679 -74301 92358 -46687 -72413
$$ packed form
15855C35394a52011B82821j17489a7729o7193k269m7955C6329a58532M2651b3214
15843B08491b7856A94603a13745A88971c823B28796q3135M2926q4941a40186B6449
15831f2994i11j36297C3365i7306a9942B61463b8547j0046A57205e7659l3257
15820i0916k2430F9318g5795A42112a65184L0869j36088J18002c5138M596k39593
15809b70135a03790L6733A70057b52153B77075m622c29609J22349A78981D5676
15798a11008B55441c2441k32262c7263j052g782D2466a96568D01194F3058c65253
15786A19313a115C74872b38205A57996n6235g4012l57215G6363b34914b7893A22059
15774F9351a30363H3144a54202H6635J5189a51939B21679g4301I2358d6687k5726
$$ plain form
15763 -72413 53738 -129745 34825 -20873 -155854 -236852 -223639 67961 -22571 96005 20686
15751 203539 -136862 -53655 266462 -232930 125418 -80646 -53671 115363 278348 41066
15740 152851 -3988 4928 -167866 -211610 -9941 -97369 125002 -281694 83307 102691 -163265
15728 -73479 -58479 -244015 -103806 -308585 -59515 -200279 -126148 6275 -358311 -200522 -236140
15717 -236140 -64640 -182369 -318011 88473 -262521 168215 -211453 -81844 -191698 -398847
15707 -398847 -420148 46837 -240040 128773 -242084 67027 -182990 -189844 -87724 -314964 -195764
15696 -195764 -44869 -190191 -123344 32310 35401 -339412 37624 -177613 -280967 -238192 192697
15684 362990 -224924 -197165 -178660 -127124 31716 89755 215597 172678 124842 111255 1986
$$ packed form
15763g2413E3738a29745C4825b0873j34981q0998J3213F7961b2571I6005B0686
15751B03539a36862e3655B66462b32930A25418h0646K6975A15363J62985D1066
15740A52851c988D928a67866m3744i941q7428A25002b81694H3307J9384a63265
15728g3479J5000j85536a03806k04779e9515j40764P4131F275c58311J57789l5618
15717b36140f4640j17729j35642H8473b62521A68215b11453h1844j09854k07149
15707c98847k1301D6837b40040A28773b42084F7027a82990o854h7724k27240J19200
15696a95764d4869j45322O6847C2310L091c39412C7624a77613j03354M2775A92697
15684C62990b24924K7759J8505N1536C1716N8039J25842m2919m7836j3587A986
$$ plain form
15672 -190065 134653 -20279 49302 -105052 53743 135232 -91881 -275105 89545 168205 65394
15660 131680 -181388 -113596 -279121 -290263 376879 1200 -172677 -328492 -103800 297837
15649 -33410 -83090 70205 -55581 -160507 108734 189062 34483 -41188 -60187 -21667 -240345
15638 -240345 -220699 -100005 375052 -247498 -51444 -9002 233470 -21106 205005 -393679
15627 -140077 -151869 202666 -82902 22509 -103481 73475 17460 -350207 87687 195232 58168
15615 -182474 -73200 -76650 -3083 128435 355674 -119616 -103040 -110886 -122223 -23832 35425
15603 -4162 -82061 -150470 32757 -196693 -256513 107224 -151493 -297795 -298380 87928 -182697
15591 4494 -148337 -180659 44320 -275356 -111445 54 291932 -68789 -44259 -305669 -486103
$$ packed form
15672a90065A34653b0279D9302a05052E3743Q1489i1881j83224H9545P8660F5394
15660A31680a81388O7792j65525j1142C76879A200a72677j55815a03800B97837
15649c3410m9680G0205e5581j04926A08734Q0328C4483d1188j8999b1667k18678
15638b40345J9646a00005C75052b47498e1444i002B33470b1106B05005c93679
15627a40077j1792B02666h2902B2509a03481G3475A7460c50207H7687J07545E8168
15615a82474g3200l450c083A28435K27239a19616J6576p846j1337b3832C5425
15603d162p7899o8409C2757a96693n9820A07224a51493j46302n85H7928a82697
15591D494a48337l2322D4320b75356a11445E4K91878f8789K4530k61410j80434
$$ plain form
15580 -486103 118680 220458 -151960 34805 240485 36112 -14469 -333884 -106698 -25929
15569 10998 21794 116125 234401 -24838 30181 -81 -3063 194051 261911 -97981 -3645 85760
15556 -200944 169992 87092 249437 -29085 118139 -58632 57209 -220702 144881 -85570
15545 -71669 145848 -207901 75587 -74362 47234 29073 84315 108892 334236 -179041 171462
15533 18600 -80970 -123842 -33024 -42349 -106425 50510 207852 338006 222935 20925 -247044
15521 -148312 -313861 35372 33568 -24213 452983 316766 -237073 120146 42338 135218 112244
15510 112244 32340 81264 -23419 -25068 -194312 -286883 75263 -116389 300005 270168 -112118
15498 -400285 254557 -105927 9390 -143038 -123362 -187378 -118973 -4765 -324322 -6427 -336055
$$ packed form
15580d86103A18680J01778a51960C4805K05680C6112a4469l19415a06698b5929
15569A0998J0796R4331J18276b4838C0181h1k982A94051O7860i7981c645H5760
15556b00944A69992q2900J62345b9085A18139e8632E7209b20702A44881h5570
15545g1669A45848b07901G5587g4362D7234j8161N5242K4577K25344a79041A71462
15533A8600h0970m2872c3024r325o4076E0510J57342J30154j15071B0925b47044
15521a48312j65549C5372j804b4213D52983j36217b37073A20146D2338R2880k2974
15510A12244C2340M8924b3419j649j69244r2571G5263a16389C00005k9837a12118
15498d00285B54557a05927I390a43038J9676o4016O8405d765l19557f427l29628
$$ plain form
15487 -336055 -26936 -151239 47543 -162619 -28701 83075 -12421 27984 158333 -245016 -20710
15475 164870 -6851 13319 64766 -95004 -74122 62461 -121539 -252504 17765 -270449 -3947
15463 -51687 -64138 -82891 -10387 -120669 -3696 409845 69365 256536 94014 49122 27097
15452 27097 48399 222965 -78503 268639 217002 -61451 -274242 81103 87982 74746 -79533
15440 6978 -68264 44136 119814 150813 44037 -143614 33007 -74010 180075 74290 -78538
15428 -28391 -157656 54173 -226248 60255 351979 -128811 92103 218562 133002 -273176
15417 -44864 53528 117296 199560 59558 174471 -72322 186723 7036 -223650 210888 553
15405 -290098 51950 316696 -219973 -230243 94231 -158482 141592 -288839 167909 116151
$$ packed form
15487c36055b6936j24303D7543a62619b8701H3075a2421B7984J30349b45016b0710
15475A64870f851A3319N1447i5004K0882F2461a21539j30965A7765b70449c947
15463e1687j2451j8753a0387j10282c696D09845F9365J87171I4014m4892k2025
15452B7097K1302J74566g8503B68639n1637f1451k12791H1103O879j3236g9533
15440F978f8264D4136P5678L0999D4037a43614C3007g4010A80075G4290g8538
15428b8391j29265E4173b26248F0255K91724a28811I2103J26459q5560b73176
15417d4864E3528O3768Q2264E9558J14913g2322A86723G036b23650B10888E53
15405b90098E1950K64746b19973j0270I4231a58482A41592b88839A67909n1758
$$ plain form
15395 116151 -110020 -4705 207970 266940 -30750 -258987 213714 -207661 202196 96326
15384 -80410 -124130 -145846 39525 62563 -7671 -260445 -21148 42179 -252235 -27106 -28862 339117
15371 -108112 99652 -432164 63094 -47861 -65627 168129 -164284 145710 -202106 -278280
15361 -278280 -235096 -519779 -8221 231526 -100726 -12153 75388 87696 30374 195130 -41910
15349 -24781 -131456 -292680 -130070 -585441 -160636 141771 42184 -204105 209944 -229250
15338 -126002 -95748 311421 -135409 -184968 -16816 -300194 330420 146594 -12301 -73061
15328 -73061 -186353 295114 145050 104421 -16795 12228 -72710 -30959 132988 158131 -68656
15316 -146161 262933 4228 169936 -236221 352893 -3831 17138 -119191 86892 -169373 -170991
$$ packed form
15395A16151a10020d705B07970N8970c0750k28237B13714b07661B02196I6326
15384h0410m3720k1716C9525K3038g671k52774b1148D2179b52235b7106j756C39117
15371a08112I9652d32164F3094d7861j7766A68129a64284A45710b02106p6174
15361b78280M3184k84683h221B31526a00726a2153G5388J2308C0374J64756d1910
15349b4781j06675j61224a30070m55371a60636A41771D2184b04105B09944b29250
15338a26002L0254C11421a35409m9559a6816k83378C30420A46594a2301o0760
15328g3061j13292B95114A45050m0629a6795A2228g2710c0959A32988K5143f8656
15316a46161B62933D228J65708b36221C52893c831A7138a19191H6892a69373j618
$$ plain form
15305 -170991 -20155 144928 255053 27471 61019 -109446 201649 -41596 88829 80417 13386
15293 180184 -302399 62452 -20860 400019 -41604 139980 117013 -170003 337220 281328
15283 281328 211118 80072 -340460 68935 83812 -1491 -172668 -103528 61516 -139536 103176
15271 -135740 -196115 3707 -76951 96670 -99095 65511 361011 137982 -125304 -74403 66587
15259 222830 12816 54014 -2078 46230 326129 420377 87267 187754 105446 174287 686008
15248 686008 1217852 1734268 1259622 1815400 772519 270937 238853 161150 48245 70977
15238 70977 126923 186515 182451 132390 276397 -215474 -26734 11896 -70178 -110209 76733
15226 298218 -23611 171845 132554 223911 297862 263833 23259 69104 33419 183891 -127078
$$ packed form
15305a70991b0155A44928J10125B7471L3548a09446B01649d1596H8829q412A3386
15293A80184c02399F2452b0860D00019d1604A39980k2967a70003C37220n5892
15283B81328p0210H0072c40460F8935J4877a491j71177O9140F1516a39536A03176
15271a35740o0375C707g6951I6670i9095F5511K95500A37982a25304N0901F6587
15259B22830A2816M1198b078D6230K79899R4248H7267J00487q2308O8841N11721
15248F86008N31844N16416m74646N55778G72519B70937l2084p7703D8245K2732
15238G0977N5946N9592m064n0061J44007b15474b6734A1896g0178m0031G6733
15226B98218b3611A71845l9291R1357P3951l4029B3259M5845C3419J50472a27078
$$ plain form
15214 106133 -46805 102022 -242468 -341522 99775 -138606 177909 -205095 80605 265002
15204 265002 14463 -209900 -207358 104792 91462 344371 -167801 -361798 328344 7206 -11721
15192 315592 205816 21508 -46887 -128957 153331 -48850 -62711 107638 52288 -51094 -41280
15181 -41280 -129565 -228773 -125561 206738 302115 -179270 266196 -133977 -35694 300559
15170 84387 356021 221738 170865 40705 335761 -203940 -2430 -65657 -121771 -25774 217431
15158 44186 -84758 84786 -105662 70102 21996 -17981 253076 194530 -74443 -207844 145700
15146 143210 279144 -70006 -19879 449221 24107 -3630 105769 18908 11711 -81714 186564
15134 167268 116715 78809 114634 49316 6530 212065 114194 -35280 218011 358662 -10898
$$ packed form
15214A06133d6805A02022b42468r9054I9775a38606A77909b05095H0605J84397
15204B65002A4463b09900K542A04792j3330K52909a67801j93997C28344G206a1721
15192C15592j09776B1508d6887q2070A53331d8850j3861A07638E2288e1094R814
15181d1280q8285r9208J03212B06738R5377a79270B66196a33977c5694C00559
15170H4387K71634j34283n0873D0705K95056b03940b430o3227n6114b5774B17431
15158D4186h4758H4786a05662G0102B1996a7981B53076n8546g4443j33401A45700
15146A43210J35934g0006a9879D49221B4107c630A05769A8908p197h1714A86564
15134A67268n0553l7906L5825D9316F530K05535r7871c5280B18011J40651a0898
$$ plain form
15122 -190495 254811 250777 345216 11468 405864 112750 392322 68218 -98352 -129456 334150
15110 364197 -73151 -108871 3836 339106 45348 241026 161020 41989 54708 29013 108850
15099 108850 -181317 156646 188672 341349 -71680 6838 104378 -9613 181408 -23812 -174832
15088 -174832 257201 392111 -231706 41409 113860 206013 136058 -83344 105337 254745
15078 254745 -70159 316910 67394 230481 267560 282657 30609 155077 206531 467295 426823
15067 426823 174962 134975 421921 149785 358708 236120 -57993 -597 -17364 89382 159842
15056 159842 234771 172374 165153 231145 490195 -93028 162897 80204 363660 224147 -41620
15044 146899 267403 126390 201235 -10415 -21020 354992 128171 173405 72815 273366
$$ packed form
15122a90495B54811m034R4439A1468L94396A12750K79572F8218i8352l1104C34150
15110C64197g3151l5720C836L35270D5348J95678q0006D1989J2719k5695P9837
15099A08850a81317A56646L2026J52677g1680F838R7540i613A81408b3812j51020
15088a74832B57201J34910b31706D1409P2451R2153o9955h3344A05337J49408
15078B54745g0159C16910F7394J63087L7079J5097C0609J24468N1454K60764m0472
15067D26823A74962l9987K86946A49785K08923j22588e7993e97j6767H9382P0460
15056A59842P4929o2397p221O5992K59050i3028A62897H0204K83456j39513d1620
15044A46899J20504A26390P4845a0415j0605C54992A28171M5234G2815K00551
$$ plain form
15034 273366 423043 -431282 335431 144810 -35618 163349 412815 523636 69316 515223
15024 515223 26334 195605 -22044 619990 70761 312493 302143 46741 195165 4587 52972
15013 52972 -56218 206703 91632 88388 426494 263415 338271 197398 144797 60231 372186
15002 372186 79600 54946 293156 133623 2302 263262 271949 386089 313912 89168 327841
14991 327841 268137 129545 232317 126333 557798 28188 280693 81189 219361 -50182
14980 258622 5848 399495 211934 540126 164088 46880 294452 184473 38904 385624
14970 385624 266045 106506 286962 560562 184850 174995 276696 335378 448168 166598
14959 387594 82186 -140927 101479 242269 264078 497819 87582 409599 61293 157082
$$ packed form
15034B73366J49677d31282C35431A44810c5618A63349K49466J10821F9316M45907
15024E15223B6334J69271b2044F19990G0761K41732j0350D6741J48424D587M8385
15013E2972e6218B06703I1632l244L38106j63079P4856j40873n2601F0231L11955
15002C72186G9600k4654K38210A33623B302K60960Q687J14140p2177H9168K38673
14991C27841n9704A29545J02772j05984M31465B8188K52505H1189J38172e0182
14980B58622E848L93647j87561L28192A64088D6880K47572j09979C8904L46720
14970C85624j19579A06506J80456K73600A84850r855J01701N8682J12790A66598
14959C87594H2186a40927A01479J40790K1809K33741H7582L22017F1293R5789
$$ plain form
14949 157082 208604 601182 588636 259520 288662 277416 171545 249427 549142 37339 223570
14938 223570 213178 284540 161786 148525 375772 305370 522514 193446 396708 255188
14928 255188 358061 222933 -71860 108927 100144 504326 317092 280267 541692 3102 491926
14917 491926 444107 141515 303332 94017 112048 12950 482711 90268 448295 460258 207024
14905 63408 106274 538777 80084 249957 106532 264519 330173 54442 348695 361153 224592
14894 224592 -47896 134395 343019 29568 294057 360705 510840 392062 578431 333793
14884 333793 740967 494090 197360 455748 482899 752968 468606 400722 56134 361576
14874 361576 352906 505164 21747 288626 34842 692940 464140 525159 273735 416382
$$ packed form
14949A57082N1522L92578j2546B59520K9142j1246j05871P7882K99715C7339J86231
14938B23570j0392P1362j22754j3261K27247p0402K17144A93446K03262j41520
14928B55188J02873j35128g1860A08927q783M04182j87234l6825K61425C102M88824
14917D91926m7819A41515J61817I4017J8031A2950M69761I0268L58027J1963B07024
14905F3408M2866M32503H0084J69873A06532J57987O5654E4442K94253J2458j36561
14894B24592d7896A34395K08624B9568K64489O6648J50135j18778J86369k44638
14884C33793M07174k46877A97360K58388K7151K70069k84362o7884E6134L05442
14874C61576q670J52258B1747K66879C4842O58098k28800O1019k51424J42647
$$ plain form
14864 416382 400309 542061 376933 794179 399173 183478 246374 524824 506002 213848
14853 310593 330446 713443 216021 369195 547442 505914 459023 509688 697365 280497
14842 678276 494995 244943 127433 249960 253913 226122 543106 448666 648646 55017
14831 143663 456501 169046 132381 390332 150628 655276 441070 635038 528551 381452
14821 381452 535751 532621 621794 546015 524995 125295 473219 611724 492047 497066 356364
14810 356364 616971 387101 379753 483846 551239 517970 815665 473152 736732 332112
14799 600113 299893 668820 594817 733179 516902 564193 832462 374848 604362 39387
14788 500615 443940 498987 504142 437366 438304 565629 439989 494185 560425 983217 859928
$$ packed form
14864D16382j6073J41752j65128M17246l95006A83478O2896K78450j8822B13848
14853C10593J9853L82997B16021J53174J78247m1528m6891N0665J87677B80497
14842F78276j83281B44943j17510J22527L953k7791L16984r4440J99980E5017
14831A43663L12838A69046l6665K57951A50628N04648k14206J93968j06487j47099
14821C81452J54299l130Q9173p5779k1020A25295L47924J38505j19677N019j40702
14810C56364K60607k29870p348J04093O7393l3269K97695l42513K63580C32112
14799F00113B99893L68927p4003J38362k16277M7291K68269C74848K29514C9387
14788E00615n6675N5047N155o6776R38J27325j25640N4196O6240M22792j23289
$$ plain form
14777 859928 469196 471969 554156 505018 691327 268856 900252 487639 682188 534186
14767 534186 497901 591884 638758 866730 536241 424408 500367 530507 503286 925031 657983
14756 657983 709122 897598 343773 635469 959628 212276 900618 594427 203745 448326
14746 448326 871419 907896 291281 381788 967109 464956 760194 771497 929024 682499
14736 682499 750921 655410 800586 767829 836565 733266 659813 643544 909435 917176 643548
14725 643548 632184 754471 507102 704752 546215 671301 1129501 842270 922118 1057800
14715 1057800 1054409 443777 631225 1048287 774332 1071984 749830 847826 996857 933774
14705 933774 761402 1043255 869027 833075 997783 1112954 812705 916808 1213608 775240
$$ packed form
14777H59928l90732K773Q2187m9138J86309B68856O31396m12613J94549j48002
14767E34186l6285R3983M6874K27972l30489j11833P5959L0140k7221M21745k67048
14756F57983N1139J88476C43773K91696L24159B12276O88342l06191B03745K44581
14746D48326M23093L6477B91281R0507N85321D64956K95238J1303J57527k46525
14736F82499O8422r5511J45176l2757O8736j03299p3453j6269K65891P741k73628
14725F43548j1364J22287k47369J97650j58537J25086M58200k87231P9848J35682
14715A057800l391D43777J87448M17062k73955K97652l22154R7996J49031o3083
14705I33774j72372K81853j74228l5952J64708J15171l00249J04103K96800m38368
$$ plain form
14695 775240 780559 836571 1093293 1275790 888934 1080034 1027695 810414 1175279 914490
14685 914490 1189214 1071093 988947 1061725 946397 1236289 563995 987441 877510 766115
14675 766115 1139233 952131 1036267 1033978 1115006 1268584 1179981 1132518 1294410 915590 633267
14664 633267 1103918 1058451 1389228 1167614 1291930 1218151 1301116 1386087 1268160 982131
14654 982131 1198894 1187496 803143 1303372 996360 1459319 1163799 1217656 1001863 1108201
14644 1108201 1018342 1169684 1021885 1014968 1380801 1017960 1606445 1620543 1349694 1514070
14634 1514070 1583312 1123509 883284 1291384 1221911 1167794 1617223 1522333 1164660 939094
14624 939094 1118597 1298146 1366844 1648867 1515199 1304580 1358513 1374424 1631655 1468937
$$ packed form
14695G75240N319N6012K56722J82497l86856J91100n2339k17281L64865k60789
14685I14490K74724j18121q2146P2778j15328K89892E63995M23446j09931j11395
14675G66115L73118j87102Q4136k289Q1028J53578q8603m7463J61892l78820k82323
14664F33267M70651m5467L30777k21614J24316p3779Q2965Q4971j17927k86029
14654I82131K16763j1398l84353N00229l07012M62959k95520N3857k15793J06338
14644A108201q9859J51342j47799o917L65833l62841N88485J4098k70849J64376
14634A514070O9242m59803k40225M08100o9473n4117M49429r4890l57673k25566
14624I39094J79503J79549O8698K82023j33668k10619N3933J5911K57231j62718
$$ plain form
14614 1468937 1371503 1717547 1497809 1658978 1609603 1546900 1658167 1558081 1450708 1767986
14604 1767986 1606220 1606138 1952864 1913453 1476505 1773862 1596148 1443133 1684578 1769090
14594 1769090 1355122 1607564 2184108 2126423 1746793 1467293 1657775 2153550 1836605 1943852
14584 1943852 2088158 1732652 1694722 2012673 2058968 1760078 2078533 2084545 2189275 1949912
14574 1949912 2051544 2185939 1955932 2181876 1954834 2226300 1938793 2321900 2274117 2569766
14564 2569766 2240005 2500489 2676613 2742288 2522717 2606269 2988955 2959637 3108408 3104168
14554 3104168 3672682 3757043 3929827 4752331 5551797 7172631 10769347 18620090 35643120
14545 35643120 51965916 27029280 10956859 4969324 3189632 2552176 2230304 2095405
$$ packed form
14614A468937r7434L46044k19738J61169m9375o2703J11267j00086j07373L17278
14604A767986j61766q2L46726l9411m36948K97357j77714j53015K41445Q4512
14594A769090m13968K52442N76544n7685l79630k79500J90482M95775l16945J07247
14584A943852J44306l55506l7930L17951M6295k98890L18455O012J04730k39363
14574A949912J01632J34395k30007K25944k27042K71466k87507L83107m7783K95649
14564B569766l29761K60484J76124O5675k19571Q3552L82686k9318J48771m240
14554C104168N68514Q4361J72784Q22504P99466J620834L596716P850743J7023030
14545C5643120J6322796k4936636A0956859D969324j779692o37456l21872j34899
$$ plain form
14537 2095405 2028414 2412290 2208436 2190981 2223436 2143295 2224612 2538060 2333998 1934493
14527 1934493 2405036 2305343 2124910 2232211 2290453 2381152 2227758 2670992 2310145 2475094
14517 2475094 2791921 2511955 2541028 2820762 2929780 2560223 2688384 2718946 2939293 2745585
14507 2745585 2661416 2883263 3075676 2924149 3283856 2782341 3133349 3157590 3166229 3083072
14497 3083072 3254109 3259139 3606041 3290329 3379044 3630116 3225151 3737869 3672783 3531520
14487 3531520 3692665 3532724 3606025 3577149 3878726 3776972 3991048 3910660 3806991 3811605
14477 3811605 3846363 4039363 4022048 4280181 4278165 4284478 4356380 4430081 4577982 4314625 4487154
14466 4487154 4500352 4785762 4787117 4462954 4705804 4540091 4747690 5287956 5053148 5177764
$$ packed form
14537B095405o6991L83876k03854j7455L2455q0141Q1317L13448k04062l99505
14527A934493M70543r9693j80433J07301N8242R0699j53394M43234l60847J64949
14517B475094L16827k79966K9073K79734J09018l69557J28161L0562K20347j93708
14507B745585q4169K21847J92413j51527L59707n01515L51008K4241Q639q3157
14497C083072J71037N030L46902l15712Q8715K51072m04965N12718o5086j41263
14487C531520J61145j59941P3301k8876L01577j01754K14076q0388j03669M614
14477C811605L4758J93000j7315K58133k016O313P1902P3701J47901k63357J72529
14466D487154J3198K85410J355l24163K42850j65713K07599N40266k34808J24616
$$ plain form
14456 5177764 5217643 5440182 5171875 5315776 5344467 5405524 5651131 5312041 5647248 5671813
14446 5671813 5436846 5876911 5838994 6299047 5930841 6066327 6401644 6318021 6324362 6469424
14436 6469424 6556273 6459460 6057815 6596609 6604955 6854038 6623581 6915377 6992316 7300219
14426 7300219 7622152 7668425 7734426 7640845 7776385 8032459 7999732 8036181 8398533 8451503
14416 8451503 8293191 8738788 8993168 8997361 9229183 9125999 9473356 9456053 9387006 9631036
14406 9631036 9622938 9902250 10218531 10101920 10709437 10773410 10512097 11021658 11010215 11642546
14396 11642546 11540837 11311456 11926121 12270248 12096171 12750161 12619276 12945962 13114635
14387 13114635 13585166 13611386 13743200 14039496 14247723 14671301 14738959 14863317 15366663 15837665
$$ packed form
14456E177764L9879K22539k68307J43901K8691O1057K45607l39090L35207K4565
14446E671813k34967M40065l7917M60053l68206J35486L35317q3623O341J45062
14436F469424Q6849r6813m01645N38794Q346K49083k30457K91796P6939L07903
14426G300219L21933M6273O6001r3581J35540K56074l2727L6449L62352N2970
14416H451503j58312M45597K54380M193K31822j03184L47357j7303o9047K44030
14406I631036q098K79312L16281j16611O07517O3973k61313N09561j1443O32331
14396A1642546j01709k29381O14665L44127j74077O53990j30885L26686J68673
14387A3114635M70531K6220J31814K96296K08227M23578O7658J24358N03346M71002
$$ plain form
14377 15837665 15588565 16194017 16296512 16953927 17665138 17402515 18086023 18457167 18872771
14368 18872771 18697924 19178149 19874705 20095580 20465840 21102344 21658121 22064150 22278507
14359 22278507 22995707 23639117 23755976 24346829 24993169 25702300 25864902 26774710 27623966
14350 27623966 28476321 28720842 29604830 30254247 31265542 31578009 32510757 33700036 34367119
14341 34367119 35513648 36138533 37314893 38175193 39539797 40588189 41645497 42712866
14333 42712866 43919210 45299508 46429009 47777559 49710684 51023852 52597171 54794512
14325 54794512 56173378 58098191 60072180 62088021 64501165 66466986 68959056 71240796
14317 71240796 74158997 76569737 79444895 82901117 85711338 89010467 92877803 96634860
$$ packed form
14377A5837665k49100O05452J02495O57415P11211k62623O83508L71144M15604
14368A8872771j74847M80225O96556K20875L70260O36504N55777M06029K14357
14359B2278507P17200O43410J16859N90853O46340P09131J62602R09808Q49256
14350B7623966Q52355K44521Q83988O49417J011295L12467R32748J189279O67083
14341C4367119J146529O24885J176360Q60300J364604J048392J057308J067369
14333D2712866J206344J380298J129501J348550J933125J313168J573319K197341
14325E4794512J378866J924813J973989K015841K413144J965821K492070K281740
14317G1240796K918201K410740K875158L456222K810221L299129L867336L757057
$$ plain form
14309 96634860 100745208 104891061 109552039 114389815 119233281 124571916 130111774 136009995
14301 136009995 142322915 149001006 156157942 163483753 171673632 179952822 188765345 197838998
14293 197838998 208104531 218501285 229394525 241459132 253265087 266209408 279462934
14286 279462934 293400196 307828328 322505429 337774116 352928562 368123218 383390166
14279 383390166 398177471 412247160 426023353 438707915 449469316 458925494 465523537
14272 465523537 468865559 469839294 469913585 470256218 466564895 463094177 457454974 449696964
14264 449696964 439907006 428380680 415606533 400973467 386285868 370549661 354997111
14257 354997111 339242476 323552665 308742405 294854151 281061681 267226110 253940448
$$ packed form
14309I6634860M110348M145853M660978M837776M843466N338635N539858N898221
14301A36009995O312920O678091P156936P325811Q189879Q279190Q812523R073653
14293A97838998J0265533J0396754J0893240J2064607J1805955J2944321J3253526
14286B79462934J3937262J4428132J4677101J5268687J5154446J5194656J5266948
14279C83390166J4787305J4069689J3776193J2684562J0761401R456178O598043
14272D65523537L342022R73735P4291L42633l691323l470718n639203p758010
14264D49696964r789958j1526326j2774147j4633066j4687599j5736207j5552550
14257C54997111j5754635j5689811j4810260j3888254j3792470j3835571j3285662
$$ plain form
14250 253940448 241314046 229541947 218074914 207721112 197531830 188037897 179517305
14243 179517305 170924708 162713800 155347829 147919934 141625105 135355235 129630706 124015236
14235 124015236 118432158 113415907 108682724 104215205 100646673 96577697 92953593 88871780
14227 88871780 85186077 82236781 79065489 76405085 73441670 70821939 68476995 66118551
14219 66118551 64301250 61879680 59461615 57663105 55766498 54336558 52951161 51125047
14211 51125047 49249464 47916049 46762955 45031256 44777644 43322680 41835263 40523112
14203 40523112 39308466 38341286 37157612 36886075 35726646 34578499 33541957 32869415
14195 32869415 31957668 31325118 30671909 29462418 28990399 28171621 27553619 26891099 26360107
$$ packed form
14250B53940448j2626402j1772099j1467033j0353802j0189282r493933q520592
14243A79517305q592597q210908p365971p427895o294829o269870n724529n615470
14235A24015236n583078n016251m733183m467519l568532m068976l624104m081813
14227H8871780l685703k949296l171292k660404k963415k619731k344944k358444
14219F6118551j817301k421570k418065j798510j896607j429940j385397j826114
14211E1125047j875583j333415j153094j731699k53612j454964j487417j312151
14203D0523112j214646r67180j183674k71537j159429j148147j036542o72542
14195C2869415r11747o32550o53209j209491m72019q18778o18002o62520n30992
$$ plain form
14186 26360107 25545477 24919041 24274584 23897612 23172913 22655213 22683345 21918834 21251888
14177 21251888 21152811 20773208 20142201 19833445 19634747 19206566 18806161 18285308 17566247
14168 17566247 17435450 17469390 16707069 16371829 16498646 16018617 15704207 15509996 15188392
14159 15188392 15219240 14872683 14478150 14103175 13966798 13906513 13347645 13185865 12597253 12857443
14149 12857443 12559149 12615344 12328961 11950519 11692146 11671690 11616762 11174992 11305548 10958513
14139 10958513 10626888 10238011 10471711 10400182 10299283 9810064 9874266 9699820 9570301 9373323
14129 9373323 9620605 9142265 8720954 8907103 8887810 8876061 8869297 8168281 8523037 8539254
14119 8539254 8099187 8177760 7892266 7934449 7891467 7556478 7582858 7627669 7533171 7546829 7346809
$$ packed form
14186B6360107q14630o26436o44457l76972p24699n17700K8132p64511o66946
14177B1251888r9077l79603o31007l08756j98698m28181m00405n20853p19061
14168A7566247j30797L3940p62321l35240J26817m80029l14410j94211l21604
14159A5188392L0848l46557l94533l74975j36377o0285n58868j61780n88612K60190
14149A2857443k98294N6195k86383l78442k58373k0456n4928m41770J30556l47035
14139A0958513l31625l88877K33700p1529j00899m89219O4202j74446j29519j96978
14129I373323K47282m78340m21311J86149j9293j1749o764p01016L54756J6217
14119H539254m40067P8573k85494M2183m2982l34989K6380M4811r4498J3658k00020
$$ plain form
14108 7346809 7409720 7073774 7195641 6966946 6769730 6816122 6938538 6400987 6575816 6473750
14098 6473750 6224058 6326607 6066981 6240447 6227932 5932244 6003559 5676323 5548807 5585232
14088 5585232 5667115 5456387 5693394 5371406 5523993 5216582 5505273 5193896 5179615 5407562
14078 5407562 5231422 5288147 5230501 4779140 4830460 5134248 4529268 4650311 4661951 4545924
14068 4545924 4494826 4458398 4015326 4256060 4473238 4534848 4294230 4732214 4322155 4483337
14058 4483337 4078402 4515824 4141984 4065158 4294656 3811646 4110945 3858806 3978972 4112407
14048 4112407 3675034 3778577 3742706 3565466 3624079 3720740 3615739 3451122 3292342 3557853
14038 3557853 3454576 3177482 3158422 3407853 3155448 3262222 3432319 3301747 3501032 3498145
$$ packed form
14108G346809O2911l35946J21867k28695j97216M6392J22416n37551J74829j02066
14098F473750k49692J02549k59626J73466j2515k95688P1315l27236j27516L6425
14088E585232Q1883k10728K37007l21988J52587l07411K88691l11377j4281K27947
14078E407562j76140N6725n7646m51361N1320L03788o04980J21043J1640j16027
14068D545924n1098l6428m43072K40734K17178O1610k40618M37984m10059J61182
14058D483337m04935M37422l73840p6826K29498m83010K99299k52139J20166J33435
14048D112407m37373J03543l5871j77240N8613R6661j05001j64617j58780K65511
14038C557853j03277k77094j9060K49431k52405J06774J70097j30572J99285k887
$$ plain form
14028 3498145 3035016 3070280 2969226 3052562 2984905 2912244 2915437 3102075 3074577 2797146 3089595
14017 3089595 2895390 2860893 2450317 3119442 2771465 2158621 2151649 2549862 2624771 2808093
14007 2808093 2426643 2431568 2416822 2585135 2359624 2322364 2253666 2324039 2564605 2146790
13997 2146790 2342135 1990384 2346470 2072162 1907287 2140432 2378243 2861416 3271537
13988 3271537 5794919 11509667 27099035 51817380 31220211 15543578 9262107 6386353
13980 6386353 5049791 4714812 4105631 3267821 3553614 3157101 3072123 3105641 2941918 2944183
13970 2944183 2636449 2600317 2444530 2585452 2469161 2292067 2473907 2448765 2345093 2160507
13960 2160507 2475127 1997402 2329067 2081241 1881586 2324804 2340198 2376979 2149747 2128898
$$ packed form
14028C498145m63129L5264j01054Q3336o7657p2661L193J86638k7498k77431K92449
14017C089595j94205l4497m10576O69125l47977o12844o972L98213P4909J83322
14007B808093l81450M925j4746J68313k25511l7260o8698P0373K40566m17815
13997B146790J95345l51751L56086k74308j64875K33145K37811M83173M10121
13988C271537K523382N714748J5589368K4718345k0597169A5543578o281471k875754
13980F386353j336562l34979o09181q37810K85793l96513q4978L3518j63723K265
13970B944183l07734l6132j55787J40922j16291j77094J81840k5142j03672j84586
13960B160507L14620m77725L31665k47826j99655M43218J5394L6781k27232k0849
$$ plain form
13950 2128898 2416908 2140797 2042019 2211546 1835524 2145757 2016546 1959430 1919272 1801071
13940 1801071 1912351 1965760 2014985 1807299 1780929 1743749 1767861 1529867 1792098 1951279
13930 1951279 1975562 1953506 1731662 1452022 1855206 1984298 1929128 1784732 1650469 1707038
13920 1707038 1805394 1247725 1959614 1641208 1642422 1450637 1798731 1660795 1363711 1767613
13910 1767613 1681622 1267959 1542744 1404109 1263799 1553995 1530969 1608543 1491418 1628721
13900 1628721 1386503 1536948 1576044 1860055 1323432 1445030 1476627 1665079 1282359 1565490
13890 1565490 1281513 1166502 1268895 1362369 1626979 1490800 1328541 1153283 1120219 1433542
13880 1433542 1428870 1401721 1357900 1289390 1145762 1028083 1041165 1415630 1267538 934686
$$ packed form
13950B128898K88010k76111r8778J69527l76022L10233j29211n7116m0158j18201
13940A801071J11280N3409M9225k07686k6370l7180K4112k37994K62231J59181
13930A951279K4283k2056k21844k79640M03184J29092n5170j44396j34263N6569
13920A707038R8356n57669P11889l18406J214j91785L48094j37936k97084M03902
13910A767613q5991m13663K74785j38635j40310K90196k3026P7574j17125J37303
13900A628721k42218J50445L9096K84011n36623J21598L1597J88452l82720K83131
13890A565490k83977j15011J02393R3474K64610j36179j62259j75258l3064L13323
13880A433542m672k7149m3821o8510j43628j17679J3082L74465j48092l32852
$$ plain form
13870 934686 1394562 1256621 1320264 996816 1027316 1210986 1310639 1224871 1038595 1152893
13860 1152893 1418534 1174840 1066113 1271710 1013326 1330829 972260 1065317 1532063 1386980
13850 1386980 984667 888247 1039471 1301008 1014851 1117484 800507 967475 968274 1106462
13840 1106462 960336 764353 889231 1240767 943263 762465 888796 900150 1067308 879428
13830 879428 866241 991841 912676 974456 963927 758534 959670 756984 999983 770300
13820 770300 758552 634458 973351 1109189 1162204 813404 813782 777109 1126664 1305052 1321329
13809 1321329 976466 938183 775291 835720 665093 695509 806939 879287 1166582 1079104
13799 1079104 634853 857041 1047176 747982 842730 1097962 632101 777202 890018 663899
$$ packed form
13870I34686M59876j37941O3643l23448L0500J83670R9653q5768j86276J14298
13860A152893K65641k43694j08727K05597k58384L17503l58569R3057M66746j45083
13850A386980m02313r6420J51224K61537k86157J02633l16977J66968P99J38188
13840A106462j46126j95983J24878L51536k97504j80798J26331J1354J67158j87880
13830H79428j3187J25600p9165O1780j0529k05393K01136k02686K42999k29683
13820G70300j1748j24094L38893J35838N3015l48800L78l6673L49555J78388J6277
13809A321329l44863l8283j62892O0429j70627L0416J11430P2348K87295q7478
13799A079104m44251K22188J90135k99194R4748K55232m65861J45101J12816k26119
$$ plain form
13789 663899 701254 858163 411148 706619 700532 1028527 500626 847765 1005496 996870
13779 996870 876086 721926 539854 811269 847613 955701 618019 765983 783826 1060751
13769 1060751 560975 464014 858815 522210 772936 609461 488760 425269 803547 721871
13759 721871 1040252 803026 848713 585115 714893 750823 778042 373579 830707 1102602
13749 1102602 527828 477076 631088 674539 402839 520876 840731 574109 549874 843894
13739 843894 632498 666654 831648 840342 774751 504719 549461 989890 472883 720216
13729 720216 769836 265143 1012516 753505 759327 574977 518764 589452 542927 560308 739057
13718 739057 584299 722582 897966 320423 473472 567798 540141 527533 774288 540137
$$ packed form
13789F63899L7355J56909D11148K95471o087L27995E00626L47139J57731q626
13779I96870j20784j54160j82072K71415L6344J08088l37682J47964J7843K76925
13769A060751m99776r6961L94801l36605K50726j63475j20701o3491L78278q1676
13759G21871L18381k37226M5687k63598J29778L5930K7219C73579M57128K71895
13749A102602E27828n0752J54012M3451k71700J18037L19855k66622k4235K94020
13739H43894k11396L4156J64994Q694o5591k70032M4742M40429D72883K47333
13729G20216M9620B65143P47373k59011N822j84350n6213P0688m6525J7381J78749
13718G39057j54758J38283J75384C20423J53049R4326k7657j2608K46755k34151
$$ plain form
13708 540137 502738 357443 803968 595961 787789 699733 834478 409622 546912 958229
13698 958229 790784 224242 611749 417142 465546 471469 305950 729617 587558 856478
13688 856478 428530 214786 490452 388736 186335 856302 373710 352872 608278 343743
13678 343743 396274 559997 685871 502826 423884 386720 290310 514975 235422 535457
13668 535457 484917 442675 512170 734633 312645 649311 514660 860815 476013 585878
13658 585878 496799 263548 367473 527754 568216 485570 541188 178674 569076 591698
13648 591698 518386 413365 495198 516891 400073 374315 224042 574075 505228 504020 455874
13637 455874 478501 547884 194413 557989 -274543 382747 313553 153076 501981 537699
$$ packed form
13708E40137l7399j45295M46525k08007J91828q8056J34745D09622J37290M11317
13698I58229j67445B24242L87507j94607M8404N923j65519M23667j42059K68920
13688H56478m27948k13744K75666j01716A86335O69967C73710k0838K55406k64535
13678C43743N2531J63723J25874j83045p8942l7164r6410K24665B35422L00035
13668E35457n0540m2242O9495K22463C12645L36666j34651L46155l84802J09865
13658E85878q9079k33251J03925J60281M0462q2646N5618A78674L90402K2622
13648E91698p3312j05021Q1833K1693j16818k5758j50273L50033o8847j208m8146
13637D55874K2627O9383A94413L63576b74543C82747o9194A53076L48905L5718
$$ plain form
13627 537699 499236 503453 438572 496322 168879 592386 199112 197025 398821 481405 317777
13616 317777 612012 516502 298291 383447 364582 490276 492778 473168 116713 356282 249360
13605 249360 490820 21143 565671 285423 243234 599199 252953 451938 271641 258095
13595 258095 703767 618699 118025 205788 430809 290724 181572 681993 380280 400486
13585 400486 158238 162403 260004 500570 455904 285567 535085 57258 583275 391245
13575 391245 370127 610093 28091 763496 40499 261832 666918 217111 241010 332700
13565 332700 209635 -65736 563466 554922 387067 309863 673878 510171 299991 262022
13555 262022 248014 -209610 160298 13486 203286 472180 98416 440254 1484 27540 301829
$$ packed form
13627E37699l8463M217o4881N7750A68879M23507A99112k087K01796Q2584j63628
13616C17777K94235r5510k18211Q5156j8865J25694K502j9610A16713K39569j06922
13605B49360K41460B1143N44528k80248m2189L55965B52953J98985j80297j3546
13595B58095M45672q5068A18025Q7763K25021j40085j09152N00421l01713K0206
13585D00486A58238M165R7601K40566m4666j70337K49518E7258N26017j92030
13575C91245k1118K39966B8091P35405D0499K21333M05086B17111K3899R1690
13565C32700j23065f5736E63466q544j67855p7204L64015j63707k10180l7969
13555B62022j4008b09610A60298A3486J89800K68894I8416L41838A484K6056K74289
$$ plain form
13544 301829 515096 55341 325182 447981 270820 -20941 379832 282870 600670 342598
13534 342598 575786 288405 -242885 192493 244018 384598 522132 528468 128130 245454
13524 245454 191965 179840 461230 269392 322903 336836 342373 -7417 -12266 244966 216922
13513 216922 184606 155285 654223 369354 335720 324886 688967 617828 338194 253126 744803
13502 744803 280984 456687 341194 473782 128788 627324 339213 160405 355241 -8166
13491 348783 141072 260217 295327 264009 69171 448948 585474 425134 379772 234664
13481 234664 310788 -1007 329854 191444 385864 -96462 339137 216726 439352 359166
13471 359166 245541 183349 223102 811859 323309 309958 286753 484861 218584 114351
$$ packed form
13544C01829K13267E5341K69841J22799j77161b0941C79832r6962L17800k58072
13534C42598K33188k87381b42885A92493N1525J40580J37534O336A28130J17324
13524B45454n3489j2125K81390j91838N3511J3933N537g417m849B44966k8044
13513B16922l2316k9321M98938k84869l3634j0834L64081p1139k79634q5068M91677
13502G44803B80984J75703j15493J32588A28788M98536k88111A60405J94836h166
13491C48783A41072J19145L5110l1318F9171L79777J36526j60340m5362j45108
13481B34664P6124a007C29854j38410J94420i6462C39137j22411K22626q0186
13471C59166j13625o2192L9753N88757C23309j3351k3205J98108B18584j04233
$$ plain form
13461 114351 216869 -9130 297631 176409 366334 354887 137837 223069 -72795 360515
13450 -75677 155698 -258134 138569 130574 221342 251910 292075 222250 -43080 277061 230906
13439 230906 164880 803922 9637 242212 -8172 312383 350798 15779 69039 184974 469510
13428 469510 121009 19376 263778 315933 38679 222906 189458 202800 193920 415654 174805
13416 510115 227213 409002 78798 -30957 17766 229854 319951 64709 -37181 201634 261275
13405 261275 51355 455662 172268 109804 91865 336269 201468 308944 201900 418987
13395 418987 626290 544784 324810 380878 263939 204350 354167 -8131 180393 -40449 313902
13383 128444 302250 295994 345968 -43119 229123 22257 223418 454527 436716 110424 -22115
$$ packed form
13461A14351J02518i130B97631j21222J89925j1447A37837Q5232g2795C60515
13450g5677A55698b58134A38569p995R0768L0568M0165o9825d3080B77061m6155
13439B30906o6026O39042I637K32575h172C12383L8415A5779N3260J15935K84536
13428D69510A21009A9376K44402N2155C8679J84227l3448J3342q880K21734A74805
13416E10115B27213J81789G8798c0957A7766K12088R0097F4709c7181B01634N9641
13405B61275E1355M04307A72268o2464j7939K44404j34801J07476j07044K17087
13395D18987K07303q1506k19974N6068j16939n9589J49817h131A80393d0449C13902
13383A28444J73806o256M9974d3119B29123B2257K01161K31109j7811A10424b2115
$$ plain form
13371 108039 287454 223601 56345 202933 102095 -37789 212994 272404 498540 139075
13360 167276 90243 120113 -2650 338657 297001 120074 486861 33906 244401 -20444 401157
13348 43521 209290 447886 247523 231770 88082 410016 378861 124948 229484 562384
13338 562384 433856 438308 358165 550984 173681 162447 23629 126602 355883 224020
13328 224020 211923 -29233 459401 169451 271881 312733 177700 165103 487658 88138
13317 -135556 105302 535568 473267 247191 305742 188700 278650 15996 117559 116325 219280
13306 219280 176336 304418 87020 155376 -17140 161689 51450 -111209 205066 113878 -24143
13294 12435 207183 24831 -44667 69727 280475 279089 150740 303434 325262 -77898 335715
$$ packed form
13371A08039J79415o3853E6345J46588j00838c7789B12994N9410K26136A39075
13360A67276p7033K9870b650C38657m1656A20074L66787C3906K10495b0444D01157
13348D3521J65769K38596k00363j5753H8082L21934l1155A24948J04536L32900
13338E62384j28528M452q0143J92819A73681j1234B3629J02973K29281j31863
13328B24020j2097b9233D59401A69451J02430M0852j35033j2597L22555H8138
13317a35556A05302M30266o2301k26076N8551j17042Q9950A5996J01563j234J02955
13306B19280m2944J28082H7020O8356a7140A61689E1450a11209B05066r1188b4143
13294A2435J94748B4831d4667F9727K10748j386j28349J52694K1828g7898C35715
$$ plain form
13282 37743 201341 57632 65588 257268 -4893 -94718 385878 -37812 196660 396794 158832
13270 14347 161226 125363 242444 -106689 416944 264416 254798 86903 247535 181567 95149
13259 95149 171839 -253699 9102 296054 70992 22441 317219 97844 -163084 400084 64635
13247 56226 16315 121747 173116 246823 163557 397158 91221 33079 -62595 262780 -213891
13235 163133 194103 66602 379806 215517 220263 -17375 106620 1476 15268 146698 109389
13224 109389 342221 67478 98704 107120 13474 -172570 -77579 -259414 49950 137598 63444
13212 63897 407766 256995 387912 146544 210420 31127 -162078 -167662 -28411 -4534 47909
13200 69832 89326 516676 -7507 9269 314189 -28661 31164 189023 123045 45103 134378
$$ packed form
13282C7743J63598E7632P956J91680d893q9825C85878c7812A96660K00134A58832
13270A4347J46879l5863J17081a06689D16944j52528r618H6903J60632o5968q6418
13259I5149P6690b53699I102K86952G0992B2441K94778I7844a63084D00084F4635
13247E6226A6315J05432N1369P3707q3266K33601I1221C3079f2595B62780b13891
13235A63133L0970F6602L13204j64289M746a7375A06620A476J3792J31430l7309
13224A09389K32832F7478L1226Q416A3474a72570g7579j81835D9950Q7648F3444
13212F3897L43869j50771J30917A46544O3876C1127a62078n584b8411d534D7909
13200F9832J9494M27350g507I269L04920b8661C1164J57859o5978D5103Q9275
$$ plain form
13189 134378 143909 188589 -26650 80164 16052 354466 -28325 159946 367158 259506 252871
13178 252871 316464 255665 25987 15151 317477 317936 114681 90287 -108712 36629 420250
13167 420250 334849 177797 156144 287384 130499 190311 -37623 363 252014 -270426 35190
13155 250905 -38177 176551 85697 17224 -28736 103113 -171575 26001 243076 261854 95984
13143 -220582 -26266 541194 467557 -64859 35823 235469 140987 157518 206702 225869 -211071
13131 -32515 142516 -28738 -187379 202519 222071 385141 15834 184955 60562 17495 -4267
13119 -224375 15866 19406 -118858 -40798 186358 295306 136099 -144707 242015 -142676
13108 -2362 -83732 -45012 376958 -91826 236552 -16459 105332 339931 379086 117233 -223248
$$ packed form
13189A34378R531M4680b6650H0164A6052L38414b8325A59946K07212j07652o635
13178B52871O3593o0799B5987j0836L02326M59A14681k4394a08712C6629L83621
13167D20250q5401j57052k1653J31240A30499N9812c7623C63K51651b70426C5190
13155B50905c8177A76551H5697A7224b8736A03113a71575B6001K17075J8778I5984
13143b20582b6266E41194p3637f4859C5823J99646r4482J6531M9184J9167b11071
13131c2515A42516b8738j58641B02519J9552J63070A5834J69121F0562A7495d267
13119b24375A5866L540a18858d0798A86358J08948A36099a44707B42015a42676
13108b362q1370L8720C76958i1826B36552a6459A05332K34599L9155A17233b23248
$$ plain form
13096 143742 -248343 131516 30414 323160 173943 162098 150498 -31196 140702 298422
13086 298422 -347129 -9566 293304 155234 184357 4595 70730 169420 -233418 107838 -1460
13074 182817 -32558 345697 246066 -47128 86949 231295 395460 89300 -20109 92239 125387
13063 125387 348015 73253 -330319 67413 -284898 197304 380379 -18562 128396 31634
13052 96990 143977 97292 -92315 267907 184736 201871 109150 225875 400805 381468 157666
13040 -96542 -7044 78013 -197356 209316 -125544 7424 -25442 180451 244873 43346 84741
13029 84741 -35915 315518 -148264 744288 217760 24102 -6129 49321 201826 -18546 82512
13017 97370 132091 -97564 219996 410250 -98399 317487 194647 213984 87970 411147 82337
$$ packed form
13096A43742b48343A31516C0414K92746j49217j1845j1600c1196A40702J57720
13086B98422c47129i566B93304j38070K9123D595O6135R8690b33418A07838a460
13074A82817c2558C45697r9631d7128H6949J44346J64165H9300b0109I2239L3148
13063A25387K22628G3253c30319F7413b84898A97304J83075a8562A28396C1634
13052I6990M6987m6685i2315B67907q3171J7135r2721J16725J74930j9337A57666
13040i6542g044G8013a97356B09316a25544G424b5442A80451O4422D3346M1395
13029H4741c5915C15518a48264G44288B17760B4102f129D9321J52505a8546H2512
13017I7370L4721i7564B19996J90254i8399C17487j22840J9337H7970L23177H2337
$$ plain form
13005 362119 -53257 46449 117918 21013 341079 -196230 -164301 49609 121796 181218 92456
12994 92456 -45091 261490 391042 -47499 43223 -48495 151805 157312 75976 -210754 182747
12982 27103 -70177 178979 145355 193102 272889 248205 93704 -196433 14597 131554 110085
12971 110085 50950 52050 60725 88388 76038 232667 2500 -11107 146975 449482 312005
12960 312005 -139581 6774 -100196 -24694 -16594 -131906 151410 -9075 -276726 85521 -138172
12948 -78881 -20933 54126 -629 -149609 298864 245985 68519 -71899 240213 35493 40293 122732
12936 122732 -1484 348227 -315850 -269131 198773 -160647 288452 -243576 176974 -20662
12925 89697 -54357 154452 168172 197585 177929 -192475 52696 -76244 110641 273473 13199
$$ packed form
13005C62119e3257D6449P1469B1013L20066a96230L1929D9609P2187N9422q8762
12994I2456d5091B61490J29552d7499D3223d8495A51805N507G5976b10754A82747
12982B7103g0177A78979l3624M7747P9787k4684I3704a96433A4597J16957k1469
12971A10085E0950J100Q675K7663j2350J56629B500a1107A46975L02507j37477
12960C12005a39581F774a00196b4694Q100j15312A51410i075k67651H5521a38172
12948g8881b0933E4126f29j48980B98864n2879F8519g1899B40213C5493M800Q2439
12936A22732a484C48227c15850M6719A98773a60647B88452b43576A76974b0662
12925H9697e4357A54452J3720K9413j9656a92475E2696g6244A10641J62832A3199
$$ plain form
12913 -38377 86419 47313 51506 -257774 -105969 -55456 -94023 -171286 -122049 -95133 184491
12901 -18059 -142768 400 112021 266327 -39507 -49260 48330 59918 -94455 75263 193249
12890 193249 -1416 -101795 172984 174610 106202 222019 -174068 -174292 -26775 9371 172938
12879 172938 -62225 393749 -63855 216725 -185065 364180 86110 175000 130863 -162137
12868 116761 -40572 107184 -34985 -121460 52358 185002 259169 31540 150283 205216 301786
12857 301786 208449 85983 -129825 30525 55221 -24621 196997 215669 4326 213424 -5150
12845 -80208 24184 -64965 -129170 -109607 -229359 386766 -28646 -115907 59499 388144 89748
12833 97823 -160391 34989 109066 98415 -100874 101230 169776 -145080 -148087 -74370 114512
$$ packed form
12913c8377H6419l9106M193b57774a05969N0513l8567p7263M9237K6916A84491
12901a8059j24709D00J11621J54306c9507r753D8330J1588i4455G5263J17986
12890A93249a416j00379A72984J626o8408J15817a74068k24b6775I371J63567
12879A72938f2225C93749f3855B16725a85065C64180H6110Q8890m4137a62137
12868A16761d0572A07184c4985q6475E2358J32644P4167C1540J18743N4933R6570
12857C01786r3337H5983a29825C0525K4696b4621A96997J8672D326K09098e150
12845h0208B4184f4965o4205J9563j19752C86766b8646q7261E9499L28645H9748
12833I7823a60391C4989P4077j0651a00874A01230O8546a45080l007P3717A14512
$$ plain form
12821 -239912 53344 -240978 -66611 -186894 427073 -63211 101481 -130340 100951 76080
12811 76080 154531 134241 -330511 -64010 285925 255032 -144331 -96390 24460 -17098 -97146
12800 -97146 -345836 34599 72034 235994 -81152 -17036 -82225 117630 67110 -80973 405140
12788 69233 114069 60623 14967 125188 -14213 177231 -150060 -91318 3527 -156429 154917
12776 -241860 132613 222278 -72691 -90538 246916 201101 178284 4471 -147168 159258 -83892
12764 -5334 199987 133823 268056 -228405 124058 -252964 90278 -98773 -137185 198747 -77317
12752 159394 76801 167494 -32928 210424 -170104 -209182 -36062 155593 315510 -447059
12741 -78769 -23796 72783 424540 -21842 37113 286461 425989 209269 253602 -224349 -11740
$$ packed form
12821b39912E3344b40978f6611j20283D27073f3211A01481a30340A00951k4871
12811G6080P8451k0290c30511f4010B85925l0893a44331M7941B4460a7098q0048
12800i7146k48690C4599L7435J63960h1152a7036o5189A17630n0520h0973D05140
12788F9233M4836n3446A4967J10221a4213A77231a50060N8742C527a56429A54917
12776b41860A32613Q9665g2691j7847B46916m5815k2817D471a47168A59258h3892
12764e334A99987o6164J34233b28405A24058b52964I0278i8773l8412A98747g7317
12752A59394G6801R0693c2928B10424a70104l9078c6062A55593J59917d47059
12741g8769b3796G2783L51757b1842C7113K49348J39528B09269M4333b24349a1740
$$ plain form
12729 -25736 -24833 285751 -182343 -192247 -221622 179808 -298612 -88279 -77117 236125 214245
12718 214245 279192 191950 -137645 248915 307635 -118378 82347 163561 -113782 -20393 351857
12706 167170 78096 331217 262177 305190 382548 -208361 95634 55859 199015 -8553 154079
12694 198075 -71883 217077 -123132 -52873 52064 6678 264189 -259989 -336220 -42414 -23082
12683 -23082 150761 -1679 301408 483005 358075 -27111 9151 89832 26332 -38032 -125137
12672 -125137 86852 -141120 -330786 188570 -411 -37681 -12069 -154090 309771 273607 -179123
12660 -211244 475356 134814 124424 -240702 119150 582976 376643 52759 207783 -7358
12649 -3107 28674 222680 23437 133524 -157586 228311 236404 32019 -58388 -235566 96637
$$ packed form
12729b5736R03B85751a82343r904k9375A79808b98612h8279J1162B36125k1880
12718B14245O4947q7242a37645B48915N8720a18378H2347Q1214a13782b0393C51857
12706A67170G8096K53121o9040M3013P7358b08361I5634l9775J43156h553A54079
12694A98075g1883B17077a23132e2873E2064F678K57511b59989p6231d2414J9332
12683b3082A50761a679C01408J81597j24930b7111I151Q0681B6332c8032q7105
12672a25137H6852a41120j89666A88570d11l7270a2069j42021C09771l6164a79123
12660b11244D75356A34814j0390b40702A19150M63826k06333E2759J55024g358
12649c107B8674J94006B3437J10087a57586B28311Q093C2019e8388j77178I6637
$$ plain form
12637 168758 223096 182309 418719 2084 278375 337120 206013 391779 309889 434120 413453
12626 413453 -276439 448196 208081 343533 79077 372117 299884 -54643 -7449 21158 -46253
12614 183218 106519 -18430 -249165 194053 -43929 146311 78932 -40980 -82785 438113 -255651
12602 -43075 29265 74792 227204 309814 58113 532814 128798 -45995 81048 -22066 -177751
12591 -177751 17110 -81697 -318511 271564 116451 -15652 257213 -85175 -51129 114936
12580 -26769 153603 176440 36182 197278 157101 -81040 32114 -109673 187223 -53693 226356
12568 -175971 320753 114086 150022 -20735 -72796 76768 18267 -86412 134315 267527 246949
12557 246949 213643 244869 -108962 346130 -74602 135339 128248 -12539 186916 274975 76213
$$ packed form
12637A68758N4338m0787K36410B084K76291N8745j31107J85766q1890J24231k0667
12626D13453b76439D48196B08081J35452G9077K93040p2233e4643g449B1158d6253
12614A83218p6699a8430k30735A94053d3929A46311o7379d0980m1805D38113b55651
12602d3075B9265M5527J52412Q2610E8113M74701A28798d5995H1048b2066j55685
12591a77751A7110h1697k36814B71564A16451a5652B57213h5175L4046A14936
12580b6769A53603K2837C6182J61096m0177h1040C2114a09673A87223e3693B26356
12568a75971C20753A14086L5936b0735n2061G6768A8267h6412A34315J33212k0578
12557B46949l3306L1226a08962C46130g4602A35339p091a2539A86916Q8059G6213
$$ plain form
12545 329669 -83238 14025 60620 31960 -72826 45555 74190 18045 11941 380549 146523
12533 -309917 -3145 24847 175795 -57280 150274 41824 -268761 116798 56715 -153682 -111973
12522 -111973 -47592 -40793 378825 483656 104427 66439 -157006 -138952 315284 145843
12511 268572 -41540 161008 22903 -115795 151241 108428 158663 111221 -75792 175967 100101
12500 100101 129204 261714 133634 137629 -20346 99573 267668 -152954 48109 151023 68356
12488 -16835 32165 -234191 15643 -69039 -100531 -56059 130336 61816 170456 16887 284559
12477 284559 -311142 21302 -254826 -132101 -88002 -93515 -111351 20616 -127224 -119652 -146755
12466 -146755 30956 43137 -174959 -259176 140088 -177545 -20241 -265049 93527 1731 -276732
$$ packed form
12545C29669h3238A4025M6595k8660g2826D5555K8635A8045o104L68608A46523
12533c09917c145B4847J50948e7280A50274D1824b68761A16798E6715a53682M1709
12522a11973d7592O799C78825J04831A04427l7988a57006J8054C15284A45843
12511B68572d1540A61008B2903a15795A51241m2813N0235m7442g5792A75967p5866
12500A00101K9103J32510j28080L995b0346I9573J68095a52954D8109J02914F8356
12488a6835C2165b34191A5643f9039l1492M4472A30336F1816J08640A6887K67672
12477B84559c11142B1302b54826J22725M4099n513j7836B0616a27224P572k7103
12466a46755C0956J2181a74959q4217A40088a77545b0241k44808I3527A731b76732
$$ plain form
12454 -179775 -291770 -24102 241783 107533 -34578 -101487 44272 -134968 -169993 -165151 259345
12442 -196389 -223668 134229 -59066 -318324 -78689 234484 127745 -23328 -293727 -40904
12431 -167736 -233057 11561 -181113 57224 -91269 509099 -101033 52767 251512 291586 -72719
12419 -56767 -276126 -58439 22393 320831 -302246 226132 221373 65597 -84664 41885 -22626
12407 -212262 129839 15724 -16788 -134495 87364 230700 287564 137760 93513 -135637
12396 -111252 147854 -295211 -84747 238122 -133132 123173 -156686 239875 -1508 192034
12385 -50982 -407073 -53714 136497 155171 -212656 11063 -27838 -66915 -240140 14804 170845
12374 170845 -6186 71269 -172589 396649 212191 15382 43740 -3026 -31985 53126 113690
$$ packed form
12454a79775j11995b4102B41783A07533c4578o6909D4272a34968l5025M842B59345
12442a96389k7279A34229e9066k59258g8689B34484j06739b3328k70399d0904
12431a67736o5321A1561a81113E7224i1269E09099a01033E2767J98745M0074g2719
12419e6767k19359e8439B2393K98438c02246B26132m759F5597h4664D1885b2626
12407b12262A29839A5724a6788j17707H7364J43336N6864A37760m4247a35637
12396a11252A47854b95211h4747B38122a33132A23173a56686B39875a508A92034
12385e0982l56091e3714A36497J8674b12656A1063b7838l9077j73225A4804J56041
12374A70845f186G1269a72589C96649j84458A5382K8358c026k8959E3126O0564
$$ plain form
12363 113690 393997 -70921 -26842 237884 -225635 39493 -28308 -174866 -129034 -43464 -79953
12352 -79953 22298 -122039 297677 -88107 145678 290137 178585 -291567 -7474 50977 429653
12341 429653 194555 -109875 147636 -131994 270472 -41952 41424 137595 25784 -131195
12330 283372 -260012 104115 382109 -39773 -57779 18416 -2492 571539 -49583 -138647 -196887
12319 -196887 174904 64821 52144 9234 127624 -89869 112871 55532 126616 -54341 -7983
12307 277335 329519 -227991 116999 146941 -9896 44483 -229670 321166 -127870 251607
12296 107065 14166 29319 221401 132563 92122 191046 -403465 189675 199978 -170559 297629
12284 -260057 -254248 381511 133768 60539 190435 117049 -245999 165254 185377 4230 270511
$$ packed form
12363A13690K80307g0921b6842B37884b25635C9493b8308j46558M5832d3464l6489
12352g9953B2298a22039B97677h8107A45678J44459j11552b91567g474E0977L78676
12341D29653A94555a09875A47636a31994B70472d1952D1424R6171B5784a31195
12330B83372b60012A04115K77994c9773j8006A8416b492E71539d9583q9064n8240
12319a96887A74904F4821j2677I234J18390h9869A12871E5532P1084e4341g983
12307B77335N2184b27991A16999K9942i896D4483b29670C21166a27870B51607
12296A07065A4166J5153J92082q8838m0441R8924d03465A89675J0303a70559B97629
12284b60057N809C81511A33768F0539J29896p3386b45999A65254K0123D230K66281
$$ plain form
12273 270511 122196 223091 -13989 -153319 79067 78875 -36948 -31019 -161817 -291201 -89697
12261 400706 -116758 139485 457402 136442 153232 -24481 -251578 167223 -39809 288881
12250 -41999 197964 -127375 400198 19493 178915 272262 -73045 120068 -323993 -220851
12240 -220851 169943 38092 52184 -115617 99164 318677 -34938 -19353 129768 226237 23587
12228 119327 261143 193402 281478 51564 221868 168090 460411 544176 285134 -51532 608982
12216 134815 106921 -108783 249510 180385 -41831 228792 333308 -53497 1266 419590 7014
12204 316233 490938 148547 277819 -98727 177519 89763 128073 66233 290311 85825
12193 8984 58956 25162 154363 2215 265459 308560 50065 321616 224880 66814 106865
$$ packed form
12273B70511A22196J00895a3989j39330G9067j92c6948N929j30798j29384h9697
12261D00706a16758A39485L17917A36442J6790b4481k27097A67223c9809B88881
12250d1999A97964a27375D00198A9493J59422R3347g3045A20068c23993J03142
12240b20851A69943C8092J4092a15617I9164K19513c4938J5585A29768R6469B3587
12228A19327J41816o7741Q8076E1564J70304n3778K92321Q3765k59042e1532F08982
12216A34815k7894a08783B49510o9125d1831B28792J04516e3497A266M18324G014
12204C16233J74705A48547J29272i8727A77519q7756L8310o1840K24078H5825
12193H984M9972B5162J29201B215K63244M3101E0065K71551r6736F6814M0051
$$ plain form
12182 106865 -248342 -119484 -36043 172276 411521 159357 143808 73975 47364 194765
12172 194765 79087 207784 -27447 27364 115155 240289 222085 442540 27640 187201 93342
12160 -79931 343643 60713 -278776 -84861 -221318 -88205 -64389 328650 253458 274645 73771
12148 279727 152103 269391 -90362 64450 15807 4513 -61782 -277437 -62883 -378303 15329
12136 37311 -113625 271354 26710 -36267 -217038 79651 126060 -48671 -233168 14869 347619
12125 347619 179176 91967 -89844 -141234 93300 -61835 210737 -174339 127718 -92135 -156230
12114 -156230 78821 -72161 -29811 171106 -245056 -123058 29807 52600 -23961 41783 -66239
12102 -244107 83595 150275 109685 -137742 52051 267311 -61035 -189020 -103627 -79953 187236
$$ packed form
12182A06865b48342a19484c6043A72276K39245A59357j5549o9833k6611J47401
12172A94765G9087J28697b7447B7364Q7791J25134j8204K20455B7640J59561I3342
12160g9931C43643F0713b78776h4861j36457h8205K3816C28650p5192K1187G3771
12148B79727j27624J17288i0362F4450A5807D513f1782k15655f2883l15420A5329
12136C7311a13625B71354B6710c6267j80771G9651M6409d8671j84497A4869L32750
12125C47619j68443q7209h9844n1390I3300f1835B10737a74339A27718i2135o4095
12114a56230G8821g2161b9811A71106b45056J21998B9807K2793b3961D1783f6239
12102b44107H3595O6680m0590a37742E2051K15260f1035j27985Q5393K3674A87236
$$ plain form
12090 -208629 -138911 -380123 -28059 -81958 -271240 -245066 -85295 -37800 -344802 -30528 533549
12078 -170727 195984 -60630 -109757 -111918 228840 285171 245958 1044237 1455309 599606 -33683
12066 -118053 199073 -106116 -12093 117027 -33553 -30754 27239 -98386 -129116 -293957 200427
12054 -175275 -125009 134039 3903 -38124 139886 138770 169351 -36305 -162413 15071 37718
12043 37718 65457 281030 174327 -85904 21164 -135627 -181788 -74123 26685 1463 143049
12032 143049 104126 -89151 85755 -234966 -23670 212848 229293 282054 204078 -321 193359
12020 -371122 212097 15987 -17613 -111185 105415 -44631 -155464 49728 -381555 -14675 -103438
12009 -103438 -139744 -296537 -187478 67995 107684 -96589 -410056 25236 201134 59656 63609
$$ packed form
12090b08629O9718k41212b8059n3899j89282K6174h5295c7800l07002c0528E33549
12078a70727A95984f0630m9127k161B28840N6331l9213P98279M11072E99606c3683
12066a18053A99073a06116a2093A17027c3553K799B7239i8386l0730j64841B00427
12054a75275N0266A34039C903c8124A39886j116L0581c6305j26108A5071K2647
12043C7718K7739K15573j06703h5904B1164a35627m6161g4123B6685A463J41586
12032A43049l8923h9151H5755b34966b3670B12848J6445N2761p7976c21A93359
12020c71122B12097A5987a7613r3572A05415d4631j10833D9728c81555a4675q8763
12009a03438l6306j56793J09059F7995L9689i6589l13467B5236J75898E9656L953
$$ plain form
11998 63609 92227 22828 -243661 -103798 -182671 203921 -97634 38549 180279 51947 -63555
11986 -244021 183022 142866 18090 -55971 22804 240753 -20824 -81561 -237252 85764 4373
11974 -158446 95791 -109250 -17237 -72075 155945 -41291 131603 82985 -5418 -154914 -53651
11962 -230523 -347607 -193619 -143152 98086 3420 492248 -127618 9066 -24650 181588 -329526
11950 -108507 59685 -109637 -40566 -190045 477319 73552 357 18831 336832 -71871 167834
11938 -45381 -133805 -155647 181447 44490 -262478 -56077 -489703 435425 59712 -732 -57787
11927 -57787 143194 -40056 169605 245170 7535 -86613 199917 -419633 22047 281218 -175328
11915 -410838 -129331 59292 994 240623 -346930 380077 13095 307893 -111433 -303935
$$ packed form
11998F3609K8618B2828b43661a03798p8873B03921i7634C8549J41730E1947f3555
11986b44021A83022m0156A8090e5971B2804K17949b0824o0737j55691H5764D373
11974a58446I5791a09250a7237n4838A55945d1291A31603m8618e418j49496e3651
11962b30523j17084J53988N0467I8086C420M88828a27618I066b4650A81588c29526
11950a08507E9685a09637d0566j49479D77319G3552C57J8474L18001g1871A67834
11938d5381q8424k1842A81447D4490b62478e6077m33626D35425E9712g32n7055
11927e7787A43194d0056A69605P5565G535h6613A99917d19633B2047K59171a75328
11915d10838a29331E9292I94K39629c46930C80077A3095K94798a11433j92502
$$ plain form
11905 -303935 120723 -6140 119133 156770 88685 147334 -157890 -114504 -497693 158226 183310
11894 183310 -162996 147405 -612192 -224011 -223952 141150 -5916 41425 -19648 -370306 394395
11882 37627 29210 39664 97640 -237665 298295 11191 39496 -36027 88869 95760 -117239
11870 -141273 -211314 -190852 -271908 8793 -131659 -249404 -293687 363589 -68816 317066 -240168
11858 -95699 -141069 40658 197128 150960 -510142 -124615 -39825 81702 47877 -139809 -100473
11847 -100473 -18443 -306529 -112259 -28373 -109651 -64493 -50787 -474193 -31184 -192926 144675
11835 8950 -132607 -86454 48958 -216243 -76160 22370 -171182 30936 -116863 273522 -247833
11823 -188703 43547 -75602 -641122 -257796 32454 74636 -281185 185213 43680 210420
$$ packed form
11905c03935A20723f140A19133L7637o8085N8649a57890M3386l83189A58226K5084
11894A83310a62996A47405f12192b24011N9A41150e916D1425a9648l50658C94395
11882C7627q417J0454N7976b37665B98295A1191K8305c6027H8869O891a17239
11870a41273p0041K0462q1056H793a31659j17745m4283C63589f8816C17066b40168
11858i5699m5370D0658J56470m6168e10142a24615c9825H1702l3825a39809L9336
11847a00473a8443k88086a12259b8373q1278M5158J3706m23406c1184j61742A44675
11835H950a32607M6153D8958b16243g6160B2370a71182C0936a16863B73522b47833
11823a88703D3547g5602n65520b57796C2454M2182b81185A85213D3680J66740
$$ plain form
11813 210420 -582 -110823 -172426 -219820 -179799 144541 -540417 -149862 154970 -86890 173
11801 -146297 -299959 -65982 73537 190326 33672 -75407 -79380 300081 -31281 -82369 -20160
11789 -253043 9932 -41070 -153623 26377 188088 -105647 -79050 64477 -73438 -68525 139354
11777 -310157 -216484 -114129 149408 49166 -29316 -245268 31006 279608 -73612 53734 -107558
11765 -258331 -102031 -193327 -308683 163892 310928 -276109 9208 -176615 104048 -295562
11754 228323 42374 -25124 51877 -126171 -61376 -51029 -29066 402332 44907 -122497 183667
11742 164451 126317 76899 -21568 76269 -272281 161012 304573 189730 115758 43592 -77091
11730 -2585 -17258 -16100 192643 -250461 -104302 -99798 64969 -57404 -176617 223585 -176155
$$ packed form
11813B10420e82j10241o1603m7394M0021A44541e40417a49862A54970h6890A73
11801a46297j53662f5982G3537J16789C3672g5407l973C00081c1281n1088b0160
11789b53043I932d1070j12553B6377J61711a05647K6597F4477g3438M913A39354
11777c10157R3673J02355A49408D9166b9316k15952C1006K48602g3612E3734a07558
11765b58331a02031r1296j15356A63892J47036b76109I208a76615A04048b95562
11754B28323D2374b5124E1877a26171f1376J0347K1963D02332D4907a22497A83667
11742A64451l8134m9418b1568G6269b72281A61012J43561j14843p3972D3592g7091
11730b585j4673J158A92643b50461a04302M504F4969e7404j19213B23585a76155
$$ plain form
11718 -21691 -25756 178965 -63232 114350 152958 133285 282494 264307 130968 -123752 167589
11706 69717 144676 -132857 -93086 -25634 -27147 -8418 -115629 228288 160051 4730 -111293
11694 174031 185787 -11017 -180394 235231 -17190 85512 23721 9273 31784 -56121 -153823
11683 -153823 5682 242291 112982 19369 74037 695534 -176099 259777 -297707 137938
11672 83974 184651 33650 -151739 238134 211639 101176 77161 89834 292693 -206298
11661 24256 -41047 53464 128111 435605 100686 149090 3620 156371 -206806 -14266 -38775
11650 -38775 229938 477574 42280 89542 -38124 95199 24303 -45182 85083 -54301 -233986
11639 -233986 -458658 -5208 303583 15185 -169100 145891 -396018 -354643 -111402 -22475
$$ packed form
11718b1691m065A78965f3232A14350L8608j9673J49209j8187A30968a23752A67589
11706F9717P4959a32857L9771b5634j513h418j07211B28288o8237D730a11293
11694A74031J1756a1017j69377B35231a7190H5512B3721I273K2511e6121r7702
11683a53823E682K36609A12982A9369N4668O21497a76099B59777b97707A37938
11672H3974J00677C3650a51739B38134k6495A01176k4015J2673K02859b06298
11661B4256d1047E3464P4647L07494A00686M8404C620J52751b06806a4266k4509
11650c8775B29938K47636D2280M7262c8124I5199B4303d5182H5083e4301j79685
11639b33986k24672e208C03583A5185a69100A45891c96018M1375a11402b2475
$$ plain form
11628 -184630 64721 -87207 278439 -129668 -18855 -204316 -475272 63494 -35524 185851
11617 -26996 139918 -57902 -13379 114178 161274 -41255 -242839 291783 -86473 -147712 157805
11605 145906 -124633 -210980 -65561 29228 -200619 -27859 -177082 88295 -155191 -35755 118047
11593 292403 19485 -40083 -337031 280530 -301724 24400 174487 176585 280243 82594 -28854
11581 296864 -552935 -18957 -149662 -89102 107096 372454 339150 -118382 107850 -4966
11570 25631 62184 160417 269347 250225 -179374 36274 -42522 23533 28880 -233570 -18479
11558 -15787 -61614 -46274 252653 83072 -173126 402671 -191973 269236 -205495 -111297
11548 -111297 385348 101378 -365057 127803 60282 -24010 -90448 552217 -210666 381240
$$ packed form
11628a84630F4721h7207B78439a29668a8855j85461k70956F3494c5524A85851
11617b6996A39918e7902a3379A14178M7096d1255k01584B91783h6473o1239A57805
11605A45906a24633q6347f5561B9228b00619b7859j49223H8295a55191c5755A18047
11593B92403A9485d0083k96948B80530c01724B4400J50087K098J03658H2594b8854
11581B96864e52935a8957j30705O0560A07096K65358l3304a18382A07850d966
11570B5631L6553R8233J08930j9122a79374C6274d2522B3533N347b33570a8479
11558a5787m5827J5340B52653H3072a73126D02671a91973B69236b05495R4198
11548a11297C85348A01378c65057A27803F0282b4010o6438E52217b10666C81240
$$ plain form
11537 -38540 31211 -5311 286790 211112 -92741 71262 -256738 -51504 93661 -52356 247087
11525 82957 137569 349043 -179417 217185 206749 214917 226237 320857 191043 15256 27661
11514 27661 190028 -48736 172481 191861 -137988 215395 -29378 196105 92086 -180961
11503 -142627 281432 117311 -6167 -85690 226829 -227623 375528 232731 190495 81188
11492 197955 217862 209099 113336 248461 -11018 89668 194851 -33273 63375 51712 -197928
11480 78978 165193 -39880 176763 -14101 114311 178561 303667 -75532 -83820 -78207 247936
11468 8172 108894 186971 16117 268297 -30937 76900 282365 -93117 8224 46182 -125799
11456 -2678 298694 -106995 -115039 -189727 235468 497489 88263 272547 73943 -121266 282357
$$ packed form
11537c8540C1211e311B86790p5678i2741G1262b56738e1504I3661e2356B47087
11525H2957N4612K11474a79417B17185j0436Q168J1320R4620j29814A5256J2405
11514B7661J62367d8736A72481J9380a37988B15395b9378A96105I2086a80961
11503a42627B81432A17311f167p9523B26829b27623C75528j42797m2236H1188
11492A97955J9907q763r5763J35125a1018H9668J05183c3273F3375j1663a97928
11480G8978Q6215c9880A76763a4101A14311O4250J25106g5532q288N613B47936
11468H172J00722P8077A6117K52180c0937G6900K05465i3117H224L7958a25799
11456b678B98694a06995q044p4688B35468K62021H8263J84284G3943a21266B82357
$$ plain form
11444 -329066 171652 204883 -46692 7342 86281 98710 297636 76016 -84715 115840 69449
11433 69449 -28364 112063 -45300 -28257 -132119 -121131 -106547 127619 239960 114741 -254017
11421 -97287 -14884 102244 208107 213611 191444 42760 257744 -127612 31979 -163113 141315
11409 27239 -149245 -199919 -120600 163951 126193 274164 -64385 -164159 -72994 81268 79916
11398 79916 -16967 8777 -36902 -10890 -50551 131760 137341 135838 -47626 -186896 256532 32223
11385 136201 77582 -177005 -44728 253245 -172970 -93290 -168553 174342 244893 93617 -246089
11373 179209 -120916 -264667 20478 231023 -184342 -145197 329040 -106639 -150557 -18253
11362 153787 -26514 -393276 89271 -60329 69439 290499 414470 15612 -117145 -81962 119924
$$ packed form
11444c29066A71652L3231d6692G342P8939J2429J98926G6016h4715A15840m6391
11433F9449b8364A12063d5300J7043j03862J0988J4584A27619J12341A14741b54017
11421i7287a4884A02244J05863N504k2167D2760K14984a27612C1979a63113A41315
11409B7239a49245n0674P9319A63951l7758J47971f4385r9774g2994H1268j352
11398G9916a6967H777c6902a0890l9661A31760N581j503d7626j39270B56532C2223
11385A36201n8619a77005d4728B53245a72970P9680p5263A74342P0551I3617b46089
11373A79209a20916j43751B0478K10545a84342L9145C29040a06639m3918a8253
11362A53787b6514l66762H9271f0329F9439K21060J23971A5612a17145L5183A19924
$$ plain form
11350 35583 -229431 162227 -58792 28605 156431 213181 149869 101490 88770 -30642 11135
11338 150051 196897 71161 22818 36354 -252362 19262 -86277 147091 316908 107673 379234
11327 379234 13872 -37206 -73141 48237 132213 -1992 66585 -41618 -8979 -241059 55968 -275992
11314 145748 -39471 178753 -29223 -121414 -270795 -58692 -247982 163540 -53637 60804 -358943
11302 207106 -222328 -127174 -83251 -89613 173940 14131 -267323 -193762 -195843 -178059 -42686
11290 -74765 -373804 -172463 145798 350492 -72638 -58322 -12423 -127009 -36296 -87503 -68660
11279 -68660 -19713 -405101 -22032 -268713 -178255 166196 -157194 -227710 -179324 272986 -90884
11267 320965 -79343 191345 -183157 44193 167972 -404051 -157081 -188866 159093 -37675
$$ packed form
11350C5583b29431A62227e8792B8605J27826N6750o3312m8379j2720c0642A1135
11338A50051M6846G1161B2818J3536b52362A9262h6277A47091J69817A07673K71561
11327C79234A3872c7206l5935D8237Q3976a992F6585d1618h979k32080E5968b75992
11314A45748c9471A78753b9223r2191j49381e8692j89290A63540e3637F0804c58943
11302B07106b22328R5154M3923o362A73940A4131b67323P3561k081J7784d2686
11290g4765k99039a72463A45798K04694g2638J4316a2423j14586c6296n1207J8843
11279f8660a9713l85388b2032k46681R0458A66196a57194p0516M8386B72986i0884
11267C20965g9343A91345a83157D4193J23779d04051a57081l1785A59093c7675
$$ plain form
11256 -275562 160892 153032 -247482 208724 -191393 184968 -28699 -20869 134105 30707 -248507
11244 -88 -35360 3121 -67942 -130061 -79864 -117921 171047 104260 47376 -22714 -241883 124268
11231 -25455 24681 155029 -47996 -114765 11875 -214479 31548 -47993 -211959 -229189 -109114
11219 246886 143890 -77169 -4222 -119309 -208391 19959 -64424 -30620 -429232 105997 -20647
11207 44907 -124251 -189527 100923 -332016 -211629 -462515 -162244 -244820 -112182 425886
11196 -99036 -413183 -116314 -29506 214821 202525 -141047 -73650 -83355 -299187 -8925 77628
11184 -5167 162564 -178902 36017 142509 -100377 270803 -1707 -474742 -437024 730 -284265
11172 -109836 -110236 -56201 -130452 -293405 -7779 112371 75579 -191134 -149527 232434 -42749
$$ packed form
11256b75562A60892p860b47482B08724a91393A84968b8699P830A34105C0707b48507
11244h8l5272C121f7942o2119N0197l8057A71047o6787D7376b2714k19169A24268
11231b5455B4681J30348d7996o6769A1875b14479C1548d7993j63966j7230a09114
11219B46886j02996g7169d222j15087q9082A9959f4424c0620l98612A05997b0647
11207D4907a24251o5276A00923c32016J20387k50886a62244q2576a12182D25886
11196i9036l14147a16314b9506B14821j2296a41047O7397r705k15832h925G7628
11184e167A62564a78902C6017J06492a00377B70803a707m73035L7718G30b84265
11172a09836m00N4035p4251j62953g779A12371l6792a91134M1607B32434d2749
$$ plain form
11160 -23017 106599 151095 -114340 -357488 14685 -23211 -251213 456183 -48241 -88174 -225553
11149 -225553 184784 -62727 -161617 -197000 299048 127068 62925 -69043 177812 -164228
11138 -39279 210094 248823 202157 17185 168354 -26035 24909 375827 -405174 108102 320804
11127 320804 -188189 -138172 3555 -85256 180059 182666 39962 -52995 143952 145126 137999 525825
11115 525825 -54147 200154 336877 -206233 -107893 188335 -381792 -58502 -54730 -6087 239106
11103 -8494 58534 82759 371533 187125 133682 13029 64632 148836 19140 249751 588179
11092 588179 374661 -88442 248893 79483 283547 249869 285066 198053 62485 311356 205159
11081 205159 588547 22018 302718 217955 322141 370734 497632 417541 84819 98219 -18660
$$ packed form
11160b3017A06599M4496a14340k43148A4685b3211k28002D56183d8241l9933j37379
11149b25553A84784f2727r8890l5383B99048A27068F2925f9043A77812a64228
11138c9279B10094L8729m6666A7185J51169b6035B4909L50918d05174A08102K12702
11127C20804a88189N0017C555h5256A80059K607C9962e2995A43952J174p127L87826
11115E25825e4147B00154J36723b06233R8340A88335c81792e8502L772f087B39106
11103h494E8534K4225K88774j84408n3443A3029N1603Q4204A9140K30611L38428
11092E88179k13518h8442B48893G9483K04064l3678L5197q7013F2485K48871j06197
11081B05159L83388B2018K80700q4763J04186M8593J26898q0091H4819J3400a8660
$$ plain form
11069 519102 564718 270602 224346 22532 280775 85967 470366 380766 460324 225818 327475
11058 327475 667912 618591 600498 485566 527006 647556 744418 593970 610957 375178
11048 375178 467965 718180 742978 669711 727457 624602 769199 654612 747571 683116 1075434
11037 1075434 826716 773759 624131 263623 695485 738438 369160 662784 612117 534466
11027 534466 539659 395405 773187 835866 384671 509297 459045 964808 436375 376540
11017 376540 500829 1001979 382340 923502 402224 702886 560814 655923 467624 225369
11006 671172 819231 628344 658728 488886 487322 535536 492990 796546 856382 570892 716369
10995 716369 512914 516355 784716 612255 687178 247850 945256 815031 654871 602169
$$ packed form
11069E19102M5616B70602m6256B2532K58243H5967L84399q9600P9558B25818J01657
11058C27475L40437m9321j8093j14932M1440J20550R6862j50448J6987k35779
11048C75178R2787K50215K4798p3267N7746j02855J44597j14587R2959o4455L92318
11037A075434k48718n2957j49628B63623M31862M2953C69160K93624n0667p7651
11027E34466N193j44254L77782O2679C84671J24626n0252N05763D36375n9835
11017C76540J24289N01150C82340N41162D02224L00662j42072R5109j88299B25369
11006F71172J48059j90887L0384j69842j564M8214m2546L03556N9836k85490J45477
10995G16369k03455L441K68361j72461P4923B47850O97406j30225j60160n2702
$$ plain form
10985 602169 567660 864535 991196 894854 776964 1302049 840871 1214652 1456365 1578209
10975 1578209 2023607 1925652 2126851 2209176 2819781 2497108 2511171 2478521 2334599 2009399
10965 2009399 1755450 1732744 1439975 1354241 1551837 1266894 1664479 1580679 1724683 1761357
10955 1761357 1323745 1414500 1161596 1070407 1013013 697938 759049 416428 232106 131332
10945 131332 331519 553003 148896 174900 257422 209970 -96459 33710 140474 -81917 -95575
10934 -95575 44610 285022 -181975 -8692 -45933 -23010 44457 -60291 -22770 -229229 -306706
10923 -306706 3213 63692 120623 191582 242125 106529 248621 -89623 115271 159436 -64985
10911 -85268 145817 -82053 145766 -92820 -58561 37748 -246965 -57352 -64557 74265 107093
$$ packed form
10985F02169l4509K96875J26661r6342j17890N25085m61178L73781K41713J21844
10975A578209M45398r7955K01199Q2325O10605l22673J4063l2650j43922l25200
10965B009399k53949k2706k92769q5734J97596k84943L97585q3800J44004L6674
10955A761357m37612R0755k52904r1189n7394l15075O1111l42621j84322j00774
10945A31332K00187K21484A48896K6004Q2522m7452i6459C3710J06764h1917j3658
10934i5575D4610K40412a81975h692l7241K2923D4457f0291b2770k06459p7477
10923c06706C213O0479N6931P0959N0543A06529J42092h9623A15271M4165f4985
10911h5268A45817h2053A45766i2820L4259C7748b46965e7352p205G4265L2828
$$ plain form
10900 107093 214624 -245272 -106891 -74549 -216582 430336 72755 -39180 -79898 -120954
10890 -120954 -136470 -275116 230121 -5253 29062 -82872 16368 44273 -14967 236478 -51529
10878 -15424 -150064 -90579 -249966 -78019 -136053 14798 -156512 249936 -181423 -253685 -174942
10867 -174942 -248899 -74153 -221442 -79357 12278 441735 -67774 -226921 32524 -50447 -254272
10856 -254272 27784 -31274 213234 51858 -30310 112284 60005 -56617 141579 31409 -143292
10844 74208 95496 -42480 191120 -189892 34287 -32062 -133557 -169577 12122 -18980 155165
10832 154735 -166023 72022 125699 31694 110957 -39869 14617 188261 -214467 -179059 -45723
10820 -166188 57842 89054 86584 66812 82205 114452 146289 -39269 37805 -53177 140630
$$ packed form
10900A07093J07531b45272a06891L2342j42033D30336G2755c9180m0718m1056
10890a20954j5516j38646B30121e253B9062h2872A6368K7905a4967B36478e1529
10878a5424j34640N9485j59387g8019n8034A4798a56512B49936a81423p2262P8743
10867a74942p3957g4153j47289g9357A2278M29457f7774j59147C2524e0447k03825
10856b54272B7784c1274B13234E1858c0310A12284n2279e6617A41579C1409a43292
10844G4208K1288d2480A91120a89892C4287c2062j01495l6020A2122a8980A55165
10832A54735a66023G2022N3677C1694P9263c9869A4617J73644b14467L5408d5723
10820a66188E7842L1212k470j9772J5393L2247L1837c9269C7805e3177A40630
$$ plain form
10808 -301045 -10859 98367 92638 81996 -233981 -93886 207259 -109457 96465 -180261 -11456
10796 -53257 40447 232602 -138749 -26475 -252942 -34765 205771 -117850 9683 62719 165277
10785 165277 -348199 519425 -9289 -42498 -291737 265304 234078 -61578 -91516 57912 341778
10774 341778 -185725 -68760 -372279 -465555 278319 -176428 -262452 -21033 -99679 -127913 -77035
10763 -77035 -82918 504462 262821 297044 -426909 22259 85717 -224218 294923 -134271 -51692
10751 -87024 -8478 -161340 -239384 -48249 -126587 117453 54843 124025 -257112 -103571 -453195
10740 -453195 143621 49262 -122095 -419526 -114680 83885 -47803 -332453 -365741 -22805
10729 26185 207583 -259246 258237 52880 216504 -262650 -189842 -113767 148348 51367
$$ packed form
10808c01045a0859I8367n729j0642b33981i3886B07259a09457I6465a80261a1456
10796e3257D0447J92155a38749b6475k26467c4765B05771a17850I683N3036J02558
10785A65277c48199E19425i289l3209k49239B65304l1226f1578k9938E7912K83866
10774C41778a85725f8760l03519r3276B78319a76428q6024b1033p8646k8234N0878
10763g7035n883E04462k41641L4223d26909B2259O3458b24218B94923a34271e1692
10751h7024h478j52862p8044d8249p8338A17453E4843O9182b57112a03571l49624
10740d53195A43621D9262a22095k97431a14680H3885d7803k84650l3288b2805
10729B6185J81398b59246B58237E2880J63624b62650P2808P6075A48348E1367
$$ plain form
10718 -18746 -98686 -58290 69802 157341 -159531 171096 96236 -46528 136174 -402220 -246007
10707 -246007 -133810 -90145 -85342 105066 37586 -164486 -68975 -8463 838 -107642 -87661
10696 -87661 55715 -416323 -221402 86309 -135081 1126 185480 85485 -92851 -113121 -82791
10685 -82791 -136735 96527 -140226 106938 234597 44442 -340842 -114114 -296467 83602
10674 80105 -38540 39314 71455 60076 -155696 218911 20388 184459 118030 -205842 -54520
10662 1149 -46185 -204490 -286622 128315 256991 -19176 -83579 159056 -76188 342396 192076
10651 192076 336335 -38609 -222202 -262826 -153260 -62958 -215021 -138524 -22963 -177682
10641 -177682 -189567 59140 -199517 56447 -90370 -147949 -321130 -252341 5978 166886 26259
$$ packed form
10718a8746p9940M0396F9802Q7539a59531A71096p4860d6528A36174d02220J56213
10707b46007J12197M3665M803A05066C7586a64486f8975h463H38a07642J9981
10696h7661E5715d16323J94921H6309a35081A126J84354H5485i2851k0270L0330
10685h2791n3944I6527a40226A06938J27659D4442c40842a14114j82353H3602
10674H0105c8540C9314L2141j1379a55696B18911B0388J64071o6429b05842e4520
10662A149d6185j58305q2132A28315J28676a9176o4403A59056g6188C42396j50320
10651A92076J44259c8609j83593m0624J09566f2958j52063P6497b2963j54719
10641a77682j1885E9140a99517E6447i0370n7579j73181O8789E978J60908B6259
$$ plain form
10629 -136859 128844 -447786 134492 -183744 94870 -140896 25672 -290245 -277706 -169083
10619 -169083 -180368 -123458 -88084 -173933 5929 -387551 89643 -293281 -110480 -283739 -165433
10608 -165433 100974 127684 -228865 25108 4664 -91463 -6470 327217 -139908 -30035 -17088
10597 -17088 171268 -81267 349388 -17040 -41758 -385169 197821 -18101 115252 50031 -477658
10585 33044 -62377 -192599 -41316 -39363 115919 -180701 248113 -2197 -377096 -138516 -272640
10574 -272640 -222701 25046 12784 -259026 -129363 -29902 86170 -350186 63029 -981 -20007
10563 -20007 -244223 123746 -124091 -101182 87800 283704 -95530 31628 243007 251360 -287857
10551 93346 136894 -64121 184168 43121 196040 41590 49857 -241701 -157547 -70479 -235039
$$ packed form
10629a36859A28844d47786A34492a83744I4870a40896B5672b90245J2539J08623
10619a69083j1285N6910L5374q5849E929c87551H9643b93281a10480j73259J18306
10608a65433A00974K6710b28865B5108D664i1463f470C27217a39908c0035J2947
10597a7088A71268h1267C49388a7040k4718l43411A97821a8101A15252E0031d77658
10585C3044f2377j30222d1316J953A15919a80701B48113b197l74899a38516j34124
10574b72640M9939B5046j2262b59026a29363b9902H6170c50186F3029i81j9026
10563b0007k24216A23746a24091K2909H7800J95904i5530C1628K11379Q353b87857
10551I3346M3548f4121A84168D3121J52919D1590Q267b41701Q4154g0479j64560
$$ plain form
10540 -235039 212402 151872 -614801 -290902 -184206 -61897 -76574 -59733 35641 -264606
10529 -187243 -63426 -158522 -37903 -50930 287436 24582 57476 32536 38421 -243746 -268824
10518 -268824 -140585 -49080 -55374 -329439 310809 -265561 -293483 -39870 -231446 66056 104059
10507 104059 60535 105904 -89105 -134501 16661 -234831 220520 -14202 -105164 4640 70903
10496 70903 242491 297118 320554 175002 -60886 8659 -16763 -260558 -343165 -188854 -171889
10485 -171889 68871 193896 227272 203781 438268 281074 151616 25693 121718 11520 -16615
10473 68516 109505 131225 239003 39676 84533 -141259 266290 32958 272683 1397 -119902
10461 -173976 87116 -175373 65859 -218775 75431 -68434 290663 132992 -81878 59259 -259105
$$ packed form
10540b35039B12402o0530f14801b90902J06696f1897j4677J6841C5641b64606
10529a87243f3426r5096c7903j3027B87436B4582L2894k4940N885b43746k5078
10518b68824J28239d9080o294k74065C10809b65561k7922c9870j91576F6056L8003
10507A04059m3524M5369h9105m5396A6661b34831B20520a4202r0962D640O6263
10496G0903J71588N4627K3436j45552f0886H659a6763k43795q2607J54311J6965
10485a71889F8871J25025L3376k3491K34487j57194j29458B5693R6025A1520a6615
10473F8516M0989K1720J07778C9676M4857a41259B66290C2958K39725A397a19902
10461a73976H7116a75373F5859b18775G5431f8434B90663A32992h1878E9259b59105
$$ plain form
10449 -266736 14862 -131306 -285775 72983 -243853 -235087 233041 12915 176400 1826 -71707
10437 200002 79614 -137299 51319 -177632 -435531 -143456 267417 106701 -21232 75262
10426 277049 90150 -96629 100256 79080 3098 31397 -173846 -130029 -135994 51744 229463
10415 229463 -379255 309704 -54151 -56238 179375 -53055 70368 -158757 75881 -10318 -182666
10404 -182666 93400 -150720 84208 -160129 -91073 -183560 197979 177736 -285322 144895
10393 -162514 -1707 321012 -113699 27546 223920 -139102 323866 237243 42446 -245400
10382 288199 124341 181941 328385 279713 317660 114529 63232 133471 166807 294198 -35425
10370 294022 300745 232634 264874 396675 465691 804540 182021 367537 150058 100756 34230
$$ packed form
10449b66736A4862a31306j54469G2983b43853Q766B33041A2915J63485A826g1707
10437B00002G9614a37299E1319a77632k57899a43456B67417A06701b1232G5262
10426B77049I0150i6629A00256k1176C098K8299a73846M3817n965E1744J77719
10415B29463c79255C09704e4151k087A79375e3055G0368a58757G5881a0318j72348
10404a82666I3400a50720H4208a60129O9056r2487A97979k0243b85322A44895
10393a62514a707C21012a13699B7546J96374a39102C23866q6623D2446b45400
10382B88199A24341N7600J46444m8672L7947A14529n1297P0239L3336J27391c5425
10370B94022O723o8111L2240J31801O9016L38849A82021J85516A50058m9302C4230
$$ plain form
10358 86161 9298 -211129 256814 277757 273817 -112498 300340 335646 567107 382662 254320
10347 254320 155644 83216 372264 417693 345502 299158 -165345 -78790 158759 201795 109027
10336 109027 180414 238503 188019 91381 111598 -120306 182939 -22190 242240 -120830 -163073
10325 -163073 -23220 -209688 120068 346759 196410 197241 111026 179871 230122 188143 307846
10314 307846 92637 489815 -29122 118278 75494 524291 172086 -103582 22479 -325487
10303 107563 -36376 -179318 87948 112515 -348519 -296585 74065 119799 -109080 -327890 -170806
10292 -170806 -150164 -7134 -119893 146242 -121868 -71476 104736 -333272 405136 -55953
10281 364683 -374303 -144643 -83945 173650 32281 117082 226606 -180233 435525 -31020
$$ packed form
10358H6161I298b11129B56814K0943l940a12498C00340L5306K31461j84445j28342
10347B54320r8676p2428K89048M5429p2191m6344a65345g8790A58759M3036r2768
10336A09027P1387N8089n0484I1381K0217a20306A82939b2190B42240a20830m2243
10325a63073b3220j86468A20068K26691j50349Q31q6215O8845N0251m1979J19703
10314C07846I2637L97178b9122A18278m2784M48797A72086a03582B2479c25487
10303A07563c6376j42942H7948K4567c48519N1934G4065M5734a09080k18810J57084
10292a70806K0642g134j12759A46242a21868N0392A04736c33272D05136e5953
10281C64683c74303a44643O0698A73650C2281Q4801J09524a80233D35525c1020
$$ plain form
10270 54043 -344684 165554 -171626 -41391 -207 -72131 95264 67333 85132 145377 471933
10259 471933 1443 103786 533339 330851 121556 -387706 123951 149233 64518 144293
10249 144293 -228682 -152646 -1823 -131519 190481 59336 -156764 -174846 201164 -52840 178464
10237 -158178 7368 -406096 -251516 -298465 -332704 -232263 -235651 -64483 34668 -82517 -163163
10226 -163163 83826 103524 -12509 -4330 -149886 131357 -335699 -1796 -1552 73866 -207714
10214 -186180 -329684 -5572 205327 -176880 48707 -71339 -165374 -129919 -135933 243372 -198357
10202 71983 389682 -203618 40257 -373225 -335702 224651 -118832 -81902 -366109 16319
10191 -23148 72887 49843 -112661 -166085 -396645 43670 187902 -11791 336938 -117431 -66445
$$ packed form
10270E4043c44684A65554a71626d1391b07p1924I5264k7931J7799O0245L26556
10259D71933A443J02343M29553k02488A21556c87706A23951K5282F4518P9775
10249A44293b28682P6036a823j29696A90481E9336a56764j8082B01164e2840A78464
10237a58178G368d06096J54580m6949l4239J00441l388f4483C4668h2517q0646
10226a63163H3826J9698a2509d330j45556A31357c35699a796K44G3866b07714
10214a86180j43504e572B05327a76880D8707g1339r4035L5455o014B43372a98357
10202G1983L17699b03618D0257c73225L7523B24651a18832L6930k84207A6319
10191b3148G2887k3044a12661n3424k30560D3670J44232a1791C36938a17431N0986
$$ plain form
10180 -66445 188652 109234 141013 -396252 158989 -462381 -125878 -46186 -189144 42619
10169 -343584 -280481 15546 160308 -423313 -85508 -277545 53319 -460018 -288665 94467
10158 -37256 139210 7810 -99898 -343689 34837 -63978 -116074 -317383 43047 -159363 41359
10146 102482 59354 84435 -212243 -18283 130744 -210703 -94517 -21386 -80584 -273019 -145487
10135 -145487 107243 -115889 -89092 -288461 -142545 89775 456195 -91184 -314483 -79281
10124 -35304 161777 97182 -277100 141049 117727 -147596 -232723 -35460 -93971 -81805 17293
10112 -113507 96303 37357 168347 -207360 62225 -36579 275247 29870 -187276 -350534
10102 -350534 -162670 91766 32272 1375 222017 143019 -304112 -101848 31094 -114089 211105
$$ packed form
10180f6445A88652p9418L1779c96252A58989d62381a25878d6186j42958D2619
10169c43584O3103A5546J44762d23313h5508j92037E3319d60018J71353I4467
10158c7256A39210G810i9898k43791C4837f3978n2096k01309D3047a59363D1359
10146A02482m3128K5081b12243a8283A30744b10703i4517b1386n9198j92435J27532
10135a45487A07243a15889K6797j99369a42545H9775L66420i1184k23299g9281
10124c5304A61777o4595b77100A41049k3322a47596q5127c5460n8511J2166A7293
10112a13507I6303C7357J30990b07360F2225c6579B75247B9870a87276j63258
10102c50534a62670I1766C2272A375K20642p8998c04112a01848C1094a14089B11105
$$ plain form
10090 -1272 266643 -70694 -83167 -28806 -89186 18589 -261886 -319976 36020 -109785 -319400
10079 -319400 234236 90554 -178241 -186733 -176854 -89153 282758 212114 -236374 -329681 -141358
10067 256432 -14160 298229 -129138 -79341 295007 -90170 46154 -161799 -34221 -72211 -374392
10056 -374392 223371 -203837 -247461 109372 -168859 -148443 -354109 20153 -180137 -7552
10045 -204012 112450 93316 -35809 -206054 -343242 151603 -90441 -196873 138936 -233999
10034 -385389 12347 117814 21489 2991 -95113 351780 189029 -273705 -382827 -329529 -109973
10022 -82486 139663 -67395 149355 -43809 -314985 162261 -64436 -42179 288014 -18062 -152513
10011 -152513 -223893 121544 -293745 -72370 -140347 -109247 -172844 -189198 -233290 96858 -247829
$$ packed form
10090a272B66643g0694j2473b8806o0380A8589b61886n8090C6020a09785k09615
10079c19400B34236I0554a78241q492R879Q7701B82758p0644b36374r3307a41358
10067B56432a4160B98229a29138M9797B95007i0170D6154a61799c4221l7990l02181
10056c74392B23371b03837m3624A09372a68859K0416k05666B0153a80137g552
10045b04012A12450j9134c5809j70245j37188A51603i0441j06432A38936b33999
10034c85389A2347J05467B1489B991i5113C51780j62751b73705j09122N3298a09973
10022h2486A39663f7395A49355d3809k71176A62261f4436K2257B88014a8062j34451
10011a52513p1380A21544b93745g2370o7977L1100o3597j6354m4092I6858b47829
$$ plain form
9999 -165302 -80829 232610 -177122 89725 42679 -330381 -83642 248760 -65544 56717 -41711
9987 703 71500 4017 -73537 -170790 -199894 -29567 73655 185340 45794 -317133 -45297 125783
9974 -3064 -88327 316522 69939 253887 159589 -124400 563585 -224392 -171808 160534 56048
9962 -377858 45543 -374443 -15688 -228893 -103969 170095 -230908 84693 -140862 -402489
9952 -402489 -91304 -111271 170469 -260377 -47040 -67688 -149840 -138019 117044 -23885 -83976
9941 -83976 396734 69220 -166640 82234 -220066 -82745 2648 -48896 -16749 -67373 -409514
9930 -409514 -375064 63052 -252417 -10194 78116 -209228 -134071 -62307 -7084 -53489 -166018
9919 -166018 -184335 133039 265221 -501824 -279789 -358978 -270575 57392 -265758 -384013
$$ packed form
9999a65302h0829B32610a77122H9725D2679c30381h3642B48760f5544E6717d1711
9987G03P0797D017g3537r7253k9104b9567G3655J11685D5794c17133d5297A25783
9974c064q5263C16522F9939J83948r4298a24400E63585b24392N2584A60534E6048
9962c77858D5543c74443a5688k13205a03969A70095b30908H4693a40862k61627
9952d02489i1304j9967A70469b60377d7040k0648q2152J1821A17044b3885o0091
9941h3976C96734F9220a66640H2234b20066h2745B648d8896a6749n0624l42141
9930d09514L4450F3052b52417a0194G8116b09228P5157f2307g084m6405j12529
9919a66018j8317A33039J32182e01824K22035p9189Q8403E7392b65758j18255
$$ plain form
9909 -384013 -224117 -278872 -173304 -342149 43094 -284277 -395655 -6772 -45171 90514 -258983
9897 84839 -107457 -161287 -171410 -77646 195517 6392 -28307 -86197 297176 -179685 191241
9885 173454 152837 -11870 99373 -77342 31454 -334462 -79974 42242 232759 -83395 -404974
9874 -404974 -158740 103067 220190 -98101 285291 -109561 -248499 -160025 -77516 -32680
9863 47428 295397 342632 -240201 -248892 191555 132200 93440 -121523 -187037 7639 -183191
9851 2066 -166280 -63113 -13553 -141709 -3266 -41326 -75947 -392367 -162717 -237238 -154767
9840 -154767 -139694 -373550 -173050 -145773 -62052 -53983 54580 -23588 -129587 -265378 -161463
9829 -161463 8542 101378 148753 -76994 218700 -10896 -103889 92499 -60148 -231706 -129278
$$ packed form
9909c84013J59896n4755J05568j68845D3094b84277j11378f772l8399I0514b58983
9897H4839a07457n3830j0123g7646A95517F392b8307n7890B97176a79685A91241
9885A73454k0617a1870I9373g7342C1454c34462g9974D2242J90517h3395l21579
9874d04974a58740A03067J17123i8101B85291a09561j38938Q8474g7516c2680
9863D7428K47969M7235b40201q691A91555n9355l8760a21523o5514G639a83191
9851B066a66280f3113a3553j28156c266l8060l4621l16420a62717p4521Q2471
9840a54767J5073k33856a73050K7277f2052Q069E4580b3588j05999j35791J03915
9829a61463H542R2836M7375g6994B18700a0896r2993I2499f0148j71558J02428
$$ plain form
9818 -129278 85260 -132117 167877 -105850 -160998 143114 -225342 -153408 -1486 -114814 186974
9806 -58245 -201697 -332930 -209762 -227651 68497 -37980 -176282 -198276 -14848 6916 274450
9795 274450 -244867 52461 -76162 292615 -15969 -1818 145019 -36821 389884 15673 -175287
9783 53401 -49630 -194821 -140464 52867 104823 -263887 -91971 163209 -176174 -113941 -61899
9772 -61899 -140093 2355 -225662 -154443 -53633 -379479 136906 -178683 -606900 -93207 -60433
9761 -60433 -26008 -329090 51904 -37330 190315 -382647 -101604 -224728 -279509 -183176 -59389
9749 -59512 398641 -82408 -241651 -202777 137458 -371711 -159689 -217292 -11206 -137813 -245686
9738 -245686 -56011 62520 -161494 139405 26629 127275 -55207 -139428 89769 -147100 -174460
$$ packed form
9818a29278H5260a32117A67877a05850n5148A43114b25342P1934a486j13328A86974
9806e8245j43452j31233J23168j7889F8497c7980j38302k1994a4848F916K67534
9795B74450b44867E2461g6162B92615a5969a818A45019c6821C89884A5673a75287
9783E3401d9630j45191N4357E2867N1956b63887i1971A63209a76174O2233N2042
9772f1899p8194B355b25662P1219e3633l25846A36906a78683m28217i3207L2774
9761f0433b6008l03082E1904c7330A90315c82647a01604j23124n4781R6333e9389
9749e9512C98641h2408j59243L8874A37458c71711a59689n7603a1206j26607j07873
9738b45686e6011F2520a61494A39405B6629J00646e5207q4221H9769a47100k7360
$$ plain form
9727 -174460 -11294 199036 -281324 -167896 -96583 -292676 -30548 -117607 187087 58163 -249015
9715 54446 -137753 84500 -49212 -359346 -201298 -215890 10692 12844 270595 -126766 219036
9703 24070 31094 48329 -195568 -54715 -18517 -43816 29174 -44246 -328745 -236669 109886
9691 -275448 -13202 -150554 68681 -737504 -227781 -16602 -74153 44455 -162824 -140096 -53152
9679 268338 -209509 -171575 -70530 -121631 -224410 -43480 -141858 -87435 16779 -36113 128820
9667 -34083 -117702 -319826 -184458 -68452 44648 109394 -41319 -133232 -81477 -133408 66260
9655 -180568 155610 -387479 101929 -375282 140860 -129872 -56198 185495 226755 46390
9644 -167062 -219992 88765 -15401 451123 -185077 -118692 -240884 -10177 -7112 -42178 169625
$$ packed form
9727a74460a1294A99036b81324J13428P1313j96093c0548q7059A87087E8163b49015
9715E4446a37753H4500d9212l10134J58048j4592A0692K152K57751a26766B19036
9703B4070P024J7235a95568e4715a8517k5299B9174d4246k84499R2076A09886
9691b75448a3202j37352F8681g37504b27781a6602n7551D4455a62824K2728e3152
9679B68338b09509L7934g0530n1101j02779d3480r8378N4423A6779c6113A28820
9667c4083q3619k02124J35368f8452D4648O4746d1319r1913N1755n1931F6260
9655a80568A55610c87479A01929c75282A40860a29872e6198A85495M1260D6390
9644a67062n2930H8765a5401D51123a85077O6385j22192a0177L065l5066A69625
$$ plain form
9632 -119624 164562 -135824 -20273 68181 -107033 11903 -38476 -221193 8406 -129651 275499
9620 -111647 -95566 113620 56791 -147610 61772 -103084 -147722 -75506 -354451 -141887 -209266
9609 -209266 -355388 266513 -246739 -175119 -269222 -155262 95245 -220173 -231832 58091 6206
9597 -103940 76470 -213967 86299 -22489 -383783 230516 171133 -19851 -75559 -69025 25148
9585 100144 -288825 -43485 -158037 91943 236826 -13111 1382 -234192 -112489 -239628 -278590
9574 -278590 -159611 152088 -142126 -97251 -221982 73232 38050 -54905 -196885 -167443 -237360
9563 -237360 36940 -180909 -211972 109273 -148880 -313730 -111840 -68996 48148 243583
9553 243583 -65079 -162383 45340 -166436 -203396 101007 -113195 -202383 44743 11993 9347
$$ packed form
9632a19624A64562a35824b0273F8181a07033A1903c8476j82717H406a29651B75499
9620a11647J6081A13620E6791a47610F1772a03084m4638P2216k78945a41887o7379
9609b09266j46122B66513b46739P1620r4103J13960I5245b20173j1659E8091F206
9597a03940G6470b13967H6299b2489l61294B30516n9383a9851n5708O534B5148
9585A00144b88825d3485j14552I1943J44883a3111A382b34192a12489j27139l8962
9574b78590J18979A52088a42126M4875j24731G3232l5182e4905j41980K9442o9917
9563b37360C6940a80909l1063A09273a48880j64850a11840M2844D8148J95435
9553B43583f5079r7304D5340a66436l6960A01007a13195q9188D4743A1993k646
$$ plain form
9542 9347 -191572 -243595 232622 -87164 -69400 -193377 187004 -28214 -272710 -115397 98220
9530 -51202 89204 -33496 -456455 -151983 -12345 49443 118454 47039 113118 -377881 -205459
9519 -205459 17320 -40919 100823 -165657 -99702 -551494 252877 52008 -107478 -251153
9509 -251153 -52657 304932 -324604 480 113765 -136289 167349 2437 -285911 -337373 34714
9497 29121 -158963 44257 -9037 -349291 252240 157558 -68893 24693 -182215 -44586 -263744
9486 -263744 45312 48446 133437 -147884 -85448 -114346 -155206 -25064 -926 -241295 -76010 -28931
9473 204030 127759 -175389 -401977 -194539 134993 -283869 -299957 -228017 -106699 181258
9462 -41599 -83589 3721 -45460 -265635 -296967 -62338 74472 -282039 -4671 403551 208747
$$ packed form
9542I347a91572n2023B32622h7164J7764j23977A87004b8214k44496a15397I8220
9530e1202H9204c3496m22959a51983a2345D9443O9011D7039O6079c77881J72422
9519b05459A7320d0919A00823a65657O5955m51792B52877E2008a07478j43675
9509b51153e2657C04932c24604D80J13285a36289A67349B437b85911n1462C4714
9497B9121a58963D4257i037l40254B52240r4682f8893B4693a82215d4586k19158
9486b63744D5312L134Q4991a47884O2436k8898m0860b5064i26k40369g6010b8931
9473B04030p6271a75389k26588a94539A34993b83869j6088P1940a06699A81258
9462d1599m1990C721d5460k20175l1332f2338G4472b82039d671D03551j94804
$$ plain form
9451 208747 139778 158827 185422 90277 120233 -159303 -71929 -342446 -363635 -218722 -35327
9439 249130 27401 -90394 -76334 9137 -71237 -153815 -281380 -182336 445027 98344 47372
9427 -162223 -294665 -122406 -65214 99507 62140 2881 -221134 263339 253126 -142217 -420117
9416 -420117 -150817 72259 -69493 -477462 14800 -55857 -2882 -69573 -283345 -197016 -81469
9404 133196 -118784 144351 65440 -15005 -476895 -351717 -405211 -321 -75795 -203769 -182819
9393 -182819 72571 10592 -208869 -61976 278249 -143193 126699 138998 143947 -102807 -131290
9382 -131290 -86889 -50543 304903 -38512 -166829 -86098 -240972 -261526 -106589 -66065 -176374
9371 -176374 -157957 -337115 -35764 52894 -217882 96278 74954 83238 34525 -121402 -295395
$$ packed form
9451B08747o8969J9049K6595I0277K9956a59303g1929k70517k1189J44913c5327
9439B49130B7401i0394J4060I137g1237q2578j27565R9044D45027I8344D7372
9427a62223j32442a22406N7192I9507l7367B881b21134B63339j0213a42217k77900
9416d20117a50817G2259f9493m07969A4800e5857b882o6691k13772Q6329h1469
9404A33196a18784A44351F5440a5005m61890J25178n3494c21p5474j27974K0950
9393a82819G2571A0592b08869f1976B78249a43193A26699J2299M949a02807k8483
9382a31290M4401L6346C04903c8512j28317Q0731j54874k0554a06589M0524j10309
9371a76374J8417j79158c5764E2894b17882I6278k1324Q284C4525a21402j73993
$$ plain form
9360 -295395 -173514 -171459 -217089 -17370 189441 -210433 -136005 -21563 -13205 -133322 121616
9348 -84811 -49493 -265744 -193814 -79283 -60030 332224 -91619 4052 -226554 -60499 50453
9336 -34064 -290328 -143403 -300655 97662 -203251 -292758 284353 353319 -239990 326250
9325 -34710 -136152 -17980 2211 147897 -54019 -140459 -126294 107909 97292 152200 -27361
9313 -294032 -171380 -92437 -62805 60608 -226497 104465 -246345 58037 105449 -90741 58860
9301 -88551 -330473 -141808 37715 29711 -89196 -31601 -90596 -74930 -111581 -433473 -157754
9289 -211110 -235818 -118130 -199505 -140530 198767 -62967 -179560 1998 -333077 -172315 -132130
9278 -132130 -33247 -137197 -163579 178891 -4329 -115197 -309436 -120234 34594 -139253 178526
$$ packed form
9360b95395J21881K055m5630a7370A89441b10433P4428b1563Q358j20117A21616
9348h4811L5318k16251P1930g9283J9253C32224i1619D052b26554f0499E0453
9336c4064k56264a43403j57252I7662b03251q9507B84353O8966b39990C26250
9325c4710j01442a7980B211J45686e4019q6440J4165A07909j0617N4908b7361
9313b94032J22652P8943K9632F0608b26497A04465b46345E8037M7412i0741E8860
9301h8551k41922a41808C7715q004h9196c1601n8995J5666l6651l21892a57754
9289b11110k4708J17688q1375N8975A98767f2967j16593A998c33077J60762M0185
9278a32130c3247j03950k6382A78891d329j10868j94239a20234C4594a39253A78526
$$ plain form
9266 152795 -45372 -48902 -50941 101892 -184445 246369 362398 -66717 211119 -139248 89210
9254 -606042 9869 -53590 -117503 -68084 -143960 -61871 -206656 44583 162530 51418 237729
9243 237729 -369334 -79690 -150496 -191995 -451753 -179076 -24936 62655 166544 332005 -130346
9231 181765 41189 -96805 279462 -169473 31194 -115223 -203291 -269884 -244863 -88256 249765
9219 -362211 -65178 -200264 -47289 208763 -13668 -56293 -248794 -128889 -222193 -51671 -154690
9208 -154690 -615 -313838 -89760 -101690 34495 -37652 56881 -212129 172516 183954 73741
9196 -12751 -472655 -398298 25474 -172376 308675 446180 -219772 -303264 -144655 21913 444540
9185 444540 -168726 191829 -277221 -158301 34877 -92238 170915 -143124 -293310 97098
$$ packed form
9266A52795d5372l530k039A01892a84445B46369J16029f6717B11119a39248H9210
9254f06042I869e3590o3913M9419p5876f1871j44785D4583J17947E1418J86311
9243B37729c69334g9690p0806m1499k59758a79076b4936F2655J03889J65461a30346
9231A81765D1189i6805B79462a69473C1194a15223q8068o6593K5021h8256B49765
9219c62211f5178j35086d7289B08763a3668m2625j92501J19905r3304e1671j03019
9208a54690f15l13223h9760j1930C4495c7652E6881b12129A72516J1438G3741
9196a2751m59904P4357B5474a72376C08675J37505b19772q3492a44655B1913M22627
9185D44540a68726A91829b77221J18920C4877i2238A70915a43124j50186I7098
$$ plain form
9174 180542 -161881 95215 -151610 -447514 -47836 -22292 101303 145576 -187979 -108586 -60227
9163 -60227 27670 148074 -249326 -193460 -145659 -222554 376517 150037 92717 8844 -339016
9151 36929 149759 161254 86691 -25593 323311 29186 51020 -278191 -151344 127926 -76864
9139 -104499 -132517 74013 -265125 2113 -307067 -97947 -119248 99985 410844 -62499 -9902
9127 78753 -58097 -373286 -63473 26873 197124 -3976 2991 -249375 214901 50730 -274299
9115 -270896 -14176 -184441 -136191 44753 -70142 193872 102582 106750 -63648 -110418 -5338 -169199
9103 -169199 -348840 -262044 87601 -176249 284652 -181258 15229 108535 -69661 50870 -143256
9091 -115576 67194 -43208 -12487 -236094 156092 143727 119701 82314 -66291 90471 92854
$$ packed form
9174A80542a61881I5215a51610k95904d7836b2292A01303M4273a87979P9393M8359
9163f0227B7670J20404b49326N5866M7801p6895C76517A50037n7320H844c39016
9151C6929J12830J1495p4563b5593C23311B9186K1834b78191J26847A27926g6864
9139a04499k8018G4013b65125B113c07067i7947k1301I9985L10859f2499i902
9127G8753e8097l15189f3473B6873J70251c976B991b49375B14901E0730b74299
9115b70896a4176j70265M8250D4753g0142A93872r1290M168f3648m6770e338j63861
9103a69199j79641Q6796H7601a76249B84652a81258A5229R3306f9661E0870a43256
9091a15576F7194d3208a2487k23607A56092j2365k4026l7387f6291I0471K383
$$ plain form
9080 92854 -129368 16234 177807 370227 -314397 -116257 -511704 -12929 -113694 -352056
9070 -352056 -14892 29653 -48637 72114 283277 -106748 -68625 -3707 -391799 -28207 -50561
9059 -50561 -123709 64732 -35245 209611 -42562 10826 71853 -139790 259319 -206930 200944
9047 -56977 -183594 -230262 -269928 23157 -376111 -406813 79129 -503391 49354 -172819 1559
9035 -17653 -129630 -83458 -178683 -42886 -192865 -127667 -48361 231508 148543 59610 -242924
9023 -25811 139332 -66331 -100894 -196946 -367588 -19959 -191989 -352953 26460 -462397 -556164
9012 -556164 -202813 -146652 33404 9554 -134430 102548 -172022 262742 -313195 -129802
9001 -90533 -76862 12114 -258376 945 264455 16692 -124518 -85883 -226681 -119461 -155124
$$ packed form
9080I2854a29368A6234J61573J92420c14397a16257l95447a2929j00765k38362
9070c52056a4892B9653d8637G2114K11163a06748L8123c707l88092b8207k2354
9059e0561p3148F4732c5245B09611d2562A0826O1027a39790B59319b06930B00944
9047e6977j26617m6668l9666B3157c76111l0702G9129e03391D9354a72819A559
9035a7653j11977M6172r5225d2886j49979O5198d8361B31508q2965E9610b42924
9023b5811A39332f6331l4563r6052j70642a9959j72030j60964B6460d62397r3767
9012e56164b02813N6161C3404I554a34430A02548a72022B62742c13195a29802
9001i0533J3671A2114b58376I45K63510A6692a24518L8635j40798J07220l5663
$$ plain form
8990 -155124 -117125 -338444 43741 204520 154680 -162746 21234 -405916 -129986 91283 -281203
8978 92866 -170498 -137280 68131 -155346 157308 234603 -225728 -186570 -144748 -110032 -27498
8966 71912 -217272 57806 5873 -354398 -67632 17457 -177635 456271 -438710 -100432 37457
8954 -91871 -316979 -80401 52099 -111560 -120432 -147034 191290 97900 -48570 -314884 -124230
8942 88066 109054 -152655 -67732 63138 -54729 -157787 139423 142988 714312 -125256 185906
8930 -116940 -142402 -249280 63599 -36267 98600 255999 1034249 2339740 6960279 23037508
8920 23037508 6348301 2165389 839591 648536 628954 290567 114458 393704 -84372
8910 300726 137649 225840 594150 173006 -66172 -245527 77939 226548 -39905 -19546 62940
$$ packed form
8990a55124L7999k21319D3741J60779m9840a62746B1234d05916a29986I1283b81203
8978I2866a70498L3218F8131a55346A57308P7295b25728L9158M1822L4716b7498
8966G1912b17272E7806E873c54398f7632A7457a77635D56271d38710a00432C7457
8954i1871k25108h0401E2099a11560q872k6602A91290r3390d8570k66314a24230
8942H8066K0988a52655f7732F3138e4729j03058A39423L565N71324a25256A85906
8930a16940k5462j06878F3599c6267I8600J57399P78250J305491M620539J6077229
8920B3037508F348301B165389H39591j91055j9582B90567A14458K79246h4372
8910C00726A37649Q8191L68310A73006f6172j79355G7939J48609c9905a9546F2940
$$ plain form
8898 -267361 -106683 118024 113147 -206077 -366164 -170231 -100693 -367161 -193228 314272
8887 125252 195622 -114344 46997 86699 30440 447213 -63332 90028 -485638 129412 -238105
8875 69557 -122834 61263 55205 -32191 -287120 20120 -275646 16381 -123744 -63604 27728
8863 -1811 -12860 -94737 345247 -23897 201509 -39295 286710 -87560 41124 -145352 209382
$$ packed form
8898b67361a06683A18024m877b06077j60087a70231O9538k66468J73933C14272
8887A25252P0370a14344D6997L9702C0440M16773f3332I0028d85638A29412b38105
8875F9557a22834F1263o058c2191k54929B0120b75646A6381a23744O0140B7728
8863a811j1049q1877C45247b3897B01509c9295B86710h7560D1124a45352B09382
$$ [...]
##END NTUPLES=NMR SPECTRUM
##END=
