
##TITLE=UV1266_M12_1292-1216_30_7414685_ONE5TAF8Cc
##JCAMPDX= 6.0         $$ Bruker NMR JCAMP-DX V2.0
##DATA TYPE= NMR SPECTRUM
##DATA CLASS= NTUPLES
##ORIGIN= BRUKER
##OWNER= Administrator
$$ 1.72 TOPSPIN		Version 2.1
$$ 2013-01-25 18:32:12.170 -0500  Administrator@X
$$ Compression mode = diff/dup
##.OBSERVE FREQUENCY= 400.02188249412
##.OBSERVE NUCLEUS= ^1H
##.ACQUISITION MODE= SIMULTANEOUS (DQD)
##.ACQUISITION SCHEME= undefined
##.AVERAGES= 64
##.DIGITISER RES= 22
##SPECTROMETER/DATA SYSTEM= spect
##.PULSE SEQUENCE= noesygpps1d.comp
##.SOLVENT NAME= COFFEE_meoh
##.SHIFT REFERENCE= INTERNAL, COFFEE_meoh, 1, 14.9611
##AUDIT TRAIL= $$ (NUMBER, WHEN, WHO, WHERE, PROCESS, VERSION, WHAT)
$$ ##TITLE= Audit trail, TOPSPIN		Version 2.1
$$ ##JCAMPDX= 5.01
$$ ##ORIGIN= Bruker BioSpin GmbH
$$ ##OWNER= Administrator
$$ $$ E:\/data/COFFEE/nmr/UV1266_M12_1292-1216_30_7414685_ONE5TAF8Cc/12/pdata/1/auditp.txt
$$ ##AUDIT TRAIL=  $$ (NUMBER, WHEN, WHO, WHERE, PROCESS, VERSION, WHAT)
(   1,<2013-01-25 18:32:06.467 -0500>,<Administrator>,<X>,<go>,<TOPSPIN 2.1>,
      <created by zg
	started at 2013-01-25 18:20:36.573 -0500,
	POWCHK enabled, PULCHK disabled,
       configuration hash MD5:
       86 BA 57 50 F2 9D 5C 9B 26 00 A9 28 5F 66 2E 89
       data hash MD5: 64K
       34 D7 55 D2 54 F5 48 A9 9A 76 A5 57 2C 23 13 FE>)
(   2,<2013-01-25 18:32:09.498 -0500>,<Administrator>,<X>,<proc1d>,<TOPSPIN 2.1>,
      <Start of raw data processing
       efp LB = 0.3 FT_mod = 6 PKNL = 1 PHC0 = 0 PHC1 = 0 SI = 128K 
       data hash MD5: 128K
       DA EE 15 68 F6 05 1B E3 27 0B 2D 79 0B 65 AE B5>)
(   3,<2013-01-25 18:32:10.529 -0500>,<Administrator>,<X>,<proc1d>,<TOPSPIN 2.1>,
      <pk PHC0 = -78.32153 PHC1 = 0 
       data hash MD5: 128K
       45 4D 59 40 EA B0 B4 49 85 12 BB 77 59 EF 7F 11>)
(   4,<2013-01-25 18:32:11.186 -0500>,<Administrator>,<X>,<proc1d>,<TOPSPIN 2.1>,
      <abs ABSG = 1 
       data hash MD5: 128K
       9A A6 2D BF D1 09 21 3C 5F 40 9E 9B FF 04 82 A9>)
(   5,<2013-01-25 18:32:11.342 -0500>,<Administrator>,<X>,<proc1d>,<TOPSPIN 2.1>,
      <abs ABSG = 2 
       data hash MD5: 128K
       55 CD CB 06 D7 38 BB A9 51 B5 71 F8 E2 A8 C5 3D>)
(   6,<2013-01-25 18:32:11.529 -0500>,<Administrator>,<X>,<proc1d>,<TOPSPIN 2.1>,
      <abs ABSG = 3 
       data hash MD5: 128K
       D7 F0 F4 92 31 2B 44 E2 32 F8 4D 72 C8 63 27 20>)
(   7,<2013-01-25 18:32:11.686 -0500>,<Administrator>,<X>,<proc1d>,<TOPSPIN 2.1>,
      <abs ABSG = 4 
       data hash MD5: 128K
       04 DF E6 F2 92 DE 8B 0F D5 69 50 F9 67 19 56 71>)
(   8,<2013-01-25 18:32:11.842 -0500>,<Administrator>,<X>,<proc1d>,<TOPSPIN 2.1>,
      <abs ABSG = 5 
       data hash MD5: 128K
       89 D6 4D 6E 73 0B A2 A9 2D 79 E3 D3 89 DB C0 A2>)
$$ ##END=
$$ 
$$ $$ hash MD5
$$ $$ CC 01 53 78 7C 34 F8 3F 26 B3 D2 22 77 83 41 EF
##$RELAX= 
##$RELAX= 
##$RELAX= 
##$RELAX= 
##$RELAX= 
##$RELAX= 
##$RELAX= 
##$RELAX= 
$$ Bruker specific parameters
$$ --------------------------
##$DU= <E:\>
##$EXPNO= 12
$$ [...]
150 150 150 150 150 150 150 150
##$TP07= 0
##$TPNAME0= <>
##$TPNAME1= <>
##$TPNAME2= <>
##$TPNAME3= <>
##$TPNAME4= <>
##$TPNAME5= <>
##$TPNAME6= <>
##$TPNAME7= <>
##$TPOAL= (0..7)
0.5 0.5 0.5 0.5 0.5 0.5 0.5 0.5
##$TPOFFS= (0..7)
0 0 0 0 0 0 0 0
##$TUNHIN= 0
##$TUNHOUT= 0
##$TUNXOUT= 0
##$USERA1= <user>
##$USERA2= <user>
##$USERA3= <user>
##$USERA4= <user>
##$USERA5= <user>
##$V9= 5
##$VALIST= <valist>
##$VCLIST= <CCCCCCCCCCCCCCC>
##$VD= 0
##$VDLIST= <DDDDDDDDDDDDDDD>
##$VPLIST= <PPPPPPPPPPPPPPP>
##$VTLIST= <TTTTTTTTTTTTTTT>
##$WBST= 2048
##$WBSW= 25
##$XGAIN= (0..3)
0 0 0 0
##$XL= 0
##$YL= 0
##$YMAX_a= 6382955
##$YMIN_a= -12649203
##$ZGOPTNS= <>
##$ZL1= 120
##$ZL2= 120
##$ZL3= 120
##$ZL4= 120
##$ABSF1= 14.9611
##$ABSF2= -5.597082
##$ABSG= 5
##$ABSL= 3
##$ALPHA= 0
##$AQORDER= 0
##$ASSFAC= 0
##$ASSFACI= 0
##$ASSFACX= 0
##$ASSWID= 0
##$AUNMP= <proc_prof1d_extract.lims>
##$AXLEFT= 0
##$AXNAME= <>
##$AXNUC= <1H>
##$AXRIGHT= 0
##$AXTYPE= 0
##$AXUNIT= <>
##$AZFE= 0.1
##$AZFW= 0.1
##$BCFW= 0
##$BC_mod= 0
##$BYTORDP= 0
##$COROFFS= 0
##$CY= 15
##$DATMOD= 1
##$DC= 0
##$DFILT= <>
##$DTYPP= 0
##$F1P= 0
##$F2P= 0
##$FCOR= 0.5
##$FTSIZE= 131072
##$FT_mod= 6
##$GAMMA= 0
##$GB= 0
##$INTBC= 1
##$INTSCL= 1
##$ISEN= 128
##$LB= 0.3
##$LEV0= 0
##$LPBIN= 0
##$MAXI= 10000
##$MC2= 0
##$MEAN= 0
##$ME_mod= 0
##$MI= 0
##$NCOEF= 0
##$NC_proc= -2
##$NLEV= 6
##$NOISF1= 0
##$NOISF2= 0
##$NSP= 0
##$NTH_PI= 0
##$NZP= 0
##$OFFSET= 14.9611
##$PC= 1
##$PHC0= -78.32153
##$PHC1= 0
##$PH_mod= 1
##$PKNL= yes
##$PPARMOD= 0
##$PPDIAG= 0
##$PPIPTYP= 0
##$PPMPNUM= 2147483647
##$PPRESOL= 1
##$PSCAL= 4
##$PSIGN= 0
##$PYNMP= <proc.py>
##$REVERSE= no
##$SF= 400.020009598501
##$SI= 131072
##$SIGF1= 0
##$SIGF2= 0
##$SINO= 400
##$SIOLD= 131072
##$SPECTYP= <>
##$SREGLST= <1H.CDCl3>
##$SSB= 0
##$STSI= 131072
##$STSR= 0
##$SW_p= 8223.68421052631
##$SYMM= 0
##$S_DEV= 0
##$TDeff= 65536
##$TDoff= 0
##$TI= <>
##$TILT= no
##$TM1= 0
##$TM2= 0
##$TOPLEV= 0
##$USERP1= <user>
##$USERP2= <user>
##$USERP3= <user>
##$USERP4= <user>
##$USERP5= <user>
##$WDW= 1
##$XDIM= 131072
##$YMAX_p= 459449760
##$YMIN_p= -11393
##$CURPLOT= <Network HP LaserJet P1505>
##$CURPRIN= <$Network HP LaserJet P1505>
##$DFORMAT= <normdp>
##$LAYOUT= <+/1D_H.xwp>
##$LFORMAT= <normlp>
##$PFORMAT= <normpl>
##$SURQMSG= 1
$$ End of Bruker specific parameters
$$ ---------------------------------
##NTUPLES= NMR SPECTRUM
##VAR_NAME=  FREQUENCY,     SPECTRUM/REAL,   SPECTRUM/IMAG
##SYMBOL=    X,             R,               I
##VAR_TYPE=  INDEPENDENT,   DEPENDENT,       DEPENDENT
##VAR_FORM=  AFFN,          ASDF,            ASDF
##VAR_DIM=   131072,        131072,          131072
##UNITS=     HZ,            ARBITRARY UNITS, ARBITRARY UNITS
##FACTOR=    0.0627417313425164, 1,          1
##FIRST=     8223.62146879497, 433,          -62990
##LAST=      0,             1590,            -63237
##MIN=       0,             -11393,          0
##MAX=       8223.62146879497, 459449760,    0
$$ Real data points
##PAGE= N=1
##DATA TABLE= (X++(R..R)), XYDATA
$$ [...]
67879 88565 88818 88534 88266 88505 89168 89831 90322 90739 90993 90858 90492 90383 90700 91219 91964 93218 94674 95327
67861 95327 94699 93561 92913 92790 92684 92588 92823 93124 92737 91329 89200 86718 84199 82249 81503 81912 82813
67844 82813 83747 84637 85176 84768 83347 81694 80576 80003 79673 79697 80391 81604 82790 83687 84523 85466 86293 86796
67826 86796 87315 88554 90862 93884 96965 99766 102322 104653 106555 107839 108600 109120 109557 109834 109759 109231
67810 109231 108297 107019 105284 102885 99889 96787 94099 91895 89904 87981 86201 84575 83037 81706
67796 81706 80790 80173 79402 78225 76810 75350 73769 72000 70273 68972 68379 68606 69486 70467 71002 71169 71516
67779 71516 72172 72595 72448 72298 73005 74693 76690 78260 79083 79203 78922 78703 78929 79743 81099 82690 83879
67762 83879 84203 84227 85369 88432 92541 95990 97947 98984 100131 101799 103503 104346 103859 102491 101092 99866
67746 99866 98284 96195 94449 93936 94548 95619 96899 98381 99444 99114 97220 94701 92576 91054 89651
67731 89651 87780 85232 82474 80405 79456 78974 77899 75924 73612 71565 70063 69376 69712 70685 71451 71557
67715 71557 71258 70909 70603 70563 71298 72910 74600 75255 74460 72763 71104 70100 69706 69424 68946 68571 68782 69489
67697 69489 70045 70023 69638 69300 69195 69485 70485 72232 74088 75183 75244 74768 74313 73862 72973 71480 69854 68754
67679 68754 68315 68091 67753 67556 67912 68722 69462 69840 70031 70325 70864 71745 73063 74699 76265 77385 77959 78236
67661 78236 78770 80202 82743 85737 87986 88651 87815 86191 84456 82931 81722 80979 80907 81514 82420 83063 83140
67644 83140 82743 82095 81313 80411 79339 77993 76502 75510 75732 77029 78303 78572 77857 76794 75850 75288 75455
67627 75455 76462 77842 79072 80260 81823 83619 85008 85720 86152 86763 87672 88879 90389 92009 93340
67612 93340 94114 94307 93966 93276 92710 92728 93198 93378 92573 90715 88459 86836 86476 86887 86771 85431 83542 82142
67594 82142 81265 80193 78703 77258 76174 75366 74837 74593 74116 72778 70899 69575 69343 69769 70425 71303 72028
67577 72028 71748 70408 69249 69326 70209 70868 71207 71863 72859 73404 73030 72183 71622 71724 72371 73134 73504 73292 72819
67558 72819 72545 72543 72495 72091 71275 70291 69649 69875 71047 72670 74139 75124 75465 75031 73980 72866 72110 71492
67540 71492 70414 68606 66420 64638 64069 65098 67323 69786 71740 73093 74014 74440 74190 73323 72087 70686
67524 70686 69365 68578 68724 69698 70921 71808 72125 71973 71542 70907 70039 69027 68115 67372 66477 65173 63843
67507 63843 63229 63577 64436 65313 66045 66464 66282 65589 65005 65014 65463 65962 66438 66996 67562 67968 68147 68042 67592 67012
67487 67012 66791 67166 67913 68785 69733 70498 70532 69699 68610 67874 67407 66882 66438 66439 66856 67379 67830 68043 67731 67035
67467 67035 66807 67601 68663 68664 67325 65636 64555 64212 64389 65000 65849 66497 66734 66805 67000 67343 67752 68169 68432
67448 68432 68397 68266 68466 69114 69903 70572 71118 71546 71805 72091 72744 73673 74311 74357 74238 74556 75365 76253 76906 77333
67428 77333 77690 78063 78291 77931 76644 74733 73012 71938 71219 70472 69902 69908 70270 70277 69647 68818 68221 67757 67280
67409 67280 67261 68477 71030 74015 76325 77613 78296 78812 79149 79100 78696 78167 77633 76992 76151 75235 74590 74638
67391 74638 75593 77118 78315 78305 76955 74941 73034 71508 70301 69461 69158 69302 69542 69716 70009 70460 70586
67374 70586 69848 68414 67165 66929 67924 69893 72413 74939 76870 77815 77717 76722 75186 73834 73479 74293 75609
67357 75609 76635 77056 76822 75940 74850 74482 75236 76304 76639 76308 76136 76289 76162 75602 75195 75206 75162 74806 74609
67338 74609 74927 75481 76142 77376 79282 80913 81402 81242 81681 83239 85565 88332 91364 94066 95642 95950
67322 95950 95511 94634 93201 91333 89635 88540 87837 87024 85859 84507 83455 83233 83892 84791 85270 85477 86155
67305 86155 87675 89683 91696 93548 95197 96484 97260 97460 97038 96122 95240 95025 95651 96774 97938 98721
67289 98721 98633 97438 95637 94145 93371 93007 92752 92725 92975 93124 92854 92318 91772 91105 90102 88876 87697 86672
67271 86672 85992 86237 87921 90783 93927 96680 98957 100789 101947 102285 102133 101995 101915 101426 100164 98384
67255 98384 96741 95634 94953 94461 94255 94646 95589 96494 96782 96523 96300 96468 96796 96950 97012 97241 97534 97515 97171
67236 97171 96921 96897 96578 95497 93982 92775 92083 91482 90694 90019 89927 90568 91730 93006 94018 94782 95782
67219 95782 97333 98966 99935 100295 100882 102125 103493 104346 104754 105145 105595 105851 105656 104828 103473 102359 102467
67202 102467 103772 104940 104809 103723 102885 102828 103178 103567 104043 104651 105240 105676 105823 105423 104423 103280 102590
67185 102590 102567 103170 104381 105917 107105 107643 108146 109276 110677 111540 111933 112637 113841 114975 115771 116444 116774
67168 116774 116123 114687 113677 113726 114063 113885 113686 114372 115729 116725 117014 117214 117796 118525 119077 119577 120330 121412
67150 121412 122687 123912 124786 125185 125434 126055 127200 128505 129579 130355 130876 131057 130904 130829 131365 132491 133516
67133 133516 133794 133396 132887 132657 132748 133252 134353 135892 137324 138364 139306 140433 141420 141771 141613 141629 142302 143573
67115 143573 145124 146601 147691 148396 149263 150987 153741 157058 160228 162553 163469 162894 161471 160110 159322
67100 159322 159236 159987 161591 163537 165049 165794 165987 165913 165794 165966 166642 167515 168117 168528 169193 170141 171065 172121
67082 172121 173888 176344 178681 180410 181978 183878 185797 187120 187841 188509 189625 191449 194002 196824 199070
67067 199070 200324 201154 202494 204648 207151 209409 211177 212563 213846 215187 216420 217299 218019 219191 221172
67052 221172 223701 226288 228592 230365 231521 232523 234219 236954 240200 243338 246416 249754 253238 256479
67038 256479 259351 261869 263817 265068 266174 268077 271166 274938 278638 281962 285118 288419 291852 294999
67024 294999 297502 299699 302515 306440 310865 314755 317861 320912 324659 329136 333828 338252 342165 345485
67010 345485 348341 351236 354919 359766 365305 370589 375193 379582 384286 389051 393215 396677 399938 403315
66996 403315 406783 410633 415522 421572 427976 433906 439408 445111 451411 458284 465480 472518 478806 484164
66982 484164 489051 494087 499641 506057 513730 522463 531153 538695 545088 551239 557888 565125 572806 580921
66968 580921 589549 598698 608195 617633 626669 635553 645046 655505 666325 676625 686221 695581 705166
66955 705166 715326 726588 739371 753411 767943 782485 797057 811650 825969 839840 853540
66944 853540 867513 881918 896573 911256 926023 941247 957272 974035 991216 1008794 1027169
66933 1027169 1046622 1067012 1088215 1110408 1133519 1156800 1179502 1201824 1224605 1248158 1272013
66922 1272013 1295877 1320309 1346133 1373491 1401771 1430256 1458624 1486894 1515158 1543526 1572284
66911 1572284 1601914 1632749 1664607 1696949 1729416 1762004 1794749 1827682 1861198 1896025 1932409
66900 1932409 1969563 2006255 2041874 2076721 2111451 2146548 2182195 2218282 2254472 2290399 2325800
66889 2325800 2360559 2394837 2429120 2463691 2497970 2530903 2562214 2592742 2623127 2652713 2680304
66878 2680304 2705563 2728986 2750866 2771107 2789898 2807694 2824305 2838655 2849796 2857801 2863476 2867547
66866 2867547 2870244 2871329 2870279 2866710 2860773 2852941 2843344 2831574 2817362 2801198 2783964 2765893 2746152
66853 2746152 2723687 2698485 2671763 2644718 2617389 2589027 2559352 2528845 2497851 2466109 2433409
66842 2433409 2400013 2366019 2330924 2294480 2257543 2221331 2185995 2150530 2114036 2076616 2039097
66831 2039097 2002325 1966684 1931946 1897552 1863223 1829180 1795658 1762544 1729734 1697418 1665665
66820 1665665 1634177 1602868 1572199 1542408 1512939 1483326 1454104 1425989 1398541 1370710 1342519
66809 1342519 1315123 1289171 1264156 1239547 1215518 1192221 1169223 1146197 1123458 1101381 1079849
66798 1079849 1058737 1038368 1018988 1000224 981529 962845 944394 926183 908148 890630 874253
66787 874253 859287 845280 831316 816752 801888 787819 775291 763831 752366 740523 728778
66776 728778 717449 706302 695217 684411 673752 662625 650925 639515 629199 619771 610577 601508
66764 601508 592796 584256 575405 566141 556731 547313 537938 528933 520704 513229 506192 499462 492988 486357
66750 486357 479104 471486 464389 458290 452784 447376 442242 437762 433651 429149 424063 419117 414995 411421
66736 411421 407496 402778 397597 392397 387174 381738 376173 370841 366171 362528 359927 357684 354744 350685
66722 350685 346051 341400 336511 331085 325698 321273 317845 314724 311737 309340 307440 305138 302023 298833
66708 298833 296288 293941 290806 286648 282031 277514 273404 270051 267739 266312 265292 264285 263041 261333
66694 261333 259138 256749 254429 252149 249920 248098 246908 245840 243992 241026 237460 234038 231053 228259
66680 228259 225203 221622 217684 213811 210299 207290 205165 204499 205296 206599 207327 207342 207238 207246 206928 206038 205055
66663 205055 204529 204213 203280 201343 198910 196780 195202 193790 192124 190191 188172 186050 183695 181316 179549
66648 179549 178920 179265 179765 179613 178719 177798 177684 178433 179170 178881 177271 174814 172198 169951 168340 167249 166256
66631 166256 165102 164031 163370 162924 162164 160927 159514 158163 156833 155496 154179 152777 151260 150008 149369
66616 149369 148903 147730 145762 143872 142652 141748 140798 140250 140631 141576 142300 142656 143071 143627 143877 143479 142486
66599 142486 141069 139371 137582 135810 133982 132187 130940 130702 131246 131849 132006 131669 130962 130058 129145 128169
66583 128169 126745 124753 122835 121795 121604 121450 120753 119640 118433 117252 116254 115758 115858 116187 116291 116014
66567 116014 115422 114651 113978 113763 114087 114621 114993 115119 115034 114607 113624 112134 110542 109366 108901 109019 109286 109394
66549 109394 109487 109893 110482 110583 109729 108282 106980 106002 104897 103534 102684 103197 104827 106341 106825 106488 106008
66532 106008 105617 105177 104828 104903 105239 105125 104192 103009 102533 103127 104268 105084 105074 104343 103233 101703 99273 95776
66514 95776 92027 89368 88504 89053 90220 91540 92897 94189 95201 95642 95258 94157 93024 92602 92885 93184
66498 93184 93090 92971 93303 93995 94653 95146 95567 95931 96252 96639 97067 97282 97204 97095 97007 96448 95114 93623 92963
66479 92963 93279 93754 93680 93127 92501 91914 91227 90377 89447 88564 87895 87601 87668 87851 87910 87903 88112 88627 89058 88876 88146
66458 88146 87695 88238 89432 90205 90011 89357 88953 88861 88767 88664 88760 88923 88706 87947 86982 86241 85847 85647 85470 85298
66438 85298 85260 85414 85561 85421 85072 84993 85548 86532 87369 87624 87258 86528 85776 85182 84670 84096 83492 82929 82311 81636
66418 81636 81387 82143 83702 85013 85220 84442 83406 82681 82434 82519 82570 82306 81914 81798 81898 81774 81475 81682 82661
66399 82661 83654 83792 83184 82598 82455 82588 82639 82230 81074 79390 78004 77634 78237 79327 80543 81642 82420
66382 82420 83033 83947 85151 85937 85950 85911 86619 87712 88190 87829 87310 87133 87111 86762 85619 83401 80517 78132
66364 78132 77069 76913 76829 76828 77403 78281 78623 78359 78272 78687 79052 78989 78831 78899 79037 79119 79327 79705 80136 80889 82387
66343 82387 84240 85376 85460 85373 85880 86598 86812 86580 86387 86271 86018 85819 86072 86689 87173 87240 86944 86325 85315
66324 85315 83988 82648 81718 81586 82309 83337 83864 83662 83278 83211 83239 82880 82208 81733 81605 81401 80825 80268 80386
66305 80386 81191 81856 81603 80622 79784 79505 79402 79175 79224 79935 80873 81322 81264 81185 81196 81100 81117 81656 82442 82775 82692
66284 82692 82972 83822 84464 84387 84111 84242 84552 84552 84304 84072 83720 83156 82899 83506 84705 85725 86267 86599 86846
66265 86846 86780 86294 85563 84752 83915 83250 83078 83394 83664 83236 81990 80580 79977 80668 82279 84007 85227 85623
66247 85623 85097 83983 83089 82996 83372 83506 83405 83724 84647 85537 85824 85561 84938 83999 83087 82870 83479 84190 84351
66228 84351 84120 83931 83881 84043 84733 85866 86566 86113 84943 84098 83962 84088 84050 83928 84102 84985 86786 89143
66210 89143 91200 92344 92686 92616 92339 92115 92437 93416 94390 94663 94370 94116 94128 94259 94463 94719 94804 94706 94916 95704
66190 95704 96413 96206 95266 94496 94229 94004 93545 93125 92877 92444 91543 90329 89101 88136 87881 88721 90329 91715
66172 91715 92099 91498 90471 89627 89337 89483 89527 89226 89165 90087 91784 93238 93822 93729 93242 92388 91478 91145 91470
66153 91470 91752 91610 91648 92479 93614 93980 93256 92093 91278 91203 91926 93099 93945 93951 93631 94057 95502 97035 97684
66134 97684 97552 97524 98204 99486 100884 101868 102009 101260 100185 99605 99853 100563 101167 101363 101029 100125 98933 98076
66116 98076 97931 98168 98276 98306 98648 99237 99673 100129 101328 103298 104885 105093 104361 103855 103921 104102 104427 105618
66098 105618 107796 109854 110669 110411 110180 110687 111771 112956 113897 114377 114371 114221 114371 114779 114911 114494 113934 113645
66080 113645 113233 111900 109751 108134 108332 110131 112097 113064 112972 112359 111633 111012 110727 110847 111120 111290 111481
66063 111481 112002 112827 113487 113475 112651 111385 110388 110295 111136 112238 112783 112509 111856 111467 111659 112354 113358 114555
66045 114555 115713 116284 115805 114728 114451 116028 118895 121396 122551 122801 123011 123402 123787 124227 124869 125496 125812
66028 125812 125988 126481 127422 128626 130062 131885 134026 136150 138051 139760 141228 142235 142696 142848 143003 143246
66012 143246 143407 143281 142883 142519 142495 142764 143078 143544 144705 146864 149686 152767 156286 160607 165462 170059
65996 170059 173975 177437 180741 183897 187044 190651 194897 199062 201940 202869 202123 200391 198151 195663 193293
65981 193293 191451 190115 188674 186464 183402 179965 176652 173693 171129 168804 166276 163095 159313 155536
65967 155536 152408 150261 149209 149111 149355 149090 147992 146561 145524 145212 145640 146711 148070 149113 149540 149692
65951 149692 150087 150930 152317 154552 157749 161372 164642 167397 170148 173301 176607 179469 181654 183581 185864
65936 185864 188500 190721 191879 192285 192739 193458 194174 195172 197284 200540 203772 206042 207732 209649 211878
65921 211878 214246 217147 220971 225242 229259 233165 237398 241490 244507 246531 248654 251501 254628 257372
65907 257372 259405 260482 260552 260236 260296 260506 259898 258260 256526 255447 254718 253722 252328 250567 248252 245397
65891 245397 242415 239484 236204 232226 227705 222811 217353 211285 205042 198987 192939 186707 180711 175643
65877 175643 171795 169029 167076 165572 164135 162722 161689 161272 161361 161922 163155 164900 166296 166425 165078
65862 165078 162714 160058 157960 157182 157846 159349 161069 162827 164414 165277 165185 164837 165125 166041 166896 167481 168283
65845 168283 169533 170705 171264 171482 172059 173175 174323 175032 175393 175678 175751 175224 174169 173238 173005 173535 174852
65828 174852 177378 181426 186518 191711 196464 200804 204931 209217 214364 220739 227500 233129 236985 239624
65814 239624 241457 241945 240586 237981 235213 232576 229556 225822 221639 217396 213180 208899 204544 200279
65800 200279 196387 193046 190150 187445 184846 182461 180383 178699 177622 177245 177273 177420 178016 179666 182347
65785 182347 185451 188772 192760 197719 203454 209900 217283 225338 233193 240477 247789 255439 262524 267929
65771 267929 271612 274034 274846 273086 268460 261634 253418 244432 235354 226735 218588 210829 204096 199479
65757 199479 197445 197611 199583 203411 209189 216750 225887 236436 248093 260576 274010 288745 304766
65744 304766 321610 338735 355525 370991 384060 394271 401768 406489 407812 405155 398567 388613 375960
65731 375960 361183 344709 326868 308183 289571 272027 256137 242049 229702 218720 208341
65720 208341 198087 188453 180430 174293 169333 164796 160540 156679 153189 150139 147835 146431 145720 145511
65706 145511 145793 146307 146419 145800 144944 144658 145238 146421 147840 149192 150182 150734 151143 151678 152145 152160 151759 151419
65688 151419 151507 152103 153351 155562 158753 162354 165635 168341 170798 173544 177029 181555 187202 193760 200998
65673 200998 209166 219130 231757 247171 264734 283723 303757 324524 345395 365560 384457 401872
65661 401872 417735 431999 444556 454950 462243 465594 465237 462655 459605 457007 454833 452844 451211
65648 451211 450497 451248 453545 456738 459612 461044 460688 458874 455723 450404 441530 428335 411402 392165
65634 392165 371838 350932 329643 308388 287838 268579 250930 235050 221048 208961 198707
65623 198707 190137 183056 177145 171907 166844 161789 157028 152994 149842 147340 145168 143247 141745 140828
65609 140828 140420 140151 139619 138781 138041 137774 137818 137662 137161 136778 136996 137716 138398 138579 138158 137439 137053 137565 138863
65590 138863 140264 141496 143223 146122 149727 152861 155135 157416 160686 165016 169928 175342 181864 190395
65576 190395 201616 215605 231715 248956 266694 284932 303915 323612 343454 362316 378707
65565 378707 391358 399831 404520 406024 404603 400162 392540 381825 368507 353219 336205 317318 296836
65552 296836 275970 256211 238367 222603 209046 197712 188065 179404 171677 165334 160483 156805 154158
65539 154158 152503 151347 150191 149485 150117 151795 153067 153291 153448 154453 155708 156120 155593 154571 152891 150199
65523 150199 147059 144513 142760 141155 139393 137854 136793 135876 134631 132885 130788 128764 127358 126772 126741
65508 126741 127066 127854 128942 129656 129698 129765 130609 131933 132935 133503 133989 134209 133718 133005 133369 135390 138274 140851
65490 140851 142555 143404 143754 144336 145946 148802 152495 156568 160636 164116 166527 168091 169391 170357 170294 169022
65474 169022 167211 165379 163302 160821 158421 156433 154236 151011 147030 143489 141146 139718 138689 138151
65460 138151 138480 139422 139982 139350 137708 135881 134320 132787 131085 129619 128940 129026 129363 129624 129965 130756 132188
65443 132188 134017 135584 136356 136617 137298 138847 140681 142070 143122 144444 146255 148391 150803 153426 155877
65428 155877 157936 160003 162306 163960 163708 161510 158526 155578 152629 149816 147946 147533 148200 149424 151092
65413 151092 152821 153588 152794 151242 150323 150505 151176 151711 152020 152131 151884 151259 150672 150642 151276 152247 153360 155022
65395 155022 157874 161879 166022 169194 171185 172529 173548 174023 173713 172699 171147 169110 166777 164605 163053
65380 163053 162273 162041 161850 161207 160115 159170 158915 159292 160033 161306 163479 166379 169307 171795 173925 175953
65364 175953 178006 180101 182092 183772 185462 188249 193038 199500 206544 213724 221504 230289 239908 249992
65350 249992 260042 269053 275897 280334 283009 284323 283902 281297 276514 269796 261644 253179 245570 238843
65336 238843 232058 224925 218341 212907 207883 202268 196169 190435 185562 181622 178701 176675 174975 173200
65322 173200 171620 170531 169572 168283 166893 165840 164827 163164 160897 158939 157954 157564 156714 154553 151070
65307 151070 147107 143713 141363 139940 139346 139623 140404 140947 141053 141375 142425 143899 145418 147263 149672 152037
65291 152037 153604 154603 155814 157296 158373 158718 158610 158212 157450 156653 156478 156903 156964 155825 153685 151409 149644
65274 149644 148531 147885 147388 146826 146359 146403 147082 148002 148690 149074 149338 149402 148803 147195 144919 142887 141810 141611
65256 141611 141773 142148 143128 145002 147477 149965 152054 153580 154493 154873 154831 154247 152827 150576 147973 145509
65240 145509 143292 141307 139775 139000 139015 139548 140220 140686 140859 141123 141989 143328 144201 143677 141701 139066 136803
65223 136803 135601 135433 135594 135384 134903 134802 135274 135802 136013 136126 136268 136035 135203 134375 134367 135282 136644 138014
65205 138014 139003 139110 138232 137141 136847 137517 138388 138587 137729 136021 134227 133275 133417 133966 134272 134627 135688
65188 135688 137272 138480 138971 139426 140565 142190 143465 143920 143945 144344 145393 146446 146639 145965 145253 145005 144780
65171 144780 144027 142950 142039 141187 139920 138358 137320 137440 138603 140204 141752 143238 145061 147395 149608
65156 149608 150731 150708 150612 151291 152420 153454 154826 157379 161010 164822 168505 172727 178139 184741 192258
65141 192258 200467 209048 217623 226023 234064 241111 246509 250542 254459 259354 265357 271875 278142 283430
65127 283430 287229 289517 290639 290865 290256 289006 287561 286244 284890 282947 279967 276054 271793 267530 262786
65112 262786 256839 249896 243123 237276 231917 226312 220426 214485 208237 201407 194417 187860 181668 175588
65098 175588 170118 166034 163166 160560 157809 155393 153726 152713 152256 152418 152911 153117 152798 152277 151912 151830
65082 151830 152060 152389 152276 151546 150920 151106 151611 151374 150404 149785 150109 151006 152234 154016 156012 157157 157070 156656
65064 156656 156805 157418 158201 159391 160900 161718 161170 160182 160262 161635 163275 164479 165362 165869 165312 163265 160325
65047 160325 157543 155419 153744 152300 151362 151350 152087 152735 152640 152076 151781 151912 151843 150923 149007 146282 143126
65030 143126 140245 138375 137546 136965 135878 134237 132449 130898 129856 129479 129651 130147 131072 132740 134964 136901
65014 136901 137883 138144 138479 139478 141231 143496 145919 148262 150529 152753 154790 156623 158712 161584 165053
64999 165053 168354 170960 172768 173568 173057 171528 169870 168683 167947 167654 168042 168944 169674 169943 170302 171304
64983 171304 172860 174809 177414 180745 184146 186931 189134 190962 192006 191705 190315 188731 187468 186316
64969 186316 184865 182882 180297 177309 174424 172022 169932 167735 165380 163238 161633 160505 159438 157912
64955 157912 155793 153668 152387 152112 152152 151851 151212 150481 149683 148902 148476 148450 148296 147611 146738 146188 145861 145394
64937 145394 144904 144796 145087 145519 146155 147301 148932 150675 152251 153471 153928 153254 151660 149826 148242 146988
64921 146988 146046 145451 145203 145350 146056 147242 148358 148859 148852 148892 149314 150078 151116 152387 153709 154901 156071
64904 156071 157451 159121 161202 164034 167696 171602 175168 178731 183206 188918 195370 202104 209010 215705
64890 215705 221440 226073 230514 235659 241274 246446 250850 254915 258853 262075 263785 263772 262367 259776 255756
64875 255756 250025 242899 235405 228700 223309 218891 214766 210712 207246 205057 204168 203786 203044 201789 200486
64860 200486 199527 198872 198262 197406 195942 193592 190513 187241 184049 180661 176780 172708 169122 166353 164135
64845 164135 162039 159908 157894 156213 155024 154466 154679 155639 156956 158030 158603 159004 159619 160238 160264 159506 158439
64828 158439 157617 157148 156849 156590 156370 156266 156461 157158 158385 160018 162012 164440 167345 170725 174556 178647
64812 178647 182691 186797 191726 198093 205464 212802 219641 226140 232066 236615 239378 240705 240779 239170 235748
64797 235748 231358 227007 222889 218776 214874 211599 208809 205892 202579 199297 196813 195717 196020 196982 197604
64782 197604 197481 196972 196491 196078 195789 195905 196427 196882 197055 197484 198862 201315 204585 208410 212415 216189 219845
64765 219845 223953 228534 232798 236422 240326 245412 251136 256214 260362 264458 269239 274675 280495 286581
64751 286581 292819 299105 305377 311246 315925 318916 320308 319827 316296 309027 299335 289601 281009 273167
64737 273167 265668 258737 252271 245521 238306 231727 227115 224780 224026 223884 223626 223156 223140 224308 226467 228686
64721 228686 230500 232242 234082 235523 236315 237283 239688 243989 249559 255322 260420 264519 267758 270265 271670
64706 271670 271305 268902 264826 259579 253389 246373 238769 230902 223143 215888 209330 203344 197936 193640
64692 193640 190968 189544 188379 187073 186194 186315 187216 188279 189169 189832 190276 190752 191879 194164 197489 201291
64676 201291 205136 208971 212960 217241 221855 226800 232195 238258 244969 251742 257597 261649 263452 263036
64662 263036 260842 257519 253570 249253 244831 240655 236864 233317 230089 227657 226266 225487 224866 224690 225591
64647 225591 227639 230331 233243 236122 238523 240073 241061 242240 244116 246901 250985 256704 263693 271116
64633 271116 278635 286533 294795 302643 309165 313965 317107 318836 319382 318666 316222 311781 305819 299109 291919
64618 291919 284171 276127 268263 260647 253221 246500 241144 236874 232758 228601 225118 222613 220488 218320
64604 218320 216441 215006 213474 211604 210139 209857 210502 211295 211992 212869 214139 216002 218859 222837 227363
64589 227363 231742 236013 240799 246528 253105 260140 267141 273638 279473 284936 290498 296484 302920 309418
64575 309418 315235 319778 323063 325338 326413 325854 323736 320561 316479 311296 305192 298598 291314 282749
64561 282749 273248 264178 256282 248955 241661 235068 229954 225852 221721 217423 213608 210599 208261 206640
64547 206640 205912 205852 206055 206565 207684 209342 211180 213073 215090 217149 219145 221134 222900 223629 222605 220012
64531 220012 216626 213041 209616 206799 204831 203402 202125 201067 200324 199531 198453 197669 197788 198351 198431 198171
64515 198171 198672 200309 202163 203376 204158 205030 205932 206641 207468 208902 210901 213159 215830 219447 224143 229471
64499 229471 235024 240868 247136 253477 259163 263723 267207 269846 271692 272733 273026 272447 270601 267442 263879
64484 263879 261217 259971 259719 260078 261123 262690 264050 264730 264979 264913 263872 261369 258191 255631 253814 251691
64468 251691 248691 245561 243351 242234 241768 241892 243096 245621 248811 251466 252885 253407 253767 254077 253856 252986
64452 252986 252031 251329 250351 248475 246030 244074 243358 243928 245473 247521 249502 251129 252665 254497 256627
64437 256627 259027 262202 266857 273127 280666 289370 299465 310931 323380 336606 350838 366513 384281
64424 384281 405201 430458 460743 496324 537795 586319 643001 708348 782398 864862 954735
64413 954735 1049718 1146163 1239789 1327001 1406087 1477185 1540790 1596199 1641407 1674126 1692584
64402 1692584 1695767 1683771 1658080 1620950 1574140 1518253 1453111 1378414 1294311 1202149 1105091
64391 1105091 1007707 914490 828513 751129 682488 622239 570019 525413 487544 455086 427043
64380 427043 403195 383311 366236 350510 335896 323483 314090 307238 301946 297763 294434 291138 286864
64367 286864 281422 275436 269371 263132 256737 250783 245857 241782 237902 233995 230451 227507 224773 221873
64353 221873 219272 218006 218663 220990 224384 228243 231914 234971 237848 241501 245930 249498 250350 248280 244700
64338 244700 240985 237460 233852 230054 226308 223067 220743 219255 217841 215814 213547 212279 212797 214689
64324 214689 217014 219306 221689 224305 226945 229189 230772 231826 232826 234231 236183 238529 240977 243111
64310 243111 244458 244767 244137 242683 240223 236502 231533 225530 218777 211899 205967 201785 199107 196982 194824
64295 194824 192756 191002 189526 188350 187678 187444 187150 186480 185841 185978 187134 188850 190585 192326 194496 197358
64279 197358 200746 204456 208622 213339 218109 222244 225877 229973 235065 240504 245314 249174 252056 253519
64265 253519 253252 252040 251354 251912 253235 254505 255285 255504 255437 255705 256627 257461 256835 254064 249609 244264 238454
64248 238454 232382 226306 220528 215519 211943 209958 208586 206591 204047 202206 201649 201510 200937 200381 200739
64233 200739 201910 203057 203942 205148 207058 209287 211175 212432 213218 213881 214615 215247 215474 215367 215434 216004 216814
64216 216814 217434 217807 218089 218226 218077 217761 217530 217379 217126 216812 216696 216878 217184 217466 217757 218041 218050 217425 216056
64197 216056 214222 212385 210906 209955 209667 210235 211856 214699 218971 224800 231928 239820 248330 257913 268721
64182 268721 279666 288958 295551 299508 300993 299598 295004 287756 278984 269718 260735 252649 245596 239049
64168 239049 232437 225879 219988 215027 210641 206394 202251 198474 195330 193019 191685 191281 191502 192000 192679
64153 192679 193657 194880 195947 196592 197290 199018 202199 206129 209714 212561 215025 217378 219458 221131 222602
64138 222602 224072 225392 226265 226531 226088 224802 222757 220521 218844 218005 217586 216975 216119 215659 216194 217500
64122 217500 218711 219315 219686 220538 222163 224436 227250 230623 234613 239511 245881 254013 263395 273001 281963
64107 281963 289730 295876 300245 303078 304625 304836 303946 303124 303893 306838 311337 316483 321787 327061 332202
64092 332202 337080 341202 343612 343697 341986 339517 336462 332158 326527 320610 315416 310953 306672 302177 297144
64077 297144 291261 284785 278667 273614 269335 265132 260893 257118 254240 252313 251145 250442 249955 249663 249667 249830
64061 249830 249818 249575 249482 249953 251166 253149 255681 258116 259804 260859 262027 263758 265899 268411 271721 276163
64045 276163 281609 287936 295283 303578 312333 321198 330274 339638 349079 358432 367487 375330 380617 382946
64031 382946 383283 382521 380366 376242 370618 364667 359167 354512 351289 349860 349600 349386 348818 348300 348038 347589
64015 347589 346354 343969 340247 335284 329637 323969 318510 313178 308090 303554 299635 296124 292894 289948
64001 289948 287130 284113 280711 277130 274056 272465 272911 274798 276767 278119 279484 281801 285062 288470
63987 288470 291436 294008 296670 300114 304879 310792 317065 323287 329872 337188 344827 352284 359760 367563
63973 367563 375209 381938 387831 393654 399944 406988 415399 425728 437669 450463 463989 478628 494270
63960 494270 510431 527362 546056 567080 590372 616385 646379 681161 720465 764240 813908
63949 813908 871703 939253 1017430 1107276 1210441 1328742 1463577 1615498 1783954 1967400
63939 1967400 2163866 2371482 2588561 2813373 3043706 3276167 3505730 3726198 3931285
63930 3931285 4115198 4272682 4399402 4492807 4552257 4577983 4570008 4528030 4451894 4342048 4200179
63919 4200179 4030053 3837593 3629655 3412448 3190923 2969118 2750530 2538068 2333997
63910 2333997 2140171 1958360 1790327 1637485 1500487 1379196 1273060 1181360 1103006 1036402
63900 1036402 979896 932343 892926 860475 833292 809662 788242 767954 747904 727656 707287
63889 707287 686934 666519 646198 626830 609546 594723 581742 569983 559860 552453 548133 546059
63877 546059 545288 546020 549280 555611 564620 575786 589095 604746 622752 643064 665697 690527 717347
63864 717347 746201 777108 809202 840810 870869 899759 928291 956360 983105 1007877 1030278
63853 1030278 1049613 1065084 1076417 1083704 1086794 1085454 1079977 1070862 1057967 1040632 1018711 992934
63841 992934 964211 933117 899993 865039 828375 790594 753182 717670 684284 652091 620539
63830 620539 590174 561646 534850 509413 485376 462901 441800 421974 403990 388596 375683
63819 375683 364161 352923 341746 331235 322095 314483 307975 302028 296412 291175 286440 282372 279191
63806 279191 276918 275160 273357 271252 268958 266630 264259 261701 258777 255492 252238 249539 247352 244949
63792 244949 241795 238266 235173 232799 230829 228942 227007 224898 222647 220691 219529 219157 219168 219224 219141 218758
63776 218758 218197 217939 218222 218604 218600 218414 218515 218882 219287 219879 220663 220844 219700 217862 216648 216218 215472 213745
63758 213745 211506 209319 207274 205672 205056 205142 204883 204084 203897 205066 206732 207777 208440 209695 211746 214141
63742 214141 216885 220402 224573 228609 231835 234155 235941 237805 240180 242762 244816 246320 248193 250941
63728 250941 253806 255985 258020 261035 265060 269202 273221 277807 283201 288584 293148 296969 300392 303144
63714 303144 304535 304238 302516 299894 296867 293773 290714 287596 284289 280725 276999 273514 270909 269600
63700 269600 269380 269684 270254 271362 273344 276080 279029 281685 283945 285983 287957 290003 292515 296046 300603
63685 300603 305292 309058 311655 313457 314559 314662 313827 312626 311433 310195 309041 308360 308037 307431 306600 306769
63669 306769 308844 312041 314758 316403 317581 318828 320055 321155 322271 323250 323417 322108 319122 314709 309491
63654 309491 304310 299616 295005 289843 284379 279730 276699 275086 274252 273889 273973 274393 274967 275604 276229 276703
63638 276703 277041 277567 278701 280656 283434 286962 291137 295811 300824 306005 311158 316194 321338 327068 333804
63623 333804 341763 351132 362142 374749 388360 402210 416110 430681 446737 464581 484080 505279
63611 505279 528539 554011 581310 609920 639683 670614 702420 734339 765125 792810 814822
63600 814822 829088 835313 835021 830366 823140 814677 806063 798102 791215 785325 779605 772464 762284 748276
63586 748276 730461 709129 684935 659343 634126 610094 586866 564126 542559 523310 507004
63575 507004 493633 482884 474285 467446 462489 459847 459405 460303 461866 464268 467988 473156 479779 488004
63561 488004 497601 507654 517363 526864 536839 547740 559872 573747 589680 607338 626406 647526
63549 647526 672005 700828 734575 773936 819134 868299 916831 958798 989242 1005764 1008871 1001227
63537 1001227 986312 967374 947214 928239 912087 899231 889294 881688 875719 870294 863961 855165
63525 855165 842298 823881 799373 769865 737563 704486 671782 639988 609402 580164 552406
63514 552406 526526 503086 482449 464628 449354 436072 424023 412664 402013 392352 383710 375841
63502 375841 368561 361801 355521 349833 345041 341274 338245 335670 333653 332286 331119 329539 327516 325535
63488 325535 323910 322690 322160 322787 324503 326542 328214 329582 331199 333438 336304 339728 343856 348930 354790
63473 354790 360539 365018 367748 369210 369972 369906 368551 365894 362356 358200 353472 348382 343240 338082 332863
63458 332863 328014 324354 322311 321580 321632 322240 323414 325123 327276 329831 332889 336736 341730 348001 355328
63443 355328 363456 372399 382344 393528 406464 422036 441033 463817 490727 522441 559163 599179
63431 599179 638528 672394 697120 711534 717088 716857 714038 711029 709531 710989 716568 727008 742814
63418 742814 764396 791744 824242 861044 901164 942734 982546 1017065 1043920 1062215 1071864 1073375
63406 1073375 1068162 1058381 1046274 1033829 1022663 1013414 1005198 996181 984754 969865 950595 926204
63394 926204 896797 863469 827744 791201 755340 721111 688563 657523 628616 602990 581061
63383 581061 562234 545913 532121 520915 511881 504473 498384 493378 489356 486788 486549 488985 493578
63370 493578 499817 507971 518666 532029 547544 564485 582300 600932 620995 643325 668151 695013
63358 695013 723630 754409 787782 823412 860434 898112 935688 971617 1003420 1028578 1045562
63347 1045562 1054104 1054802 1048862 1038306 1025994 1014647 1005316 996970 987804 976819 963932 948991 931262
63334 931262 909818 884077 854135 821045 786652 752635 719725 688225 659074 633710 612824
63323 612824 595940 582592 573445 569761 571587 576372 579387 576023 564397 546005 523869 500421 477230
63310 477230 455796 437381 422142 409307 398272 388891 380829 373560 367067 361711 357262 352933 348557
63297 348557 344853 342202 339955 337357 334407 331380 328224 325001 322259 320365 318890 317183 315138 312969
63283 312969 310693 308369 306481 305534 305439 305659 305702 305237 304110 302651 301608 301365 301505 301470 301302 301375 301727 302119
63265 302119 302494 302991 303692 304682 306097 307787 309211 310026 310544 311301 312428 313812 315611 318146 321390 324974
63249 324974 328681 332677 337264 342534 348223 353880 359347 365042 371478 378521 385645 392972 401524 412068
63235 412068 424197 436922 449830 463258 477700 493512 510954 529892 549464 568453 586136
63224 586136 602654 618552 634127 649197 663503 677320 691551 707002 723674 741017 758678
63213 758678 776522 793974 809966 823592 834343 841720 845218 844854 840974 833352 821201 804511 784744
63200 784744 763785 742689 721818 701507 682029 663499 646496 632350 622145 615678 611955 610379
63188 610379 610923 613469 617785 624101 633114 645356 660762 678708 698180 718234 738672 760054 782662
63175 782662 805762 828301 849945 870941 891297 910775 929508 947929 966048 983296 999032
63164 999032 1012672 1023287 1029563 1030458 1025702 1015578 1000313 979751 953636 922378 887502 851059
63152 851059 814536 778634 744041 711692 681995 654435 628470 604402 582930 564279 548223
63141 548223 534512 522712 512094 502327 493949 487499 482519 478018 473620 469534 465732 461976 458525
63128 458525 455972 454414 453495 453257 454129 456007 458112 460027 462244 465403 469472 473920 478278 482327 486142
63113 486142 490129 494682 499611 504252 508225 511781 515288 518732 521898 524768 527482 530059 532272 533758
63099 533758 534306 534222 534309 535213 536812 538402 539355 539384 538432 536830 535520 535565 537173 539446 541198 541861 541582 540794
63081 540794 539910 539304 539304 540053 541326 542569 543386 544043 545283 547531 550498 553672 556900 560359 564246 568716
63065 568716 573875 579727 586433 594660 605181 617887 631831 646648 663341 683128 706009 731151
63053 731151 758197 787395 818740 851889 886866 924052 963386 1004189 1045904 1088482 1131895
63042 1131895 1175731 1219375 1262275 1304052 1344637 1384255 1423010 1460725 1497514 1534136 1571258
63031 1571258 1608541 1644870 1679147 1710243 1736587 1756665 1769810 1775711 1773276 1760960 1738417 1707010
63019 1707010 1668482 1623866 1574031 1520640 1466029 1412410 1361368 1313790 1270136 1231019 1197529
63008 1197529 1170653 1150451 1136256 1127629 1124692 1127686 1136826 1152459 1174601 1202167 1233282 1266503
62996 1266503 1301293 1337420 1374682 1413209 1453149 1493803 1533838 1572669 1610931 1649292 1687433
62985 1687433 1724442 1759381 1791039 1817867 1838776 1853450 1861365 1861096 1851211 1831413 1802158 1763646
62973 1763646 1715991 1660280 1598767 1533899 1467501 1400857 1335135 1271526 1211046 1154244 1101209
62962 1101209 1052052 1007266 967281 931754 899716 870419 843541 818580 794804 771977 750491
62951 750491 730401 710972 691561 672398 654034 636575 619972 604500 590341 577074 564207
62940 564207 551897 540605 530318 520753 511999 504272 497231 490259 483384 477282 472313 468174 464523
62927 464523 461388 458775 456392 454018 451813 450006 448532 447143 445705 444266 442982 442039 441479 441067 440433
62912 440433 439345 437785 435848 433787 432036 430872 430005 428725 426551 423637 420552 417867 415942 414920
62898 414920 414737 415197 416078 417165 418304 419498 420923 422678 424485 425783 426177 425783 425127 424723 424720 424854 424732
62881 424732 424214 423481 422728 421892 420814 419655 418913 418829 418881 418129 416163 413549 411182 409382 407802 406058 404073
62864 404073 401865 399473 397227 395649 394815 394147 393166 392175 391878 392497 393603 394648 395358 395736 395971 396197 396186
62847 396186 395582 394700 394606 395888 397706 398704 398573 397984 397228 395839 393620 391212 389358 388273 387955 388437 389443
62830 389443 390367 390957 391535 392185 392248 391060 388874 386676 385348 385293 386534 388803 391654 394738 397870 400810
62814 400810 403343 405680 408383 411717 415401 419151 423010 426955 430654 434003 437547 441987 447489 453699
62800 453699 460159 466461 472398 478290 484943 492933 502121 512060 522567 533652 545285 557704 571746
62787 571746 588439 608280 631153 656836 685372 717062 752322 791461 834571 881740 933322
62776 933322 989607 1050154 1113884 1179946 1247949 1317009 1385048 1449525 1508584 1561096 1605867
62765 1605867 1641366 1666175 1679407 1680756 1670400 1648827 1616677 1574954 1525447 1470452 1411745
62754 1411745 1350099 1286132 1221280 1157494 1096201 1037966 982986 931453 883466 838950 797778
62743 797778 759848 725147 693817 666026 641659 620321 601728 585743 571926 559473 547903
62732 547903 537493 528722 521608 515879 511421 508102 505442 502960 500736 499246 498761 499235 500633 503024
62718 503024 506476 511106 517048 524117 531805 539908 549004 559930 573015 588130 605180 624209 645277
62705 645277 668755 695476 726103 760505 798325 839966 886353 937723 993351 1052738 1116466
62694 1116466 1185507 1259948 1338728 1420335 1503269 1585702 1665005 1737968 1801663 1854045 1893730
62683 1893730 1919513 1930488 1926524 1908145 1875903 1830380 1773068 1706699 1634298 1558114 1479683
62672 1479683 1400450 1321855 1245109 1171351 1101732 1036906 976686 920737 869438 823488 782756
62661 782756 746116 712542 681946 654766 631024 609949 590477 572144 555447 541098 528866
62650 528866 517599 506554 496155 486999 478662 470212 461579 453624 446996 441666 437526 434609 432544
62637 432544 430504 428009 425328 422855 420636 418688 417216 416137 414822 412791 410354 408166 406394 404767
62623 404767 403277 402267 401709 400861 399003 396477 394638 394649 396437 398997 401610 404432 407898 411902 415878
62608 415878 419439 422665 425826 429147 432886 437447 443360 451126 460984 472727 485950 500629 517296
62595 517296 536488 558208 582159 608315 636928 668007 701043 735192 769476 802827 834176
62584 834176 862615 887372 907615 922385 930802 932432 927526 916894 901399 881621 858105 831766
62572 831766 803640 774299 743901 712934 682496 653702 627117 602796 580460 559544 539632
62561 539632 521074 504700 490735 478543 467679 458485 451205 445174 439494 434033 429153 424874 421020
62548 421020 417830 415668 414335 413297 412407 411908 411876 412189 412752 413283 413258 412673 412435 413253 414552 415373 415970 417450
62530 417450 419952 422419 424364 426749 430690 436177 442635 450075 459102 470198 483448 498762 516081
62517 516081 535572 557738 583049 611442 642562 676445 713455 753542 796114 840621 886583
62506 886583 932840 977505 1019044 1056883 1090567 1118855 1140136 1153445 1158661 1156030 1145914 1128908
62494 1128908 1105989 1078655 1049011 1019304 991024 964587 940081 918068 899486 885011 874853
62483 874853 869004 867373 869659 875368 884044 895399 909029 923869 937979 949187 956186 958967 958094
62470 958094 953688 945143 931491 911927 886443 856380 823996 790968 757503 723234 688616 654903
62458 654903 623153 593935 567762 544956 525140 507641 492431 479978 470199 462310 455740 450410
62446 450410 446072 442253 439119 437513 437791 439352 441638 444787 448850 453183 457270 461516 466451 471565
62432 471565 475693 478273 479528 479547 477866 474098 468568 462193 455841 449778 443663 437193 430699 424873 419888
62417 419888 415220 410401 405509 400784 396271 392042 388333 385195 382452 380238 378986 378493 377643 375646 373145
62402 373145 371424 370862 370845 370944 371359 372238 373346 374658 376586 379216 381745 383222 383732 384428 386345 389454
62386 389454 392989 396461 400060 404188 408956 414276 420095 426283 432581 438971 445921 453815 462388 471228
62372 471228 480666 491462 503530 515728 527278 538846 551827 566954 584011 602584 622671 644786
62360 644786 669882 699047 732894 771268 813783 860499 911776 967535 1026830 1087999 1148878
62349 1148878 1206817 1258851 1302373 1335990 1359838 1374912 1381959 1381165 1372960 1358633 1339569 1315954
62337 1315954 1286807 1251497 1210932 1167260 1122818 1079443 1038190 999247 962305 927310 894819
62326 894819 865572 839873 817431 797543 779329 761954 744781 727276 708945 689651 669985
62315 669985 650930 633027 616042 599440 582961 566761 551347 537435 525652 516194 508747 502626
62303 502626 496969 491272 485981 482193 480340 479570 478883 478414 478895 480303 481900 483345 484810 486176 487143
62288 487143 488136 490048 492931 495997 499025 502658 507018 511196 514628 517960 521860 525921 529417 532314
62274 532314 534818 536666 537816 539234 542161 546957 553278 560909 569773 579630 590598 603662 620046
62261 620046 640362 664846 693893 727703 765901 808285 855593 908697 967289 1029973 1095168
62250 1095168 1160960 1224325 1281684 1330594 1370392 1401226 1423118 1436063 1440350 1436322 1424077 1403534
62238 1403534 1374739 1338158 1294840 1246116 1193039 1136508 1078176 1020727 966637 916875 871269
62227 871269 829852 793207 761632 734657 711542 691889 675656 662787 652876 645160 639048 634729
62215 634729 632890 633576 635721 638058 640093 641865 643246 644021 644339 644449 644188 643125 641043 637899 633615
62200 633615 628419 623108 618464 614517 610774 607001 603438 600482 598487 597619 597583 597864 598645 601017 605800
62185 605800 612529 620115 628105 636712 646016 655836 666058 676318 685575 692747 697736 701291 704124 706853
62171 706853 710666 717184 727525 741902 760167 782316 808595 839492 875399 915886 959538 1004906
62159 1004906 1051076 1096634 1138669 1173865 1200545 1218925 1229691 1233400 1231145 1224496 1214293 1200109
62147 1200109 1181121 1156868 1127170 1092319 1053757 1013848 974490 936465 900339 867219 838093
62136 838093 812984 791340 772916 757759 745561 735610 727352 720683 715660 712107 709498 707145 704611
62123 704611 702060 700250 700150 702505 707599 715294 725324 737498 751445 766130 779896 791049 798309
62110 798309 800940 799201 794859 790559 788073 787356 787312 786738 784229 778225 768199 755458 742057 729337
62096 729337 718082 709377 704146 702152 702464 704735 709089 714999 721453 728288 736332 746091 757058 768472
62082 768472 779967 791424 802958 815224 829036 844621 861875 881200 903189 927499 952968
62071 952968 978930 1005450 1032193 1058177 1083064 1107672 1132719 1158010 1183400 1209725 1237887
62060 1237887 1267456 1296783 1324105 1348033 1367438 1381520 1389967 1392774 1390136 1382716 1371668 1357964
62048 1357964 1341738 1322311 1298667 1270036 1236462 1198952 1158760 1116607 1072948 1028807 985610
62037 985610 944212 904669 866995 831415 797841 765877 735617 707765 682732 660216 639930
62026 639930 622077 606787 593605 581818 570861 560228 549551 539032 529312 520661 512694 504934
62014 504934 497180 489351 481558 474345 468200 462880 458063 454557 453742 455554 458191 460319 462533 466059
62000 466059 471058 476932 483367 490074 496220 501121 505134 509034 512869 516164 518856 521224 523090 523798
61986 523798 522884 520241 515842 509859 502881 495566 488210 480964 474154 468058 462701 458219 454952 452753
61972 452753 450710 448119 445342 443106 441368 439524 437387 435209 432888 429983 426580 423573 421852 421472
61958 421472 421704 421764 421589 421939 423498 425868 427947 429406 431186 434221 438362 443080 448561 455359 463503
61943 463503 472757 483481 496416 511802 529397 549155 571061 594404 618068 641610 665262 688764
61931 688764 710988 731067 749293 766438 782604 797191 809674 819936 827795 832579 833369 829692
61919 829692 821911 810988 797999 784028 770353 758294 748677 741728 737656 737056 740478 747857 758631
61906 758631 772261 788345 806326 825325 844168 861389 875372 884760 888882 887862 882453 873680
61894 873680 862267 848342 831919 813607 794454 775102 755634 736339 717947 700836 684665
61883 684665 669239 655148 642935 632073 621473 610769 600388 590488 580566 570225 559814 550107
61871 550107 541751 535164 530618 528129 527354 527810 529237 531735 535522 540565 546566 553446 561690 571986
61857 571986 584547 599081 615359 633485 653733 676528 702612 732634 766366 802694 840538
61846 840538 879415 919014 958668 997419 1034168 1067600 1096369 1119570 1136722 1147299 1150835 1147612
61834 1147612 1138790 1125743 1109787 1092540 1075774 1060659 1047801 1038131 1032856 1032238 1035406 1041834 1051983
61821 1051983 1065698 1080889 1094827 1106106 1114350 1118483 1116491 1106820 1089257 1064606 1034288 1000096
61809 1000096 963513 925189 885594 846014 808287 773612 742156 713675 687961 664773 643903
61798 643903 625388 609300 595443 583554 573552 565197 557825 550884 544445 538718 533339 527727 521923
61785 521923 516622 512566 510297 510015 511067 511897 511296 509515 507543 505590 503066 499871 496812 494648 493394
61770 493394 492721 492420 492274 491974 491387 490630 489854 489227 489093 489823 491499 493922 496766 499577 501900 503733 505512
61753 505512 507398 508986 510068 511142 512622 514011 514497 514001 512996 511633 509752 507465 505025 502366 499416
61738 499416 496648 494609 493191 491991 491116 490863 490909 490643 490080 489631 489230 488607 488251 489061 491079 493543 496153
61721 496153 499292 502918 506344 509359 512550 516164 519517 521957 523638 524932 525812 526278 526739 527452 527981
61706 527981 527576 525725 522169 516949 510777 504819 499740 495306 491126 487314 484169 481631 479355 477023
61692 477023 474431 471647 469188 467514 466200 464147 460822 456799 452853 449147 445704 443018 441543 440868
61678 440868 440013 438490 436610 434785 432938 430741 428178 425630 423408 421444 419594 418155 417644 417988 418320
61663 418320 417907 416876 415700 414380 412711 411021 409903 409298 408528 407289 406065 405469 405699 406714 408472
61648 408472 410820 413500 416347 419251 422035 424721 427779 431738 436588 441879 447166 451910 455265 456612
61634 456612 456187 454680 452390 449309 445722 441938 437649 432441 426830 421900 417951 414427 411258 409227
61620 409227 408717 409013 409258 409334 409388 409257 408837 408381 407940 407015 405239 402908 400391 397403 393349 388075 381900
61603 381900 375204 368326 361678 355600 350226 345552 341405 337307 332800 328042 323751 320429 317965 316104
61589 316104 314891 314397 314353 314275 313834 313017 312083 311334 310743 309953 308882 308061 307977 308280 308167 307305 305852 303826
61571 303826 301239 298754 297366 297253 297590 297643 297474 297432 297576 297782 297957 297965 297736 297469 297402 297444 297466 297681 298220 298583
61551 298583 298182 297238 296471 296191 296382 297318 299061 300700 301256 301204 301908 303651 305545 307369 309947 313336 316181
61534 316181 317561 318257 319453 321283 323335 325530 327693 329147 329567 329518 329526 329413 329119 329206 329779 329763 328195 325603
61516 325603 323243 321547 320091 318618 317294 316316 315815 315813 315909 315601 315170 315435 316204 316026 314167 311858 310701
61499 310701 310668 310631 310081 309275 308333 307336 306828 307155 307690 307717 307747 308902 311202 313438 314631 314834 314615 314558 315123
61480 315123 316321 317616 318721 320219 322671 325423 327066 327002 325936 324987 324872 325720 327051 328086 328616 329298
61464 329298 330631 332052 332691 332638 332663 333066 333592 334182 334888 335231 334591 333279 332368 332332 332595 332577 332534 333060 334300
61445 334300 335936 337651 339366 341140 342979 344795 346672 349087 352475 356555 360544 364186 367933 371881
61431 371881 375208 377233 378436 379830 381737 383709 385283 386336 387095 388211 390325 393152 395587 397154
61417 397154 398669 400933 403596 406016 408395 411044 413261 414095 413820 413527 413578 413439 412737 411459 409419 406579
61401 406579 403686 401573 399946 397842 395116 392491 390358 388558 387193 386459 385717 383909 381073 378400 376595
61386 376595 375216 373849 372903 372844 373447 374225 374941 375468 375769 376174 377086 378316 379437 380748 382982 385930 388356
61369 388356 389629 390550 392154 394476 396956 399327 401557 403552 405443 407625 410058 412129 413734 415901
61355 415901 419628 424521 429357 433841 439042 446020 454658 464073 473746 483805 494342 504819 514337
61342 514337 522321 528740 533771 537561 540439 543077 546152 549836 553596 556438 557485 556693 554943 553040
61328 553040 550685 546974 541899 536682 532464 529431 527441 526552 526366 525789 524303 522857 522646 523538 524541
61313 524541 525333 526423 528219 530955 535192 541353 548838 556593 564520 573558 584381 596770 610152 623903
61299 623903 637009 648075 655850 659503 658790 654573 648821 643270 638132 632617 626298 619234 611257 602214
61285 602214 592736 583787 575569 567763 560612 554745 550027 545669 541503 538195 536160 535237 535502 537384 540782
61270 540782 544932 549337 554040 558857 563185 566753 569913 573093 576642 581178 587356 595334 605145 617307
61256 617307 632097 648330 663946 677765 689746 699675 706915 711554 714541 716327 716450 714741 711898
61243 711898 708458 704178 698803 692632 686080 679510 673707 669506 666673 664011 660726 656849 652366 647196
61229 647196 642194 638811 637375 636886 636895 638222 641210 644631 647188 649011 650834 652730 654565 656772 659729
61214 659729 663068 666440 670305 675195 680759 686179 690912 694475 696365 696880 697300 698492 699999 701186 702510
61199 702510 704910 708655 713691 720513 729724 741188 754453 769625 786981 805937 825054 842873
61187 842873 858321 870760 880248 887440 892782 896153 897650 898083 898142 897626 896055 893470 889972 885028 878024
61172 878024 869199 859374 849084 838537 828105 818091 808147 797476 785604 772679 759161 745442
61160 745442 731590 717355 702694 688256 674889 662746 651469 641228 632771 626455 622127 620098
61148 620098 621095 624908 630089 635396 640433 644397 645508 642632 636564 628813 619893 609768 599212 589727
61134 589727 582483 578054 576539 577220 578688 580190 582469 586655 592848 600381 608895 618512 629481 642230
61120 642230 657142 673769 690956 708316 726777 747107 768814 791225 814623 839339 864563
61109 864563 889140 912863 936012 958267 979073 998446 1016434 1032388 1045707 1056614 1065191 1070295
61097 1070295 1070530 1065725 1056493 1043043 1025614 1005446 983983 961494 937606 912744 887921 863525
61085 863525 839446 816003 793610 771964 750716 730535 712351 696026 680999 667766 657307
61074 657307 649307 642334 635615 629420 623837 618565 613898 610675 609112 608643 608894 609888 611446 613414 616301
61059 616301 620748 626507 632857 639675 647161 654975 662858 671726 682860 696210 710711 725915 742092
61046 742092 759070 776489 794999 815782 838889 863342 888788 915685 944045 973319 1003496
61035 1003496 1035007 1067632 1100841 1135087 1171485 1210348 1251339 1294706 1340901 1389282 1438646
61024 1438646 1488625 1539051 1588699 1636838 1685639 1738932 1798932 1866409 1943390 2032652 2134401
61013 2134401 2246396 2367823 2500670 2647821 2813672 3007311 3241492 3527703 3876084
61004 3876084 4300979 4822127 5459687 6234402 7175664 8324423 9727795 11440439 13526941
60995 13526941 16020274 18818763 21604865 23912567 25352785 25831231 25575596 24971544
60987 24971544 24379725 24066767 24203721 24814423 25683076 26364863 26379186 25464895 23692105
60978 23692105 21361961 18816047 16311416 14001042 11960698 10211681 8738452 7509561
60970 7509561 6492546 5655996 4968542 4402850 3938569 3558661 3245510 2982911 2759322
60961 2759322 2566657 2397808 2247437 2113328 1994586 1889473 1796345 1715085 1645784 1587157
60951 1587157 1537772 1497438 1465513 1438872 1413459 1387298 1360546 1333439 1305973 1279123 1254523
60940 1254523 1232863 1213736 1196826 1182034 1168666 1155740 1143078 1131156 1120088 1109744 1100612
60929 1100612 1093362 1087683 1082697 1078493 1076119 1075946 1077150 1078988 1081519 1084768 1088213 1091530 1094974 1098497
60915 1098497 1101184 1102118 1101263 1099030 1095504 1090586 1084445 1077312 1069165 1060024 1050212 1039911 1028814 1016702
60901 1016702 1004037 991451 978846 965585 951517 937270 923401 909675 895382 880176 864466
60890 864466 849099 834744 821462 808804 796307 783906 771883 760509 749772 739294 728479
60879 728479 716897 704666 692370 680547 669460 659380 650760 643754 637786 631967 625935 620038 614745
60866 614745 610134 605935 601809 597541 593172 589031 585524 582848 580868 579085 576628 572660 567096 560776
60852 560776 554602 548739 542991 537653 533362 530221 527714 525459 523429 521347 518593 514998 511116 507418
60838 507418 503707 499631 495190 490319 484544 477650 470328 463594 457797 452695 448194 444530 441895 440326
60824 440326 439791 439986 440301 440401 440630 441432 442680 444053 445727 448050 450784 453351 455721 458277 460846 462592
60808 462592 463058 462710 462241 461790 461074 459905 458422 457028 456119 455670 455194 454451 453952 454233 454815 454529 452841
60791 452841 450227 447261 444047 440630 437234 433778 429810 425250 420743 416905 413654 410492 407064 403273
60777 403273 399327 395844 393328 391334 388748 385236 381808 379557 378446 377809 377434 377484 377845 378376 379537 381908
60761 381908 385077 387737 389073 389573 390291 391718 393599 395533 397429 399412 401476 403424 405299 407791 411808
60746 411808 417455 423741 429558 434696 439469 443606 446055 446009 443631 439662 434696 429086 423218 417405 411554
60731 411554 405301 398583 391856 385616 379936 374687 370010 366231 363315 360782 358212 355574 352971 350466
60717 350466 348298 346830 345955 344967 343449 341929 341114 340712 339688 337628 335234 333395 332360 331924 331912 332214
60701 332214 332747 333575 334810 336262 337537 338597 339847 341514 343296 344801 346059 347402 349136 351460 354416
60686 354416 357679 360620 362781 364263 365636 367668 371019 375877 381752 387899 393995 400196 406589 412943
60672 412943 418962 424494 429450 433887 438078 442038 444979 445745 443981 440509 436490 432631 429177 426076
60658 426076 422930 419337 415552 412450 410533 409396 408407 407505 407032 407126 407628 408317 408922 409131 408871 408403 407963
60641 407963 407416 406351 404398 401390 397416 392796 387873 382943 378515 375266 373308 371796 369913 368000
60627 368000 366984 366863 366733 366357 366615 368039 369849 370992 371371 371477 371540 371685 372299 373513 374754 375428 375730
60610 375730 376258 377245 378661 380598 382929 384976 386177 386823 387526 388273 388619 388546 388411 388187 387481 386367 385649
60593 385649 386117 387854 390290 392637 394322 395271 395826 396309 396844 397663 399152 401292 403364 404598 404956 404994
60577 404994 405294 406280 408296 411375 415132 419257 424028 430044 437670 446975 457963 470556 484592 500174
60563 500174 517751 537409 558118 577913 594790 607441 615506 619324 619259 615151 606824 595163 582146
60550 582146 569613 558506 549445 543274 540478 540637 543015 547266 553154 560240 568551 579142 593295
60537 593295 611469 633510 659334 688589 719945 751519 781764 809261 831932 847471 854738 854226
60525 854226 847270 835377 820227 803556 786746 770747 756226 743354 731589 720182 708933 698225
60513 698225 688657 681037 676315 674808 675700 677949 681469 686828 694053 702584 712428 724647 740602 761305
60499 761305 787507 819803 858488 903683 955545 1013913 1077889 1146257 1218016 1291721 1364487
60488 1364487 1432635 1493560 1546183 1589341 1620554 1636940 1636917 1620689 1589502 1544854 1488192 1421114
60476 1421114 1345936 1266020 1185097 1106173 1031347 962429 900908 846989 799394 756710 718668
60465 718668 685701 657578 633082 611001 590930 572978 557045 542702 529670 518084 508105 499475
60453 499475 491737 484812 478966 474120 469593 464813 459951 455545 451800 448651 446264 444982 444733 444907 444890
60438 444890 444502 443927 443386 442916 442348 441569 440827 440610 441107 441910 442262 441439 439070 435591 432386 430817 430821 430984
60420 430984 430250 428927 427739 426699 425572 424771 424922 425881 426979 427930 428775 429229 428944 428278 428009 428276 428452
60403 428452 428073 427335 426753 426886 428235 430723 433334 434908 435369 435596 436136 436773 437433 438736 441266 444687
60387 444687 447966 450312 451805 453230 455371 458329 461605 464814 468040 471311 474195 476266 477630 478619
60373 478619 479317 479769 480326 481288 482545 483962 485741 487948 490105 491773 493116 494349 495137 495241 495271 496050
60357 496050 497555 499205 500874 503020 506197 511014 517982 526677 535704 544396 553708 564362 574906 583145
60343 583145 588875 593445 596898 597470 594130 587831 579849 570541 560382 550708 542537 535715 529913 525424
60329 525424 522247 519425 516110 512538 509309 506462 503911 501954 500617 499180 497090 494774 492958 491813
60315 491813 491430 492476 495498 499959 504778 509637 515162 522049 530594 541030 553811 569461 588373
60302 588373 610810 636941 666560 698239 728557 753002 768614 775584 775516 768549 753451 730462
60290 730462 702554 673432 645464 620001 598282 580774 566394 553566 541892 532133 524864 519782
60278 519782 516089 513031 510110 507125 503940 500301 496176 492219 489232 487152 485198 483033 480979 479018
60264 479018 476573 473665 471352 470460 470638 471122 471712 472449 473038 473273 473442 473742 473768 473089 471878 470534 469214
60247 469214 468172 467937 468652 469746 470717 471736 473052 474350 475174 475483 475402 474943 474391 474357 475078 476185 477475
60230 477475 479183 481174 482758 483857 485487 488340 491665 494314 496200 497920 499582 500946 502245 503959
60216 503959 506135 508698 512067 516615 521826 526759 531119 535203 539132 542877 546865 551755 557572 563564
60202 563564 568909 573246 576747 579982 583456 586996 589952 592197 594356 596702 598512 599060 598614 597795 596533
60187 596533 594412 591569 588516 585464 582433 579643 577139 574470 571428 568617 566586 564841 562551 559878
60173 559878 557751 556604 556158 556186 556614 556991 556732 555836 554698 553254 551039 548069 545023 542509 540710 539764
60157 539764 539912 541149 543097 545296 547412 549320 551200 553347 555691 557860 559913 562499 565900 569437
60143 569437 572336 574731 577294 580359 583932 588118 592917 597968 603141 608930 615657 622703 629187 634966
60129 634966 640281 644848 648130 650189 651437 651826 651134 649803 648638 647742 646540 644791 642928 641457 640652
60114 640652 640729 641649 642840 643742 644601 646175 648709 651657 654290 656079 656629 655800 653856 651134 647723 643716
60098 643716 639438 635077 630546 626115 622674 620807 620088 619856 620164 621298 622977 624845 627268 630774 635013
60083 635013 639134 642892 646616 650365 653815 656654 658355 658009 655185 650597 645170 638943 631687 623974
60069 623974 616567 609267 601480 593519 586122 579102 571745 564269 557499 551308 544816 538086 532153 527251
60055 527251 522483 517479 513019 509613 506755 504124 502378 502105 502890 503983 505134 506406 507901 510017 513148
60040 513148 516796 519773 521618 523118 525115 527583 530141 532576 534504 535326 535004 534189 533192 531485 528549
60025 528549 524532 519755 514322 508518 502826 497120 490635 483250 476095 470378 466208 463057 460700 459042
60011 459042 457627 456030 454436 453163 451848 449657 446294 442454 439248 437275 436131 434814 432796 430648
59997 430648 429339 429131 429614 430585 432227 434409 436510 438114 439372 440595 442038 444103 447126 450849 454604
59982 454604 458063 461198 463591 464603 464365 463825 463587 463355 462696 461670 460471 459135 457864 456995 456436 455754
59966 455754 455000 454780 455320 456210 457283 458945 461285 463721 465965 468534 471692 474553 476003 476100 475900 476146
59950 476146 476643 476772 476219 475259 474489 474216 474100 473644 472875 472156 471477 470567 469574 468910 468399 467447 466211 465752
59932 465752 466695 468516 470496 472623 475154 478005 481061 484456 488103 491497 494493 497702 501638 506001
59918 506001 510289 514678 519717 525519 531696 537789 543397 548221 552300 555899 558898 560664 560801 559570
59904 559570 557388 554458 551191 548356 546309 544564 542663 541054 540506 540943 541505 541685 541897 542870 544822 547321
59888 547321 549807 552164 554781 558003 561714 565663 570013 575195 581297 588029 595157 602507 609599 615801
59874 615801 620927 625226 628751 631197 632302 631960 629994 626387 621683 616633 611460 606008 600461 595224
59860 595224 590228 585181 580498 577086 575031 573312 571102 568781 567467 568082 570911 575470 580851 586817
59846 586817 594441 604803 617082 628737 637539 642708 644403 643415 641412 640145 640116 640969 643063 647081
59832 647081 651861 654388 652760 647872 641527 634364 626566 619061 612592 606538 600051 593570 587948 582750
59818 582750 576808 570152 564133 559714 556611 554025 551407 548522 545415 542364 539450 536314 532631 528565
59804 528565 524526 520864 517979 516172 515116 514113 513120 512734 512775 511814 508815 504519 500507 497554 495622
59789 495622 494728 494922 495801 496862 498104 499701 501409 502814 503823 504473 504647 504407 504154 504087 504012 503982 504498 505642
59771 505642 506705 507125 507184 507323 507504 507696 508284 509425 510678 511662 512409 512738 512279 511541 511860 513656 515850
59754 515850 517690 519928 523228 526682 529240 531601 535187 539928 544450 547979 550773 553127 555247 557813
59740 557813 561395 565379 568468 570140 570886 571333 571915 572992 574421 575382 575400 575072 575031 574815 573669 571868 570208
59723 570208 568796 567328 565959 564800 563208 560763 558383 557195 556812 556115 555178 554887 554992 554240 552463 550965
59707 550965 550693 551356 552506 554200 556260 558073 559474 560843 562149 562861 562986 563223 563873 564496 564835 565209
59691 565209 565742 566085 566128 566215 566437 566408 565963 565467 565268 565417 565965 566992 568292 569484 570249 570065 568098 564070
59673 564070 558902 553731 548670 543323 538028 533494 529558 525479 521299 517780 515166 513189 512111 512438
59659 512438 513543 513952 513257 512517 512497 512768 512986 513896 516392 520378 525103 529940 534347 537764 539991 541228
59643 541228 541476 540401 538016 534926 531711 528525 525358 522153 518710 515049 511875 509986 509240 508710 507828
59628 507828 506697 505439 504045 502855 502270 501881 500692 498364 495527 492805 490219 487551 484551 480782 476024
59613 476024 470944 466687 463821 462310 462286 463867 466335 468564 470428 472827 476137 479540 482098 483646 484471
59598 484471 484924 485502 486527 487576 487960 487857 488135 489024 489841 490087 489922 489436 488445 487256 486700 487056 487675 487868
59580 487868 487513 486690 485508 484365 483535 482478 480395 477502 474786 472562 470418 468614 468116 468889 469431 468633
59564 468633 467041 465731 464949 464512 464595 465392 466641 468034 469477 470544 470534 469566 468914 469712 471918 474899 478256
59547 478256 481711 485021 488531 493063 498779 504913 511134 518367 527724 539505 554031 572530 595771
59534 595771 621693 645169 660578 664957 659371 647769 634356 621629 610583 602031 596819 594907
59522 594907 595260 596971 599805 603477 607226 610392 612691 613566 612034 607644 601029 593124 584376 575028 565637
59507 565637 556809 548724 541136 533635 525940 518276 511366 505605 500546 495744 491677 488958 486982 484488
59493 484488 481318 478526 476769 475753 475191 475029 474653 473261 471292 470193 470427 470957 471038 471203 472087 473661
59477 473661 476104 479983 484897 489341 492764 496437 501358 506554 510570 513460 516103 518520 520239 521660
59463 521660 523703 526468 529276 531756 534064 536404 539100 542841 548165 554926 562740 571489 580944 590442
59449 590442 599468 608045 616144 623223 628771 632624 634434 633626 630318 625418 619369 611749 602748 593900
59435 593900 586409 579699 572668 565631 559861 555818 553026 551336 551107 552263 554264 557142 561822 569194
59421 569194 579299 591434 604789 619053 634624 652069 671246 691282 711684 733263 757725
59410 757725 786065 816509 843327 858627 857328 841248 817704 793960 773571 757380 746023 740758
59398 740758 743056 753574 769971 785304 790737 781660 760685 734165 707019 681549 659124 640722
59386 640722 626238 614782 605661 598392 592419 587633 584593 583502 583599 584180 585322 586913 588051 588376 589051
59371 589051 591398 595358 600241 605962 612439 618669 623803 628456 633747 639640 645395 651063 657282 664033
59357 664033 670732 677215 683683 690088 696430 703187 710658 718588 727168 737509 750083 763578 776508
59344 776508 789126 802503 816492 830035 842847 855169 866197 874288 878739 880163 879183 875807 870061
59331 870061 862332 853004 842267 829987 815506 798379 779983 763290 750092 739306 729002 719038
59319 719038 710390 702964 695758 688578 682039 676317 671316 667510 665171 663303 660838 658464 657637 658202 658616
59304 658616 658335 658422 660004 663593 669911 679943 694045 711762 731888 751351 764912 768042 760302
59291 760302 744692 724235 700855 676939 655411 637639 622944 610637 601078 594455 590085 587423
59279 587423 586497 587090 588760 591834 597037 603944 611234 618658 627329 637736 648994 660434 672430 685047
59265 685047 697204 707850 716872 724345 729998 733887 736392 737053 734603 728772 720979 712626 703801 694286
59251 694286 684744 675990 667909 659983 652361 645715 640491 636832 634794 634203 634669 636078 638748 642858 648034
59236 648034 653561 658739 663236 667509 672575 678728 684729 689019 691399 692712 693244 692514 690418 687396 683521
59221 683521 678475 672485 666268 660173 654412 649923 647679 647051 646155 643982 641088 638116 634935 631457 628016
59206 628016 624558 620594 616274 612405 609102 605564 601537 597876 595257 593432 592141 591664 591908 591982 591232
59191 591232 589942 588584 587275 586307 586296 587336 588817 590360 592150 594066 595556 596760 598791 602354 606910
59176 606910 611646 616435 621342 626025 630279 634610 639766 646049 653345 661379 669834 678638 688086 698164
59162 698164 708022 716830 724786 732224 738115 740823 740363 738442 736036 732254 725963 717287 707020 695767
59148 695767 684208 673181 662925 653088 643747 635440 627945 620188 611818 603663 596126 588355 579773
59135 579773 571412 564791 560213 556872 554068 551604 549464 547734 546562 545892 545576 545774 546822 548788 551755
59120 551755 556346 563078 571316 579785 588119 597015 607017 618201 630829 644977 659502 672721 684293
59107 684293 695187 705746 715221 723346 730793 737628 742893 746219 748472 750155 750543 749047 746152 742358
59093 742358 737447 731516 725580 720437 715972 712129 709425 707852 706382 704175 701266 697594 692659 686709
59079 686709 680956 675869 670408 663595 655714 647373 638775 630605 624172 619680 615652 611073 606854 604072
59065 604072 602028 599335 595913 592602 589587 586525 583625 581396 579724 578087 576291 574245 571524 567904
59051 567904 563932 560420 557860 556671 557213 559049 560827 561440 560801 559359 557711 556751 557120 558198 558736 558642
59035 558642 558911 559687 560034 559979 560956 563463 566082 567910 570336 575168 582270 590336 598791 607736 617101 627098
59019 627098 638535 651617 665232 678213 690228 700703 708239 712168 713373 712596 709361 703741 697672
59006 697672 692908 688985 684753 680822 678813 679154 681248 684986 690418 696626 702496 708062 713743 718867
58992 718867 722400 724554 726309 727866 728811 729204 729201 728136 725236 720757 715398 709297 702793 697324 694161
58977 694161 692790 691889 691363 692178 694760 698921 704872 712948 722613 732883 743372 754012 764373 774364
58963 774364 784918 796758 809039 820427 830970 841646 852499 862382 870116 874817 875611 872185 865289
58950 865289 855748 843494 828404 811448 793997 776670 759745 743862 729264 715248 701484 689061
58938 689061 679101 671259 664721 659602 656009 652856 649262 646159 644833 644677 644192 643395 643293 643497 642468
58923 642468 639874 636920 634371 631885 629206 626488 623521 620092 617007 615402 615126 615101 615134 616083 618277 621046
58907 621046 623738 626206 628522 631285 635882 643396 653506 665291 678418 692527 706339 718812 730588
58894 730588 742931 755834 768637 781855 796776 813640 831793 851239 872468 895039 917875
58883 917875 940639 963339 984747 1002755 1016261 1025552 1031099 1033114 1031874 1027182 1017945 1003645 985845
58870 985845 967001 948239 929485 911094 893946 878508 865168 854720 846979 839716 830763 820586
58858 820586 811119 802762 794370 785483 776468 766938 756165 744759 733965 723601 712737 702129 693808
58845 693808 688277 684030 679747 675080 669517 662594 655167 648453 641879 633950 625082 617246 610787 603993
58831 603993 596211 589012 583675 579663 576299 573981 572883 572203 571562 571706 573186 575625 578711 582596 586985
58816 586985 591198 595321 599931 604593 608177 610742 613431 616415 618701 620117 621615 623307 624068 623588 622964
58801 622964 622672 621640 619018 615327 611253 606714 601696 596694 591789 586566 581311 577000 573805 570880
58787 570880 567879 565437 563975 563339 563686 565352 567851 570412 573440 577904 583401 588463 592703 596858 600800
58772 600800 603425 604526 604772 603782 600288 594429 587850 581303 574309 567391 562215 558882 555355 550467 545522
58757 545522 542092 540135 539179 539486 541079 543173 545448 548419 551952 554936 556980 558886 561019 562862 564635
58742 564635 567579 572107 577404 583296 590646 599411 608207 616378 624681 633390 641719 649683 658489 668331
58728 668331 677827 686367 694973 703967 711852 717544 721852 725782 729182 732008 735148 739051 743259 748108
58714 748108 755017 764117 773489 781656 788997 795797 800894 803416 804004 803079 799597 792766 783373 772287
58700 772287 759112 743403 725773 706880 686742 665849 645452 626063 607263 589485 574180
58689 574180 561628 550585 540703 533158 528092 523724 518943 514576 511064 507203 502402 497943 494733 491971
58675 491971 489305 488051 488798 490018 490603 491757 494860 499497 505119 512574 522295 532954 543672 555670
58661 555670 569967 585123 598901 610381 618911 622999 622179 618364 613527 607549 599922 591803 584579
58648 584579 577965 571242 564985 559996 555944 552454 549965 548261 545989 542936 540812 540334 539746 537897 536577
58633 536577 537825 540970 544304 547672 551287 553952 554796 555069 556079 557018 556953 557158 559056 561446 562259 561778
58617 561778 561855 563250 565884 570423 577308 585286 592907 600327 607833 614000 617287 618133 617615 615564 612047
58602 612047 609100 608668 609966 610922 610899 610075 607621 602786 596607 590535 584572 578610 574121 572480 572968 574363
58586 574363 576987 581303 586214 590929 596893 605560 615782 625596 635022 644864 654397 662624 670288 678315
58572 678315 685810 691910 697925 705278 713090 720318 728468 739528 753015 767846 785258 806787 830991
58559 830991 855389 880116 906361 932522 955329 973742 988535 999131 1004227 1004760 1003028 999492
58547 999492 993377 985590 977961 970272 961040 950569 940297 929795 917248 902304 885759 867308
58535 867308 846435 824652 804017 784315 764561 746241 731920 721510 713015 706190 702334 701255
58523 701255 701634 703670 708194 713868 718420 722009 726163 730141 731707 730941 729920 729067 727105 724167 721679
58508 721679 719505 716382 712770 710080 707600 703480 698235 693892 690167 685060 678917 674257 671600 668962
58494 668962 665501 662307 659553 656219 652766 650899 650638 650694 651587 655174 661179 667437 673513 680862 689633
58479 689633 698720 708836 721934 737441 752469 765911 778882 790988 799728 804069 805303 803945
58467 803945 799014 790854 781613 772470 763176 754440 747789 742988 738593 735050 734234 736036 738569 741680
58453 741680 747039 754816 763454 772493 782309 791305 796914 799295 800542 800516 797202 791106 785333 781122 777081
58438 777081 773001 770534 769804 769140 768555 769719 772253 773864 774541 776798 781376 786502 791763 798809 807762
58423 807762 816835 825973 836925 849105 859256 865866 870226 872707 871916 868102 863455 858396 851341 842606
58409 842606 834652 828011 820918 813342 807304 802807 797633 791667 787301 785065 783097 781287 781537 783515
58395 783515 784738 785370 788229 793482 798123 801361 805487 810600 813690 814158 815122 817850 819884 820177 821127
58380 821127 823853 826184 827072 828509 831471 834448 837416 842687 850394 857704 863835 871284 880835 890162
58366 890162 898538 907899 918029 925952 931609 938803 948898 958847 967126 976130 986841 996631 1004450
58353 1004450 1012836 1022610 1030741 1035656 1039591 1043769 1046485 1047836 1050915 1056328 1061054 1064593 1070542 1080059
58339 1080059 1089723 1098088 1108350 1122161 1136833 1151120 1167607 1186797 1204995 1220750 1237150 1255028
58327 1255028 1270329 1281145 1290840 1301076 1308358 1310927 1312595 1316203 1319507 1321032 1323527 1328168 1331851
58314 1331851 1333867 1338645 1348199 1358521 1367208 1377746 1392244 1406872 1418852 1431215 1446368 1461726
58302 1461726 1475950 1492588 1513102 1533285 1550951 1570036 1592639 1614370 1632297 1650074 1670441
58291 1670441 1690182 1707484 1726498 1749473 1772157 1792243 1814316 1841038 1867699 1891283 1916482
58280 1916482 1946768 1977974 2006970 2037952 2073602 2108881 2140581 2174188 2214022 2255439 2294300
58269 2294300 2335174 2382315 2431417 2478514 2528151 2584416 2642736 2699039 2758119 2824222 2892360
58258 2892360 2957739 3024597 3096704 3168517 3235091 3301353 3372203 3443202 3510674 3580958 3659589
58247 3659589 3741565 3822485 3908663 4005685 4108076 4211312 4322591 4448148 4581714 4717596
58237 4717596 4862920 5024252 5194661 5367355 5549281 5747487 5955509 6167887 6394273
58228 6394273 6643775 6909531 7184835 7479671 7804349 8152342 8517458 8912002 9348704
58219 9348704 9821165 10322447 10866003 11466911 12120488 12822352 13591096 14447133 15388963
58210 15388963 16416232 17555735 18837755 20269725 21863555 23665616 25728391 28079246
58202 28079246 30753400 33831861 37412584 41580438 46453388 52228839 59143028 67430546
58194 67430546 77382874 89403398 103941794 121426152 142334065 167275677 196931940
58187 196931940 231949646 272763473 318846684 367269932 411853894 444643245 459449760
58180 459449760 454764028 433658862 401265812 362402714 320847222 279578727 240848099
58173 240848099 206001036 175545624 149476719 127508900 109159839 93868191 81136621
58166 81136621 70552924 61729884 54314481 48045118 42735861 38214100 34321764 30956652
58158 30956652 28056034 25545403 23342738 21398445 19688153 18174744 16813248 15582742
58150 15582742 14478618 13481820 12566549 11728750 10976412 10299553 9677410 9106674 8595280
58141 8595280 8135823 7711222 7319688 6968809 6650677 6346733 6052323 5774573 5511377
58132 5511377 5254149 5006661 4780251 4573917 4377939 4192771 4025771 3873592 3726085
58123 3726085 3583845 3454449 3335217 3216912 3100966 2996197 2901644 2808952 2718689 2638221
58113 2638221 2566068 2494003 2422480 2358762 2301684 2242961 2182020 2125372 2072713 2017575 1960567
58102 1960567 1908615 1861822 1813851 1764523 1719708 1679487 1638460 1597181 1561547 1531274 1500204
58091 1500204 1467623 1438517 1413083 1386561 1359053 1335276 1315033 1293811 1272186 1254776 1240478
58080 1240478 1223344 1202588 1182319 1162251 1138336 1111996 1089060 1069694 1048643 1025234 1004103
58069 1004103 986169 967808 948920 933130 920049 905809 891086 880174 872328 862515 850630 841430
58057 841430 835334 827746 817742 809015 801767 791955 779280 767988 758984 748850 737373 728401 722412
58044 722412 715699 707751 702077 698760 693508 685230 677624 672182 666323 659398 653811 649216 642273 633189
58030 633189 625995 621296 615234 606596 598475 591686 583057 571727 561067 552818 545011 536969 530714 526231
58016 526231 520810 514190 509043 505600 501318 496541 494661 495778 495920 493618 491616 491128 490083 488124 487558
58001 487558 488093 486308 481791 478414 478095 478553 478468 479493 481723 482519 481337 480701 481030 479589 475950 473304
57985 473304 472894 472131 469635 467093 464707 460027 452977 446993 443412 439560 434061 429127 425895 422373 417867
57970 417867 414644 413302 411197 407414 404619 403984 402907 399888 397198 396529 396269 395287 395186 396689 397832
57955 397832 397799 398469 400137 399838 396087 391399 388021 385101 382066 380758 381943 383437 383985 385497 389391
57940 389391 394300 399330 405915 414453 422716 429611 437098 446574 456931 467817 480813 495443 508041
57927 508041 516829 524271 532180 538370 540653 540370 539276 536464 531067 524711 518584 511184 501503 491401
57913 491401 482438 473482 463847 455595 450126 445567 440168 435364 432815 431266 428940 426322 423980 420309
57899 420309 414107 407026 401034 395761 390470 386145 383451 381133 378606 377555 378910 380958 382497 385008
57885 385008 389452 393804 396256 398080 400783 403170 403857 404094 405322 406312 405437 403508 401823 399653 396252
57870 396252 393065 391322 389609 386400 382872 380672 379016 376629 374479 373993 374416 374459 374731 376124 377727
57855 377727 378710 380363 383875 387944 390943 393509 396681 399447 400565 400839 401225 400691 398467 396339 396027
57840 396027 396126 394305 390759 386914 382525 376828 370964 366435 362555 357941 353160 349450 346350 343006 340356
57825 340356 339571 339771 339643 339816 341309 343295 344842 347174 351556 356581 360248 363180 366978 370827 372631
57810 372631 372254 370776 367753 362163 355088 348565 342619 336168 330038 326269 324958 324430 324067 324588 325982
57795 325982 327458 329045 331194 333319 334663 335956 338400 341730 344978 348164 351500 354115 355473 356745
57781 356745 358715 359713 357995 354947 353445 354020 355165 356404 358399 360638 361634 361180 360322 359494 358483 357581
57765 357581 356928 355499 352517 348907 345529 341226 334821 327811 322613 319079 315254 310819 307303 305417
57751 305417 304532 304411 305311 306773 308255 310427 314055 318312 321940 325125 328472 331304 332961 334504 336913
57736 336913 338900 338943 338216 338831 340302 340585 339680 339211 339168 338129 336280 335243 335108 334441 333091 332322 332213
57719 332213 331480 329863 328258 326579 323836 320232 316866 313582 309461 305166 302291 300540 298074 294614
57705 294614 291655 289601 287179 283925 280833 278301 275653 272905 270836 269101 266413 262825 259794 257919
57691 257919 256548 255612 255726 256462 256638 256397 257014 258681 260562 262839 266486 271092 275258 279236 284931 293276
57675 293276 303898 317378 335358 358212 385099 416722 455617 503355 559998 626660 705296
57664 705296 793708 881852 954380 996870 1001253 968706 908899 834831 756846 681091 611764 551888
57652 551888 501877 459996 425029 396854 374470 355803 339876 327146 317358 309147 302035 296616
57640 296616 292444 288017 283351 280288 279603 279966 280352 281249 282670 283312 282745 282381 283117 283872 283618 283078 283204
57623 283204 283427 282633 280713 278190 275360 272512 270023 267775 265440 263484 262593 262092 260460 257621 255082
57608 255082 253621 252453 250903 249181 247295 244949 242807 242055 242397 242204 240841 239110 237327 235054 232815
57593 232815 231759 231287 229389 225869 222836 221355 220068 217968 216060 215091 213969 211812 209501 207835 205990
57578 205990 203178 200174 197930 196217 194720 193830 193285 191731 188811 186072 184704 183970 182929 182010 181648
57563 181648 181050 179629 178171 177356 176503 174955 173277 171998 170665 169240 168846 169929 171199 171661 172169 173698
57547 173698 175576 176835 177903 179497 181091 181849 182025 182286 182764 183862 186585 190921 195192 198262 201051
57532 201051 204660 208399 211057 212758 214050 214396 213126 210866 208626 206400 203982 202081 201262 200727 199535
57517 199535 198095 197138 196153 194266 191861 190043 189188 189163 190168 192202 194442 196254 198058 200229 202087
57502 202087 202980 203510 204602 206199 207789 209303 210574 210940 210392 210050 210565 211159 211188 211386 212386 213311 213165
57485 213165 212472 212139 211755 210430 208394 206349 204108 201244 198236 195639 192864 189074 184598 180308 176362
57470 176362 172693 169870 168299 167376 166528 166219 166861 167719 168069 168420 169316 169975 169495 168483 168093 168311 168565
57453 168565 169176 170748 172899 174932 177069 179675 182057 183403 184182 185321 186730 187898 189096 190622 191703
57438 191703 191577 190905 190740 190917 190833 190965 191983 193135 193160 192258 191623 191596 191724 192065 192872 193551 193441 193107 193352
57419 193352 193543 192510 190689 189688 190033 190803 191280 191489 191355 190687 189860 189368 188967 188285 187715 187551 186884 184767
57401 184767 181963 180144 179776 180124 180812 181960 183229 184158 185137 186694 188269 188966 189047 189290 189485 189092 188862
57384 188862 190136 192780 195433 197577 199812 202272 204274 205570 206625 207718 208916 210659 213097 215172
57370 215172 215657 214865 214109 213846 213706 213896 215061 216960 218761 220399 222301 224020 224701 224676 225092 226032 226489
57353 226489 226136 225766 225980 226736 228114 230259 232582 234208 235093 235715 236048 236052 236644 238708 241454 243258 243805
57336 243805 243980 244017 243412 242469 242242 242942 243870 244817 246091 247295 247610 247220 247022 247067 246754 246348 246718 247679 248162
57317 248162 247864 247239 246120 244155 242368 242387 244117 245987 247491 249525 252183 254318 255682 257453 260061
57302 260061 262325 263430 264162 265517 267527 269952 272690 275070 276271 276847 278326 280861 282901 283713 284522
57287 284522 286454 288914 290907 292534 294310 296216 298281 301010 304441 307820 310823 314131 318176 322399
57273 322399 326303 330299 334891 339927 345124 350551 356287 362354 369050 376297 382702 386639 388475 390422
57259 390422 393891 398228 402298 405868 409065 411927 415124 419776 425933 432272 437759 442566 447138 451606
57245 451606 456416 462183 468511 474328 479737 486096 493905 502161 510213 518589 527297 535107 541526 547974
57231 547974 555891 564970 574302 583972 594301 604613 614051 622942 632215 642040 651892 661437 670694 679839
57217 679839 689370 699912 711505 723662 736268 749614 763530 777554 792021 807702 824229 840252
57205 840252 855494 871150 887873 904926 921874 939434 957865 976124 993630 1011458 1030723
57194 1030723 1051076 1071817 1093243 1115783 1138969 1162385 1186626 1212196 1238466 1264696 1291121
57183 1291121 1317989 1344566 1370171 1395284 1420528 1445441 1469312 1492398 1515212 1537411 1558556
57172 1558556 1579384 1601203 1624521 1649099 1674786 1701436 1728506 1755497 1782448 1809571 1837064
57161 1837064 1865582 1895886 1927531 1958967 1989507 2020010 2050951 2081181 2109585 2136756 2163855
57150 2163855 2190921 2217503 2243996 2270930 2297652 2323021 2346923 2370057 2392798 2415256 2437904
57139 2437904 2461099 2484469 2507562 2530523 2553311 2575076 2595336 2615170 2636294 2659512 2684915
57128 2684915 2712905 2743972 2777928 2814276 2852840 2893403 2935470 2979261 3026179 3077350 3132412
57117 3132412 3190653 3252629 3319585 3391998 3469828 3553691 3644646 3743414 3851068 3970237 4104630
57106 4104630 4257646 4432422 4632926 4864092 5131346 5441314 5803188 6228885 6732347
57097 6732347 7329714 8039996 8884525 9885354 11064070 12440734 14031519 15845655 17883658
57088 17883658 20136950 22587153 25205155 27951977 30781537 33641823 36472374 39202333
57080 39202333 41755755 44062506 46062081 47691578 48869566 49499946 49502565 48846869 47560201
57071 47560201 45710107 43383809 40679797 37705225 34569526 31376476 28219812 25180101
57063 25180101 22319672 19679567 17282327 15136711 13239506 11576720 10127859 8870733
57055 8870733 7782965 6842183 6027978 5323492 4713930 4184926 3723953 3321946 2971708
57046 2971708 2665818 2397572 2162476 1956810 1775847 1615303 1473247 1348636 1239055
57037 1239055 1141818 1056124 982094 918741 864851 820783 787339 764029 750507 748450 760020
57026 760020 786315 829819 895134 981096 1071361 1137872 1157309 1124265 1049830 951374 844518
57015 844518 740198 644327 559132 485490 423915 373671 332641 298859 271268 248728 229547
57004 229547 212546 197660 185110 174776 166412 159512 152952 145740 138104 130945 124442 118267 112861
56991 112861 109169 107298 106711 107594 110737 116225 123619 133288 146123 161856 178833 195212 209001
56978 209001 217327 217600 209864 196745 180938 163868 146639 130626 116775 105470 97181 92137 89487
56965 89487 88136 88350 91227 96758 103956 112878 124877 140676 159704 181449 205643 230445 251769
56952 251769 265319 268819 262389 247971 228603 207105 185034 163313 143430 126857 113704 103242
56940 103242 95566 91444 90783 92768 97439 105681 117757 133255 152454 176310 205058 237849 273001
56927 273001 306729 332199 342589 336027 316319 288842 257405 224820 193808 166050 141698 120654
56915 120654 103252 89390 78309 69536 62808 57051 50962 44679 39290 34643 29470 23924 19969
56902 19969 18695 18981 19422 19853 20412 20809 21345 23205 26977 32150 38503 46685 57111 69809 85643
56887 85643 106002 130859 158715 188576 219837 249669 272938 286007 289072 284080 272565 256637
56875 256637 239898 225340 213494 203960 197394 194608 195040 197799 203446 213385 228268 248184 273768
56862 273768 306004 345464 392573 447991 511534 580384 648059 704768 739955 747173 727822 689508
56850 689508 640628 587374 534905 488102 449719 419613 397087 382665 376876 379179 389330 408333
56838 408333 436958 474907 522620 582418 656688 746066 849646 963825 1078389 1175588 1236716
56827 1236716 1251191 1219952 1152501 1062420 963525 866258 775992 694962 625080 567964 523366
56816 523366 489483 464918 449429 443250 446753 460564 485131 520427 566671 624773 694975 774600
56804 774600 856532 929110 978389 993499 972149 921064 850901 771334 690006 612914 543614
56793 543614 483082 431633 390094 358472 335173 318799 309486 307402 311493 321063 337168 360872
56781 360872 391372 427252 467952 511663 552496 581919 593319 584638 557908 518013 471212 422846
56769 422846 375934 332193 293326 260280 232312 208177 187553 170290 155334 141799 130252
56758 130252 121496 114850 108986 103611 98947 94410 89398 84685 81450 79386 77235 74637 72030 69282
56744 69282 66015 62928 61303 61253 61662 61687 61352 61000 61023 61779 62875 63128 62036 60623 59935 59648 59140 58959
56726 58959 59887 61409 62490 63187 64153 65227 65862 66330 67197 68132 68548 68830 69682 70832 71639 72395 73768
56709 73768 75500 76878 77942 79072 80012 80420 80728 81316 81596 81063 80384 80228 79986 79034 78269 78757 79761
56692 79761 79794 78872 78024 77274 75929 74357 73683 74070 74850 75939 77552 78992 79298 78705 78018 77103 75575
56675 75575 74349 74710 76202 77163 77033 76595 76275 75797 75184 74559 73356 71271 69459 69152 69617 69237 68110
56658 68110 67674 68168 68532 68620 69470 71291 73007 73956 74388 74221 72903 70621 68258 66154 64286 63387 64352
56641 64352 66732 69275 71710 74468 77129 78891 80187 81901 83283 82747 80650 79181 79310 79906 80078
56626 80078 80360 81093 81555 81379 81261 81587 81716 81169 80352 79732 79336 79272 79665 80006 79639 78807 78173 77635 76856
56607 76856 76562 77747 79889 81551 82547 83901 85823 87497 88772 90388 92431 94153 95315 96286 96971
56592 96971 97147 97519 98777 99981 99753 98719 98716 99828 100374 99776 99214 99385 99836 100700 102812 105736 107836
56575 107836 108779 109907 111764 113299 114044 114968 116553 117987 118892 120001 121556 122928 124377 127296 132072
56560 132072 137574 143384 150617 159800 169703 178914 186905 193016 196355 197499 198524 200567 202921 204957
56546 204957 207012 208756 208850 207223 205809 205914 206524 206202 205061 203807 202396 200670 199040 197614 195837
56531 195837 193584 191361 189011 185753 181936 179011 177275 175386 172715 170278 168651 166913 164528 162393
56517 162393 160982 159240 156363 153070 150151 147341 144524 142400 140991 139173 136648 134775 134441 134743 134744
56502 134744 134851 135393 135501 134612 133578 133123 132653 131678 130968 131206 131859 132391 133228 134571 135621 135917 136046 136247
56484 136247 135794 134582 133737 133804 133937 133698 133869 134620 134786 134058 134030 135810 138323 140224 141700 143073 143453
56467 143453 142387 141315 141753 143290 144750 145980 147166 147734 147322 146687 146476 146294 146007 146506 148066 149372
56451 149372 149332 148490 147638 146596 145426 145186 146217 147255 147425 147570 148500 149671 150757 152638 155426 157440
56435 157440 157708 157677 158790 160176 160502 160385 161002 161794 161600 160838 160721 161340 162129 163090 164107 164300 163551 163364
56417 163364 164763 166660 167724 168406 169650 171125 172287 173635 175274 175885 174833 173708 173961 174616 174205
56402 174205 173360 173390 173785 173360 172614 172755 173453 173743 174186 176030 179038 182008 184666 187375 189861 191839 193975
56385 193975 196675 198972 200070 200830 202239 203707 204392 204859 205892 207092 208182 210065 212860 214631 214004
56370 214004 212450 211996 212345 212285 212211 212888 213378 212690 212126 213528 216399 219029 221144 223109 223960 222787 220805
56353 220805 219540 218237 215658 213122 212894 214577 215890 216151 216270 216109 214663 212302 210284 208597 206603
56338 206603 205073 205168 206155 206620 207177 209544 213630 217982 222387 227515 232644 236208 238126 239429 240302 240664
56322 240664 241699 244457 247819 250214 252262 255268 258259 259311 258805 258534 258526 257726 256949 257997 260429 262252
56306 262252 263339 265207 267884 270016 271758 274549 278260 281421 284086 287649 292002 295615 298290 301163
56292 301163 304267 306704 308921 312141 315872 318709 321260 325520 331587 337728 343374 349370 355585 361062
56278 361062 366293 372648 379852 386672 393631 402236 411996 421131 429828 439864 451414 463244 475603
56265 475603 489775 505118 519764 534073 550276 568935 588904 610497 635381 663547 693779
56254 693779 727095 766317 812175 863173 919318 982615 1053695 1131362 1215697 1308242 1408796
56243 1408796 1515152 1626204 1742069 1860983 1979263 2094444 2205178 2308022 2397844 2471694
56233 2471694 2528919 2567564 2584464 2579280 2554862 2513300 2455269 2383446 2302447 2214588 2119444
56222 2119444 2018323 1915349 1813281 1712039 1612325 1516958 1427450 1342750 1262556 1188555
56212 1188555 1121346 1059417 1002095 950353 903930 861002 821484 787175 757855 730718 704523
56201 704523 680847 660465 642097 625486 611937 600875 589649 577764 567529 559626 551982 544086
56189 544086 538253 535215 532535 528955 526456 526332 527007 527371 528539 530599 531324 529917 528561 528577 528511 527572
56173 527572 527349 528475 529164 528725 529040 530960 532795 533900 536129 540233 544498 548540 554557 563065 571259
56158 571259 577474 583588 591243 599519 608090 618792 632075 645678 658727 673480 691277 710664
56146 710664 731260 755443 784421 816797 852918 896361 949180 1010171 1079922 1162797 1261162
56135 1261162 1371775 1490090 1613297 1736294 1849725 1946110 2024841 2088797 2140386 2183659
56125 2183659 2225352 2269208 2311886 2347121 2370788 2380141 2373151 2352338 2325493 2299095 2273623 2246788
56113 2246788 2216478 2177773 2122397 2045617 1950717 1844140 1730472 1614837 1504958 1406447
56103 1406447 1319515 1243446 1180147 1130169 1089757 1055557 1028177 1007913 991591 977205 967042
56092 967042 962447 960097 957268 956088 958542 962039 964241 967589 974512 982553 988815 994938 1003077 1011217
56078 1011217 1017090 1022669 1030278 1038217 1044618 1051608 1061435 1072548 1083452 1095971 1110753 1124439 1135487
56065 1135487 1147756 1163992 1181051 1196105 1211958 1231250 1251052 1268538 1286476 1307498 1328433
56054 1328433 1346054 1363007 1382176 1400653 1415385 1429375 1446115 1463327 1478489 1494921 1515855
56043 1515855 1538038 1557936 1578709 1604139 1631286 1656216 1681413 1710346 1740364 1768330 1797586
56032 1797586 1831828 1867850 1901992 1937779 1979268 2022924 2064250 2106274 2153027 2200965 2245728
56021 2245728 2291095 2342117 2395706 2447356 2500698 2560675 2623783 2685161 2748821 2820421 2896459
56010 2896459 2971322 3048433 3133316 3222371 3309979 3400083 3498950 3603288 3707627 3816490 3936700
55999 3936700 4064784 4194981 4332341 4484218 4646160 4810453 4981252 5166670 5363553
55990 5363553 5565416 5777726 6009483 6257451 6515092 6788902 7088887 7411546 7750316
55981 7750316 8113902 8515325 8952044 9416910 9919158 10473429 11078192 11727683 12435016
55972 12435016 13219777 14083785 15024700 16062624 17226704 18528066 19975369 21604632
55964 21604632 23463466 25581587 27992692 30771938 34017451 37816211 42274030 47563593
55956 47563593 53900632 61501140 70622293 81623829 94926674 110939196 130098152
55949 130098152 152953420 180138545 212290410 249943951 292967414 339218340 383342358
55942 383342358 417503913 434521761 431348924 410155501 376472278 336355474 294632934
55935 294632934 254553115 218017451 185862647 158197376 134761644 115132958 98786320
55928 98786320 85170493 73812658 64335840 56403648 49712699 44033616 39203596 35075281
55920 35075281 31510324 28413450 25727010 23390100 21335325 19519782 17923281 16516600
55912 16516600 15260805 14134434 13131927 12236855 11423010 10679475 10009096 9403844 8845281
55903 8845281 8327365 7855870 7426598 7025735 6650395 6307980 5995937 5701879 5423117
55894 5423117 5167269 4933906 4713556 4504704 4314527 4142633 3980392 3826551 3687987
55885 3687987 3564815 3449756 3342448 3249789 3171570 3099339 3029722 2965551 2903960 2837006 2764743
55874 2764743 2694709 2627517 2555233 2474900 2391741 2308094 2220948 2131737 2047302 1969481 1893903
55863 1893903 1820179 1753268 1693813 1637079 1582445 1534261 1492276 1450723 1408062 1368568 1333305
55852 1333305 1298557 1264235 1234860 1210847 1187211 1162075 1138306 1115789 1090432 1062047 1035214
55841 1035214 1011082 986051 959665 936036 916116 896124 874981 856047 840183 824211 807596
55830 807596 793637 782679 770986 757708 746343 737984 729623 720353 712740 706717 698512 687077 675539
55817 675539 664997 652973 639258 627210 617862 608501 598353 589923 583569 576584 568916 564061 562911
55804 562911 562323 561195 562436 567507 574276 581620 590928 601733 610935 617566 623381 627852 627838 623195 617362
55789 617362 611345 602527 590593 579187 570270 562070 553878 547344 541457 531727 516447 498948 481971
55776 481971 464735 447265 432514 422047 414151 408072 405687 407255 409897 411902 414168 416070 414741
55763 414741 410058 405562 402668 398655 392136 385624 380625 375072 367915 361599 357467 353107 346676 339579
55749 339579 332462 323001 310480 298425 289773 283103 276280 270123 265692 261553 256660 252765 251275 250725
55735 250725 249692 249114 249454 248830 246383 244304 244171 244384 243482 242663 242569 240920 236123 230157 225231 220461
55719 220461 214609 209194 206035 204231 202375 201254 201708 202227 201473 200982 202622 205384 207271 208458 210136
55704 210136 212059 213607 215549 218463 220986 221612 220666 218835 215528 210405 204671 199201 193309 186887 181689
55689 181689 178885 177478 176667 177448 180121 182675 183586 184047 185500 187276 188665 191014 195498 200777 205050
55674 205050 208528 211830 213887 213588 211840 209957 207770 205148 203493 203618 203912 202659 200640 199567 199564 199961
55658 199961 200880 202283 203191 203597 205304 209106 213052 215376 217162 220107 223527 225751 226714 227047 226199 223608
55642 223608 220241 216938 212702 206479 199108 191718 183973 175775 168846 164424 161078 157017 152978 150558
55628 150558 149269 147593 145561 144003 142440 139991 137232 135126 133275 131126 129523 129109 128662 127084 125521
55613 125521 125294 125297 123912 121994 121260 120965 119067 115817 113321 112088 110743 108859 107594 107508 107892 108232 108558
55596 108558 108533 107779 106836 106313 105625 104078 102465 101946 102037 101436 100196 99335 98841 97875 96483 95519 95260 95536
55578 95536 96633 98625 100472 101254 101631 102622 103695 103602 102436 101314 100712 100622 101623 104175 107429 110122
55562 110122 112065 113521 114082 113589 113184 113875 114952 115409 115840 117233 118855 119259 118572 117911 117307 116113 114766
55545 114766 114112 113598 112078 109968 108626 108011 106787 104547 102132 99989 97838 95721 93882 91878 89195
55530 89195 86357 84076 81957 79498 77689 77929 79880 81965 83458 84485 84608 83204 80847 78682 76839
55515 76839 74922 73385 72784 72409 71467 70900 71977 73702 73809 72067 70407 69908 69716 68991 67935 66671
55499 66671 64912 63038 61959 61748 61754 62044 63293 65343 67332 69147 71309 73550 74977 75571 76121 76785
55483 76785 77149 77397 77938 78175 77262 75901 75692 76830 78056 78764 79424 80030 79927 79285 79085 79450 79513 79139
55465 79139 79282 80388 81807 82886 83399 82947 81321 79462 78687 78992 79423 79865 80888 82050 82117 81047 80071
55448 80071 79677 79112 78062 77125 76424 75357 74066 73606 74285 75276 76188 77538 79317 80556 80783 80590 80324
55431 80324 79527 78093 76770 76022 75497 74961 74673 74619 74434 74306 74823 75767 76228 76041 75913 76029 75841 75414 75631
55412 75631 76702 77722 78012 77797 77322 76511 75688 75469 75661 75451 74830 74613 74940 75086 74951 75299 76188 76660
55394 76660 76397 76335 77055 77868 78134 78263 78749 79252 79401 79539 79989 80345 80159 79676 79381 79341 79358 79330 79257 79264 79586
55373 79586 80043 79829 78499 76811 75744 75099 74072 72762 71908 71418 70487 68964 67369 65823 64259 63361
55357 63361 63818 64934 65531 65916 67205 69001 69779 69559 70019 71628 72880 72903 72761 73354 73920 73587 72740 71907
55339 71907 70842 69684 69476 70474 71287 70736 69417 68471 68001 67633 67516 67770 67916 67725 67704 68052 68133 67663 67329
55320 67329 67514 67507 66781 65952 65657 65529 65097 64671 64493 63990 62757 61433 60855 61125 62109 63836 65820 67068
55302 67068 67482 68158 69579 70691 70595 70035 70186 70993 71725 72278 72863 73160 72800 72085 71469 71000 70922 71906 73907
55283 73907 75691 76334 76368 76650 77010 76927 76640 76632 76772 76859 77221 77885 78015 77122 76017 75551 75196 73986 72219
55264 72219 71079 71085 71961 73494 75536 77587 79330 81142 83258 84913 85229 84441 83322 81904 79818 77504
55248 77504 75956 75389 75094 74593 74179 74335 75214 76623 78053 78875 78930 78738 78806 79023 79031 78789 78519 78472 78965 80094
55228 80094 81231 81429 80580 79481 78586 77609 76593 76340 77244 78641 79822 80737 81181 80435 78507 76698 75946
55211 75946 75537 74438 73067 72670 73539 74920 76144 76919 76998 76496 76145 76471 77071 77337 77385 77649 78150 78795
55193 78795 79779 81005 81790 81825 81721 81928 81917 81205 80377 80217 80568 80960 81545 82454 83039 82877 82741 83421 84235
55174 84235 83974 82766 81729 81249 80890 80693 81225 82405 83454 84018 84407 84783 84928 84811 84662 84605 84748 85334
55156 85334 86246 86803 86671 86405 86426 86121 84831 83083 81844 81170 80570 80171 80399 80955 81230 81332 81671 82006
55138 82006 81940 81852 82148 82180 81258 80275 80740 82429 83599 83526 83224 83470 83663 83148 82358 81982 82017 82231 82774 83761
55118 83761 84899 85947 86991 87953 88382 88069 87436 87053 87086 87334 87515 87534 87663 88268 89089 89235 88358 87334
55100 87334 87167 87673 88035 88191 88717 89609 90247 90482 90785 91282 91545 91453 91487 92025 92910 93812 94504 94861 95023 95432
55080 95432 96213 96777 96602 96049 95763 95668 95319 94843 94625 94349 93343 91681 90063 88824 87988 88044 89492 91650
55062 91650 93034 93120 92823 93027 93539 93715 93401 93003 93105 94062 95495 96346 95977 94981 94295 93872 93077 92085 91800
55043 91800 92475 93361 93778 93694 93280 92704 92316 92266 92067 91338 90725 91140 92299 93105 93287 93489 93800 93550 92703
55024 92703 92222 92629 93261 93278 92563 91382 90108 89484 90123 91439 92030 91471 90890 91398 92859 94524 96003
55007 96003 97170 97877 98225 98499 98586 98114 97318 97017 97533 98425 99352 100316 100876 100224 98429 96672 95794 95482
54989 95482 95250 95279 95748 96242 96473 96838 97660 98522 99024 99571 100813 102731 104776 106444 107374 107370 106722 106048 105528
54970 105528 104837 103996 103618 103979 104605 105126 105827 106879 107783 108159 108459 109223 110157 110583 110447 110308 110574 111207
54952 111207 111952 112500 112669 112665 112895 113356 113592 113422 113263 113549 114264 115196 116147 116750 116652 116117 115866 116141 116522 116856
54932 116856 117634 119102 120705 121885 122800 123778 124643 125203 125954 127715 130818 135138 140646 147411 155167 163257
54916 163257 171006 178019 184107 188973 191923 192164 189668 185446 180459 174501 166839 157742 148642 140827
54902 140827 134686 130117 126740 123716 120286 116735 114021 112438 111507 111186 112010 113792 115361 116046 116391
54887 116391 116891 117148 116865 116753 117673 119646 122364 125936 130500 135800 141769 148787 156754 164640 171582
54872 171582 177755 183545 188528 191878 193077 191701 187409 180897 174031 168150 162860 157236 151378 145949
54858 145949 140965 136127 131735 128224 125332 122742 120961 120411 120142 118677 115907 112984 110563 108345 106254
54843 106254 104797 104079 103554 103020 102952 103555 104260 104523 104475 104473 104550 104589 104619 104707 104857 105157 105721 106410 106896 107017 106824
54822 106824 106349 105653 104982 104544 104234 103895 103725 104025 104587 104733 104020 102688 101453 100982 101435 102316 102902 102928
54804 102928 102678 102449 102353 102676 103762 105243 106032 105600 104695 104273 104261 104059 103769 104046 104950 105787 106108 106159 106268
54785 106268 106351 106168 105749 105518 106144 108114 111172 114384 117026 119150 121049 122628 123754 124858 126520 128739
54769 128739 131208 134154 138236 143642 149884 156540 163662 171270 178839 185492 190573 193880 195402 194918
54755 194918 192090 187109 181061 175144 169609 163992 158288 153075 148366 143366 137833 132858 129615 128011
54741 128011 127213 126819 126758 126698 126451 126470 127040 127458 127014 126411 127088 129241 131583 133150 134376 136207 138942 142305
54723 142305 146083 150374 155472 161579 168406 175185 181320 186750 191291 194023 193933 190954 185855 179369 172028
54708 172028 164529 157531 151175 145401 140565 137151 135022 133552 132316 131087 129445 127155 124710 122829
54694 122829 121556 120562 120000 120198 120659 120362 119074 117522 116241 115106 114046 113286 112728 111946 111012 110536 110611
54677 110611 110504 109704 108626 107950 107889 108412 109530 110962 112035 112340 112133 111806 111389 110779 110018 109128 108133 107438
54659 107438 107679 108866 110069 110387 109935 109537 109724 110325 110913 111295 111585 111980 112576 113402 114539 115977 117326
54642 117326 117959 117654 116755 115557 113938 112005 110591 110526 111680 113262 114769 116031 116690 116409 115519 114755
54626 114755 114498 114804 115876 117683 119291 119534 118386 116897 115809 115047 114519 114427 114618 114517 114001 113591 113557
54609 113557 113655 113925 114870 116486 117906 118493 118611 118904 119402 119792 120002 120058 119866 119530 119453 119765 120062 120008 119721
54590 119721 119341 118723 117857 117057 116479 115927 115377 115101 114995 114457 113345 112487 112694 113760 114864 115534 115706 115289
54572 115289 114255 112981 112037 111747 112075 112635 112761 112073 111161 111103 112033 112855 112768 112370 112666 113662 114667 115503
54554 115503 116452 117361 117679 117445 117417 118061 118971 119531 119735 120136 121189 122868 124839 126849 128901 131025 133002
54537 133002 134513 135500 136101 136276 135877 135098 134364 133639 132367 130354 128266 126893 126289 125983 125716 125563 125616
54520 125616 125917 126534 127387 128163 128664 129018 129318 129277 128576 127416 126415 126043 126260 126561 126254 124941 122901 120839
54502 120839 119187 117894 116956 116766 117685 119586 121965 124275 126015 126862 127002 127037 127341 127664 127529 126762 125557
54485 125557 124328 123614 123716 124310 124777 125012 125485 126370 127224 127797 128640 130461 133246 136339 139054 140898 141667
54468 141667 141697 141648 141687 141243 140012 138789 138758 140149 142039 143309 143430 142525 141098 139730 138753 138266 138389 139168
54450 139168 140142 140468 139786 138599 137606 137060 136953 137268 137703 137637 136858 135872 135130 134414 133451 132550 132018 131477 130452
54431 130452 129299 128790 129063 129691 130537 131735 132987 133741 134142 135020 136757 138669 139712 139403 138063 136604
54415 136604 136093 137004 138728 140172 140900 141348 141963 142632 143072 143295 143457 143551 143493 143331 143245 143424 143947 144665 145230
54396 145230 145430 145466 145739 146424 147318 147982 147931 146966 145538 144535 144395 144629 144509 143947 143355 142943 142713 142962 144152
54377 144152 146145 148080 149179 149393 149156 148856 148689 148779 149173 149778 150411 150987 151684 152851 154548 156144 156748
54360 156748 156184 155282 154981 155484 156564 158253 160688 163467 165784 167317 168638 170587 173380 176342 178376
54345 178376 178841 178096 177073 176198 174993 172886 170080 167314 165016 163041 161095 159119 157384 156379 156314
54330 156314 156553 155933 153985 151470 149350 147720 146252 145156 144907 145254 145347 144815 144063 143484 143059 142759 142771
54313 142771 143168 143811 144647 145636 146402 146479 146014 145687 145812 145950 145599 144820 144011 143427 143122 143012 142792 142064 140768
54294 140768 139357 138393 138130 138471 139111 139637 139724 139355 138803 138403 138372 138729 139234 139529 139454 139115 138599 137954 137510
54275 137510 137767 138664 139398 139382 139006 139051 139721 140692 141683 142379 142247 141215 140203 140215 141102 141993 142645 143401 143971
54256 143971 143458 141864 140579 140857 142493 144353 145614 146105 146006 145676 145466 145380 145142 144614 143852 142818 141603
54239 141603 140829 141122 142123 142778 142738 142717 143276 144122 144913 145829 146784 146929 145759 144185 143665 144550 145932 146902
54221 146902 147313 147441 147449 147246 146576 145311 143842 142951 143105 144045 145209 146243 146963 147235 147114 146743 145911 144258
54203 144258 142175 140920 141321 142756 143945 144331 144246 144073 143909 143818 143808 143647 143155 142598 142360 142386 142358 142303 142541
54184 142541 143084 143562 143771 143912 144259 144827 145452 145983 146411 146859 147375 147691 147481 146904 146560 146691 146830 146531 146036
54165 146036 145776 145607 145059 144097 143034 141902 140491 139002 138105 138203 139050 140157 141266 142329 143262 143839 143755
54148 143755 142895 141655 140800 140769 141302 141931 142541 143173 143677 144014 144563 145527 146286 146057 145112 144605 145090 145900 146145
54129 146145 145741 145188 144836 144744 144837 144848 144424 143641 143131 143391 144149 144792 145238 146001 147426 149209 150788 151968
54111 151968 152906 153594 153657 152855 151627 150819 150821 151314 151962 152940 154451 156023 156782 156386 155293 154249 153854 154493
54093 154493 156067 157737 158457 158008 157134 156565 156306 156075 155951 156243 156965 157801 158463 158932 159566 161024 163695
54076 163695 166998 169660 171067 172030 173860 176985 180919 185276 190185 195864 202454 210320 219838 230585
54062 230585 241075 249537 254601 255273 250991 242364 231584 221387 213339 207295 202396 198235 195033 193081
54048 193081 192352 192562 193403 194640 196044 197354 198422 199425 200824 203016 206106 210098 215140 221359 228511
54033 228511 236016 243379 250357 256740 262232 266745 270621 274373 278175 281695 284429 286172 287154 287733 288003
54018 288003 287882 287598 287745 288451 288687 286965 282902 277658 272637 268158 263693 258967 254290 249970 245942
54003 245942 242016 238160 234493 231223 228579 226571 224869 223180 221683 220886 221080 222163 223923 226112 228337
53988 228337 230189 231568 232653 233495 233856 233418 231947 229322 225708 221626 217535 213418 209107 204868 201216
53973 201216 198182 195356 192728 190938 190434 190877 191588 192165 192389 192039 191230 190531 190329 190337 190133 189905 190210 191241
53955 191241 192786 194744 197123 199597 201628 203178 204951 207739 211701 216289 220712 224475 227653 230715
53941 230715 233980 237291 240267 242715 244679 246306 247933 250085 253041 256520 260115 263920 268362 273524
53927 273524 279110 285061 291745 299376 307768 316920 327453 340113 355173 372694 392993 415949 439531
53914 439531 459689 472489 476681 474143 468060 460977 454295 448664 444073 439839 435210 430169 425295 420807
53900 420807 416228 411163 405916 400990 396276 391139 385145 378405 371331 364353 357769 351539 345228 338407
53886 338407 331086 323605 316213 308961 301914 295199 288868 282937 277507 272680 268390 264500 260991 257833
53872 257833 254790 251565 248068 244306 240246 236134 232756 230750 229620 228008 225234 222080 219675 217988
53858 217988 215992 213156 210151 207977 206827 206100 205223 204067 202662 200978 199186 197848 197470 197870 198274
53843 198274 198121 197534 196944 196539 196284 196314 196894 197966 198992 199336 198754 197493 196035 194756 193807 193276 193415
53826 193415 194512 196381 198203 199154 199205 199048 199258 199757 200206 200603 201317 202648 204538 206661 208560 209811
53810 209811 210329 210627 211569 213667 216655 219953 223477 227748 233149 239349 245683 251865 258024 264132 269790
53795 269790 274614 278593 281964 285050 288246 291828 295506 298427 299907 300097 299744 299447 299300 299112 298664 297756
53779 297756 296181 293706 290090 285281 279687 274033 268726 263483 257817 251811 246190 241699 238624 236885
53765 236885 236213 236079 235602 233888 230689 226741 223218 220673 218617 216338 213907 211954 210563 209085 207254
53750 207254 205759 205148 204693 203123 200305 197431 195607 194936 195084 195937 197283 198495 199125 199562 200510 201923
53734 201923 202987 203257 203296 203926 205132 206158 206624 207126 208440 210419 212039 212511 211977 211047 210080 209172 208624
53717 208624 208939 210321 212358 214285 215569 216293 217027 218243 219874 221602 223496 226005 229215 232559 235513
53702 235513 238251 241270 244637 248010 251207 254316 257359 260265 263157 266347 269968 273843 277607 280830
53688 280830 283191 284778 286000 286896 286809 285210 282615 280160 278373 276925 275498 274275 273466 272902 272287 271419
53672 271419 270111 268382 266817 266229 266702 267433 267728 267703 267755 267785 267361 266379 265247 264472 264238 264160 263459 261747
53654 261747 259751 258739 259059 259708 259667 259097 258804 259068 259630 260406 261466 262483 262997 263209 263806 264904 265843
53637 265843 266280 266860 268368 270630 272734 274061 274658 274816 274814 275077 276044 277646 279255 280478 281811 284169
53621 284169 287820 292044 295895 299060 301901 304900 308210 311571 314559 317055 319592 323064 327884 333483
53607 333483 338838 343355 347151 350697 354495 358966 364247 370012 375768 381350 386881 392196 396613 399452
53593 399452 400656 400781 400426 399641 397843 394412 389535 384390 380268 377542 375613 373666 371197 368060 364528
53578 364528 361294 358962 357373 355798 353830 351680 349603 347559 345690 344557 344501 345032 345277 344853 343994 343006
53562 343006 341924 340625 339075 337534 336633 337033 338793 341162 343160 344296 344746 345084 345959 347700 350026
53547 350026 352324 354377 356534 359076 361756 364181 366307 368264 370066 371874 374253 377710 382145 387147
53533 387147 392648 398786 405273 411496 417334 423483 430843 439842 450331 461788 473530 485115 496662
53520 496662 508643 521324 534674 548727 563619 579187 594986 610984 627937 646722 667457
53509 667457 689549 712462 736060 760286 784906 809732 834805 860093 885160 909368 932349
53498 932349 954108 974717 994251 1013048 1031691 1050495 1069248 1087738 1106271 1125314 1144783
53487 1144783 1164165 1183227 1202089 1220575 1238211 1255136 1272371 1290606 1309104 1326431 1342093
53476 1342093 1356816 1371278 1385190 1397720 1408287 1416688 1422902 1427088 1429501 1430036 1427991 1422591 1413666
53463 1413666 1401694 1387339 1371332 1354656 1338303 1322580 1306951 1290826 1274239 1257395 1239792
53452 1239792 1220444 1199100 1176770 1154739 1133481 1112880 1093088 1074494 1056917 1039465 1021435
53441 1021435 1003036 985083 968298 953055 939572 928095 918908 912132 907466 904261 902055 900907
53429 900907 900955 901945 903591 906222 910456 916332 923425 931776 941903 953726 966356 979399 993697 1010131
53415 1010131 1028323 1047259 1066760 1087578 1110329 1135075 1161746 1190190 1219851 1250127 1281160
53404 1281160 1313770 1348534 1385368 1423978 1464160 1505706 1548629 1593641 1641751 1693022 1746158
53393 1746158 1799665 1853153 1907268 1962621 2019098 2076082 2132973 2189426 2245186 2299813 2352721
53382 2352721 2403571 2452438 2499340 2543775 2585065 2623034 2657876 2689324 2716450 2738581 2756046
53371 2756046 2769691 2779879 2786288 2788428 2785815 2777486 2761892 2737825 2705558 2666711 2622873 2574633
53359 2574633 2522220 2466688 2409772 2352573 2295026 2236960 2179049 2122329 2067289 2014088 1963246
53348 1963246 1915352 1870114 1826380 1783181 1740237 1697406 1654257 1610570 1566928 1524519 1484391
53337 1484391 1446898 1411634 1377890 1345405 1314720 1286652 1261512 1239115 1219421 1202673 1188795
53326 1188795 1176921 1165717 1154062 1141525 1128411 1115301 1102367 1089337 1076317 1064288 1054213
53315 1054213 1045922 1038549 1031914 1026677 1023093 1020584 1018898 1018763 1020813 1024486 1028755 1033568 1039837 1048150
53301 1048150 1058194 1069426 1081794 1095670 1111423 1129209 1148955 1170453 1193544 1218219 1244471
53290 1244471 1272083 1300678 1329893 1359432 1388963 1417956 1445622 1471186 1494469 1516057 1536528
53279 1536528 1555586 1572366 1586429 1597864 1606372 1611073 1611597 1608716 1603409 1595823 1585705 1573290 1559029
53266 1559029 1542773 1524070 1503142 1480778 1457237 1431991 1404802 1376394 1347757 1319184 1290307
53255 1290307 1260731 1230362 1199357 1168101 1137127 1106820 1077230 1048262 1020014 992902 967462
53244 967462 943835 921201 897897 872563 845384 817983 792060 768318 746565 726260 706705
53233 706705 687240 667901 649757 634095 621167 610017 599523 589300 579542 570330 561419 552550
53221 552550 543680 534842 525927 516624 506575 495637 484109 472659 461858 451693 441622 431229
53209 431229 420806 411185 402940 395842 389190 382617 376381 370809 365701 360503 354947 349197 343371 337284
53195 337284 330881 324593 318907 313786 308874 304134 299795 295749 291588 287347 283671 280943 278787 276730
53181 276730 274914 273620 272537 271106 269371 267838 266596 265200 263428 261559 259833 258237 256902 256157
53167 256157 255947 255702 255071 254321 253757 253192 252366 251503 251017 250816 250222 248463 245165 240740 236482 233853 233204
53150 233204 233482 233514 233201 233056 233024 232509 231458 230567 230314 230412 230407 230270 230028 229335 227890 226122 225037 225331 226842
53131 226842 228790 230388 231338 231928 232684 233845 235248 236754 238567 240876 243319 245153 246033 246368 246776 247423
53115 247423 248088 248614 248951 248814 247735 245646 243157 241006 239369 237853 236097 234214 232705 232029 232122 232309
53099 232309 231922 231081 230576 230731 230834 230096 228812 227952 227758 227488 226639 225641 225039 224632 223953 223211 223094 223757
53081 223757 224459 224286 223033 221381 220391 220715 222120 223766 224960 225565 225716 225474 224902 224231 223675 223159 222378
53064 222378 221063 219161 216939 214922 213544 212807 212494 212590 213169 213891 214214 214144 214231 214601 214663 214114 213548 213498 213476
53045 213476 212746 211668 211375 212274 213625 214622 215114 215186 214789 214050 213422 213128 212847 212180 211157 210059 209017
53028 209017 208008 207072 206376 206184 206730 207947 209326 210324 210903 211396 211873 212012 211632 210983 210380 209881 209467 209233
53010 209233 209222 209310 209427 209729 210394 211409 212590 213679 214417 214752 215004 215561 216324 216743 216478 215839 215463 215808
52992 215808 216910 218312 219170 218910 217994 217616 218346 219431 219782 219286 218666 218333 218021 217522 217122 217102 217298 217514
52974 217514 218067 219488 221763 224216 226119 227237 227773 228107 228648 229682 231099 232412 233234 233668 234053 234456
52958 234456 234676 234638 234415 233854 232615 230779 228995 227740 226680 225153 223058 220884 219037 217598 216732 216825
52942 216825 217962 219546 220662 220814 220242 219547 219052 218530 217683 216778 216490 216890 217057 216109 214383 213071 212814
52925 212814 213187 213516 213575 213354 212765 211901 211209 211009 211124 211216 211239 211269 211153 210635 209678 208433 207034 205720 204954
52906 204954 205102 206003 207166 208335 209581 210782 211410 211096 210287 209967 210568 211364 211204 209841 208237 207474 207677
52889 207677 208223 208725 209401 210561 212139 213781 215112 215892 216145 216129 215903 215084 213420 211550 210623 210989 211771
52872 211771 212003 211823 212173 213652 216073 218976 222149 225602 229222 232569 235034 236358 236958 237437 237731 237170
52856 237170 235604 233952 233168 232911 231855 229278 225833 222617 219927 217286 214440 211906 210382 209848 209553
52841 209553 208894 207994 207268 206691 205929 205020 204390 204134 203826 203280 203000 203527 204709 206006 207200 208329 209152
52824 209152 209268 208689 207819 206858 205675 204377 203558 203744 204831 206225 207403 208220 208861 209614 210686 212180
52808 212180 214244 217046 220351 223244 224613 224031 221996 219289 216354 213330 210301 207313 204331 201448
52794 201448 199005 197270 196096 195152 194443 194300 194799 195484 195809 195704 195494 195455 195648 196085 196758 197465 197906 198015
52776 198015 197988 197962 197953 198188 199097 200706 202344 203325 203762 204334 205350 206390 206799 206187 204569 202427 200651 200003
52758 200003 200533 201685 202916 203908 204355 204072 203323 202581 201977 201481 201561 202885 205165 207070 207734 207785 208430 210018
52740 210018 212022 213958 215647 216874 217426 217466 217420 217573 218050 218961 220230 221548 222827 224383 226286 227924
52724 227924 228742 229006 229220 229138 228125 226300 224426 222726 220688 218206 216052 214872 214418 214138 213911 213807
52708 213807 213588 213024 212337 211901 211728 211625 211648 211998 212592 213062 213126 212797 212366 212339 213193 214938 216990 218696 219866
52689 219866 220660 221132 221210 221027 220981 221333 221895 222191 221882 221017 219895 218745 217590 216403 215254 214229 213324
52672 213324 212518 211897 211620 211830 212660 214117 215792 216988 217465 217843 218869 220401 221538 221739 221346 221000 221017
52655 221017 221522 222713 224710 227336 230193 232785 234535 235006 234215 232479 229982 226874 223773 221555 220435
52640 220435 219795 219224 219172 220086 221374 221928 221505 221023 221532 223306 225852 228384 230316 231724 233329 235625
52624 235625 238038 239336 238909 237260 235198 233040 230808 228769 227354 226731 226740 227114 227534 227613 227164 226451 225925
52607 225925 225698 225510 225219 225033 225148 225443 225778 226336 227256 228054 227924 226763 225443 224792 224636 224286 223714 223711 224914
52588 224914 227142 229758 232206 234077 235123 235543 235934 236672 237501 238043 238446 239170 240176 240744 240187 238644
52572 238644 237064 236406 236753 237197 236744 235440 234403 234584 235629 236204 235351 233325 231134 229547 228665 228269
52556 228269 228329 229000 230173 231247 231558 231025 230187 229637 229637 230203 231159 232020 232230 231790 231348 231370 231491 231031 229965
52537 229965 228943 228480 228500 228640 228629 228368 228002 227973 228679 229986 231330 232352 233173 233970 234603 234849 234822 234880 235186
52518 235186 235497 235416 234843 234180 233994 234378 234853 235161 235955 238227 241993 246030 249167 251417 253469 255443 256682
52501 256682 256621 255374 253419 251263 249449 248330 247518 246009 243360 240462 238636 238066 237750 236980 236237 236315
52485 236315 237157 238103 238980 240298 242384 244828 246897 248124 248420 247983 247270 246770 246645 246778 247177 247989 249030
52468 249030 249733 249851 249845 250258 251042 251913 253115 255271 258552 262401 266110 269240 271468 272450 272053 270435 267766
52451 267766 264137 259930 255952 252893 250743 248986 247311 245885 244927 244272 243551 242725 242204 242381 243160 244058
52435 244058 244660 244765 244193 242832 241008 239472 238746 238637 238634 238554 238529 238526 238272 237599 236590 235472 234696 234971 236700
52416 236700 239343 241812 243616 245237 247288 249857 252879 256581 261109 266147 271533 277991 286607 297504
52402 297504 309371 320259 328506 333057 333496 330068 323497 314779 305276 296677 290189 285640 281873 278170
52388 278170 274840 272357 270593 269276 268530 268385 268268 267723 267333 268049 269776 271473 272670 273993 275934 278053
52372 278053 279917 282067 285316 289520 293761 297437 300542 303144 305271 307145 308897 310159 310599 310732 311430
52357 311430 312623 313312 313045 312497 312315 312238 311908 311723 312131 312679 312657 312369 312828 314311 316091 317676 319482 321979
52339 321979 324886 327634 330225 333136 336609 340477 344615 349211 354510 360519 367101 374378 382912 393285
52325 393285 405430 418505 431607 444528 457707 471545 485938 500377 514297 527450 540171
52314 540171 553140 566690 580497 594242 608300 623292 639051 654598 669199 682942 696196
52303 696196 709080 721770 734755 748277 761793 774441 785880 796285 805704 813823 820338 825125
52291 825125 828073 829070 828259 826052 822819 818696 813728 808022 801823 795597 790004 785521 782119 779493 777634
52276 777634 776856 777202 778138 779132 780336 782453 785994 790947 797147 804557 812995 821752 829921 837225 844378
52261 844378 852379 861493 871121 880721 890615 901635 914062 927250 940344 953054 965451 977309
52249 977309 988075 997515 1005925 1013506 1019806 1024077 1026053 1026118 1024814 1022410 1018917 1014297 1008726 1002804
52235 1002804 997341 992680 988309 983529 978419 973701 969665 965752 961406 956801 952353 947987 943465 939188
52221 939188 936093 934695 934613 935093 935705 936528 937882 939931 942389 944790 947291 951024 957144 965433 974226
52206 974226 981816 987752 992728 997578 1002578 1007503 1012082 1016378 1020750 1025490 1030633 1036102 1041823 1047525
52192 1047525 1052752 1057377 1061870 1066650 1071413 1075564 1079024 1081926 1083614 1082873 1079398 1074295 1068675 1062425
52178 1062425 1054895 1046285 1037581 1029374 1021454 1013600 1006151 999621 994086 989196 984669 980631 977485 975447
52164 975447 974280 973598 973399 974012 975461 977220 978708 979746 980378 980624 980700 981090 981958 982765 982889 982464 982165
52147 982165 982362 983028 984299 986448 989132 991290 992140 991892 991151 990009 988203 985985 984225 983451 983141 982307
52131 982307 980674 979068 978718 980476 984748 991800 1001752 1014343 1029037 1045398 1063212 1082311 1102546
52118 1102546 1123879 1146129 1168636 1190580 1211715 1232388 1252670 1271943 1289668 1306085 1321690
52107 1321690 1336272 1349070 1359789 1369032 1377729 1386510 1395654 1405211 1414957 1424325 1432500 1438651 1442322
52094 1442322 1443710 1443353 1441258 1436542 1428235 1416320 1401747 1385658 1369000 1352722 1337744 1324589
52082 1324589 1313313 1303846 1296124 1289892 1284762 1280552 1277310 1275016 1273570 1273146 1274176 1276860 1280971 1286275
52068 1286275 1292853 1300828 1309954 1319703 1329701 1339953 1350619 1361592 1372310 1382137 1391111 1400058 1409695
52055 1409695 1419701 1428983 1436759 1443031 1448005 1451518 1453134 1452467 1449275 1443497 1435379 1425375 1413904
52042 1413904 1401365 1388331 1375350 1362487 1349447 1336245 1323409 1311396 1300147 1289360 1278878
52031 1278878 1268644 1258607 1248862 1239485 1229992 1219371 1207041 1193553 1179982 1166872 1154150 1141840
52019 1141840 1130330 1119953 1110694 1102339 1094599 1087054 1079332 1071492 1064021 1057292 1051081 1044668 1037275
52006 1037275 1028420 1017988 1006074 992683 977538 960238 940743 919767 898656 878698 860443
51995 860443 843683 828133 813915 801212 789619 778238 766438 754216 741788 729217 716609
51984 716609 704254 692244 680149 667406 653935 640077 626087 611989 597899 584189 571249
51973 571249 559304 548554 539379 532288 527666 525555 525694 527762 531507 536561 542313 548253 554449 561281
51959 561281 568529 575064 579672 581975 582234 580550 576740 570993 564192 557415 551328 546165 542056 539185
51945 539185 537660 537425 538350 540408 543750 548693 555666 565099 577061 590799 604853 617995 630017
51932 630017 641273 651493 659439 663841 664281 661121 655013 646709 636813 625355 612055 597393 582981
51919 582981 570303 559433 549608 540730 533538 528433 525080 523429 524441 529399 538886 552705 570336
51906 570336 590993 613359 635475 654853 668741 674902 672687 663352 649173 632215 613825 594758
51894 594758 575343 555598 535509 515356 495816 477873 462539 450302 440667 432574 425548 420267
51882 420267 417743 418040 420105 422819 426016 430442 436922 445564 455617 465966 475682 484146 490824 495229
51868 495229 497179 496827 494292 489511 482662 474536 466212 458407 451385 445396 440897 438256 437459 438155 439842
51853 439842 441977 444124 446104 447892 449280 449722 448603 445624 440933 435032 428687 422777 417952 414257
51839 414257 411156 408026 404688 401462 398773 396819 395605 395140 395463 396532 398206 400344 402754 405031 406611
51824 406611 407132 406687 405592 403946 401596 398574 395452 393063 391879 391723 392116 392853 394136 396159 398619
51809 398619 400743 401839 401846 401283 400590 399552 397564 394524 391237 388713 387223 386368 385917 386039 386556 386580 385344
51792 385344 383116 380770 378638 376355 373771 371434 369965 369394 369349 369535 369717 369519 368578 366899 364861 363008
51776 363008 361932 362142 363778 366500 369803 373363 377051 380892 385220 390657 397593 405709 414183 422240
51762 422240 429283 434726 438122 439420 438748 435969 430913 424187 417315 411702 407632 404396 401196 397726
51748 397726 394113 390646 387510 384594 381612 378625 376291 375333 375784 377061 378750 381020 384235 388581 394193
51733 394193 401182 409042 416223 420868 422207 421097 419226 417994 418133 419841 422868 426512 429797 431730
51719 431730 431431 428343 422695 415754 409289 404604 402021 401144 401298 401736 401808 401256 400311 399425 399058 399800 402377
51702 402377 407112 413252 419096 422945 424012 422586 419640 416351 413779 412629 413201 415482 419070 422904
51688 422904 425272 424585 420449 413997 407004 400618 394909 389527 384576 380708 378432 377568 377532 378067 379391
51673 379391 381460 383376 383964 383080 382000 382240 384209 387363 391451 397014 404423 412928 421051 427679 432342
51658 432342 434663 434207 431138 426584 422020 418509 416771 417662 422038 430047 440729 452262 462346 468660
51644 468660 469770 466004 459134 450780 441397 431009 420434 410953 402894 395331 387552 380197 374510 370807
51630 370807 368193 365659 363102 361345 361409 363605 367027 370042 371505 371404 370208 368022 364847 361266 358149
51615 358149 355717 353548 351522 350089 349500 349458 349808 350920 353001 355505 357680 359297 360526 361570 362845
51600 362845 365047 368483 372650 376999 381859 388114 396274 406237 417443 428517 437153 441376 441018 437365
51586 437365 431544 424114 416048 408943 403827 400583 398961 399348 402107 407027 414133 424290 438039 454150
51572 454150 470307 485234 499567 514654 531077 548299 565062 579916 591940 601451 610032 619859
51560 619859 633088 651620 676862 709325 748400 792337 838192 882074 920229 950404 972099
51549 972099 985565 990916 988190 977602 959241 932943 899144 859747 817583 774930 733010 692773
51537 692773 655359 621438 590787 563154 539076 519119 502646 488203 475055 463484 453520 444455
51525 444455 436094 429474 425510 423477 421692 419271 416391 413221 409735 406505 404575 404251 404762 405383 406145
51510 406145 407218 408426 409754 411616 414006 415978 416517 415525 413447 410467 406645 402404 398176 393854 389274
51495 389274 385021 382040 380493 379624 378727 377658 376405 374785 372840 371014 369674 368694 367607 365980 363587
51480 363587 360561 357470 355013 353454 352443 351367 349710 347169 343698 339608 335501 332038 329698 328451
51466 328451 327547 325912 323172 320162 318111 317491 317985 319325 321517 324210 326519 327778 328209 328607 329604 331401
51450 331401 333954 337212 341281 346462 353035 361038 370455 381625 395079 410769 427540 443428 456423
51437 456423 465158 469317 469704 467812 465171 462886 461381 460014 457042 450588 440113 426849 412725 399136
51423 399136 386848 376499 368592 362988 358911 355703 353398 352421 352799 353896 355004 356052 357547 359856
51409 359856 362750 365762 368733 371834 375213 378875 382804 386938 391038 394760 397859 400250 402063 403805
51395 403805 406178 409347 412568 414976 416667 418616 421554 425456 430141 435908 443435 453428 466522 483237
51381 483237 503867 528689 558238 592996 632830 677218 726078 779650 837097 895570 951048
51370 951048 999927 1039771 1069200 1087698 1095355 1092364 1078858 1055384 1023162 983584 937872 887656
51358 887656 835476 783958 734594 687831 644246 604911 570488 540581 514317 491221 471266
51347 471266 454429 440534 429365 420571 413460 407174 401160 395406 390183 385571 381321 377091 372784
51334 372784 368593 364784 361465 358494 355552 352411 349216 346370 343941 341377 338204 334851 332354 331192
51320 331192 330899 330883 331089 331595 332118 332390 332644 333183 333771 334020 334250 335416 338090 341876 345868 349427 352469
51303 352469 355237 357813 359853 360966 361387 361828 362367 361969 359646 355734 351455 347546 344031 341115 339272
51288 339272 338299 337145 335124 332760 331149 331018 332604 335851 340218 344794 349060 353218 357399 360951 362993
51273 362993 363363 362544 360996 359081 357453 356859 357475 358831 360474 362356 364583 367027 369252 370678 370955
51258 370955 370358 369626 369141 368481 367092 365107 362963 360497 357188 353363 350343 349044 348963 348976 348704 348658 349324
51241 349324 350722 352689 355006 357118 358195 357818 356470 355094 354177 353380 352112 350310 348460 346849 345127
51226 345127 342906 340592 339118 338845 339160 339381 339612 340343 341578 342850 343988 345334 347158 349261 351248
51211 351248 352919 354323 355731 357606 360325 363832 367791 372090 376873 381921 386472 389933 392483 394565
51197 394565 395966 395834 393681 390090 386330 383423 381554 380188 378646 376631 374293 371932 369841 368455
51183 368455 368274 369319 370846 371987 372668 373526 374915 376381 377315 377786 378402 379486 380674 381327 381142 380334
51167 380334 379434 378985 379280 380155 381042 381412 381267 381135 381395 381664 381094 379342 377045 375176 374092 373394 372531
51150 372531 371341 370077 369184 369002 369499 370307 371168 372201 373473 374440 374278 372799 370720 368867 367416 366042
51134 366042 364453 362576 360420 358095 355855 353949 352536 351838 352131 353394 355132 356783 358216 359588 360908
51119 360908 362070 363297 365175 368081 371788 375716 379426 382710 385391 387379 389016 391126 394420 398777
51105 398777 403279 407089 410143 412923 415663 418033 419487 419695 418709 417045 415591 415022 415097 414831 413602 411872
51089 411872 410574 410027 409801 409479 409096 408739 408112 406779 404786 402820 401704 401760 402692 403977 405223 406137 406404
51072 406404 405963 405373 405587 407132 409634 412258 414545 416731 419372 422752 426667 430894 436001 443501 454700
51057 454700 469174 484623 498397 509088 516797 522490 527522 533463 541783 553414 568434 585793
51045 585793 603347 618781 631063 640748 648466 653464 654192 650149 642532 633177 623499 614400 606290 598581
51031 598581 589605 577673 562434 545181 528040 512887 500663 491367 484638 480329 478406 478426 479576
51018 479576 481407 484152 488101 492973 498325 504389 511927 521170 531218 540777 549288 557171 565071 573174
51004 573174 581237 589062 596768 604758 613563 623526 634396 645385 655944 666446 677636 689365 700378
50991 700378 709612 717197 723767 729279 733231 735800 737903 739977 741500 742121 742760 745007 749594 755772 762039
50976 762039 767182 770853 773703 777186 783031 792544 806236 823940 845255 869983 898240 930186 965651
50963 965651 1004155 1045253 1088753 1134557 1182465 1232155 1283178 1334792 1385897 1435377 1482485
50952 1482485 1526753 1567516 1603743 1634557 1659962 1680949 1698884 1714816 1729461 1743691 1758839
50941 1758839 1776366 1797024 1819974 1842556 1861229 1873478 1879126 1879705 1876651 1870418 1861181 1849445
50929 1849445 1835345 1817875 1795663 1768397 1736820 1701341 1661289 1615784 1564927 1509952 1452599
50918 1452599 1394547 1337087 1281040 1227075 1176165 1129411 1087287 1049349 1014894 983624 955500
50907 955500 930212 907236 886369 867849 851809 837769 824838 812389 800454 789421 779471 770510
50895 770510 762560 755805 750054 744513 738562 732622 727802 724671 722740 721236 720059 719804 721087 723916
50881 723916 727588 731150 734132 736870 740015 743842 748279 753413 759508 766585 774455 783282 793643 805836
50867 805836 819509 834166 849752 866486 884469 903730 924468 947004 971639 998713 1028733
50856 1028733 1062367 1100406 1143642 1192473 1246630 1305691 1369878 1439992 1516507 1599261 1688184
50845 1688184 1783693 1885815 1993307 2104272 2217518 2332845 2449884 2566868 2680478 2786728
50835 2786728 2882163 2964645 3033322 3088155 3129710 3159238 3178345 3188351 3190395 3186485 3180052 3175038
50823 3175038 3174526 3180399 3193778 3215084 3243644 3277671 3314674 3351577 3384479 3408753 3419766 3413871
50811 3413871 3389207 3345909 3285377 3208906 3117007 3010249 2890587 2761510 2626919 2490215
50801 2490215 2354487 2223050 2099171 1985097 1881471 1787939 1704346 1631162 1568697 1516271
50791 1516271 1472599 1436860 1408905 1388419 1374483 1366105 1362532 1362625 1364432 1366000 1366469 1365938 1364475 1361746
50777 1361746 1357489 1351899 1345366 1338078 1329906 1320540 1309705 1297226 1282796 1265787 1245705 1222876
50765 1222876 1198310 1172769 1146430 1119603 1093113 1067638 1043206 1019858 998247 979068 962375
50754 962375 948147 936984 929419 924878 922191 920948 921474 923722 927203 932082 939289 949386 962245
50741 962245 978147 998175 1022980 1051994 1084587 1121369 1163528 1211191 1263161 1318123 1375491
50730 1375491 1435093 1496586 1559338 1622583 1685549 1747531 1807936 1866287 1922260 1975713 2026416
50719 2026416 2073612 2115877 2151409 2178331 2194947 2200296 2194797 2180274 2159290 2134646 2109402 2086720
50707 2086720 2069142 2058018 2053727 2056187 2064935 2079024 2097231 2118366 2141136 2163656 2183256 2196808
50695 2196808 2201329 2194474 2174764 2141623 2095513 2038215 1972739 1902467 1830214 1758171 1688575 1623862
50683 1623862 1565938 1515522 1472466 1436540 1407753 1386126 1371440 1363319 1361522 1366181 1377696 1396286
50671 1396286 1421641 1453051 1489635 1530139 1572626 1614754 1654570 1690958 1723412 1751738 1775939
50660 1775939 1796143 1812577 1825783 1836737 1846402 1855186 1863177 1870759 1878485 1886315 1893582 1899863 1905525
50647 1905525 1911394 1918485 1928213 1942161 1961114 1984701 2012359 2044234 2080804 2122011 2167173 2215256
50635 2215256 2264657 2313122 2358698 2400817 2439961 2476316 2509282 2538473 2564849 2590687 2618191
50624 2618191 2647172 2673019 2687037 2680222 2648312 2594121 2525510 2451380 2378938 2313170 2257291
50613 2257291 2213056 2180857 2159920 2148721 2145565 2149030 2157859 2170353 2183928 2195460 2202142 2201938
50601 2201938 2193247 2174493 2144461 2103136 2051968 1993140 1928734 1860621 1790753 1721062 1653096
50590 1653096 1588084 1527286 1471787 1421771 1376349 1334455 1295905 1261431 1231705 1206333 1183743
50579 1183743 1162187 1141029 1121055 1103419 1088553 1076359 1067149 1061642 1059995 1061448 1065173 1070932
50567 1070932 1078655 1087859 1097903 1108531 1119859 1132155 1145874 1161591 1179615 1200006 1223195 1250127
50555 1250127 1281376 1316476 1354530 1395032 1437577 1481083 1524011 1565190 1603886 1639279 1670693
50544 1670693 1698543 1724535 1750643 1778071 1807232 1838386 1872237 1910117 1953535 2003283 2058998
50533 2058998 2119821 2185376 2255969 2332205 2414939 2505348 2604423 2712244 2828120 2951199 3080373
50522 3080373 3213647 3348267 3481608 3611428 3735183 3849751 3952110 4039785 4110390 4161307
50512 4161307 4190297 4196211 4178896 4138748 4076609 3993852 3892511 3775777 3648506 3516565 3385116
50501 3385116 3257812 3137885 3029297 2936081 2860833 2804567 2767846 2751270 2754781 2777134 2816186
50490 2816186 2869089 2931836 2998968 3064084 3120557 3161892 3182056 3176329 3142290 3080312 2993372
50479 2993372 2886328 2764805 2634105 2498789 2362944 2230364 2104115 1986012 1876728
50470 1876728 1776397 1685002 1602311 1527739 1460450 1399625 1344703 1295453 1251852 1213869 1181368
50459 1181368 1154175 1132121 1114966 1102426 1094326 1090589 1090811 1093886 1098230 1102489 1105988 1108652 1110745
50446 1110745 1112756 1115294 1118855 1123644 1129679 1136870 1144911 1153230 1161261 1168803 1176012 1183057 1189903 1196456
50432 1196456 1202829 1209499 1217188 1226520 1237590 1249936 1263073 1277096 1292606 1309998 1328974 1348856
50420 1348856 1369351 1390956 1414658 1441301 1471253 1504615 1541599 1582591 1627948 1677991 1733151
50409 1733151 1793659 1858844 1927067 1996727 2067026 2137276 2205737 2269944 2328320 2380721 2427128
50398 2427128 2466463 2497068 2517643 2526952 2523093 2504213 2470155 2422725 2364170 2296032 2219790 2137951
50386 2137951 2053838 1970576 1890827 1817270 1752458 1697887 1653652 1619522 1596085 1584368 1584372 1594470
50374 1594470 1612397 1636365 1664848 1695543 1725060 1749724 1766397 1772582 1766368 1746808 1714455 1671291
50362 1671291 1619941 1562824 1501885 1439004 1376487 1316778 1261425 1210407 1162761 1117780 1075315
50351 1075315 1035184 997035 961134 928739 901128 878424 859700 844077 831310 821431 814310 809726
50339 809726 807629 808196 811683 818224 827753 840182 855658 874265 895035 915241 931008 939029 938084
50326 938084 929393 915844 900654 886220 873768 863841 856880 853259 852872 854942 858333 862141 866086
50313 866086 870344 874871 878991 881917 883626 884893 886444 888526 891347 895244 899997 904533 907965 910621
50299 910621 913432 916595 919555 922240 925433 929691 934519 939006 942861 946374 949631 952195 953672 954455
50285 954455 955942 959862 967083 976787 986773 994624 998748 998812 995726 991272 987327 985170 985382 988070 992835
50270 992835 998750 1004984 1011496 1018621 1025845 1031552 1034332 1034262 1032577 1030394 1028084 1025627 1023092 1020695 1018632
50255 1018632 1016982 1015741 1014956 1014860 1015725 1017571 1020269 1024110 1030133 1039621 1053242 1070802 1091764 1115835
50241 1115835 1142994 1173120 1205702 1239875 1274612 1308795 1341248 1371017 1397800 1422088 1444751
50230 1444751 1466446 1487253 1506515 1522786 1534113 1538655 1535096 1522564 1500599 1469687 1431645 1389073
50218 1389073 1344355 1299390 1256003 1215981 1180579 1150375 1125697 1106594 1091951 1078916 1063724
50207 1063724 1043418 1017134 986179 953137 920561 890047 862246 837523 816228 798346 783262
50196 783262 770290 759324 750635 744017 738368 732350 725410 718035 710941 704225 697517 690838 684820 679925
50182 679925 675911 672386 669445 667202 665021 662033 658417 655394 653660 652488 650780 648521 646643 645784
50168 645784 645738 646064 646724 647959 649819 652031 654328 656775 659637 662910 666268 669722 674130 680615 689489
50153 689489 700127 711848 724390 737359 749805 760714 769610 776440 781241 784319 786404 788187 789856
50140 789856 791381 793036 795290 798449 802851 809340 819037 832643 850230 871679 896911 925718 957813
50127 957813 993291 1032776 1076921 1125872 1179229 1236196 1295465 1355059 1412755 1467072 1518040
50116 1518040 1567034 1615736 1665183 1715534 1766263 1816025 1862233 1901263 1929574 1944734 1945438 1930946
50104 1930946 1901096 1856970 1801250 1737566 1669382 1599378 1529517 1461306 1395796 1333603 1275306
50093 1275306 1221954 1174939 1135110 1102083 1074508 1050787 1029470 1009415 990233 972588 957599
50082 957599 945756 936666 929727 924593 920976 918578 917500 918233 920868 924618 928378 931473 933658 934807
50068 934807 935043 934814 934351 933210 930804 927251 923212 918930 913899 907560 899982 891774 883558 875612 867848
50053 867848 860111 852665 846326 841935 839681 839010 839081 839179 838985 838906 840144 844020 850975 860271 870610 880904
50037 880904 890677 900209 910433 922296 935946 950567 965070 978685 990866 1001085 1009164 1015645
50025 1015645 1021362 1026467 1030234 1031958 1031849 1030755 1029180 1026943 1023761 1019794 1015413 1010755 1005840 1001085
50011 1001085 997490 996334 998797 1005703 1017313 1033293 1053024 1076026 1102127 1131314 1163545 1198432
49999 1198432 1234955 1271704 1307641 1342418 1375753 1406931 1435430 1461675 1486309 1508621 1526257
49988 1526257 1536494 1537163 1526363 1502399 1464852 1415429 1357278 1293726 1227855 1162665 1100815 1044096
49976 1044096 993406 949004 910563 877292 848465 823789 803075 785740 770892 757706 745530
49965 745530 733977 723161 713578 705411 698246 691783 686549 683461 682929 684751 688697 694687 702512 711813
49951 711813 722329 733835 745834 757472 767739 775740 781083 784280 786455 788297 789449 789085 786735
49938 786735 782262 775487 766400 755467 743139 729239 713388 695990 678336 661733 646849 633796
49926 633796 622389 612314 603370 595608 589107 583854 580042 578121 578204 579678 581793 584279 587010 589521
49912 589521 591483 593290 595498 598062 600940 605135 612069 621866 633193 644977 657408 671021 685639
49899 685639 700563 715099 728406 739468 747740 753485 757115 758632 757987 755529 751524 745526 736689
49886 736689 724756 710579 695768 681800 669155 657161 644807 631755 618433 605412 593201
49875 593201 582540 574222 568390 564418 561525 559064 556314 552773 548977 546388 546076 547878 551074 555333
49861 555333 560685 567115 574662 583529 593731 604984 617205 630597 644867 658874 671602 683008
49849 683008 693333 701976 707820 710596 711291 711178 710814 709836 707212 701790 693137 682025 669834 657526
49835 657526 645443 633933 623656 615215 608817 604351 601471 599554 597918 596307 595059 594773 595917 598755
49821 598755 603468 610255 619298 630544 643440 657014 670404 683237 695416 706681 716556 724683
49809 724683 731028 735870 739667 742783 745126 746058 744850 741138 734929 726425 716129 705010 694203 684418
49795 684418 675738 667896 660546 653303 645831 638111 630557 623755 618064 613504 609981 607510 606142 605681
49781 605681 605633 605500 605053 604214 602856 601032 599368 598945 600620 604493 610046 616659 623985 631967 640515 649066
49765 649066 656570 662086 665438 667195 668152 668990 670102 671270 671475 669438 664541 657101 647897 637715 627175
49750 627175 616453 605217 593358 581818 572092 564778 559141 554278 550043 546539 543442 540409 537689
49737 537689 535713 534386 533358 532739 532945 533975 535414 537151 539578 543031 547346 552075 556881 561787 567253
49722 567253 573944 582246 592028 602991 614936 627378 639135 648847 655998 661163 665219 668522 670812
49709 670812 671610 670543 667409 662080 654518 645052 634614 624410 615255 607432 601166 596771 594052 591985
49695 591985 589467 586328 583340 581463 581223 582529 584714 587060 589638 593341 598684 604908 610844 616409
49681 616409 622559 629883 638041 646736 656470 667962 681406 696738 714032 732763 750768 764776
49669 764776 772552 774400 772413 768519 763619 758390 754022 751590 751019 751349 751972 752906 753606 752151 746261
49654 746261 735063 719668 702285 684997 669037 654751 642148 631527 623309 617215 612151 607353
49642 607353 603339 601226 601383 603151 605666 608342 610634 611978 612117 611156 609197 606205 602217 597491 592440
49627 592440 587628 583622 580551 577928 575174 572131 568802 565024 560954 557607 556105 556401 557330 557967 558261
49612 558261 558376 558201 557818 557753 558298 559080 559727 560551 562060 564103 565943 567025 567271 566816 565934 565215 565386 566738
49594 566738 568855 570968 572588 573768 574853 575975 576888 577386 577768 578655 580359 582650 585163 587728 590220
49579 590220 592369 593992 595261 596567 598200 600245 602650 605248 607837 610434 613431 617344 622388 628375
49565 628375 635102 642739 651691 661933 672553 682197 690040 696155 700878 704113 705508 705074 703310 700800
49551 700800 697970 695054 692006 688574 684863 681737 680245 680556 681828 683109 683993 684378 684086 683008 681419
49536 681419 679875 678902 678769 679426 680748 683165 687844 695698 706130 717306 727957 738601 750826 765811
49522 765811 783710 803798 824577 843944 859911 871382 878267 881171 881232 879963 878710 878231 878935 881245
49508 881245 885385 890974 897164 902977 907138 907852 903538 894032 880729 865460 849520 833798 819186
49495 819186 806398 795518 786087 777598 769798 762710 756517 751309 746885 742959 739652 737438 736365 735667
49481 735667 734573 733324 732891 733769 735539 737624 739859 742093 743811 744651 744973 745366 745882 746283 746936 748727
49465 748727 751967 755880 759459 762399 764916 767008 768349 768738 768304 767261 765639 763239 759744 754988 749289
49450 749289 743361 737743 732393 726978 721384 715768 710275 704993 700144 696042 692848 690526 689059 688564
49436 688564 689156 690809 693320 696347 699570 702992 707057 712361 719203 727514 737173 748204 760590 774094
49422 774094 788519 804173 821548 839933 856377 866833 869125 864802 857820 851588 847536 845850 846450
49409 846450 849091 853527 860098 869603 882082 896151 909998 922713 934337 945138 955384 965508
49397 965508 975914 986735 998094 1010301 1023354 1036520 1048827 1059757 1069114 1076555 1081720 1084565
49385 1084565 1085118 1083168 1078652 1072090 1064138 1054932 1044350 1032697 1020681 1008991 998307 989367 982466
49372 982466 977165 973079 970626 970389 972193 975536 980486 987136 994429 1000593 1004765 1007273 1008392 1007871 1005726
49357 1005726 1002391 997823 991516 983725 975695 968257 961126 954036 947583 942328 937926 933929 930788 929223
49343 929223 929142 929859 930967 932285 933300 933350 932076 929219 924349 917479 909655 902309 896136 891075 887023
49328 887023 883960 881566 879471 877845 877231 877739 878874 880206 881856 884314 888047 893174 899156 904940 909832
49313 909832 914263 919337 925612 932654 939803 947051 955043 964502 975753 988647 1002745 1017620 1033145
49300 1033145 1049546 1067069 1085337 1102793 1116880 1125083 1126025 1119781 1107569 1091550 1074531 1058997
49288 1058997 1045937 1034775 1024468 1014292 1003644 991849 978800 965595 954016 945247 939133 934643
49276 934643 931049 928699 928530 930722 934219 938007 942473 948789 957153 966530 976094 985871 995557 1003714
49262 1003714 1008837 1010673 1009948 1007400 1003779 1000380 998873 1000580 1006127 1015392 1027502 1041330 1056174
49249 1056174 1071312 1084548 1092303 1092157 1084775 1072531 1056818 1037821 1016454 994973 975333 957938
49237 957938 942373 928525 916511 906207 897506 890736 886369 884471 884717 886809 890594 895821 902010
49224 902010 908712 915887 923944 933261 943637 954326 964578 974025 982646 990708 998682 1006710 1014108
49211 1014108 1019932 1024277 1028434 1033472 1039179 1044822 1050454 1056970 1065259 1075752 1088413 1102620 1117374
49198 1117374 1132081 1146814 1161498 1175356 1187809 1199442 1211299 1223513 1235316 1246143 1255980
49187 1255980 1264788 1272371 1278783 1284281 1289022 1293424 1298621 1305848 1315465 1327186 1341060 1357441 1376257
49174 1376257 1397442 1422179 1452735 1490543 1534969 1583870 1634240 1681827 1721165 1747412 1758723
49163 1758723 1756977 1746559 1732454 1718799 1708291 1702226 1700606 1702078 1704416 1705819 1705786 1704441 1701534
49150 1701534 1696931 1691756 1687928 1686363 1686501 1687758 1690482 1695121 1701399 1708887 1717721 1728140 1739877 1752593
49136 1752593 1766408 1781384 1796897 1812139 1827003 1841995 1857566 1873977 1891430 1909629 1927463
49125 1927463 1943903 1959261 1975037 1992390 2011160 2030442 2049649 2068835 2088368 2108632 2129895
49114 2129895 2152194 2175392 2199596 2225691 2255462 2291242 2335547 2390947 2459399 2540108 2627121
49103 2627121 2710158 2780617 2838928 2895543 2962050 3038555 3108952 3150006 3147689 3107026 3047096
49092 3047096 2986254 2930691 2874853 2810498 2734852 2652057 2569504 2493672 2428189 2374045 2330700
49081 2330700 2296885 2270763 2250127 2233249 2219653 2209635 2202886 2197822 2192401 2185425 2177101 2168654
49069 2168654 2161432 2156095 2152437 2149909 2148123 2146692 2144941 2142268 2138731 2134909 2131245 2127924 2125242 2123484
49055 2123484 2122268 2120569 2117726 2114208 2111116 2109128 2108095 2107536 2107373 2108104 2110218 2113527 2117432 2121967 2128144
49040 2128144 2136939 2148296 2161518 2176072 2191233 2205327 2216317 2223384 2227299 2229276 2230158 2230761 2232062
49027 2232062 2234582 2238013 2241688 2245012 2247407 2248516 2248732 2248902 2249272 2249318 2248946 2249200 2251284 2255310 2260459 2265954
49011 2265954 2271487 2277119 2283317 2290828 2300024 2310444 2321247 2331968 2342637 2353460 2364647 2376307
48999 2376307 2388138 2399400 2409404 2417927 2425000 2430528 2434307 2436298 2436801 2436486 2436094 2435746 2434639 2431984
48985 2431984 2428257 2424947 2422923 2421673 2420384 2419035 2417998 2417147 2415994 2414378 2412483 2410401 2408065 2405408
48971 2405408 2402227 2398187 2393347 2388405 2384014 2380022 2375764 2370962 2366102 2362055 2359571 2358961 2359995 2362234
48957 2362234 2365596 2370433 2376991 2385079 2394389 2404743 2415873 2427364 2439078 2451313 2464347 2478215
48945 2478215 2493126 2509545 2527513 2546316 2565275 2584546 2604840 2626751 2650741 2677367 2707038
48934 2707038 2739800 2775709 2815044 2857699 2902695 2948839 2995741 3043866 3093833 3145991 3200316
48923 3200316 3256329 3313437 3371770 3432253 3495335 3559962 3624367 3687453 3748837 3807963 3864191
48912 3864191 3917685 3969426 4020170 4069931 4118465 4165543 4210669 4253253 4293383 4331922 4369487
48901 4369487 4405691 4439702 4471251 4500792 4528892 4555773 4581312 4605244 4627318 4647460 4665837
48890 4665837 4682686 4697848 4710362 4718693 4721768 4719896 4714439 4706484 4696031 4682480 4665491 4645241
48878 4645241 4622346 4597764 4572223 4545193 4514747 4479078 4438061 4392887 4344427 4292639 4237581
48867 4237581 4180231 4121866 4063047 4003683 3944048 3885294 3828781 3774960 3723220 3672840 3623875
48856 3623875 3576886 3532128 3489472 3448966 3410932 3375417 3342173 3311301 3283421 3258980 3237946
48845 3237946 3220399 3206796 3197187 3190735 3186491 3184226 3184060 3185818 3189348 3195071 3203498 3214456 3227386
48832 3227386 3242143 3258859 3277213 3296447 3315998 3335659 3355329 3375184 3395832 3417633 3440022
48821 3440022 3462217 3484479 3507987 3533398 3560172 3587314 3614102 3640037 3664786 3688479 3711653
48810 3711653 3734736 3757930 3781539 3805872 3830755 3855665 3880471 3905552 3931120 3957007 3983383
48799 3983383 4011101 4040906 4072594 4105184 4137540 4168554 4197092 4222406 4244613 4264487 4282695
48788 4282695 4299408 4314677 4329035 4343366 4357934 4371489 4381606 4386145 4384340 4376545 4363376 4345398
48776 4345398 4323278 4297673 4268917 4237161 4202768 4166272 4127932 4087612 4045103 4000396 3953723
48765 3953723 3905539 3856450 3806960 3757357 3707880 3658762 3609986 3561383 3513263 3466580 3422106
48754 3422106 3379726 3339058 3300486 3265012 3233099 3204122 3176923 3150582 3124780 3099838 3076409
48743 3076409 3054898 3035389 3018367 3005004 2996199 2991594 2990046 2990675 2992671 2994432 2994008 2990669 2985352
48730 2985352 2979442 2973796 2969023 2965747 2964087 2963494 2963589 2964798 2967699 2972117 2977213 2982206 2986618 2990050 2992201
48715 2992201 2993130 2993274 2993118 2992816 2992114 2990711 2988805 2987167 2986462 2986706 2987613 2989275 2992037 2995839 3000180 3004701
48699 3004701 3009303 3013716 3017551 3020953 3024670 3029184 3034254 3039566 3045355 3051849 3058365 3063512 3066437 3067560
48685 3067560 3068009 3068527 3069073 3069385 3069680 3070686 3073055 3076831 3081368 3085539 3088096 3088202 3085724 3080880 3073652
$$ [...]
##END NTUPLES=NMR SPECTRUM
##END=
