
##TITLE=UV1267_M12_1292-1216_50_7414289_y3Ng7DHpK0
##JCAMPDX= 6.0         $$ Bruker NMR JCAMP-DX V2.0
##DATA TYPE= NMR SPECTRUM
##DATA CLASS= NTUPLES
##ORIGIN= BRUKER
##OWNER= Administrator
$$ 1.72 TOPSPIN		Version 2.1
$$ 2013-01-25 19:31:07.954 -0500  Administrator@X
$$ Compression mode = diff/dup
##.OBSERVE FREQUENCY= 400.02188249412
##.OBSERVE NUCLEUS= ^1H
##.ACQUISITION MODE= SIMULTANEOUS (DQD)
##.ACQUISITION SCHEME= undefined
##.AVERAGES= 8
##.DIGITISER RES= 22
##SPECTROMETER/DATA SYSTEM= spect
##.PULSE SEQUENCE= zg30
##.SOLVENT NAME= COFFEE_meoh
##.SHIFT REFERENCE= INTERNAL, COFFEE_meoh, 1, 14.98509
##AUDIT TRAIL= $$ (NUMBER, WHEN, WHO, WHERE, PROCESS, VERSION, WHAT)
$$ ##TITLE= Audit trail, TOPSPIN		Version 2.1
$$ ##JCAMPDX= 5.01
$$ ##ORIGIN= Bruker BioSpin GmbH
$$ ##OWNER= Administrator
$$ $$ E:\/data/COFFEE/nmr/UV1267_M12_1292-1216_50_7414289_y3Ng7DHpK0/10/pdata/1/auditp.txt
$$ ##AUDIT TRAIL=  $$ (NUMBER, WHEN, WHO, WHERE, PROCESS, VERSION, WHAT)
(   1,<2013-01-25 19:30:57.545 -0500>,<Administrator>,<X>,<go>,<TOPSPIN 2.1>,
      <created by zg
	started at 2013-01-25 19:29:51.451 -0500,
	POWCHK enabled, PULCHK disabled,
       configuration hash MD5:
       86 BA 57 50 F2 9D 5C 9B 26 00 A9 28 5F 66 2E 89
       data hash MD5: 64K
       CA 29 8F 4D A8 C3 EB 78 21 54 7C 6E 04 9A 98 AA>)
(   2,<2013-01-25 19:31:01.217 -0500>,<Administrator>,<X>,<proc1d>,<TOPSPIN 2.1>,
      <Start of raw data processing
       efp LB = 0 FT_mod = 6 PKNL = 1 PHC0 = 0 PHC1 = 0 SI = 32K 
       data hash MD5: 32K
       83 E2 45 2E 48 B3 61 C1 81 89 20 56 2A C9 9C 73>)
(   3,<2013-01-25 19:31:02.643 -0500>,<Administrator>,<X>,<proc1d>,<TOPSPIN 2.1>,
      <pk PHC0 = 100.3326 PHC1 = 0 
       data hash MD5: 32K
       48 F2 33 08 0A 0D 10 7A 95 B2 72 02 50 F2 D0 48>)
(   4,<2013-01-25 19:31:03.159 -0500>,<Administrator>,<X>,<proc1d>,<TOPSPIN 2.1>,
      <abs ABSG = 1 
       data hash MD5: 32K
       82 0C F3 A9 A7 76 53 B7 60 2F D1 F1 47 BB 77 E4>)
(   5,<2013-01-25 19:31:03.314 -0500>,<Administrator>,<X>,<proc1d>,<TOPSPIN 2.1>,
      <abs ABSG = 2 
       data hash MD5: 32K
       6B 30 35 CC 03 BA F8 B8 FC 06 3A 03 D0 1B 98 63>)
(   6,<2013-01-25 19:31:03.468 -0500>,<Administrator>,<X>,<proc1d>,<TOPSPIN 2.1>,
      <abs ABSG = 3 
       data hash MD5: 32K
       FC A4 C8 6D A3 9A 8B 72 5D 46 1A 62 86 71 2A 9E>)
(   7,<2013-01-25 19:31:03.640 -0500>,<Administrator>,<X>,<proc1d>,<TOPSPIN 2.1>,
      <abs ABSG = 4 
       data hash MD5: 32K
       96 E5 F6 33 98 59 B1 FC C0 E9 F0 93 B0 17 FB 6B>)
(   8,<2013-01-25 19:31:03.795 -0500>,<Administrator>,<X>,<proc1d>,<TOPSPIN 2.1>,
      <abs ABSG = 5 
       data hash MD5: 32K
       41 BB 19 62 24 03 41 B5 14 A5 A1 FC 45 96 C9 8E>)
$$ ##END=
$$ 
$$ $$ hash MD5
$$ $$ B7 BB 1A 4E D1 0A F0 E3 C2 81 06 55 DC 0F 51 77
##$RELAX= 
##$RELAX= 
##$RELAX= 
##$RELAX= 
##$RELAX= 
##$RELAX= 
##$RELAX= 
$$ Bruker specific parameters
$$ --------------------------
##$DU= <E:\>
##$EXPNO= 10
$$ [...]
150 150 150 150 150 150 150 150
##$TP07= 0
##$TPNAME0= <>
##$TPNAME1= <>
##$TPNAME2= <>
##$TPNAME3= <>
##$TPNAME4= <>
##$TPNAME5= <>
##$TPNAME6= <>
##$TPNAME7= <>
##$TPOAL= (0..7)
0.5 0.5 0.5 0.5 0.5 0.5 0.5 0.5
##$TPOFFS= (0..7)
0 0 0 0 0 0 0 0
##$TUNHIN= 0
##$TUNHOUT= 0
##$TUNXOUT= 0
##$USERA1= <user>
##$USERA2= <user>
##$USERA3= <user>
##$USERA4= <user>
##$USERA5= <user>
##$V9= 5
##$VALIST= <valist>
##$VCLIST= <CCCCCCCCCCCCCCC>
##$VD= 0
##$VDLIST= <DDDDDDDDDDDDDDD>
##$VPLIST= <PPPPPPPPPPPPPPP>
##$VTLIST= <TTTTTTTTTTTTTTT>
##$WBST= 2048
##$WBSW= 25
##$XGAIN= (0..3)
0 0 0 0
##$XL= 0
##$YL= 0
##$YMAX_a= 626491
##$YMIN_a= -535120
##$ZGOPTNS= <>
##$ZL1= 120
##$ZL2= 120
##$ZL3= 120
##$ZL4= 120
##$ABSF1= 14.98509
##$ABSF2= -5.573092
##$ABSG= 5
##$ABSL= 3
##$ALPHA= 0
##$AQORDER= 0
##$ASSFAC= 0
##$ASSFACI= 0
##$ASSFACX= 0
##$ASSWID= 0
##$AUNMP= <proc_prof1d_extract_pilot.lims>
##$AXLEFT= 0
##$AXNAME= <>
##$AXNUC= <1H>
##$AXRIGHT= 0
##$AXTYPE= 0
##$AXUNIT= <>
##$AZFE= 0.1
##$AZFW= 0.1
##$BCFW= 0
##$BC_mod= 0
##$BYTORDP= 0
##$COROFFS= 0
##$CY= 15
##$DATMOD= 1
##$DC= 0
##$DFILT= <>
##$DTYPP= 0
##$F1P= 0
##$F2P= 0
##$FCOR= 0.5
##$FTSIZE= 32768
##$FT_mod= 6
##$GAMMA= 0
##$GB= 0
##$INTBC= 1
##$INTSCL= 1
##$ISEN= 128
##$LB= 0
##$LEV0= 0
##$LPBIN= 0
##$MAXI= 10000
##$MC2= 0
##$MEAN= 0
##$ME_mod= 0
##$MI= 0
##$NCOEF= 0
##$NC_proc= -8
##$NLEV= 6
##$NOISF1= 0
##$NOISF2= 0
##$NSP= 0
##$NTH_PI= 0
##$NZP= 0
##$OFFSET= 14.98509
##$PC= 1
##$PHC0= 100.3326
##$PHC1= 0
##$PH_mod= 1
##$PKNL= yes
##$PPARMOD= 0
##$PPDIAG= 0
##$PPIPTYP= 0
##$PPMPNUM= 2147483647
##$PPRESOL= 1
##$PSCAL= 4
##$PSIGN= 0
##$PYNMP= <proc.py>
##$REVERSE= no
##$SF= 400.02
##$SI= 32768
##$SIGF1= 0
##$SIGF2= 0
##$SINO= 400
##$SIOLD= 32768
##$SPECTYP= <>
##$SREGLST= <1H.CDCl3>
##$SSB= 0
##$STSI= 32768
##$STSR= 0
##$SW_p= 8223.68421052631
##$SYMM= 0
##$S_DEV= 0
##$TDeff= 65536
##$TDoff= 0
##$TI= <>
##$TILT= no
##$TM1= 0
##$TM2= 0
##$TOPLEV= 0
##$USERP1= <user>
##$USERP2= <user>
##$USERP3= <user>
##$USERP4= <user>
##$USERP5= <user>
##$WDW= 1
##$XDIM= 32768
##$YMAX_p= 467414221
##$YMIN_p= -758755
##$CURPLOT= <Network HP LaserJet P1505>
##$CURPRIN= <$Network HP LaserJet P1505>
##$DFORMAT= <normdp>
##$LAYOUT= <+/1D_H.xwp>
##$LFORMAT= <normlp>
##$PFORMAT= <normpl>
##$SURQMSG= 1
$$ End of Bruker specific parameters
$$ ---------------------------------
##NTUPLES= NMR SPECTRUM
##VAR_NAME=  FREQUENCY,     SPECTRUM/REAL,   SPECTRUM/IMAG
##SYMBOL=    X,             R,               I
##VAR_TYPE=  INDEPENDENT,   DEPENDENT,       DEPENDENT
##VAR_FORM=  AFFN,          ASDF,            ASDF
##VAR_DIM=   32768,         32768,           32768
##UNITS=     HZ,            ARBITRARY UNITS, ARBITRARY UNITS
##FACTOR=    0.250966925370066, 1,           1
##FIRST=     8223.43324360094, -142152,      -102827
##LAST=      0,             -48143,          -183785
##MIN=       0,             -758755,         0
##MAX=       8223.43324360094, 467414221,    0
$$ Real data points
##PAGE= N=1
##DATA TABLE= (X++(R..R)), XYDATA
$$ [...]
19534a22584b059A68727D1649J24482a86226E6796a85994A9627a39190o8607M3776
19523a64021B55049n9823m6712o0321N8087d5909l5326K9484D657d1154j01328
19512a42482f0922C9752M3173b26607b7732q2650A92762m4729A2593M0407b06851
19500a47766k5883H8494a3042j22151j10088L2259C7206K7889b0555B16376h9684
19488a40996A796J2695h1585a8266k63187J23999f0238A35987b81574j86380G5273
19476A59823m5919a80740O445B1388c9547I1374a74471j15605B17318h0946p7926
19465a58872H5366J03355a91252j58474e6298A30658d2115j1978k09822A983d5278
19453H8861b27102b3839G2230h9342A19811f7046E456b86756R2061j2010B57430
$$ plain form
19534 -122584 -2059 168727 41649 166131 -186226 56796 -185994 19627 -139190 -207797 -164021
19523 -164021 255049 195226 148514 88193 146280 -45909 -81235 -51751 4657 -41154 -142482
19512 -142482 -60922 39752 82925 -226607 -27732 -110382 192762 148033 12593 53000 -206851
19500 -147766 -173649 88494 -13042 -135193 -245281 -213022 37206 65095 -20555 216376 -89684
19488 -140996 1796 14491 -81585 -18266 -281453 -157454 -60238 135987 -281574 -467954 75273
19476 159823 113904 -180740 -174295 21388 -39547 91374 -174471 -290076 217318 -80946 -158872
19465 -158872 85366 188721 -191252 -349726 -56298 130658 -42115 -54093 -263915 1983 -45278
19453 88861 -227102 -23839 72230 -89342 119811 -67046 5456 -286756 -194695 -206705 257430
19441h0422j58176d7638H2850b63742g4308A1545h0159F8914C246a69632P6885
19430i2747f947G8121k2695b25057N4594d6118G4669e1921M421A27330F3322a7887
19417C07359a1466k84658K7630H0494m137b50519o1708F5652a16531I8541K39673
19406C38214B9673N2703J37848d4905j9380K95j36562j75749g3834o6059A5882
19394b44840l2983B03163c647A53323c69089d1141A16293a67113O7705L9096A41016
19382g4295m94185A15416a02379k01314a47251B01815a71636K0855j72087f1414
19371a98568e0626a9928B49487a55251l7590e5035A70673a31361q9883A40388
19360c35681J55243k7362o0053A44742b9311B05403b76917P5125A03491b70766
$$ plain form
19441 -80422 -238598 -47638 82850 -263742 -74308 11545 -80159 68914 3246 -169632 -92747
19430 -92747 -6947 78121 55426 -225057 -170463 -46118 74669 -51921 -47500 127330 63322 -17887
19417 307359 -11466 -296124 -268494 80494 76357 -250519 -312227 65652 -116531 98541 338214
19406 338214 29673 82376 220224 -44905 -64285 -63990 -200552 -376301 -73834 -139893 15882
19394 -244840 -277823 203163 -3647 153323 -369089 -41141 116293 -167113 -99408 -60312 141016
19382 -74295 -568480 115416 -102379 -303693 -147251 201815 -171636 -150781 -322868 -61414
19371 -198568 -50626 -19928 249487 -155251 -192841 -55035 170673 -131361 -221244 140388
19360 -335681 -180438 -207800 -267853 144742 -29311 205403 -276917 -201792 103491 -270766
19349A34865M9278C2957a04752B12614b0922A04152a37210C5136a15661A74498
19338b77340C08409E3129b12263L2080A09409K05028a627C15475b93557a12633
19327a65323d2424p4353j8387o3707k2481N9460d5523r3720k34165N0730D4864
19315h5088A4951a42252j53428a5655A13827m1746a7354j16998B9238a11697j30871
19304b42568I2943f3929I8579q245a52968A70541a3401j01585B9597b5344j67252
19293a92596f974C13376a7426j15205H3568c23584f4881b7481A36033a12018j47925
19282b59943F9216B3463N9773d1401E4137J18785h6774n4403D5735a17124H2963
19270B16346a48228e3083j82736A11947d9445p5891B07261b72466K4943F2273
$$ plain form
19349 134865 184143 32957 -104752 212614 -20922 104152 -137210 35136 -115661 174498
19338 -277340 308409 53129 -212263 -180183 109409 314437 -1627 315475 -293557 -112633
19327 -165323 -42424 -116777 -135164 -198871 -221352 -161892 -45523 -139243 -373408 -322678 44864
19315 -85088 14951 -142252 -295680 -15655 113827 72081 -17354 -134352 29238 -111697 -242568
19304 -242568 92943 -63929 98579 90334 -152968 170541 -13401 -114986 29597 -25344 -192596
19293 -192596 -6974 313376 -17426 -132631 83568 -323584 -64881 -27481 136033 -112018 -259943
19282 -259943 69216 23463 83236 -41401 54137 172922 -86774 -141177 45735 -117124 82963
19270 216346 -148228 -53083 -235819 111947 -49445 -125336 207261 -272466 -247523 62273
19259a15756b2395l06182D4250i0118k67944A72350m9314J33060K3061a43579
19248a63150N4731B8241f6517A60803d56305a44397c8759E7416a40708D1055N5326
19237I6381b3218G5230A7553b15818C9617L536J53256g6377E9811c39101R0725
19226b48376B2820b99683P7447J04770p8304c0287O098E7550a23692m2901L2209
19215a34384A13936e4800j74268E5447L07098c22278Q6311A67848d4777O927j19822
19204a57672N4296m77019B0336a17103M7460j99801r1581I1256J28203H0974N569
19193H6543e275A33776J40993a9469k34975E12b9445j96592d2578n9478q9648
19182a91704O5875N7047j0855F3113J2396C4109a02261A93598a94154F5311b75360
$$ plain form
19259 -115756 -22395 -328577 44250 -90118 -358062 172350 123036 256096 279157 -143579
19248 -163150 -108419 28241 -66517 160803 -456305 -144397 -38759 57416 -140708 41055 96381
19237 96381 -23218 75230 17553 -215818 39617 43153 196409 -76377 59811 -339101 -248376
19226 -248376 22820 -299683 -222236 -117466 -195770 -30287 -24189 57550 -123692 -166593 -134384
19215 -134384 113936 -54800 -229068 55447 362545 -322278 -235967 167848 -44777 -37850 -157672
19204 -157672 -103376 -580395 20336 -117103 -69643 -269444 -361025 91256 219459 80974 86543
19193 86543 -5275 133776 274769 -19469 -254444 512 -29445 -226037 -42578 -102056 -191704
19182 -191704 -125829 -68782 -79637 63113 75509 34109 -102261 193598 -194154 65311 -275360
19170H8313m1683c10602G8610J23555a36627k37861D9502J98589b12766i8781
19159b29917M7889L1742m4796R3707B53855b24641C12136d55170K16610a78j27858
19148a28036A4250J3360R7604B4400g2537B6676b23170A09419e2840I24a64595
19136I3122d11955B00955b85499J14419D3403b0150A30673c20592A25730c37955
19125g6499q9113D0267a61854b6327G3768L4219d16333K02070p7384h248I277
19113c35262A79028e0329F1894k0278a17633M8940f487j12453M3101k32956Q5101
19102b23694r6933J11675B89386B174b05414L7570E8302c00104i2497A09530O7104
19091A76634b80558A33386e7406A3857K9939K10352E8797c11177e7286A49295
$$ plain form
19170 88313 46630 -310602 78610 202165 -136627 -374488 49502 248091 -212766 -98781
19159 -229917 -182028 -150286 -195082 -101375 253855 -224641 312136 -455170 -238560 -178 -128036
19148 -128036 14250 27610 125214 24400 -72537 26676 -223170 109419 -52840 924 -164595
19136 93122 -411955 200955 -285499 -171080 43403 -20150 130673 -320592 125730 -337955
19125 -76499 -165612 40267 -161854 -26327 73768 107987 -416333 -214263 -291647 -8248 9277
19113 -335262 179028 -50329 61894 41616 -117633 -68693 -6487 -118940 -75839 -308795 -223694
19102 -223694 -320627 -208952 289386 2174 -205414 -167844 58302 -300104 -92497 109530 176634
19091 176634 -280558 133386 -57406 13857 43796 254148 58797 -311177 -57286 149295
19080A37983a15611l6694m33192a89640f4964A8691d31200a36634a512j6643m03201
19069d21356i8193D3183a89357B22088b92671c3213C60821A19512J39769b59245
19058B5825J48816d3346k68082A67148J83656C1194a80304F5393c2719j13244
19048a45963b8852k02939c6090A5995M43751b14286i6811r5144e1582k80435k6227
19037c58244G356J25005C5288J51999p3463B2018b4848j57285e1429o7775A63007
19025A15392A7838a67646I5347A6679J74318j0701J54286G6366Q1080a84091D8537
19013h6342j29200h2019G3556L17360a24726A38335b39317Q196e6648R080K743
19002d4825A73619a16667n643A63247a217B62260j00971a12469c8153E4124J26824
$$ plain form
19080 137983 -115611 -152305 -585497 -189640 -64964 18691 -431200 -136634 -1512 -18155 -421356
19069 -421356 -98193 43183 -189357 222088 -292671 -33213 360821 119512 259281 -259245
19058 25825 174641 -43346 -311428 167148 350804 31194 -180304 65393 -32719 -145963
19048 -145963 -28852 -231791 -36090 15995 459746 -214286 -96811 -191955 -51582 -332017 -358244
19037 -358244 7356 132361 35288 187287 113824 22018 -24848 -182133 -51429 -119204 163007
19025 115392 17838 -167646 95347 16679 190997 180296 334582 76366 157446 -184091 48537
19013 -86342 -215542 -82019 73556 390916 -124726 138335 -239317 -231121 -56648 -47568 -44825
19002 -44825 173619 -116667 -122310 163247 -1217 262260 161289 -112469 -38153 54124 180948
18991A80948b34263n6062B04862e749l33825D360b54336j57199B38014b35862
18980D6760K3873J34996b58819J20865l9850Q2703B56970a17054H910b0342j02303
18969a22645j28727b391r1097q8591P1905o1462j41091F0276b17591I8547b53486
18957b88794J01928r8635j55105A78828d03870J57671D19608c09069C2643c66818
18946H3076f9330G0292J46574m9622h0983G4899a68114h2133B59424i3368c0122
18934F7654K3541b34863A68f9021q8898A12750e1924j6353j3026j5915b7761I5406
18921g1756E1232a62082j8316D62508a5341A40825J36038a32446j38884O1941
18911b09389G8243d65451a49540A35845J4455a71052p329h6464A63622b6491j06920
$$ plain form
18991 180948 -234263 -290325 204862 -5749 -339574 4360 -254336 -411535 238014 -235862
18980 46760 70633 205629 -258819 -137954 -177804 -95101 256970 -117054 8910 -20342 -122645
18969 -122645 -251372 -2391 -93488 -182079 -110174 -171636 -312727 60276 -217591 98547 -253486
18957 -288794 -186866 -285501 -440606 178828 -403870 -246199 419608 -309069 32643 -366818
18946 83076 -69330 70292 216866 167244 -80983 74899 -168114 -82133 259424 -93368 -30122
18934 67654 91195 -234863 168 -69021 -157919 112750 -51924 -68277 -81303 -97218 -27761 95406
18921 -71756 51232 -162082 -180398 462508 -15341 140825 276863 -132446 -271330 -209389
18911 -209389 78243 -465451 -149540 135845 150300 -171052 -178381 -86464 163622 -26491 -133411
18900a33411k64474C56394H6033a69963E7139J44748d6307A67134D3077K62467
18890C05544i7084M0095A56689a26915r3698q5417B02239i0267F8179J02428L3477
18879B04084p9287k425j7974B2816h4089j06319F901J11270d38899F1204J04739
18868A65943o057e4697A76154d9566G9a41936b8386B92994I4103a33153O52A62022
18855D1477A1771O6857c01841d0704m114A05939b17055B19099I7629l3454a98506
18843A16160P097J25140g3908q6221r6158O4449r5286A63554a70626b8560H9317
18831A88411o8012a53900B36621a14257K5071D6744r624b86602F18c4904k92947
18820c27851J54792c7692I8119a36865K3453j86849i8011k15126B09733N7578
$$ plain form
18900 -133411 -397885 356394 86033 -169963 57139 201887 -46307 167134 43077 305544
18890 305544 -97084 -56989 156689 -126915 -220613 -306030 202239 -90267 68179 170607 204084
18879 204084 124797 122372 104398 22816 -84089 -190408 6901 118171 -438899 61204 165943
18868 165943 159886 -54697 176154 -49566 79 -141936 -28386 292994 94103 -133153 -132501 162022
18855 41477 11771 78628 -301841 -40704 -44818 105939 -217055 219099 97629 64175 -198506
18843 116160 123257 248397 -73908 -160129 -256287 -191838 -287124 163554 -170626 -28560 89317
18831 188411 120399 -153900 236621 -114257 -89186 46744 37120 -286602 618 -34904 -327851
18820 -327851 -173059 -37692 98119 -136865 -113412 -300261 -98011 -313137 209733 267311
18810B67311L1695A01188f9719k3354A65311a57974G9977l0568h9312B14941a16463
18798D51629c94401P7367a34728n6945j15510I736b24596M6441N1861N7623j29128
18787a97799P7843D4352a21523H5022g3969A864M2631b43866J16890B53877a89575
18775g569o9033I3527C5601K8553J42316a80756f0165j24739J9031b0897r3819
18764a14716j24274d4765j39118F6319a77957m76973D0136b475j00271L1716j94721
18753b65751N6487k5035h0334j89638f2069C91205a85336A54043C6658b23012
18742e7557n1502q1801B35773P1586A46744a97115E9086a21201N5696K942B9276
18730e8406B4268J07937a70651N5700j24286k3453p259J29720N2448A59740c33458
$$ plain form
18810 267311 299006 101188 -69719 -93073 165311 -157974 79977 49409 -89312 214941 -116463
18798 451629 -394401 -317034 -134728 -191673 -307183 9736 -224596 -178155 -126294 -68671 -197799
18787 -197799 -119956 44352 -121523 85022 -73969 1864 44495 -243866 -126976 253877 -189575
18775 -7569 -76602 93527 35601 64154 206470 -180756 -60165 -184904 -165873 -20897 -114716
18764 -114716 -238990 -44765 -183883 66319 -177957 -654930 40136 -2475 -102746 -71030 -265751
18753 -265751 -209264 -234299 -80334 -269972 -62069 391205 -185336 154043 36658 -223012
18742 -57557 -109059 -190860 235773 307359 146744 -197115 59086 -121201 -65505 -62563 29276
18730 -58406 24268 132205 -170651 -114951 -239237 -262690 -269949 -140229 -87781 159740 -333458
18718A32640c6355A94885c77354e3700B60563b10738B5281b29262C01349b06612
18707a00455l28689A51659M0670J9221c21637D8618g1921j15902m3138R3175l90050
18696e27836Q4135h6063b2287O241l84510f6277G1083R4421n9285A0214M5766
18685E5980a37437A25006e24290H9677J7417d40759J89723A25113K64719c03816
18674A55832l2856a05155j40576A1265J02958M4767A1537e07047A99586n3689
18664A45897c26793F3441j6411J14784J13673b91045c2647D374O256f2664m5257
18653a07921j4055N8225B5726M2631e1240j0591j97221J22625k4407A26651J63710
18642B90361A16592b81986a29624A1213P2922b21314d1858l4341n6732A05263
$$ plain form
18718 132640 -36355 194885 -377354 -53700 260563 -210738 25281 -229262 301349 -206612
18707 -100455 -429144 151659 192329 211550 -321637 48618 -71921 -187823 -230961 -137786 -527836
18696 -527836 -443701 -86063 -22287 -16046 -400556 -66277 71083 165504 106219 10214 55980
18685 55980 -137437 125006 -524290 89677 107094 -440759 -251036 125113 389832 -303816
18674 155832 122976 -105155 -245731 11265 114223 158990 11537 -507047 199586 145897
18664 145897 -326793 63441 47030 161814 275487 -291045 -32647 4374 10630 -62664 -107921
18653 -107921 -121976 -63751 25726 68357 -51240 -61831 -259052 -136427 -160834 126651 290361
18642 290361 116592 -281986 -129624 11213 84135 -221314 -41858 -76199 -132931 105263
18631a1355m29573J71819a27177c0873l49434C6859J06469a93288G4949b55493
18620I1186a22411d0935A08459A8988a88202n0874A69880d55F7567c41646J04652
18609b36994B23814j03357f5166B3891h1468o9582b0700B07998D285a17300A00335
18597a55799A10771a63160k775E505K35764q9096b63713C41597a92617n8458E8673
18585F4548a04799k25202a64734k67802K9278a2679C0829a15627a0182k11736
18575b21918f7169c0465j98974a12463j25264a01782B4176C320a06493B7261a86826
18563e920l47368a19648p4033F3202a59592c0071B1668b25873J4084F2367c06374
18551H0578R7114a49711G9377a67669Q1524E0134J80350I1566a77524k593p3413
$$ plain form
18631 -11355 -440928 -269109 -127177 -30873 -380307 36859 143328 -193288 74949 -255493
18620 91186 -122411 -40935 108459 18988 -188202 -239076 169880 -455 67567 -341646 -236994
18609 -236994 223814 120457 -65166 23891 -81468 -151050 -20700 207998 4285 -117300 100335
18597 -155799 110771 -163160 -165935 5505 241269 152173 -263713 341597 -192617 -251075 58673
18585 64548 -104799 -330001 -164734 -432536 -403258 -12679 30829 -115627 -10182 -221918
18575 -221918 -67169 -30465 -229439 -112463 -237727 -101782 24176 3320 -106493 27261 -186826
18563 -5920 -353288 -119648 -193681 63202 -159592 -30071 21668 -225873 -211789 62367 -306374
18551 80578 177692 -149711 79377 -167669 -86145 50134 230484 91566 -177524 -180117 -253530
18540b53530a02015j13894E7586N0729i3840J414L5601q0927f6499B40248b85629
18528b3650n5129b9458A13012l3429b88144o1719C8784a08322j86A50716k683
18517A48033F5559L5382f664A46741l0511b3554B3471L7058b34199d8441A17928
18505a55649B64411a65161B85401a19643D500h7290k31660A4909K22143d03885
18494D2258J34106B7783f4618B4081a25559j37142A13575m7252J16743C5148f7253
18482a1820l1182j28108D0373c63388R3673Q0087F4246H961b88554i7920j70653
18471b68573E3486L6472l446B943J24082a94626h707j37149A00841h236A95867
18459a10762d9048j05207F4142i3074M2955j53054k76057B8051f7873l9988D8411
$$ plain form
18540 -253530 -102015 -215909 57586 108315 -93840 -92426 -56825 -137752 -66499 240248 -285629
18528 -23650 -78779 -29458 113012 79583 -288144 -349863 38784 -108322 -108508 150716 148033
18517 148033 65559 100941 -6664 146741 116230 -23554 23471 60529 -234199 -48441 117928
18505 -155649 264411 -165161 285401 -119643 4500 -87290 -318950 14909 237052 -403885
18494 42258 176364 27783 -64618 24081 -125559 -262701 113575 66323 183066 35148 -67253
18482 -11820 -43002 -171110 40373 -363388 -269715 -189628 64246 8961 -288554 -97920 -268573
18471 -268573 53486 89958 86512 2943 127025 -194626 -8707 -145856 100841 -8236 195867
18459 -110762 -49048 -154255 64142 -93074 -50119 -203173 -479230 28051 -67873 -107861 48411
18447C0702b60977A05619a17653J2493H560c9687B51918a53233f4097q1235E8521
18435a47327k87059c2779k6523A04265c26638a54118j58929C94354b22201a2869
18424A71763o3291C617L1755a0475j53953n744q2613A14141B9055J09675o8951
18413F9779b1251m690p7589L9989l1105A14653b16216H5598K0904Q9487i8973
18401I2251a88327B70391D406b52011j87541B04235a44050B2114b78448M4894
18391b33554J16524j2678D04708h9995A96197d0956m4459k445j98784A18923M4089
18380A63012c9173j77531N9467f4773j51718D0554g8610j54611j83725a0572o5024
18369g5596j85562O7289e9277q9246L8751n3639q7283B94723i6751p3146K5400
$$ plain form
18447 30702 -260977 105619 -117653 -105160 8560 -39687 251918 -153233 -64097 -145332 58521
18435 -147327 -434386 -32779 -59302 104265 -326638 -154118 -313047 394354 -222201 -12869
18424 171763 108472 3617 35372 -10475 -164428 -170172 -252785 114141 29055 138730 69779
18413 69779 -21251 -25941 -103530 -63541 -94646 114653 -216216 85598 106502 195989 -98973
18401 92251 -188327 270391 4406 -252011 -439552 204235 -144050 22114 -278448 -233554
18391 -233554 -117030 -129708 404708 -89995 196197 -40956 -85415 -87860 -286644 118923 163012
18380 163012 -39173 -216704 -157237 -64773 -216491 40554 -78610 -233221 -416946 -10572 -75596
18369 -75596 -261158 -193869 -59277 -148523 -109772 -163411 -250694 294723 -96751 -169897 -144497
18358a44497f3375I8103D1422c909n2866A53353A5292c7887j73433e3148R12n22
18346e2758A78546B7254a72434g8911l2017k40429a6136D5298L3864a34838r6640
18335b31478q265A36751A1293a18833E0329Q2851a62563b1510A19979P3662a56527
18323B99226b78965A38639a40173M2109C4243J1702J03825a9465G9530j2766l058
18312F3706b65938a30883m229N5975E6248b23352A38262b31326B86446j25268
18302A61178f8206A18514J92581i3703E8690f5830k22150I8904C860J18048f3600
18290A27720a25172r8910A34274F1888j0527k2437K31695a51866A27957o3461
18280F4496d96211H5881g821E9807K0544K46815i7740D9019a15148D4712g8758
$$ plain form
18358 -144497 -63375 98103 41422 -3909 -56775 153353 15292 -37887 -211320 -53148 -52236 -52758
18346 -52758 178546 27254 -172434 -78911 -110928 -351357 -16136 45298 79162 -134838 -231478
18335 -231478 -239743 136751 11293 -118833 50329 133180 -162563 -21510 119979 193641 -156527
18323 299226 -278965 138639 -140173 -98064 34243 45945 149770 -19465 79530 66764 63706
18312 63706 -265938 -130883 -135112 -79137 56248 -223352 138262 -231326 286446 161178
18302 161178 -68206 118514 311095 -93703 58690 -65830 -287980 98904 3860 121908 -63600
18290 127720 -125172 -224082 134274 61888 51361 28924 260619 -151866 127957 64496
18280 64496 -496211 85881 -7821 59807 80351 327166 -97740 49019 -115148 44712 -78758
18268a18802K1202K8681B90537f3771j69470j01360E2496c35111a31536k7074
18258a58610A16487J64230F316J23137q671b71126e9362B70637B1838K4467a73896
18246B0090L56462a33545d6490j34219A2463a01254j11651n1187e8443m0137a5451
18234a64012f9686n497F1294d4209p7691G1399a13844B76353h1878A94345k9085
18223A65260f603E0991c56489A36613M1855a47535F3326R0770a28224p5905K0646
18212a83483g3821j8369c0423B6500K5307b03540b1588B52853a01632J1735J0776
18201g9121F3435h5020c6926C93153A64627f5809j24249f3926q0161k54051J46254
18190b51884C92918g0744k7082B7319c6145A60622a28300K8332B3434b6847A28506
$$ plain form
18268 -118802 -97600 -68919 290537 -63771 -233241 -334601 52496 -335111 -131536 -158610
18258 -158610 116487 280717 6316 129453 120782 -271126 -59362 270637 21838 46305 -173896
18246 20090 376552 -133545 -46490 -180709 12463 -101254 -212905 -264092 -58443 -98580 -15451
18234 -164012 -69686 -75183 61294 -44209 -121900 71399 -113844 276353 -81878 194345 165260
18223 165260 -6603 50991 -356489 136613 178468 -147535 63326 154096 -128224 -204129 -183483
18212 -183483 -73821 -92190 -30423 26500 51807 -203540 -21588 252853 -101632 -89897 -79121
18201 -79121 63435 -85020 -36926 393153 164627 -65809 -190058 -63926 -144087 -398138 -251884
18190 -251884 392918 -70744 -97826 27319 -36145 160622 -128300 -99968 23434 -26847 128506
18178B92535J09569d22801a66407A2497g4145k09884l9505D7995b58438R9911
18168a58527A42713b56583I5194c6562r3613d056I0403a78220C1727J63981d16771
18156B6178A974b60237C8137K5710B5084a92238a8434j39875N7135j4228l9307
18145a54709g2219I0108c73210c3543n6263l51778J31928C23368g0477K4288B6281
18133D1602f6126J9904l943j41864j91688f4197D3545K38660r3671h4752A09206
18121A05102a13860I3989a57310n9996A4465a42738b8899r7989M886K9333l63425
18110d56094g2790A634K08184b47035K7429I443M7685k37J19107h9127l32912
18099d22039A25051g5657k61949B57223j06566E7133a73985L8950C26100a43863
$$ plain form
18178 292535 402104 -422801 -166407 12497 -74145 -284029 -323534 47995 -258438 -158527
18168 -158527 142713 -256583 95194 -36562 -130175 -4056 90403 -178220 31727 195708 -416771
18156 26178 1974 -260237 38137 63847 25084 -192238 -18434 -158309 -101174 -115402 -154709
18145 -154709 -72219 90108 -373210 -33543 -89806 -441584 -309656 323368 -70477 -46189 26281
18133 41602 -66126 -46222 -50165 -192029 -383717 -64197 43545 282205 188534 -84752 109206
18121 105102 -113860 93989 -157310 -217306 14465 -142738 -28899 -126888 -122002 -92669 -456094
18110 -456094 -72790 1634 209818 -247035 -219606 9443 57128 56891 175998 -89127 -422039
18099 -422039 125051 -75657 -337606 257223 150657 57133 -173985 -135035 326100 -143863
18088A05370k4175a9000o4719k19356J14588G0383J6195O2258i5528d2733j40803
18077a83536G2221a49895p8280H0514h1505k80602A5724O0788a80745P5420a290
18065I938P3128E899K64850r9079L6947c24243a39808C12542I8693J49565b96690
18053H412L9474J1079a05874a1295k17545a14288A83213E7066a09518C0402b7796
18041a20759o1621q2252C06201a4482l0715N845C1373h9387L5694k77221g9800
18029A350d84755K39558K028A11918b51577I3185a70871b3012k16861G8301p868
18018G0433l0697a13210b5974k47373D8464j7715J14009b51514p0488B5537R1106
18007A16643c62204I0706P9146J44774B2590J62443b87477B35240B0188J2260
$$ plain form
18088 105370 81195 -19000 -83719 -303075 -188487 70383 86578 148836 -95528 -42733 -183536
18077 -183536 72221 -149895 -228175 80514 -81505 -362107 15724 76512 -180745 -105325 -1290
18065 9938 83066 5899 270749 171670 208617 -324243 -139808 312542 98693 248258 -296690
18053 8412 47886 58965 -105874 -11295 -228840 -114288 183213 57066 -109518 30402 -27796
18041 -120759 -182380 -264632 306201 -14482 -45197 -39352 31373 -89387 -53693 -330914 -79800
18029 1350 -484755 -245197 -243169 111918 -251577 93185 -170871 -23012 -239873 78301 70433
18018 70433 39736 -113210 -25974 -273347 48464 30749 144758 -251514 -322002 25537 116643
18007 116643 -362204 90706 169852 314626 22590 185033 -287477 235240 20188 32448
17997C2448b15349G1053J12788o471a98297D02374b8140B5968M5096J64407a59430
17985a43244c3501M372E2511P5312L409a67847G0636J05289a21054j85127d3174
17973F24a37611B14688b29790Q0460A473K8333c57083a10908N3290j99933G5504
17961b6428j45535M4605p5316H0062c01422B6024i120l64220E9907h0988m9053
17950a30041p437d2460q3770C92746a67950j55227A77892f6577K8425r6330d9993
17938A65944e3894j23614f4000A55094C689a84980A73057b78945d8979A30296
17927a45219A22543N0253M8500I7671J5485n2655P5412R9311A00782e2967n451
17916e8418g930p1821J3864p6199D2217K86162b50120I1022m3377i6652l3977
$$ plain form
17997 32448 -215349 71053 183841 177370 -198297 402374 -28140 25968 71064 235471 -159430
17985 -143244 -33501 -29129 52511 127823 131232 -167847 70636 175925 -121054 -306181 -43174
17973 624 -137611 214688 -229790 -149330 1473 29806 -357083 -110908 -57618 -257551 75504
17961 -26428 -171963 -127358 -202674 80062 -301422 26024 -9120 -373340 59907 -80988 -130041
17950 -130041 -137478 -42460 -126230 392746 -167950 -323177 177892 -66577 -38152 -134482 -49993
17938 165944 -53894 -177508 -64000 155094 3689 -184980 173057 -278945 -48979 130296
17927 -145219 122543 172796 221296 97671 113156 60501 135913 235224 100782 -52967 -58418
17916 -58418 -7930 -79751 -65887 -142086 42217 328379 -250120 91022 47645 -96652 -130629
17905a30629D6998L0085J52193b89551a23591A65387f6291k67082H9887c24046
17894c64253B06512D6583b89951J41424j23110J13755l2938j37330J55782B49243
17883h4095b0877A09288b1291o9335A61517d0816o5866B28502k2451i7972l11
17872i8283k04501G5720J63006b01618C02002a58486A62556p6548a00236B5793
17861h8313C3185R2482f3039A29795a10735k48052f7754A91782E717a30793k05515
17850c36308C7925f8796k7702B51468c16264A78457q8926f8372a7469l84617B7876
17838D06212E1847d300B9961j024i8704q5986F3359a393B83934a66784C12109
17826E7118J18484b81946J05693B4200b8302B72360D8918d3401B3839F255a82712
$$ plain form
17905 -130629 46998 77083 229276 -289551 -123591 165387 -66291 -333373 89887 -324046
17894 -364253 206512 46583 -289951 -148527 -271637 -157882 -190820 -328150 -172368 249243
17883 -84095 -20877 109288 -21291 -90626 161517 -40816 -106682 228502 206051 -97972 -98283
17872 -98283 -302784 75720 238726 -201618 302002 -158486 162556 86008 -100236 25793
17861 -88313 33185 125667 -63039 129795 -110735 -358787 -67754 191782 5717 -130793 -336308
17850 -336308 37925 -68796 -96498 251468 -316264 178457 89531 -68372 -17469 -402086 27876
17838 406212 51847 -4300 29961 28937 -98704 -184690 63359 -1393 283934 -166784 312109
17826 57118 175602 -281946 -176253 24200 -28302 272360 48918 -43401 23839 6255 -182712
17814g2861m6007n1430A54477a13458E2784A611L3864b130B87750A36164N338
17803A41502c43215A91622b45222A68026a37599Q032k649C3648a24950j24512
17793b49462j923I9176A5981c76849A5030a49436A6201a03659r7222B121J17988
17782A20109a02181M6882n521N760m8093C5989K22136a8675C2340J5522a00275
17770G1488L01211H5008a44349J5502B5017N3131L2363C9881J2115a06053K446
17759a03607j0594A88362J51474a83076R1038p4801o0338j93989K06445B54066
17748B07734b49821J10015A07809K02040i8508I4071i8026D0685i8039B99835
17737F4173a3578A30197D5295a77414l2885d2675p5593o2153A78105c1682j32430
$$ plain form
17814 -72861 -118868 -170298 154477 -113458 52784 1611 35475 -2130 287750 136164 141502
17803 141502 -343215 191622 -245222 168026 -137599 -129567 -132216 33648 -124950 -249462
17793 -249462 -251385 99176 15981 -376849 15030 -149436 16201 -103659 -200881 2121 120109
17782 120109 -102181 -55299 -60820 -55060 -103153 35989 258125 -18675 32340 47862 -100275
17770 71488 372699 85008 -144349 -128847 25017 78148 110511 39881 51996 -106053 -103607
17759 -103607 -114201 188362 339836 -183076 -92038 -166839 -227177 -421166 -214721 254066
17748 207734 -249821 -139806 107809 309849 -98508 94071 -98026 40685 -98039 299835
17737 64173 -13578 130197 45295 -177414 -210299 -42675 -118268 -180421 178105 -31682 -164112
17726a64112C5028a72921B1985P2116J11968l6157a04920B41296C3640r406g0737
17714b33137A34912E909a0785C0746N141J82821a45109K0077p9495G2818J49480
17703B22298a28899G1722d5778k006A13919d23635C19712j17764f7199r6161A85430
17691B7367J74505c23958B88613d7850C59965b74970I4968i2143l3756G4776a48880
17679B73999i8501A09323j5536g9281r3250A47618a71239l52217g3902D6697i1100
17667A74739f6324B21429j1425b43253J05049j84222A48149b330B04666m0431
17657A64235g6633A32420o1777L310i4951q400j73206A13551b8937j58956A74825
17645A03415b36100A04893O8485b31363B66957c06139J43025H9774a9697j21580
$$ plain form
17726 -164112 35028 -172921 21985 94101 206069 169912 -104920 241296 33640 24234 -70737
17714 -233137 134912 5909 -10785 30746 35887 218708 -145109 -125032 -204527 72818 222298
17703 222298 -128899 71722 -45778 -47784 113919 -423635 319712 201948 -67199 -163360 185430
17691 27367 201872 -323958 288613 -47850 359965 -274970 94968 -92143 -125899 74776 -148880
17679 273999 -98501 109323 93787 -79281 -172531 147618 -171239 -523456 -73902 46697 -91100
17667 174739 -66324 221429 210004 -243253 -138204 -322426 148149 -2330 204666 164235
17657 164235 -76633 132420 70643 73953 -94951 -103351 -276557 113551 -28937 -187893 174825
17645 103415 -236100 104893 173378 -231363 266957 -306139 -163114 89774 -19697 -141277
17635a41277D09612a04081B36740a12919b5884B28958E3364P1481b7577A75994
17624A4162J86832b47045N1783n9601i5439c9775j21767d2320p735r3576g0486
17612c2918j06985A7937J58671l6844B6893b43078B89641j36335a80789B5960
17601G3137h9531j8817H2046b91428H4867a65708C70548j37959b4995A21203a389
17589c7126C00664H0096L1678O679a30940L4504q0871j96262A2366N697M510n310
17577A7263b41532D05118a16996l13729a38356C44225F1548m909a8202j00749
17567a18951B51439f2420l33989a5445o8728B97454I4051i3096a058A08054g4690
17555d8668H9396a50462A09553a50443k1928A29731N8m7810b37881i3332D8464
$$ plain form
17635 -141277 409612 -104081 236740 -112919 -25884 228958 53364 124845 -27577 175994
17624 14162 200994 -247045 -195262 -254863 -95439 -39775 -161542 -42320 -50055 -143631 -70486
17612 -32918 -139903 17937 176608 139764 26893 -243078 289641 153306 -180789 25960
17601 73137 -89531 -108348 82046 -291428 84867 -165708 370548 232589 -24995 121203 -1389
17589 -37126 300664 80096 111774 118453 -130940 -96436 -177307 -373569 12366 18063 22573 17263
17577 17263 -241532 405118 -116996 -430725 -138356 344225 61548 56639 -18202 -118951
17567 -118951 251439 -62420 -396409 -15445 -84173 297454 94051 -93096 -1058 108054 -74690
17555 -48668 89396 -150462 109553 -150443 -172371 129731 129789 81979 -237881 -93332 48464
17543a39396I0340J6298M963l393b81578J19265C0247J8769d5226j98785A2650
17531i867B23552a42361B94796j26845m1441K00101a58601k46781A21163K71461
17521C92624j66891K80517A65341D2538J7239L6456K8815l6665R5254c0671j87579
17510b18250Q6469J7044d0882A51055a43604o9053A0497J55108a43751I4916b2386
17498G2957J48468a32669F2756A1941a29401B86274j33471f835B09348C7567i88
17486B79444A18240K4230L3633F1311R9535a09512l0570D30897d6466B53600Q2748
17475C36348i6253C00821j28894G1977b7465l9637c2871B28345F6242J11800p4194
17464A03848g8113C65054A51382n9243A3283K49434e4792E9632J46835a9761H3701
$$ plain form
17543 -139396 90340 106638 111601 108208 -281578 -162313 30247 49016 -45226 -244011 12650
17531 -9867 223552 -142361 294796 167951 126510 326611 -158601 -405382 121163 392624
17521 392624 225733 506250 165341 42538 59777 96233 125048 88383 183637 -30671 -218250
17510 -218250 -131781 -114737 -40882 151055 -143604 -212657 10497 165605 -143751 94916 -22386
17498 72957 221425 -132669 62756 11941 -129401 286274 152803 -6835 209348 37567 -988
17486 279444 118240 142470 176103 61311 160846 -109512 -140082 430897 -46466 253600 336348
17475 336348 -96253 300821 171927 71977 -27465 -67102 -32871 228345 66242 178042 103848
17464 103848 -78113 365054 151382 92139 13283 262717 -54792 59632 206467 -19761 83701
17452B25262h5103C73954H5295J90870i6406F8718K48721k4288j0563q4262N3336
17441B51662D5687L36471E0834L40106j09419R1917A59135N1688n017R6316K45982
17430E48104B27001Q7722h5761D18066F896M72688A69408M695a7879C73283J0402
17419C83685j90863J48817P6422A0113h3138C5342J37690G2243J99211c3335k17438
17408b50773C6456a33494A78224J95010A44125Q1289h9168c1085D5839M7104J3509
17397A06452b01391B5148J25428K83753i9414d2499n5455A12582J86613j32221
17387A66974o5183a98132A78960L08649A63126j7168J3266h6264B24596F6865
17376A71759O5000J736g3220B23977G7917e2672i709B2802b7742B00810K29575
$$ plain form
17452 225262 -85103 373954 85295 276165 -96406 68718 317439 293151 282588 198326 251662
17441 251662 45687 382158 50834 390940 281521 373438 159135 210823 205806 302122 548104
17430 548104 227001 314723 -85761 418066 6896 479584 169408 174103 -17879 373283 383685
17419 383685 192822 341639 418061 10113 -83138 35342 173032 72243 271454 -33335 -250773
17408 -250773 36456 -133494 178224 373234 144125 225414 -89168 -31085 45839 92943 106452
17397 106452 -201391 25148 150576 434329 -99414 -42499 -97954 112582 299195 166974
17387 166974 101791 -198132 178960 487609 163126 145958 159224 -86264 224596 66865
17376 171759 236759 238495 -73220 223977 77917 -52672 -9709 22802 -27742 200810 430385
17365D30385f9232A59983m7823C2217L87807I11b44279B36801r9926b9354B92492
17353a37718d6460k7884C40201j32149G7432a8102A98280G7287b01330L4304F2189
17341A74854J00706O2050J9733j72623R0439j09378D3481J87827D6118J55727
17331B01845e8167A27430j2911K6911a32607A45654R5919j07962k2394i72C06306
17319E4183J06816a50055a8649I6330J29973m8855h8757C17608b63841A37876
17308d3786A86199q9520K62171g5108b3474l0714B16123J32663A30002b4472j10431
17297a34903F49K64461j8785n795k0856G799J17274J52305a87423A89589a29211
17285G1594J26386M3963J95069E9753P5158F4716J60396E3451J05760d8643A69315
$$ plain form
17365 430385 -69232 159983 112160 32217 420024 911 -244279 236801 136875 -29354 292492
17353 -137718 -46460 -74344 340201 208052 77432 -18102 198280 77287 -201330 -167026 62189
17341 174854 275560 337610 357343 184720 275159 165781 43481 231308 46118 201845
17331 201845 -58167 127430 114519 141430 -132607 145654 241573 133611 111217 -972 306306
17319 54183 160999 -150055 -18649 96330 226303 177448 -88757 317608 -263841 137876
17308 -43786 186199 96679 358850 -75108 -23474 -54188 216123 348786 130002 -24472 -134903
17297 -134903 649 265110 246325 240530 219674 7799 125073 277378 -187423 189589 -129211
17285 71594 197980 241943 437012 59753 134911 64716 225112 53451 159211 -48643 169315
17273H7319L8245J08341Q615f6445B89149o4626p6285J35002j19273J89602I6786
17261C09236j30302j2539f8241B73225j22750M48955B46464Q2477N0601g7261
17250A29678F4112f6902n7582A61777M74g743C74291I1481J78092M3058A21906
17238G0337J93295G9279a91226B82387K257J01375j63617R7770o223p5022Q6991
17227C25918J95876A01329M1895M7107c6071a5458E3907i601k777C68088o7972
17216C00116l880r274n5713j8690M40298D7120c9946B74693r0027J59555E9305
17204B3289L72988C1638N3316P1495E0445O4271M8600J49904A39176A6011J67875
17193A83886a69585k4787A37011L064P7901G7226L46628j82633C2766A0888J24186
$$ plain form
17273 87319 125564 233905 242520 -66445 289149 224523 148238 283240 163967 353569 96786
17261 309236 178934 166395 -68241 273225 150475 599430 246464 328941 379542 -77261
17250 129678 64112 -66902 -124484 161777 162251 -7743 374291 91481 269573 312631 121906
17238 70337 263632 79279 -191226 282387 284644 386019 222402 320172 313949 238927 325918
17227 325918 521794 101329 143224 190331 -36071 -15458 53907 -9601 -12378 368088 300116
17216 300116 296236 286962 231249 212559 652857 47120 -39946 274693 184666 344221 59305
17204 23289 396277 31638 84954 156449 50445 114716 163316 313220 139176 16011 183886
17193 183886 -169585 -194372 137011 140075 217976 77226 423854 241221 32766 10888 135074
17182A35074P9923r2870j7790J79492r597k1205k2706L7293J29508D057M18179
17171D22236k08162J58814k7704K2738j9762J32510I1885M9768K83550A88287
17160B1766J45040K47823j68787B0247J99355L0307A14238O9409a4359C39218
17149C36204J28024q2140N3798A23211B1105L68877E2837M62466m5130E023b3747
17137a85974a137A34154A8508J18633B7023L17284j68929L2378N5862J93491Q3988
17126E41097B34210L33650R8440j44920A71165O0513P1223J26769j15454n517
17116C08699K5712j35553L20323j73935I2404M5203Q3777H7058G996P0460K3861
17105A02317L59348G9988J36618J88475N9079J6335k0904k22695K92295k13906
$$ plain form
17182 135074 214997 122127 104337 283829 274232 253027 230321 267614 397122 4057 422236
17171 422236 214074 372888 345184 367922 348160 480670 91885 141653 425203 188287
17160 21766 166806 414629 245842 20247 219602 249909 114238 183647 -14359 339218
17149 336204 464228 382088 435886 123211 21105 389982 52837 515303 470173 5023 -23747
17137 -185974 -1137 134154 18508 137141 27023 344307 175378 207756 263618 457109 541097
17126 541097 234210 567860 666300 521380 171165 231678 302901 429670 314216 308699
17116 308699 334411 198858 519181 345246 92404 137607 221384 87058 7996 78456 102317
17105 102317 461665 79988 216606 405081 464160 480495 459591 236896 529191 315285
17095C15285N5657j0022K1843N5021A84472P322J63912K1849O6082B01218L53470
17084E54688k71407K12195B42033J08693j09720K36705B11656L5548J86869j15400
17074C18673j40909K66568k8466J08150j69902K53975q0311L5638K00070A18405
17063D72767K22509n0686C4890L38463J45181O6638j4778j30080m3651N0259K35713
17052F82635k30453J68984B64588K06823l5917B17172N79227l20028J53677J81060
17042H11108k78206K3650j69145A86455L82275k0125m0515N5488J02298n8008
17032F07868k33777n7086A47825O62995k69811q4717L9691j99233J00991J41818
17022E39559j14079r7796K74017q222k76708K01733J93378j99365n3638K26589
$$ plain form
17095 315285 370942 360920 382763 437784 184472 191794 355706 377555 443637 201218 554688
17084 554688 283281 495476 242033 350726 241006 477711 211656 247204 434073 318673
17074 318673 177764 444332 415866 524016 354114 608089 527778 563416 763486 118405
17063 472767 695276 644590 34890 373353 518534 585172 570394 440314 396663 446922 682635
17052 682635 452182 621166 264588 471411 435494 217172 796399 476371 630048 811108
17042 811108 532902 556552 387407 186455 568730 548605 508090 563578 665876 607868
17032 607868 374091 317005 147825 810820 541009 456292 495983 296750 397741 539559
17022 539559 425480 327684 601701 593479 316771 518504 711882 512517 458879 685468
17012F85468k14002J07991J56979M1778j90657J22765j34682K21128j54057j44689
17002D98022N21569l21180L00957D74917R7373J00985L32467k63421j28984K5195
16992F38532M83552n15246J99581C28683N45139l87824K6308K09316j472J76030
16982H96180j0498j77169j91604K07555J83336l97254N2046J41622K68105r6306
16972H76013k17045J43553j77821j2557K6820R3476J49347O8602l0264K2743r3068
16961H49799K02408m42968J53184L40580k18462J28514m2208M95558m48478Q3861
16951A101788R0572l90211O381J21070k9193M26755l04032m2211K80897l14309
16941I47507M25354k72998j58674j46365p7424L99285l9184K46492k78564P790
$$ plain form
17012 685468 471466 579457 736436 778214 587557 710322 575640 796768 642711 498022
17002 498022 1019591 698411 999368 474917 572290 673275 1005742 742321 613337 638532
16992 638532 1122084 606838 806419 328683 873822 485998 512306 721622 720150 896180
16982 896180 885682 708513 516909 724464 907800 510546 562592 704214 972319 876013
16972 876013 658968 802521 624700 612143 638963 732439 881786 950388 920124 942867 849799
16961 849799 1052207 609239 762423 1103003 884541 1013055 970847 1466405 1017927 1101788
16951 1101788 1192360 802149 808530 929600 900407 1327162 1023130 980919 1261816 947507
16941 947507 1372861 1099863 941189 794824 717400 1116685 1077501 1323993 1045429 1053219
16931A053219K60651j85144l69973M65587m9142n7881J33461K6239J19570l16474
16921A080113j16144J58968J14660J22095p9079K46273J38372l18472L18671Q0311
16911A745768m30818J40195o0436L05610k92384K50854m97319L47744N4115L13845
16901A877174k59224K62636J06526l92238K09851j55451K05449l80592L43512
16892A817643J20396k96833M91993o10901N36677J04516l58635L02462n03779
16883A603539N10203q2422O0247K20159K2757l91892r6827L46216J50474l2173
16873B310281M14946o33919M48842q4230L8678k40301K77461k46475J09911O8076
16863B463270L02631j26691L42593o4503j04119j46297K19600Q8695j35172K21631
$$ plain form
16931 1053219 1313870 1128726 758753 1224340 1175198 1117317 1250778 1277017 1396587 1080113
16921 1080113 963969 1122937 1237597 1359692 1280613 1526886 1665258 1346786 1665457 1745768
16911 1745768 1314950 1455145 1394709 1700319 1407935 1658789 1161470 1509214 1563329 1877174
16901 1877174 1617950 1880586 1987112 1594874 1804725 1649274 1854723 1474131 1817643
16892 1817643 1938039 1641206 2133199 1522298 2058975 2163491 1804856 2107318 1603539
16883 1603539 2113742 2031320 2091567 2311726 2334483 1942591 1845764 2191980 2342454 2310281
16873 2310281 2725227 2091308 2540150 2455920 2494598 2254297 2531758 2285283 2395194 2463270
16863 2463270 2765901 2639210 2981803 2917300 2813181 2666884 2886484 2975179 2840007 3061638
16853C061638J09887N1746j45828M05959l01674J39340J88565k07426j51272N45411
16843C696346k55487n598K86506N384K24819j34259k51068K72663J78367m3691
16833C973982J56432K63955J06684k95287j11575O82156j88124Q7364m134J15071
16823D786524K50152L9635N9100Q2001J55060K00963K07628J5916N4045M02876
16813F253900l63000M37240o0546L14091n2779L30569M1604K46074J36667K61945
16803G545765Q7877p9844L70815K26422N1200K16551L84907M22467k94575M18480
16793I350065J13953L88292O2690L35323M09977R6006N27914J13182P37694p7262
16783A2057834M27698L07115K47805O15861K55241P52074K30392O18119N75032
$$ plain form
16853 3061638 3171525 3223271 3077443 3483402 3181728 3321068 3509633 3302207 3150935 3696346
16843 3696346 3440859 3435261 3721767 3727151 3951970 3817711 3566643 3839306 4017673 3973982
16833 3973982 4130414 4394369 4501053 4205766 4094191 4776347 4588223 4675587 4671453 4786524
16823 4786524 5036676 5076311 5135411 5217412 5372472 5573435 5781063 5796979 5851024 6253900
16813 6253900 5890900 6328140 6267594 6581685 6528906 6859475 6901079 7147153 7283820 7545765
16803 7545765 7633642 7553798 7924613 8151035 8202235 8418786 8803693 9226160 8931585 9350065
16793 9350065 9464018 9852310 9915000 10250323 10660300 10756306 11284220 11397402 12135096 12057834
16783 12057834 12485532 12792647 13040452 13656313 13911554 14663628 14894020 15512139 16087171
16774A6087171M00591O5480P77543N94467N00877J271706J84341Q23558J091838
16765B1797572P60005P79618P99427J087089Q51707J285125J039348J252726J224068
16756C0876685Q39135J672090J468750J294679J801914J850087K180646J983081
16748D3967067J729553K520591K290323K816991K566859L397504K880366L517153
16740F5686407L349402L775555M405940L994112M569817M940732N087969N467447
16732A01277381N582325N551351O243850O217917N629406O268860O136931O067474
16724A48975495N312904M941242M489568M044104K703941K028191J078081l70568
16716A73202958p67204k242913k583338l808637m551968n095224n099529o233733
$$ plain form
16774 16087171 16487762 16553242 17330785 17925252 18426129 19697835 19882176 20705734 21797572
16765 21797572 22557577 23337195 24136622 25223711 26075418 27360543 28399891 29652617 30876685
16756 30876685 31715820 33387910 34856660 36151339 37953253 39803340 41983986 43967067
16748 43967067 45696620 48217211 50507534 53324525 55891384 59288888 62169254 65686407
16740 65686407 69035809 72811364 77217304 81211416 85781233 90721965 95809934 101277381
16732 101277381 106859706 112411057 118654907 124872824 130502230 136771090 142908021 148975495
16724 148975495 154288399 159229641 163719209 167763313 170467254 172495445 173573526 173202958
16716 173202958 172435754 170192841 167609503 163800866 159248898 154153674 149054145 142820412
16708A42820412n957866n975896o292077o108836o118226n898768n523184n277475
16700I5668084n333870m861193m233202m756463l866264m168113l505737l463830
16692F1479412k960735l097458k410537k902342k412542k290189k212936j964648
16684D1228025k081805j599066j936542j375092j428289j369926j346200j122016
16676B8969089j251058j146074j036936j220243p10613j055792o84729o96272
16668B1167372r11395o75336l58857p11634m71880r35577p28246k94068p13034
16659A5367345n73994j80601n16556m34573m36702j65468p88731l07808m57860
16650A1505052k07344m38894J40459o27893r7148r4190k75758l9637m05912n83398
$$ plain form
16708 142820412 136862546 130886650 124594573 118485737 112367511 106468743 100945559 95668084
16700 95668084 90334214 85473021 81239819 76483356 72617092 68448979 64943242 61479412
16692 61479412 58518677 55421219 53010682 50108340 47695798 45405609 43192673 41228025
16684 41228025 39146220 37547154 35610612 34235520 32807231 31437305 30091105 28969089
16676 28969089 27718031 26571957 25535021 24314778 23604165 22548373 21863644 21167372
16668 21167372 20255977 19580641 19221784 18510150 18038270 17102693 16374447 16080379 15367345
16659 15367345 14793351 14612750 14096194 13661621 13224919 13059451 12270720 11962912 11505052
16650 11505052 11297708 10858814 10999273 10371380 10274232 10180042 9904284 9864647 9458735 8875337
16640H875337k11411J95609k93601l50946j77047L315k12602l43332j84351j99740
16630G101231J10255j23874k83601l68335l32978K16165r7785j99304n3044m02740
16620E565990N94o7563j58159p4203J22400l56123K48038k07650l51542P9863
16610D801645m77310M01290m48027L79701m02841J49090l82946K47519m77316
16601C790805K77331o9017r8771J6342j760k48159j34638K3166j24477j24895
16591C305927K58467n37567q111L56834j39245k53527M53998p39255M41397n1100
16581C087818l73058j91198N81223m42255K04226k24721J66441o7301k29210k65630
16571B246335L95810r6927r4717R8609M3593l35359k63624J83399J51953l47534
$$ plain form
16640 8875337 8663926 8859535 8565934 8214988 8037941 8041256 7828654 7485322 7300971 7101231
16630 7101231 7211486 7087612 6804011 6435676 6102698 6318863 6221078 6021774 5968730 5565990
16620 5565990 5566584 5499021 5340862 5266659 5389059 5032936 5280974 5073324 4721782 4801645
16610 4801645 4324335 4725625 4277598 4657299 4254458 4403548 4020602 4268121 3790805
16601 3790805 4068136 3999119 3900348 3916690 3914930 3666771 3532133 3555299 3430822 3305927
16591 3305927 3564394 3026827 3018716 3375550 3236305 2982778 3436776 2697521 3138918 3087818
16581 3087818 2714760 2523562 3104785 2662530 2866756 2642035 2808476 2741175 2511965 2246335
16571 2246335 2642145 2545218 2450501 2549110 2592703 2257344 1993720 2177119 2329072 1981538
16561A981538J77465m7292J4237R3238J39039j11824l07905m3835K14989n19453
16551A590197N46495o4178j55766R2336j67490R9907l55184M73397n34709O459
16541A531464J22600J0713K86530k43256J04905P7447m10922J38366l8183l29704
16531A249960O53682o05332K16619L7623K0230j92419M8019l03656L17812j55513
16521A287025J71266l81494L68498l05583K27359j80212J73383j59517N4585J57518
16511A412828P9189m28849L32269N2566j1387R7097o5087n10041P650K52371j31623
16500A086983M4425k51846J8943l7214J39923J88570l09770J17710n6527K67771
16490A208968l18405M0082j51174j08302M48055j71951J63027O9907m22961K47963
$$ plain form
16561 1981538 2159003 2111711 2125948 2219186 2358225 2246401 1938496 1894661 2109650 1590197
16551 1590197 2136692 2072514 1916748 2009084 1841594 1941501 1586317 2059714 1525005 1531464
16541 1531464 1654064 1664777 1951307 1708051 1812956 1890403 1479481 1617847 1579664 1249960
16531 1249960 1903642 1298310 1514929 1552552 1572782 1380363 1428382 1124726 1442538 1287025
16521 1287025 1458291 1076797 1445295 1139712 1367071 1186859 1360242 1200725 1255310 1412828
16511 1412828 1492017 1063168 1395437 1448003 1436616 1533713 1468626 958585 966235 1218606 1086983
16500 1086983 1131408 879562 898505 861291 1001214 1189784 880014 997724 941197 1208968
16490 1208968 890563 930645 779471 671169 1119224 947273 1110300 1180207 757246 1005209
16480A005209k80511L05225n9047m06725J38897K42331k02651L16504l25411k24974
16470E08847K62040n4766N5823m4034J73856l96204R3458J21572J63156m9278
16460H34470L03751l7958k41432J04403k80102K56918k06732r1259P8024M9276
16450G69359O1036j14233K65942l86603J99473J20872k45953L6314r3389k02464
16440D10354L69999B30908M72257Q4866L06883m89497l4967j84172M23564l6315
16430G73527J00864C27884K51528Q688B82921L70536q4657j39264J79544K56608
16420H65688C54412K0143L04178j23170k01133L58413k00811j97401J11774B09575
16409B29267K88867K17249B10713q8473M88145l01322L50567B47349K91962k44661
$$ plain form
16480 1005209 724698 1029923 970876 564151 703048 945379 742728 1059232 733821 508847
16470 508847 770887 716121 771944 727910 901766 505562 599020 720592 883748 834470
16460 834470 1138221 1100263 858831 963234 683132 940050 733318 642059 720083 769359
16450 769359 830395 716162 982104 595501 794974 915846 669893 706207 612818 410354
16440 410354 780353 230908 703165 788031 1094914 605417 570450 386278 809842 773527
16430 773527 874391 327884 579412 588100 282921 653457 568800 429536 609080 865688
16420 865688 354412 374555 678733 555563 354430 712843 512032 314631 426405 209575
16409 229267 518134 735383 210713 122240 610385 309063 659630 247349 539311 294650
16399B94650K26244B41112L48363J22908p0380C05845J57522j1230M77794j66784
16389G63147j39738j68348Q235K37991j33452k74735O3753O89714C17115J3005
16379C30120K88604O2991q4787l0605j9686J58211l13066L07906l21918j85985
16369A91785K66625F0124c4417C11623L8573j5090A10337M27543P869n2193O7537
16358E61093B48224d642B58184J70140L68093l26660j44869a89D26299A05417
16347C16231P2151a6578D70285A75378J36602l9739L4161P7082A11595d9152C60496
16335C51511J63666B30141F8388K12423k6578j07587K96215G5709R3465K72065
16325D41239k13636J23859O9483j39501j8472M83074C67041H2123K34445L89392
$$ plain form
16399 294650 520894 241112 589475 712383 642003 305845 463367 452137 929931 763147
16389 763147 623409 455061 463296 701287 567835 293100 356853 1046567 317115 330120
16379 330120 618724 681715 596928 566323 546637 704848 391782 699688 377770 191785
16369 191785 458410 60124 -34417 311623 350196 335106 110337 537880 545749 493556 561093
16358 561093 248224 -4642 258184 428324 796417 469757 324888 -189 426299 105417
16347 316231 388382 -16578 470285 175378 311980 272241 306402 383484 111595 -49152 360496
16335 351511 515177 230141 68388 280811 254233 146646 442861 75709 169174 441239
16325 441239 227603 351462 420945 281444 262972 746046 367041 82123 316568 705960
16315G05960B58388r438N8914O9974O3081J34850A900J34681m3418M27854j93068
16304C27949Q8431A74238O71711D16703j85191D1589M55444j57037A43902J50972
16294B94874A09984J7309K82102A36374a8746G4717K41631h0107G7241O5533O5242
16283B08016f560D58241F4573K65855m4993D7594N44607A89228J68252P2348G9376
16271C75315b36935a2420D32099a8613D54004l7690A31291J22996f1911B95736
16260D09798A47183h043m1808C10736b21403E34269H8398k4732L33742A16390
16249C34087A22051K72843a96809C35597h3654A16614J24548j1513R148M06171
16239F44968C05052A17068K39002N7768A79233L42833j02529c0245k8334j03620
$$ plain form
16315 705960 258388 248950 307864 377838 440919 575769 1900 136581 93163 521017 327949
16304 327949 416380 174238 845949 416703 231512 41589 497033 339996 143902 294874
16294 294874 109984 127293 409395 136374 -18746 74717 316348 -80107 77241 142774 208016
16283 208016 -6560 458241 64573 330428 285435 47594 592201 189228 357480 429828 79376
16271 375315 -236935 -12420 432099 -18613 454004 416314 131291 254287 -61911 295736
16260 409798 147183 -8043 -49851 310736 -221403 534269 88398 63666 397408 116390
16249 334087 122051 394894 -196809 335597 -83654 116614 241162 229649 238797 644968
16239 644968 305052 117068 356070 413838 179233 522066 419537 -30245 -58579 -162199
16229a62199c1461H8370e2517C56861j6937q3436P4081B3327L13651l1985m9516
16218B55477J43990A20628O5048f6418K0269A98923E5430A2373J27875I937J51834
16207A61771b00520C53311A42398b6960C21162C9795a04920D07967H9417M4513
16197A33930k0903c9660j15070C43626c6097A94375P4214j29167i6283F7082a5221
16185C58525a28867B98179L2675H1802K44156I8441a9480A22800M68657B6362
16174E74113C177J82689H6916a32868H1461j7061d5652k01708D07053A40658A1014
16162a31083B7640G224a88262b3903A9532d6505A60746a35239A68944a13653C20827
16150C2189N2169c4324E1698K31132A22709Q7261l0788P7920g7788K5970D8267
$$ plain form
16229 -162199 -31461 88370 -52517 356861 339924 256488 330569 23327 336978 304993 255477
16218 255477 399467 120628 185676 -66418 -46149 198923 55430 12373 140248 9937 161771
16207 161771 -200520 353311 142398 -26960 321162 39795 -104920 407967 89417 133930
16197 133930 113027 -39660 -154730 343626 -36097 194375 268589 139422 -96283 67082 -15221
16185 358525 -128867 298179 330854 81802 325958 98441 -19480 122800 591457 26362
16174 574113 3177 185866 86916 -132868 81461 64400 -45652 -247360 407053 140658 11014
16162 -131083 27640 7224 -188262 -23903 19532 -46505 160746 -135239 168944 -113653 320827
16150 32189 84358 -34324 51698 282830 122709 209970 179182 257102 -77788 -51818 48267
16138G4924e1412G1154K6399a5948l87906C38177J84360j49516i010B22317h1335
16126B84144A7103M1105a38846D82278d00305A35318K46445a418A26112j6467
16116A09645J2549E8551A3915L75332a1058o4605A30883J48842c26646I6666a19606
16104a68900I3641J29342m0287L58479A79241J0713N7527b96427C47232h4913
16093H3975e7595A89530c14413B59186a11693A55724E0232e1163J1275E9719O7723
16082A27442K86705A12982g1600A49278b10534G6590f9085B6845b6544B01604
16071e0710P773E9844P5242d9148k00736b2029F4105B4190c3299j91016a7080
16059a5880p0134k0862j6062o474j0242G9483J42340a20905A48558b6917h925
$$ plain form
16138 74924 -51412 71154 97553 -15948 -403854 338177 522537 373021 -9010 222317 -81335
16126 284144 17103 58208 -138846 482278 -400305 135318 381763 -1418 126112 109645
16116 109645 122194 58551 13915 389247 -11058 -75663 130883 279725 -326646 96666 -119606
16104 -168900 93641 222983 182696 541175 179241 189954 247481 -296427 347232 -84913
16093 83975 -57595 189530 -314413 259186 -111693 155724 50232 -51163 -39888 59719 127442
16082 127442 414147 112982 -71600 149278 -210534 76590 -69085 26845 -26544 201604
16071 -50710 -42937 59844 135086 -49148 -249884 -22029 64105 24190 -33299 -224315 -17080
16059 -15880 -86014 -106876 -122938 -129412 -139654 79483 221823 -120905 148558 -26917 -8925
16047a74996h4755A14024J7484b7946m7000r9895A26681K57065r5049r2151c02284
16035b51205a09810H9004c01772i9447C39039a5281j91158A6713N0766l0224f3329
16023b76805A11744g5408k3763F0431A238L65129I452Q6676O2715h9502D7980
16011a62784P1619b621j08237K0758k6300A57499o0122J99201C7114a92647I8416
15999a70468a9508A6995O2182B8137b59618e0624n4065F2988b60843C31215a08652
15987B6525N8558b2772C9196J20344G0777L47909A83990D3087J06501M0492K00262
15976C90342c22854B49894H9442a28882A82484C999K41343F8885a67608h3553
15965f6048k58847A70089f074B36268a08164N3528C58676r8190i584H2024d0526
$$ plain form
16047 -174996 -84755 114024 131508 -27946 -74946 -174841 126681 383746 288697 196546 -302284
16035 -251205 -109810 89004 -301772 -99447 339039 -15281 -206439 16713 67479 37255 -63329
16023 -276805 111744 -75408 -99171 60431 1238 366367 9452 96128 158843 -89502 47980
16011 -162784 -91165 -2621 -110858 -90100 -116400 157499 97377 296578 37114 -192647 98416
15999 -170468 -19508 16995 79177 28137 -259618 -50624 -104689 62988 -260843 331215 -108652
15987 26525 85083 -22772 39196 159540 70777 418686 183990 43087 149588 190080 390342
15976 390342 -322854 249894 89442 -128882 182484 3999 245342 68885 -167608 -83553
15965 -66048 -324895 170089 -6074 236268 -108164 -54636 358676 260486 -9584 82024 -40526
15953A18257a19048j51095a5648G0886L3302h3333A5773P7373a84985l2833N2878
15942a64940C91456j20807d83458O1281h7864A66631a04102E3943L46584a08088
15931B38922B8498g8291A20079M8163g7332e537n079E7232f5976l2213j7387c6334
15918a3658A02064J10691a81339J7515C7183b57671A60311f9603j09815b2741
15907b0259q6046n5305C09002o0398D1859a16343F9499K23864a40298A84040b25296
15895a37606f3029j78600A00680A5046d025G1776J26186f3408H7251b43934E2601
15883E7508c4076k40765E4325d01693J23000A7567Q8015L9626a11998d9691A48127
15871b10095a6237O572m4117D42035a40263c8614l05133B5917A030f9556A9255
$$ plain form
15953 118257 -119048 -270143 -15648 70886 104188 -83333 15773 93146 -184985 -217818 -164940
15942 -164940 391456 270649 -483458 -422177 -87864 166631 -104102 53943 400527 -108088
15931 238922 28498 -78291 120079 168242 -77332 -5537 -10616 57232 -65976 -98189 -115576 -36334
15918 -13658 102064 212755 -181339 -163824 37183 -257671 160311 -69603 -179418 -22741
15907 -20259 -106305 -161610 309002 248604 41859 -116343 69499 293363 -140298 184040 -225296
15895 -137606 -63029 -241629 100680 15046 -4025 71776 197962 -63408 87251 -243934 52601
15883 57508 -34076 -274841 54325 -401693 -278693 17567 105582 145208 -111998 -49691 148127
15871 -210095 -16237 -9665 -53782 442035 -140263 -38614 -343747 25917 1030 -69556 19255
15859F392J79979d57818B36500d5621l8190A59878F4060e1505A03703k3353a57978
15847F2929a99188q6734A0072K37286A17690j7515m3958c7289E9426c7541l9718
15836g7259j32888b9881j24432h889B04871a54362K8951D00145e4793A18463d1699
15824C61157c10365f4275j85568B72481A35205E3547a28125q8507N4438f3380
15813a70428f1439j5470A79536R7846b41752B79930C2054K0560a37134B76505
15802I5345a76632B8822a78037k37551b0155A93125A0009k352a73066O922H4343
15790A6818K59914o0249M5922H5997C9948c01367D437c18871J50771Q0508n331
15779i2923F2599k9452J273m147a63404b5215r1962D9640J41237c52554N7815
$$ plain form
15859 6392 186371 -457818 236500 -45621 -83811 159878 64060 -51505 103703 80350 -157978
15847 62929 -199188 -285922 10072 247358 117690 100175 56217 -37289 59426 -37541 -77259
15836 -77259 -210147 -29881 -154313 -8889 204871 -154362 -125411 400145 -54793 118463 -41699
15824 361157 -310365 -64275 -249843 272481 135205 53547 -128125 -216632 -162194 -63380
15813 -170428 -61439 -76909 179536 277382 -241752 279930 32054 52614 -137134 276505
15802 95345 -176632 28822 -178037 -415588 -20155 193125 10009 7657 -173066 -166144 84343
15790 16818 276732 216483 262405 85997 39948 -301367 4437 -318871 -168100 -87592 -92923
15779 -92923 62599 33147 34420 30273 -163404 -25215 -117177 49640 190877 -352554 -294739
15768b94739A42906a89924m8070g5735F7939b08988O531A44349d6021j43783G8635
15756D2290N9679J43454e2589E7245k5599K31823a98021j5684P5044l0116q1428
15745b50205B24424a28862a7746B48319A10503N2707l3855m2817L22346j76871
15735B32013j09590a02305A30f0046p7316B49751C7153A6392i2714J7434C0660
15723a93665M4254c0895l12875a40922A29948a4807l68360A30999j8212i1353
15712B32222d3593o3896B0664J48455J12040b16736C5703b22220A54788c14384
15701d20999I196N8942K5354L0363R1369F0566O1561b47795m3763I9677J51027
15690B50704b14874a9559A55904b11436d1728B23997f8798b9047A07010J11190
$$ plain form
15768 -294739 142906 -189924 -237994 -75735 67939 -208988 -202457 144349 -46021 -189804 78635
15756 42290 101969 245423 -52589 57245 31646 263469 -198021 -213705 -138661 -168777 -250205
15745 -250205 224424 -128862 -17746 248319 110503 163210 129355 86538 408884 232013
15735 232013 122423 -102305 130 -60046 -137362 249751 37153 16392 -92714 -75280 30660
15723 -193665 -149411 -30895 -343770 -140922 129948 -14807 -383167 130999 112787 -91353
15712 232222 -43593 -107489 20664 169119 281159 -216736 35703 -222220 154788 -314384
15701 -420999 9196 68138 93492 123855 215224 60566 122127 -247795 -291558 99677 250704
15690 250704 -214874 -19559 155904 -211436 -41728 223997 -68798 -29047 107010 218200
15680B18200b6297D3279b63074b3304p6862k31571a20300j65866A16403d5621
15669F4884B3799a92514g3504j63432A01817Q234D056a43347n4906c912A9426
15657b24584a6048k73025B84252c3451k01090M7229B77024C6248G96d274m5472
15646d9746F5321e0387j03706c0849l87322a08854B9117O2175k9757b5537F4133
15634D8920d21179A77053b03727D7298m241a63478i548j81809N2980D6531J01987
15623A48518j929J63417a38882n946E8371g5349q0995K4544A54062f5772K7483
15612c8289B6066a8383B74007d0622B73357a13485E2768K08203c9607j95881c7715
15600C08917a72696q9160A87686C8150K31739a81750j198F4639b59473A6370b19618
$$ plain form
15680 218200 -26297 43279 -263074 -23304 -100166 -331737 -120300 -286166 116403 -45621
15669 64884 23799 -192514 -73504 -236936 101817 110051 4056 -143347 -198253 -3912 19426
15657 -224584 -16048 -289073 284252 -33451 -234541 -187312 277024 36248 796 -4274 -49746
15646 -49746 65321 -50387 -154093 -30849 -418171 -108854 29117 91292 61535 -25537 64133
15634 48920 -421179 177053 -203727 47298 43057 -163478 -9548 -191357 -138377 46531 148518
15623 148518 146589 310006 -138882 -144828 58371 -75349 -156344 -131800 154062 -65772 -38289
15612 -38289 26066 -18383 274007 -40622 273357 -113485 52768 260971 -39607 -235488 -37715
15600 308917 -172696 -261856 187686 38150 269889 -181750 -182948 64639 -259473 16370 -219618
15588F3738c5016o5844C04393b1734A63006b30961A0925b3559j26673P0514E46808
15576g5817p9428P3435j4809k45004H2950h3146j7002H6920A6644c6868A27226
15564b8976l04229B24784C2768b03500B07290J05074f4854j22293N1160E8905
15553F2006b3858l25353a29188R725d0603j94169G6033h086A01992c12778E5412
15541a11066J7712I3190J96342r2182d656H074a69919K1614J0728A18365c6963
15529a60941k7989K3776p1621A48693J3557o7364i1337H0159B1105d2601g049
15517A09298J59109A20704a62285A54923J42628d5203G1347b32060P6335J3133
15507a42592H0386O9095b72182A78744e4694F6846b1263k03043B7732b27846a2675
$$ plain form
15588 63738 -35016 -100860 304393 -21734 163006 -230961 10925 -23559 -150232 -79718 546808
15576 -75817 -155245 -81810 -96619 -341623 82950 -83146 -100148 86920 16644 -36868 127226
15564 -28976 -333205 224784 32768 -203500 207290 312364 -64854 -187147 -135987 58905
15553 62006 -23858 -349211 -129188 -119463 -40603 -234772 76033 -8086 101992 -312778 55412
15541 -111066 -93354 93190 289532 197350 -4656 8074 -169919 -148305 -137577 118365 -36963
15529 -160941 -188930 -165154 -236775 148693 162250 94886 -91337 80159 21105 -42601 -7049
15517 109298 268407 120704 -162285 154923 297551 -45203 71347 -232060 -155725 -142592
15507 -142592 80386 149481 -272182 178744 -54694 66846 -21263 -224306 27732 -227846 -12675
15495A53029k9103k7626A3755N2712l2648h9497j23800K3183c0477p6258F2192
15483b2500j98113A5367J03150g4636B3618K11972e29277c2504r6286o6725g7023
15471a77213B8438b33542g0025l25900a61348f5668K5174j02109B01217g7773
15460a39864A89934a74128a9563k79030Q3936A21966j8840g9806k9787B70722
15449f9299A13895a390C6646Q7725i7307C41582o4622e2910H3947a14515B69844
15437d6945B80299a07559L233o3791A45192L9884H9050O1509F0265M1535r924
15426I1876m1583J11059c04026r0481a76467A08513a29707d8577j60394F4714
15415c1845B61126c6891j70159i4226j24525M9948A08323M0010a4723A08951C1922
$$ plain form
15495 153029 123926 96300 13755 66467 33819 -89497 -213297 -190114 -30477 -106735 62192
15483 -22500 -220613 15367 118517 -74636 23618 235590 -529277 -32504 -128790 -195515 -77023
15471 -177213 28438 -233542 -70025 -395925 -161348 -65668 -40494 -142603 201217 -77773
15460 -139864 189934 -174128 -19563 -298593 -214657 121966 103126 -79806 -109593 270722
15449 -69299 113895 -1390 36646 124371 -97307 341582 276960 -52910 83947 -114515 269844
15437 -46945 280299 -107559 -104326 -168117 145192 185076 89050 150559 60265 101800 91876
15426 91876 50293 161352 -304026 -394507 -176467 108513 -129707 -48577 -208971 64714
15415 -31845 261126 -36891 -207050 -94226 -218751 -168803 108323 148333 -14723 108951 31922
15403e9382G5630A7194M3291e8605j29164D6386a26255c6335k15906j21085D10759
15391h6319B27203j06069a74720I1539b5240k23509d6789k07520O6327A65065
15380B42670q1679e544r0686B61561k4346a00992k00379c6814B37270A06289q05
15369A05484b37891A6172a10025K8129j49999P5083B92082j14790c6943C00685
15358E4391b89218L6999G5137L00704i3479j42724A09693h6620k11584M6345A99670
15346h5329A09377J9560g3259q3047G8269b4552A30257b55123p2549G4663k2195
15335E2468a98925A03318J19556L3778a15909A39076O375F8265b71917A32497
15324A21900c3666k14476D33485D2608J91987c2307r975A50623a02623I7726M9049
$$ plain form
15403 -59382 75630 17194 60485 -58605 -187769 46386 -126255 -36335 -252241 -373326 410759
15391 -86319 227203 121134 -174720 91539 -25240 -248749 -46789 -254309 -187982 165065
15380 242670 160991 -5544 -96230 261561 237215 -100992 -301371 -36814 237270 106289 105484
15369 105484 -237891 16172 -110025 -81896 -231895 -156812 292082 177292 -36943 300685
15358 54391 -289218 -252219 75137 375841 -93479 -236203 109693 -86620 -298204 -251859 199670
15346 -85329 109377 128937 -73259 -156306 78269 -24552 130257 -255123 -327672 74663 52468
15335 52468 -198925 103318 222874 256652 -115909 139076 145451 68265 -271917 132497
15324 121900 -33666 -248142 433485 42608 234595 -32307 -42282 150623 -102623 97726 146775
15313A46775g5045r8581C39924I8354J00094o6535L2791R4468I179a19693a084
15301B45401a62818A50800P7536a73669C18295A7196P7646b0956B17388O8106
15291B85494b75716c217p5632e87D3751c3701j38159O907L5647A18655a09919
15279A29338j8348D2212K38772c32832a113j66736m828n2530k6568A21964n8435
15268F3529c6345p3991G7639h2875p322l3650A93199c4117q4856K1539c0565C4877
15255A96030I3542a07204o8881A2391f8063C07317K83052N63763Q72257q40437
15245A185952L59696n01199C76912j25728a7029j29459B2092N5124a48516f3850
15234D9809J4851N00a51858l8286H394O3807j9344a0152j00955n0167P8304A74046
$$ plain form
15313 146775 -75045 -173626 339924 98354 198448 131913 164704 259172 9179 -119693 -1084
15301 245401 -162818 150800 228336 -173669 318295 17196 94842 -20956 217388 285494
15291 285494 -275716 -3217 -78849 -587 43751 -33701 -171860 -164953 -129306 118655 -109919
15279 129338 110990 42212 280984 -332832 -1113 -167849 -172677 -225207 -251775 121964 63529
15268 63529 -36345 -110336 77639 -82875 -90197 -123847 193199 -34117 -118973 -97434 -30565 34877
15255 196030 93542 -107204 -176085 12391 -68063 307317 590369 1154132 2026389 1185952
15245 1185952 1545648 1044449 376912 251184 -17029 -146488 22092 77216 -148516 -63850
15234 49809 64660 65160 -151858 -190144 8394 72201 52857 -10152 -111107 -161274 -82970 174046
15221A89685L3182D4222f2385A25013b1325A74043e0975j02391o6486c3893R943
15210b3950C98102A94598b7646A09840G955f8363B74063G6174K24212e2342k36895
15199b89237i462o410B44644n7324G7335a15112l2376C9043A6016J1618h3237
15187a50159l27949C2012K47108G4919a82344e7475D9684a79747E77977B6876
15176C33579J4714F8356K86341i458I6156l0509K10770Q7817I9156D8867O0786
15165A09653c45463D06198A28303e4443B69553o8824G5878J1773J89448c30226
15154A75247F8233M9150J52979a34060A21872i4184A33767O5572q0529i0563B07017
15142a85006C31216n7730n7993B7249a73509B59794l5689a08633G3370d9904D24216
$$ plain form
15221 189685 222867 44222 -62385 125013 -21325 174043 -50975 -153366 -219852 -33893 -23950
15210 -23950 398102 194598 -27646 109840 7955 -68363 274063 76174 300386 -52342 -289237
15199 -289237 -9462 -15872 244644 187320 77335 -115112 -147488 39043 16016 27634 -83237
15187 -150159 -478108 32012 279120 74919 -182344 -57475 49684 -179747 577977 26876
15176 333579 348293 68356 354697 -9458 96156 65647 276417 364234 99156 48867 109653
15165 109653 -345463 406198 128303 -54443 269553 200729 75878 87651 277099 -330226
15154 175247 68233 117383 270362 -134060 121872 -94184 133767 199339 118810 -90563 207017
15142 -185006 331216 273486 215493 27249 -173509 259794 224105 -108633 73370 -49904 424216
15130F1424J58154E3138k3479j0528L9769N5662J69982I6548J42761D7253K64753
15119C12006D1663a32124C7020r676q642a48536A19002f6454k2708B18447D4147
15107H4650J0306M0751a3073k8688B90503A09949b46965F0555O9854O7917A9015
15095B82242j40863P7866A4262J19581f9525j20751G9871a96582A97256g2100
15084A85140e4820G4640h3027H6857K33924a3164A21441J600K54617j74702a61107
15072G7281a52775b186k6360A62575J6894c8433D2908a41303e8734D03656j71786
15061B31870L1582b9295H9435b39511c104B43873a47819A65520E5412B1744L24865
15050C46609j45836J4309a89606K7495A80688N1071k0948R6208B1134L88152j78226
$$ plain form
15130 61424 219578 53138 29659 19131 58900 114562 284544 96548 239309 47253 312006
15119 312006 41663 -132124 37020 27344 18702 -148536 119002 -66454 -89162 218447 44147
15107 84650 94956 135707 -13073 -41761 290503 109949 -246965 60555 130409 198326 19015
15095 282242 141379 219245 14262 133843 -69525 -190276 79871 -196582 197256 -72100
15084 185140 -54820 74640 -83027 86857 320781 -13164 121441 123041 377658 202956 -161107
15072 77281 -152775 -2186 -28546 162575 179469 -38433 42908 -141303 -58734 403656 231870
15061 231870 263452 -29295 89435 -239511 -3104 243873 -147819 165520 55412 21744 346609
15050 346609 200773 215082 -189606 -162111 180688 231759 210811 307019 21134 409286 231060
15039B31060I0649b44581C21220J23678A38101K21485J39055A86806L73657A67187
15028i5130C41461G7710Q7943K03817a45940a2278C25411M502c37222C24616F952
15016c01048A21188K16741F5185i827A95980J5423J59892a46563B93674c0723
15005D13160g1478A96709M7610O1055g718A91069j5723J43915A06381J07161i0546
14993B78931a59505C81665F2961O3225E1315J37948H468a86773B83017L7318A19375
14981D64659A42642P3465J82988h4666B48792K26680B20486A10190B1253L00805
14971C22058E2592c3003E69268j61236b1723A87710l0272D6561A678K9770L09856
14960C41304O3266j27014J95958A52850l8252K66718J35640k41235A0079L10449
$$ plain form
15039 231060 90649 -244581 321220 444898 138101 359586 498641 186806 560463 167187
15028 -95130 341461 77710 165653 369470 -145940 -12278 325411 329913 -337222 324616 6952
15016 -301048 121188 337929 65185 -9827 195980 211403 371295 -146563 293674 -30723
15005 413160 -71478 196709 244319 305374 -7718 191069 175346 319261 106381 213542 -90546
14993 278931 -159505 381665 62961 126186 51315 189263 8468 -186773 283017 320335 119375
14981 464659 142642 216107 399095 -84666 248792 475472 220486 110190 21253 322058
14971 322058 52592 -33003 569268 408032 -21723 187710 157438 46561 1678 31448 341304
14960 341304 404570 277556 473514 152850 114598 381316 516956 275721 10079 320528
14950C20528r6278L8898F8781M0151J69819P6619G7684K28231G4981J82512M824
14939B62317j16085L0508Q1287j27438J27498J9302j08535J12938H6457K40607
14929C27064A49992l0563L60016A80720p6013K08016J9928P4602j40012d6154
14918F6979L28369B2314O970O7674M239K20886j03139a81983c6998A75432j4055
14907A61377k2834J42253j00047K13962A90408H6371J11078K00613H3043L13159
14897C96202K0439j59506A4318P22831p7931A52088J30180r156o2296j9746J78572
14886C69642j58621J06127K2268q3202O5713A45692J61529A12097K69269j26139
14876B55227p7506L06379B09372K25591B07809R9935K26128d0937D43271B2547
$$ plain form
14950 320528 224250 263148 68781 108932 278751 355370 77684 305915 74981 257493 262317
14939 262317 146232 176740 258027 130589 258087 277389 168854 281792 86457 327064
14929 327064 149992 119429 479445 180720 104707 312723 332651 407253 267241 -46154
14918 66979 395348 22314 29284 96958 101197 322083 218944 -181983 -36998 175432 161377
14907 161377 138543 280796 180749 394711 190408 86371 197449 398062 83043 396202
14897 396202 416641 257135 14318 737149 659218 152088 282268 273112 210816 191070 369642
14886 369642 211021 317148 339416 256214 321927 145692 307221 112097 381366 255227
14876 255227 177721 484100 209372 434963 207809 307744 533872 -40937 443271 22547
14865C38324n334C1304K2933K90959j70375L96158k00957j28570j05555M11587
14855E47484k03847J66268k15055J27895A17796L60122o3929j75512R0707K85937
14845F15121k6678A25354L91997l4115j80545L978J23846k06386J14254q8905
14835B49478m9019J05498L07179k00072p6317M8005q2635K04990P1256j56561
14825D21802l2576p2758P6262J98888r2588A56949M99423l9840k20153p3423K62265
14814E85221q7527J68259j18750B60997m4842m0022L09849j67961M09342k08291
14804E19072o4179j51392C6813N90935k75080J4842k5003J45052q7003j04142
14794B96414o1433N92786j10433k10376l9990J27385k55584Q5733m8809J77219
$$ plain form
14865 338324 332990 31304 54237 345196 174821 570979 370022 241452 135897 547484
14855 547484 343637 509905 294850 422745 117796 477918 413989 238477 329184 615121
14845 615121 588443 125354 517351 483236 302691 306669 430515 224129 338383 249478
14835 249478 200459 305957 613136 413064 336747 384752 302117 507107 578363 421802
14825 421802 389226 316468 392730 591618 499030 156949 656372 616532 396379 322956 585221
14814 585221 497694 665953 547203 260997 216155 176133 485982 318021 727363 519072
14804 519072 454893 303501 36813 627748 352668 367510 342507 487559 400556 296414
14794 296414 234981 827767 717334 506958 466968 594353 338769 424502 375693 552912
14784E52912L5254B48231q1080J87276L30749m4697A3923M12606j86395K32379
14774D72513A27994O36252j96781n5416k007k36003J13839M9579o7053P8488L03419
14763G52311j89266K37434l60323K26573j74166J76292l6011k12488J14041K16079
14753G50476k48812J85696k25082L13705C04842K72381Q9007J52983L96595B44579
14742G02555l737j57822O0396j58150L10995C68608J53345K10493j68434o3945
14732E00067q598L8621N5406J24007j85773J72598J7378j2143Q7562J35899l20175
14721F04849J62657o3854j55737M26712k84965j07658p486M4484L7458j87681
14711D68779M27697r1224l27704M67669l24330L0675K44344D05186P68869l55883
$$ plain form
14784 552912 588166 248231 167151 354427 685176 640479 13923 426529 240134 472513
14774 472513 127994 764246 567465 512049 510042 274039 387878 437457 370404 448892 752311
14763 752311 563045 800479 440156 666729 492563 668855 632844 420356 534397 750476
14753 750476 501664 687360 462278 775983 304842 577223 666230 819213 1215808 244579
14742 702555 698818 540996 601392 443242 754237 368608 521953 732446 564012 500067
14732 500067 491469 530090 585496 709503 523730 696328 713706 701563 789125 925024 604849
14721 604849 767506 703652 547915 974627 689662 582004 574518 619002 656460 468779
14711 468779 896476 805252 477548 945217 620887 651562 895906 405186 1174055 818172
14701H18172l08039K61217j38709K5083L19874k6801k4084k37239M62184l72842
14691G78816j52450M04893k89111L53792j36633j29548M9075p7383p5712J50143
14681H75882L3980k14721J10087m3857J57091K52514j74835k24627J05351l70694
14671E06171P90092k10842j40597r3324k0920K05723j82116J63762J93071l77072
14661H33948j2671l5562K73233o7966m86751O32255l32616K64057j37541J00519
14651A030905k40117n561N65862j52115m08034K83709k99092L44139j98557j82454
14641G38685N44703k08239r9515K53072Q1165l66119K07194j79348L13339N8982
14631A343919l00923K62243l54892K82456p2816J68601J12311k76471M60388k14861
$$ plain form
14701 818172 510133 771350 632641 657724 977598 950797 926713 689474 1151658 778816
14691 778816 626366 1031259 742148 1095940 959307 829759 878834 801451 725739 875882
14681 875882 909862 695141 805228 761371 918462 1170976 996141 771514 876865 506171
14671 506171 1296263 1085421 944824 851500 830580 1036303 854187 1017949 1211020 833948
14661 833948 821277 785715 1058948 990982 504231 1136486 803870 1067927 930386 1030905
14651 1030905 790788 785227 1351089 1198974 790940 1074649 775557 1119696 921139 738685
14641 738685 1283388 1075149 975634 1228706 1309871 943752 1150946 971598 1284937 1343919
14631 1343919 1042996 1305239 950347 1232803 1159987 1328588 1440899 1164428 1624816 1409955
14621A409955j54659j68644K01380J46090n1837R5100j25239N3455N0629J41064
14611A597294K3381l67018J02513M676Q7879j40383j33524o0571L47826J35915
14601A597988k04182J72463K51808k32079k33751Q6611J17142j28592J94257j9352
14591A602313m16406K00082n8875j8594M87149k72405K51724l5959m85256N63285
14581A817058k24627K08041M1600J68098j28371k91519K61601j29750m3574N645
14571A684202L14342k85466K14194L19910j15003k50321N31983k53934j58744
14562B001163J35236L98090j96295K6228M9319j73209L51884K62874L49738J10709
14552C315737L63345N53701O28218J088173L773284R490745J6806506Q427653
$$ plain form
14621 1409955 1255296 1086652 1288032 1434122 1382285 1477385 1352146 1405601 1456230 1597294
14611 1597294 1620675 1253657 1356170 1360846 1448725 1308342 1174818 1114247 1462073 1597988
14601 1597988 1393806 1566269 1818077 1585998 1352247 1438858 1556000 1427408 1621665 1602313
14591 1602313 1185907 1385989 1327114 1308520 1795669 1523264 1774988 1739029 1253773 1817058
14581 1817058 1592431 1800472 1842072 2010170 1881799 1590280 1851881 1722131 1678557 1684202
14571 1684202 1998544 1713078 1927272 2247182 2132179 1881858 2413841 2159907 2001163
14562 2001163 2136399 2534489 2338194 2364422 2413741 2240532 2592416 2855290 3205028 3315737
14552 3315737 3679082 4232783 4861001 5949174 9722458 19213203 36019709 44447362
14544D4447362k1027377j1685643E279457k268610o77027k58780j02708K8787
14536B001119r1424j92453q4538J25567q9880M28515m67750K95204r5301J06066
14526A935125L8182J63366N1256j83088J33933J80967Q9012P2290p7013j73545
14516B230485J3095J03654l80352N11957K26291m79854L77490m39658K84806L6834
14506B484748J93684J469k11566J63137J25938P963j55893J34292O1165J07137
14496B912074k34320K01828r5031j08352L89734j89975M9550K36463K09199L64460
14486C735630m13101K6679j08111q3407k19337L99538J01913j09669M10548n4796
14476C685887k356l37075K07891M23619p3430K26972O5646j47485l71212M70686
$$ plain form
14544 44447362 23419985 11734342 5279457 3010847 2333820 2075040 1972332 2001119
14536 2001119 1909695 1717242 1632704 1758271 1668391 2096906 1629156 1924360 1829059 1935125
14526 1935125 1973307 2136673 2187929 2004841 2138774 2319741 2408753 2481043 2404030 2230485
14516 2230485 2243580 2347234 1966882 2478839 2705130 2225276 2602766 2163108 2447914 2484748
14506 2484748 2678432 2679901 2468335 2631472 2757410 2765373 2609480 2743772 2804937 2912074
14496 2912074 2677754 2879582 2784551 2676199 3065933 2875958 2925508 3161971 3371170 3735630
14486 3735630 3322529 3349208 3241097 3157690 2938353 3337891 3439804 3330135 3740683 3685887
14476 3685887 3683531 3346456 3554347 3977966 3904536 4131508 4197154 4049669 3678457 4149143
14466D149143j31095j21839j36315M60729j54629Q9312J92127k68890L84209K80387
14456D743139k13167j53115K38086O8866M4174k9320N6793m1397J23310K0006
14446D857375K0432K93305j72804L37842r3498J60287m1741O1786L8251M78571
14436E939806k61021J06963r185K20531n9163j82525O76736k42330L05033n1633
14426F443212j43546K61085q8029L15819N6645P5315L2317J5687P1672M37773
14416G477950M2757K17799L37483k82720R7361J06008M14292P1289l93474N05003
14406H593748L02128J62148k31097N22692m73202M36917L08699j38741O2491L74900
14396I920683K59010L48176j04244k08332Q46570K61481j12342o182M03282J79422
$$ plain form
14466 4149143 4018048 3896209 3759894 4220623 4065994 4155306 4347433 4078543 4462752 4743139
14456 4743139 4529972 4376857 4614943 4683809 4727983 4698663 4755456 4714059 4837369 4857375
14446 4857375 4877807 5171112 4998308 5336150 5242652 5402939 5361198 5422984 5461235 5939806
14436 5939806 5678785 5785748 5776563 5997094 5937931 5755406 6432142 6189812 6494845 6443212
14426 6443212 6299666 6560751 6472722 6788541 6845186 6920501 6952818 6968505 7040177 7477950
14416 7477950 7520707 7738506 8075989 7793269 7890630 7996638 8410930 8482219 8088745 8593748
14406 8593748 8895876 9058024 8826927 9349619 8876417 9313334 9622033 9483292 9545783 9920683
14396 9920683 10179693 10527869 10423625 10215293 11061863 11323344 11211002 11204820 11608102 11787524
14386A1787524Q5217K97272K74658j9503J91971M43393J09057L99547J47729K80923
14376A3997788K82774O101Q45437j35252Q86177k43796N03617K29919K20619M57389
14366A7050773M27328J38016M12821M74060K97476N33257N30205J32752N91105
14357B0587793N99604L95890N17237M75171L23030P21137M72598N65873M65603
14348B5123936Q79765R20721M36978Q89185O62580R82696M18210J057113O48933
14339C2020117N26894J282258R17135R62827R01106R89376J487725J281945J076940
14330D1446323J139657J339575J012599J900970J454404J612873J352828J778654
14322E3037883J984855K044558J925414K422612K240110J998496K809666K467255
$$ plain form
14386 11787524 11872741 12170013 12444671 12425168 12617139 13060532 13169589 13569136 13716865 13997788
14376 13997788 14280562 14286663 15132100 14996848 15883025 15639229 16142846 16372765 16593384 17050773
14366 17050773 17478101 17616117 18028938 18502998 18800474 19333731 19863936 19996688 20587793
14357 20587793 21187397 21583287 22100524 22575695 22898725 23619862 24092460 24658333 25123936
14348 25123936 26003701 26924422 27361400 28250585 28913165 29895861 30314071 31371184 32020117
14339 32020117 32547011 33829269 34746404 35709231 36610337 37599713 39087438 40369383 41446323
14330 41446323 42585980 43925555 44938154 46839124 48293528 49906401 51259229 53037883
14322 53037883 55022738 57067296 58992710 61415322 63655432 65653928 68463594 70930849
14314G0930849K630153K911146L178394L205904L713319L281036M138251L736647
14306I7725699M363515M695647N026974M739851N629691N892807O432684O547948
14298A41054816P093295P742257P692493Q499923Q847672R799257J0152920J0816829
14290B11699462J1647893J1961138J2609319J3546256J4424838J4600161J5346531
14283C05835598J5584916J6065283J6218902J6597352J5988156J5759545J4985486
14276D17035238J3913287J2568082J0815156Q512268M570190l8094m84943j130787
14268D65760397k995432k012305m585198q450106j1246395j3133767j4634819
14261D08702375j5710940j6198515j6520932j6538010j6483291j6014824j5899522
$$ plain form
14314 70930849 73561002 76472148 79650542 82856446 86569765 89850801 93989052 97725699
14306 97725699 102089214 106784861 111811835 116551686 122181377 128074184 134506868 141054816
14298 141054816 148148111 155890368 163582861 172082784 180930456 190729713 200882633 211699462
14290 211699462 223347355 235308493 247917812 261464068 275888906 290489067 305835598
14283 305835598 321420514 337485797 353704699 370302051 386290207 402049752 417035238
14276 417035238 430948525 443516607 454331763 462844031 467414221 467376127 466891184 465760397
14268 465760397 462764965 460752660 456167462 447717356 436470961 423337194 408702375
14261 408702375 392991435 376792920 360271988 343733978 327250687 311235863 295336341
14254B95336341j3828915j4314466j3763810j3495226j2221848j1845932j1447417
14247B04418727j0709942r341872r153012q546397q518677p673336p158761o863086
14239A36453644o570234n773201m942304n724862n016027m979212m435068m139115
14231I4873621l476830l491137l591410l564149l374554k781334k781603k920529
14223F8892075k525694k076351k390923j998239k061893j842622k231902j997434
14215E1767017j529618j429836j144690j437525k062209j154349j420695r98197
14207D0589898p56541j048804j274815j200570j039724j411356l65455n88458
14199C2904175q63723j036129j041131o51089j031999l26063n76048q55399n7406
$$ plain form
14254 295336341 281507426 267192960 253429150 239933924 227712076 215866144 204418727
14247 204418727 193708785 184366913 175213901 166667504 158148827 150475491 143316730 136453644
14239 136453644 129883410 124110209 119167905 113443043 108427016 103447804 99012736 94873621
14231 94873621 91396791 87905654 84314244 80750095 77375541 74594207 71812604 68892075
14223 68892075 66366381 64290030 61899107 59900868 57838975 55996353 53764451 51767017
14215 51767017 50237399 48807563 47662873 46225348 44163139 43008790 41588095 40589898
14207 40589898 39833357 38784553 37509738 36309168 35269444 33858088 33492633 32904175
14199 32904175 32040452 31004323 29963192 29312103 28280104 27954041 27377993 26522594 26465188
14190B6465188j321998o85567k99304q41852l4711q34683m84247n76070o73556
14181B0713200l66669p1885q00358l08843m70226l87194K62957p24429j86381
14172A7660172p04315k99307O7714o48615k50981o80449P7893l31268m19075j85599
14162A4286170l11744j68097p1501n11434J10449m79499j14855j21143j79559
14153A2438787l20121n12415L00706p10836J3173k0206m40919n04049N5861j79427
14143A0120554K62925l09300j93628j51299l37595J85452l59685k48789J88225
14134I156860j28483m64973J01970J2845j19220j42384l81948k37505J08587J18603
14124H024352m13399k8616K73095p95542L06637r2634m8404k59423j44024O3213
$$ plain form
14190 26465188 25143190 24457623 24158319 23316467 23281756 22447073 21962826 21386756 20713200
14181 20713200 20346531 20274646 19474288 19165445 18695219 18308025 18570982 17846553 17660172
14172 17660172 16955857 16656550 16724264 16075649 15824668 15144219 15222112 14890844 14471769 14286170
14162 14286170 13974426 13806329 13734828 13223394 13333843 12854344 12739489 12618346 12438787
14153 12438787 12118666 11606251 11906957 11196121 11209294 11189088 10748169 10244120 10299981 10120554
14143 10120554 10383479 10074179 9880551 9729252 9391657 9577109 9217424 8968635 9156860
14134 9156860 9028377 8563404 8665374 8678219 8558999 8416615 8034667 7797162 7905749 8024352
14124 8024352 7610953 7582337 7855432 7059890 7366527 7273893 7225489 6966066 6822042 6885255
14114F885255k5288l83020J43269r533k052l17411J74036l70581O8997P7422p3074
14103F168020o9130j84699l2605j71142K7545J70932m30060l08605M18015l6058
14093E552213n12753j97654M68947l35071p283K35923k33669j77398k60854L47942
14083D880343m22611O2627K8055J5936n0685k0259R5844m39300r092J37731j01901
14072D176688K00267m32207L36978k34721m8228j71576K34825k62861L14643n8025
14062D055783l78046o4686K93058l7585l56854K47984K30459k58393l36066R0559
14052C486213J42531l88734L08633J072k46471k34330L22708Q4659k22108m8641
14042C205532m0440m7963Q0776M9648m12808K38055l31447M62738P5131k88223
$$ plain form
14114 6885255 6859967 6476947 6620216 6610683 6608631 6291220 6465256 6094675 6163672 6241094 6168020
14103 6168020 6098890 5914191 5881586 5710444 5737989 5908921 5478861 5170256 5588271 5552213
14093 5552213 5039460 4841806 5310753 4975682 4968399 5204322 4970653 4793255 4532401 4880343
14083 4880343 4457732 4520359 4548414 4564350 4513665 4493406 4589250 4149950 4140858 4278589 4176688
14072 4176688 4376955 3944748 4281726 4047005 3998777 3827201 4062026 3799165 4113808 4055783
14062 4055783 3677737 3613051 3906109 3868524 3511670 3759654 3990113 3731720 3395654 3486213
14052 3486213 3628744 3240010 3548643 3549715 3303244 3068914 3391622 3476281 3254173 3205532
14042 3205532 3165092 3117129 3197905 3247553 2834745 3072800 2741353 3204091 3279222 2990999
14032B990999K13985m56378J29371J10433J49039m93178K08425r8662J19200k91463
14022B581771J09430j0617j24352N6175j48992K55984m21006J75702k20082K47118
14012B501131j75517J16797k00032o7281J16311j74619j6072J75685j61974j18108
14002A996321J98489k12780K17425l53025L99387j14313M1921o06528J36478k5228
13992A678147L91115q691J23459J037440K076679P093849J6872332J6691625j9128128
13983B6827827j2385771n843626k462644j431247o13351p03642k06331k55958
13975B925257O778j82823k93788m3473K96598k96874m6372k25564K40354j23690
13965B256403j15373q3634O5239Q0617r103L0088j03865m13939N36477j05400
$$ plain form
14032 2990999 3204984 2748606 2877977 2988410 3137449 2644271 2852696 2754034 2873234 2581771
14022 2581771 2691201 2680584 2556232 2612407 2463415 2719399 2298393 2474095 2254013 2501131
14012 2501131 2325614 2442411 2242379 2175098 2291409 2116790 2100718 2276403 2114429 1996321
14002 1996321 2194810 1982030 2199455 1846430 2245817 2131504 2173425 1566897 1703375 1678147
13992 1678147 2069262 2060571 2184030 3221470 5298149 12391998 29264330 45955955 26827827
13983 26827827 14442056 8598430 6135786 4704539 4091188 3387546 3181215 2925257
13975 2925257 2932035 2749212 2455424 2411951 2708549 2411675 2365303 2139739 2380093 2256403
13965 2256403 2141030 2057396 2122635 2203252 2194149 2224237 2120372 1706433 2242910 2137510
13955B137510l91429J44852q9286j09439M9261K42320l9295j34606K48633j74464
13945A884057l03260L56031J74101l74288K12598k66448L6775J01550l29333j95251
13935A296532Q05274p40815L698M93122l54508J32260l55181K05947K82512k19395
13925A549446j8774k68918J31709J3666J57856K30714o57757n1925K83665K5567
13915A395249l57635K70298L6073J02224k00696N2492J80161N1848K2291j13693
13905A438612j87683k86560M62459j35097l93281M42916K0282j0218m26146M7778
13895I73062M11414L0516J25892j57920k25506K01126j17206r3140l2887r8268
13885A017083k071O23045j72704M0037n63886K47939N5015j30607k17914j40069
$$ plain form
13955 2137510 1746081 1890933 1801647 1692208 1741469 1983789 1944494 1809888 2058521 1884057
13945 1884057 1580797 1936828 2110929 1736641 1949239 1682791 1719566 1821116 1491783 1296532
13935 1296532 2101806 1360991 1364689 1857811 1503303 1635563 1280382 1486329 1768841 1549446
13925 1549446 1530672 1261754 1393463 1407129 1564985 1795699 1137942 1086017 1369682 1395249
13915 1395249 1037614 1307912 1343985 1446209 1245513 1298005 1478166 1530014 1552305 1438612
13905 1438612 1250929 964369 1426828 1291731 898450 1341366 1361648 1351430 925284 973062
13895 973062 1384476 1414992 1540884 1382964 1157458 1358584 1241378 1148238 1115351 1017083
13885 1017083 1015012 1638057 1465353 1505390 941504 1189443 1244458 1113851 895937 755868
13875G55868O50905k70438k49845L49491j50314j03759k06837M32105j14782o2811
13865A029583J39633k37303Q1497J91771j41233O5374k92181J10697J9781K22005
13855A189624j33528j02570j42638K15114k03421J02107Q1967M0433k55774q7591
13845G03723L26754p1062j92638L42851l7160k44593L87442j45684k45059K9089
13835H53663C86929O48512l48708O9858J26231n5565q1129j55436N49185M8715
13825A188592k97222m23522K30350k16513O41094m73806N91279j79290l77793
13816F83169j03756J90764j31148j37446M91316l77881J16414q0355J60762M3800
13806H55639k38692Q7219K77792P9733k15198k43072j7865L29436j71438J06266
$$ plain form
13875 755868 1406773 1136335 886490 1235981 1085667 981908 775071 1207176 1092394 1029583
13865 1029583 1169216 931913 1013410 1205181 1063948 1129322 837141 947838 967619 1189624
13855 1189624 1056096 953526 810888 1026002 822581 924688 1006655 1047088 791314 703723
13845 703723 1030477 959415 766777 1109628 1072468 827875 1215317 1069633 824574 853663
13835 853663 386929 1035441 686733 756591 882822 827257 746128 590692 1139877 1188592
13825 1188592 891370 467848 698198 481685 1122779 648973 1240252 1060962 683169
13816 683169 579413 770177 639029 501583 992899 615018 731432 651077 811839 855639
13806 855639 616947 704166 981958 1061691 846493 603421 585556 914992 743554 849820
13796H49820l48677L07206J18295j73737j1119J58652q6494j153R8460m26867
13786D84386J96820J44554R2006j05088J72751k49396K24499r6791j75500k86669
13776D01572N49949B68337L62218P0137l06004L28636k5936O9508J18361B17284
13765F70853n9109q8083J92557J1641R929k10972k41109M84767J17004l96029
13755D91449L06797k22342o9469M9K98368C31477L34393J17396l60874Q8808j08143
13744D03057J81984m3218K13493j95832J95836C58662N7713M40171p4001k57341
13734E25204K29636k42831J54096A13292L61929k8667j48172L36514R8624m4212
13724F89308r9615j3934K25218j12513j79739j27094K93178k71559N9076B01369
$$ plain form
13796 849820 501143 808349 926644 752907 741788 900440 813946 812793 911253 484386
13786 484386 681206 825760 917766 812678 985429 736033 960532 863741 688241 401572
13776 401572 951521 268337 630555 700692 394688 723324 697388 766896 885257 217284
13765 670853 611744 523661 716218 727859 737788 526816 285707 770474 887478 491449
13755 491449 798246 575904 506435 506484 804852 331477 665870 783266 422392 511200 403057
13744 403057 585041 541823 755316 559484 755320 358662 416375 856546 782545 525204
13734 525204 754840 512009 666105 113292 475221 446554 298382 634896 733520 689308
13724 689308 589693 575759 800977 688464 508725 381631 674809 403250 462326 201369
13713F08678O7882m6915B26399M62756j24564k65884N14868k34854k5321k32591
13703C20809J84519B00529M93012k56972R2090J10502j73443L59843C56503j15641
13693B40862K72725J24312K4010b06656F51032l03188K99120o1371j94806o7729
13683C23058j59744J93088J2744q2052K73525K13557J0061A69561K42699j45543
13673B66717K42755I6518M95985k79062J36584L0686R1826j40866B00155L44004
13663E44159j7312l3125R8254j91516K67283m1348B89318q8723E7015L12516J31361
13652E00892J50406B16576J03281J85435L8425J6126j27313j68247o8415J95203
13642C91071O9664m5020j2904o5364j24151L39419p7096j44669L50556l40489
$$ plain form
13713 608678 676560 629645 226399 689155 564591 298707 813575 578721 553400 320809
13703 320809 505328 200529 693541 436569 528659 639161 465718 825561 356503 240862
13693 240862 513587 637899 661909 -206656 651032 347844 646964 585593 390787 323058
13683 323058 163314 356402 369146 287094 560619 774176 784237 169561 412260 266717
13673 266717 509472 96518 592503 313441 450025 480711 572537 431671 200155 544159
13663 544159 526847 493722 591976 400460 667743 626395 289318 200595 57015 369531 500892
13652 500892 651298 216576 319857 505292 543717 559843 432530 264283 195868 391071
13642 391071 460735 415715 402811 337447 213296 552715 475619 330950 681506 341017
13632C41017L39901k57937k8738p2499J60061j92714K13985j4368J91029B55100
13621B68892K4824j26794l3118J0554M22466A98866D9041L49008J05708j24064
13611C79693K04847m6561n3354B31738L20768K0965A02034j7683l8595M16516
13601D62272A45406J82494L0058J10786B09655K47056q5022M28588B48924r5703
13591A53221o9567L88966j50086j2579J68816D8656K03281K36914C8448K43506
13581B81954M82J52723B0284L40938K2398J37398k05636J5462j7989A01953L7575
13570A39528N7629r3073N7217f0999B39960J26830l2482J39899m4764j28971A03310
13558E15367B03490K01778b4153E71695B58532p903a62287D97061D5165a39971
$$ plain form
13632 341017 680918 422981 394243 321744 481805 289091 503076 488708 679737 255100
13621 268892 293716 166922 133804 144358 566824 198866 49041 398049 503757 379693
13611 379693 584540 537979 484625 231738 552506 573471 102034 84351 45756 462272
13601 462272 145406 327900 357958 468744 209655 456711 371689 800277 248924 153221
13591 153221 83654 472620 322534 309955 478771 48656 251937 488851 38448 281954
13581 281954 282436 435159 20284 361222 383620 521018 315382 330844 312855 101953 139528
13570 139528 197157 104084 161301 -60999 239960 366790 334308 474207 429443 300472 103310
13558 515367 203490 405268 -24153 571695 258532 250629 -162287 497061 45165 -139971
13547D35413j14806o816L40333j61182j56208K5311n9219m1766o8775D7605K22709
13536B70314F0447J50769L39891C1777K60817j44928L55349k17551K0539K33441
13526E39444k14000K84594B11728q1473K66492M5143A29727M27023k65316K51454
13516E42888A13254L12696k04441K61139b15392D077L12296j48897d5216C50140
13505D38009j71708J75510Q9424I2096D4734L46866j19407m5004N6542a06913
13494A64234n96J4839p4297J99641j46744o9140L07550A15245J44253A22292J42616
13483B64908J91706A71422J07601o1098p8516M0601K53795A26386L51161A1809
13472D05317K66994j53151k04135I7426J79936b4008F4224M63618k58831J59317
$$ plain form
13547 435413 320607 313791 654124 492942 336734 362045 302826 261060 192285 47605 270314
13536 270314 60447 211216 551107 31777 292594 147666 503015 285464 306003 539444
13526 539444 325444 610038 211728 130255 396747 441890 129727 556750 291434 542888
13516 542888 113254 425950 221509 482648 -215392 4077 316373 167476 -45216 350140
13505 438009 266301 441811 531235 92096 44734 391600 272193 227189 283731 -106913
13494 164234 163638 178477 104180 303821 157077 87937 395487 115245 259498 122292 264908
13483 264908 456614 171422 279023 217925 139409 180010 433805 126386 477547 11809
13472 405317 672311 519160 315025 97426 277362 -24008 64224 527842 269011 428328
13462D28328j49677r0276P6007j26243l4594L15423f8336H1721J48424K00637
13452D30782a69265B14918k5103F7396J55437J55709j40949J38257L9999j75745
13442B40104a529H13899A07942L41814k8380J2215j53534o970L5298m0148j11992
13431A56245f93C76487j39913L1640q9337J0581I0323J08226D1133J71172a60209
13419B90541B8586N3791J43687J35617M9483M8803H5781J22708P6604J0559M2056
13408C37708j47650K24972j23680L4050A33779K89927A68916N5074B1629g6941
13397A25408N0694f5310C46525b6094C28149q6334A8394L55488j14109b6421A30897
13385d1954q2875A13445O9931J18726H8104R6395C4895K47716A0697R0151N7498
$$ plain form
13462 428328 278651 188375 264382 138139 103545 418968 -68336 81721 230145 430782
13452 430782 -169265 214918 189815 67396 222833 378542 237593 375850 415849 240104
13442 240104 -1529 813899 107942 449756 421376 433591 280057 273087 308385 268237 156245
13431 156245 -693 376487 236574 268214 178877 189458 90323 198549 41133 212305 -160209
13419 290541 28586 82377 226064 361681 411164 459967 85781 208489 285093 295652 337708
13408 337708 190058 415030 291350 325400 133779 423706 168916 223990 21629 -76941
13397 125408 176102 -65310 346525 -26094 328149 241815 18394 373882 259773 -26421 130897
13385 -41954 -124829 113445 183376 302102 88104 184499 34895 282611 10697 100848 158346
13374A58346E1029L84618k8118k00934n5001f6774C83352b73228C11156J37658
13364D48814A49945B2656J89119K91370k25745B9691M4248J91039b36201D83499
13353A75788k275b2717B50396J3136J80144G5007M91536B08423K29516A31263
13342E94988B11618M6715A27615m2321P6825j1269J6712k8801Q9438J97886p1929
13331C54156j4175j16344B9701a04011B16065a20782B15204n4292d9516C0437
13320B61672r2783g0390B2260J27614J12650C6552J75265K08489B03443P8024
13310B81467j28599F2849J74089b45152B54335H1267K49785j5375j10917P3688
13300B78448o0483e2681E6549d9506A64950J64068G2274N3161a28199A54941K57367
$$ plain form
13374 158346 51029 435647 407529 206595 151594 -66774 383352 -273228 311156 448814
13364 448814 149945 22656 211775 503145 277400 29691 73939 264978 -236201 483499
13353 175788 173513 -22717 250396 263532 443676 75007 566543 208423 437939 131263
13342 594988 211618 258333 127615 85294 162119 150850 167562 138761 228199 426085 354156
13331 354156 339981 223637 29701 -104011 216065 -120782 215204 160912 -49516 30437
13320 261672 168889 -70390 22260 149874 262524 36552 211817 420306 203443 281467
13310 281467 152868 62849 236938 -245152 254335 81267 331052 315677 204760 278448
13300 278448 217965 -52681 56549 -49506 164950 329018 72274 125435 -128199 154941 412308
13289D12308E2766P7965K01104I1423J35930B0816a65613H9543K13894C404K22711
13278B26115c3683C09568g3320B46713b468G1070e1278A43092J21256A18869a11329
13266E18814B32137F2923a63183F4587K43959P3729C7283J44458a19878B5279
13255c83225C40463A61499N9772n4209B0538L29110j23299f2707j61366C30885
13244A42699K4571i8414k3790G8199B3284K08769J94784a12448A06643a98413
13233B92426D8191f0225C3983c75336j08501C36185c36655B49335A3592M82823
13223D96415B27416g9948J6050p485m5807A20387J15548F1021L23180A06915K20495
13212C27410R193O130D5989O1736M4502F8701J74201J7491c21230C58489j46375
$$ plain form
13289 412308 52766 130731 331835 91423 227353 20816 -165613 89543 303437 3404 226115
13278 226115 -33683 309568 -73320 246713 -2468 71070 -51278 143092 264348 118869 -111329
13266 518814 232137 62923 -163183 64587 308546 382275 37283 181741 -119878 25279
13255 -383225 340463 161499 221271 167062 20538 349648 226349 -62707 -224073 330885
13244 142699 167270 -98414 -122204 78199 23284 232053 426837 -112448 106643 -198413
13233 292426 48191 -60225 33983 -375336 -483837 336185 -336655 249335 13592 496415
13223 496415 227416 -79948 -63898 -71383 -117190 120387 235935 61021 384201 106915 327410
13212 327410 336603 342733 45989 107725 152227 68701 242902 260393 -321230 358489 212114
13201B12114D5266J5771Q4742R545n6695N103l4812K7902b9719j47335B60071
13189E3888b5784B32898Q2850j00932q8743b72086h1737C40224H8403g2927A14093
13177A35172K04048j12160H7590h0991A58426d2910J1490j18214E2493L62896
13167D15389G1633J43613a70090Q1032A54514B0052R7554J57324j30828a73461
13156A36357a612B49609q3473o514a85204C30518f2495C67120B5784c891C06964
13144b14844A63819a60803k3210L7508B61300J16618A59555c7491A95298E7425
13133C68405G0999J44700a30044A01166K4271m8255L07738n1520j23027a32379
13122A02909Q7245L7769l0618F3223a45850A89918m7133i955F7392P9368O2389
$$ plain form
13201 212114 45266 61037 145779 155324 98629 103732 68920 96822 -29719 -177054 260071
13189 53888 -25784 232898 315748 214816 126073 -272086 -81737 340224 88403 -72927 114093
13177 135172 339220 227060 87590 -80991 158426 -42910 -31420 -149634 52493 415389
13167 415389 71633 215246 -170090 -89058 154514 20052 117606 274930 144102 -173461
13156 136357 -1612 249609 166136 159622 -185204 330518 -62495 367120 25784 -3891 306964
13144 -214844 163819 -160803 -184013 -146505 261300 377918 159555 -37491 195298 57425
13133 368405 70999 215699 -130044 101166 125437 77182 384920 333400 210373 -132379
13122 102909 190154 227923 197305 63223 -145850 189918 142785 -9955 67392 146760 209149
13111B09149J1520J00380A60354N6263n4622a19312D8010k3419L18103A16237
13100a17667A76107f985F3963j0912a68j46094C92645r1656P5016h716A68497
13088G7028r803J50827A05625h5837A40926P251b18253C02354a43986B51733b35356
13076A35852R8244G8283b7911j8014m707G0740K33629a30388K9787A12586a87734
13064C3083b19172A94322e1292n1335c6253B59730i7344C57556H0883a92603A51495
13052B21290A1741K46901A24947b13715C89187A00540J62789k6195d9552A7230
13041E8204K25354o1953e4971A08075b9423k3956B03358D8851L15960f6741P968
13030e8773E2122J629q494A1435a8811A35195j7369P8159r1502K05788i0216p9990
$$ plain form
13111 209149 220669 321049 160354 216617 161995 -119312 48010 24591 342694 116237
13100 -117667 176107 -6985 63963 53051 -168 -146262 392645 300989 376005 -8716 168497
13088 77028 67225 218052 105625 -85837 140926 148177 -218253 302354 -143986 251733 -235356
13076 135852 234096 78283 -27911 -45925 -50632 70740 304369 -130388 -100601 112586 -187734
13064 33083 -219172 194322 -51292 -102627 -36253 259730 -97344 357556 80883 -192603 151495
13052 221290 11741 258642 124947 -213715 389187 100540 263329 237134 -49552 17230
13041 58204 283558 221605 -54971 108075 -29423 -53379 203358 48851 364811 -66741 -58773
13030 -58773 52122 53751 45257 11435 -18811 135195 117826 195985 104483 310271 -90216 -170206
13018a70206A14885J48876a08288B21063r9958D3491g589A04459M6656g4269k6161
13007a00430o1508A66849f6495E6365q453p598a2435j12906E12493k25497a58857
12995e2983B81150c279q8534C66617a0746A34723K25520F598a751B93645h0961
12983g2712A10022a87220A1197J48380A7010L54876H745J61528C937J42657J21066
12972B67660I2723i9399j1573d3289B40688b2901E02869E7594c35879J12761N8313
12961a64805B29837J9418h5345A0506b85693d9351m1606J3176c5679p9533A95088
12949a16281G8190c20256a42630C35430j27526c2432B03921c56382e0733D51902
12938A75009e2630m15775A27675a5374j22557B3286M9154a26984A10921p734K89126
$$ plain form
13018 -170206 114885 263761 -108288 221063 121105 43491 -7589 104459 151115 -74269 -100430
13007 -100430 -161938 166849 -66495 56365 47912 40314 -12435 -125341 512493 286996 -158857
12995 -52983 281150 -3279 -91813 366617 -10746 134723 360243 6598 -1751 293645 -80961
12983 -72712 110022 -187220 11197 159577 17010 371886 8745 170273 3937 146594 267660
12972 267660 92723 -99399 -110972 -43289 240688 -22901 502869 57594 -335879 -223118 -164805
12961 -164805 229837 249255 -85345 10506 -285693 -49351 -90957 -77781 -35679 -115212 195088
12949 -116281 78190 -320256 -142630 335430 207904 -32432 203921 -356382 -50733 451902
12938 175009 -52630 -468405 127675 -15374 -137931 23286 72440 -126984 110921 103187 392313
12927C92313c66461A47902c17922J27116d7124j48155K4470A92600l4923G8538
12916A13143D0789b48392A21129J24883j04625K2633B5343a71076P9920A12512
12905h0126c3783d068A38685f1019A51919N1650M2724e6677G7644Q8106p7197
12894H8553K38558C3072K6853N1700K29466a12246p1275B83466n0981M087b8357
12882a5072B4470J94942e3526n2464F6236E273J85838K81522A88515g3572B38507
12870g7746A32254a89103M6348A7631a30530j31698J10300P4129C2528a35762
12859A07918b50107P4951B57466F6164L62432B7431a5124E6208h5642m8355B63024
12847A53066K58941C9245N3690B6422K62819G9551b3379A49765K11125j34167
$$ plain form
12927 392313 -366461 147902 -317922 -190806 -47124 -195279 -170809 192600 157677 78538
12916 113143 40789 -248392 121129 246012 141387 164020 25343 -171076 -91156 112512
12905 -80126 -33783 -4068 138685 -61019 151919 203569 246293 -56677 77644 165750 88553
12894 88553 327111 33072 59925 111625 341091 -112246 -183521 283466 232485 236572 -28357
12882 -15072 24470 219412 -53526 -105990 66236 5273 191111 472633 188515 -73572 238507
12870 -77746 132254 -189103 -142755 17631 -130530 -262228 -151928 -77799 32528 -135762
12859 107918 -250107 -175156 257466 66164 428596 27431 -15124 56208 -85642 -133997 263024
12847 153066 412007 39245 92935 26422 289241 79551 -23379 149765 360890 226723
12837B26723h4969B8919a3850B61578b36234j96815I328K30050m4927c79662J8711
12826c60951b8971j03560A43030a90090A400i4572A72634b9525H3637c1498B55232
12814c08516C6109J2247P5051e7326F3874R3076a71230A28971a05489C98874A49409
12802a7956N748j0367C23067E9671i488A63293A4614J28737Q9234J2729E173f1916
12789a32639O2698I3462f6721q38h618A82842D7860K0657b52004f4405l7097A67267
12776C2834i7790G7872c4110G1800a53346F4153M0887f6901C9346b6505B49517
12764A2985O4419J77003A04811d7552j40030h4041k30614c7315I4460M8086c5977
12752d2605A0494d54642A11783B9711J3808K91579A24971b943m1492B82811E2559
$$ plain form
12837 226723 -84969 28919 -13850 261578 -236234 -433049 9328 239378 194451 -379662 -360951
12826 -360951 -28971 -132531 143030 -190090 1400 -94572 172634 -29525 83637 -31498 255232
12814 -308516 36109 48356 123407 -57326 63874 156950 -171230 128971 -105489 398874 149409
12802 -17956 -12208 -22575 323067 59671 -9488 163293 14614 143351 232585 245314 5173 -61916
12789 -132639 -69941 93462 -66721 -67559 -8618 182842 47860 68517 -252004 -64405 -101502 167267
12776 32834 -97790 77872 -34110 71800 -153346 64153 105040 -66901 39346 -26505 249517
12764 12985 77404 254407 104811 -47552 -187582 -84041 -314655 -37315 94460 142546 -35977
12752 -42605 10494 -454642 111783 29711 43519 335098 124971 -2943 -44435 282811 52559
12740h6328j64168a24209F4285e111m8907O699C13834K7655b33611d3529k8739
12729g2268k3413A58351Q0281f5989m6340A77413n3385P3941f4972k0597N973
12718g9596E7605R4571C3930J43118a46396b1000C4726J13839a01684C45443A33654
12706b29683O7863A28944D0102O8938k2840a10543B01674k2804E4958A1289O8159
12695G9448B0089N4034a12479A89370l2167a03587B06949d653C29884a33977A65334
12683I8184O7875q1273J21271O6162b18153e2794j34429B65762N8114J1555I3103
12671h5455C14694j28848l9704P893c65742I8990a95703k1851A94772F5312l383
12660F1929b40642A44906L13412k25079A08263L31049I4457J76943A10954J5377
$$ plain form
12740 -86328 -250496 -124209 64285 -5111 -54018 -47319 313834 341489 -233611 -43529 -72268
12729 -72268 -95681 158351 238632 -65989 -112329 177413 124028 197969 -64972 -85569 -79596
12718 -79596 57605 152176 33930 177048 -146396 -21000 34726 148565 -101684 345443 133654
12706 -229683 -161820 128944 40102 109040 86200 -110543 201674 178870 54958 11289 79448
12695 79448 20089 74123 -112479 189370 157203 -103587 206949 -4653 329884 -133977 165334
12683 98184 166059 84786 206057 272219 -218153 -52794 -187223 265762 323876 335431 93103
12671 -85455 314694 185846 146142 154035 -365742 98990 -195703 -217554 194772 65312 61929
12660 61929 -240642 144906 458318 233239 108263 439312 94457 271400 110954 126331
12650A26331a430E18827A80598L17439d6102D6573d7133a7580C27792q6834h3009
12638A02847f4887J7551p1448B22813I7545J42350E3200J61292J26690h9312D39913
12626C28031H6255P4326K06397D7304J32650b24651D17433A55400l0919L6069
12616A60550n0418B9865a30503K6534o0810K514M1038E15259a23856e984C16343
12604A28480M0638e3837B7065i9570B94987R8639A07030b83370I7550J9823M0738
12593A58111a22438G9649k9558J78402j8746J23296j49214a65483A36707c00910
12582a34186L9707M4551o634A1380i6389H6092f2937A94767J4884B1085b8131
12570a26949A76245J42596i1576m6677a7060H7803a78177D2682Q1614A6859K37715
$$ plain form
12650 126331 -1430 518827 180598 498037 -46102 46573 -47133 -17580 327792 240958 -83009
12638 102847 -64887 -47336 -118784 222813 97545 239895 53200 214492 341182 -89312 439913
12626 328031 86255 160581 366978 47304 179954 -224651 417433 155400 124481 160550
12616 160550 110132 29865 -130503 -103969 -164779 -162265 -121227 515259 -123856 -5984 316343
12604 128480 169118 -53837 27065 -99570 294987 393626 107030 -283370 97550 117373 158111
12593 158111 -122438 79649 50091 228493 209747 333043 183829 -165483 136707 -300910
12582 -134186 -94479 -49928 -56562 11380 -96389 86092 -62937 194767 209651 21085 -28131
12570 -126949 176245 318841 -91576 -138253 -17060 87803 -178177 42682 124296 16859 254574
12559B54574g062C1600a84231l5665A88455K0570a70271j40787j37438J73828
12549b74668J11008C66150c7880B51149a51432N6173A03538a14160A07309e4126
12538F7851b0763I4976a06415j53625j84107a73464a4692A4195J8399O7429C6555
12526A96083c3508k48176C25084r9170c9290E3758h0734B7384a05605d9445C0114
12514g4855j2706A85190b50979B81537F3317c4522C1305a57487J1803B02835e3041
12502H0702J66559K0470b01522Q2130B55594j14487J54475I7318l9568K40702
12492B98452F863a28255D2989I599a41354A42351a4203A46820J07056j9062i6001
12480a89445o2606B8194h4060A39395b23973b8912D61945a15687M3417j049q9776
$$ plain form
12559 254574 -7062 31600 -184231 -219896 188455 209025 -170271 -311058 -448496 -274668
12549 -274668 -163660 366150 -37880 251149 -151432 -95259 103538 -114160 107309 -54126
12538 67851 -20763 94976 -106415 -260040 -444147 -173464 -14692 14195 32594 100023 36555
12526 196083 -33508 -281684 325084 225914 -39290 53758 -80734 27384 -105605 -49445 30114
12514 -74855 -87561 185190 -250979 281537 63317 -34522 31305 -157487 -145684 202835 -53041
12502 80702 247261 267731 -201522 -119392 255594 141107 295582 97318 57750 298452
12492 298452 6863 -128255 42989 9599 -141354 142351 -14203 146820 253876 234814 -96001
12480 -189445 -252051 28194 -84060 139395 -223973 -28912 461945 -115687 -72270 -73319 -163095
12469a63095f9160B71577P0053b3163A37019L0605D0522a15920A5410J40456c5842
12457C2476d5196A02777N8279i8928c5396c524C45433b8194A8176a51240A4220
12445G495R2697m1610n354c9286B1848a05941B13775a78862G755L02008E7966
12433B20716g228p3089D2133d5083F256J20058M1323g1730a2037j00427B66041
12421d342l04799e1237B77475a18071F316a09565A88789J14087b87963b0965H7577
12409a54432A6058b77482l2201a331j54414E7274L3435k5255p97b44840E6698
12397A09561a78758P5096j50650a9602B88530c19896A44270n6492l0596R1422
12387A48604b78179A40274g2041A69834a77842a2611k60751Q2413D28910d3542
$$ plain form
12469 -163095 -69160 271577 341630 -23163 137019 167624 40522 -115920 15410 155866 -35842
12457 32476 -45196 102777 161056 -98928 -35396 -3524 345433 -28194 18176 -151240 14220
12445 7495 100192 58582 53228 -39286 21848 -105941 213775 -178862 7755 309763 57966
12433 220716 -7228 -80317 42133 -45083 6256 126314 167637 -71730 -12037 -112464 266041
12421 -4342 -309141 -51237 277475 -118071 6316 -109565 188789 302876 -287963 -20965 87577
12409 -154432 16058 -277482 -309683 -1331 -155745 57274 90709 65454 64657 -244840 56698
12397 109561 -178758 -103662 -254312 -19602 288530 -319896 144270 87778 57182 148604
12387 148604 -278179 140274 -72041 169834 -177842 -12611 -273362 -190949 428910 -43542
12376b89297C19153h8218D6502b40708B2557c4823B11213C7259J58951r2174l5536
12365F8500J61955d0124r4094I3400a5810k70349B93074c29101j35282a68084
12354a29515C81939B5817a77732j36697Q1236G4898J722d1308a1889A93988C4246
12342B53320g9576K0828k27741H7343J02370E5757L2910d13754C40107g6263k7789
12331a04052A6850J8378A2629J65567g6382I5065a12481A63478b80395B02240
12320A6932J11044Q461R0915G3456J94274J32533C4371b82184A92620K2065a05306
12308a11777j02950d0985b168C3453d01472i7652j12242N091b7783E3657J94591
12297B48248a08450A44405J1085b80002C79587j27289b4362B19352e6621G40274
$$ plain form
12376 -289297 319153 -88218 46502 -240708 22557 -34823 211213 37259 196210 104036 68500
12365 68500 230455 -40124 -134218 93400 -15810 -286159 293074 -329101 -464383 -168084
12354 -129515 381939 25817 -177732 -314429 -233193 74898 76620 -41308 -11889 193988 34246
12342 253320 -79576 -58748 -286489 87343 189713 55757 88667 -413754 340107 -76263 -104052
12331 -104052 16850 35228 12629 178196 -76382 95065 -112481 163478 -280395 202240
12320 16932 127976 136437 227352 73456 267730 400263 34371 -282184 192620 214685 -105306
12308 -111777 -214727 -40985 -2168 33453 -401472 -97652 -209894 -204803 -27783 53657 248248
12297 248248 -108450 144405 155490 -280002 379587 252298 -24362 219352 -56621 740274
12286B67133b21644F5855f0969A76586P7149H9086J3711J15207I016a82905B17621
12274A25885B8077K58061a80604C22153a15329I6622B4700b1875B19356b49746
12263C6679M03542A59521k3118P6321B5330a84325L6458j5328M3514b9926a4099
12251A49572Q8719a88241H9176K4891a8711B10231K36277a15049B43437J75807
12241D19244C8966A7598K58989r7504i0884B3107P0357G959m02a98014G7510J57968
12229B35478M8263c31471A47774a13038I7949j6266B8132a30040j27713d8179
12218C83982A09874l6291M7453l608O4451i572B36216j03700J4961e4851A26435
12206f16n7163D2346K26605J27123f9875D14993q5763R5762a8396o9502A88415
$$ plain form
12286 267133 -221644 65855 -60969 176586 253735 89086 102797 218004 9016 -182905 217621
12274 125885 28077 286138 -180604 322153 -115329 96622 24700 -21875 219356 -249746
12263 36679 440221 159521 136403 212724 25330 -184325 -147867 -163195 -119681 -29926 -14099
12251 149572 238291 -188241 89176 114067 -18711 210231 446508 -115049 243437 419244
12241 419244 38966 17598 276587 179083 -90884 23107 93464 7959 7557 -198014 77510 235478
12229 235478 283741 -331471 147774 -113038 97949 81683 28132 -130040 -257753 -48179
12218 383982 109874 73583 121036 117428 181879 -9572 236216 132516 147477 -54851 126435
12206 -616 -57779 42346 268951 396074 -69875 414993 329230 424992 -18396 -87898 188415
12194C2442J52652p2409a20573D38803A2781R0294E0962R1150o9638B9082K80230
12183C09312A21180B7226K24150p7136B659J3131J70129K2428J58301b39180J10221
12172a28959B72067A24687d4995K579B38275L0802P50a42708D4722g9295p8389
12161a57684I8171D8854Q412f3378A3391K74434j4656h953B14478a63380F3783
12149a84948D3907e0295A81360c2565j05667B349K9624J09515n017K2238B4107
12137a3763E4787N0574E413b20817j67560a31937E2002a10915A29045D629K09818
12126B14447M5163H8157a0477n1258k73961F3414h4397C98898H0642b19700i6942
12114h3024l234k94517A7833a3813j05861o9583b5247B03191l0715K3260a57545
$$ plain form
12194 32442 185094 112685 -120573 438803 12781 103075 50962 142112 72474 29082 309312
12183 309312 121180 27226 251376 174240 2659 15790 185919 208347 366648 -239180 -128959
12172 -128959 272067 124687 -44995 -42416 238275 269077 269827 -142708 44722 -79295 -157684
12161 -157684 98171 48854 57266 -63378 13391 287825 273169 -8953 214478 -163380 63783
12149 -184948 43907 -50295 181360 -32565 -138232 2349 31973 141488 136471 158709 24107
12137 -13763 54787 105361 5413 -220817 -388377 -131937 52002 -110915 129045 4629 214447
12126 214447 259610 88157 -10477 -61735 -335696 63414 -84397 398898 80642 -219700 -96942
12114 -83024 -86258 -380775 17833 -13813 -119674 -189257 -25247 203191 172476 195736 -157545
12102b65112A19646a33110o1386E9341a38159j16003A8269a70998E238a16168
12091A87339f9066A46659f9414C6965b30161B38110F8130a22884C00787A49994
12080A61574b02898B17267c3078k9660b6645o0461k53506a53293q2005B70526
12069A89062L98003J017021n67434l06989A75372b75917g1743j20905A1886f2384
12058A34742L3180C0059a35686N0576J6920B23865b92303K6932H3416L7674L0825
12047A51915o9189q45b53547E7263L7475b35224G4483J11849e5332A13795c5733
12035e0435A51880G3332K02155A31079f3851h132j96770A63573f9055J9201M084
12024d5770r8265A41172a73575A22865A1161c7373o9511b1479A44191f0399A34349
$$ plain form
12102 -265112 119646 -133110 -194496 59341 -138159 -254162 18269 -170998 5238 -116168
12091 187339 -69066 146659 -69414 36965 -230161 238110 68130 -122884 300787 149994
12080 161574 -202898 217267 -33078 -62738 -26645 -87106 -340612 -153293 -235298 270526
12069 189062 587065 1604086 1036652 729663 175372 -275917 -71743 -192648 11886 -62384
12058 134742 167922 30059 -135686 -85110 -68190 223865 -292303 -265371 83416 121090 151915
12047 151915 82726 81881 -253547 57263 94738 -235224 74483 186332 -55332 113795 -35733
12035 -50435 151880 73332 275487 131079 -63851 -8132 -204902 163573 -69055 -49854 -45770
12024 -45770 -144035 141172 -173575 122865 11161 -37373 -106884 -21479 144191 -60399 134349
12012I7904M9237c4597j99838A19751b51847J23186e4009j25290E9346a36556
12001g3149l5577A46182C625f8765D1783a16727r5823d536B21970C6670a35335
11989A86772J51707A0742K48889d152j59978j05935A46651D1021h8744K7821D28777
11977a82153L522A8516M7701J81496i5115k09447e1426D9364c5665C3369L23006
11966C56375k8949c0624B80597m1577e705D4836b84855f0374J5125A6924a80628
11954G610c97346a1278j14861A24631E0721b46550J16603a7163F5533K12550A17992
11942a22276C74593c30659f403k02222B54504f1847O709A41581i1991A66292a26010
11930f4983A83108L9626c42200o275N9911A72240l4547a56503I9149L4172A5972
$$ plain form
12012 97904 147141 -34597 -234435 119751 -251847 -128661 -54009 -179299 59346 -136556
12001 -73149 -108726 146182 3625 -68765 41783 -116727 -212550 -4536 221970 36670 -135335
11989 186772 338479 10742 259631 -4152 -164130 -270065 146651 41021 -88744 -60923 428777
11977 -182153 -178631 18516 66217 247713 -95115 -304562 -51426 49364 -35665 33369 356375
11966 356375 327426 -30624 280597 239020 -5705 44836 -284855 -60374 -45249 16924 -180628
11954 7610 -397346 -11278 -126139 124631 50721 -246550 -129947 -17163 65533 278083 117992
11942 -122276 374593 -330659 -6403 -208625 254504 -61847 -55138 141581 -91991 166292 -126010
11930 -64983 183108 222734 -342200 -348475 -288564 172240 137693 -156503 99149 133321 15972
11918A72359l2685g4753B14101H4140c1509B47503K6130c2138D2107c38140b295
11906A63454h2022A07586a32335B58233G8811a98665n7216E6240d4635A9501K04167
11895B23668B4259e58098B8532e268o5260j91431l7078C13328a9675p3054d3237
11883A0255b07391k5338P0213C21566C2551a0802l42051H8827C8630J4684b58141
11871D1710g2969A11640b33887g7534B28102b69470g4106L0810a2684K766j28223
11860a38141K4467I1914L33708A1527M717c24061B17450g50F64R6639M9645d7842
11847C6256J97842c68458B09885b30399J07664A90181b80098A74308l0585l0711
11837A13012J80424d1510C51121a64256A88993d48746A59323a27341j00027Q1555
$$ plain form
11918 172359 139674 -74753 214101 84140 -31509 247503 273633 -32138 42107 -338140 -2295
11906 163454 -82022 107586 -132335 258233 78811 -198665 -255881 56240 -44635 19501 223668
11895 223668 24259 -558098 28532 -5268 -70528 -261959 -299037 313328 -19675 -92729 -43237
11883 10255 -207391 -232729 -162516 321566 32551 -10802 -352853 88827 38630 53314 -258141
11871 41710 -72969 111640 -233887 -77534 228102 -269470 -74106 -43296 -12684 -9918 -138141
11860 -138141 -113674 91914 425622 11527 16244 -324061 217450 -750 664 97303 146948 -47842
11847 36256 234098 -368458 209885 -230399 -122735 190181 -280098 174308 143723 113012
11837 113012 293436 -41510 351121 -164256 188993 -448746 159323 -127341 -227368 -145813
11827a45813A28697J25063b08158A05982c8380n0461A06552c52230A18183g2055
11816I065J4446c55477E5788L7282c3904B71156C6879b04497C47569A61499b9172
11804i9929m4475j34203h8902D4888K29681a40885N676A12151h6741R786B57193
11792a87561k2118R9069a5559j43969H1674l889g6157B19286F260O0118J93133
11781B59511j05917e772k48085B27049j577H6871K54864a84471I5624A4934d7137
11769g514A71194i0183q1384A20258j0247h0347j07849h7779q4776d4396l2760
11758g7156n1387r6056a7192A74586f0962B37029H1690R7951a92110C41841b87664
11746i6509j6816B95416L5731r4904B9745a21783b737A01993a50748l3988C07194
$$ plain form
11827 -145813 128697 253760 -208158 105982 -38380 -88841 106552 -352230 118183 -72055
11816 9065 23511 -355477 55788 93070 -33904 271156 36879 -204497 347569 161499 -29172
11804 -99929 -144404 -278607 -88902 44888 274569 -140885 -135209 112151 -86741 -76955 257193
11792 -187561 -209679 -110610 -15559 -159528 81674 77785 -76157 219286 6260 66378 259511
11781 259511 153594 -5772 -253857 227049 225472 86871 341735 -184471 95624 14934 -47137
11769 -7514 171194 -90183 -171567 120258 110011 -80347 -188196 -87779 -172555 -44396 -77156
11758 -77156 -128543 -224599 -17192 174586 -60962 237029 81690 179641 -192110 341841 -287664
11746 -96509 -113325 295416 331147 236243 29745 -121783 -2737 101993 -150748 -184736 307194
11734A10388L46207C4508b90406h8080B86677n740b02785j44587c0839H9324a2917
11722a91962d1997o5835A82723C1111k961b14883B28543i8197K1299c7641k0026
11711e7667K437D9349a01600G8979i0327j42681g782j64685A1181a31939B45557
11699a38679c4825J4136B83644D0636b50417A88454e6430B13187l7738K1499a33967
11687A8167a41472L7507M2513j71684R2352A7689c50945A7312J37481c714G324
11675b46553E9334J42127Q8990a9664r7370q9422r0643a41310L203A57951J66588
11664C24539j61784a13215B391R336b9547a0340C34334A41832c7828l35590B95100
11652c20022m5156a22345j711J080m894n5935Q9870A41438J85195C8765j675b7423
$$ plain form
11734 110388 456595 34508 -290406 -88080 286677 280937 -202785 -347372 -30839 89324 -12917
11722 -191962 -41997 -107832 182723 31111 28150 -214883 228543 -98197 -76898 -37641 -57667
11711 -57667 -55230 49349 -101600 78979 -90327 -233008 -7782 -172467 11181 -131939 245557
11699 -138679 -34825 -20689 283644 40636 -250417 188454 -56430 213187 175449 196948 -133967
11687 18167 -141472 -103965 -61452 -233136 -140784 17689 -350945 17312 154793 -3714 7324
11675 -246553 59334 201461 290451 -19664 -117034 -206456 -297099 -141310 -138107 157951 324539
11664 324539 162755 -113215 2391 11727 -29547 -10340 334334 141832 -37828 -373418 295100
11652 -320022 -365178 -122345 -124056 -122976 -127870 -183805 -93935 141438 326633 38765 37090 -27423
11639h6992c775l4672O800k94278A11337M9674f9633A67332b7511r0392A74326
11627c04189J04458C01332p7203n2282M61823B36993B7458a29207M9863q602q131
11616i6077B42028q5882c86133B03717b15196C6251O5289b57415E1279b5721k81816
11605c07537A89644a29021d0166A84768F8141O3728R1210M6852g1718A34572b88780
11593A2450g7629C9195J05669K15059h6609l009G9011d4007A80417f4811b275
11581A31439g833j10191B41509g41I5354f6766I7506a42594c6827A56867c59649
11569h803B12575E2624e3227A48596j4463i1960A8899K39464e9668k5493a7096
11557b01425M031M078A93745L7515i6768a5708A04978J87277h0858l7364A47787
$$ plain form
11639 -86992 -3775 -38447 -31647 -325925 111337 161011 -69633 167332 -27511 -117903 174326
11627 -304189 -199731 301332 224129 171847 633670 236993 27458 -129207 -79344 -87946 -96077
11616 -96077 242028 156146 -386133 203717 -215196 36251 101540 -257415 51279 -25721 -307537
11605 -307537 189644 -129021 -40166 184768 68141 131869 223079 269931 -71718 134572 -288780
11593 12450 -77629 39195 144864 359923 -86609 -89618 79011 -44007 180417 -64811 -2275
11581 131439 -7833 -118024 241509 -741 95354 -66766 97506 -142594 -36827 156867 -359649
11569 -8803 212575 52624 -53227 148596 134133 -91960 18899 258363 -59668 -85161 -17096
11557 -201425 -197394 -193316 193745 231260 -96768 -15708 104978 292255 -80858 -118222 147787
11545G5521K48757i305A80678l0502a68849C04393i6796B32657b01752L5450D26953
11533B2872a42672G0163R1117k8943K91211i5379k9675A09533P2515O5770J10768
11522C58586C1823O8504c22608H0675b54891A90574d8354C48253a65421G714K9942
11511C7656c9716o1163B767M1470L12930L0672A17842n2110J02861i1804P877
11500h3927F8788K79074j22534O061N7287N0837j55527q4790l8425K96614A17276
11488B97427k5894j0267a22778A53162R9245L854c1485C48938j16421A298L60990
11477C62288A20879b09438A65989C3337R4094K1466J55142a38361A9385L19357
11467C38742A05729f342B64592O9927f6462A38870M1680c34866B50209a86566
$$ plain form
11545 75521 324278 -9305 180678 150176 -168849 304393 -96796 232657 -201752 -166302 426953
11533 22872 -142672 70163 161280 132337 423548 -95379 -125054 109533 182048 247818 358586
11522 358586 31823 100327 -322608 80675 -254891 190574 -48354 348253 -165421 7714 37656
11511 37656 -39716 -100879 2767 44237 357167 387839 117842 65732 168593 -91804 -83927
11500 -83927 68788 347862 225328 231389 288676 339513 183986 99196 60771 357385 117276
11488 297427 271533 261266 -122778 153162 252407 256261 -31485 348938 232517 1298 362288
11477 362288 120879 -209438 165989 33337 127431 148897 304039 -138361 19385 338742
11467 338742 105729 -6342 264592 334519 -66462 138870 180550 -334866 250209 -186566
11456b21798A80798J04878H1192h3666o2881I6007A8138N9748b34062A9032M60805
11445D79837j3192H8032K07571a60465m9226e2247A6283J75548b46083M7173m1191
11434b40101A77242F0389e8517j39965g2916F5541L14636i0109j16380c3315m6505
11423g9820c1704m76684a21630C5035R884K9988L9602i1539K4798k93927J27301
11412b33367E5395O7791O7506i2392j10741B4678j0480L77840c7714l5277k19736
11401b92727a5731j41465A53862G051e1936j07275A27190B9284b0524A99859a14315
11389A74244B466J71501H4923C252g577B40426q8813J47441I6263B8881b49601
11377A72256E8156J78442d67H7398M5213e31255A16063K47902a5733B24203l0254
$$ plain form
11456 -221798 180798 285676 81192 -83666 -146547 96007 18138 77886 -234062 19032 479837
11445 479837 466645 88032 295603 -160465 -209691 -52247 16283 191831 -246083 -198910 -240101
11434 -240101 177242 60389 -58517 -198482 -72916 65541 380177 -90109 -206489 -33315 -79820
11423 -79820 -31704 -508388 -121630 35035 44919 74907 114509 -91539 -66741 -360668 -233367
11412 -233367 55395 123186 190692 -92392 -203133 24678 14198 392038 -37714 -72991 -292727
11401 -292727 -15731 -157196 153862 7051 -51936 -159211 127190 29284 -20524 199859 -114315
11389 174244 2466 173967 84923 3252 -7577 240426 151613 299054 96263 28881 -249601
11377 172256 58156 236598 -467 87398 132611 -531255 116063 363965 -15733 224203 193949
11366A93949J60367i0222L0633A47371h6030I8597b68387J12108b94B12064c3430
11354a63092j67881C59887A24810d4238J9512B60568a3655B40897n6521j6567
11344A67809K9720F2751a94300D057L63363j53856r1256i8152d8685A0402b61527
11332G755K98690a51056P1381l04650a64138m8490e913q6403n7543E62049I51
11320B21808f9365B20339c73572i7165B21086M6326a27371A26609g2664c1378
11309A55177a83655B00596b51433B1238a07293E7799h457k16853L4995B05995
11298G4932k668K8320a64878C19494a05367H4740h6901A17032b2381A21010a01232
11286a1379j58596P5727C4130O2717a13925D06814a06220A35293f1272p6927M0411
$$ plain form
11366 193949 354316 -90222 -59589 147371 -86030 98597 -268387 -156279 -294 212064 -33430
11354 -163092 -330973 359887 124810 -44238 -24726 260568 -13655 240897 184376 167809
11344 167809 197529 62751 -194300 4057 367420 213564 122308 -98152 -48685 10402 -261527
11332 7755 306445 -151056 -79675 -384325 -164138 -212628 -5913 -92316 -149859 562049 951
11320 221808 -69365 220339 -373572 -97165 221086 267412 -127371 126609 -72664 -31378
11309 155177 -183655 200596 -251433 21238 -107293 57799 -8457 -225310 -190315 205995
11298 74932 72264 100584 -164878 319494 -105367 84740 -86901 117032 -22381 121010 -101232
11286 -11379 -169975 -94248 34130 96847 -113925 406814 -106220 135293 -61272 -138199 -97788
11275i7788K176D6992N6871r255a71020J3468b8440q9164m9131g0760A08745D0434
11262H2373d0802j75051j75824F890b43805B97895b57123a5961g307m38012a98633
11250H402b22315G6313P7069N3952j7747n6293a12491G1260d3212J641A01822
11238e0021D10948A02621J74437A20925c4614o8566L155j84359a5965I6705B9829
11226G4329a59637P7861A62824c1047B61293b6204I6239a42105J5201m687C22935
11214a37400H1222d8626A31326f1932j86836B9566e8704j46721R0317C62425C0255
11202e2578j62835A21826b19361c7123k37838a11736q1958A02084d49046a43570
11191B17216C016J06256K39705g633k27k61302C3944c75153N9409o5500h9100
$$ plain form
11275 -97788 -95612 46992 103863 94608 -171020 -157552 -28440 -117604 -166735 -70760 108745 40434
11262 82373 -40802 -215853 -391677 6890 -243805 297895 -257123 -15961 -7307 -445319 -198633
11250 8402 -222315 76313 153382 207334 189587 133294 -112491 71260 -43212 -41571 101822
11238 -50021 410948 102621 277058 120925 -34614 -103180 -100025 -284384 -15965 96705 29829
11226 74329 -159637 -81776 162824 -31047 261293 -26204 96239 -142105 -126904 -131591 322935
11214 -137400 81222 -48626 131326 -61932 -248768 29566 -58704 -205425 -115108 362425 30255
11202 -52578 -215413 121826 -219361 -37123 -274961 -111736 -193694 102084 -449046 -143570
11191 217216 3016 109272 348977 -7633 -7860 -269162 33944 -375153 -315744 -381244 -89100
11179A8794Q7361j3999f3125k2124A23536R2270a40578A44055L2704b41927R2906
11168a49021B36566F1745b6373A89986p5883g0613J5195J7824I7146d0459n2685
11157i3144k6962l1660a2964j7765B3611m674J1515J92134h3162l4783l3764G8797
11144a87860C91554e8319n6360d4109k9766b5839E5056M8067f1549j9484H5884
11132D0503a40609q3959Q5744q650I117K85998R8527A58618b5726o1326E8811
11120f8236j03834A06766F220Q1433L1968b1649q9042D1997A9146i5344M1342
11109e4002j2458A81636A2342b06644A22442m2937J11197a99779C385M2478b53153
11097c45032B78917a39624d6176A95412K01422O5426k13303a15311H8338K82496
$$ plain form
11179 18794 106155 92156 -63125 -85249 123536 215806 -140578 144055 176759 -241927 -149021
11168 -149021 236566 61745 -26373 189986 114103 -70613 -55418 -37594 97146 -40459 -93144
11157 -93144 -120106 -151766 -12964 -30729 23611 18937 30452 222586 -83162 -117945 -151709 78797
11144 -187860 391554 -58319 -114679 -44109 -73875 -25839 55056 103123 -61549 -81033 85884
11132 40503 -140609 -224568 -138824 -147474 9117 295115 393642 158618 -25726 -87052 58811
11120 -68236 -172070 106766 6220 87653 119621 -21649 -110691 41997 19146 -95344 -54002
11109 -54002 -66460 181636 12342 -206644 122442 79505 190702 -199779 3385 45863 -253153
11097 -345032 278917 -139624 -46176 195412 396834 462260 248957 -115311 88338 370834
11087C70834p0701A4475J11342N1446J78388b6563F13465G2028L30396P32b1790
11075h76B79259J0245M49734B95244J9530J127j00423K66L3277R8280J22431j24964
11063C44768q0388L33460j99594j13032A06921K72954L38601k28241n5102j10
11053D35023J921B12202J73371L20669j25945B45003M20552K25411q5610j04749
11043G00607B96316J74152m9592J10247L00564k76689J73276J82673l19520J46241
11033G37668l45362N3078M82784k40493A64381J88954K3182N21326j87211j83739
11023E26893K70835k18477N2451j45314J2108K47927j75083k801A64240L83675
11013E47915K29146n7023j48069j10121K17749N6538q5379C10599M92628l02140
$$ plain form
11087 370834 300133 14475 125817 177263 355651 -26563 613465 72028 402424 403156 -21790
11075 -876 279259 289504 739238 295244 314774 315901 215478 215744 249021 347301 469732 344768
11063 344768 264380 597840 398246 285214 106921 379875 718476 490235 435133 435023
11053 435023 436944 212202 385573 706242 580297 245003 665555 890966 805356 700607
11043 700607 296316 470468 420876 531123 831687 554998 728274 910947 591427 737668
11033 737668 392306 445384 928168 687675 164381 353335 376517 897843 710632 526893
11023 526893 797728 579251 631702 486388 498496 746423 571340 568539 164240 547915
11013 547915 777061 720038 571969 461848 679597 736135 650756 310599 803227 501087
11003E01087M02523C90354j31030K16621L5268J44144l8388q2185k5027J22610
10993F32367r4917O0691J184o2455K20716l61599j10264L85134j39525M10070
10983I41402k08055o6854L43480Q3095j77003L91474K28421J8956L64937K72612
10973B192465J66646j27644M91389k90670k22288M4255K47270o80171l0634j43137
10963A647481j60110j59880K43359j38276N2373m2758R4585j21565K17595l90015
10953A242789k79366l20555J07656p8605J9087k05896j34945O3141m848L46337
10943G54795C05157k2799h3319F3697J85979P9336a2505B33756p2356d0438F9857
10931B51383j01348a95935A72207e8475j72925h4457p7582B93540D4018c5290
$$ plain form
11003 501087 903610 390354 259324 475945 511213 655357 616969 534784 509757 632367
10993 632367 537450 598141 599325 536870 757586 395987 285723 670857 531332 941402
10983 941402 733347 666493 1009973 1093068 916065 1307539 1535960 1554916 1919853 2192465
10973 2192465 2359111 2231467 2722856 2432186 2209898 2254153 2501423 1821252 1790618 1647481
10963 1647481 1487371 1327491 1570850 1432574 1484947 1442189 1536774 1415209 1632804 1242789
10953 1242789 963423 642868 750524 671919 691006 485110 350165 413306 408458 754795
10943 754795 305157 282358 -83319 63697 249676 329012 -12505 233756 161400 -40438 69857
10931 251383 150035 -195935 172207 -58475 -231400 -84457 -162039 293540 44018 -35290
10920h7974p6542B74263a73114p179P307h2574B46716F4848L5799b88872J42622
10909a46250A89894a75498N6154b0033A03652l358D7130i7075L3529F5256c51037
10897C84157A82635n642b15396d4117A58483B4811c33129A46385f36A23956a39228
10885a84377e3879a8073A33792c23042d8102A00338a6251A13487c8284H8923H52
10873g917A22621i8262j32582j39645A2835O968f8721A13707M8368J16709J72636
10862D51420a94097g4291b5484c135n4597B18214B2994f3855j20468E8355J97790
10851B56145g2639m5888l1209N2777E6772h0487B52432I2863D1976J86116j4425
10840B13667i0691I2033b04868d2312C61877i8713A77370p6336H576J10901n8647
$$ plain form
10920 -87974 -164516 274263 -173114 -180293 -172986 -82574 246716 64848 100647 -288872 -146250
10909 -146250 189894 -175498 -119344 -20033 103652 100294 47130 -97075 -63546 65256 -351037
10897 384157 182635 176993 -215396 -44117 158483 24811 -333129 146385 -636 123956 -139228
10885 -184377 -53879 -18073 133792 -323042 -48102 100338 -16251 113487 -38284 88923 852
10873 -7917 122621 -98262 -230844 -370489 12835 19803 -68721 113707 162075 278784 451420
10862 451420 -194097 -74291 -25484 -3135 -57732 218214 22994 -63855 -184323 58355 256145
10851 256145 -72639 -118527 -149736 -96959 56772 -80487 252432 92863 41976 228092 213667
10840 213667 -90691 92033 -204868 -42312 361877 -98713 177370 101034 8576 119477 60830
10829F0830J651b28571A615i5174j33255G0664K27421a87458A32532j1486a45282
10817i0486b7751I6440f9762D4431d479C79373d84628e8383J6209j0033A58097
10805H4399k9130D563g5770L6971A48278o0013g921k01837H828R3544a74765D156
10792e316j12258j16728B0826J28821B3872Q1874a5128A33011a15957d032j53529
10781a57561o6766f8041j06679h2516c6893D478b26628a12580j08304c557A9481
10769C67207g7470l94293K22419Q9229K0638A61215F0316b37023B12081d54942
10758h5261E4577a45553A88302a9097A56265f6540j87655H3050c3541G3641K5527
10747I9168a66610j93955a15221G542e6468D9429K90835c45844i4833b6873j22398
$$ plain form
10829 60830 62481 -228571 1615 -95174 -228429 70664 298085 -187458 132532 121046 -145282
10817 -90486 -27751 96440 -69762 44431 -4479 379373 -484628 -58383 -42174 -52207 158097
10805 84399 55269 4563 -75770 -38799 148278 88265 -7921 -209758 8828 102372 -174765 4156
10792 -5316 -117574 -234302 20826 149647 23872 105746 -15128 133011 -115957 -4032 -157561
10781 -157561 -224327 -68041 -174720 -82516 -36893 4478 -226628 -112580 -220884 -3557 19481
10769 367207 -77470 -471763 -249344 -160115 -139477 161215 60316 -237023 212081 -454942
10758 -85261 54577 -145553 188302 -19097 156265 -66540 -254195 83050 -33541 73641 99168
10747 99168 -166610 -360565 -115221 7542 -56468 49429 340264 -345844 -94833 -26873 -149271
10736a49271k6037A92383d77788a23982F0169a1936B92435i0304L8962p6213j53375
10725b80930A56133F6948b92077f1289A29859j6808J40315b26900g5097l33617
10715d08714C07164a50834D9430c2111n5846G940a15351A99528c6771j75876M5014
10704a67633O8525H3757h1588A32731j8541a20574j78060P9268A82302C2723b8968
10692F9804J88252G0031b39421e3300j81250A0008C526b2230D7536K4228b19759
10680b9131j24189B67656D320c4237O172O030G5477G960a87602A42229A9111J00609
10668A19720R9564a73933j7860C50347F5014A0705L02721c50300N1779O2302f2023
10656H892K34857g7907k87075A57353O7463I3453a00516c4268R506j81508G1559
$$ plain form
10736 -149271 -175308 192383 -477788 -123982 60169 -11936 292435 -90304 -51342 -127555 -280930
10725 -280930 156133 66948 -292077 -61289 129859 113051 253366 -226900 -75097 -408714
10715 -408714 307164 -150834 49430 -32111 -87957 7940 -115351 199528 -36771 -212647 -167633
10704 -167633 -99108 83757 -81588 132731 114190 -120574 -298634 -219366 182302 32723 -28968
10692 69804 258056 70031 -239421 -53300 -234550 10008 3526 -22230 47536 71764 -219759
10680 -29131 -153320 267656 4320 -34237 -28065 -22035 75477 7960 -187602 142229 19111 119720
10668 119720 219284 -173933 -191793 350347 65014 10705 313426 -350300 -298521 -236219 -62023
10656 8892 243749 -77907 -364982 157353 224816 93453 -100516 -34268 -24762 -206270 71559
10644h2711k27292I8957a08106M6197j44640g0541a0147j33307n4635e9082A56257
10632b82885c0457F9528h7898A68623f3260l85245c9748F4496a4673j07415k25370
10621c47458J66940g4139o8231K0712F9436E904J4433J04219l8513e764a375k24765
10609b26140I2890R183a66096k31440A2904a81965C618b7083A07870h4570B78522
10597G4604a69308Q0246o5196A01991k1327C8423R9496D8828c78028B78890b09869
10585C96064b36310c740j9972m21069b21390d4178D7293b54796j0774B80849h9377
10573A95441F2992J9986a87785d4060K0819n3830A9504a40765B2619g32B05868
10561A34297a50165k0704r0232g6446k50678C3125M9633k3600f8469C70837b82620
$$ plain form
10644 -82711 -310003 98957 -108106 -61909 -206549 -70541 -10147 -143454 -198089 -59082 156257
10632 -282885 -30457 69528 -87898 168623 -63260 -448505 -39748 64496 -14673 -122088 -347458
10621 -347458 -180518 -74139 -142370 -121658 69436 5904 20337 124556 86043 -5764 -1375 -226140
10609 -226140 92890 102073 -166096 -397536 12904 -181965 3618 -27083 107870 -84570 278522
10597 74604 -169308 -89062 -154258 101991 80664 38423 137919 48828 -378028 278890 -209869
10585 396064 -236310 -3740 -23712 -444781 -221390 -44178 47293 -254796 -265570 280849 -89377
10573 195441 62992 82978 -187785 -44060 -23241 -77071 19504 -140765 22619 -732 205868
10561 134297 -150165 -170869 -261101 -76446 -327124 33125 82758 59158 -68469 370837 -282620
10549I1684e8799C41624a46486k88839B91369b43498A86484i7749A62323a28706
10538a12267B42834a63681b5434E5900f643D9411f5692B08667a2725m6481E3335
10526g8256r9206H8541h1751j95590d3079k02555Q846B15740c29002E3040a83289
10514g9663A25073D0413a5955B2945c02539a1195j86457j94283J35189E01046
10503b70241P9832O7672N4847j7668k165F0628J03057a94929L2346j81949a32575
10491b97778i4498B27490D5481b39292I1124b9341a2547B55242a19962a3393A30118
10479A72853J77234E8745N8768J43371K3384A0746e6590k02835g4748A96191d5753
10467H2274c8741A13426f2798C2482a11767e929k25783k37350B08364b96710B65284
$$ plain form
10549 91684 -58799 341624 -146486 -435325 291369 -243498 186484 -97749 162323 -128706
10538 -112267 242834 -163681 -25434 55900 -6643 49411 -65692 208667 -12725 -59206 53335
10526 -78256 -177462 88541 -81751 -277341 -43079 -245634 -236788 215740 -329002 53040 -183289
10514 -79663 125073 40413 -15955 22945 -302539 -11195 -197652 -391935 -256746 501046
10503 -270241 -190409 -122737 -67890 -85558 -87723 60628 163685 -194929 -162583 -344532 -132575
10491 -297778 -94498 227490 45481 -239292 91124 -29341 -12547 255242 -119962 -13393 130118
10479 172853 350087 58745 117513 260884 284268 10746 -56590 -259425 -74748 196191 -45753
10467 82274 -38741 113426 -62798 32482 -111767 -5929 -231712 -469062 208364 -296710 265284
10455a66511A4038o136a93917A48354n6353O3995C3574d8073e543j20270k44465
10444c70278h8249C2151a12770A04994c66229A8276P914K12031b85292D5595b10192
10432D13237m8471g9985j17663j15406B5210P7793M8804g7552k84266E9667a12408
10420B25923c3718H4494D0369L34543a34606B6684J76773a82223C26437d19718
10409A14444D8129Q1523J2520g3571l05199L9401a4452l25269J37651D11909a26786
10397A71618R8210R391A4419L3494K7237J55251i0490m9024D5440O1450N5430
10386A62320d2868n5138d2739j79883e652j0535I9422K9814a18006B05698I1858
10374b6943C27562a75462B84956J41832j39159J3410L46148l19428Q6694A19641
$$ plain form
10455 -166511 14038 7902 -193917 148354 92001 155996 33574 -48073 -5543 -125813 -370278
10444 -370278 -88249 32151 -112770 104994 -366229 18276 26190 238221 -285292 45595 -210192
10432 413237 364766 -79985 -197648 -313054 25210 103003 151807 -77552 -361818 59667 -112408
10420 225923 -33718 84494 40369 374912 -134606 26684 203457 -182223 326437 -419718
10409 114444 48129 129652 142172 -73571 -378770 -339369 -14452 -339721 -202070 411909 -126786
10397 171618 269828 279219 14419 47913 75150 230401 -90490 -139514 45440 106890 162320
10386 162320 -42868 -98006 -42739 -222622 -5652 -16187 99422 129236 -118006 205698 91858
10374 -26943 327562 -175462 284956 426788 287629 301039 647187 327759 414453 119641
10363C96504P1125p3104a4158A47292n4802J32217o0457m6945J7878l0162a42695
10351B22722K39966j66606N2494m2037o3750J18581O0368P150j68304j3381r940
10340B37263A95K57510K58972a14204A76855P6869H0329M8968C69K41134F3773
10328B8475a43127b1437A79080J6718O2262K340b3981A87667f2346A79316B8705
10316C05616N134f2341K9779k73769e4794G826J89211p6116g8403D4789R0806
10305A35595l9229a8986j60338M0275l6813C81403a3883B3198O8218L25083j90353
10294B26146m3029o5707i0798r0314A00135R2970b63596B04101g7023k13973E0190
10282b112k80950J01042B2941b60383d8969l73129i2097j91785H1358E826J30067
$$ plain form
10363 396504 467629 394525 -14158 147292 92490 224707 164250 117305 135183 105021 -142695
10351 222722 462688 296082 348576 306539 242789 361370 421738 428888 260584 247203 237263
10340 237263 195 257705 516677 -114204 176855 253724 80329 129297 369 241503 63773
10328 28475 -143127 -21437 179080 195798 258060 260400 -23981 187667 -62346 179316 28705
10316 305616 310750 -62341 -32562 -306331 -54794 7826 197037 120921 -78403 44789 135595
10305 135595 96366 -18986 -179324 -139049 -175862 381403 -13883 23198 91416 416499 226146
10294 226146 183117 117410 -90798 -181112 100135 193105 -263596 204101 -77023 -290996 50190
10282 -2112 -283062 -182020 22941 -260383 -48969 -422098 -92097 -283882 81358 5826 135893
10271A35893m1995M2305J85930a32335l9690C1420a59377N7358o1463q3813k2743
10260b70038E62927G8893J92575D4164K6501L40393g7656k55167a57930b8263
10249C2707A5787f416l1419I8042b28006h2149a2878k21034O550F1793a39826
10237b73717J00694C9301J32055i8675k26569B06976D5098J3231B096i8745A94942
10225a99946j73572A33660a24234A41048a44558j5418d0230C5735J20875P8127
10215B34737b69437f395j62348o4951e4815j03895A52819j2601i9480k39342f1028
10203a51130E3132a32325E0437d8875q4553H5584f1333A08027D6837J8867h7381
10191h185m5802B24566A01672f2648G1509e014A08448b8497m5626j96814A61490
$$ plain form
10271 135893 93898 136203 322133 -132335 -172025 31420 -159377 -102019 -163482 -247295 -270038
10260 -270038 562927 78893 271468 44164 70665 411058 -77656 -332823 -157930 -28263
10249 32707 15787 -6416 -37835 98042 -228006 -82149 -12878 -233912 -227362 61793 -139826
10237 -273717 -173023 39301 171356 -98675 -325244 206976 45098 58329 2096 -98745 194942
10225 -199946 -373518 133660 -124234 141048 -144558 -159976 -40230 35735 156610 234737
10215 234737 -269437 -6395 -168743 -233694 -54815 -158710 152819 140218 -99480 -338822 -61028
10203 -151130 53132 -132325 50437 -48875 -133428 85584 -61333 108027 46837 65704 -87381
10191 -8185 -53987 224566 101672 -62648 71509 -5014 108448 -28497 -74123 -270937 161490
10179a78913j93M9592A09399a41935b2639l25240G0306a98277M3364a2136m0312
10168e2448k63927A22761B9062i6882A56188a29650r368B20524a9706F7078a38175
10156h3267A46976a68657m924Q6714l930C52711a25297Q45m2006e8892j24568
10145a83460A25449d7594o1704A87601e75554K23825A46171b39246J06956E8572
10134d6012k3310G5067e7959m1445B44634B1737a08893P542C34573b72657A83615
10122A36576n8728J43275a47607B13772a90359g1428a2025j35194j58690Q178
10112b97731F4628j8387A6652c26885J49304J8426K6905p6295h1487A10407K55335
10101C65742b53627B21118o3736b20172a341j23158G5654L8624a81835A07326
$$ plain form
10179 -178913 -179106 -129514 109399 -141935 -22639 -347879 70306 -198277 -154913 -12136 -52448
10168 -52448 -316375 122761 29062 -96882 156188 -129650 -139018 220524 -19706 67078 -138175
10156 -83267 146976 -168657 -173581 -86867 -90797 352711 -125297 -124452 -166458 -58892 -183460
10145 -183460 125449 -47594 -109298 187601 -575554 -351729 146171 -239246 -132290 58572
10134 -46012 -69322 75067 -57959 -99404 244634 21737 -108893 -101351 334573 -272657 183615
10122 136576 77848 221123 -147607 213772 -190359 -71428 -12025 -147219 -305909 -297731
10112 -297731 64628 46241 16652 -326885 -177581 -159155 -132250 -208545 -81487 110407 365742
10101 365742 -253627 221118 157382 -220172 -1341 -124499 75654 114278 -181835 107326
10090A00470e3770A49183a47505e8320j05130A87224R436b69122A02089M0243
10080A42332a26366A00557a5710j51120D7890b77828J17134I9032J43837a37218
10069a89580C8282b24170H2038i048A51516b51992J13379A91950H8748a2315j94773
10058b07088A65817j2325a49609I9271b64235E1454K38080a15040k29617a31143
10047G0301a55665j34285J32851f704k99524O9618j29357F7606C2699l251J09828
10036A39276b53391J06164A48205b1063F9113J354d22882B10599b6587p3878B5138
10024b46039k1967D19586B6404P4307b6753G6652a46910l1701J07b026m3115H8088
10011b13925D7241J38814d59850A7705e56513e6051k92772B88872d60307a28206
$$ plain form
10090 100470 -53770 149183 -147505 -58320 -163450 187224 196660 -269122 102089 142332
10080 142332 -126366 100557 -15710 -166830 47890 -277828 -160694 99032 242869 -137218
10069 -189580 38282 -224170 82038 -9048 151516 -251992 -138613 191950 88748 -12315 -207088
10058 -207088 165817 153492 -149609 99271 -264235 51454 289534 -115040 -344657 -131143
10047 70301 -155665 -289950 -157099 -6704 -306228 -236610 -365967 67606 32699 29448 139276
10036 139276 -253391 -147227 148205 -21063 69113 70467 -422882 210599 -26587 -100465 25138
10024 -246039 -268006 419586 26404 100711 -26753 76652 -146910 -178611 -178504 -2026 -45141 88088
10011 -213925 47241 186055 -459850 17705 -556513 -56051 -348823 288872 -460307 -128206
10000A50860r364c41780a62911A00549a62463f6287j78062G3919a20440e2238
9989e335k48020c9645B7352g3933M444C15049C1759a58701q7221j44584A21443
9977B37727a85057O3680k7072K1000j36403F3849f4697j55117A44862o6603k1053
9966E7206e4886A48668c0436j30635A22424A7676J53271b07547h306B9449R253
9955C8702N768a19055g666k23741j36886a4639O656k86353a7100A01884a44361
9943a81951B99681e0951b1895j5407l18198a17009j68124E8008N7812n7012e6181
9931G7063B5287b728n3580j86396r6615J29846B38287b4418A00869J98065a99841
9919b21327R2244a6191j51229F0283a46385O7009b7943G4453a31722M3196k3088
$$ plain form
10000 150860 141496 -341780 -162911 100549 -162463 -66287 -244349 73919 -120440 -52238
9989 -5335 -253355 -39645 27352 -73933 -69489 315049 31759 -158701 -245922 -390506 121443
9977 237727 -185057 -121377 -148449 -127449 -263852 63849 -64697 -219814 144862 78259 57206
9966 57206 -54886 148668 -30436 -161071 122424 17676 170947 -207547 -8306 29449 38702
9955 38702 44470 -119055 -7666 -231407 -368293 -14639 -7983 -294336 -17100 101884 -144361
9943 -181951 299681 -50951 -21895 -37302 -355500 -117009 -285133 58008 115820 58808 -56181
9931 77063 25287 -2728 -56308 -242704 -339319 -209473 238287 -24418 100869 298934 -199841
9919 -221327 -129083 -16191 -167420 60283 -146385 -79376 -27943 74453 -131722 -88526 -111614
9908a11614A97150a21129k39164J63703F4102a00256M8293k06624R5919q5499
9898b48167L0433A04737i1706C12318A00116d40846i5255B11054B0853e4160G3959
9886b72426K9003A70132b30072M1051j94403e3717j90356m7022a22370I7648d2327
9874H7547f9789B18085I2626b3387D9891r178c09265D4946a32992A90389e15567
9862E3214J97687c02092a06265k64548A32455m8087j1051k2326a72516g4519l15924
9851c90443J00066A67028k5200F8573R7180n3338g9167j11129P8679j70243c6363
9839B4766i4250A49345f0410H2187b3056A99646b09859M9466A096N9004R5147
9828A55247f8226I2704J76456b53556h2540L8981m26502A33979a04179B6920a52768
$$ plain form
9908 -111614 197150 -121129 -360293 -196590 64102 -100256 -51963 -258587 -162668 -248167
9898 -248167 -217734 104737 -91706 312318 100116 -440846 -95255 211054 20853 -54160 73959
9886 -272426 -243423 170132 -230072 -189021 -383424 -53717 -244073 -291095 -122370 97648 -42327
9874 87547 -69789 218085 92626 -23387 49891 40713 -309265 44946 -132992 190389 -515567
9862 53214 250901 -302092 -106265 -370813 132455 84368 73317 50991 -172516 -74519 -390443
9851 -390443 -290377 167028 141828 68573 165753 112415 -79167 -190296 -111617 -281860 -36363
9839 24766 -94250 149345 -60410 82187 -23056 199646 -209859 -160393 1096 60100 155247
9828 155247 -68226 92704 269160 -253556 -82540 -43559 -470061 133979 -104179 26920 -152768
9816a49206D5965b53306A94398d2972C4416g0243j79987A3273L9428J09327E953
9804B96257m4938c0614o3213B89900d0334q1658M6237c1591A180a29005A82421
9792F5920J2512a85771k72398I7738b7451B37383r3206b04699A00228K22710a78
9780B23187B1644a61192L3138n5080N0366k5814d0633B80493c0962k51109G1677
9768A33688d24737A35458a19506E6659a29536A94845r0742b78044j61910b2081
9757c14141I6848O301m6725M7856g5691b9356k49443H5173b29641A27987b20092
9745c58879a42596A34382c4457C28621c31272J37032d4666C35325b14206d1139
9734h0821h625p4534b1425k76406F2922c53056A35205a62081o4187p0903N4865
$$ plain form
9816 -149206 45965 -253306 194398 -42972 34416 -70243 -250230 13273 52701 162028 5953
9804 296257 251319 -30614 -93827 289900 -40334 -121992 -75755 -31591 1180 -129005 182421
9792 65920 78432 -185771 -458169 97738 -27451 237383 144177 -204699 100228 322938 -178
9780 223187 21644 -161192 -128054 -183134 -132768 -158582 -40633 280493 -30962 -282071 71677
9768 133688 -424737 135458 -119506 56659 -129536 194845 104103 -278044 -439954 -22081
9757 -314141 96848 103149 56424 104280 -75691 -29356 -278799 85173 -229641 127987 -220092
9745 -358879 -142596 134382 -34457 328621 -331272 -194240 -44666 335325 -214206 -41139
9734 -80821 -8625 -83159 -21425 -297831 62922 -353056 135205 -162081 -226268 -297171 -242306
9723b42306f4187j34725O4544p675B7889a03293A5227a12302j28857i8305A23512
9711D5420J38224a00640k5005A65419a81141M6262A94520b72093A46088a04205
9700H7966j0701a10127m3995A47514B2076J16546b65861i7275B4283i4634j27130
9689b21764g8798I4177a0428j50999a0639k88728A21379b19413E7749b05842C5910
9677a11928m8526B1547a22646J3003F1140j1419a10661D0074A2681a86970n1112
9666b38082B32251d9140l5965q0290D7769N7571b33350A16847j2516D8625a32244
9654a30982F8709c8273o8790J5773r7513q2728O3222I8096J27370i9991K1682
9643g8309r7139j9422q8984j00167O5443B02589O1122h6378K7492j87902L8565
$$ plain form
9723 -242306 -64187 -198912 -134368 -142043 27889 -103293 15227 -112302 -241159 -98305 123512
9711 45420 183644 -100640 -125645 165419 -181141 -134879 194520 -272093 146088 -104205
9700 87966 77265 -110127 -154122 147514 22076 138622 -265861 -97275 24283 -94634 -221764
9689 -221764 -78798 94177 -10428 -161427 -10639 -299367 121379 -219413 57749 -205842 35910
9677 -111928 -160454 21547 -122646 -109643 61140 49721 -110661 40074 12681 -186970 -238082
9666 -238082 232251 -49140 -85105 -165395 47769 105340 -233350 116847 104331 48625 -132244
9654 -130982 68709 -38273 -107063 -91290 -188803 -271531 -208309 98096 225466 -99991 -78309
9643 -78309 -175448 -194870 -283854 -384021 -318578 202589 263711 -86378 -58886 -246788 -208223
9632b08223f6264j7947D6194J29142a04292G1214b56126R1168M8204k6831l87439
9621e31024c7083I3406J44159F5736h0022B32855F5284l2611f6049b2408h410
9609c88057J76625j0319A16875e2317l7308d1403k08667h7124j46705g6501j21045
9598a97546i0996q9238j0676l0525A03173m532g8185A36101D4282h048j30987
9587a39035B576c1837A75916b02913a0913A59085e2774D2924L3455J8356k158
9576I2577L2332a13597B5146D577h9423j91117A70957a01498B34478K4151c1450
9564b41213E5503f9395K4525j23301A04395J30669I2216j6380h9546m7811B54819
9552D3218a79820D6403b07863P0891E9832J48523a41102j70721a5120A78035b45167
$$ plain form
9632 -208223 -66264 -84211 46194 175336 -104292 71214 -256126 -164958 -116754 -143585 -531024
9621 -531024 -37083 93406 237565 65736 -80022 232855 65284 32673 -66049 -22408 -8410
9609 -388057 -211432 -221751 116875 -52317 -89625 -41403 -250070 -87124 -233829 -76501 -197546
9598 -197546 -90996 -180234 -190910 -221435 103173 98641 -78185 136101 44282 -8048 -139035
9587 -139035 2576 -31837 175916 -202913 -10913 159085 -52774 42924 76379 94735 92577
9576 92577 124909 -113597 25146 4577 -89423 -280540 170957 -101498 234478 258629 -31450
9564 -241213 55503 -69395 -44870 -168171 104395 235064 92216 75836 -89546 -137357 254819
9552 43218 -179820 46403 -207863 -136972 59832 208355 -141102 -311823 -15120 178035 -245167
9540b27168E2097a87701c1057A21697b81141J35081j1262C4320b50281j04706
9530c54987d9179k01477J24254F107J86544a13641A23627c00764a38734m4116
9520a82850j34576i4168j6491D403a83880f9083K2646l9367E21841b39490A07336
9508b99362B7903J32988O2780a2120n9587b1875q9762j88475B4430J22753d5371
9496A05414b2192m25813A40401b66225f1932m74319f0209q2307A53891A9301J36553
9485A55854a24046j82307A07201a17678F9572a33290D2053J07382L8660i5609
9474g9508c2247j61784G144O869a48952C98619b29835G1386a89953F6045i5290
9462c640p7480j89225f1755D9127d2755o5817A93754E1461a7273m08514A46416
$$ plain form
9540 -227168 52097 -187701 -31057 121697 -281141 -146060 -157322 34320 -250281 -354987
9530 -354987 -49179 -250656 -126402 6107 192651 -113641 123627 -300764 -138734 -182850
9520 -182850 -317426 -94168 -110659 4403 -183880 -69083 -46437 -85804 521841 -239490 107336
9508 -299362 27903 160891 223671 -12120 -71707 -21875 -111637 -300112 24430 147183 -45371
9496 105414 -22192 -448005 140401 -266225 -61932 -536251 -60209 -142516 153891 19301 155854
9485 155854 -124046 -306353 107201 -117678 69572 -133290 42053 149435 188095 -95609
9474 -79508 -32247 -194031 7144 14013 -148952 398619 -229835 71386 -189953 66045 -95290
9462 -3640 -81120 -270345 -61755 49127 -42755 -108572 193754 51461 -17273 -425787 146416
9450B5136J64992J56999j10696b31358A30733c21886b1028O497A42609d8908j71643
9439b20551A34785E8180b425F0831a91946K1363r311r1979e5352j15694B39782
9427b72655J14200A37591a0703A16228b56393J4805E8902b7695p6032A0968b32630
9415d68717I8468j24k1805a5759j31807j82257E3751B5062b6236l73975A94089
9403F7738c13872A91271q2748b34887a05338k27273a54927A54745a02559A4298
9392A57743a13388j56689j92247B57198a4168A04775c75166a30637m06165a97893
9381a21105j2595A41918b26856c9839A57065A5511i9597L3290I3428J0112a9148
9369e9491k22061g9256l90727a44022a9540B7168J79669A2677b62796l01732b79113
$$ plain form
9450 25136 190128 347127 236431 -231358 130733 -321886 -21028 -14531 142609 -48908 -220551
9439 -220551 134785 58180 -2425 60831 -191946 -170583 -179894 -271873 -55352 -171046 239782
9427 -272655 -158455 137591 -10703 116228 -256393 -241588 58902 -27695 -103727 10968 -232630
9415 -468717 98468 98344 76539 -15759 -147566 -329823 53751 25062 -26236 -400211 194089
9403 67738 -313872 191271 108523 -234887 -105338 -332611 -154927 154745 -102559 14298
9392 157743 -113388 -270077 -462324 257198 -14168 104775 -375166 -130637 -536802 -197893
9381 -121105 -133700 141918 -226856 -39839 157065 15511 -99597 -66307 93428 103540 -19148
9369 -59491 -281552 -79256 -469983 -144022 -19540 27168 206837 12677 -262796 -564528 -279113
9357b11908A10994b29403B20944J7287j8337a97782A35023b77221g1992A74989
9346b54124J21825N936A99677K7352a26840j536m0811F5984M1322a5442j15729
9335a31171j6272f373l39612N5045a21756p9904F3506k1714J61246m4858j2502
9324A45678f844A41471J66840e4559F9243d8988k69977b0771G5945b78027a9148
9312i2915H1438A19K00108b56808F9601a10002j41875f7827l92749J43179J18437
9301a98960A11754c22700Q7554j27626C1061g9487r806j81302F8511b6925A51080
9289I7321e8088B00186c71820K2488h3507j49243Q1588l94643A50761b41746A7284
9277b98948P8538O2325j2198E5983a53631D9976a33011j58810a09026m2515o0236
$$ plain form
9357 -211908 110994 -229403 220944 238231 219894 -197782 135023 -277221 -71992 174989
9346 -254124 -132299 -126363 199677 227029 -126840 -128376 -169187 65984 107306 -15442 -131171
9335 -131171 -147443 -6373 -345985 -290940 -121756 -201660 63506 41792 203038 158180 145678
9324 145678 -6844 141471 308311 -54559 69243 -48988 -318965 -20771 75945 -278027 -19148
9312 -92915 81438 119 200227 -256808 69601 -110002 -251877 -67827 -460576 -317397 -198960
9301 -198960 111754 -322700 -235146 -362772 31061 -79487 -89293 -270595 68511 -26925 151080
9289 97321 -58088 200186 -371820 -349332 -83507 -232750 -151162 -545805 150761 -241746 17284
9277 -298948 -220410 -158085 -170283 55983 -153631 49976 -133011 -291821 -109026 -151541 -211777
9266b11777P2001q3590j3531M8658A93979a19033b217F5149f795q2972A03110
9254b7023H7615b19344M596A64451f5826n0768A25538o1573M6276c07936a43175
9242g1679j51363k1224P9076A7394J90401c63566I3384K4959c40352f3217k88596
9231c51813C35009I9878Q2582B3054J28296b65577i0867D45659I0555c0863o7851
9220i8714q734d1930a4343o0445F7797b42532h6306A47613O712L463l9739B0729
9207a79464j19611F4712c2142A27685b45442f5579E7108e6179n5857j99479A66391
9195a71432B65408h395B90078b0640C67311F9051B1332a60605a9952k17795e0777
9183A38134a89188e1430A65846c51672a37381A49140m5239b50272A89641a67933
$$ plain form
9266 -211777 -139776 -223366 -236897 -188239 193979 -119033 -2217 65149 -6795 -89767 103110
9254 -27023 87615 -219344 -214748 164451 -65826 -116594 125538 63965 110241 -307936 -143175
9242 -71679 -223042 -244266 -165190 17394 207795 -363566 93384 118343 -340352 -63217 -351813
9231 -351813 335009 99878 182460 23054 151350 -265577 -90867 445659 90555 -30863 -98714
9220 -98714 -107448 -41930 -14343 -74788 67797 -242532 -86306 147613 154325 157788 118049 20729
9207 -179464 -299075 64712 -32142 127685 -245442 -65579 57108 -56179 -112036 -311515 166391
9195 -171432 265408 -8395 290078 -20640 367311 69051 21332 -160605 -19952 -237747 -50777
9183 138134 -189188 -51430 165846 -351672 -137381 149140 103901 -250272 189641 -167933
9172B76262f8788j00816L9156A14770E2827c9372b335I9290a83834e6827r0205
9161a47032N2835k29395j7883j6663j47987D2096Q5272J40496G7917b7945A83396
9149c21407J36210f7441r7856L1628A21012a49580F1391L4329R081J17737b78349
9137b9850j90944B65448c70848a64698f3980C6445a42265B08235d00226B99450
9126a13702I9296j4058b18711a8559j67131H7112f1246J21r8987g6866C87030
9114a49422B46379a81538e4103H136a29706A93148D4965M7455f1690j5744r7498
9103a74932r1922A78719e7276B9229Q8286P8097g8348k5034L1129k88484J13098
9092b47639A24444a39121j07450a1608q4300d807j14026b8510A10495b5349r4241
$$ plain form
9172 276262 -68788 -169604 -130448 114770 52827 -39372 -2335 99290 -183834 -56827 -147032
9161 -147032 -94197 -323592 -341475 -358138 -506125 42096 127368 267864 77917 -27945 183396
9149 -321407 -185197 -67441 -165297 -133669 121012 -149580 61391 95720 104801 222538 -278349
9137 -29850 -220794 265448 -370848 -164698 -63980 36445 -142265 208235 -400226 299450
9126 -113702 99296 85238 -218711 -18559 -185690 87112 -61246 -61125 -160112 -76866 387030
9114 -149422 246379 -181538 -54103 8136 -129706 193148 44965 92420 -61690 -77434 -174932
9103 -174932 -266854 178719 -57276 29229 117515 195612 -78348 -103382 -72253 -360737 -247639
9092 -247639 124444 -139121 -246571 -11608 -95908 -4807 -118833 -28510 110495 -25349 -119590
9081a19590k6911r7729f5924l22060R9117a03628n693C02635c02966A0892O438
9070A7330g2616h919A8749p871b27255j3198e1597C3796A1525c73241e9451B0338
9057a84213C7291O6579b55107N4095B4184d8523l8236h451p1731B48349c73248
9045A64630J6893C3954j0661b2127k74675J18766l4615r1449A91136q9845N2261
9034A53552f7909B127a90693Q0419A85866f9790A41996c40814A45985G78c97992
9022A4977a66335O3721j48472a118I643b83310f0651r9953k8879j4573R9955M1243
9010f2858B88225G0480M0576d856A0241e05952a89735f4039H518a7994j47235
8999a65229F8352J17597m5750N37352C5607a65412e1449k33932B11156e1202C456
$$ plain form
9081 -119590 -146501 -244230 -65924 -387984 -288867 -103628 -109321 302635 -302966 10892 17330
9070 17330 -72616 -8919 18749 10878 -227255 -240453 -51597 33796 11525 -373241 -59451 20338
9057 -184213 37291 103870 -255107 -201012 24184 -48523 -86759 -8451 -80182 248349 -373248
9045 164630 181523 33954 23293 -22127 -296802 -178036 -212651 -304100 191136 101291 153552
9034 153552 -67909 2127 -190693 -110274 185866 -69790 141996 -340814 145985 778 -397992
9022 14977 -166335 -102614 -251086 -1118 9643 -283310 -60651 -160604 -189483 -204056 -104101 -62858
9010 -62858 288225 70480 111056 -4856 10241 -505952 -189735 -64039 8518 -17994 -165229
8999 -165229 68352 185949 140199 677551 35607 -165412 -51449 -285381 211156 -51202 3456
8987h270A01957C4819J6266J66301n8267J44677H1941a90295A8451b42671q917
8976b51588A6354i8873j83082c7629C7587d5237A38543K0799d63206a2876E11418
8964a23860r9414O5421C7213d33076i3588K2786Q27p5185d7496k27049i6381k0468
8952a16849a5845B38926B0508L0577a302m3321q3035l447K258d5899l89500b5508
8939c05847K054J09939h2322j60398C3061L87379a39967k10306J72668P2287c6832
8927a999l43165E80924I1441N33450J707183N703527J1428801F234062B001432
8917E54936B41973J97797p0645k0151k2801c47482D16199A37051K15379R5986
8907D48416A24393a72008a2055l9076j15988o3807J6292A97253a41549A95984
$$ plain form
8987 -8270 101957 34819 51085 217386 159119 303796 81941 -190295 18451 -242671 -251588
8976 -251588 16354 -98873 -281955 -37629 37587 -45237 138543 159342 -463206 -12876 511418
8964 -123860 -223274 -157853 37213 -433076 -93588 -70802 -69975 -145160 -47496 -274545 -96381 -116849
8952 -116849 -15845 238926 20508 51085 -1302 -44623 -127658 -131105 -128847 -45899 -435399 -25508
8939 -305847 -303793 -193854 -82322 -242720 33061 420440 -139967 -350273 -177605 -105318 -36832
8927 -1999 -345164 580924 91441 624891 2332074 8035601 19464402 6234062 2001432
8917 554936 241973 439770 369125 348974 326173 -347482 416199 137051 352430 448416
8907 448416 124393 -172008 -12055 -51131 -167119 -230926 -214634 197253 -141549 195984
8896i4640A86640h8904D9735f860m4270l29814G3803N1465Q4752b01270L4421
8885a66849B43032D2937c73120J62324A93371a22005d0433E580f5816j72357c89
8873b02547J00814l7958A23817O323a01688k1761A48950C0034M2340f1374F0139
8861a02507k4341B98279r146B5668b55194c7795l6850j30704j48376A88804A0343
8849b46657O8812I0095A9591G670J31186h530A46279b98600O1268J17048K2740
$$ plain form
8896 -94640 186640 -88904 49735 -6860 -51130 -380944 73803 125268 210020 -201270 -166849
8885 -166849 243032 42937 -373120 -210796 193371 -122005 -40433 5580 -65816 -238173 -389
8873 -202547 -101733 -139691 123817 130140 -101688 -123449 148950 30034 72374 -61374 60139
8861 -102507 -126848 298279 289133 25668 -255194 -37795 -74645 -205349 -353725 188804 10343
8849 -246657 -177845 90095 19591 7670 138856 -8530 146279 -298600 -237332 -120284 -97544
$$ [...]
##END NTUPLES=NMR SPECTRUM
##END=
