
##TITLE=UV1269_M12_1292-1216_90_7414817_RMNKnYd3Fd
##JCAMPDX= 6.0         $$ Bruker NMR JCAMP-DX V2.0
##DATA TYPE= NMR SPECTRUM
##DATA CLASS= NTUPLES
##ORIGIN= BRUKER
##OWNER= Administrator
$$ 1.72 TOPSPIN		Version 2.1
$$ 2013-01-25 17:55:47.370 -0500  Administrator@X
$$ Compression mode = diff/dup
##.OBSERVE FREQUENCY= 400.02188249412
##.OBSERVE NUCLEUS= ^1H
##.ACQUISITION MODE= SIMULTANEOUS (DQD)
##.ACQUISITION SCHEME= undefined
##.AVERAGES= 64
##.DIGITISER RES= 22
##SPECTROMETER/DATA SYSTEM= spect
##.PULSE SEQUENCE= noesygpps1d.comp
##.SOLVENT NAME= COFFEE_meoh
##.SHIFT REFERENCE= INTERNAL, COFFEE_meoh, 1, 14.96127
##AUDIT TRAIL= $$ (NUMBER, WHEN, WHO, WHERE, PROCESS, VERSION, WHAT)
$$ ##TITLE= Audit trail, TOPSPIN		Version 2.1
$$ ##JCAMPDX= 5.01
$$ ##ORIGIN= Bruker BioSpin GmbH
$$ ##OWNER= Administrator
$$ $$ E:\/data/COFFEE/nmr/UV1269_M12_1292-1216_90_7414817_RMNKnYd3Fd/12/pdata/1/auditp.txt
$$ ##AUDIT TRAIL=  $$ (NUMBER, WHEN, WHO, WHERE, PROCESS, VERSION, WHAT)
(   1,<2013-01-25 17:55:41.620 -0500>,<Administrator>,<X>,<go>,<TOPSPIN 2.1>,
      <created by zg
	started at 2013-01-25 17:44:12.199 -0500,
	POWCHK enabled, PULCHK disabled,
       configuration hash MD5:
       86 BA 57 50 F2 9D 5C 9B 26 00 A9 28 5F 66 2E 89
       data hash MD5: 64K
       B4 01 46 6F BE 47 15 8C A9 71 BF A0 6A 44 30 F6>)
(   2,<2013-01-25 17:55:44.652 -0500>,<Administrator>,<X>,<proc1d>,<TOPSPIN 2.1>,
      <Start of raw data processing
       efp LB = 0.3 FT_mod = 6 PKNL = 1 PHC0 = 0 PHC1 = 0 SI = 128K 
       data hash MD5: 128K
       2F EF FE 89 DF A1 8C 90 AD 1C CF 58 16 F5 F0 A7>)
(   3,<2013-01-25 17:55:45.699 -0500>,<Administrator>,<X>,<proc1d>,<TOPSPIN 2.1>,
      <pk PHC0 = -79.94202 PHC1 = 0 
       data hash MD5: 128K
       69 DD 9E F0 9B EE 67 73 B3 D1 17 4D F0 D0 C7 73>)
(   4,<2013-01-25 17:55:46.355 -0500>,<Administrator>,<X>,<proc1d>,<TOPSPIN 2.1>,
      <abs ABSG = 1 
       data hash MD5: 128K
       78 DD F7 0F 55 45 7C 12 93 7B 84 F2 29 AD 14 6A>)
(   5,<2013-01-25 17:55:46.511 -0500>,<Administrator>,<X>,<proc1d>,<TOPSPIN 2.1>,
      <abs ABSG = 2 
       data hash MD5: 128K
       6D F1 A7 9F E9 09 BF 41 77 51 79 AF D0 9C F6 85>)
(   6,<2013-01-25 17:55:46.699 -0500>,<Administrator>,<X>,<proc1d>,<TOPSPIN 2.1>,
      <abs ABSG = 3 
       data hash MD5: 128K
       95 65 E2 8A 95 33 8B 0C 5F F1 B3 2F 0B 4E CF 41>)
(   7,<2013-01-25 17:55:46.886 -0500>,<Administrator>,<X>,<proc1d>,<TOPSPIN 2.1>,
      <abs ABSG = 4 
       data hash MD5: 128K
       85 50 AE 61 FD 80 99 55 8E 3D 7B 78 11 3E A1 FE>)
(   8,<2013-01-25 17:55:47.089 -0500>,<Administrator>,<X>,<proc1d>,<TOPSPIN 2.1>,
      <abs ABSG = 5 
       data hash MD5: 128K
       9E E8 42 14 A8 A5 50 CF BB E4 2C DF CC BA 24 B8>)
$$ ##END=
$$ 
$$ $$ hash MD5
$$ $$ 27 61 88 40 82 50 F5 9B 52 F4 A4 C1 BB 0B 9B 96
##$RELAX= 
##$RELAX= 
##$RELAX= 
##$RELAX= 
##$RELAX= 
##$RELAX= 
##$RELAX= 
##$RELAX= 
$$ Bruker specific parameters
$$ --------------------------
##$DU= <E:\>
##$EXPNO= 12
$$ [...]
##$TP07= 0
##$TPNAME0= <>
##$TPNAME1= <>
##$TPNAME2= <>
##$TPNAME3= <>
##$TPNAME4= <>
##$TPNAME5= <>
##$TPNAME6= <>
##$TPNAME7= <>
##$TPOAL= (0..7)
0.5 0.5 0.5 0.5 0.5 0.5 0.5 0.5
##$TPOFFS= (0..7)
0 0 0 0 0 0 0 0
##$TUNHIN= 0
##$TUNHOUT= 0
##$TUNXOUT= 0
##$USERA1= <user>
##$USERA2= <user>
##$USERA3= <user>
##$USERA4= <user>
##$USERA5= <user>
##$V9= 5
##$VALIST= <valist>
##$VCLIST= <CCCCCCCCCCCCCCC>
##$VD= 0
##$VDLIST= <DDDDDDDDDDDDDDD>
##$VPLIST= <PPPPPPPPPPPPPPP>
##$VTLIST= <TTTTTTTTTTTTTTT>
##$WBST= 2048
##$WBSW= 25
##$XGAIN= (0..3)
0 0 0 0
##$XL= 0
##$YL= 0
##$YMAX_a= 5937695
##$YMIN_a= -11213837
##$ZGOPTNS= <>
##$ZL1= 120
##$ZL2= 120
##$ZL3= 120
##$ZL4= 120
##$ABSF1= 14.96127
##$ABSF2= -5.596911
##$ABSG= 5
##$ABSL= 3
##$ALPHA= 0
##$AQORDER= 0
##$ASSFAC= 0
##$ASSFACI= 0
##$ASSFACX= 0
##$ASSWID= 0
##$AUNMP= <proc_prof1d_extract.lims>
##$AXLEFT= 0
##$AXNAME= <>
##$AXNUC= <1H>
##$AXRIGHT= 0
##$AXTYPE= 0
##$AXUNIT= <>
##$AZFE= 0.1
##$AZFW= 0.1
##$BCFW= 0
##$BC_mod= 0
##$BYTORDP= 0
##$COROFFS= 0
##$CY= 15
##$DATMOD= 1
##$DC= 0
##$DFILT= <>
##$DTYPP= 0
##$F1P= 0
##$F2P= 0
##$FCOR= 0.5
##$FTSIZE= 131072
##$FT_mod= 6
##$GAMMA= 0
##$GB= 0
##$INTBC= 1
##$INTSCL= 1
##$ISEN= 128
##$LB= 0.3
##$LEV0= 0
##$LPBIN= 0
##$MAXI= 10000
##$MC2= 0
##$MEAN= 0
##$ME_mod= 0
##$MI= 0
##$NCOEF= 0
##$NC_proc= -2
##$NLEV= 6
##$NOISF1= 0
##$NOISF2= 0
##$NSP= 0
##$NTH_PI= 0
##$NZP= 0
##$OFFSET= 14.96127
##$PC= 1
##$PHC0= -79.94202
##$PHC1= 0
##$PH_mod= 1
##$PKNL= yes
##$PPARMOD= 0
##$PPDIAG= 0
##$PPIPTYP= 0
##$PPMPNUM= 2147483647
##$PPRESOL= 1
##$PSCAL= 4
##$PSIGN= 0
##$PYNMP= <proc.py>
##$REVERSE= no
##$SF= 400.020009527916
##$SI= 131072
##$SIGF1= 0
##$SIGF2= 0
##$SINO= 400
##$SIOLD= 131072
##$SPECTYP= <>
##$SREGLST= <1H.CDCl3>
##$SSB= 0
##$STSI= 131072
##$STSR= 0
##$SW_p= 8223.68421052631
##$SYMM= 0
##$S_DEV= 0
##$TDeff= 65536
##$TDoff= 0
##$TI= <>
##$TILT= no
##$TM1= 0
##$TM2= 0
##$TOPLEV= 0
##$USERP1= <user>
##$USERP2= <user>
##$USERP3= <user>
##$USERP4= <user>
##$USERP5= <user>
##$WDW= 1
##$XDIM= 131072
##$YMAX_p= 410582018
##$YMIN_p= -31848
##$CURPLOT= <Network HP LaserJet P1505>
##$CURPRIN= <$Network HP LaserJet P1505>
##$DFORMAT= <normdp>
##$LAYOUT= <+/1D_H.xwp>
##$LFORMAT= <normlp>
##$PFORMAT= <normpl>
##$SURQMSG= 1
$$ End of Bruker specific parameters
$$ ---------------------------------
##NTUPLES= NMR SPECTRUM
##VAR_NAME=  FREQUENCY,     SPECTRUM/REAL,   SPECTRUM/IMAG
##SYMBOL=    X,             R,               I
##VAR_TYPE=  INDEPENDENT,   DEPENDENT,       DEPENDENT
##VAR_FORM=  AFFN,          ASDF,            ASDF
##VAR_DIM=   131072,        131072,          131072
##UNITS=     HZ,            ARBITRARY UNITS, ARBITRARY UNITS
##FACTOR=    0.0627417313425164, 1,          1
##FIRST=     8223.62146879497, 703,          -52669
##LAST=      0,             2452,            -52714
##MIN=       0,             -31848,          0
##MAX=       8223.62146879497, 410582018,    0
$$ Real data points
##PAGE= N=1
##DATA TABLE= (X++(R..R)), XYDATA
$$ [...]
63972B87682O086O328N895N088M322M096M739N983P079P665Q205R206J0352J0984
$$ 287682 293768 300096 305991 311079 315401 319497 324236 330219 337298 344963 353168 362374 372726 383710
63958C83710J1193J1761J3032J4471J5537J6398J7565J9285K1607K4638K8409
$$ 383710 394903 406664 419696 434167 449704 466102 483667 502952 524559 549197 577606
63947E77606L2760L7627M3216M9765N7450O6662P7931R1209J05584J19991J33904
$$ 577606 610366 647993 691209 740974 798424 865086 943017 1034226 1139810 1259801 1393705
63936A393705J47054J58983J69433J78781J87402J94710J99424K00627J97915
$$ 1393705 1540759 1699742 1869175 2047956 2235358 2430068 2629492 2830119 3028034
63927C028034J90588J77616J58742J35131J08599Q0534N1697K2470p111l7156
$$ 3028034 3218622 3396238 3554980 3690111 3798710 3879244 3930941 3953411 3946300 3909144
63917C909144o7330r6579j23621j47495j67381j82420j92186j97143j98176j95793
$$ 3909144 3841814 3745235 3621614 3474119 3306738 3124318 2932132 2734989 2536813 2341020
63907B341020j90250j82194j72588j61795j49351j34984j19599j04876r1914q0537
$$ 2341020 2150770 1968576 1795988 1634193 1484842 1349858 1230259 1125383 1033469 952932
63897I52932o9949n9831n0591m2698l6141l0722k6550k3791k2081k0630j9072
$$ 952932 882983 823152 772561 729863 693722 663000 636450 612659 590578 569948 550876
63886E50876j7735j6870j6083j4904j3562j2670j2283j1800j0762r290p674n957
$$ 550876 533141 516271 500188 485284 471722 459052 446769 434969 424207 414917 407243 401286
63874D01286m139k484j362q27m47M34K139M212N719O206O323P209R308J2086J4671
$$ 401286 397147 394663 393301 392474 392027 392461 394600 398812 404531 410737 417060 424269 433577 445663 460334
63859D60334J6536J7584J8138J8860K0232K1960K3225K3680K3779K3941K3824
$$ 460334 476870 494454 512592 531452 551684 573644 596869 620549 644328 668269 692093
63848F92093K2763K0662J8111J5723J3592J1325Q478N043J528j649m765q382j2311
$$ 692093 714856 735518 753629 769352 782944 794269 802747 807790 809318 807669 802904 794522 782211
63835G82211j5512j7312j8212j9148k0399k1721k3076k4605k6040k6798k6689
$$ 782211 766699 749387 731175 712027 691628 669907 646831 622226 596186 569388 542699
63824E42699k6032k5169k4231k3305k2341k0975j8934j6549j4443j2732j1147
$$ 542699 516667 491498 467267 443962 421621 400646 381712 365163 350720 337988 326841
63813C26841r852r413r775r979r338q261p521p135o547n564m537l740l115k580
$$ 326841 316989 307576 297801 287822 278484 270223 262702 255567 249020 243456 238919 235179 232064 229484
63799B29484k210k077k159k322k287j752q29j97m40j312k049k327k471k702k668
$$ 229484 227274 225197 223038 220716 218429 216677 215848 215651 215211 213899 211850 209523 207052 204350 201682
63784B01682j997j034n79r55j602j714j145m94l85p64j064r24n34k75k49l09l46
$$ 201682 199685 198651 198072 197117 195515 193801 192656 192162 191777 191013 189949 189025 188491 188216 187967 187658 187312
63767A87312m07n61p85q91o03J34Q55R28K88l97n41l09k58n65r28j033p53n5Q80
$$ 187312 186905 186344 185559 184668 184065 184199 185054 185982 186270 185873 185332 185023 184765 184200 183272 182239 181486 181431 182311
63748A82311J529J437O92j93p91q47k01R28J805J946J812K092K426J809L45m80
$$ 182311 183840 185277 185969 185776 184985 184138 183937 184865 186670 188616 190428 192520 194946 196755 197100 196620
63732A96620K61J640K158J660J115J099J465K121L145M107M255L563K889K813
$$ 196620 196881 198521 200679 202339 203454 204553 206018 208139 211284 215391 219646 223209 226098 228911
63718B28911K950K728K305K314K885L399L147K026O79m4J26N79M52n01j819k998
$$ 228911 231861 234589 236894 239208 242093 245492 248639 250665 251344 251300 251426 252005 252457 251956 250137 247139
63702B47139l879m397m320l493k172r19j95lJ28P42J839K848L331L522L862M289
$$ 247139 243260 238863 234543 231050 228878 227959 227764 227761 227889 228631 230470 233318 236649 240171 244033 248322
63686B48322M448M348M212L789K586Q81k87l68L7P3m27j229k183k865k447o73
$$ 248322 252770 257118 261330 265119 267705 268586 268299 267931 267968 268041 267614 266385 264202 261337 258890 258217
63670B58217J366K238J796J149J194J825K520K923K762J886O45k60n60p29j327
$$ 258217 259583 261821 263617 264766 265960 267785 270305 273228 275990 277876 278521 278261 277701 276972 275645
63655B75645k328l258l679l433k743k226k441l232l765l392k251r08K15Q94R77
$$ 275645 273317 270059 266380 262947 260204 257978 255537 252305 248540 245148 242897 241989 242204 243098 244075
63640B44075O28M02O74J152J313J156J127J361J536J487J513J877K401K952L901
$$ 244075 244703 245105 245779 246931 248244 249400 250527 251888 253424 254911 256424 258301 260702 263654 267555
63625B67555N615P624Q868Q861Q199P760P810Q203Q986J0363J2176J3962J5506
$$ 267555 273170 280794 289662 298523 306722 314482 322292 330495 339481 349844 362020 375982 391488
63612C91488J6913J8188J9174K0041K1328K3289K5561K7741K9783L1462L1848
$$ 391488 408401 426589 445763 465804 487132 510421 535982 563723 593506 624968 656816
63601F56816K9981K6054K1368J6956J2664P801K448k237n069o003o106o349o757
$$ 656816 686797 712851 734219 751175 763839 771640 774088 771851 766782 760779 754673 748324 741567
63588G41567o925p150q434j1235j4766j7871k0173k1935k3158k3437k2647k1210
$$ 741567 734642 727492 719058 707823 693057 675186 655013 633078 609920 586483 563836 542626
63576E42626j9588j7902j6067j4032j1825r604p605n840l951j689O56K600M069
$$ 542626 523038 505136 489069 475037 463212 453608 446003 440163 436212 434523 435179 437779 441848
63563D41848N253N976N884N245M950N527O602P587Q433R392J0383J1021J1235
$$ 441848 447101 453077 458961 464206 469156 474683 481285 488872 497305 506697 517080 528101 539336
63550E39336J1652J3226J6433K0711K4878K8344L1646L5415L8970M0444L8264
$$ 539336 550988 564214 580647 601358 626236 654580 686226 721641 760611 801055 839319
63539H39319L2143K2934J2305K507m573q623j0755j1809j1548r722p161n123m212
$$ 839319 871462 894396 906701 909208 904635 896012 885257 873448 861900 852178 845017 839894 835682
63526H35682m539o403r980j4607j9204k3288k6911k9795l1315l1386l0624k9539
$$ 835682 831143 824740 814760 800153 780949 757661 730750 700955 669640 638254 607630 578091
63514E78091k8091k6213k4175k2213k0230j8097j5966j4068j2496j1311j0510
$$ 578091 550000 523787 499612 477399 457169 439072 423106 409038 396542 385231 374721
63503C74721r760q551o871n365m572m224l704l027k852l423l966l557k382j600
$$ 374721 364961 356410 349539 344174 339602 335378 331674 328647 325795 322372 318406 314849 312467 310867
63489C10867j856k469k440j860j670k112k287j392K36J760K876L691M047L653
$$ 310867 309011 306542 304102 302242 300572 298460 296173 294781 295017 296777 299653 303344 307391 311044
63475C11044K744J941J596J685K196K982L411K770J146n92j718k131k042j818
$$ 311044 313788 315729 317325 319010 321206 324188 327599 330369 331515 330923 329205 327074 325032 323214
63461C23214k080l297n026o159o103n203l910k304p16k1o21j650j879j056K25
$$ 323214 321134 317837 312811 306652 300549 295346 291436 289132 288416 288395 287774 286124 284245 283189 283414
63446B83414J596L037M174M438M063M168N468P478R269J0678J2256J4437J7249
$$ 283414 285010 288047 292221 296659 300722 304890 310358 317836 327105 337783 350039 364476 381725
63433C81725K0702K4849K9209L2452L3096L0654K5982K0538J5353J0795P076M599
$$ 381725 402427 427276 456485 488937 522033 552687 578669 599207 614560 625355 632431 637030
63421F37030L719M457O658J0221J4855J9751K4002K7437L0620L3805L6171L6416
$$ 637030 640749 645206 651864 662085 676940 696691 720693 748130 778750 812555 848726 885142
63409H85142L3913K8994K2322J4621O986P93l222n457o699p189o968o836q037
$$ 885142 919055 948049 970371 984992 991978 992771 989549 984092 977393 970204 963236 956400 948363
63396I48363j0838j4145j7044k0038k4070k8713l2278l3689l3475l2639l1332
$$ 948363 937525 923380 906336 886298 862228 833515 801237 767548 734073 701434 670102
63385F70102k9160k6330k3723k1923k0637j9117j6883j3980j0811p806n107k612
$$ 670102 640942 614612 590889 568966 548329 529212 512329 498349 487538 479732 474625 472013
63373D72013l70J216J922K251L131M940P189R209J0823J2235J3614J5094J6834
$$ 472013 471643 472859 474781 477032 480163 485103 492292 501501 512324 524559 538173 553267 570101
63360E70101J8713K0259K1248K2225K3954K6429K8948L1080L2940L4353L4506
$$ 570101 588814 609073 630321 652546 676500 702929 731877 762957 795897 830250 864756
63349H64756L2805K9530K5165J9585J2726N672J67l092m898o185p046p402p832
$$ 864756 897561 927091 952256 971841 984567 990239 990406 987314 982416 976231 969185 961783 953951
63336I53951r064j1059j3347j5991j9558k4089k8723l2366l4361l4546l3164l0956
$$ 953951 944887 933828 920481 904490 884932 860843 832120 799754 765393 730847 697683 666727
63324F66727k8823k7009k4874k1678j7479j2879q242l740j99P68j827o989j2269
$$ 666727 637904 610895 586021 564343 546864 533985 525743 522003 521804 522572 520745 513756 501487
63311E01487j5777j7315j7561j6831j5143j2943j0994r642q706q054p664p171
$$ 501487 485710 468395 450834 434003 418860 405917 394923 385281 376575 368521 360857 353686
63299C53686o142m927m418m704m772m004l233l461m251m402l840l643m235m635
$$ 353686 347544 342617 338199 333495 328723 324719 321486 318025 313774 309372 305532 301889 297654 293019
63285B93019l961k680j870j780j812j529j125r31r68j041r95q14n56l04j41j82
$$ 293019 289058 286378 284508 282728 280916 279387 278262 277331 276363 275322 274327 273513 272957 272653 272512 272330
63269B72330m77q64r89o95k68j03k14k82j65n3r3j18J39O92J191J166N19j67j64
$$ 272330 271853 270989 270000 269305 269037 268934 268720 268438 268273 268220 268127 268009 268148 268840 270031 271197 271716 271549 271385
63250B71385M11N60k64j179r20L93J398J353R64J158J861K475K854L133L101K517
$$ 271385 271796 272356 272092 270913 269993 270386 271784 273137 274101 275259 277120 279595 282449 285582 288683 291200
63234B91200J836J922L009M408N285N383M947M375M029M100M426M564M209L516
$$ 291200 293036 294958 297967 302375 307660 313043 317990 322365 326394 330494 334920 339484 343693 347209
63220C47209K956K886L258L773M253M755N344N885O207O291O132N608M709L769
$$ 347209 350165 353051 356309 360082 364335 369090 374434 380319 386526 392817 398949 404557 409266 413035
63206D13035L126K702K245J892J927K072J587K49j244k077k089j482l31J270K876
$$ 413035 416161 418863 421108 423000 424927 426999 428586 428835 427591 425514 423425 421943 421612 422882 425758
63191D25758M053M904N887P185Q576R833J1048J2593J4774J7420J9835K1398K2259
$$ 425758 429811 434715 440602 447787 456363 466196 477244 489837 504611 522031 541866 563264 585523
63178E85523K3071K4036K4640K4514K3966K3414K2784K1884K0955K0339J9971
$$ 585523 608594 632630 657270 681784 705750 729164 751948 773832 794787 815126 835097
63167H35097J9669J9564J9645J9143J7051J3233Q545L831p14n291j0098j5255
$$ 835097 854766 874330 893975 913118 930169 943402 951947 955778 955064 949773 939675 924420
63155I24420k0623k5604k9432l1798l2963l3327l3148l2611l1782l0442k8301
$$ 924420 903797 878193 848761 816963 784000 750673 717525 684914 653132 622690 594389
63144E94389k5439k2341j9433j6859j4637j2809j1344j0109q956p722o291m832
$$ 594389 568950 546609 527176 510317 495680 482871 471527 461418 452462 444740 438449 433617
63132D33617l824l523l559l364k907k564k294j498J30J974L061L194L208M080
$$ 433617 429793 426270 422711 419347 416440 413876 411582 410084 410214 412188 415249 418443 421651 425731
63118D25731N753P064P004N942N235N523N997N631M637M068M345M911N243N403
$$ 425731 431484 438548 445552 451494 456729 462252 468249 473880 478517 482585 486930 491841 497084 502487
63104E02487N441M975L749K295J601K144L398M221L870K700J812J835K304K446
$$ 502487 507928 512903 516652 518947 520548 522692 526090 530311 534181 536881 538693 540528 542832 545278
63090E45278K190K005K027J995J871J817J589P10p03j907k567l117l859m348m089
$$ 545278 547468 549473 551500 553495 555366 557183 558772 559482 558779 556872 554305 551188 547329 542981 538892
63075E38892l417l196l901n243o460o805o038m676l509k830k356j856j363p93
$$ 538892 535475 532279 528378 523135 516675 509870 503832 499156 495647 492817 490461 488605 487242 486449
63061D86449M5R19J305J294J696K957M570N891O891P674Q020Q031Q615J0510J3124
$$ 486449 486494 487413 488718 490012 491708 494665 499235 505126 512017 519691 527711 535742 544357 554867 567991
63046E67991J5068J5651J5319J4849J4761J5202J5875J6171J5881J5525J5519
$$ 567991 583059 598710 614029 628878 643639 658841 674716 690887 706768 722293 737812
63035G37812J5463J4825J3933J3503J3479J3245J2748J2485J2367J1573R666O988
$$ 737812 753275 768100 782033 795536 809015 822260 835008 847493 859860 871433 881099 888087
63023H88087L916N71k597m854o259p765r833j1666j2347j2012j1365j0657r805
$$ 888087 892003 892574 889977 885123 878864 871099 861266 849600 837253 825241 813876 803219 793414
63010G93414q843p542n073r47M005Q323J1466J4061J6809J9878K3247K6872L0408
$$ 793414 784571 777029 771956 771009 775014 783337 794803 808864 825673 845551 868798 895670 926078
62997I26078L3380L5809L8160M0540M2458M3491M3741M3468M2734M1709M0914
$$ 926078 959458 995267 1033427 1073967 1116425 1159916 1203657 1247125 1289859 1331568 1372482
62986A372482M0739M0900M0642L9429L7189L3984K9672K3986J6940R015P84p659
$$ 1372482 1413221 1454121 1494763 1534192 1571381 1605365 1635037 1659023 1675963 1684978 1685762 1678103
62974A678103j6650k6164l5358m3282m9798n5327n9813o2541o3106o1962n9719
$$ 1678103 1661453 1635289 1599931 1556649 1506851 1451524 1391711 1329170 1266064 1204102 1144383
62963A144383n6468n2176m7404m3051l9484l6328l3145k9975k7224k5202k3808
$$ 1144383 1087915 1035739 988335 945284 905800 869472 836327 806352 779128 753926 730118
62952G30118k2594k1217j9810j8808j8337j8090j7869j7891j8178j7999j6549
$$ 730118 707524 686307 666497 647689 629352 611262 593393 575502 557324 539325 522776
62941E22776j4111j2005j1200j1306j1217j0443r505r057q961q430p039n326m149
$$ 522776 508665 496660 485460 474154 462937 452494 442989 433932 424971 416541 409502 404176 400027
62928D00027l656l231k552k107k382l012l254k969k520j922q72L31P65R4q30j036
$$ 400027 396371 393140 390588 388481 386099 383087 379833 376864 374344 372422 371550 371881 372646 372740 371910 370874
62912C70874o69n81j059j551j566j307j276j622k033k109j757j205o81j49M57
$$ 370874 370205 369624 368565 367014 365448 364141 362865 361243 359210 357101 355344 354139 353458 353309 353766
62897C53766R12R87J056J903L617N212N767N555N465N584N119L706K012Q01P9
$$ 353766 354678 355665 356721 358624 362241 367453 373220 378775 384240 389824 394943 398649 400661 401462 401541
62882D01541m96q53p11l10l04r49j816k416k784l247l843m250m254l973l631l350
$$ 401541 401045 400192 399481 399171 398867 397918 396102 393686 390902 387655 383812 379562 375308 371335 367704 364354
62866C64354l277l614m185m287l491k480k424l349l813k749r66j42p10j639k084
$$ 364354 361077 357463 353278 348991 345500 343020 340596 337247 333434 330685 329719 329577 328867 327228 325144
62851C25144k243k348j937o67P65J336J006O52Q79J419J665J289L51p64j463j381
$$ 325144 322901 320553 318616 317949 318714 320050 321056 321708 322587 324006 325671 326960 327311 326547 325084 323703
62835C23703q28n70r99j793k357k448k290k242k426k493j890n70O37Q12J24l11
$$ 323703 322875 322305 321306 319513 317156 314708 312418 310176 307750 305257 303367 302797 303434 304246 304370 304059
62819C04059J16P76Q98Q46J496K652L052K098P40J84L81M62K13K63R57J784K152
$$ 304059 304175 304951 305849 306695 308191 310843 313895 315993 316733 316917 317298 317760 317973 318236 319193 320977 323129
62802C23129K088J856J435P45J25J15Q11J734K323K403K219K141K261K266J919
$$ 323129 325217 327073 328508 329253 329378 329493 330304 332038 334361 336764 338983 341124 343385 345651 347570
62787C47570J571J851K721L337L212L049L876N677P547R080J0795J3070J5327
$$ 347570 349141 350992 353713 357050 360262 363311 367187 372864 380411 389491 400286 413356 428683
62774D28683J6723J7138J7097J6945J6584J5892J5027J4263J3679J2974J1551
$$ 428683 445406 462544 479641 496586 513170 529062 544089 558352 572031 585005 596556
62763E96556Q980N501J972r02l162n299p496r394j0606j1209j1657j2332j3240
$$ 596556 605536 611037 613009 612107 608945 603646 596150 586756 576150 564941 553284 540952 527712
62750E27712j4134j4794j5102j4941j4201j3063j2038j1455j0994j0053q561p143
$$ 527712 513578 498784 483682 468741 454540 441477 429439 417984 406990 396937 388376 381233
62738C81233o379o199o110n717m876l633k282j279p97n40j51L30P12J124J843
$$ 381233 374854 368655 362545 356828 351952 348319 346037 344758 343961 343421 343270 343600 344312 345436 347279
62723C47279K734L267L140K649K324K563L547N205P016Q233Q606Q706R292J0445
$$ 347279 350013 353280 356420 359069 361393 363956 367503 372708 379724 387957 396563 405269 414561 425006
62709D25006J1692J2779J4035J5844J8137K0576K2985K5398K7903L0713L4192
$$ 425006 436698 449477 463512 479356 497493 518069 541054 566452 594355 625068 659260
62698F59260L8425M2832M6744N0352N4607N9891O5281O9592P2680P5141P6849
$$ 659260 697685 740517 787261 837613 892220 952111 1017392 1086984 1159664 1234805 1311654
62687A311654P6623P3540O7918O0704N2244M2170L0215J6739K518j1647k5122
$$ 1311654 1388277 1461817 1529735 1590439 1642683 1684853 1715068 1731807 1734325 1722678 1697556
62676A697556l7520m8646n8243o5897p1328p4673p6219p5956p3759o9931o5317
$$ 1697556 1660036 1611390 1553147 1487250 1415922 1341249 1265030 1189074 1115315 1045384 980067
62665I80067o0670n6221n1925m7896m4300m1038l7832l4603l1480k8391k4970
$$ 980067 919397 863176 811251 763355 719055 678017 640185 605582 574102 545711 520741
62654E20741k1104j7419j4919j4013j4034j3820j2704j0913r150p951p383p186
$$ 520741 499637 482218 467299 453286 439252 425432 412728 401815 392665 384714 377331 370145
62642C70145p019o637n973n099m122l090j972q20J11M60M9r01j928k635k870k677
$$ 370145 363126 356489 350516 345417 341295 338205 336233 335413 335524 335984 336033 335132 333204 330569 327699 325022
62626C25022k187j588j116j050j663k950m308m724l715j939n81r1J0J36Q0l19
$$ 325022 322835 321247 320131 319081 317418 314468 310160 305436 301721 299782 299201 299110 299120 299256 299336 299017
62610B99017n41m9P88J094P04L22M16N74K44l04k97M70J291J449J172J390K470
$$ 299017 298476 298427 299215 300309 301013 301335 301751 302325 302569 302265 301968 302438 303729 305178 306350 307740 310210
62593C10210L636L980L801M313N919P496P870P387P302P902Q128P174N679M835
$$ 310210 313846 317826 321627 325940 331859 339355 347225 354612 361914 369816 377944 385118 390797 395632
62579C95632M759M267K326o38l148m326m781n633o892p487o856n766n215n263
$$ 395632 400391 404658 406984 406346 403198 398872 394091 388458 381566 374079 367223 361457 356242 350979
62565C50979n438n619n808n546m544l450l131l401l374k876k448k095j213J69
$$ 350979 345541 339922 334114 328568 324024 320574 317443 314042 310668 307792 305344 303249 302036 302205
62551C02205J146J269J046R24P37N34Q26J477J492N45k16K63J439K073J962J779
$$ 302205 303351 304620 305666 306590 307327 307861 308687 310164 311656 312201 311985 312248 313687 315760 317722 319501
62535C19501J831J916K030K290K429K172J899K228L163M216N090N683N859N850
$$ 319501 321332 323248 325278 327568 329997 332169 334068 336296 339459 343675 348765 354448 360307 366157
62521C66157O462Q144J0231J1865J3262J5208J7681K0007K2161K4876K8449L2280
$$ 366157 372619 380763 390994 402859 416121 431329 449010 469017 491178 516054 544503 576783
62509E76783L5633L8145L9708M0614M1655M3145M3985M2627L8981L4341K9364
$$ 576783 612416 650561 690269 730883 772538 815683 859668 902295 941276 975617 1004981
62498A004981K3304J5560O911j304q450j4504j9407k3078k5563k6780k6528k5026
$$ 1004981 1028285 1043845 1050756 1049452 1041002 1026498 1007091 984013 958450 931670 905142 880116
62486H80116k2922k0528j7630j4284j1054q093m760p24L210N984P466Q070P701
$$ 880116 857194 836666 819036 804752 793698 785605 780845 780121 783331 789315 796781 804851 812552
62473H12552N903K871m58l366n931q681j2136j6500k1293k5331k7603k8303k8607
$$ 812552 818455 821326 820868 817502 811571 802890 790754 774254 752961 727630 700027 671724 643117
62460F43117k9324l0047k9753k7997k5268k2402j9855j7581j5375j3160j1015
$$ 643117 613793 583746 553993 525996 500728 478326 458471 440890 425515 412355 401340
62449D01340r051p412o163n181m203l123k050j052l8R95J814K304K594K761K711
$$ 401340 392289 384877 378714 373533 369330 366207 364157 363105 363067 364062 365876 368180 370774 373535 376246
62434C76246K714L435M921O039N612L879K000M69j116k761l770l915l939m445
$$ 376246 378960 382395 387316 393355 398967 402846 404846 405315 404199 401438 397668 393753 389814 385369
62420C85369n110n477n795o413o900o481n074l438k423k379l003l509l255k429
$$ 385369 380259 374782 368987 362574 355674 349193 344119 340681 338258 335879 332876 329367 326112 323683
62406C23683j789j645j532j057m86k18k40l97o36o37J21J476K414K349K045K544
$$ 323683 321894 320249 318717 317660 317174 316956 316716 316319 315683 315046 315167 316643 319057 321406 323451 325995
62390C25995L677M379M169L523L017K845L122L940N060O032O693P134P286P026
$$ 325995 329672 334051 338220 341743 344760 347605 350727 354667 359727 365759 372452 379586 386872 393898
62376C93898O645O689P311Q120Q745R225R823J0696J1738J2579J2917J3010J3567
$$ 393898 400543 407232 414543 422663 431408 440633 450456 461152 472890 485469 498386 511396 524963
62363E24963J4903J6550J8075J9921K2845K6782L0870L4583L8199M2143M6405
$$ 524963 539866 556416 574491 594412 617257 644039 674909 709492 747691 789834 836239
62352H36239N0668N4545N7455N8647N7658N4552M9607M2909L4506K4985J5701
$$ 836239 886907 941452 998907 1057554 1115212 1169764 1219371 1262280 1296786 1321771 1337472
62341A337472Q105K474k524q545j5771k2821k8521l3116l7376m1222m3845m4699
$$ 1337472 1345577 1348051 1345527 1336982 1321211 1298390 1269869 1236753 1199377 1158155 1114310 1069611
62329A069611m3779m1252l7608l3875l1001k8972k7128k5163k3303k1698k0377
$$ 1069611 1025832 984580 946972 913097 882096 853124 825996 800833 777530 755832 735455
62318G35455j9684k0032k1106k1960k2003k1382k0414j9206j7915j6763j5678
$$ 735455 715771 695739 674633 652673 630670 609288 588874 569668 551753 534990 519312
62307E19312j4406j3090j2155j1541j0624r077p302n801m550l241j784l84N65
$$ 519312 504906 491816 479661 468120 457496 448419 441117 435316 430766 427525 425741 425357 425922
62294D25922O77O9l51L10J810K963L114K815K825L137L307L228L097L005K895
$$ 425922 426599 426668 426317 426627 428437 431400 434514 437329 440154 443291 446598 449826 452923 455928 458823
62279D58823K763K593K418K462K924L509L714L667M019M730M873M058L415M332
$$ 458823 461586 464179 466597 469059 471983 475492 479206 482873 486892 491622 496495 500553 503968 508300
62265E08300O734R390J1563J3536J5742J8309K1443K5452L0118L4723L8936M3187
$$ 508300 515034 524424 535987 549523 565265 583574 605017 630469 660587 695310 734246 777433
62253G77433M7822N2358N5970N8379N9832O0252N8869N4802M8017L9518L0618
$$ 777433 825255 877613 933583 991962 1051794 1112046 1170915 1225717 1273734 1313252 1343870
62242A343870K1996J3596N331k470r613j6684k4602l3372m1720m8247n2641n5483
$$ 1343870 1365866 1379462 1384793 1382323 1372710 1356026 1331424 1298052 1256332 1208085 1155444 1099961
62230A099961n7069n7005n4975n1433m7218m2794l8255l3888l0144k7026k3990
$$ 1099961 1042892 985887 930912 879479 832261 789467 751212 717324 687180 660154 636164
62219F36164k0750j7774j5611j4077j2539j0823r397q714q719r025r133q612p458
$$ 636164 615414 597640 582029 567952 555413 544590 535193 526479 517760 508735 499602 490990 483532
62206D83532o292n768n775n601m888l918k979k059j297j070j326j342n85O45J765
$$ 483532 477240 471472 465697 460096 455208 451290 448311 446252 444955 443885 442559 441217 440632 441277 443042
62191D43042K719L779M933N978O913P779Q374Q615Q869R401R799R634R418J0071
$$ 443042 445761 449540 454473 460451 467364 475143 483517 492132 501001 510402 520201 529835 539253 549324
62177E49324J1410J2001J0874Q710O942O259O479P414R167J1698J4645J7760K1135
$$ 549324 560734 572735 583609 592319 599261 605520 611999 619413 628580 640278 654923 672683 693818
62164F93818K4929K9126L3570L7994M1875M4540M5635M5365M4031M1376L6756
$$ 693818 718747 747873 781443 819437 861312 905852 951487 996852 1040883 1082259 1119015
62153A119015L0088K2404J5164R074L737j558p056j2527j7728k2544k6783l0075
$$ 1119015 1149103 1171507 1186671 1195745 1199482 1197924 1190868 1178341 1160613 1138069 1111286 1081211
62141A081211l2107l2904l2772l1953l0316k7510k3548j9078j4982j1759r421
$$ 1081211 1049104 1016200 983428 951475 921159 893649 870101 851023 836041 824282 814861
62130H14861p836o826o100n486n207n572o373p114p792q829r979j0101q513o073
$$ 814861 807025 800199 794099 788613 783406 777834 771461 764347 756555 747726 737747 727646 719133 713060
62116G13060m157k915j323J245M301P060R164J0314R969P925M827J680q68k561
$$ 713060 708903 705988 704665 705910 710211 717271 726435 736749 746718 754643 759470 761150 760282 757721
62102G57721l164k546j094L38Q85O2k112n119q105j0268j1219j1007r951q418
$$ 757721 754557 752011 750917 751255 752140 752202 750090 744971 736866 726598 715379 704372 694421 686003
62088F86003o684m781k524J77L072N612P352Q382R437J1362J4268J7306J9499
$$ 686003 679319 674538 672014 672191 675263 680875 688227 696609 706046 717408 731676 748982 768481
62075G68481K0779K1856K3138K4186K4438K4083K3904K4398K5306K5971K5950
$$ 768481 789260 811116 834254 858440 882878 906961 930865 955263 980569 1006540 1032490
62064A032490K5363K4774K4746K5445K6662K8100K9458L0176K9537K7139K3162
$$ 1032490 1057853 1082627 1107373 1132818 1159480 1187580 1217038 1247214 1276751 1303890 1327052
62053A327052J8104J2590P450L443M36k776p232j2547j7424k1383k5322l0137
$$ 1327052 1345156 1357746 1365196 1368639 1369075 1366299 1359067 1346520 1329096 1307713 1282391 1252254
62041A252254l5386l9680m2150m3087m3262m3006m2054m0083l7316l4467l2138
$$ 1252254 1216868 1177188 1135038 1091951 1048689 1005683 963629 923546 886230 851763 819625
62030H19625l0302k8470k6294k3808k1200j8553j5920j3439j1295r682q793q643
$$ 819625 789323 760853 734559 710751 689551 670998 655078 641639 630344 620662 611869 603226
62018F03226q900r130r237r393r528r274q516p654p027o470n721m966m593m575
$$ 603226 594326 585196 575959 566566 557038 547764 539248 531594 524567 518097 512376 507410 502817 498242
62004D98242m450l839k698j230J88J162J712K311L141L539K793J277K05J65N13
$$ 498242 493792 489953 487255 486025 486213 487375 489087 491398 494539 498078 500871 502148 502353 502518 503031
61989E03031L19o35j963l206m011m259m386n123o636q188r015r098q802q203p264
$$ 503031 503350 502715 500752 497546 493535 489276 484890 479767 473131 464943 455928 446830 438028 429825 422561
61974D22561o296n649n180m490l573k679j722m44Q57J419R48N6n01n38l16p5M4
$$ 422561 416265 410616 405436 400946 397373 394694 392972 392528 393385 394804 395752 395808 395307 394769 394453 394378 394422
61957C94422n4k47j78L48J060J488J502J361J374J600J898K176K575L343M492
$$ 394422 394368 394121 393943 394291 395351 396839 398341 399702 401076 402676 404574 406750 409325 412668 417160
61942D17160N682O640P624R191J1405J3556J4887J5455J6066J7278J8660J9151
$$ 417160 422842 429482 437106 446297 457702 471258 486145 501600 517666 534944 553604 572755
61930E72755J8150J6226J4624J4067J4151J3868J2564J0324P621M870K201m85
$$ 572755 590905 607131 621755 635822 649973 663841 676405 686729 694350 699220 701421 700936
61918G00936l234n714p352q000q203q519q736q177o653m558k103J009M846Q735
$$ 700936 697702 691988 684636 676636 668433 659914 651178 643001 636348 631790 629687 630696 635542 644277
61904F44277J1871J4126J5820J6873J6720J5070J2332R158N787K097j833n505
$$ 644277 656148 670274 686094 702967 719687 734757 747089 756247 762034 764131 762298 756793
61892G56793q413j0509j2142j3586j4782j5564j5906j5852j5315j4206j2698j1194
$$ 756793 748380 737871 725729 712143 697361 681797 665891 650039 634724 620518 607820 596626
61880E96626j0001r107q305p470o746o429o635p114p535p847q130q112p282n665
$$ 596626 586625 577518 569213 561743 554997 548568 541933 534819 527284 519437 511307 503195 495913 490248
61866D90248l987k850k034j036R3R49J512K145L041M182N710P738R919J1810J3578
$$ 490248 486261 483411 481377 480341 480434 481383 482895 485040 488081 492263 497973 505711 515630 527440 541018
61851E41018J5748J8319K0843K3334K6220K9236L1299L1875L1683L1515L1135
$$ 541018 556766 575085 595928 619262 645482 674718 706017 737892 769575 801090 832225
61840H32225K9937K7930K5266K1329J5438Q260J623l239o555r140j1288j2721
$$ 832225 862162 890092 915358 936687 952125 960385 962008 958769 952214 943074 931786 919065
61828I19065j3001j1672q524m055O25M728Q356J1894J4988J6599J6117J3983J1005
$$ 919065 906064 894392 885868 881813 882438 887166 895522 907416 922404 939003 955120 969103 980108
61815I80108P357K624l184r209j4588j9345k3985k8372l1610l3038l2895l1865
$$ 980108 987465 990089 986905 977696 963108 943763 919778 891406 859796 826758 793863 761998
61803G61998l0400k8646k6671k4486k2105j9815j8066j6873j5641j3851j1674
$$ 761998 731598 702952 676281 651795 629690 609875 591809 574936 559295 545444 533770
61792E33770r655q080o919o104n583n196m777m237l501k635k092k368l161l357
$$ 533770 524115 516035 509116 503012 497429 492233 487456 483219 479718 477083 474991 472623 469462 466105
61778D66105k335p84J37R4m90j271k049k337j785r15o03p51l66R09K166K533K350
$$ 466105 463770 462986 463123 463217 462727 461456 459407 457070 455285 454370 453767 453016 452650 453559 455725 458258 460608
61761D60608K492L073L507L507L317L090K737K464K765L621M157L612K355J464
$$ 460608 463100 466173 469680 473187 476504 479594 482331 484795 487560 491181 495338 498950 501305 502769
61747E02769J313J130J44j286k120j922j208o17k89r7lQ1L70Q75J166Q73J82l30
$$ 502769 504082 505212 505356 504070 501950 500028 498820 498203 497914 497817 497814 497895 498265 499140 500306 501179 501361 501031
61729E01031k45M39J377K031K025J594J452J920K446K271J412O21M75Q13J091
$$ 501031 500786 501225 502602 504633 506658 508252 509704 511624 514070 516341 517753 518374 518849 519662 520753
61714E20753J005P24O18P93R25O29q8r28j789k743l589l941l838l751l840l737
$$ 520753 521758 522482 523100 523893 524818 525447 525359 524431 522642 519899 516310 512369 508531 504780 500940 497203
61698D97203l299k959l020l198l263l430l629l157j811o84q95j984k590k264j620
$$ 497203 493904 490945 487925 484727 481464 478034 474405 471248 469437 468753 467858 465874 463284 461020 459400
61683D59400r75r6P75Q78J56m96n68n97j084j594j450p29q8ln06j292j810j646
$$ 459400 458425 458329 459104 459982 460138 459642 459074 458477 457393 455799 454349 453620 453532 453529 453023 451731 449921 448275
61665D48275r74l36M1K70K31l14j126j709k134k811l367k832j260p1j76p41n82
$$ 448275 447301 446965 447006 447276 447507 447193 446067 444358 442224 439413 436046 433214 431954 431883 431707 430966 430384
61648D30384P1K12k20l36K87J165J847K383K865L188L349L453L373K841J919R40
$$ 430384 430455 430667 430447 430111 430398 431563 433410 435793 438658 441846 445195 448648 452021 454862 456781 457721
61632D57721Qj051k285l478m413m938m802l858k469j392j181j769k555k816k168
$$ 457721 457729 456678 454393 450915 446502 441564 436762 432904 430435 429043 427862 426093 423538 420722 418554
61617D18554r20J68O36P37R13J139J069O49J66l05j081k432m100n415n845n495
$$ 418554 417634 417802 418438 419175 420088 421227 422296 422945 423111 422806 421725 419293 415193 409778 403933 398438
61601C98438n037n055n469n770n737n537n212m590l802l379l440l332k531j478
$$ 398438 393401 388346 382877 377107 371370 365833 360621 356031 352229 348850 345410 342078 339547 338069
61587C38069j063j466k056k247k036j747j660j819j976j843j484j236j105p38
$$ 338069 337006 335540 333484 331237 329201 327454 325794 323975 321999 320156 318672 317436 316331 315593
61573C15593j87j46r22j745j773j320j278j639j594r39m25n25p88o92m26m02n99
$$ 315593 315406 315260 314338 312593 310820 309500 308222 306583 304989 304050 303625 303100 302312 301620 301194 300792 300193
61556C00193p81q61p10o9R26J588J482J038R23J140J201R68P72Q60J108J327J389
$$ 300193 299412 298551 297841 297772 298698 300286 301768 302806 303729 304869 306070 307038 307810 308670 309778 311105 312494
61539C12494J155N87K3n5L99R06J091J101J242J464J429J034N49K62J89J55J4
$$ 312494 313649 314236 314259 314204 314603 315509 316600 317701 318943 320407 321836 322870 323419 323681 323870 324025 324039
61522C24039k95p61j285j727k048k312k498k437k027j441r10m27J02N05M42j34
$$ 324039 323744 322983 321698 319971 317923 315611 313113 310676 308649 307208 306298 305871 305973 306478 306920 306786
61506C06786q10j151j131j005r06p11k86K55N78M83J98J63M81P73P68P32R86J281
$$ 306786 305976 304825 303694 302689 301783 301072 300786 301041 301619 302102 302300 302463 302944 303717 304485 305217 306203 307484
61488C07484J052K56n35q61p77n43l29k97n08p12n89k04J68N70J167J608J339
$$ 307484 308536 308792 308257 307396 306619 306076 305747 305450 304942 304230 303641 303437 303605 304175 305342 306950 308289
61471C08289N81K10M46N41O8m09m65n94j165j419n27R51J698J279L40m87r33p45
$$ 308289 308870 309080 309526 310067 310135 309726 309261 308667 307502 306083 305556 306507 308205 309484 309824 309337 308404 307659
61453C07659K7N23Rq93p99M98J733J842J047R1o32r41p20k23J50O37J866L583
$$ 307659 307686 308209 308218 307325 306526 307024 308757 310599 311646 311737 311105 310164 309444 309221 309371 310008 311874 315457
61435C15457M501L911K689K130K351K570K399K215K355K658K680K096R67q3k17
$$ 315457 319958 323869 326558 328688 331039 333609 336008 338223 340578 343236 345916 348012 348979 348896 348679
61420C48679P82K159K906K723K072J492J095P42M22M12R15J582J610O31p29j609
$$ 348679 349461 351620 354526 357249 359321 360813 361908 362650 363072 363484 364399 365981 367591 368222 367493 365884
61404C65884j942k269k687k769k510k500k885k955k164r85k17%L7L9p3j77o1K07
$$ 365884 363942 361673 358986 356217 353707 351207 348322 345367 343203 342218 342001 342001 342038 342077 342004 341827 341766 341973
61386C41973L91M30M34N06P25J103J367J156N80J74J00r0n77p04J84J726K914
$$ 341973 342364 342794 343228 343734 344459 345562 346929 348085 348665 348839 348939 348849 348272 347568 347752 349478 352392
61369C52392L217K881K367J992J913J986J777J196Q66J396K448L064K858K382
$$ 352392 355609 358490 360857 362849 364762 366748 368525 369721 370587 371983 374431 377495 380353 382735
61355C82735K369L023M021M801M837M146L495L800N170O846Q139R051R877J0560
$$ 382735 385104 388127 392148 396949 401786 405932 409427 413227 418397 425243 433382 442433 452310 462870
61341D62870J0637R788Q234O579N245M134K984J943J449J485J393O93k66q04q39
$$ 462870 473507 483295 491529 498108 503353 507487 510471 512414 513863 515348 516741 517434 517168 516364 515525
61326E15525r37j576k718l996m982n373n138m512l681k770k110k069k292j731
$$ 515525 514588 513012 510294 506298 501316 495943 490805 486293 482612 479842 477732 475663 473371 471640
61312D71640L3J915K557K122J998K873M054M843N620P055Q955J0576J1657J2572
$$ 471640 471673 473588 476145 478267 480265 483138 487192 492035 497655 504710 513665 524241 535898 548470
61298E48470J3505J4068J3649J1982R284O132L104M44k016m424o525p819q123
$$ 548470 561975 576043 589692 601674 610958 617090 620194 620638 618622 614198 607673 599854 591731
61285E91731p867p682p725p536o701n532m804m747m667l806k346j165o86l87M93
$$ 591731 583864 576182 568457 560921 554220 548688 543884 539137 534470 530664 528318 527153 526467 526080 526573
61270E26573K065L723M843N388N818O450O930O605N411M196L884M532N472O285
$$ 526573 528638 532361 537204 542592 548410 554860 561790 568395 573806 578002 581886 586418 591890 598175
61256E98175P251Q796J0778J2508J3356J3182J2201J0580Q359N837L672K245J099
$$ 598175 605426 614222 625000 637508 650864 664046 676247 686827 695186 701023 704695 706940 708039
61243G08039n04k500m061m785n214n924o711p129p214p122o557n240l674k728
$$ 708039 707535 705035 700974 696189 690975 685051 678340 671211 663997 656875 650318 645078 641404 638676
61229F38676k649l041l519l809l458k199n02R10J962K998L841L922L348K961L131
$$ 638676 636027 632986 629467 625658 622200 620001 619499 620409 622371 625369 629210 633132 636480 639441 642572
61214F42572L257K787K015J560J597J923K331K633K695K637K670K637K194J526
$$ 642572 645829 648616 650631 652191 653788 655711 658042 660675 663370 666007 668677 671314 673508 675034
61200F75034J330J853K584L094L631M600N937P393Q996J0878J2969J5108J7128
$$ 675034 676364 678217 680801 683895 687526 692126 698063 705456 714452 725330 738299 753407 770535
61187G70535J8562J8724J7372J4986J2190R318O741N069M527M490M053K922J455
$$ 770535 789097 807821 825193 840179 852369 861687 868428 873497 878024 882514 886567 889489 890944
61174H90944R8j032k175l699n635p385q293q489q722r354j0110j0863j1907j3202
$$ 890944 891042 890010 887835 884136 878501 871116 862823 854334 845612 836258 826148 815285 803378 790176
61160G90176j4143j4431j4488j4567j4192j3040j1703j0865j0297r343p926o426
$$ 790176 776033 761602 747114 732547 718355 705315 693612 682747 672450 663107 655181 648755
61148F48755m919l326j893q22L06J990L852M849M343K488j49k820m732n603n949
$$ 648755 643836 640510 638617 637795 638101 640091 643943 648792 653135 655623 655474 652654 647922 642319 636370
61133F36370o322o498n913m562k913j299L4P18Q94J594L577O064P632Q197R019
$$ 636370 630048 623550 617637 613075 610162 608863 608897 609615 610509 612103 615680 621744 629376 637573 646592
61118F46592J0776J2708J4000J4948J6303J8081J9609K0395K0610K0906K1775
$$ 646592 657368 670076 684076 699024 715327 733408 753017 773412 794022 814928 836703
61107H36703K2872K3144K1983K0060J8371J6847J4668J1795R166P293N639L601
$$ 836703 859575 882719 904702 924762 943133 959980 974648 986443 995609 1002902 1008541 1012142
61095A012142J185j600n101r284j3297j6359j8583k0434k1922k2784k3042k2875
$$ 1012142 1013327 1011727 1006626 997342 984045 967686 949103 928669 906747 883963 860921 838046
61083H38046k2326k1532k0874k0448j9681j7959j5479j3109j1440j0290r102p644
$$ 838046 815720 794188 773314 752866 733185 715226 699747 686638 675198 664908 655806 648162
61071F48162o281n518n279m850l736k330j360r48p05n03n11n60k19M76J083J608
$$ 648162 641881 636363 631084 626234 622498 620168 618808 617860 617155 616652 616141 615581 615362 615838 616921 618529
61055F18529K584M155N697O657P161P575Q033Q613R510J0735J2071J3492J5209
$$ 618529 621113 625268 630965 637622 644783 652358 660391 669004 678514 689249 701320 714812 730021
61042G30021J7194J9079K0582K1691K2409K2790K3131K3674K4307K5040K6357
$$ 730021 747215 766294 786876 808567 830976 853766 876897 900571 924878 949918 976275
61031I76275K8402L0215L0801L0637L1069L2486L4319L6513L9572M3117M5914
$$ 976275 1004677 1034892 1065693 1096330 1127399 1159885 1194204 1230717 1270289 1313406 1359320
61020A359320M7481M8254M8260M7320M6683M8531N3482O0332O8599P9146R1801
$$ 1359320 1406801 1455055 1503315 1550635 1597318 1645849 1699331 1759663 1828262 1907408 1999209
61009A999209J04634J16466J28034J40296J54409J74208K05339K50280L07496
$$ 1999209 2103843 2220309 2348343 2488639 2643048 2817256 3022595 3272875 3580371
61000C580371L77147M63514N69556O94362Q40471J019228J244593J527967J883137
$$ 3580371 3957518 4421032 4990588 5684950 6525421 7544649 8789242 10317209 12200346
60991A2200346K316582K779801L125128L147510K721379J918548R83999J86875
$$ 12200346 14516928 17296729 20421857 23569367 26290746 28209294 29193293 29380168
60983B9380168l10086m64170l00410R9094N57936Q19853O69931P6138p85686j649638
$$ 29380168 29070082 28605912 28305502 28404596 28962532 29782385 30452316 30528454 29742768 28093130
60973B8093130k309917k686626k797309k702959k476458k187391j887656j604426
$$ 28093130 25783213 23096587 20299278 17596319 15119861 12932470 11044814 9440388
60965I440388j348002j123229r31703p69677o31495n15066m20904l47327k90100
$$ 9440388 8092386 6969157 6037454 5267777 4636282 4121216 3700312 3352985 3062885
60956C062885k45692k11741j85177j62871j43872j28453j15415j02658q9951p8636
$$ 3062885 2817193 2605452 2420275 2257404 2113532 1985079 1869664 1767006 1677055 1598419
60946A598419o8861n9555n1063m5402m3370m3471m4123m5085m6185m6456m5293
$$ 1598419 1529558 1470003 1418940 1373538 1330168 1286697 1242574 1197489 1151304 1104848 1059555
60935A059555m3224m0891l8345l5743l3646l2175l0785k9143k7352k5214k2365
$$ 1059555 1016331 975440 937095 901352 867706 835531 804746 775603 748251 723037 700672
60924G00672j9269j6975j5648j4347j2542j0778r538q511p437o657o353o021n258
$$ 700672 681403 664428 648780 634433 621891 611113 601575 593064 585627 578970 572617 566596 561338
60911E61338m399l918l722l343k428q67J006K313K331J423N98J96k44q40j089
$$ 561338 556939 553021 549299 545956 543528 542661 543667 545980 548311 549734 550332 550528 550284 549444 548355
60896E48355r13j008j782k779l556m360n469o574p348p946q481q520p736o641
$$ 548355 547442 546434 544652 541873 538317 533957 528488 521914 514566 506620 498139 489619 481883 475242
60882D75242o126o384o732o432n440m400l917l867l570k813k281k580l226l247
$$ 475242 469116 462732 456000 449568 444128 439728 435811 431944 428374 425561 423280 420700 417474 414227
60868D14227k506j623p87M08J949L123L484L389L435L879M720N751O453O550O516
$$ 414227 411721 410098 409311 409719 411668 414791 418275 421664 425099 428978 433698 439449 445902 452452 458968
60853D58968O887P264O873N967N527N583N104L790K703K624K991L008K760K485
$$ 458968 465855 473119 479992 485959 491486 497069 502173 505963 508666 511290 514281 517289 520049 522534
60839E22534J770K66j535l051m440n983p259p662p210o346n479n187o050p642
$$ 522534 524304 524570 523035 519984 515544 509561 502302 494640 487430 481084 475605 470418 464368 456726
60825D56726q535q024p082o810o769n898m363l285l068l162l273l610m019l892
$$ 456726 448191 440167 433085 426275 419506 413608 409245 405960 402892 399730 396457 392847 388828 384936
60811C84936l108k272j893j863j822j554j065o55p37j225j393q06O2O41J138J907
$$ 384936 381828 379556 377663 375800 373978 372424 371359 370704 369967 368742 367349 366543 366605 367246 368384 370291
60795C70291K490K274J738J971L073M080M423M503M750N111N653O674P895Q397
$$ 370291 372781 375055 376793 378764 381837 385917 390340 394843 399593 404704 410357 417031 424926 433323
60781D33323P797O785O176O029O095O430P024P348O927O062N504N566N906O076
$$ 433323 441120 447905 454081 460110 466205 472635 479659 487007 493934 499996 505500 511066 516972 523048
60767E23048N934N695N792O515P626Q505Q847Q991R311R589R299Q472P852Q190
$$ 523048 528982 534677 540469 546984 554610 563115 571962 580953 590264 599853 609152 617624 625476 633666
60753F33666R489J1043J2112J2476J2448J2449J2627J2827J2779J2285J1361J0303
$$ 633666 643155 654198 666310 678786 691234 703683 716310 729137 741916 754201 765562 775865
60741G75865R411Q538O984M120N3m353q196j1112j3256j4878j6011j6550j6536
$$ 775865 785276 793814 800798 804918 804971 800618 792422 781310 768054 753176 737165 720615 704079
60728G04079j6255j5962j5637j5212j4815j4548j4150j3263j2063j1112j0531
$$ 704079 687824 671862 656225 641013 626198 611650 597500 584237 572174 561062 550531
60717E50531r755q388o784n577m965m756m725m687m568m600n105n846o126n824
$$ 550531 540776 532388 525604 520027 515062 510306 505581 500894 496326 491726 486621 480775 474649 468825
60703D68825n718o309o979o988o704o936p428p180o099n283n367n649n267m444
$$ 468825 463107 456798 449819 442831 436127 429191 421763 414583 408484 403201 397834 392185 386918 382474
60689C82474l912l692l248k588k394k908l312k675j261l44n43r05j01J733L064
$$ 382474 378562 374870 371622 369034 366640 363732 360420 357745 356484 356140 355597 354692 354591 356324 359388
60674C59388K949K163J965K427K649K212J591J288J268J305J300J134O59k2o02
$$ 359388 362337 364500 366465 368892 371541 373753 375344 376632 377900 379205 380505 381639 382298 382276 381674
60659C81674r44j106j031n62J72P17Q28P44R36J619K590L413L873M274N104O269
$$ 381674 380730 379624 378593 378031 378203 378920 379748 380492 381428 383047 385637 389050 392923 397197 402301 408570
60643D08570P024O832N920M752L385J809M84q8p8j13m52r10j370j836k110j987
$$ 408570 415594 422426 428346 433098 436483 438292 438776 438688 438610 438497 438045 437135 435765 433929 431819 429832
60627D29832j721j763k070k171j879j510j414j698k241k652k421j587r14r11j049
$$ 429832 428111 426348 424278 422107 420228 418718 417304 415606 413365 410713 408292 406705 405791 404880 403831
60612D03831o53j57m66j359j654r65j68Q4K05O26R27O86L65O58J442K004J907
$$ 403831 403178 403021 402555 401196 399542 398577 398409 398493 398698 399324 400251 400937 401302 401960 403402 405406 407313
60595D07313J228K53o41j094j113j012r11o78m35n22p81n42L79J308J738K040
$$ 407313 408541 408794 408153 407059 405946 404934 404023 403345 402910 402388 401607 401065 401444 402752 404490 406530
60579D06530K674L303L405L225L428M142N021N959P076Q179Q984R785J1226J3391
$$ 406530 409204 412507 415912 419137 422565 426707 431728 437687 444763 452942 461926 471711 482937 496328
60565D96328J5678J7719J9949K2913K6318K9044L0017K8955K6249K2232J6791
$$ 496328 512006 529725 549674 572587 598905 627949 657966 686921 713170 735402 752193
60554G52193R812J859n931j2554j7408j9976j9936j7771j4700j1577q203m140
$$ 752193 762005 763864 757933 745379 727971 707995 688059 670288 655588 644011 635808 631668
60542F31668K27M034P081J0126J4054J9206K5402L2134L8623M4037M7810M9622
$$ 631668 631895 635929 643010 653136 667190 686396 711798 743932 782555 826592 874402 924024
60530I24024M9055M5575L8945K9622J8654P328l135j1766j8062k2093k4308k5116
$$ 924024 973079 1018654 1057599 1087221 1105875 1113203 1110068 1098302 1080240 1058147 1033839 1008723
60518A008723k4757k3619k2458k1830k1329j9922j7277j4225j1485q600m849p25
$$ 1008723 983966 960347 937889 916059 894730 874808 857531 843306 831821 823221 818372 817647
60506H17647K417M107N247O788Q882J1577J5417K0800K7322L4293M1613M9722
$$ 817647 820064 824171 829418 836206 845088 856665 872082 892882 920204 954497 996110 1045832
60494A045832N9001O9314P9821Q9102R5890R9806J00961R8847R2469Q1838O8633
$$ 1045832 1104833 1174147 1253968 1343070 1438960 1538766 1639727 1738574 1831043 1912881 1981514
60483A981514N4944M1940L0017J9426J0099J320p839j8108l0226m4819o1409p8034
$$ 1981514 2036458 2078398 2108415 2127841 2137940 2139260 2131421 2113313 2083087 2038268 1976859 1898825
60471A898825r2428j03194j09587j11097j08082j02147r4897q6701p7474o8113
$$ 1898825 1806397 1703203 1593616 1482519 1374437 1272290 1177393 1090692 1013218 945105
60461I45105n9992n3243m6806m0196l4227k9741k6509k3678k0693j7497j4484
$$ 945105 885113 831870 785064 744868 710641 680900 654391 630713 610020 592523 578039
60450E78039j2362j1530j1377j0759r317p809o892o231n153l739k748k688l233
$$ 578039 565677 554147 542770 532011 522694 514885 507993 501762 496609 492870 490122 487434 484201
60437D84201l557l028j732l81L51M29L24M06O53P98N01n12k107l561m072l511
$$ 484201 480644 477616 475884 475503 475854 476283 476607 477013 477666 478464 478965 478453 476346 472785 468713 465202
60421D65202k564k076k385l131l550l081j898p60k01q1n1m9j17j25q7l37q83j039
$$ 465202 462638 460562 458177 455046 451496 448415 446517 445757 445556 445475 445424 445375 445258 445133 445046 444709 443826 442787
60403D42787l17O80R59M87O9R4K11J69O9k34j049j966j952p76N15R39P12N21L95
$$ 442787 442470 443150 444109 444596 444665 444759 444970 445139 445208 444974 443925 441959 440007 439231 439746 440685 441397 441918 442313
60384D42313Lm31l65J33M19K62J71N92J238J443J017M51L11N15M49j27o26l93
$$ 442313 442316 441885 441520 441653 442072 442334 442505 443097 444335 445778 446795 447246 447557 448072 448521 448394 447768 447375
60366D47375K74M28j77o75k90O28J202J223J181J341J459J370J328J531J700J368
$$ 447375 447649 448077 447900 447225 446935 447563 448765 449988 451169 452510 453969 455339 456667 458198 459898 461266
60350D61266M72n25j017p00K19J230J892K090J955J650J315J082R57O89L0q36
$$ 461266 461738 461213 460196 459496 459715 460945 462837 464927 466882 468532 469847 470929 471886 472575 472605 471769
60334D71769j352j249r63j113j610j667q38L29R43Q50N83M18P4n06o66J91J610
$$ 471769 470417 469168 468205 467092 465482 463815 462977 463306 464249 465099 465682 466100 466174 465668 465002 465193 466803
60317D66803K379J842N72k74m9J004K208L140L844M519N159N741O620Q337J0937
$$ 466803 469182 471024 471596 471322 471273 472277 474485 477625 481469 485988 491147 496888 503508 511845 522782
60302E22782J3889J6972K0756K5701L0878L4223L4184L0787K5029J7672Q917r29
$$ 522782 536671 553643 574399 600100 630978 665201 699385 730172 755201 772873 781790 780861
60290G80861j0899j9588k5834k9121k9550k7682k4492k1083j8156j5726j3587
$$ 780861 769962 750374 724540 695419 665869 638187 613695 592612 574456 558730 545143
60279E45143j1800j0421q996p029m978m018m498n235m916l739k990l250l715l332
$$ 545143 533343 522922 513926 506897 501919 497901 493403 488168 483252 479513 476523 473273 469558 466226
60265D66226k076q52m72q36j139p78J3N39N39L76L62M47N72P99Q63K37r92j919
$$ 466226 464150 463298 462826 461990 460851 460073 460086 460625 461164 461540 461902 462349 462921 463720 464583 464820 463828 461909
60247D61909j928j424r70l47P53J735J726R26L42L59M33K23P4K79N98P81R50J245
$$ 461909 459981 458557 457587 457240 457993 459728 461454 462380 462722 463081 463514 463737 463811 464090 464688 465469 466419 467664
60229D67664J605K014K525K979L174L316L726M098L681K385J117P45J185J736
$$ 467664 469269 471283 473808 476787 479961 483277 487003 491101 494782 497167 498284 499029 500214 501950
60215E01950J965K011K236K748L173L045K557K567L446M315M095L032K365K583
$$ 501950 503915 505926 508162 510910 514083 517128 519685 522252 525698 530013 534108 537140 539505 542088
60201E42088K919K606J814J070N61K51R9j58q37j703k056j611q22j99J11K0n31
$$ 542088 545007 547613 549427 550497 551058 551309 551408 551250 550413 548710 546654 545043 544221 544022 544133 544153 543622
60184E43622j133j195q42q54j385j648j170o11p83j551k216k458k305j725p58
$$ 543622 542489 541294 540452 539598 538213 536565 535395 534784 534001 532450 530234 527776 525471 523746 522988
60169E22988K66J079J691J914J355J63p82r34p49q05q50m07K99P41R77J386J859
$$ 522988 523254 524333 526024 527938 529293 529456 528674 527740 526991 526186 525336 524929 525228 525969 526946 528332 530191
60152E30191K030K101K696L976N499O787P548P546O890O235O112O198N885N363
$$ 530191 532221 534322 537018 540994 546493 553280 560828 568374 575264 581499 587611 593809 599694 605057
60138F05057N359N824N730M445K674J640J725K269K471K092J369M89o73k343m349
$$ 605057 610416 616240 621970 626415 629089 630729 632454 634723 637194 639286 640655 641144 640471 638128 633779
60123F33779o054o783o348n096l602k355j554j104q71r02j174j329j020m66j98
$$ 633779 627725 620942 614594 609498 605896 603541 601987 600883 600012 599110 597936 596607 595587 595121 594923
60108E94923j66K83J388K524L089L301L753M575N456O124O326N694M146K233P27
$$ 594923 594757 595040 596428 598952 602041 605342 609095 613670 619126 625250 631576 637270 641416 643649 644376
60093F44376J9M3M79P36K23j002k162k619k433j860r09K34R99J225J602K664L831
$$ 644376 644395 644438 644917 645653 645876 644874 642712 640093 637660 635800 634891 635125 636124 637349 638951 641615 645446
60076F45446M129L463K436J268k37j972l499m653n534o134o554p170p905p850
$$ 645446 649575 653038 655474 656742 656505 654533 651034 646381 640847 634713 628159 620989 613084 605234
60062F05234o567n289n588p119q062p773p499q093q622q015o838o294o310n907
$$ 605234 598667 593378 587790 580671 572609 564836 557337 549244 540622 532607 525769 519475 513165 507258
60048E07258m928m237m221m186l378j954n67M31J123J572J633J189M61o2l7L74
$$ 507258 502330 498093 493872 489686 486308 484354 483787 484218 485341 486913 488546 489735 490196 490134 490097 490471
60032D90471P37Q31P63O44L64j73q63j508j965k219k427k882l640m273m364m197
$$ 490471 491208 492039 492802 493446 493810 493637 492774 491266 489301 487082 484655 481773 478133 473860 469496 465299
60016D65299m455n102n196m162k780k287k745k988k190q43L0J38J2J23M76R56
$$ 465299 460844 455742 450546 446384 443604 441317 438572 435584 433394 432551 432581 432719 432731 432854 433330 434286
60000D34286J566K172K455K406K532L221M083M400M085L743L768L893L721L294
$$ 434286 435852 438024 440479 442885 445417 448638 452721 457121 461206 464949 468717 472610 476331 479625
59986D79625K943K912L297L945M326L958L106K643K905L219K875K018J149K55
$$ 479625 482568 485480 488777 492722 497048 501006 504112 506755 509660 512879 515754 517772 518921 519176
59972E19176r34k185k899k919k584k183j792j469j124m05P65J784K126K186K681
$$ 519176 518242 516057 513158 510239 507655 505472 503680 502211 501087 500682 501447 503231 505357 507543 510224
59957E10224L387L358K362J218N42J03l94o70n54m91p69q45r3J043J432O23o67
$$ 510224 513611 516969 519331 520549 521091 521194 520800 520130 519576 519085 518316 517471 517378 518421 519853 520476 519809
59940E19809j454j412q76l67k23n35j178j872k275k121j467q00o95j171j520r85
$$ 519809 518355 516943 516067 515700 515477 514942 513764 511892 509617 507496 506029 505229 504534 503363 501843 500858
59924E00858L60J524J492K71j017j188j50J100J577J222O52L73L96M61L53J10
$$ 500858 501218 502742 504234 504505 503488 502300 502150 503250 504827 506049 506701 507074 507470 507931 508284 508394
59908E08394P8N60J315J680J337P03L28K70L73P42J496K340K846K981K945K769
$$ 508394 508472 509032 510347 512027 513364 514067 514395 514665 515038 515780 517276 519616 522462 525443 528388 531157
59892E31157K551K762L723M880N315M872M220L882L793L794L842L741L238K542
$$ 531157 533708 536470 540193 545073 550388 555260 559480 563362 567155 570949 574791 578532 581770 584312
59878E84312K188K314K613L013L722M524M708L970K704J221o70k948m944o091
$$ 584312 586500 588814 591427 594440 598162 602686 607394 611364 614068 615289 614619 611671 606727 600636
59864F00636o581o804o606n702m460l637l484l543l293k630j774j031o27n45n24
$$ 600636 594055 587251 580645 574943 570483 566846 563362 559819 556526 553896 552122 551091 550464 549919 549395
59849E49395k24N71J944L750N536O853P795R037J1076J3634J5776J6433J4890
$$ 549395 549171 549742 551686 555436 560972 567825 575620 584657 595733 609367 625143 641576 656466
59836F56466J1174O271J758j078j794p44J231L001L510K209p97m936r319j2975
$$ 656466 667640 673911 675669 674591 672797 672053 673284 676285 679795 682004 681207 676271 666952 653977
59822F53977j5333j6469j6599j5643j3757j1963j1353j1679j1504j0018p895o115
$$ 653977 638644 622175 605576 589933 576176 564213 552860 541181 529677 519659 511764 505649
59810E05649m758l471k469k298k867l452l536l269l013k796k287j296k57K6p21
$$ 505649 500891 497420 494951 492653 489786 486334 482798 479529 476516 473720 471433 470137 469880 469906 469185
59795D69185j777k303k380k558k688k095r22k83p38j612k194k682l317l568k992
$$ 469185 467408 465105 462725 460167 457479 455384 454462 454179 453441 451829 449635 446953 443636 440068 437076
59780D37076k198j939j860j132k7K68o68j963k626k537k100j603j114n57J75R44
$$ 437076 434878 432939 431079 429947 429920 430188 429520 427557 424931 422394 420294 418691 417577 417020 417195 418139
59764D18139J269R17L52J93M38P59J248K158L034L055K345K071K921M174M752
$$ 418139 419408 420325 420677 420870 421308 422067 423315 425473 428507 431562 433907 435978 438899 443073 447825
59749D47825M636M646N168N653N433M512L470K761K260J541M94m44q13p48q47
$$ 447825 452461 457107 462275 467928 473361 477873 481343 484104 486364 487905 488399 487955 487142 486394 485547
59734D85547j370j846j622p04J04J5q91j739j847j383r23n83j16L12J10p22j253
$$ 485547 484177 482331 480709 480005 480109 480124 479233 477494 475647 474264 473341 472758 472642 472954 473064 472342 471089
59717D71089p69K05N83J35m45o46o25n75k90L76J103J512J680J974K510L007L178
$$ 471089 470320 470525 471108 471243 470798 470152 469527 468952 468662 469038 470141 471653 473333 475307 477817 480824 484002
59700D84002L060K934K943K908K595K092J716J567J410J101Q14P04O40M66L14
$$ 484002 487062 489996 492939 495847 498442 500534 502250 503817 505227 506328 507142 507846 508486 508952 509266
59685E09266M04P40J178J585J715J233K15p01r53p55p16j005j279j299j197j156
$$ 509266 509670 510410 511588 513173 514888 516121 516336 515635 514682 513927 513211 512206 510927 509628 508431 507275
59669E07275j284j710k459l159l313k946k626k720k895k560j584l92O08J490K593
$$ 507275 505991 504281 501822 498663 495350 492404 489778 487058 484163 481603 480019 479627 480235 481725 484318
59654D84318L878M693M450L433K607K525K852L066L113L065K618J441k14j758
$$ 484318 488196 492889 497339 500772 503379 505904 508756 511822 514935 518000 520618 522059 521845 520087
59640E20087k953l904m597m895m917m920m864m478l772l096k702k510k265j739
$$ 520087 517134 513230 508633 503738 498821 493901 489037 484559 480787 477691 474989 472479 470214 468475
59626D68475r07j74j09o60j030p25k99m32q03p06m26r38k276l353l496l093k459
$$ 468475 467568 467394 467285 466625 465595 464870 464571 464139 463336 462630 462204 461266 458990 455637 452141 449048 446589
59609D46589j229N03J573J173J55q6M75P56L58j5J15K69o4o57j011j062r78p32
$$ 446589 445360 445863 447436 448609 448764 448678 449153 449909 450267 450252 450367 450636 450572 449915 448904 447842 446864 446132
59591D46132k41K61M16J66k30n42p06p04n13k34j06l60r66j569j735j410j013
$$ 446132 445891 446152 446568 446734 446504 445962 445256 444552 444039 443805 443699 443339 442373 440804 439069 437659 436646
59574D36646r82j290j621j908k307k683k567j857j127q89q54m13L94Q88O82Q5
$$ 436646 435664 434374 432753 430845 428538 425855 423288 421431 420304 419415 418561 418148 418542 419430 420112 420197
59558D20197m62p75o98r1O95R31N33M44J491L207M297M072K937J758J261J804
$$ 420197 419735 418960 418262 418171 418866 419797 420330 420774 422265 425472 429769 433841 436778 438536 439797 441601
59542D41601L116M435N441O705Q671J0685J2083J3828J7476K2234K4520K1325
$$ 441601 444717 449152 454593 461298 469969 480654 492737 506565 524041 546275 570795 592120
59530E92120J3219L440m978j0470j2517j1542r012o468m342k277l66P73R33N70
$$ 592120 605339 608779 603801 593331 580814 569272 560260 553792 549450 547173 546807 547580 548513 549083
59516E49083J12k79m31l35n84j846l879n676o672p182p542p563p037o161n254
$$ 549083 549195 548916 548485 548150 547566 545720 541841 536165 529493 522311 514769 507206 500169 494008 488754
59501D88754m417l788l702m281n130n628n423m583l490k601k053j595j093q18
$$ 488754 484337 480549 476847 472566 467436 461808 456385 451802 448312 445711 443658 442063 440970 440152
59487D40152r11q42JJ301K020J721J007N98N41N80P02R61J209J361J673K368L203
$$ 440152 439241 438399 438400 439701 441721 443442 444449 445047 445588 446168 446870 447831 449040 450401 452074 454442 457645
59470D57645L639L373K566J646R69N41J04l78m65K85J647K878L429L256K627K065
$$ 457645 461284 464657 467223 468869 469838 470379 470483 470105 469640 469925 471572 474450 477879 481135 483762 485827
59454D85827K310L779N967P803Q711Q940Q953Q956Q979Q880Q203O583M363K311
$$ 485827 488137 491916 497883 505686 514397 523337 532290 541246 550225 559105 567308 573891 578254 580565
59440E80565O49j109l281n531p383q594q957q324p105o060n379m532l366k530
$$ 580565 581214 580105 576824 571293 563910 555316 546359 538035 530930 524870 519491 514959 511593 509063
59426E09063k451k520j909o21P85K133L627N274O917Q601J0414J2172J3676J5107
$$ 509063 506612 504092 502183 501562 502347 504480 508107 513381 520298 528899 539313 551485 565161 580268
59412E80268J6831J9163K2422K6478K9598K8612K1471R644k711j2018j7167j8771
$$ 580268 597099 616262 638684 665162 694760 723372 744843 754487 751776 739758 722591 703820
59400G03820j7828j5164j1106n249K435R763J2673Q547j055j1649j9622k4135
$$ 703820 685992 670828 659722 654473 656908 666671 679344 687891 686836 675187 655565 631430
59388F31430k5831k5085k2152j8155j4743j2642j1104r022o279l806k435k004
$$ 631430 605599 580514 558362 540207 525464 512822 501718 492696 486417 482611 480176 478172
59376D78172j589n32Q34J588J373R65J445K858M155M557M405M415M602M593M530
$$ 478172 476583 476051 476885 478473 479846 480811 482256 485114 489269 493826 498231 502646 507248 511841 516371
59361E16371M842N252M968L992L371L809M771N452N960O933Q447R996J1230J2094
$$ 516371 521213 526465 531433 535425 538796 542605 547376 552828 558788 565721 574168 584164 595394 607488
59347F07488J2541J2746J3361J4841J6610J7625J7674J7474J7381J6805J5192
$$ 607488 620029 632775 646136 660977 677587 695212 712886 730360 747741 764546 779738
59336G79738J2867J0460Q052N397K615P2k197m358o162p088p189p320q223r692
$$ 779738 792605 803065 811117 816514 819129 819201 817004 812646 806484 799396 792207 784887 776664 766972
59322G66972j0889j1286j1024j0522j0034r629r285q920q453q011p883q169q526
$$ 766972 756083 744797 733773 723251 713217 703588 694303 685383 676930 668919 661036 652867 644341
59309F44341q410p554o154m568l026j591l04P65J620K399L336M620O259Q122J0074
$$ 644341 635931 628377 622223 617655 614629 613038 612734 613499 615119 617518 620854 625474 631733 639855 649929
59294F49929J2188J4776J8164K2120K5312K5548K1133J2427K002p011j2956j6151
$$ 649929 662117 676893 695057 717177 742489 768037 789170 801597 803599 796588 783632 767481
59282G67481j7722j8156j7068j4165j0201o655m437l100j616K99K028L161M122
$$ 767481 749759 731603 714535 700370 690169 683514 679077 675977 674361 674660 676688 679849 683971
59269F83971N458O995Q106Q502Q324P654O405M625K578N46j322l023m764o752
$$ 683971 689429 696424 704530 713032 721356 729010 735415 740040 742618 743164 741842 738819 734055 727303
59255G27303q768j0216j0900j1417j2369j3465j3753j2640j0368p738n707m898
$$ 727303 718535 708319 697419 686002 673633 660168 646415 633775 623407 615669 609962 605064
59243F05064n043n164m629l708k640r71J392L118K769R73l3Q62K615L893M517
$$ 605064 600021 594857 590228 586520 583880 582909 584301 587419 590188 591161 591128 591990 594605 598498 603015
59228F03015M555L428R91j522k862l479m679o509p667p454o632o151n911n278
$$ 603015 607570 610998 611989 610467 607605 604126 599447 592938 585271 577817 571185 565034 559123 553845
59214E53845m171l119k528k320k235k195k247k304k112j586r99o68n15j57N66
$$ 553845 549674 546555 544027 541707 539472 537277 535030 532726 530614 529028 528029 527361 526846 526689 527255
59199E27255J471K351L106L575L639L543L650L885L908L863M336N365O231O528
$$ 527255 528726 531077 534183 537758 541397 544940 548590 552475 556383 560246 564582 569947 576178 582706
59185E82706O784P505Q232Q192P427O605O008N442M903M638M603M414L905L237
$$ 582706 589490 596995 605227 613419 620846 627451 633459 638901 643804 648442 653045 657459 661364 664601
59171F64601K554J902J524J746K531L460M155M408M126L497L107L347L797L611
$$ 664601 667155 669057 670581 672327 674858 678318 682473 686881 691007 694504 697611 700958 704755 708366
59157G08366K578J366O04J04q04k494m690o639p530p071n810m708m306m415m612
$$ 708366 710944 712310 712914 713018 712214 709720 705030 698391 690861 683790 677980 673272 668966 664551 659939
59142F59939m744m823m705m221l525k990k668k102r25M54J139Q31K30J55N62R14
$$ 659939 655195 650372 645667 641446 637921 634931 632263 630161 629236 629690 630829 631660 631890 632045 632607 633521
59126F33521J223K040L352M289M294L966M290N369O495P212P677Q104Q424Q668
$$ 633521 634744 636784 640136 644425 648719 652685 656975 662344 668839 676051 683728 691832 700256 708924
59112G08924R142R872J0215R426P650N937N082M701L833K264P64j41r79k437m238
$$ 708924 718066 727938 738153 747579 755229 761166 766248 770949 774782 777046 777810 777669 776690 774253 770015
59097G70015n560o213o621o875o722o434o645p165o982n796m644m414m693m675
$$ 770015 764455 758242 751621 744746 738024 731590 724945 717780 710798 705002 700358 695944 691251 686576
59083F86576m476m698n327n951o580p311p617o937n773n254n681o351o803p298
$$ 686576 682100 677402 672075 666124 659544 652233 644616 637679 631906 626652 620971 614620 607817 600519
59069F00519p922q083p305n926m653l829l403l245l149k856k338j920j872k007
$$ 600519 592597 584514 577209 571283 566630 562801 559398 556153 553004 550148 547810 545890 544018 542011
59055E42011j906j463j114j383k265l084l180k662k217k162k023j257o2Q51J053
$$ 542011 540105 538642 537528 536145 533880 530796 527616 524954 522737 520575 518552 517295 517233 518084 519137
59040E19137P46M29M61Q27J208J426J778K580L418L481K766K238K423K602K091
$$ 519137 519883 520312 520773 521600 522808 524234 526012 528592 532010 535491 538257 540495 542918 545520 547611
59025E47611J593K398M560O831Q260R013R576J0026J0204J0065R528Q443O808
$$ 547611 549204 551602 556162 562993 571253 580266 589842 599868 610072 620137 629665 638108 644916
59012F44916M768K441R2j626k173j869j693k211l035l395k879j632j71R64J674
$$ 644916 649684 652125 652217 650591 648418 646549 644856 642645 639610 636215 633336 631704 631533 632497 634171
58997F34171K425L612M912N595N372M594L668K706J679N88n53j636k409k818l197
$$ 634171 636596 640208 645120 650715 656087 660681 664349 667055 668734 669322 668769 667133 664724 661906 658709
58982F58709l847m537m824m655m291l807l118k331j576o83N81K040L383M734O441
$$ 658709 654862 650325 645501 640846 636555 632748 629630 627299 625723 625040 625621 627661 631044 635778 642219
58967F42219Q357R912J0841J1414J2007J2867J4055J5098J4981J3236J0862R339
$$ 642219 650576 660488 671329 682743 694750 707617 721672 736770 751751 764987 775849 785188
58955G85188Q741P691N243J936j329m406p420j0030j1918j3448j5087j6455j6743
$$ 785188 793929 801620 806863 808799 807470 803064 795644 785614 773696 760248 745161 728706 711963
58942G11963j5913j4767j3779j2511j0461q008o077n058m527m038l710l709l599
$$ 711963 696050 681283 667504 654993 644532 636524 630447 625389 620862 616824 613114 609405 605806
58929F05806k741j288j46J18j76n43r37j359j538j526k036l430m826m998l888
$$ 605806 603065 601777 601631 601749 601573 601030 600093 598734 597196 595670 593634 590204 585378 580380 576492
58914E76492k492j425n10L99J021J288J569K030K382K539K976M056N497O767P717
$$ 576492 574000 572575 572065 572464 573485 574773 576342 578372 580754 583293 586269 590325 595822 602589 610306
58899F10306Q553R442J0318J0996J1297J1232J1019J0917J1065J1616J2735J4330
$$ 610306 618859 628301 638619 649615 660912 672144 683163 694080 705145 716761 729496 743826
58887G43826J6053J7760J9613K1463K2610K2591K1713K0378J8378J5459J1989
$$ 743826 759879 777639 797252 818715 841325 863916 885629 906007 924385 939844 951833
58876I51833Q347M189p73n662r273j1740j4216j6917j8681j8650j7349j5746j4201
$$ 951833 960180 964369 963596 957934 948661 936921 922705 905788 887107 868457 851108 835362 821161
58863H21161j2687j1323j0177r167q438q329q800r412r982j0574j0862j0348r435
$$ 821161 808474 797151 786974 777807 769369 761040 752240 742828 732846 722272 711410 701062 691627
58850F91627r304j0348j1417j1211r790q228p291o954o872o790o615o316n776
$$ 691627 682323 671975 660558 649347 639557 631329 624038 617084 610212 603422 596807 590491 584715
58837E84715m849l822l530m400n642o023n374m545m029l555l049k906l113l037
$$ 584715 579866 576044 572514 568114 562472 556449 551075 546530 542501 538946 535897 532991 529878 526841
58823E26841k512k182k322k209j168M60J887K814L259L189K750K428K492K754
$$ 526841 524329 522147 519825 517616 516448 516908 518795 521609 524868 528057 530807 533235 535727 538481
58809E38481L112L685M163L815K519J144M22J43j05k22j25l01j115k170k960l537
$$ 538481 541593 545278 549441 553256 555775 556919 557341 557484 557379 557157 557032 556731 555616 553446 550486 546949
58793E46949l953l738k706j683j534j884j734j016n78p04o04M47K131L549M241
$$ 546949 542996 539258 536552 534869 533335 531451 529717 528701 528123 527419 526815 527262 529393 532942 537183
58778E37183M491M755N072N067M489L546K550J438n5j914l944o037p860q672q189
$$ 537183 541674 546429 551501 556568 561057 564603 567153 568591 568536 566622 562678 556641 548781 540109 531920
58763E31920p404p528q194p948o441m849l813k520m64J257J530J010J087J927
$$ 531920 524516 516988 508794 500846 494405 489556 485743 483223 482759 484016 485546 486556 487643 489570
58749D89570K722L271M006M797M944M357L782L840M528N571O652P455Q041Q897
$$ 489570 492292 495563 499569 504366 509310 513667 517449 521289 525817 531388 538040 545495 553536 562433
58735E62433J0087J0731J0087Q808Q260Q762R346R223Q680Q367Q369Q191P280
$$ 562433 572520 583251 593338 602146 610406 619168 628514 637737 646417 654784 663153 671344 678624
58722F78624N448L033P78o53j032m46R03K569L950M782N341N905O363O505O266
$$ 678624 684072 687105 687883 687230 686198 685752 686655 689224 693174 697956 703297 709202 715565 722070 728336
58707G28336N499L964J825l68k435m714p238r472j1296j3331j5757j7596j8016
$$ 728336 733835 737799 739624 739256 736821 732107 724869 715397 704101 690770 675013 657417 639401
58694F39401j7592j7352j7174j6228j4522j2930j1811j0708r373q141p176o154
$$ 639401 621809 604457 587283 571055 556533 543603 531792 521084 511711 503570 496394 490240
58682D90240m956m024l755l945m025l577k673j880j803k361k714k183r49L93J592
$$ 490240 485284 481260 477505 473560 469535 465958 463285 461405 459602 457241 454527 452344 451395 451788 453380
58667D53380K680L613M453N592P253R071J0493J1284J1255R981P412M273J318
$$ 453380 456060 459673 464126 469718 476971 486042 496535 507819 519074 529055 536467 540740 542058
58654E42058j369l783n233n050l741k613k394k853l585m305m623m288l716l578
$$ 542058 540689 536906 531673 526623 522882 520269 517875 515022 511437 507132 502509 498221 494505 490927
58640D90927l843l829l141j998o86O56J745K259K409K814L590L980L118J054j079
$$ 490927 487084 483255 480114 478116 477430 478086 479831 482090 484499 487313 490903 494883 498001 499055 497976
58625D97976j950j139M66J589J844J929K564L755N162O557P628P899P268O193
$$ 497976 496026 494887 495353 496942 498786 500715 503279 507034 512196 518753 526381 534280 541548 547741
58611E47741N080L936K861K214J908J250j9j197j647j718k036k499k698k737k943
$$ 547741 552821 556757 559618 561832 563740 564990 564971 563774 562127 560409 558373 555874 553176 550439 547496
58596E47496l246l500l901m397m244k931j021O38K014L484M879N912P009Q668
$$ 547496 544250 540750 536849 532452 528208 525277 524256 524894 526908 530392 535271 541183 548192 556860
58582E56860J0403J1318J1508J1861J2540J2651J1480R363P157N438M281L454
$$ 556860 567263 578581 590089 601950 614490 627141 638621 647984 655141 660579 664860 668314
58570F68314K807K636L393M875O246P143Q123R695J1639J3643J5731J7542J8243
$$ 668314 671121 673757 677150 682025 688271 695414 703537 713232 724871 738514 754245 771787 790030
58557G90030J7810J7347J7220J6074J2858Q682N258K507n98l634n210n475o147
$$ 790030 807840 825187 842407 858481 871339 880021 885279 887786 887188 883554 878344 872869 866722
58544H66722p866r327r436q852q869r903j1570j3348j4707j5290j5332j5387j5505
$$ 866722 858856 849529 840093 831241 822372 812469 800899 787551 772844 757554 742222 726835 711330
58531G11330j5233j4343j2993j1291r279p189n173l111j225l31o88j251r65k13
$$ 711330 696097 681754 668761 657470 648191 641002 635829 632718 631493 631162 630474 629223 628258 628045
58517F28045O2J26R93K567L639L598K949K221J530J211J595K145J863P18k98o56
$$ 628045 628107 628233 629226 631793 635432 639030 641979 644200 645730 646941 648536 650681 652544 653262 652964 652308
58501F52308q47j413k231k908l218l148k999l217l626l377k298j552k027k796
$$ 652308 651461 650048 647817 644909 641691 638543 635544 632327 628701 625324 623026 621474 619447 616651
58487F16651k428j113j46K46J031K603M308N639O614P115P029P032P985R635J0857
$$ 616651 614223 613110 612964 613210 614241 616844 621152 626791 633405 640520 647549 654581 662566 672201 683058
58472F83058J1025J0256Q696O575M493K659M17k418m571n014m685m942n208m049
$$ 683058 694083 704339 713035 719610 724103 726762 727179 724761 720190 715176 710491 705549 700341 696292
58458F96292j858l50R2M92J029J020Q86J889L854N218N443N324M846L027J35k117
$$ 696292 694434 694084 694176 694668 695697 696717 697603 699492 703346 708564 714007 719331 724177 727204 727339 725222
58442G25222l020l481l894l498k302j542j522r91O81K443L353L702L849L600L255
$$ 725222 722202 718721 714827 711329 709027 707485 705963 704972 705653 708096 711449 715151 719000 722600 725855
58427G25855L615M523N032N284O403Q225R221R037R003R573R489Q157O670N600
$$ 725855 729470 733993 739025 744309 750712 758937 768158 777195 786198 795771 805260 813417 820087 825687
58413H25687L940J289j037k155l009m456n729o046o018o325o488o049n528n206
$$ 825687 829627 830916 829879 827724 824715 820259 814530 808484 802466 796141 789653 783604 778076 772870
58399G72870m441k999j650o65O88K408L250K754K106K221K614K856L309L645K712
$$ 772870 768429 765430 763780 763115 763803 766211 769461 772215 774321 776542 779156 782012 785321 788966 791678
58384G91678Q02PJ237K847L336L382L981M619M775N358P078Q884R567R463R319
$$ 791678 792480 792487 793724 796571 799907 803289 807270 811889 816664 822022 829100 837984 847551 857014 866333
58369H66333Q957Q219P760P789P457O608O450P529Q696R068R258R747R904R609
$$ 866333 875290 883509 891269 899058 906515 913123 919573 927102 935798 944866 954124 963871 973775 983384
58355I83384R832J0547J0172Q241O448N873N490M639M496N537O106N356N105O765
$$ 983384 993216 1003763 1013935 1022176 1028624 1034497 1039987 1044626 1049122 1054659 1060765 1066121 1071226 1077991
58341A077991Q755R209R005R761J0877J1053J0986J2049J3759J4884J5648J6730
$$ 1077991 1086746 1095955 1104960 1114721 1125598 1136651 1147637 1159686 1173445 1188329 1203977 1220707
58329A220707J7447J6988J6133J5810J5421J4299J3199J2581J1260Q729O859P148
$$ 1220707 1238154 1255142 1271275 1287085 1302506 1316805 1330004 1342585 1353845 1362574 1369433 1376581
58317A376581Q106P628O230N681O056O479P139Q419R559J0225J1715J4568J6832
$$ 1376581 1384687 1392315 1398545 1404226 1410282 1416761 1423900 1432319 1441878 1452103 1463818 1478386 1495218
58304A495218J6896J6110J6372J7125J7152J7322J8845K0683K1326K1344K1672
$$ 1495218 1512114 1528224 1544596 1561721 1578873 1596195 1615040 1635723 1657049 1678393 1700065
58293A700065K1338J9571J8230J9237K1417K2690K3472K5103K6792K7249K7503
$$ 1700065 1721403 1740974 1759204 1778441 1799858 1822548 1846020 1871123 1897915 1925164 1952667
58282A952667K8981L0581L0732L0582L1939L3737L3878L2953L2923L3655L3945
$$ 1952667 1981648 2012229 2042961 2073543 2105482 2139219 2173097 2206050 2238973 2272628 2306573
58271B306573L4416L6260L8606M0174M1833M4658M7478M9276N1709N6048O0143
$$ 2306573 2340989 2377249 2415855 2456029 2497862 2542520 2589998 2639274 2690983 2747031 2807174
58260B807174O1949O3377O6758P0218P0877P0146P1214P3571P4728P5306P7572
$$ 2807174 2869123 2932500 2999258 3069476 3140353 3210499 3281713 3355284 3430012 3505318 3582890
58249C582890Q0898Q3470Q6613R2554R9675J04922J09133J15127J22413J28756
$$ 3582890 3663788 3747258 3833871 3926425 4026100 4131022 4240155 4355282 4477695 4606451
58239D606451J34954J43002J51632J58867J66651J77583J89571J99502K09535
$$ 4606451 4741405 4884407 5036039 5194906 5361557 5539140 5728711 5928213 6137748
58230F137748K23574K40169K55519K70841K89794L11146L31432L52469L78690
$$ 6137748 6361322 6601491 6857010 7127851 7417645 7728791 8060223 8412692 8791382
58221H791382M09308M40836M74796N14725N58437O02076O49168P06171P72008
$$ 8791382 9200690 9641526 10116322 10631047 11189484 11791560 12440728 13146899 13918907
58212A3918907Q42096R19945J013768J124393J248385J390665J561578J764214
$$ 13918907 14761003 15680948 16694716 17819109 19067494 20458159 22019737 23783951
58204B3783951J998429K275186K612677L021745L511974M109698M851595N763186
$$ 23783951 25782380 28057566 30670243 33691988 37203962 41313660 46165255 51928441
58196E1928441O864589Q194890R807117J1742835J4042067J6778074K0048051
$$ 51928441 58793030 66987920 76795037 88537872 102579939 119358013 139406064
58189A39406064K3922130K8401716L3314111L8013091M1060387M0422106L4458843
$$ 139406064 163328194 191729910 225044021 263057112 304117499 344539605 378998448
58182C78998448K3141051Q442519o532069j9010921k7513822l1853686l2612378
$$ 378998448 402139499 410582018 404049949 385039028 357525206 325671520 293059142
58175B93059142l0724366k7333327k3655742k0660929j8738968j7665685j6917947
$$ 293059142 262334776 235001449 211345707 190684778 171945810 154280125 137362178
58168A37362178j6064493j4938731j3569882j2056280j0507897r030328p697477
$$ 137362178 121297685 106358954 92789072 80732792 70224895 61194567 53497090
58161E3497090o533256n531343m683051l977212l390274k896256k481579k138866
$$ 53497090 46963834 41432491 36749440 32772228 29381954 26485698 24004119 21865253
58153B1865253j853874j610789j404426j235296j097015r79102q78326p96848
$$ 21865253 20011379 18400590 16996164 15760868 14663853 13684751 12806425 12009577
58145A2009577p31778o75642o25056n80636n40199m99660m59253m22030l87619
$$ 12009577 11277799 10602157 9977101 9396465 8856266 8356606 7897353 7475323 7087704
58136G087704l53444l20378k91442k66735k45006k28131k18348k12885k06750
$$ 7087704 6734260 6413882 6122440 5855705 5610699 5382568 5164220 4951335 4744585
58127D744585j99149j92088j84654j74214j61768j50734j41527j32133j22823
$$ 4744585 4545436 4353348 4168694 3994480 3832712 3681978 3540451 3408318 3285495
58118C285495j15479j09415j02488r5423r0554q7270q3038p8036p4508p2368o9545
$$ 3285495 3170016 3060601 2958113 2862690 2772136 2684866 2601828 2523792 2449284 2376916 2307371
58107B307371o5976o3296o1317n8652n6042n5293n5576n4512n2217n0638m9650
$$ 2307371 2241395 2178099 2116782 2058130 2002088 1946795 1891219 1836707 1784490 1733852 1684202
58096A684202m7547m4743m3219m2662m0832l7457l4386l2051k9138k5643k3072
$$ 1684202 1636655 1591912 1548693 1506031 1465199 1427742 1393356 1361305 1332167 1306524 1283452
58085A283452k1669k0354j9171j9038j9499j9469j9717k1632k4065k4553k3281
$$ 1283452 1261783 1241429 1222258 1203220 1183721 1164252 1144535 1122903 1098838 1074285 1051004
58074A051004k2707k3425k3599k2394k0943j9731j8028j6156j5486j5824j5409
$$ 1051004 1028297 1004872 981273 958879 937936 918205 900177 884021 868535 852711 837302
58063H37302j3863j2646j2271j1546r984q727q534q845r191r781j0443j0669j0748
$$ 837302 823439 810793 798522 786976 776992 768265 759731 750886 741695 731914 721471 710802 700054
58050G00054j1247j1592j0857r556q892q702q056p323p478p946p413o372o458
$$ 700054 688807 677215 666358 656802 647910 639208 631152 623829 616351 608405 600992 594620 588162
58037E88162p604q233q013p979q152p545o520o514p373p465o610o381p211p735
$$ 588162 580558 572325 564312 556333 548181 540636 534116 527602 520229 512764 506154 499773 492562 484827
58023D84827p415p387q110q479p934p325p053o418n392m982n261n031l989l261
$$ 484827 477412 470025 461915 453436 445502 438177 431124 424706 419314 414332 409071 404040 400051 396790
58009C96790l202k803j866j620k317k403j130K8j81q23n80P1M0l78j57P21J501
$$ 396790 393588 390785 388919 387299 384982 382579 381449 381477 381296 380473 379893 379964 380004 379626 379469 380190 381691
57992C81691J951K284K390K013J297N71J4j74R0L00k46j376k219k517k825l341
$$ 381691 383642 385926 388316 390329 391626 392197 392211 392037 392127 392427 392181 390805 388586 386069 383244 379903
57976C79903l579l341k971k520j713q74o78r11o33J90N79K67K17R88J847J949
$$ 379903 376324 372983 370012 367492 365779 364905 364227 363316 362683 362873 363452 363719 363936 364924 366771 368720
57960C68720J358M86m23r40o94k68p75k232l519m136m691n393n494m760m064l871
$$ 368720 370078 370564 370141 369201 368507 368239 367464 365232 361713 357577 352886 347493 341999 337239 333175 329304
57944C29304l428k301j420j686k470k503j589m88K80Q58J639K942M760O517P536
$$ 329304 325876 323575 322155 320469 317999 315496 313907 313419 313699 314557 316196 319138 323898 330415 337951
57929C37951P809P788P503O683N733N432N601N089L411J392j63j381k633l834
$$ 337951 345760 353548 361051 367734 373467 378899 384500 389589 393000 394392 394229 392848 390215 386381
57915C86381m874n861o606o695o321o225o561o676o226n581n054m692m817n629
$$ 386381 381507 375646 369040 362345 356024 349799 343238 336562 330336 324755 319701 315009 310192 304563
57901C04563o239n440l698k902l780n007n341n146n110m995m541m282m397l926
$$ 304563 298324 292884 289186 286284 282504 277497 272156 267010 261900 256905 252364 248082 243685 239759
57887B39759k293n59nl83o64o91q98j041n29L78Q37O78M99O68R71J103Q51j1j473
$$ 239759 237466 236907 236902 236519 235855 235164 234266 233225 232696 233074 233911 234589 235088 235756 236727 237830 238681 238670 237197
57868B37197l050m138m487m127l245k312j840j789j715j540j573j667j243l14
$$ 237197 234147 230009 225522 221395 218150 215838 213998 212209 210494 208954 207381 205714 204471 204157
57854B04157M27P93J442K642L769M460N228O392P407P872Q119Q188P446N952M980
$$ 204157 204584 205377 206819 209461 213230 217690 222918 229310 236717 244589 252708 260896 268342 274294 279274
57839B79274N168N325M293K816K141J799M57j669l063l210l008k998k827k555
$$ 279274 284442 289767 294060 296876 299017 300816 301273 299604 296541 293331 290323 287325 284498 281943
57825B81943k931l991m696m410l646k954k157j178o20q13j074o63N1J88l08n80
$$ 281943 279012 275021 270325 265915 262269 259315 257158 255980 255360 254547 253473 252810 252861 253049 252741 252161
57809B52161n0Q60J205L71j524l702n177n430m766m019l760l862l842l461k871
$$ 252161 252111 252971 254176 254547 253023 249321 244144 238714 233948 229929 226169 222307 218465 215004 212133
57794B12133k193j380n37j07l48q46q97l08N88J537K511L269L365K694J625N23
$$ 212133 209940 208560 208023 207916 207568 206722 205825 205517 206105 207642 210153 213422 216787 219481 221106 221629
57778B21629m79j183j304r14m41j47K7J29J99N79J563K698L142K846K582K594
$$ 221629 221150 219967 218663 217749 217308 217161 217188 217317 217516 218095 219658 222356 225498 228344 230926 233520
57762B33520K105N31j636l738n940q601j1215j2788j2907j1816r817p266m804
$$ 233520 235625 236156 234520 230782 224842 216241 205026 192238 179331 167515 157698 150432 145628
57749A45628k898j328L02J724K352K295K356K973L679L781L149K173J274N36j94
$$ 145628 142730 141402 141704 143428 145780 148075 150431 153404 157083 160864 164013 166186 167460 167996 167802
57734A67802r58j482j403p77r2K80M39P54J445K389L108L030K117J124Q66J210
$$ 167802 166844 165362 163959 163182 163090 163370 163809 164563 166008 168397 171505 174535 176652 177776 178642 179852
57718A79852J343R89O88Q33J109J121R62P73L71l66j188j856k336k470k056j487
$$ 179852 181195 182184 182872 183705 184814 185935 186897 187670 188041 187675 186487 184631 182295 179825 177769 176282
57702A76282j561k275k509j536j38M32P0l03j54J96K94J25m9j9J83K38j14o27
$$ 176282 174721 172446 169937 168401 168263 168695 168765 168462 168308 168504 168798 168923 168874 168855 169038 169276 169162 168535
57684A68535p44l45J66O15J299K313L304M207N575P785J0568J3734J7615K2429
$$ 168535 167791 167446 167612 168227 169526 171839 175143 179350 184925 192710 203278 217012 234627 257056
57670B57056K7966L4434M2799N3683O6690Q1105R5683J06570J06913R1030N9466
$$ 257056 285022 319456 362255 415938 482628 563733 659416 765986 872899 963929 1023395
57659A023395J9091k1434n5441p8865r0195r0983q5145p6412o6635n6522m6938
$$ 1023395 1042486 1021052 965611 886746 796551 705568 620423 544011 477376 420854 373916
57648C73916l8734l2005k6273k1220j6931j3607j1322r808q386o467m208k415
$$ 373916 335182 303177 276904 255684 238753 225146 213824 204016 195630 189163 184955 182540
57636A82540j680j885k459k783k417j400l85n3l18m57l1O63J105J077O80J67j87
$$ 182540 180860 178975 176516 173733 171316 169916 169531 169478 169160 168703 168672 169335 170440 171517 172197 172364 172177
57619A72177l38n84j159j774j872j336o07j25N4J62M82J053J376P73o84j916k064
$$ 172177 171839 171255 170096 168322 166450 165114 164507 164382 164436 164598 165080 166133 167509 168282 167598 165682 163618
57602A63618j594j571k147k596k602k611k830k838k479k249k477k754k695k634
$$ 163618 162024 160453 158306 155710 153108 150497 147667 144829 142350 140101 137624 134870 132175 129541
57588A29541l032l646l885l660l380l226k969k495k064j962k120k213j999j486
$$ 129541 126509 122863 118978 115318 111938 108712 105743 103248 101184 99222 97102 94889 92890 91404
57574I1404r01n25n59j000j599j970j928j684j621j837k119k320k463k409j859
$$ 91404 90503 89978 89419 88419 86820 84850 82922 81238 79617 77780 75661 73341 70878 68469 66610
57559F6610r35l34n14j031j133o96j55K25N16O98O49M67L67L43L31N63J179J689
$$ 66610 65675 65341 64827 63796 62663 61967 61812 62037 62553 63251 63900 64367 64734 65077 65408 65971 67150 68839
57541F8839J442O04L0O8K30K24M85J310K089J984J023J7m46m20k25r9j48l19m32
$$ 68839 70281 70885 70915 70983 71213 71437 71922 73232 75321 77305 78328 78345 77899 77479 77254 77155 77007 76688 76256
57522G6256l99m38q15j374j584j133l33J26j83j018j691j694j137o41p39j375
$$ 76256 75857 75419 74604 73230 71646 70513 70180 70306 70123 69105 67414 65720 64583 63942 63203 61828
57506F1828j988k075j743j585k036k936l820m433m751m647l961k954k229k022
$$ 61828 59840 57765 56022 54437 52401 49465 45645 41212 36461 31814 27853 24899 22670 20648
57492B0648j953j637j137n96J86J347K517L227L601M125M809N063M487L430K590
$$ 20648 18695 17058 15921 15325 15511 16858 19375 22602 26203 30328 35137 40200 44687 48117 50707
57477E0707K309K399K503K526K639K892K943K390J350M35Q3K34P05J405K054K120
$$ 50707 53016 55415 57918 60444 63083 65975 68918 71308 72658 73093 73176 73410 74115 75520 77574 79694
57461G9694J425M49k56o08p52o90n80q29j381j446o28J12n11k237l367k806j227
$$ 79694 81119 81568 81312 80704 79952 79262 78682 77853 76472 75026 74398 74510 73999 71762 68395 65589 64362
57444F4362m1J33l83j017j372j266q01l18n0J34N32J214J838J878J115l5q42j004
$$ 64362 64321 64454 64071 63054 61682 60416 59615 59297 59247 59381 59913 61127 62965 64843 65958 65923 65081 64077
57426F4077q47p59p16o20o24q02q08l64J57J82k34n50o04p98j382k033k250j897
$$ 64077 63230 62471 61755 61135 60511 59709 58901 58537 58694 58876 58642 58092 57488 56690 55308 53275 51025 49128
57408D9128j235o67l93k39J31P03J064J006P60M41k56j366k199k076j220l03M77
$$ 49128 47893 47226 46833 46594 46725 47428 48492 49498 50258 50699 50443 49077 46878 44802 43582 43279 43756
57391D3756J275J883J912J495J134R58P32M53L19K68J92L50R26J438J264N70q2
$$ 43756 45031 46914 48826 50321 51455 52413 53145 53598 53917 54185 54377 54727 55653 57091 58355 58925 58843
57374E8843o88j492k037j653p25l11m60j69P97J368Q84J32N2M20N59M90O40R37
$$ 58843 58155 56663 54626 52973 52248 51937 51477 51308 52105 53473 54357 54489 54541 54961 55520 56010 56650 57587
57356E7587J073J077J082Q59K85j48J03Q38J327J152M45m15r98j031p19o06q95
$$ 57587 58660 59737 60819 61678 61963 61815 61918 62756 64083 65235 65680 65265 64267 63236 62517 61911 61016
57339F1016j183j125r37r59j089r54m48K01O93Q67Q60R85J155P05o99k188k529
$$ 61016 59833 58708 57771 56812 55723 54769 54321 54522 55215 56082 56942 57927 59082 59787 59088 56900 54371
57322E4371j745j039j019j085p31l58l08j76K78M27j63p64m98K62L81n01j655
$$ 54371 52626 51587 50568 49483 48752 48394 48086 47910 48188 48615 48452 47688 47190 47452 47833 47332 45677
57305D5677k174j596o5J557K116J392M83M97J204J633J440J013O51M25M79P37
$$ 45677 43503 41907 41842 43399 45515 46907 47390 47887 49091 50724 52164 53177 53828 54253 54732 55469
57289E5469O35j25r04j011q68j409k614l556l870m153m834n466n421m703l866
$$ 55469 56104 55979 55075 54064 53196 51787 49173 45617 41747 37594 32760 27294 21873 17170 13304
57274A3304l476l708A980b025l027j762q26l2J078K256a515A165K381K214K039
$$ 13304 9828 6120 1980 -2025 -5052 -6814 -7640 -7672 -6594 -4338 -1515 1165 3546 5760 7799
57259G799J846J798J811J690J645J943K221J929J372J407K095K630K628K543K541
$$ 7799 9645 11443 13254 14944 16589 18532 20753 22682 24054 25461 27556 30186 32814 35357 37898
57244C7898K050Q39l32p28n01o7O16J471J780J075M7l03m3J2k55q6Q62J890K229
$$ 37898 39948 40787 40455 39727 39226 39159 39775 41246 43026 44101 44148 43845 43802 43814 43559 43473 44335 46225 48454
57225D8454J965J725J804K013K086J973J773J610J538J496J370J098O81J82k12
$$ 48454 50419 52144 53948 55961 58047 60020 61793 63403 64941 66437 67807 68905 69586 69768 69556
57210F9556j32O55J836K670K731K382K228K274K020J396J136J813K981L749M044
$$ 69556 69424 70079 71915 74585 77316 79698 81926 84200 86220 87616 88752 90565 93546 97295 101339
57195A01339M594N663O507O475O066O373P686R154R791R489R023R233J0214J1274
$$ 101339 105933 111596 118103 124578 130644 137017 144703 153857 163648 173137 182160 191393 201607 212881
57181B12881J1704J1486J1077J0694J0265R999J0274J0909J1200J1033J1094J1673
$$ 212881 224585 236071 247148 257842 268107 278106 288380 299289 310489 321522 332616 344289
57169C44289J2060J1806J1738J2705J3941J3941J2675J1704J2002J2806J2947
$$ 344289 356349 368155 379893 392598 406539 420480 433155 444859 456861 469667 482614
57158D82614J2370J1905J2194J3265J4617J5458J5278J4473J3969J4155J4623
$$ 482614 494984 506889 519083 532348 546965 562423 577701 592174 606143 620298 634921
57147F34921J4952J5120J5088J4677J4099J3855J3859J3363J2148J1025J0751
$$ 634921 649873 664993 680081 694758 708857 722712 736571 749934 762082 773107 783858
57136G83858J1067J1426J2055J3591J5976J8369K0055K0998K1701K2823K4636
$$ 783858 794925 806351 818406 831997 847973 866342 886397 907395 929096 951919 976555
57125I76555K6632K8006K8808L0148L2858L6527M0303M4045M7992N1910N5556
$$ 976555 1003187 1031193 1060001 1090149 1123007 1159534 1199837 1243882 1291874 1343784 1399340
57114A399340N9611O5032P1588P8141Q4535R2149J02169J14244J27460J41943
$$ 1399340 1458951 1523983 1595571 1673712 1758247 1850396 1952565 2066809 2194269 2336212
57104B336212J58845J79304K04233K34897K73020L20350L78664M50115N36896
$$ 2336212 2495057 2674361 2878594 3113491 3386511 3706861 4085525 4535640 5072536
57095E072536O40331P60479Q96511J046834J208516J376782J545414J707589J856378
$$ 5072536 5712867 6473346 7369857 8416691 9625207 11001989 12547403 14254992 16111370
57086A6111370J984855K086025K152663K177187K152203K072147J935105J743346
$$ 16111370 18096225 20182250 22334913 24512100 26664303 28736450 30671555 32414901
57078C2414901J501644J214420Q84125N13183J09107l11157p22293j097528j416645
$$ 32414901 33916545 35130965 36015090 36528273 36637380 36326223 35603930 34506402 33089757
57069C3089757j669799j856314j981237k052005k075673k057367k000870j910636
$$ 33089757 31419958 29563644 27582407 25530402 23454729 21397362 19396492 17485856
57061A7485856j792906j655089j504882j350065j197974j054113r21512q01675
$$ 17485856 15692950 14037861 12532979 11182914 9984940 8930827 8009315 7207640
57053G207640o95683o03809n24881m57011l98869l49635l08068k72485k41545
$$ 7207640 6511957 5908148 5383267 4926256 4527387 4177752 3869684 3597199 3355654
57044C355654k14476j90719j69997j52485j38084j25689j14056j03278r4444q7733
$$ 3355654 3141178 2950459 2780462 2627977 2489893 2364204 2250148 2146870 2052426 1964693
57034A964693q1810p5398o8515o1813n5447m9056m2233l4659k6198j7044p287
$$ 1964693 1882883 1807485 1738970 1677157 1621710 1572654 1530421 1495762 1469564 1452520 1445233
57023A445233L817J7520L4544N4825P7511R9217J12056J06175P6974K9950k2578
$$ 1445233 1449050 1466570 1501114 1555939 1633450 1732667 1844723 1950898 2027872 2057822 2035244
57012B035244o9252j04042j25271j33582j31573j23315j12471j00806q8720p6614
$$ 2035244 1965992 1861950 1736679 1603097 1471524 1348209 1235738 1134932 1046212 969598
57002I69598o5257n5289m6816l9494l3042k7658k3730k0947j8219j4930j1867
$$ 969598 904341 849052 802236 762742 729700 702042 678312 657365 639146 624216 612349
56991F12349j0143r521q643o701m077j426J012L103M731O095P295P563N744J859
$$ 612349 602206 592685 584042 577341 573264 571838 572850 575953 580684 586779 594074 601637 607381 609240
56977F09240k706o754j0186j3034j4675j4701j3726j2565j1197r370p562o434
$$ 609240 606534 599780 589594 576560 561885 547184 533458 520893 509696 500326 492764 486330
56965D86330n680m395k390k84J660L870O583R419J1960J4069J5273J4532J1038
$$ 486330 480650 476255 473865 473581 475241 479111 485694 495113 507073 521142 536415 550947 561985
56952E61985N087k166r413j5503j9569k1380k1485k0649j9211j7139j4540j1768
$$ 561985 567072 564906 555493 539990 520421 499041 477556 456907 437696 420557 406017 394249
56940C94249r072o502m121k009JK286N029Q088J1436J5247J9197K1929K1792J8109
$$ 394249 385177 378675 374554 372545 372546 374832 379861 387949 399385 414632 433829 455758 477550 495659
56926D95659J1491L042o108j4552k0825k4336k5640k5391k3639k0672j7819j6299
$$ 495659 507150 510192 504084 489532 468707 444371 418731 393340 369701 349029 331210 314911
56914C14911j5548j3821j0550p122m986l971l044j939j248j287j579j419m58J059
$$ 314911 299363 285542 274992 267870 262884 258913 255869 253930 252682 251395 249816 248397 247939 248998
56900B48998K422K985K966L298M470N859O682P151Q081R692J1391J2590J3149
$$ 248998 251420 254405 257371 260669 265139 270998 277680 284831 292912 302604 313995 326585 339734
56887C39734J3264J3492J4581J6447J7431J5538J0548M115k226q096j3093j5967
$$ 339734 352998 366490 381071 397518 414949 430487 441035 445150 442924 434828 421735 405768
56875D05768j5957j4240j2807j2204j1264q950n429j412K667O541J0016J3404
$$ 405768 389811 375571 362764 350560 339296 330346 324917 323505 326172 332713 342729 356133
56863C56133J7479K2525K7972L3289L8551M3336M5525M2308L2737J8736L549j0307
$$ 356133 373612 396137 424109 457398 495949 539285 584810 627118 659855 678591 682140 671833
56851F71833k1476k9157l2987l3338l1089k7054k1880j6293j0872n576J37O564
$$ 671833 650357 621200 588213 554875 523786 496732 474852 458559 447687 442111 442248 448812
56839D48812J3462K0591K8139L6451M5637N5495O5328P3368P6606P1897N7698
$$ 448812 462274 482865 511004 547455 593092 648587 713915 787283 863889 935786 993484
56828I93484L5156P881j9269m1845n7173o4817o6045o2969n7727n1693m4993l7100
$$ 993484 1028640 1036521 1017252 975407 918234 853417 787372 724403 666676 614983 569990 532890
56816E32890k8141j9232j1315m103L254J0884J8330K5683L3716M2537N0624N5334
$$ 532890 504749 485517 474202 470099 473353 484237 502567 528250 561966 604503 655127 710461
56804G10461N4114M5413K9430Q570j3130l1751m4936n2087n3866n1766m7608m2658
$$ 710461 764575 809988 839418 847988 834858 803107 758171 706084 652218 600452 552844 510186
56792E10186l7176l0994k4360j8003j2520q024m195m48L884R150J5058K0827K5581
$$ 510186 473010 442016 417656 399653 387133 379109 374914 374466 378350 387500 402558 423385 448966
56779D48966K8428K8315K4256J6028M788p219j7785k5781l1116l3822l3684l1059
$$ 448966 477394 505709 529965 545993 550781 543562 525777 499996 468880 435058 401374 370315
56767C70315k7455k4512k2404k0024j6830j3708j1652j0423r114p514o122n172
$$ 370315 342860 318348 295944 275920 259090 245382 233730 223307 214193 206679 200557 195385
56755A95385m398l612k891k282j867j993k816l705l788l146k720k986l416l422
$$ 195385 190987 187375 184484 182202 180335 178342 175526 171821 168033 164887 162167 159181 155765 152343
56741A52343l121k798k279j443q25r98j593j646q82j10j37p72j131p05J32O55
$$ 152343 149222 146424 144145 142702 141877 140879 139286 137640 136758 136648 136511 135739 134608 133903 134035 134690
56725A34690O14M38O14J060J275J079Q60R72J202J085N58nk90l29k80k74m67r35
$$ 134690 135304 135742 136356 137416 138691 139770 140630 141602 142804 143889 144447 144442 144152 143823 143543 143269 142802 141867
56707A41867j436j500r52j61L41L85J19l34r08j392j517j289r76o97l03K46O70
$$ 141867 140431 138931 137979 137818 138159 138544 138663 138329 137421 136029 134512 133223 132247 131550 131247 131493 132163
56690A32163P84Q57J199J589J544J058O42N97P55J018J641K713L748M172L963
$$ 132163 132947 133804 135003 136592 138136 139194 139836 140433 141188 142206 143847 146560 150308 154480 158443
56675A58443L488L074K988L477M309M649L906K593J727J574J591J510J620J903
$$ 158443 161931 165005 167993 171470 175779 180428 184334 186927 188654 190228 191819 193329 194949 196852
56661A96852J697O47o87j579k011k360k649k683k572k558k539k320k174k534l198
$$ 196852 198549 199196 198509 196930 194919 192559 189910 187227 184655 182097 179558 177238 175064 172530 169332
56646A69332l443k993k344j940j588r68k72J41M46J199K484L700M275M267L997
$$ 169332 165889 162896 160552 158612 157024 156056 155784 155925 156371 157570 160054 163754 168029 172296 176293
56631A76293L426K342J048L63O93J432J555P52l65j105j346j331j228j060r29
$$ 176293 179719 182061 183109 183472 184165 185597 187152 187904 187539 186434 185088 183757 182529 181469 180540
56616A80540r93j255j524j555j243p10k33MQ6J50J24j29m29m06j24j82r68k090
$$ 180540 179547 178292 176768 175213 173970 173260 173027 173031 173117 173267 173391 173262 172833 172427 172303 172121 171153 169063
56598A69063k823k888k495j887j211o97m84l50M5N75P55M47J30K19M97M72J03
$$ 169063 166240 163352 160857 158970 157759 157062 156578 156228 156273 156848 157603 158050 158180 158399 158896 159368 159471
56581A59471j69m9K95N63P68J084J432J443R77L81R0J17K52O19J521K739L543
$$ 159471 159302 159253 159548 160111 160879 161963 163395 164838 165815 166196 166286 166403 166655 167274 168795 171534 175077
56564A75077L668L719M219M760M816M887N864P438Q212P633O720O385N993M460
$$ 175077 178745 182464 186683 191443 196259 201146 207010 214448 222660 230293 237013 243398 249391 253851
56550B53851K165O48O27J229J277O02p1LR61K156K515J555Q6o53n88q63k109l422
$$ 253851 256016 256664 257291 258520 259797 260399 260328 260331 261292 263448 265963 267518 267604 266951 266363 265500 263391 259969
56532B59969l620k897k463k918l734m283m620n058n518n653n257m407l372k524
$$ 259969 256349 253452 250989 248071 244337 240054 235434 230376 224858 219205 213948 209541 206169 203645
56518B03645k131k058j882j406r08p88j050j329j333j126r53r19r41r60j040j148
$$ 203645 201514 199456 197574 196168 195260 194472 193422 192093 190760 189634 188681 187762 186821 185861 184821 183673
56502A83673j079q11p35j175j666j302K1J206J188J53q80j280j073m32L95P89
$$ 183673 182594 181783 181048 179873 178207 176905 176926 178132 179320 179473 178593 177313 176240 175808 176203 176992
56486A76992K84n59o17K90J067Q36L4l88k48k8O2K20M66N35L90L39N93R31R50
$$ 176992 177276 176717 176100 176390 177457 178293 178327 177939 177691 177663 177725 177945 178411 178946 179336 179675 180268 181199 182149
56467A82149N52J72M68J605K856L239K589J653J027N29j36o09k96O98J620J952
$$ 182149 182701 182873 183341 184946 187802 191041 193630 195283 196310 196839 196703 196094 195798 196496 198116 200068
56451B00068J831J649J549J374R23K85r8J71R16J532J711J615J272L83r46j814
$$ 200068 201899 203548 205097 206471 207394 207679 207581 207752 208668 210200 211911 213526 214798 215181 214235 212421
56435B12421j443j61J012J512J526J382J196R66N83j34j071j689j582j017n98
$$ 212421 210978 210817 211829 213341 214867 216249 217445 218411 218994 218860 217789 216100 214518 213501 212903
56420B12903o28j014j470j577j002m3N47N80P04J202J377Q16M25J145K258K307
$$ 212903 212275 211261 209791 208214 207212 207169 207716 208296 209000 210202 211579 212395 212820 213965 216223 218530
56404B18530J237K53j72o14j084p61L10Q92N19M25J549K897K985K003J278J221
$$ 218530 219767 220020 219848 219234 218150 217389 217699 218591 219110 219535 221084 223981 226966 228969 230247 231468
56388B31468J089N75L43R04J849K585L129L862M753N228M780L608K574K415K949
$$ 231468 232557 233132 233475 234379 236228 238813 241942 245804 250557 255785 260565 264173 266747 269162 272111
56373B72111L223K453O42j575l450m473m586m123l387k345j014P9L65j0m01n74
$$ 272111 275334 277787 278429 276854 273404 268931 264345 260222 256835 254490 253476 253555 253920 253910 253509 252935
56357B52935p73r15n52K45P11L51m69j141j402j110j49J119J932K002J743J428
$$ 252935 252162 251247 250695 250940 251651 252002 251533 250392 248990 247880 247731 248850 250782 252784 254527 255955
56341B55955Q04n5l15N45J811K348J943J267Q93Q97J172J571J871J983K096K316
$$ 255955 256759 256704 256389 256934 258745 261093 263036 264303 265196 266093 267265 268836 270707 272690 274786 277102
56325B77102K498K575K725K950K921K502K039J798J594J259R76Q59O74L91M68
$$ 277102 279600 282175 284900 287850 290771 293273 295312 297110 298704 299963 300939 301798 302472 302863 303331
56310C03331J105J697J532P00j58o13n04K44J366K134K124J743J615J709J605
$$ 303331 304436 306133 307665 308365 308207 307594 307090 307334 308700 310834 312958 314701 316316 318025 319630
56295C19630J327J331J824K590L308L707L596L059K549K470K811L251L408K909
$$ 319630 320957 322288 324112 326702 330010 333717 337313 340372 342921 345391 348202 351453 354861 357770
56281C57770J739O79Q36K426M418N655N857N371M587M025M301N398O436O665O388
$$ 357770 359509 360188 361024 363450 367868 373523 379380 384751 389338 393363 397664 403062 409498 416163 422551
56266D22551O422P050P939Q714R229R534R893J0613J1730J3208J5338J8316K1475
$$ 422551 428973 436023 443962 452676 461905 471439 481332 491945 503675 516883 532221 550537 572012
56253E72012K3941K6122K9441L4247L9182M3162M6884N1559N7253O3358O9718
$$ 572012 595953 622075 651516 685763 724945 768107 814991 866550 923803 987161 1056879
56242A056879P6200Q2007Q6491R0014R3002R4733R4222R1590Q7436Q1318P2128
$$ 1056879 1133079 1215086 1301577 1391591 1484593 1579326 1673548 1765138 1852574 1933892 2006020
56231B006020N9779M5411L0128J4415j388j6916l1927m5906n7771o6769p3281
$$ 2006020 2065799 2111210 2141338 2155753 2154365 2137449 2105522 2059616 2001845 1935076 1861795
56220A861795p8138q1478q3055q3142q2246q0274p6882p2395o7579o2850n8270
$$ 1861795 1783657 1702179 1619124 1535982 1453736 1373462 1296580 1224185 1156606 1093756 1035486
56209A035486n3922m9644m4938l9945l5794l3176l1188k8552k5269k2105j9170
$$ 1035486 981564 931920 886982 847037 811243 778067 746879 718327 693058 670953 651783
56198F51783j6199j3638j2088j1139r938q545p479o458m853l038j965j637j360
$$ 651783 635584 621946 609858 598719 588781 580236 572757 566299 561446 558408 556443 554806 553446
56185E53446j140j521k201k270j761j633k172k648k568k134j473n54J44M7m13
$$ 553446 552306 550785 548584 546314 544553 542920 540748 538100 535532 533398 531925 531371 531515 531562 531149
56170E31149k28O16J114Q26M49O52J323K063K691L172L670M482N404N573M710
$$ 531149 530921 531537 532651 533477 533926 534578 535901 537964 540655 543827 547497 551979 557383 562956 567666
56155E67666L913M344N715P048Q149R209R806R608R421J0065J0935J1203J1717
$$ 567666 571579 575923 581638 588686 596835 606044 615850 625458 634879 644944 655879 667082 678799
56142F78799J3907J7403K0642K3434K6975L1555L6329M1409M8189N7310O7841
$$ 678799 692706 710109 730751 754185 781160 812715 849044 890453 938642 995952 1063793
56131A063793P8583Q8601R6459J00550J00315R5906Q7071P4164N9933M8284M1051
$$ 1063793 1142376 1230977 1327436 1427986 1528301 1624207 1711278 1785442 1845375 1893659 1934710
56120A934710L7393L5829L4800L1730K4299J3230J887p103j3178j6228j6453j6133
$$ 1934710 1972103 2007932 2042732 2074462 2098761 2111991 2113878 2106775 2093597 2077369 2060916 2044783
56108B044783j9030k6971l8692n2153o5814p7437q4401q6143q4342q0086p3019
$$ 2044783 2025753 1998782 1960090 1907937 1842123 1764686 1680285 1594142 1509800 1429714 1356695
56097A356695o3725n4343m5925l7601k9280k2701j8600j5198j1008o996m500k889
$$ 1356695 1292970 1238627 1192702 1155101 1125821 1103120 1084520 1069322 1058314 1051318 1046818 1043929
56085A043929r78R62K191K989L784M124L857M005N253O721P349P373P514P961
$$ 1043929 1042951 1043913 1046104 1049093 1052877 1057001 1060858 1064863 1070116 1076837 1084186 1091559 1099073 1107034
56071A107034Q890J0731J3055J4561J4812J4802J5259J5855J6514J7857J9769
$$ 1107034 1115924 1126655 1139710 1154271 1169083 1183885 1199144 1214999 1231513 1249370 1269139
56060A269139K1157K1710K2313K3262K3753K3500K3085K2399K0703J8515J7284
$$ 1269139 1290296 1312006 1334319 1357581 1381334 1404834 1427919 1450318 1471021 1489536 1506820
56049A506820J6906J5809J3965J3318J4700J6771J8593K0674K2905K4069K4287
$$ 1506820 1523726 1539535 1553500 1566818 1581518 1598289 1616882 1637556 1660461 1684530 1708817
56038A708817K5242K7223K8598K8881K9507L0840L1421L1108L1708L3568L4788
$$ 1708817 1734059 1761282 1789880 1818761 1848268 1879108 1910529 1941637 1973345 2006913 2041701
56027B041701L4945L6174L9201M1817M2831M4085M6827M9509N1034N2862N5894
$$ 2041701 2076646 2112820 2152021 2193838 2236669 2280754 2327581 2377090 2428124 2480986 2536880
56016B536880N8541N9824O1276O3966O6803O9494P3787P9963Q5637Q9743R4105
$$ 2536880 2595421 2655245 2716521 2780487 2847290 2916784 2990571 3070534 3156171 3245914 3340019
56005C340019R9454J03948J07388J12538J20129J27045J31733J36887J44313J51857
$$ 3340019 3439473 3543421 3650809 3763347 3883476 4010521 4142254 4279141 4423454 4575311
55995D575311J58118J65357J74897J84555J93600K05159K20485K36076K49904
$$ 4575311 4733429 4898786 5073683 5258238 5451838 5656997 5877482 6113558 6363462
55986F363462K65076K83890L03925L23756L46652L74532M04243M34043M67563
$$ 6363462 6628538 6912428 7216353 7540109 7886761 8261293 8665536 9099579 9567142
55977I567142N07141N49774N94181O44834P04401P69844Q41021R24960J026243
$$ 9567142 10074283 10624057 11218238 11863072 12567473 13337317 14178338 15103298 16129541
55968A6129541J142083J272753J427191J612169J827128K077284K380356K752526
$$ 16129541 17271624 18544377 19971568 21583737 23410865 25488149 27868505 30621031
55960C0621031L201504L743354M412024N241734O256168P487053Q984606J0795908
$$ 30621031 33822535 37565889 41977913 47219647 53475815 60962868 69947474 80743382
55952H0743382J2956299J5521031J8580994K2223280K6479159L1242940L6030162
$$ 80743382 93699681 109220712 127801706 150024986 176504145 207747085 243777247
55945B43777247L9629352M0111812L5627549K5649217J1637753l540912j6997819
$$ 243777247 283406599 323518411 359145960 384795177 396432930 392892018 375894199
55938C75894199k6927729l2842204l5174868l4787008l2621731k9495151k5999292
$$ 375894199 348966470 316124266 280949398 246162390 213540659 184045508 158046216
55931A58046216k2511469j9252235j6328892j3768089j1559033r685093q121683
$$ 158046216 135534747 116282512 99953620 86185531 74626498 64941405 56819722
55924E6819722o827468n757137m876576m156698l563894l068542k654920k312788
$$ 56819722 49992254 44235117 39358541 35201843 31637949 28569407 25914487 23601699
55916B3601699k026592j781477j571872j394996j242500j106589r87671q87838
$$ 23601699 21575107 19793630 18221758 16826762 15584262 14477673 13490002 12602164
55908A2602164q02330p24910o56032n98394n49352n04612m64735m31405m01609
$$ 12602164 11799834 11074924 10418892 9820498 9271146 8766534 8301799 7870394 7468785
55899G468785l71842l44064l21471l02131k82460k63320k47021k31784k14758
$$ 7468785 7096943 6752879 6431408 6129277 5846817 5583497 5336476 5104692 4889934
55890D889934j97532j83274j71091j58161j44969j33562j22935j10601r6767q3000
$$ 4889934 4692402 4509128 4338037 4179876 4034907 3901345 3778410 3667809 3571042 3488042
55880C488042o8755n2916l6686k1533o764P348J6336J5114K984j7479m3714p2217
$$ 3488042 3419287 3366371 3329685 3308152 3301388 3308736 3325072 3340186 3343170 3325691 3281977 3209760
55868C209760r7282j14851j25854j32825j35482j32682j26097j18298j09371r8856
$$ 3209760 3112478 2997627 2871773 2738948 2603466 2470784 2344687 2226389 2117018 2018162
55858B018162q8847q1594p5943o9547o2819n7449n2879m7717m2861l9807l7529
$$ 2018162 1929315 1847721 1771778 1702231 1639412 1581963 1529084 1481367 1438506 1398699 1361170
55847A361170l4402l1567l0917l1278l0150k7989k7102k7382k6737k5008k3954
$$ 1361170 1326768 1295201 1264284 1233006 1202856 1174867 1147765 1120383 1093646 1068638 1044684
55836A044684k3722k2760k0923j9669j9189j8179j6413j4982j4015j2551j0661
$$ 1044684 1020962 998202 977279 957610 938421 920242 903829 888847 874832 862281 851620
55825H51620r538r441r481r440r966j1093j2123j2836j3457j3815j3734j3626
$$ 851620 842082 832641 823160 813720 803754 792661 780538 767702 754245 740430 726696 713070
55813G13070j3503j2401j0042q063p968q981r389q856p798n838k875m79o9n86
$$ 713070 699567 687166 677124 669061 661093 652112 642723 633867 626069 620231 617356 616877 616808 616222
55799F16222PJ752L215L998M569M421K684Q9j841l146m967p130q268q054p433
$$ 616222 616229 617981 621196 625194 629763 634184 636868 636957 635116 631970 627003 619873 611605 603551 596118
55784E96118o798n690m213l184l092m210p175j1770j5785j6864j5317j3393j2117
$$ 596118 589320 583630 579417 576233 573141 568931 561756 549986 534201 517337 502020 488627 476510
55771D76510j0586q178n598l614k224j362j139j274j263j088j011q98o44p48j608
$$ 476510 465924 457746 452148 448534 446310 444948 443809 442535 441272 440184 439173 438275 437631 436883 435275
55756D35275k703l473m290n590o709o790o239o083o447o808p171p777q228q011
$$ 435275 432572 429099 424809 419219 412510 405720 399481 393398 386951 380143 372972 365195 356967 348956
55742C48956p385o769n983n038m772n553o248n769m729m225l997l192k072j397
$$ 348956 341571 334802 328819 323781 319009 313456 307208 301439 296710 292485 288488 285296 283224 281827
55728B81827q66J40R76N03j112k803m170n246n494m689m028m628n574n163l517
$$ 281827 280961 281101 282077 282580 281468 278665 274495 269249 263755 259066 255038 250410 244836 239673 236156
55713B36156k167j628j213p98q50r72l09P91J239J123J493K304K372J313r1j359
$$ 236156 233989 232361 231148 230350 229500 228528 228219 229010 230249 231372 232865 235169 237541 238854 238763 237404
55697B37404k661l714l905l505l267l021k143j246j600k898l364k321r90m11j63
$$ 237404 234743 231029 227124 223619 220352 217331 215188 213942 212342 209444 206080 203759 202769 202358 202195
55682B02195L83R67J181J250J476J718J754J494Q29j45r02j216j681k769l843
$$ 202195 202578 203545 204726 205976 207452 209170 210924 212418 213247 213102 212200 210984 209303 206534 202691
55667B02691m101l815l571k930j290N95J463J469J738K351K452K067K120K772
$$ 202691 198590 194775 191204 188274 186984 187579 189042 190511 192249 194600 197052 199119 201239 204011
55653B04011L284L478L843M249M074L470L067K638J565L49k8J0q09k402l528m070
$$ 204011 207295 210773 214616 218865 222939 226409 229476 232114 233679 234028 234000 234010 233201 230799 227271 223201
55637B23201n012o185o189m941m080m300m413l713l221l650l998l384k613k682
$$ 223201 218189 212004 205815 200874 196794 192494 188081 184368 181147 177497 173499 170115 167502 164820
55623A64820l071k704j579m30L38M92k16j368j948j773j810k513k980k538j964
$$ 164820 161749 159045 157466 157036 157374 157866 157650 156282 154334 152561 150751 148238 145258 142720 140756
55608A40756k132k537k253j551j399j880k202j902j215m79J36M64L88m7p13j371
$$ 140756 138624 136087 133834 132283 130884 129004 126802 124900 123685 123206 123342 123806 124194 124147 123434 122063
55592A22063j556r76o4L29q0p88j167q68J79J468J873Q33o28j068n73m54j174
$$ 122063 120507 119531 119467 119796 119716 118928 117761 116893 117072 118540 120413 121246 120618 119550 118977 118523 117349
55575A17349j861j948j854j785j275l49J22j53k95K93Q72N56l15p35l61L26P24
$$ 117349 115488 113540 111686 109901 108626 108277 108399 108246 107951 108244 109116 109672 109357 108622 108261 108587 109311
55558A09311N10j98p86o79o2L94M60M50M56K71jK8M23J045J946K866K820J362
$$ 109311 109821 109623 108837 108158 108096 108490 108950 109400 109856 110127 110126 110154 110577 111622 113568 116434 119254 120616
55540A20616k31m42K02l6j257j809j083l87o30j043r16q41j327j759j639j461
$$ 120616 120385 119943 120145 120109 118852 117043 115960 115573 114943 113900 112984 112143 110816 109057 107418 105957
55524A05957j463r34K56R03K68o58r47j460l435o274q106p980o369m168k129p39
$$ 105957 104494 103560 103816 104719 104987 104329 103382 101922 98487 92213 84107 76127 69758 65590 63461 62722
55508F2722K70J718L611M775M433L305K354J500M68j41J49N51J50n57n09J03L36
$$ 62722 62992 64710 68321 73096 77529 80834 83188 84688 85156 85015 85164 85715 85865 85308 84799 84902 85238
55491H5238K58Q23K067K831K368J203K16k47k22J75O71R37R55R47R77R30Q26Q14
$$ 85238 85496 86319 88386 91217 93585 94788 95004 94757 94535 94710 95381 96318 97273 98220 99197 100127 100953 101767
55473A01767R79J287J576J505Q10k71j149j575j728j661j234o67m59o54p89p24
$$ 101767 102746 104033 105609 107114 107924 107653 106504 104929 103201 101540 100306 99639 99180 98526 97737 97013
55457I7013p17o09Q8J010J011j35j107q35L0K42k34m53P1R36J531J420M76q07
$$ 97013 96296 95687 95775 96785 97796 97661 96554 95719 95749 95991 95757 95304 95375 96311 97842 99262 99738 98931
55439I8931j490j217o28m09m70m09k14J4L91Q34Q68L60k03m73p01j000r27l41
$$ 98931 97441 96224 95596 95187 94717 94308 94094 94108 94499 95333 96201 96561 96358 95885 95184 94184 93257 92916
55421I2916R0j42n45m01K00O86Q17O65K94l8J02O33Q95O20L14L07J86m00j083
$$ 92916 93006 92864 92319 91918 92118 92804 93621 94286 94580 94542 94644 95277 96172 96792 97106 97413 97599 97199 96116
55402I6116j345j102l77P56J656J521O45J50J88k54j317j609m16R39J116O12M41
$$ 96116 94771 93669 93292 94048 95704 97225 97870 98020 98208 97954 96637 95028 94612 95551 96667 97279 97720
55385I7720K55n78j292q33K35O28M70P72J403J384Q52R51J837K432K190J735J532
$$ 97720 97975 97397 96105 95272 95507 96135 96605 97377 98780 100164 101016 101967 103804 106236 108426 110161 111693
55368A11693J315R16N50J22o59j423j485j084j225k109k818k727k302k170k272
$$ 111693 113008 113924 114474 114596 113937 112514 111029 109945 108720 106611 103793 101066 98764 96594 94322
55353I4322k293k198k024j637j000l10J95L74K10PK17P68R87O22L50O55Q95K69
$$ 94322 92029 89831 87807 86170 85170 84860 85055 85429 85639 85646 85863 86631 87618 88240 88590 89245 90140 90409
55335I0409q23j382j313j322j563j452p24K30J045J578J583R70K48j6n7m64j096
$$ 90409 89586 88204 86891 85569 84006 82554 81830 82060 83105 84683 86266 87236 87484 87468 87411 86947 85851
55318H5851j253p53n5N25R51J014N34n0j19K23L31j0m84r29j399j670j355m79
$$ 85851 84598 83845 83790 84315 85266 86280 86814 86764 86645 86868 87199 87189 86705 85776 84377 82707 81352 80873
55300H0873N59J416J740J123k16j163q71K02J020J289J326J209R27Q37J076J000
$$ 80873 81432 82848 84588 85711 85495 84332 83461 83663 84683 85972 87298 88507 89434 90271 91347 92347
55284I2347J46p69q39l72k58m97n57o21j130j559j106k14O4q8L41J218J399P89
$$ 92347 92493 91724 90885 90513 90255 89758 89201 88580 87450 85891 84785 84571 84635 84547 84888 86106 87505 88294
55266H8294N40J029J297Q39L48K87J81r5J43R74J312N40n04q05m47K7N31J024
$$ 88294 88834 89863 91160 91999 92347 92634 92815 92720 92863 93837 95149 95689 95185 94380 93933 93960 94491 95515
55248I5515J066M46l96j035j443j453p52K94P36L17k19m08o07r37q10j16K77j45
$$ 95515 96581 97027 96631 95596 94153 92700 91948 92242 92978 93295 93076 92668 92061 91124 90314 90198 90475 90330
55230I0330o34l40M72J052J248J273J083O53K87J10j46n00n56l84o95j620k219
$$ 90330 89696 89356 89828 90880 92128 93401 94484 95137 95424 95534 95388 94888 94332 93948 93253 91633 89414
55213H9414j811r68n03k51L41J128J562J536J231O10k34p75p08m23k86L3Q29J544
$$ 89414 87603 86635 86132 85881 86222 87350 88912 90448 91679 92289 92055 91280 90572 90149 89863 89896 90725 92269
55195I2269J392M44n62j095j064n80nK19K20O32J458J722Q78k02m16k3q0p93j380
$$ 92269 93661 94105 93543 92448 91384 90804 90799 91018 91238 91870 93328 95050 95928 95726 95310 95287 95207 94414 93034
55176I3034j301p39l2N93P98M12j11j12M38J031J345J347R07j7r58j267q82k47
$$ 93034 91733 90994 90962 91555 92353 92765 92654 92542 92980 94011 95356 96703 97610 97593 96635 95368 94486 94239
55158I4239L49Q48J098J034J056J517J912J364m0j149j215p56o28q26p47k67N2
$$ 94239 94588 95436 96534 97568 98624 100141 102053 103417 103377 102228 101013 100257 99629 98803 98056 97789 97841
55141I7841k21q37j204r79k63N44R70P52J20l12j98Q2j00p24j056o57J4K93J94
$$ 97841 97620 96783 95579 94600 94337 94881 95851 96603 96723 96411 96213 96295 96195 95471 94415 93758 93772 94065 94259
55122I4259J73L58M77L99J76k66r39j377j029n5P83J079J103J093Q83L82q2j93
$$ 94259 94432 94790 95267 95666 95842 95576 94637 93260 92231 92176 92959 94038 95141 96234 97117 97499 97417 97224
55104I7224l9J60L27M32L77J74lmK34P00J149J142O11J31J43K50j05n88m51J74
$$ 97224 97185 97345 97672 98104 98481 98655 98652 98648 98882 99582 100731 101873 102484 102615 102758 103008 102903 102315 101864 102038
55084A02038L91l0m03l66l67o13n79k7M37L37J18L34P66R13P67N30J02n34r09
$$ 102038 102429 102399 101996 101630 101263 100650 100071 100044 100481 100818 100936 101270 102036 102949 103716 104246 104348 103814 102905
55065A02905o41j13M4k29m72l64N7N18N98M6p45r91m47L39Q17R44P12m8j045j437
$$ 102905 102264 102151 102195 101966 101494 101130 101187 101705 102303 102349 101604 100613 100166 100505 101322 102266 102978 102930 101885 100448
55045A00448q99j84r3m76p31p42o89m26K40J041J522J587J281M79o43j312j005
$$ 100448 99549 99365 99272 98796 98065 97323 96634 96208 96448 97489 99011 100598 101879 102358 101715 100403 99398
55028I9398k53N2r1N3P07J174P84k42j020r25k17J88l08j248j632j159m91k11
$$ 99398 99145 99197 99106 99159 99866 101040 101824 101582 100562 99637 99420 99608 99300 98052 96420 95261 94770 94559
55010I4559j76n1M0j12l19k76NL41O13O00Q0o34p50L5J051J476J225P32M22O09
$$ 94559 94383 94332 94372 94260 93941 93665 93670 94011 94624 95224 95304 94670 93920 93955 95006 96482 97707 98439 98861 99470
54990I9470J338J968J618L80o00o18k66k68l25J15O59N30j30m61j88Q5j80q43
$$ 99470 100808 102776 104394 104774 104174 103556 103290 103022 102697 102812 103471 104001 103871 103410 103222 103307 103127 102284
54972A02284j314j084j51Q11J081Q15Q49J348J449P01q0rO10R67R49Q23M50j85
$$ 102284 100970 99886 99735 100546 101627 102442 103291 104639 106088 106789 106709 106700 107310 108277 109226 110049 110499 110314
54954A10314l31M98J417J192M1o97m01L80J021J320J084L10l32k14J08m32j637
$$ 110314 109983 110481 111898 113090 113131 112434 112033 112413 113434 114754 115838 116148 115816 115602 115710 115278 113641
54937A13641k101j143L40J159J120P40N53R43J921K832K885K185J681J982K834
$$ 113641 111540 110397 110737 111896 113016 113756 114309 115252 117173 120005 122890 125075 126756 128738 131572
54922A31572L798M726N495N960O422P483R161J0628J1015J0102Q204N783L260
$$ 131572 135370 140096 145591 151551 157973 165456 174617 185245 196260 206362 214566 220349 223609
54909B23609P38k021m995p499q900r449r696r463q259o515n319m902m404l361
$$ 223609 224347 222326 217331 209832 200932 191483 181787 172324 164065 157550 152231 147329 142925 139564
54895A39564k384k067k180k270k282k124j482m68K22L31N31J355K310K624K408
$$ 139564 137180 135113 132933 130663 128381 126257 124775 124307 124529 124860 125391 126746 129056 131680 134088
54880A34088K364K763L341M001M940O163P271P837P795P477P313P333O928N350
$$ 134088 136452 139215 142556 146557 151497 157660 164931 172768 180563 188040 195353 202686 209614 214964
54866B14964K558p11l655n896p322p967q171q392q623q395p584o682o037n229
$$ 214964 217522 216811 213156 207260 199938 191971 183800 175408 166785 158390 150806 144124 138087 132858
54852A32858l718j830o04o34j440k025j909j512j506j969k256j829r19k37k03
$$ 132858 129140 127310 126706 126072 124632 122607 120698 119186 117680 115711 113455 111626 110707 110470 110267
54837A10267p15j365j618j082o0M74l3q73r11q2O61P46N51M94M75L85M36N68K78
$$ 110267 109552 108187 106569 105487 105427 105901 105868 104995 104084 104002 104663 105409 105960 106454 106929 107314 107750 108318 108596
54818A08596n20j027n74L44O31k5q76j103o40k8J90r2n47p24m32J63P31R85Q19
$$ 108596 108076 107049 106475 106819 107450 107425 106549 105446 104806 104778 104968 104876 104329 103605 103173 103336 104067 105052 105871
54799A05871M19J86L01N34N98N69O30O31L36r9k85k22k12k40K1N81J047J204J155
$$ 105871 106290 106476 106777 107311 107909 108478 109108 109739 110075 109976 109691 109469 109257 109017 109038 109619 110666 111870 113025
54780A13025Q90L25j47J85J356K510K960K899K767K520K065J870K504L759M862
$$ 113025 113915 114240 114093 114278 115634 118144 121104 124003 126770 129290 131355 133225 135729 139488 144350
54765A44350N445N882O635P644Q438Q656Q333P805P201O148M149J320j534l732
$$ 144350 149795 155677 162312 169956 178394 187050 195383 203188 210389 216537 220686 222006 220472 216740
54751B16740n323o682p779q216p870p175o620o222n632m677l620k794k197j589
$$ 216740 211417 204735 196956 188740 180870 173695 167075 160853 155221 150544 146924 144130 141933 140344
54737A40344r70o15n80m70R6J013J863K334K309J824J263J264K017K935L416L718
$$ 140344 139374 138759 138179 137709 137805 138818 140681 143015 145324 147148 148411 149675 151692 154627 158043 161761
54721A61761M572O107P677Q684R014Q661P542N804L860J910k45k778n441p669
$$ 161761 166333 172440 180117 188801 197815 206476 214018 219822 223682 225592 225347 222569 217128 209459
54707B09459q965r185q652p875p037o010m988m599m961n127m179k524j390j211
$$ 209459 200494 191309 182657 174782 167745 161735 156747 152148 147187 142060 137881 135357 133967 132756
54693A32756j348j296j217j233j074p15o19j021j473j483j091o04j80P1L4j50
$$ 132756 131408 130112 128895 127662 126588 125873 125254 124233 122760 121277 120186 119582 119402 119473 119507 119357
54677A19357j23K04N63P49P54M38m09j555k334k321j672p89j6L36J97o5j07j29
$$ 119357 119234 119438 120001 120750 121504 121942 121533 119978 117644 115323 113651 112862 112846 113182 113379 113314 113207 113078
54659A13078m26o64l40J84P9n38o66KN61L96J07L73Q52R00O57O48Q40Q40O81P18
$$ 113078 112652 111988 111648 111832 111911 111373 110707 110709 111270 111666 111773 112146 112998 113898 114555 115203 116043 116883 117564 118282
54639A18282R88J195J112O55j10p57p54k07J37p7l88m63p32j474j994j514m13
$$ 118282 119270 120465 121577 122232 122122 121365 120611 120404 120541 120464 120076 119613 118881 117407 115413 113899 113486
54622A13486K93M46P98J685K448K326J354K03n48p84p66q21j000j020n30N45J861
$$ 113486 113779 114225 115023 116708 119156 121482 122836 123039 122491 121707 120941 120120 119120 118100 117570 118115 119976
54605A19976K709K412J034m65j139j032p74n35p9L20M1o70o88M12J620J814J001
$$ 119976 122685 125097 126131 125666 124527 123495 122721 122186 122107 122427 122468 121798 121110 121522 123142 124956 125957
54588A25957j50j211j839j624p88l70r02j585j412n71N8J74R7lq8R1N09N57j21
$$ 125957 125807 124596 122757 121133 120345 119975 119073 117488 116076 115505 115563 115737 115834 115831 115743 115834 116343 116900 116779
54569A16779q39p80j79K10L21N44P28M76J38M41J296J899J931J659J089j8j263
$$ 116779 115940 115160 114981 115191 115512 116056 116784 117260 117398 117839 119135 121034 122965 124624 125713 125695 124432
54552A24432j838j660j346j043l31O54J059O28J75L65Q86J191J220J045O03K48
$$ 124432 122594 120934 119588 118545 118214 118868 119927 120555 120730 121095 121981 123172 124392 125437 126040 126288
54536A26288P19J952K724K116P80m%L0l01n81n00l66m73m96J16J308K261K189
$$ 126288 127007 128959 131683 133799 134579 134575 134575 134605 134304 133723 133223 132857 132384 131888 132004 133312 135573 137762
54518A37762J221L43L24Q39R48L01n03p32l54J31K69r4q49j602j862j475p71j25
$$ 137762 138983 139326 139650 140489 141437 141738 141235 140503 140149 140280 140549 140455 139606 138004 136142 134667 133896 133771
54500A33771M16R28J241J101N95J56O6J10j92r48j593j361j89J026J327P26R2
$$ 133771 134187 135115 136356 137457 138052 138208 138274 138384 138192 137244 135651 134290 134101 135127 136454 137180 137272
54483A37272PJ57qm12m65O3P43J050R34P17O22N98N30L95K44J33J08R5j20n76
$$ 137272 137279 137436 137428 137016 136551 136614 137357 138407 139341 140058 140680 141278 141808 142203 142447 142580 142688 142783 142663 142087
54463A42087q25l31O84J279R78M86O77J256J237N06qJ59L54J4l65q5N83Q03L17
$$ 142087 141262 140931 141615 142894 143872 144358 145035 146291 147528 148034 148026 148185 148539 148553 148188 148103 148686 149489 149806
54444A49806n29j492k416k762k005n68L60J14p28j149p85j17J95p0o00r64j072
$$ 149806 149277 147785 145369 142607 140602 140034 140394 140508 139780 138631 137846 137729 137924 137854 137254 136290 135218
54427A35218j131j212j072n11K93R65J225R69L89O5N03J411J861J427P10M70O86
$$ 135218 134087 132875 131803 131292 131585 132550 133775 134744 135133 135198 135701 137112 138973 140400 141110 141580 142266
54410A42266Q56P73N51K34j41l90m42m88n64m06J9L45N64J237K429L127K563J468
$$ 142266 143122 143895 144446 144680 144539 144149 143707 143219 142655 142249 142268 142613 143177 144414 146843 149970 152533 154001
54392A54001J043J188Q47j45q02n23J66N70O04L70j12n41m59J7J98k31r05j472
$$ 154001 155044 156232 157079 156934 156132 155609 155775 156345 156949 157319 157207 156666 156207 156224 156422 156191 155286 153814
54374A53814j868j830j020J40O45L42K89J125J935J485mj209j454j310j453j762
$$ 153814 151946 150116 149096 149236 149881 150223 150512 151637 153572 155057 155053 153844 152390 151080 149627 147865
54358A47865j654q45L76J436J850J536P94qp11j286j607j465q52j59M0m29r83
$$ 147865 146211 145366 145742 147178 149028 150564 151358 151350 150639 149353 147746 146281 145429 145270 145310 144881 143898
54341A43898q53n9N46M12mo2Ql74r85j001l03K85K07j48k78l15n48p41m36M20
$$ 143898 143045 142986 143532 143944 143940 143878 143886 143512 142527 141526 141223 141508 141715 141567 141289 140974 140426 139685 139249 139669
54321A39669J447K208K450K254K125K599L553M251M190L523K610J584N78k11q74
$$ 139669 141116 143324 145774 148028 150153 152752 156305 160556 164746 168269 170879 172463 173041 172830 171956
54306A71956j819l041l830l573k538j510r65r05j183j588j808j699j455j296j233
$$ 171956 170137 167096 163266 159693 157155 155645 154680 153775 152592 151004 149196 147497 146042 144746 143513
54291A43513j310j684k140j973q56M76R94O61L44N13P14M51l5k46j81j55j66L5
$$ 143513 142203 140519 138379 136406 135550 136026 137020 137681 138025 138538 139252 139703 139668 139422 139241 139086 138920 138955
54273A38955L17J87m63j053r95l90K21N26N19K00l32n74m7R41J463J124N31L55
$$ 138955 139272 139459 138996 137943 136948 136558 136779 137305 137824 138024 137692 137118 137071 138012 139475 140599 141130 141485
54255A41485M15J36m68q19n69O1O39Q76P54N09L86K46k12p11m67O02J393R53k02
$$ 141485 141900 142036 141568 140749 140180 140241 140880 141756 142510 143019 143405 143651 143439 142728 142261 142863 144256 145209 145007
54236A45007q04n77l35o55j267j714j772j335n93k68q45j645j540n86Rl45r21
$$ 145007 144203 143626 143291 142636 141369 139655 137883 136548 135955 135687 134842 133197 131657 131071 131080 130735 129814
54219A29814j003q56q95q39l46K20M01M49Q09J211R53p7j209j711j357m26N50
$$ 129814 128811 127955 127060 126221 125875 126095 126496 126945 127754 128965 129918 129841 128632 126921 125564 125138 125688
54202A25688J166J460J687J809J533R09L89J62m5l97o02l91R3N95R41Q31M7r25
$$ 125688 126854 128314 130001 131810 133343 134252 134641 134803 134758 134361 133759 133368 133461 134056 134997 135828 135875 134950
54184A34950j166n23J06Q3q9K02N21N8r64j504j090l12J11O8j10p6L19Q92J172
$$ 134950 133784 133261 133367 133450 133361 133563 134084 134142 133178 131674 130584 130272 130383 130451 130341 130265 130584 131476 132648
54165A32648Q41J12m84o69n62m68o43j072j334j009l31l5l39n42k7P95J023M47
$$ 132648 133489 133601 133117 132448 131886 131418 130775 129703 128369 127360 127029 126994 126655 126113 126086 126881 127904 128351
54147A28351l78r41j124r25m01L8p4o26r25m53N87J555J994J886J494J059O53
$$ 128351 127973 127032 125908 124983 124582 124620 124546 123920 122995 122542 123129 124684 126678 128564 130058 131117 131770
54130A31770K87N5Km4k81n73n96k76J67O09R61Q64Qj110j487q75r0K40N23J278
$$ 131770 132057 132112 132114 132070 131789 131216 130620 130344 130511 131120 132081 132945 132953 131843 130356 129481 129391 129631 130154 131432
54110A31432K084K205J747J344J056M47l88p83n16r6J28M10Q86J073M98m74j013
$$ 131432 133516 135721 137468 138812 139868 140315 139927 139144 138628 138532 138660 139070 139956 141029 141527 141053 140040
54093A40040p60j42K84L80L36K29o3n26q19n94O5P36J114J219J157R66P11N08
$$ 140040 139280 139138 139422 139802 140138 140367 140304 139778 138959 138365 138430 139166 140280 141499 142656 143622 144333 144841
54075A44841L74K52K02L29N54O91O93N88K92j32k14L77J139J215N96J46L23O42
$$ 144841 145215 145467 145669 145998 146552 147243 147936 148524 148816 148684 148470 148847 149986 151201 151797 151943 152266 152908
54057A52908O61O62R44J178J005P07O79P18M33Ro7K86P96J336J907K411K808L211
$$ 152908 153569 154231 155175 156353 157358 158065 158744 159462 159895 159904 159837 160123 160919 162255 164162 166573 169381 172592
54039A72592L551L559L376L592M342M980N192N608O601P253O593N304M947N682
$$ 172592 176143 179702 183078 186670 191012 195992 201184 206792 213393 220646 227239 232543 237490 243172
54025B43172O057N150L778L194L489L784L429K508J523R08O98N32J10m45q99j370
$$ 243172 249229 254379 258157 261351 264840 268624 272053 274561 276084 276992 277690 278222 278332 277887 276988 275618
54009B75618k070k814l232l346l424l430l142k734k594k634k355j622p65R4J217
$$ 275618 273548 270734 267502 264156 260732 257302 254160 251426 248832 246198 243843 242221 241456 241550 242767
53994B42767K651M135N585P075Q068P406M555M55l287n794p227q065q549q682
$$ 242767 245418 249553 255138 262213 270281 277687 282242 282697 279410 273616 266389 258324 249775 241093
53980B41093q428p787o840n782m845m204l916l867l831l678l451l137k529j545
$$ 241093 232665 224878 218038 212256 207411 203207 199291 195424 191593 187915 184464 181327 178798 177253
53966A77253n53j32m34r30q29K26J773K827K709J721P61L24J80N9J38O44J367
$$ 177253 176700 176568 176134 175204 174375 174601 176374 179201 181910 183631 184392 184716 184896 184955 185093 185737 187104
53949A87104J907K145K153J990J796J726J602J128O35R55K048K566J513j84o81
$$ 187104 189011 191156 193309 195299 197095 198821 200423 201551 202186 203141 205189 207755 209268 209084 208403
53934B08403N21K186L024K937K583K540K959L517L605K984K220K078K691L706
$$ 208403 208924 211110 214134 217071 219654 222194 225153 228670 232275 235259 237479 239557 242248 245954
53920B45954M931O187O847O345N105M265M482N512O841Q050Q793R044R339J0032
$$ 245954 250885 257072 263919 270264 275369 279634 284116 289628 296469 304519 313312 322356 331695 341727
53906C41727J0505R839Q051N931L889J908M36L4J36n76k182l166k602j557j551
$$ 341727 352232 362071 370122 376053 379942 381850 382286 382320 382456 381880 379698 376532 373930 372373 370822
53891C70822k583l595m181m778n545o035o002n820n968o490p037p236o949o290
$$ 370822 368239 364644 360463 355685 350140 344105 338103 332283 326315 319825 312788 305552 298603 292313
53877B92313n446m577l998m116m798n106m297k949k349k769l216l039k778k995
$$ 292313 286867 282290 278292 274176 269378 264272 259975 257026 254677 251908 248692 245653 242875 239880
53863B39880l209k686j660r68r34j313k004l004l839l777k783j725j450j937k456
$$ 239880 236671 233985 232325 231357 230423 229110 227106 224102 220263 216486 213703 211978 210528 208591 206135
53848B06135k353j609p21j39J23L07M97N81O14Q68J456K121K546K736L066M009
$$ 206135 203782 202173 201452 201313 201436 201743 202240 202821 203435 204303 205759 207880 210426 213162 216228 220237
53832B20237N750P968J0093J1847J3209J3726J2390Q731L630j453n750r103j1118
$$ 220237 225987 233955 244048 255895 269104 282830 295220 303951 307581 306128 300378 291275 280157
53819B80157j1432j0598r687q924p658n777m089l085k279j135J48J205K005K416
$$ 280157 268725 258127 248440 239516 231858 226081 221992 218907 216628 215493 215641 216846 218851 221267
53805B21267K163J658J999L494M957N242M757M657N135N397N008M298L599K892
$$ 221267 223430 225088 227087 230581 235538 240780 245537 250194 255329 260726 265734 270032 273631 276523
53791B76523K167J593J240J056J034J155J225J103R03P69O18L38j1l91r10j553
$$ 276523 278690 280283 281523 282579 283613 284768 285993 287096 287999 288768 289386 289724 289713 289322 288412 286859
53775B86859k125k590l184m011m854n533o000o032n363m316l665l607l482k861
$$ 286859 284734 282144 278960 274949 270095 264562 258562 252530 247167 242851 239186 235579 232097 229236
53761B29236k207k046k166k193k304k713k999k684k084j838j911j724j126n54
$$ 229236 227029 224983 222817 220624 218320 215607 212608 209924 207840 206002 204091 202367 201241 200687
53747B00687l52m23m72k68K25P06Q20P29R21J308J145K13o77q82q49j157j388
$$ 200687 200335 199912 199440 199172 199397 200103 200923 201652 202573 203881 205026 205239 204562 203680 202831 201674 200286
53730B00286r21j83r9n89p07r9O47J048J164J071O95K05j00l14o58q55m75K12
$$ 200286 199365 199182 199083 198494 197787 197688 198335 199383 200547 201618 202313 202518 202418 202104 201446 200591 200116 200328
53712B00328N37M92O90J255J631J526J335J367J443J438J558J869K058J950J731
$$ 200328 200865 201357 202047 203302 204933 206459 207794 209161 210604 212042 213600 215469 217527 219477 221208
53697B21208J594J574J752K092K166J561P14N84J396K272K339J611O37j53n17
$$ 221208 222802 224376 226128 228220 230386 231947 232661 233245 234641 236913 239252 240863 241500 241347 240830
53682B40830l95j48k93q12j094q29l96k48l51m90o27o82m19J73O68O66J49p12
$$ 240830 240435 240287 239994 239182 238088 237259 236863 236615 236264 235774 235147 234465 234046 234219 234887 235553 235702 234990
53664B34990j667k258k050j266o87o72p37m31j05l46j022j410j132n23q1L6K1
$$ 234990 233323 231065 229015 227749 227062 226390 225653 225222 225117 224771 223749 222339 221207 220684 220603 220639 220660
53647B20660O5J52J39J3k3O8nl34l62M60J618J906J034K01O00J889K726K416J472
$$ 220660 220725 220877 221016 221029 221006 221074 221069 220735 220373 220833 222451 224357 225391 225592 226192 228081 230807 233223 234695
53628B34695P14M70N88Q12R42R46J003J361K030K721L042K809K230J834K008K602
$$ 234695 235409 235879 236467 237279 238221 239167 240170 241531 243561 246282 249324 252133 254363 256197 258205 260807
53612B60807L077L113K816K397K008J925K504L615M435M201L091K080J925K465
$$ 260807 263884 266997 269813 272210 274218 276143 278647 282262 286697 290898 293989 296069 297994 300459
53598C00459K907K652J794R13M28K54J66K29N88R89Q67j1j324k607l468l459k329
$$ 300459 303366 306018 307812 308725 309153 309407 309573 309802 310390 311379 312246 312235 310911 308304 304836 301377 299048
53581B99048o81J73m40j688k221j771j274j516k260k802k854k569k079j426q02
$$ 299048 298367 298540 298100 296412 294191 292420 291146 289630 287370 284568 281714 279145 277066 275640 274838
53566B74838n46p40j014r14l69K91P79J080J256J217R24N94M85M82K59j51k62
$$ 274838 274292 273552 272538 271624 271255 271546 272325 273405 274661 275878 276802 277396 277881 278363 278622 278471 278209
53549B78209K82J251K103K472K386K127K061K371K837L042K910K865L278L955
$$ 278209 278491 279742 281845 284317 286703 288830 290891 293262 296099 299141 302051 304916 308194 312149
53535C12149M359M198L625K994K648K821L564M675N925P248Q640R893J0656J0783
$$ 312149 316508 320706 324331 327325 329973 332794 336358 341033 346958 354206 362846 372739 383395 394178
53521C94178J0575J0533J0889J1402J1674J1739J2144J3279J4774J5856J6379
$$ 394178 404753 415286 426175 437577 449251 460990 473134 486413 501187 517043 533422
53510E33422J7020J8240J9545K0213K0478K1225K2568K3451K3001K1728K0797
$$ 533422 550442 568682 588227 608440 628918 650143 672711 696162 719163 740891 761688
53499G61688K0501K0124J9230J8363J8145J8309J8111J7398J6762J6645J6898
$$ 761688 782189 802313 821543 839906 858051 876360 894471 911869 928631 945276 962174
53488I62174J7249J7708J8228J8354J7651J6372J5303J4961J5181J5489J5628
$$ 962174 979423 997131 1015359 1033713 1051364 1067736 1083039 1098000 1113181 1128670 1144298
53477A144298J5557J5190J4329J2878J1013R075P348N936M757L545J893m35l116
$$ 1144298 1159855 1175045 1189374 1202252 1213265 1222340 1229688 1235624 1240381 1243926 1245819 1245384 1242268
53464A242268n355o727p807r644j2499j5427j7303j7971j8154j8450j8825j9015
$$ 1242268 1236913 1230186 1222379 1212735 1200236 1184809 1167506 1149535 1131381 1112931 1094106 1075091
53452A075091j9092j9385k0032k0746k1112k0992k0609k0222j9818j9219j8373
$$ 1075091 1055999 1036614 1016582 995836 974724 953732 933123 912901 893083 873864 855491
53441H55491j7375j6282j5117j4020j3134j2314j1134r339p120m978l416k677
$$ 855491 838116 821834 806717 792697 779563 767249 756115 746776 739656 734678 731262 728585
53429G28585k433j827k40J906L533M208M606N504O909Q448J0077J1855J3459J4565
$$ 728585 726152 724325 724085 725991 729524 733732 738338 743842 750751 759199 769276 781131 794590 809155
53415H09155J5488J6817J8512J9943K0845K1732K3184K5130K6982K8220K8855
$$ 809155 824643 841460 859972 879915 900760 922492 945676 970806 997788 1026008 1054863
53404A054863K9457L0723L2810L5106L6881L8071L9210M0760M2728M4903M7113
$$ 1054863 1084320 1115043 1147853 1182959 1219840 1257911 1297121 1337881 1380609 1425512 1472625
53393A472625M9221N1029N2243N2567N2004N1103N0529N0310M9833M8870M8001
$$ 1472625 1521846 1572875 1625118 1677685 1729689 1780792 1831321 1881631 1931464 1980334 2028335
53382B028335M7669M7226M5621M2692L9207L5767L2358K8846K5240K1441J7296
$$ 2028335 2076004 2123230 2168851 2211543 2250750 2286517 2318875 2347721 2372961 2394402 2411698
53371B411698J2967Q754M611L56l755p406j1114j6010k2419k9351l5677m1234
$$ 2411698 2424665 2433419 2438030 2438386 2434631 2427225 2416111 2400101 2377682 2348331 2312654 2271420
53359B271420m6365n0924n4222n5784n5749n4730n3541n2858n2806n2871n2317
$$ 2271420 2225055 2174131 2119909 2064125 2008376 1953646 1900105 1847247 1794441 1741570 1689253
53348A689253n0709m8208m5608m3863m3152m2591m1305l9682l8887l9170l9471
$$ 1689253 1638544 1590336 1544728 1500865 1457713 1415122 1373817 1334135 1295248 1256078 1216607
53337A216607l8874l7617l6281l4744l2626l0137k7755k5441k2918k0453j8626
$$ 1216607 1177733 1140116 1103835 1069091 1036465 1006328 978573 953132 930214 909761 891135
53326H91135j7371j6016j4306j2705j1533j0417q959p448o446n954n495m841m136
$$ 891135 873764 857748 843442 830737 819204 808787 799828 792380 785934 779980 774485 769644 765508
53313G65508l317k019l14J046J585J952L175N217P031Q073Q954J0304J1865J3228
$$ 765508 762191 760172 759858 760904 762489 764441 767616 772833 779864 787937 796891 807195 819060 832288
53299H32288J4731J6762J8709J9674J9934K0690K2315K3921K4853K5582K6681
$$ 832288 847019 863781 882490 902164 922098 942788 965103 989024 1013877 1039459 1066140
53288A066140K7734K7964K7394K6728K6326K5868K4891K3247K1128J8816J6414
$$ 1066140 1093874 1121838 1149232 1175960 1202286 1228154 1253045 1276292 1297420 1316236 1332650
53277A332650J3752J0775P916N658L672J059k338n490p490q801j0566j3047j5466
$$ 1332650 1346402 1357177 1365093 1370751 1374423 1375482 1373144 1367654 1360164 1351363 1340797 1327750 1312284
53264A312284j7253j8748k0511k2468k4018k4734k4772k4673k4963k5846k7157
$$ 1312284 1295031 1276283 1255772 1233304 1209286 1184552 1159780 1135107 1110144 1084298 1057141
53253A057141k8490k9457k9835k9674k9167k8432k7456k6353k5467k5028k4830
$$ 1057141 1028651 999194 969359 939685 910518 882086 854630 828277 802810 777782 752952
53242G52952k4530k4138k3832k3488k2789k1844k1176k1008k0965k0592j9789
$$ 752952 728422 704284 680452 656964 634175 612331 591155 570147 549182 528590 508801
53231E08801j8604j7043j5262j3554j1961j0221q384p051o670o867o889o519o214
$$ 508801 490197 473154 457892 444338 432377 422156 413772 406721 400051 393184 386295 379776 373562
53218C73562o383o839p052o792o408o436o965p520p637p268o517n354l978l096
$$ 373562 367179 360340 353288 346496 340088 333652 326687 319167 311530 304262 297745 292391 288413 285317
53204B85317l164l562l264k244j521j681k158k242k041k012k100j970j662j532
$$ 285317 282153 278591 275327 273083 271562 269881 267723 265481 263440 261428 259328 257358 255696 254164
53190B54164j740k153k556k741k604k250j879j438p90k07j82p01j175j299j378
$$ 254164 252424 250271 247715 244974 242370 240120 238241 236803 236013 235806 235624 234923 233748 232449 231071
53175B31071j671k019k268k452k233j102N75J424O88p59j678k035k462k802k320
$$ 231071 229400 227381 225113 222661 220428 219326 219901 221325 222013 221254 219576 217541 215079 212277 209957
53160B09957j118k00r4k53j15M0l30j066j380p93K64P98K55r08j819k151k140
$$ 209957 208839 208639 208545 208292 208177 208217 207887 206821 205441 204648 204912 205710 205965 205057 203238 201087 198947
53143A98947j764o89P65J422O93m34n82J98O31K2q85r76j2J246J835J443O19J15
$$ 198947 197183 196494 197259 198681 199374 198940 198358 198556 199187 199209 198324 197348 197336 198582 200417 201860 202479 202594
53125B02594l9m33j161j434p19L21O50J75m08o63o20k34M84J060J048P76Q99J280
$$ 202594 202555 202122 200961 199527 198808 199129 199779 199954 199546 198883 198263 198029 198513 199573 200621 201397 202296 203576
53107B03576J159L90l95p93j073j385j445j262j410k083k546j997o89L17L67k07
$$ 203576 204735 205125 204730 203937 202864 201479 200034 198772 197362 195279 192733 190736 190047 190364 190731 190524
53091A90524o05n00l04n62j128j262o41J11L01J32K17M82K93m14r54r54q25r97
$$ 190524 189919 189419 189115 188553 187425 186163 185522 185633 185934 186066 186283 186765 187058 186644 185690 184736 183911 182914
53073A82914j274j282j000n79q9L26M20K71L12O86R55P42L10J21J32o1n27q38
$$ 182914 181640 180358 179358 178779 178690 179016 179436 179707 180019 180705 181660 182402 182712 182833 182965 182904 182377 181539
53055A81539o06J49J117J923K174J561K32j030j349o75Q2R9l76m86q2O4n21j305
$$ 181539 180933 181082 182199 184122 186296 187857 188089 187059 185710 185035 185117 185216 184840 184354 184272 184336 183815 182510
53037A82510j548j241p98l88j20l38j097j677j371n31q8l15p13r49j074r80m81
$$ 182510 180962 179721 178923 178535 178415 178077 176980 175303 173932 173401 173313 172998 172285 171336 170262 169282 168801
53020A68801J24K76O8R5M25N23L64O44J541K136J620M91j34J5J91k79j221j895
$$ 168801 168925 169201 169269 169364 169789 170312 170676 171320 172861 174997 176617 177108 176974 176989 177180 176901 175680 173785
53002A73785j809j186p04p40r68q86n02j47J20L85L63k45q94n46Q74K150K220
$$ 173785 171976 170790 170086 169346 168378 167492 166990 166843 166963 167348 167711 167466 166572 166026 166900 169050 171270
52985A71270J322L74j59l26j45L27P15N90k9p67j252j204n16N01J258J486J422
$$ 171270 172592 172966 172807 172481 172336 172663 173378 173968 173939 173172 171920 170716 170200 170701 171959 173445 174867
52968A74867J231P30k7l62K71J459K225K061J207J56o47q45m02J75K40k72q67
$$ 174867 176098 176828 176801 176439 176710 178169 180394 182455 183662 183818 183171 182326 181924 182099 182339 182067 181200
52951A81200j174j304j474j612j499j142q11p64r97j316j547j640j518j022j51
$$ 181200 180026 178722 177248 175636 174137 172995 172184 171420 170423 169107 167560 165920 164402 163380 163229
52936A63229P12J063Q03L48J40J39r4q38j790k285k014j433j183j212q73k2N80
$$ 163229 163941 165004 165807 166155 166295 166434 166340 165502 163712 161427 159413 157980 156797 155585 154712 154690 155270
52919A55270L53j12J85J204J865J426K73o91r05m13K24K88l24p65k31Q64J394
$$ 155270 155623 155511 155696 156900 158765 160191 160464 159773 158868 158455 158679 158967 158643 157878 157647 158511 159905
52902A59905J122R04J179J219L83p27j023m29J77J52l24p22p16k46N70J456K060
$$ 159905 161027 161931 163110 164329 164712 163985 162962 162533 162710 162862 162538 161816 161100 160854 161424 162880 164940
52885A64940K090J461M47l90o73n96n43n22l28j65m70j083j258o31L01Q80R45
$$ 164940 167030 168491 168938 168548 167875 167279 166736 166214 165886 165721 165251 164168 162910 162279 162580 163460 164405
52868A64405O43J56j58J03P36J003O59M26J040K241L189L516L462L223K668J645
$$ 164405 165048 165204 165046 165149 165885 166888 167547 167973 169013 171254 174443 177959 181421 184644 187312 188957
52852A88957K65j126k108k499k509k368j898q85K06M65l07j327j895k102k220
$$ 188957 189222 188096 185988 183489 180980 178612 176714 175829 176035 176500 176193 174866 172971 170869 168649
52837A68649k043j400p31o50j231k050k600k403j258K92J302J544J698K085K062
$$ 168649 166606 165206 164475 163825 162594 160544 157944 155541 154283 154575 155877 157421 159119 161204 163266
52822A63266J277O21R47J546J096k81j134p81p3O6j88j97J85P52J445K264L035
$$ 163266 164543 165164 166111 167657 168753 168472 167338 166557 166484 166550 166362 166165 166350 167102 168547 170811 173846
52805A73846L493L375K332L12j897l095k900k167j864k004k080k069k407l059
$$ 173846 177339 180714 183046 183358 181461 178366 175466 173299 171435 169431 167351 165282 162875 159816
52791A59816l322k652j359k41K44J93o2k34j53Q0K7n66j137o98Q10K114K004P95
$$ 159816 156494 153842 152483 152242 152486 152679 152617 152383 152230 152310 152337 151771 150634 149936 150746 152860 154864 155659
52773A55659j97l43q6J33M20Q17R94Q42O72N87K74k94n89l67q2j04j43J30M69
$$ 155659 155462 155119 155033 155166 155586 156403 157397 158239 158911 159498 159772 159478 158889 158522 158440 158336 158193 158323 158792
52754A58792N66O00P90R09P43N22L91M4o42j105r13m22q4L29J008J260M30p75
$$ 158792 159358 159958 160748 161657 162400 162922 163313 163357 162715 161610 160697 160275 160191 160520 161528 162788 163218 162443
52736A62443r17L26J850K569K372J710J036P00P73Q55N48J8l55n81q32r64r05
$$ 162443 161526 161852 163702 166271 168643 170353 171389 172089 172862 173717 174265 174283 173928 173347 172515 171551 170646
52719A70646j071j616j761q14M94P66j43j078j390j512j707j503p04Q2L73L63
$$ 170646 169575 167959 166198 165384 165878 166644 166501 165423 164033 162521 160814 159311 158607 158689 159062 159425
52703A59425K80L0j98N2N66N06j99n87j72L14K97L28Q74J228P00n0o4K30k08j027
$$ 159425 159705 159735 159537 159589 160155 160661 160462 159875 159703 160017 160314 160642 161516 162744 163444 163394 163330 163560 163352 162325
52683A62325q32O20J954K157J783J716J836J553Q78K42k21n75o37l06p1n76j621
$$ 162325 161493 162113 164067 166224 168007 169723 171559 173112 173990 174232 174011 173436 172799 172493 172422 171846 170225
52666A70225k208j672m65M19N57M02N65J040J287R77M53L44P90J264J259R68J064
$$ 170225 168017 166345 165880 166299 166856 167258 167823 168863 170150 171127 171580 171924 172714 173978 175237 176205 177269
52649A77269J806K600K575J533J51p04p61m43l78q12j454j823j765j592j586j559
$$ 177269 179075 181675 184250 185783 185934 185230 184469 184026 183648 182836 181382 179559 177794 176202 174616 173057
52633A73057j116k60N87J153J531J730J529J007P71J248J963K036J248J66p00
$$ 173057 171941 171681 172268 173421 174952 176682 178211 179218 179989 181237 183200 185236 186484 186650 185950
52618A85950j340j840j988j582q66l65l21m17j18O98J449J353K99r21j446j238
$$ 185950 184610 182770 180782 179200 178334 177969 177648 177231 177113 177811 179260 180613 180912 179991 178545 177307
52602A77307r03p90o25q0O16R22O92L68L87O39P02N84P74J435K013K038J860K043
$$ 177307 176404 175614 174989 174909 175525 176447 177139 177507 177894 178533 179235 179819 180593 182028 184041 186079 187939 189982
52584A89982K336K039J229O48M06j91j181j509n92O46J081Q26N35J61n68j100
$$ 189982 192318 194357 195586 196234 196640 196449 195268 193759 193167 193813 194894 195720 196255 196416 195848 194748
52568A94748q30l47o59j446j486o16P2J08K11P62J056N84p7l14l78n39l59L82
$$ 194748 193918 193571 192912 191466 189980 189364 189436 189544 189755 190517 191573 192157 192080 191766 191388 190849 190490 190872
52550A90872Q69L81m64n32R7L48j61n94k83L45M92J01k35k09j31l60p42q01m13
$$ 190872 191741 192122 191658 191126 191223 191571 191410 190816 190533 190878 191370 191471 191236 191027 190896 190536 189794 188993 188580
52531A88580k8r1m64n83j23O96J361J447Q97J38k40j52j52n90r84o86R8N96O30
$$ 188580 188552 188461 187997 187414 187291 187987 189348 190795 191692 191830 191590 191438 191286 190696 189712 189026 189124 189720 190350
52512A90350Q11J448J978J715P74jJ51J226K338K480J590O36K40k43j564k984
$$ 190350 191161 192609 194587 196302 197076 197075 197226 198452 200790 203270 204860 205496 205736 205493 203929 200945
52496B00945k998j525j91k07r94j339r73m53k08k92m83k79O43J700J824R30J71
$$ 200945 197947 196422 196231 196024 195030 193691 192718 192265 192057 191765 191282 191003 191646 193346 195170 196100 196271
52479A96271K67N49K34k16P8Q98J275R05M26L90P65J244J481J209O04K56L61L66
$$ 196271 196538 197087 197321 197105 197183 198081 199356 200261 200687 201077 201842 203086 204567 205776 206380 206636 206997 207363
52461B07363o5k84M47J683K284J912J202O92L29Pk52o56j470k387k718k281j600
$$ 207363 207298 207014 207461 209144 211428 213340 214542 215234 215563 215570 215318 214662 213192 210805 208087 205806 204206
52444B04206j151r54q64p37l66K18M01l88j621j969q86O77J399R46q3j012j507
$$ 204206 203055 202101 201237 200500 200134 200352 200753 200365 198744 196775 195889 196566 197965 198911 198828 197816 196309
52427A96309j472j054o35m98n43m82k42M8L07O43J205J950K519K441J611N85J61
$$ 196309 194837 193783 193148 192650 192107 191625 191383 191431 191738 192381 193586 195536 198055 200496 202107 202692 202853
52410B02853O12J470K123K460K842L576M521N282N691N942O180O081N150L454
$$ 202853 203465 204935 207058 209518 212360 215936 220457 225739 231430 237372 243552 249633 254783 258237
52396B58237J651J79j297l261n381o593o208m653l078k307k243k170j596q00m05
$$ 258237 259888 260067 258770 255509 250128 243535 237327 232674 229596 227289 225046 222876 221280 220480 220075
52381B20075m91m19L16J307J688J212N76O25J405K163K202J668J422K060L198
$$ 220075 219584 219165 219481 220788 222476 223688 224264 224889 226294 228457 230659 232327 233749 235809 239007
52366B39007L877L541K408R65m12j358j511r31j93J73J61M1j7O1L20O39P15M75
$$ 239007 242884 246425 248833 249798 249386 248028 246517 245586 245393 245566 245727 245768 245751 245812 246132 246771 247486 247961
52348B47961J73j8k19m63m57k2O06J183J781K350K438J794J021R85J799K792L363
$$ 247961 248134 248116 247897 247434 246977 246955 247561 248744 250525 252875 255313 257107 258128 259113 260912 263704 267067
52331B67067L466L377L456M031N091O127O626O696O912P597Q539R313R605R299
$$ 267067 270533 273910 277366 281397 286488 292615 299241 305937 312849 320446 328985 338298 347903 357202
52317C57202Q576P801P168O568O017N821O054O265O107N923O158O457O060M981
$$ 357202 365778 373579 380747 387315 393332 399153 405207 411472 417579 423502 429660 436117 442177 447158
52303D47158M102M058M588N104N401N557N609N536N347N022M526L931L346K737
$$ 447158 451260 455318 459906 465010 470411 475968 481577 487113 492460 497482 502008 505939 509285 512022
52289E12022J979J104K76m24r72j248j157q08l77Q9N16O60M08N5m9J3L9L33J449
$$ 512022 514001 515105 515381 514957 513985 512737 511580 510772 510395 510484 511000 511660 512068 512123 512074 512087 512126 512459 513908
52270E13908L229M594M631L645K900L369M829O182O617O339O124O277O421O196
$$ 513908 517137 521731 526362 530007 532907 536276 541105 547287 553904 560243 566367 572644 579065 585261
52256E85261N687N091M487M154M530N521O394O743O931P175O905N722M350L704
$$ 585261 590948 596039 600526 604680 609210 614731 621125 627868 634799 641974 648879 654601 658951 662655
52242F62655L583L240K834L117L923M199L623K996K867K875K757K994L873M822
$$ 662655 666238 669478 672312 675429 679352 683551 687174 690170 693037 695912 698669 701663 705536 710358
52228G10358N298N582O109O546O281N429M773M834N434O002O070N658N288N389
$$ 710358 715656 721238 727347 733893 740174 745603 750376 755210 760644 766646 772716 778374 783662 789051
52214G89051N638N356M550M005M270N094O062P123Q164Q698Q441P726O992O267
$$ 789051 794689 800045 804595 808600 812870 817964 824026 831149 839313 848011 856452 864178 871170 877437
52200H77437N499M909M580M228L766L678M295N165N649N764N922O171O231O003
$$ 877437 882936 887845 892425 896653 900419 904097 908392 913557 919206 924970 930892 937063 943294 949297
52186I49297N523M646L309J890P76j62j253k403l352m262n422o525o972o840o867
$$ 949297 954820 959466 962775 964665 965441 965279 964026 961623 958271 954009 948587 942062 935090 928250 921383
52171I21383p391p826p440o275n114m723n157n552m792k707m49P29Q86R97J410
$$ 921383 913992 906166 898726 892451 887337 882614 877457 871905 867113 864406 863957 864686 865572 866569 867979
52156H67979J553J159Q65J170J600J442P26j12r56j690j586o0K155L462L263K515
$$ 867979 869532 870691 871556 872726 874326 875768 876494 876382 875426 873736 872150 872090 874245 877707 880970 883485
52140H83485K230K142J379j84j873l167m034m512m560m320m005l473k461j169
$$ 883485 885715 887857 889236 889052 887179 884012 879978 875466 870906 866586 862581 859108 856647 855478
52126H55478j45N91J714L622N851P761R383J1054J2587J3416J3389J2858J1994
$$ 855478 855333 855924 857638 861260 867111 874872 884255 895309 907896 921312 934701 947559 959553
52113I59553J0659Q994P632P006O793O342N441M416L622L062K513J822J078N58
$$ 959553 970212 979206 986838 993844 1000637 1006979 1012420 1016836 1020458 1023520 1026033 1027855 1028933 1029491
52099A029491N56J266K675M428N820O207N599M656L885L024J444r80l727o147
$$ 1029491 1030047 1031313 1033988 1038416 1044236 1050443 1056042 1060698 1064583 1067607 1069051 1068071 1064344 1058197
52085A058197p820q485q064o854n416m177l256k619k089j264J14J660K576K572
$$ 1058197 1050377 1041892 1033828 1026974 1021558 1017381 1014125 1011506 1009417 1008153 1008267 1009927 1012503 1015075
52071A015075K278K518L398M385N106N704O349O751O408N359M348M016M143L972
$$ 1015075 1017353 1019871 1023269 1027654 1032760 1038464 1044813 1051564 1057972 1063331 1067679 1071695 1075838 1079810
52057A079810L232K373J768J247O48K48K04j9j025k621m140n369o547p622q268
$$ 1079810 1083042 1085415 1087183 1088430 1089078 1089326 1089530 1089511 1088486 1085865 1081725 1076356 1069809 1062187 1053919
52042A053919q618r224j0100j0483r841q598p579p117o935o589n806m683l614
$$ 1053919 1045301 1036077 1025977 1015494 1005653 997055 989476 982359 975424 968835 963029 958346 954732
52029I54732k885k306j610j034r81j254j240r09q80j351j688j457j082j071j235
$$ 954732 951847 949541 947931 946897 945916 944662 943422 942513 941633 940282 938594 937137 936055 934984 933749
52014I33749j246j376k003k757k900k358j777j720k313l597n633q240j0941j3332
$$ 933749 932503 931127 929124 926367 923467 921109 919332 917612 915299 911702 906069 897829 886888 873556
52000H73556j5256j6742j7935j8942j9547j9321j8300j7277j6964j7089j6749
$$ 873556 858300 841558 823623 804681 785134 765813 747513 730236 713272 696183 679434
51989F79434j5577j4092j2960j2342j2023j1790j1495j1063j0580j0273j0298
$$ 679434 663857 649765 636805 624463 612440 600650 589155 578092 567512 557239 546941
51978E46941j0611j1054j1450j1626j1483j1035j0336r403q288p067n705m029
$$ 546941 536330 525276 513826 502200 490717 479682 469346 459943 451655 444588 438883 434854
$$ [...]
##END NTUPLES=NMR SPECTRUM
##END=
