
##TITLE=UV1270_M13_1250-1169_5_7414377_yad8vE2ShB
##JCAMPDX= 6.0         $$ Bruker NMR JCAMP-DX V2.0
##DATA TYPE= NMR SPECTRUM
##DATA CLASS= NTUPLES
##ORIGIN= BRUKER
##OWNER= Administrator
$$ 1.72 TOPSPIN		Version 2.1
$$ 2013-01-26 01:31:16.465 -0500  Administrator@X
$$ Compression mode = diff/dup
##.OBSERVE FREQUENCY= 400.02188249412
##.OBSERVE NUCLEUS= ^1H
##.ACQUISITION MODE= SIMULTANEOUS (DQD)
##.ACQUISITION SCHEME= undefined
##.AVERAGES= 8
##.DIGITISER RES= 22
##SPECTROMETER/DATA SYSTEM= spect
##.PULSE SEQUENCE= zg30
##.SOLVENT NAME= COFFEE_meoh
##.SHIFT REFERENCE= INTERNAL, COFFEE_meoh, 1, 14.98509
##AUDIT TRAIL= $$ (NUMBER, WHEN, WHO, WHERE, PROCESS, VERSION, WHAT)
$$ ##TITLE= Audit trail, TOPSPIN		Version 2.1
$$ ##JCAMPDX= 5.01
$$ ##ORIGIN= Bruker BioSpin GmbH
$$ ##OWNER= Administrator
$$ $$ E:\/data/COFFEE/nmr/UV1270_M13_1250-1169_5_7414377_yad8vE2ShB/10/pdata/1/auditp.txt
$$ ##AUDIT TRAIL=  $$ (NUMBER, WHEN, WHO, WHERE, PROCESS, VERSION, WHAT)
(   1,<2013-01-26 01:31:08.481 -0500>,<Administrator>,<X>,<go>,<TOPSPIN 2.1>,
      <created by zg
	started at 2013-01-26 01:30:02.090 -0500,
	POWCHK enabled, PULCHK disabled,
       configuration hash MD5:
       86 BA 57 50 F2 9D 5C 9B 26 00 A9 28 5F 66 2E 89
       data hash MD5: 64K
       29 12 61 55 E6 0D AF 06 47 C4 05 A8 BB B3 5B 92>)
(   2,<2013-01-26 01:31:11.528 -0500>,<Administrator>,<X>,<proc1d>,<TOPSPIN 2.1>,
      <Start of raw data processing
       efp LB = 0 FT_mod = 6 PKNL = 1 PHC0 = 0 PHC1 = 0 SI = 32K 
       data hash MD5: 32K
       34 82 C2 87 D3 71 86 7B 65 50 83 24 06 0F 90 6E>)
(   3,<2013-01-26 01:31:11.996 -0500>,<Administrator>,<X>,<proc1d>,<TOPSPIN 2.1>,
      <pk PHC0 = 98.05298 PHC1 = 0 
       data hash MD5: 32K
       42 8E 6A 1D FE 72 D1 61 B2 38 E1 4D 5D F7 EA 01>)
(   4,<2013-01-26 01:31:12.231 -0500>,<Administrator>,<X>,<proc1d>,<TOPSPIN 2.1>,
      <abs ABSG = 1 
       data hash MD5: 32K
       77 A2 6E 95 C4 C4 B6 BC 6A 82 28 23 F6 2D 35 74>)
(   5,<2013-01-26 01:31:12.371 -0500>,<Administrator>,<X>,<proc1d>,<TOPSPIN 2.1>,
      <abs ABSG = 2 
       data hash MD5: 32K
       BB ED 1C 7C DB FE AE CC 50 34 8B CE 50 B8 3B A7>)
(   6,<2013-01-26 01:31:12.512 -0500>,<Administrator>,<X>,<proc1d>,<TOPSPIN 2.1>,
      <abs ABSG = 3 
       data hash MD5: 32K
       F1 1D FE CF 10 0A E4 6E DF C3 59 75 70 B5 09 53>)
(   7,<2013-01-26 01:31:12.653 -0500>,<Administrator>,<X>,<proc1d>,<TOPSPIN 2.1>,
      <abs ABSG = 4 
       data hash MD5: 32K
       8A 50 38 CD DA D8 C2 91 6F D0 7F D8 FC BE 16 A7>)
(   8,<2013-01-26 01:31:12.824 -0500>,<Administrator>,<X>,<proc1d>,<TOPSPIN 2.1>,
      <abs ABSG = 5 
       data hash MD5: 32K
       0F EC DF E4 F9 6A F3 05 D6 F0 67 2E 89 68 24 FE>)
$$ ##END=
$$ 
$$ $$ hash MD5
$$ $$ 66 83 F7 06 2A FC 1A D2 86 F6 DF B1 09 BB 3E 03
##$RELAX= 
##$RELAX= 
##$RELAX= 
##$RELAX= 
##$RELAX= 
##$RELAX= 
##$RELAX= 
$$ Bruker specific parameters
$$ --------------------------
##$DU= <E:\>
##$EXPNO= 10
$$ [...]
150 150 150 150 150 150 150 150
##$TP07= 0
##$TPNAME0= <>
##$TPNAME1= <>
##$TPNAME2= <>
##$TPNAME3= <>
##$TPNAME4= <>
##$TPNAME5= <>
##$TPNAME6= <>
##$TPNAME7= <>
##$TPOAL= (0..7)
0.5 0.5 0.5 0.5 0.5 0.5 0.5 0.5
##$TPOFFS= (0..7)
0 0 0 0 0 0 0 0
##$TUNHIN= 0
##$TUNHOUT= 0
##$TUNXOUT= 0
##$USERA1= <user>
##$USERA2= <user>
##$USERA3= <user>
##$USERA4= <user>
##$USERA5= <user>
##$V9= 5
##$VALIST= <valist>
##$VCLIST= <CCCCCCCCCCCCCCC>
##$VD= 0
##$VDLIST= <DDDDDDDDDDDDDDD>
##$VPLIST= <PPPPPPPPPPPPPPP>
##$VTLIST= <TTTTTTTTTTTTTTT>
##$WBST= 2048
##$WBSW= 25
##$XGAIN= (0..3)
0 0 0 0
##$XL= 0
##$YL= 0
##$YMAX_a= 679381
##$YMIN_a= -577972
##$ZGOPTNS= <>
##$ZL1= 120
##$ZL2= 120
##$ZL3= 120
##$ZL4= 120
##$ABSF1= 14.98509
##$ABSF2= -5.573092
##$ABSG= 5
##$ABSL= 3
##$ALPHA= 0
##$AQORDER= 0
##$ASSFAC= 0
##$ASSFACI= 0
##$ASSFACX= 0
##$ASSWID= 0
##$AUNMP= <proc_prof1d_extract_pilot.lims>
##$AXLEFT= 0
##$AXNAME= <>
##$AXNUC= <1H>
##$AXRIGHT= 0
##$AXTYPE= 0
##$AXUNIT= <>
##$AZFE= 0.1
##$AZFW= 0.1
##$BCFW= 0
##$BC_mod= 0
##$BYTORDP= 0
##$COROFFS= 0
##$CY= 15
##$DATMOD= 1
##$DC= 0
##$DFILT= <>
##$DTYPP= 0
##$F1P= 0
##$F2P= 0
##$FCOR= 0.5
##$FTSIZE= 32768
##$FT_mod= 6
##$GAMMA= 0
##$GB= 0
##$INTBC= 1
##$INTSCL= 1
##$ISEN= 128
##$LB= 0
##$LEV0= 0
##$LPBIN= 0
##$MAXI= 10000
##$MC2= 0
##$MEAN= 0
##$ME_mod= 0
##$MI= 0
##$NCOEF= 0
##$NC_proc= -8
##$NLEV= 6
##$NOISF1= 0
##$NOISF2= 0
##$NSP= 0
##$NTH_PI= 0
##$NZP= 0
##$OFFSET= 14.98509
##$PC= 1
##$PHC0= 98.05298
##$PHC1= 0
##$PH_mod= 1
##$PKNL= yes
##$PPARMOD= 0
##$PPDIAG= 0
##$PPIPTYP= 0
##$PPMPNUM= 2147483647
##$PPRESOL= 1
##$PSCAL= 4
##$PSIGN= 0
##$PYNMP= <proc.py>
##$REVERSE= no
##$SF= 400.02
##$SI= 32768
##$SIGF1= 0
##$SIGF2= 0
##$SINO= 400
##$SIOLD= 32768
##$SPECTYP= <>
##$SREGLST= <1H.CDCl3>
##$SSB= 0
##$STSI= 32768
##$STSR= 0
##$SW_p= 8223.68421052631
##$SYMM= 0
##$S_DEV= 0
##$TDeff= 65536
##$TDoff= 0
##$TI= <>
##$TILT= no
##$TM1= 0
##$TM2= 0
##$TOPLEV= 0
##$USERP1= <user>
##$USERP2= <user>
##$USERP3= <user>
##$USERP4= <user>
##$USERP5= <user>
##$WDW= 1
##$XDIM= 32768
##$YMAX_p= 474034392
##$YMIN_p= -741671
##$CURPLOT= <Network HP LaserJet P1505>
##$CURPRIN= <$Network HP LaserJet P1505>
##$DFORMAT= <normdp>
##$LAYOUT= <+/1D_H.xwp>
##$LFORMAT= <normlp>
##$PFORMAT= <normpl>
##$SURQMSG= 1
$$ End of Bruker specific parameters
$$ ---------------------------------
##NTUPLES= NMR SPECTRUM
##VAR_NAME=  FREQUENCY,     SPECTRUM/REAL,   SPECTRUM/IMAG
##SYMBOL=    X,             R,               I
##VAR_TYPE=  INDEPENDENT,   DEPENDENT,       DEPENDENT
##VAR_FORM=  AFFN,          ASDF,            ASDF
##VAR_DIM=   32768,         32768,           32768
##UNITS=     HZ,            ARBITRARY UNITS, ARBITRARY UNITS
##FACTOR=    0.250966925370066, 1,           1
##FIRST=     8223.43324360094, -119395,      -129277
##LAST=      0,             -103993,         -46288
##MIN=       0,             -741671,         0
##MAX=       8223.43324360094, 474034392,    0
$$ Real data points
##PAGE= N=1
##DATA TABLE= (X++(R..R)), XYDATA
$$ [...]
19512f1946n4594A70505a17317k88757a84795f6477f183G3115f9646q2484j01222
$$ -61946 -116540 170505 -117317 -406074 -184795 -66477 -6183 73115 -69646 -152130 -253352
19501b53352A87230F6064k7775a98110J2753m71k9462d9019A18511c56205A216
$$ -253352 187230 66064 38289 -198110 -185357 -185828 -215290 -49019 118511 -356205 1216
19489F937J51107b10258l1346a10741j57941L5187m2715Q3302F5136a86092j14538
$$ 6937 158044 -210258 -241604 -110741 -268682 -233495 -276210 -192908 65136 -186092 -300630
19478c00630C3542b78573i6057o8707a1882j91411O3766f5992E26596c85898B29398
$$ -300630 33542 -278573 -96057 -164764 -11882 -203293 -139527 -65992 526596 -385898 229398
19466a20417j08612e3210q9808k488q7686B8707B116J38037J12919d0657o0000
$$ -120417 -229029 -53210 -143018 -145506 -233192 28707 2116 140153 253072 -40657 -100657
19455a00657A26825j7871a7561l4019B3018a14652I8960b7437k4498k8575A11150
$$ -100657 126825 108954 -17561 -51580 23018 -114652 98960 -27437 -51935 -80510 111150
19443I1253A6004b36424A75455E308f5420F312J32373f1725A55993d17413A19419
$$ 91253 16004 -236424 175455 5308 -65420 6312 138685 -61725 155993 -417413 119419
19431h0747G9004a48785j7204D235J61674a49816A4317J28541a18597j16911A69867
$$ -80747 79004 -148785 -165989 4235 165909 -149816 14317 142858 -118597 -235508 169867
19419b22986A82056a53111L4894k5387a0077C6980h0095l6481J7730B314K1459
$$ -222986 182056 -153111 -118217 -143604 -10077 36980 -80095 -116576 -98846 2314 23773
19408B3773c03974Q3325O9377B47520A9819a55744B31204a33016N9051O772j34001
$$ 23773 -303974 -220649 -151272 247520 19819 -155744 231204 -133016 -73965 -67193 -201194
19397b01194o91f1406b0658k41191h6186G9074e24431i3032n1473m0450A04937
$$ -201194 -201885 -61406 -20658 -261849 -86186 79074 -524431 -93032 -144505 -184955 104937
19385g3917m5594l013c0555k29391l5185D1421c6714A51530a21061j31608a693
$$ -73917 -119511 -122524 -30555 -259946 -295131 41421 -36714 151530 -121061 -252669 -1693
19373F7543b94469c9130r7049O0678k85455a75781m1489A67261c25438Q9654A46569
$$ 67543 -294469 -39130 -136179 -75501 -360956 -175781 -217270 167261 -325438 -235784 146569
19361I4665B0705a14866A00453a73217j204P9492j30454g5346A69568c0992A02725
$$ 94665 20705 -114866 100453 -173217 -174421 -94929 -225383 -75346 169568 -30992 102725
19349E4319k4572b35284f3434J3024K4323l3900j68217N1364B1348a74908A31161
$$ 54319 29747 -235284 -63434 -50410 -26087 -59987 -228204 -176840 21348 -174908 131161
19337A9551K71543i8291k94330a08738m6180C95881a62701l102A34919g1499L4477
$$ 19551 291094 -98291 -392621 -108738 -154918 395881 -162701 -165803 134919 -71499 -37022
19326c7022j29571B1364b668A3497J79817Q579d5201a7546n4531B68382n3613
$$ -37022 -166593 21364 -2668 13497 193314 201893 -45201 -17546 -72077 268382 214769
19315B14769q9777O780c00090A37123J19650p6578d5661j0262j68879C6366a65258
$$ 214769 124992 131772 -300090 137123 256773 180195 -45661 -55923 -224802 36366 -165258
19303B28026k151g4512F9629d07303h3506B52620a36536d4241o0954L0404j89441
$$ 228026 225875 -74512 69629 -407303 -83506 252620 -136536 -44241 -105195 -74791 -264232
19292b64232d3066n2738m00342D0522J17495b50716I0013k7738J01305F7195b82088
$$ -264232 -43066 -95804 -496146 40522 158017 -250716 90013 62275 163580 67195 -282088
19280a8287j07046k35225J09953i0104p6633k5603a3000k83445A37654e6221m225
$$ -18287 -125333 -360558 -250605 -90104 -166737 -192340 -13000 -296445 137654 -56221 -60446
19269f0446j32885q7005c7281k78671J52750j2807j81519A7764R0153Q3007E9398
$$ -60446 -193331 -280336 -37281 -315952 -163202 -176009 -357528 17764 107917 190924 59398
19257a87079B4178c50576c0483j22202j17144G5203a79877p1884E2856J74591
$$ -187079 24178 -350576 -30483 -152685 -269829 75203 -179877 -251761 52856 227447
19247B27447a50349b6648a2959C38731d5434F7542a18390M7549A79084H29d80107
$$ 227447 -150349 -26648 -12959 338731 -45434 67542 -118390 -70841 179084 829 -480107
19235a00679a4651k64345B66468a01607A33003g8571L2641C2272M8182c1470A76477
$$ -100679 -14651 -278996 266468 -101607 133003 -78571 -45930 32272 80454 -31470 176477
19223c4805B05069p251F063e0135K376F4342a82402c1894B20601a05631j20521
$$ -34805 205069 197818 6063 -50135 -47759 64342 -182402 -31894 220601 -105631 -226152
19212b26152A63180b69509d0233A21446f6647j4113j8116B2255f4322j82209a4673
$$ -226152 163180 -269509 -40233 121446 -66647 -80760 -98876 22255 -64322 -246531 -14673
19200h7768A85195p397E1166a33764m1771j01141E8477k4259h436I9181A816e1174
$$ -87768 185195 177798 51166 -133764 -175535 -276676 58477 34218 -8436 99181 1816 -51174
19187f276H9312a06484A95808a59429B2304b48294c7085a3375E1924a3492l36385
$$ -6276 89312 -106484 195808 -159429 22304 -248294 -37085 -13375 51924 -13492 -349877
19176c49877g1128j1391l16460a42840f75F9243J88796a04236B68470o8786a62074
$$ -349877 -71128 -82519 -398979 -142840 -675 69243 258039 -104236 268470 199684 -162074
19164A69558a00470e0031C12196g6347K5063k232B16579b63720K9826j13519a19384
$$ 169558 -100470 -50031 312196 -76347 -51284 -53516 216579 -263720 -233894 -347413 -119384
19152a85240r186i0567B2393a66981D0682c19657J55842j13213d0531R898j5930
$$ -185240 -194426 -90567 22393 -166981 40682 -319657 -163815 -277028 -40531 -30633 -46563
19141d6563j89599a16507q0158G2058b37551M6054j37939C75342a41272A3140
$$ -46563 -236162 -116507 -196665 72058 -237551 -191497 -329436 375342 -141272 13140
19130A64378c7857A20252h8522l14719A33809c18801A57668E0284J42352a17209
$$ 164378 -37857 120252 -88522 -403241 133809 -318801 157668 50284 192636 -117209
19119f4307j16917P8023k3885j03671a1679k28653j24850M8063A05235L2927a56127
$$ -64307 -181224 -103201 -127086 -230757 -11679 -240332 -365182 -317119 105235 138162 -156127
19107b55783h7281D5761N8138a24944j58079E1363a55241k77409D3916a44753
$$ -255783 -87281 45761 103899 -124944 -283023 51363 -155241 -432650 43916 -144753
19096b5897j493k06574A82953a14909M3960B13087I6223a35060J5996k59905J49297
$$ -25897 -27390 -233964 182953 -114909 -70949 213087 96223 -135060 -119064 -378969 -229672
19085b29672r0822J12919j26756B41181C0674a21245o0637P1234a0606o5093j51210
$$ -229672 -320494 -207575 -334331 241181 30674 -121245 -181882 -110648 -10606 -75699 -226909
19074b26909Q5640B48511E2266M1453e7842C8381J09551a67989j02833A41738
$$ -226909 -141269 248511 52266 93719 -57842 38381 147932 -167989 -270822 141738
19063i649D6526J30456d3739a7942C15423E9285h4894H6829c7772j34481B75114
$$ -9649 46526 176982 -43739 -17942 315423 59285 -84894 86829 -37772 -172253 275114
19051I6060a52619q38J5189j26685c5313N980k6748A59752F5401J43760F7646
$$ 96060 -152619 -153457 -138268 -264953 -35313 -29333 -56081 159752 65401 209161 67646
19039b03362d8453C6018QJ25396a23480k05447a29600A31889K5894G7170a55473
$$ -203362 -48453 36018 36026 161422 -123480 -328927 -129600 131889 157783 77170 -155473
19027a9337E260M51990E771P2562c5590D5614J07650a03281J1183l5530e1578
$$ -19337 5260 457250 5771 78333 -35590 45614 153264 -103281 -92098 -127628 -51578
19015a94596k3464C62391g1832B78326a11795C7953K7139b88439G7197c7344a2832
$$ -194596 -218060 362391 -71832 278326 -111795 37953 65092 -288439 77197 -37344 -12832
19003A11628N7683c049B43832j14341n8441C2736f7768A52930e8777C200c764
$$ 111628 169311 -3049 243832 129491 71050 32736 -67768 152930 -58777 3200 -3764
18991G6101J47292d3252B25993I1263j7230J86455h7983A15888i0714j9438H7080
$$ 76101 223393 -43252 225993 91263 74033 260488 -87983 115888 -90714 -110152 87080
18979c65180A69924b00872Q6102J2770k1935b8122A7264J2768d34017H7816B5091
$$ -365180 169924 -200872 -114770 -102000 -123935 -28122 17264 30032 -434017 87816 25091
18967a23156g630E499c99738B7342L6648Q8933c69774J14191i0797E0903J55456
$$ -123156 -7630 5499 -399738 27342 63990 152923 -369774 -255583 -90797 50903 206359
18956B06359A8115d1770j12931B4155F307a5386n5991H0844b59984A84681g6294
$$ 206359 18115 -41770 -154701 24155 6307 -15386 -71377 80844 -259984 184681 -76294
18944a67887B30146b71111B69285G6330a55006j94614E1125K43686j47302a26305
$$ -167887 230146 -271111 269285 76330 -155006 -349620 51125 294811 147509 -126305
18933d3297j59526L1935E1014M9237d17333P9399J29227c7708j65425R8301A69970
$$ -43297 -202823 -170888 51014 100251 -417333 -337934 -208707 -37708 -203133 -104832 169970
18921B37150h946k5251j59367M6101M3821A86029c6909k37609a28346n0675j57703
$$ 237150 -8946 -34197 -193564 -147463 -103642 186029 -36909 -274518 -128346 -179021 -336724
18910c36724J50551A9083g2456j6392A4757K9855i7789I8248e4547k8254m1263
$$ -336724 -186173 19083 -72456 -88848 14757 44612 -97789 98248 -54547 -82801 -124064
18899a24064d2302H8472b73015l4118J28858L863P8187m6746o7771k0057a6455
$$ -124064 -42302 88472 -273015 -307133 -178275 -174412 -96225 -142971 -210742 -230799 -16455
18887b10537B0947b6854o433B6787K98467e62214a55960d8566C9215b95242a28289
$$ -210537 20947 -26854 -33287 26787 325254 -562214 -155960 -48566 39215 -295242 -128289
18875a20690A77398H7875b83743A2103a79352A10390E1554b28591F0919L39492
$$ -120690 177398 87875 -283743 12103 -179352 110390 51554 -228591 60919 400411
18865D00411b85758a21523j96554N7329G2837a14472C9748a61343k5487q4360
$$ 400411 -285758 -121523 -318077 -260748 72837 -114472 39748 -161343 -186830 -271190
18855b71190i1142j31930h4638p6720P1482A26138b28159l0740A15096a42469
$$ -271190 -91142 -223072 -84638 -161358 -89876 126138 -228159 -258899 115096 -142469
18844A00313h0447j1187o6791j12774g8954k0957a4276C08668b95713D1765O0202
$$ 100313 -80447 -91634 -158425 -271199 -78954 -99911 -14276 308668 -295713 41765 101967
18833A01967b31081I7459a51423k60341R4162E2406N7636J7371O6231g1827k50228
$$ 101967 -231081 97459 -151423 -411764 -317602 52406 110042 127413 193644 -71827 -322055
18822c22055J25794R695I7778J54024A23629B0574K53838j19060J80283C0425
$$ -322055 -196261 -186566 97778 251802 123629 20574 274412 155352 335635 30425
18811A52667f9468A26839b85316A27857k2507J36248I3658C289K02705f6940L0647
$$ 152667 -69468 126839 -285316 127857 105350 241598 93658 3289 205994 -66940 -36293
18800c6293f430C8131c10513A07598a58064A42201O6937b15994M3139M588q2117
$$ -36293 -6430 38131 -310513 107598 -158064 142201 209138 -215994 -172855 -168267 -250384
18789b50384I3838a21328D6084b20101a09883b9430I3406A4216a57907D8686a05874
$$ -250384 93838 -121328 46084 -220101 -109883 -29430 93406 14216 -157907 48686 -105874
18777b02876o9380Q7543I072a12503o6672e9131j89984j7255a0918E2277L4755
$$ -202876 -272256 -184713 9072 -112503 -179175 -59131 -249115 -266370 -10918 52277 87032
18766H7032e7925A05342D7827d02635b8480j73229I1587a6407n11800a87680B85495
$$ 87032 -57925 105342 47827 -402635 -28480 -201709 91587 -16407 -528207 -187680 285495
18754a66100B36304o6558D2193J0129c66395J71989k8494A65052b4748B12909
$$ -166100 236304 169746 42193 52322 -366395 -194406 -222900 165052 -24748 212909
18743b2591j51737B209K09269N349b2814F4763d2820B97697A24635a59812O5453
$$ -22591 -174328 2209 211478 216827 -22814 64763 -42820 297697 124635 -159812 -94359
18732i4359K8119B6678K14171g4414k16328E6536a50341f6285A25828p024j8623
$$ -94359 -66240 26678 240849 -74414 -290742 56536 -150341 -66285 125828 118804 100181
18721A00181a58865g3897F0727G577J3275b18664a3913E9731R6597f5374n4539
$$ 100181 -158865 -73897 60727 7577 20852 -218664 -13913 59731 156328 -65374 -119913
18710a19913D4845a03706p2188e0290F1700a33B18726B1641b23210M0431j45574
$$ -119913 44845 -103706 -175894 -50290 61700 -133 218726 21641 -223210 -182779 -328353
18699c28353C72030i9983L2617q2904N3211D7865J50640b42201c5018a3809A0382
$$ -328353 372030 -99983 -67366 -150270 -97059 47865 198505 -242201 -35018 -13809 10382
18687a28587K4289A45594D7946b00106M4016q2154k0553E9772b42375C62169a52906
$$ -128587 -104298 145594 47946 -200106 -156090 -238244 -258797 59772 -242375 362169 -152906
18675e00370e1220E6765K10836b55012e8667A98067b52933K6460P1895k6891F9422
$$ -500370 -51220 56765 267601 -255012 -58667 198067 -252933 -226473 -154578 -181469 69422
18663e6244A07470M4187b16566b569p2922a2774C49973b24894l1412G1090b00370
$$ -56244 107470 151657 -216566 -2569 -75491 -12774 349973 -224894 -256306 71090 -200370
18651A75642b02828P6407k06161d0316C4390L9752a82881H7829c831A26335a2193
$$ 175642 -202828 -126421 -332582 -40316 34390 74142 -182881 87829 -3831 126335 -12193
18639A08888J25323F9123M8436d26066f7870A27352a56751A15958a7536A07771
$$ 108888 234211 69123 117559 -426066 -67870 127352 -156751 115958 -17536 107771
18628c1543A9283R2697f6376M812k21518E953a31691B08388p2586J13821d33888
$$ -31543 19283 111980 -66376 -61564 -283082 5953 -131691 208388 135802 249623 -433888
18616a21989k14811a5717l9121j29100j29220a14131G7762a37761M6473F2979
$$ -121989 -336800 -15717 -54838 -183938 -313158 -114131 77762 -137761 -91288 62979
18605G2737N9152c9121A95565b4783I1364E975J64417b75599F2707e5846A90542
$$ 72737 131889 -39121 195565 -24783 91364 5975 170392 -275599 62707 -55846 190542
18593D2370a55169C57945B7901a14175G3175i0388n6892A11214K7188L1382E1891
$$ 42370 -155169 357945 27901 -114175 73175 -90388 -147280 111214 138402 169784 51891
18581A31310b89040F4025c1110C8034J26100a519k5155k5110b5349j88288a5304
$$ 131310 -289040 64025 -31110 38034 164134 -1519 -26674 -51784 -25349 -213637 -15304
18569B06822b11933A3836a23411M2312p1609A62187A5661J12748a14592B4002
$$ 206822 -211933 13836 -123411 -81099 -152708 162187 15661 128409 -114592 24002
18558a5452k73816a38828a7837k0075r7845L2924n53885A82920n0052c06278J40006
$$ -15452 -289268 -138828 -17837 -37912 -135757 -102833 -656718 182920 132868 -306278 -166272
18547a66272A56204a2785A13776a0113A01272b53877e6441A17525a24399m4712
$$ -166272 156204 -12785 113776 -10113 101272 -253877 -56441 117525 -124399 -169111
18537a69111j7461Q4525o2652C9033a89538j02820a43168j99310a9951j69625
$$ -169111 -186572 -102047 -164699 39033 -189538 -292358 -143168 -342478 -19951 -189576
18527a89576J828G7158b07828j08251M0813J21690a6700k87548J12791F8726a04117
$$ -189576 -187748 77158 -207828 -316079 -275266 -153576 -16700 -304248 -191457 68726 -104117
18515C5662K29626d4312A08476b36408R4760K7605B9549b42560G6374c10584A52944
$$ 35662 265288 -44312 108476 -236408 -141648 -114043 29549 -242560 76374 -310584 152944
18503c49648c5439k12549j48442D1954J38091a65250j4962D5701a49917b6242
$$ -349648 -35439 -247988 -396430 41954 180045 -165250 -180212 45701 -149917 -26242
18492b79190D3575c76156A91048g1213r2873k07009J12349C4456e7205k498A24195
$$ -279190 43575 -376156 191048 -71213 -164086 -371095 -258746 34456 -57205 -59703 124195
18480h8857A12796N0950F5578a59094B76635B8405g3806I6103a27666o6092A51892
$$ -88857 112796 163746 65578 -159094 276635 28405 -73806 96103 -127666 -193758 151892
18468a11208j03331Q7541j01484b9615n12I8594b61829j45712A1482a03967A25581
$$ -111208 -214539 -126998 -228482 -29615 -30127 98594 -261829 -407541 11482 -103967 125581
18456B7081K00143B7456g822A973J533K7920P999J49810a25011F1671b77691a05309
$$ 27081 227224 27456 -7822 1973 3506 31426 39425 189235 -125011 61671 -277691 -105309
18443a27527F5250b95166G7622o344J0429f8411l2466j11268R0610r3349E5357
$$ -127527 65250 -295166 77622 71278 81707 -68411 -100877 -212145 -121535 -214884 55357
18431c64934B0187b07844A56702c3691D3880N1913b73148A9306J81129r0992a55735
$$ -364934 20187 -207844 156702 -33691 43880 95793 -273148 19306 200435 109443 -155735
18419a06482k69804B14755a78281a9329A2262e4007B1506f7676l47216B62135
$$ -106482 -376286 214755 -178281 -19329 12262 -54007 21506 -67676 -414892 262135
18408A23996c3897F1430l0091J85050q8088b3273l8874J3577j9607B01278a3275
$$ 123996 -33897 61430 31339 216389 128301 -23273 -62147 -48570 -68177 201278 -13275
18396a19738F2571a27312H7813k4569c55927A70558l5871g7277A94347b35216
$$ -119738 62571 -127312 87813 63244 -355927 170558 134687 -77277 194347 -235216
18385A46324a69965C5551a99509l96380b39833F4687b31503c1522B30802a69083
$$ 146324 -169965 35551 -199509 -595889 -239833 64687 -231503 -31522 230802 -169083
18374A4824a41839A71079a0408A57111e8754j02978m7580O3857A27375J09174
$$ 14824 -141839 171079 -10408 157111 -58754 -161732 -209312 -145455 127375 236549
18364B36549A07934h6349a5965B01241k2874a05809A8643a7195j86830D0273c33926
$$ 236549 107934 -86349 -15965 201241 178367 -105809 18643 -17195 -204025 40273 -333926
18352a47548p8073g4073B8120f506l5448k05711F577a19267A02922b25241h7095
$$ -147548 -225621 -74073 28120 -6506 -41954 -247665 6577 -119267 102922 -225241 -87095
18340c6249k7160K0310q9982A16965i32j10666A36707c6104I1866J3029K37532
$$ -36249 -63409 -43099 -133081 116965 -932 -111598 136707 -36104 91866 104895 342427
18329C42427g6211C27211H3194a46546k63008B84733C7395a32964A02677b79144
$$ 342427 -76211 327211 83194 -146546 -409554 284733 37395 -132964 102677 -279144
18318f4016D82618h2742D346a95348C85269b45696F3560g8505o401l3633R468
$$ -64016 482618 -82742 4346 -195348 385269 -245696 63560 -78505 -84906 -118539 -109071
18307a09071P987b424k14079E4882b06352C28359A36124l3399g3487E8522I353
$$ -109071 -101084 -2424 -216503 54882 -206352 328359 136124 102725 -73487 58522 9353
18295a48497f6516A74227a18161j20959A4494b12298L1086K465F4241J31023d66271
$$ -148497 -66516 174227 -118161 -239120 14494 -212298 -181212 -178747 64241 195264 -466271
18283A0338i2206B95893f5974B19015b4980C0899h4442H1531C4456N4992j404
$$ 10338 -92206 295893 -65974 219015 -24980 30899 -84442 81531 34456 89448 88044
18272H8044a99217A8165J82642j5521q0966B2011b37920j00505C696b59383A72585
$$ 88044 -199217 18165 200807 185286 104320 22011 -237920 -338425 3696 -259383 172585
18260a08133A9216K4757J67496I208a45141B32856c76458a51923m8148o3745J11923
$$ -108133 19216 43973 211469 9208 -145141 232856 -376458 -151923 -200071 -263816 -151893
18249a51893b0526A86504b01981b6312F8035J19077b75724K7965H2857a03028
$$ -151893 -20526 186504 -201981 -26312 68035 187112 -275724 -247759 82857 -103028
18238h4739j7293A36606f4604A17364l890i8207c0719A21510b7730m3928A197
$$ -84739 -102032 136606 -64604 117364 113474 -98207 -30719 121510 -27730 -71658 1197
18226b4603A65120a30843o4817A918N2884a48507q9586d4522Q206l6004k81907
$$ -24603 165120 -130843 -195660 1918 54802 -148507 -238093 -44522 -36316 -72320 -354227
18215c54227b0378j58060j85041a60127e9422m00743d7882j57103H2661K7383
$$ -354227 -20378 -178438 -363479 -160127 -59422 -460165 -47882 -204985 82661 110044
18205A10044a6708E8854g7654q5573D503a22034j98201j04990a38429A42252e3422
$$ 110044 -16708 58854 -77654 -163227 4503 -122034 -320235 -425225 -138429 142252 -53422
18193b78640c2707B44078b5316j84495I1721a39178f2103A11236g8333q3606j17811
$$ -278640 -32707 244078 -25316 -209811 91721 -139178 -62103 111236 -78333 -161939 -279750
18182b79750i5732k04208C1373J38938b7761E4752d5336m7056G4131b0798k70767
$$ -279750 -95732 -299940 31373 170311 -27761 54752 -45336 -92392 74131 -20798 -291565
18171b91565B47765b39766f5396G3521c48282B83419h7355F9077c344A66291i6845
$$ -291565 247765 -239766 -65396 73521 -348282 283419 -87355 69077 -3344 166291 -96845
18159A8726J97665c432m5468M884A5125f6652o4197E5117Q9860h0266B18943E4379
$$ 18726 216391 -3432 -48900 -44016 15125 -66652 -130849 55117 144977 -80266 218943 54379
18146b32066C5430c13945R6698h2436k28952a45018A56408G4306a11429j83308
$$ -232066 35430 -313945 -217247 -82436 -311388 -145018 156408 74306 -111429 -294737
18136b94737C05655a74578m6590b8662o2518k18346h813F1110a54513A55126a92714
$$ -294737 305655 -174578 -221168 -28662 -91180 -309526 -8813 61110 -154513 155126 -192714
18124A70515G5467K74031j36237a48778G3701a69823k0528A95923L02512a67468
$$ 170515 75467 349498 213261 -148778 73701 -169823 -190351 195923 498435 -167468
18113c2593j5589j22524B1981q710b85093e5528B17378D3185f5463P527K0674
$$ -32593 -48182 -170706 21981 13271 -285093 -55528 217378 43185 -65463 -57936 -37262
18102c7262D3970b15126e0897k39659J19640G0797b50145A1729L0849J43634J92119
$$ -37262 43970 -215126 -50897 -290556 -170916 70797 -250145 11729 42578 186212 378331
18091C78331a15954q9855A16612B5668h3859A09135h7151J2545j2345j2201L8114
$$ 378331 -115954 -205809 116612 25668 -83859 109135 -87151 -74606 -86951 -99152 -61038
18080f1038k32989J25141D0270a5470F9003j0090h8820D34096a9697G9514a10441
$$ -61038 -294027 -168886 40270 -15470 69003 58913 -88820 434096 -19697 79514 -110441
18068a44347M4517B19719E2977A1304a35162m3081A02482Q0631D0102f7706j73837
$$ -144347 -99830 219719 52977 11304 -135162 -178243 102482 183113 40102 -67706 -241543
18057b41543R0940A66221c1789m6307B10478a3682A28368e682F3902N5357b07079
$$ -241543 -150603 166221 -31789 -78096 210478 -13682 128368 -5682 63902 119259 -207079
18045E8983b36075A83963b34074G920J36244b88932A65666c803q9217M5357A68302
$$ 58983 -236075 183963 -234074 7920 144164 -288932 165666 -3803 -93020 -47663 168302
18033b8004n4934k82576M7588Q0330a06167H6195J25029L2393n7854E171M45772
$$ -28004 -82938 -365514 -317926 -237596 -106167 86195 211224 243617 185763 5171 450943
18022D50943a97843F5785j9281a29383A12450j3994k360J56870b0735A0879d0984
$$ 450943 -197843 65785 46504 -129383 112450 98456 96096 252966 -20735 10879 -40984
18010A0448h8058A72628F3488J2238a12206C9324a02144B63705E4786K2926a47462
$$ 10448 -88058 172628 63488 75726 -112206 39324 -102144 263705 54786 77712 -147462
17998C31897g7622C7620L78752d3819r3520c3176B27999a82980N2924j207d0041
$$ 331897 -77622 37620 416372 -43819 -137339 -33176 227999 -182980 -130056 -131263 -40041
17986b23179a9840B7320a86658C5488J20736h2133C6124c9254C6248a68417g0284
$$ -223179 -19840 27320 -186658 35488 156224 -82133 36124 -39254 36248 -168417 -70284
17974c6867j75500A69328p9175L2580j7162I133a62815l294r6849A78376E9877
$$ -36867 -212367 169328 90153 122733 105571 9133 -162815 -166109 -262958 178376 59877
17962b2727j28354f8410k19942I5263a53691B36411k9123E1636J31432a74635
$$ -22727 -151081 -68410 -288352 95263 -153691 236411 207288 51636 183068 -174635
17951a18955H6006K75685B9308J77719o9714d576j60671b3928D6384L8265h1087
$$ -118955 86006 361691 29308 207027 137313 -4576 -165247 -23928 46384 84649 -81087
17939F7246a50456g2432B12933k2083E7980e0248b0011A46228J74630A30369e0060
$$ 67246 -150456 -72432 212933 190850 57980 -50248 -20011 146228 320858 130369 -50060
17927B43156b0824j43459l6524C9502d25358k3407A89760L7915G5307a12042d9773
$$ 243156 -20824 -164283 -200807 39502 -425358 -448765 189760 227675 75307 -112042 -49773
17915a09450C9862a32511l7493b5053j36800a9007A79701Q3230c21654A74903
$$ -109450 39862 -132511 -170004 -25053 -161853 -19007 179701 262931 -321654 174903
17904a10529m817m0607I158K29666a55883J9341J4093j3332D60040a75181B6860
$$ -110529 -115346 -155953 9158 238824 -155883 -136542 -122449 -135781 460040 -175181 26860
17892a07795A6975L34256O5519F063i3859m7189f8493C45460A06050C5087a6878
$$ -107795 16975 351231 416750 6063 -93859 -141048 -68493 345460 106050 35087 -16878
17880c9863q1431A23362J53846B5020c948j16195c1405o2077a3463a500C09073
$$ -39863 -121294 123362 277208 25020 -3948 -120143 -31405 -93482 -13463 -1500 309073
17868A9536P1912N1572C8833i2515C8166L867a25107B2441a2109r7323E8891a4181
$$ 19536 91448 143020 38833 -92515 38166 42033 -125107 22441 -12109 -109432 58891 -14181
17855B54479a17743j16323B55182a75132q8053A5198d6121l19574A00499h9772
$$ 254479 -117743 -234066 255182 -175132 -263185 15198 -46121 -365695 100499 -89772
17844c8770A4513g9762m4040K7836A82251k1692g6120n6828j00659C93733g9518
$$ -38770 14513 -79762 -123802 -95966 182251 160559 -76120 -132948 -233607 393733 -79518
17832A25036a26094G3964b39417f4181B33934b9347k11888k641A42969N1716c32129
$$ 125036 -126094 73964 -239417 -64181 233934 -29347 -241235 -243876 142969 194685 -332129
17820d44638B17969n6497a39793A50733h7324q2711A43732j4433L70894I8535
$$ -444638 217969 161472 -139793 150733 -87324 -170035 143732 129299 500193 98535
17809B45294b28484B69812l7814c3805a0476j6408j71524e8071j7183A00450J00019
$$ 245294 -228484 269812 231998 -33805 -10476 -26884 -198408 -58071 -75254 100450 200469
17798B00469a57359A11354A6102Q2855l5574J14441b38694d1698j97102B43785
$$ 200469 -157359 111354 16102 98957 63383 177824 -238694 -41698 -238800 243785
17787g6835I9562f0408r5057M503a7066q4681d1649m268j11736O5483M1028A57852
$$ -76835 99562 -60408 -155465 -150962 -17066 -101747 -41649 -45917 -157653 -92170 -51142 157852
17774a33025I4503J18645G3667f7076k09850E4886a58311c757o8619A05218R6698
$$ -133025 94503 213148 73667 -67076 -276926 54886 -158311 -3757 -72376 105218 201916
17763B01916b4406j5432j53332I2045j8482b96043A26145a23967k2016B98258
$$ 201916 -24406 -39838 -193170 92045 73563 -296043 126145 -123967 -145983 298258
17752b47416A24042k7206K765b11959B89495F6778e4633I8279P6353k8561i5632
$$ -247416 124042 96836 99601 -211959 289495 66778 -54633 98279 174632 146071 -95632
17740G215a23536Q023B11544q8455c43641K4023C22589A7882c73524c2649l9233
$$ 7215 -123536 -115513 211544 123089 -343641 -319618 322589 17882 -373524 -32649 -71882
17729g1882o1078C9580a79173B95228a5297k32642A12201K26375n2959a8440A72731
$$ -71882 -132960 39580 -179173 295228 -15297 -247939 112201 338576 285617 -18440 172731
17717G8432a74769A70821i9460a0937E234c92616C0113e0014j56053i2986c8462
$$ 78432 -174769 170821 -99460 -10937 5234 -392616 30113 -50014 -206067 -92986 -38462
17705a19598o7657g0254A35485C8099e8288B8754K2742Q0679r541a29179B43888
$$ -119598 -187255 -70254 135485 38099 -58288 28754 51496 132175 122634 -129179 243888
17693H6066A0108d2111j19456A67386C8212c78337C84457j61171k3703E0912L06754
$$ 86066 10108 -42111 -161567 167386 38212 -378337 384457 223286 199583 50912 357666
17682C57666A6466J37264J65025n1875b3165m3510j567A66628J42512a51266j75976
$$ 357666 16466 153730 318755 266880 -23165 -66675 -68242 166628 309140 -151266 -327242
17671c27242h6660M2764B9442b99667H7584a80881G8631a22423a2950G6224a34411
$$ -327242 -86660 -43896 29442 -299667 87584 -180881 78631 -122423 -12950 76224 -134411
17659a29327F2367a14601A06841b26338j4145Q7421A08638L0434d8950A75644
$$ -129327 62367 -114601 106841 -226338 -240483 -153062 108638 139072 -48950 175644
17648a00441j31307A87139b80514P5260E6130P974J6495a57008e2144j00795e8711
$$ -100441 -231748 187139 -280514 -205254 56130 64104 80599 -157008 -52144 -152939 -58711
17636b7405L607B393b95903a16681a2265A98926H8669C4930J45864O4309C6995
$$ -27405 -23798 2393 -295903 -116681 -12265 198926 88669 34930 180794 245103 36995
17624A93061K6190b84027H6463J02354e4202l96026E4915A5791i9006l08274A79795
$$ 193061 219251 -284027 86463 188817 -54202 -450228 54915 15791 -99006 -407280 179795
17612C34200a91403N6027B86542A15307Q1364m3654j6347L4475b18081A5697a1408
$$ 334200 -191403 -135376 286542 115307 196671 153017 136670 171145 -218081 15697 -11408
17600a19821b5659E463b05818A48312p4083b89716J43399A25182Q0226o9070a48688
$$ -119821 -25659 5463 -205818 148312 74229 -289716 -146317 125182 205408 136338 -148688
17588A07089A9298e0734E2238a38338B35154E1316J11199b6816A86498l7753F8668
$$ 107089 19298 -50734 52238 -138338 235154 51316 162515 -26816 186498 148745 68668
17576B66847j08035D809a89967B40560I6134b21637B49326a2135j23086j0688
$$ 266847 158812 4809 -189967 240560 96134 -221637 249326 -12135 -135221 -145909
17566a45909A34021h8303c6128A47380h2613C42430A6073K45048A1203L2678d6029
$$ -145909 134021 -88303 -36128 147380 -82613 342430 16073 261121 11203 43881 -46029
17554A76236G2057K7281A1550d7283B1780K58957d023j77981j06875a40497K5721
$$ 176236 72057 99338 11550 -47283 21780 280737 -4023 -182004 -288879 -140497 -114776
17543a14776B44025d8057B56306a74155A02116C3354N18408B40927J57337b88116
$$ -114776 244025 -48057 256306 -174155 102116 33354 551762 240927 398264 -288116
17532C1970a12346C37864a68245O8268B46204A2350N8718J75122j8278q4228E6312
$$ 31970 -112346 337864 -168245 -99977 246204 12350 71068 246190 227912 143684 56312
17520B78842I5221M7360a0291C08887b06538A59481C1444h0508k30333B1921b23395
$$ 278842 95221 142581 -10291 308887 -206538 159481 31444 -80508 -310841 21921 -223395
17508a6506A69941a30206A46196C8703a41548b4805j14117B45938j99K09196o7292
$$ -16506 169941 -130206 146196 38703 -141548 -24805 -138922 245938 245739 454935 387643
17497C87643D2248a73721G7774k9172i7450I8373J04567J3424m604f3438j76801
$$ 387643 42248 -173721 77774 48602 -97450 98373 202940 216364 211760 -63438 -240239
17486b40239J03493E6246c172A76634n390L01956a30176B05557h5272A56796m1936
$$ -240239 -136746 56246 -3172 176634 171244 473200 -130176 205557 -85272 156796 114860
17475A14860J95120E6710j2675L01280A35997e0617k29512k3137B18817r0729
$$ 114860 309980 56710 44035 345315 135997 -50617 -280129 -303266 218817 128088
17465A28088J56635a70103c3594D74427a39474C05452F3551J7255K00364O7416
$$ 128088 284723 -170103 -33594 474427 -139474 305452 63551 80806 281170 348586
17455C48586B7148J12707L8220D2163b0015B22611a62331E40986n2438A61372
$$ 348586 27148 139855 178075 42163 -20015 222611 -162331 540986 488548 161372
17444C56061A05307J88680j09724N35463n7585j83649D0702b179C38008E9530
$$ 356061 105307 293987 184263 719726 662141 478492 40702 -2179 338008 59530
17433d930D69162j62066m2668J25717q3161C5564a49796B28624O6479R3637M3446
$$ -4930 469162 307096 264428 390145 306984 35564 -149796 228624 295103 388740 432186
17422D32186j69854g2962C88611l8916k3986r2544l7892L97768A57981J04184
$$ 432186 262332 -72962 388611 349695 325709 233165 195273 593041 157981 262165
17412B62165K3341e9816D49549I2014l8048J94838A00293c93401D3032J53417
$$ 262165 285506 -59816 449549 92014 53966 248804 100293 -393401 43032 196449
17402A96449j3416D8446J82546J32646R6016c4058D54284B09289J1627k2706f0298
$$ 196449 183033 48446 230992 363638 459654 -34058 454284 209289 220916 198210 -60298
17390D18452j22617j47021O1323n3470E7948e2540B09184k980n5766M09401j37721
$$ 418452 295835 148814 210137 156667 57948 -52540 209184 206204 150438 559839 422118
17379D22118A83379J27336c44788C30409c7759D4669L27719A79587b51533C51359
$$ 422118 183379 310715 -344788 330409 -37759 44669 372388 179587 -251533 351359
17368C54172C8414L97417j54281A5618K54588E5014j898h4481B60004B3876J73367
$$ 354172 38414 435831 281550 15618 270206 55014 53116 -84481 260004 23876 197243
17357A97243R5410A18318R5456q0315e7687C60310k7560a84850B76035p6607G4041
$$ 197243 292653 118318 213774 133459 -57687 360310 332750 -184850 276035 199428 74041
17345h7898B47181K55765k47432Q8645B0743K47127k2163J6014M974I0588O01659
$$ -87898 247181 502946 255514 344159 20743 267870 245707 261721 266695 90588 692247
17334F92247A48990J85966H5287J85995o3188J89484b0781l214A03334M69880
$$ 692247 148990 334956 85287 271282 208094 397578 -20781 -23995 103334 573214
17324E73214p6173B14862J28557j11778N4991o4216P1207j6146A34836K18384
$$ 573214 497041 214862 343419 231641 286632 222416 293623 277477 134836 353220
17314C53220F3358L00389A46197C4618J18309k2232L6742C0488O4912N8278J09065
$$ 353220 63358 363747 146197 34618 152927 130695 167437 30488 95400 153678 262743
17303B62743O5173J05713m6949G8057P6465e9579B40423J39618j26306f0546C37022
$$ 262743 327916 433629 386680 78057 154522 -59579 240423 380041 253735 -60546 337022
17291c405C52654H4644M56947k19360A44488J53632J13898e6878B88145o4298
$$ -3405 352654 84644 541591 322231 144488 298120 412018 -56878 288145 223847
17281B23847K41237j83364i3108C21158h125A02279J18576i3875C64526q6907
$$ 223847 465084 281720 -93108 321158 -8125 102279 220855 -93875 364526 277619
17271B77619a25150G19375e0681C54305a54912C21315n8561j5573j6652P0258
$$ 277619 -125150 719375 -50681 354305 -154912 321315 262754 247181 230529 300787
17261C00787q1260H9401K94914j47328A155J09877j966R5132q4267h3469E95700
$$ 300787 219527 89401 384315 236987 1155 111032 109066 204198 119931 -83469 595700
17249A55385a48227A0547J41494L94383A38068K06371b04299A92847K30156a02279
$$ 155385 -148227 10547 152041 546424 138068 344439 -204299 192847 423003 -102279
17238B89500A37388a4701j2400D53371H1159a06342C53446D8202J03826N1889
$$ 289500 137388 -14701 -27101 453371 81159 -106342 353446 48202 152028 203917
17228B03917O6404j32373C6368M16044A12836K98756j19856q6714J43815A36492
$$ 203917 270321 137948 36368 452412 112836 411592 291736 205022 348837 136492
17217C45205e714B59620A17920L08697i7030A91410G2746K11860M8552j28047
$$ 345205 -5714 259620 117920 426617 -97030 191410 72746 284606 333158 205111
17207B05111I6052K8354J73683I909J74940B401J66367J2372k0927J88440m4274
$$ 205111 96052 124406 298089 9909 184849 2401 168768 181140 160213 348653 304379
17196C04379B468J98427m1008K19956C9431J50695L06940B11865K57257N7903
$$ 304379 2468 200895 159887 379843 39431 190126 497066 211865 469122 527025
17186E27025M1672A85230J70560b1990C59955j54988L5688K52820A20070L28017
$$ 527025 568697 185230 355790 -21990 359955 204967 240655 493475 120070 448087
17176D48087q7507K11797B40923M73151j57176l7496j02791Q2783k39376K40326
$$ 448087 360580 572377 240923 714074 556898 519402 416611 499394 260018 500344
17166E00344B20645M68465k51100j18463P7012j91977L5710A15486R6379K11295
$$ 500344 220645 689110 438010 319547 396559 204582 240292 115486 211865 423160
17156D23160A97812K82272j76742J67416H8598K55223q2457P6791P7223o8417
$$ 423160 197812 480084 303342 470758 88598 343821 261364 338155 415378 346961
17146C46961D7416K68929d2832C07389a1423C17258J03964l2680j24795K42589
$$ 346961 47416 316345 -42832 307389 -11423 317258 421222 388542 263747 506336
17136E06336R360j28201j12864N0903j14495J50263J15458e4458C63446j08579
$$ 506336 515696 387495 274631 325534 211039 361302 476760 -54458 363446 254867
17126B54867K35458K94893l37067m2963J42653j87113j60562M09427B00942N1306
$$ 254867 490325 785218 448151 405188 547841 360728 200166 609593 200942 252248
17116B52248L10428j48407m2380J26016j37106J35160K4683l3126j94607J067
$$ 252248 562676 414269 371889 497905 360799 495959 520642 487516 292909 293976
17106B93976Q8394l0936K3727j29597F531M35141j06586J77598j93309J75910
$$ 293976 382370 351434 375161 245564 6531 441672 335086 512684 319375 495285
17096D95285J66313A12980M27377k1200P7086J78191C37106K94998j93949o5037
$$ 495285 661598 112980 540357 519157 596243 774434 337106 632104 438155 373118
17086C73118K25326j08728j19892P7215J12810m2874K0057j2354k29110M80506
$$ 373118 598444 489716 369824 447039 559849 516975 537032 524678 295568 776074
17076G76074k38069J0103A73000O3571L89536o2417j15666j05361N51728l71968
$$ 776074 538005 548108 173000 236571 626107 563690 448024 342663 894391 522423
17066E22423L30297k35831J82087j99274o1065j60922L69897k84276L13223k70058
$$ 522423 852720 616889 798976 599702 538637 377715 747612 463336 776559 506501
17056E06501j5001J31580Q825l1326K12508r2064l52511L92371k65245J06941
$$ 506501 491500 623080 631905 600579 813087 721023 368512 760883 495638 602579
17046F02579j43014Q20758n77442B54472L64332o5367j0809J75855P1312j9496
$$ 602579 459565 1280323 702881 254472 618804 553437 542628 718483 789795 770299
17036G70299o3458j74954K322J43978j89195K39649L64841l54515r72K6865j49581
$$ 770299 706841 531887 534209 678187 488992 728641 1093482 738967 737995 764860 615279
17025F15279L18844j04124l5261j46719m0282L77637p1207j92678K68440k76724
$$ 615279 934123 829999 794738 648019 607737 985374 914167 721489 989929 713205
17015G13205J9161L20264l67331L55936m68098K81333j05015j60065J65884o5456
$$ 713205 732366 1052630 685299 1041235 573137 854470 749455 589390 755274 689818
17005F89818J84140k92844O16031m06156j34091K239M46954k52690J69966L94203
$$ 689818 873958 581114 1197145 790989 656898 659137 1106091 853401 1023367 1417570
16995A417570n41665k9522k39635M69736o6548k75793L67570j47815n1596J40358
$$ 1417570 875905 846383 606748 1076484 1009936 734143 1101713 953898 902302 1042660
16985A042660j12587K35196n59665N79781l52536P8229L96531j1824m07640q8801
$$ 1042660 930073 1165269 605604 1185385 832849 911078 1307609 1295785 888145 799344
16975G99344Q9225R0358m2774J3917J01834r1689M8917L76621k11382m10094M80276
$$ 799344 888569 978927 936153 950070 1051904 960215 1009132 1385753 1174371 764277 1244553
16964A244553l22315q245N25626j77154j53505L33193m595l36818J70288l3865
$$ 1244553 922238 913993 1439619 1262465 1108960 1442153 1437558 1100740 1271028 1237163
16954A237163K11826k29038K6781M5040Q6830k71477K00158j02328m7213Q2161
$$ 1237163 1448989 1219951 1246732 1291772 1378602 1107125 1307283 1204955 1157742 1239903
16944A239903P5499K90133k53285k72105J21459K17269j28716J57154K44103j90165
$$ 1239903 1315402 1605535 1352250 1080145 1201604 1418873 1290157 1447311 1691414 1501249
16934A501249k54404J65390M9817J47150n8186O2989O4647m9943j18396O150J55655
$$ 1501249 1246845 1412235 1462052 1609202 1551016 1614005 1678652 1628709 1510313 1516463 1672118
16923A672118K53262k34539j15646P474Q5809L32508m54069k7950J84604k35089
$$ 1672118 1925380 1690841 1575195 1582669 1668478 2000986 1546917 1518967 1703571 1468482
16913A468482L00226o2511P4266J16482L4452j23334K926K22665J91881n05858
$$ 1468482 1768708 1706197 1780463 1896945 1931397 1808063 1810989 2033654 2225535 1719677
16903A719677K46587j12152K20456Q396O0100J87305l71326L51393k81263M14237
$$ 1719677 1966264 1854112 2074568 2082964 2143064 2330369 1959043 2310436 2029173 2443410
16893B443410m02853L07108N9186k94023O0188J96817L3571J44340q484l63558
$$ 2443410 2040557 2347665 2406851 2112828 2173016 2369833 2403404 2547744 2539260 2175702
16883B175702L55585J98106O6113l27559K96419M68571k34093j31320Q1034l04316
$$ 2175702 2531287 2729393 2795506 2467947 2764366 3232937 2998844 2867524 2948558 2644242
16873B644242M45779j88907L18260l84069N17470l86817L40499k65257J4986R2701
$$ 2644242 3090021 2901114 3219374 2835305 3352775 2965958 3306457 3041200 3056186 3148887
16863C148887M41720m26209J29915L64586r0005j96027K1962L28978J9568K86249
$$ 3148887 3590607 3164398 3294313 3658899 3568894 3372867 3394829 3723807 3743375 4029624
16853D029624l26533M7766K57563k34229K07032K87504p6112k61349N28616j31877
$$ 4029624 3703091 3750857 4008420 3774191 3981223 4268727 4192615 3931266 4459882 4328005
16843D328005K21226k29823K28501l9908K29953k88014M03236k479K11059J61014
$$ 4328005 4549231 4319408 4547909 4508001 4737954 4449940 4853176 4850697 5061756 5222770
16833E222770r0695J6107K94350k04126L13910l2386M01182k45602M48838q3376
$$ 5222770 5132075 5148182 5442532 5238406 5552316 5519930 5921112 5675510 6124348 6040972
16823F040972J82402j04446L73283n4175J68965M01939k5553k22457O49530q8340
$$ 6040972 6223374 6118928 6492211 6438036 6607001 7008940 6983387 6760930 7410460 7322120
16813G322120N7809J29922R0968M42380L39193j38342K00276J85832K61625J07638
$$ 7322120 7379929 7509851 7600819 8043199 8382392 8244050 8444326 8630158 8891783 8999421
16803H999421n2700K28009K54225M03039P3179M42066P1293O82879m7784L92980
$$ 8999421 8946721 9174730 9428955 9831994 9905173 10347239 10418532 11101411 11053627 11446607
16793A1446607M74671K84328J69713K14643K31388O85762J91638M11718L74040
$$ 11446607 11921278 12205606 12375319 12589962 12821350 13507112 13698750 14110468 14484508
16784A4484508M35013J76892O30028K81890M50854O38200O31473L93948Q36615
$$ 14484508 14919521 15096413 15726441 16008331 16459185 17097385 17728858 18122806 18959421
16775A8959421K95895Q80840M26601N44749Q30680R97792O90697R87561O53913
$$ 18959421 19255316 20136156 20562757 21107506 21938186 22935978 23626675 24614236 25268149
16766B5268149R49367J130731R49931J035773J404092J123937J197367J388790
$$ 25268149 26217516 27348247 28298178 29333951 30738043 31861980 33059347 34448137
16758C4448137J619595J362672J860218J196720J798905K201894J622466K275319
$$ 34448137 36067732 37430404 39290622 40487342 42286247 44488141 46110607 48385926
16750D8385926K254347K492532K768680K733452K996488K898502L127239L764357
$$ 48385926 50640273 53132805 55901485 58634937 61631425 64529927 67657166 71421523
16742G1421523L666258L933765M075479M478214M358767N500648M498342N584956
$$ 71421523 75087781 79021546 83097025 87575239 91934006 97434654 101932996 107517952
16734A07517952N725179N444487N835833N835992O249981O111446N741285N593349
$$ 107517952 113243131 118687618 124523451 130359443 136609424 142720870 148462155 154055504
16726A54055504N691480N024984M619272L770875L177007K828873J168458L03028
$$ 154055504 159746984 164771968 169391240 173162115 176339122 179167995 180336453 180639481
16718A80639481k47992j341056k345196l312710l424792m504574n181083n796932
$$ 180639481 180391489 179050433 176705237 173392527 169967735 165463161 160282078 154485146
16710A54485146n603206n831826o162172o081529o161493o188858n707975n941676
$$ 154485146 148881940 143050114 136887942 130806413 124644920 118456062 112748087 106806411
16702A06806411n254161n243451n055193m914033m355279m118175l636177l997470
$$ 106806411 101552250 96308799 91253606 86339573 81984294 77866119 74229942 70232472
16694G0232472m019806l115851k795255k859695k914379k768998k408120k263121
$$ 70232472 66212666 63096815 60301560 57441865 54527486 51758488 49350368 47087247
16686D7087247j960428k339102j794820j706448j567951k059520j283408j061487
$$ 47087247 45126819 42787717 40992897 39286449 37718498 35658978 34375570 33314083
16678C3314083j644346j366307j109719j182798r96345j009652q55622q26216
$$ 33314083 31669737 30303430 29193711 28010913 27014568 26004916 25149294 24323078
16670B4323078j047685n94680r42628j188587l79275p06352m01305j072230K6958
$$ 24323078 23275393 22680713 21738085 20549498 20170223 19463871 19062566 17990336 18017294
16661A8017294p89808p08564k16591o22654n50809p54012j46518k35296l32266
$$ 18017294 17227486 16518922 16302331 15679677 15128868 14374856 14228338 13993042 13660776
16652A3660776o77920j32426r21421P2638l06487p06390L46030m95517k63728
$$ 13660776 12982856 12850430 11929009 12001647 11695160 10988770 11334800 10839283 10575555
16643A0575555n65500K8682k15597o31079K16557k3243n94450n58926k18488M34708
$$ 10575555 10010055 10038737 9823140 9192061 9408618 9385375 8790925 8231999 8013511 8448219
16633H448219j98996n53700K09452n36138j56730j75524k44486K0632k78172j89973
$$ 8448219 8249223 7695523 7904975 7368837 7212107 7036583 6792097 6812729 6534557 6344584
16623F344584N69090q86569K92106m43788n53858L36026j19368j17497R0972j13103
$$ 6344584 6913674 6027105 6319211 5875423 5321565 5657591 5538223 5420726 5511698 5398595
16613E398595j73590k02307R5516p6703r5419L6110k39787m91822Q7808K9488
$$ 5398595 5225005 5022698 5118214 5041511 4946092 4982202 4742415 4250593 4338401 4367889
16603D367889k2516J161j00200l67045K08398l90981K94488J71640l07628K2489
$$ 4367889 4345373 4346534 4246334 3879289 4087687 3696706 3991194 4162834 3855206 3877695
16593C877695m16092M53678p08928L43991J80074o63500L15406l42655K39722
$$ 3877695 3461603 3915281 3206353 3550344 3730418 3066918 3382324 3039669 3279391
16584C279391O3679l65033k74859L45401L41572l59271R6751j22107j18137R3320
$$ 3279391 3343070 2978037 2703178 3048579 3390151 3030880 3127631 3005524 2887387 2980707
16574B980707m32191K39932m4463O4590j59191j98237j1968K47195j44783j67598
$$ 2980707 2548516 2788448 2743985 2808575 2649384 2451147 2439179 2686374 2541591 2373993
16564B373993JK07408m24635P1277j44110M50625j31668m27420J04908J26968
$$ 2373993 2373994 2581402 2156767 2228044 2083934 2534559 2402891 1975471 2080379 2207347
16554B207347j58660J12778l31569K02415M9386N4136l75663j37996M83918k12479
$$ 2207347 2048687 2161465 1829896 2032311 2081697 2135833 1760170 1622174 2106092 1893613
16544A893613j77932K83781J07472l88020J47157k17947r0087M5665J5559J24758
$$ 1893613 1715681 1999462 2106934 1718914 1866071 1648124 1558037 1603702 1619261 1744019
16534A744019J39652r6833j67124N4430J70317p4292k30902O0211j88522r8348
$$ 1744019 1883671 1786838 1619714 1674144 1844461 1770169 1539267 1599478 1410956 1312608
16524A312608k84512M54624j91219o1387R7157K33656J47103k42688j5366k41607
$$ 1312608 1028096 1482720 1291501 1230114 1327271 1560927 1708030 1465342 1449976 1208369
16514A208369K33642N9531k36362R7785R9534j30934j12062k1642R0739r6597
$$ 1208369 1442011 1501542 1265180 1362965 1462499 1331565 1219503 1197861 1288600 1192003
16504A192003J27267j25748L9048k13323j9905j22387K17780p088K6834r0561
$$ 1192003 1319270 1193522 1232570 1019247 999342 876955 1094735 1087647 1114481 1023920
16494A023920r5188J07840O0508J33753k25193J88950l96107J42231M0186J01777
$$ 1023920 928732 1036572 1097080 1230833 1005640 1194590 798483 940714 980900 1082677
16484A082677N3662l52587K37084k21146n8364K71021k41429l7016j1475K74618
$$ 1082677 1136339 783752 1020836 799690 741326 1012347 770918 733902 722427 997045
16474I97045r2769j92738L33614k15178n5450K77631l35581M13061k91926J13709
$$ 997045 904276 711538 1045152 829974 774524 1052155 716574 1129635 837709 951418
16464I51418O8565k85089m8068L6458J18606j39931K27780M2475A60964L13922
$$ 951418 1019983 734894 686826 723284 841890 701959 929739 972214 160964 474886
16454D74886L06046j1785J65078m63678L54755N5018C97096J95174j24552L90485
$$ 474886 780932 769147 934225 470547 825302 880320 397096 592270 467718 858203
16444H58203l82767K4706M4963J95242l63988L55461k99008O7101k09721L01143
$$ 858203 475436 500142 545105 740347 376359 731820 432812 499913 290192 591335
16434E91335J08256l05680K85603p1618k17311K69313j50090K2011A04177O70377
$$ 591335 699591 393911 679514 607896 390585 659898 509808 531819 104177 774554
16424G74554j11167o4535K9767L09130D12393K89588j70306J79373C51470N50881
$$ 774554 663387 598852 628619 937749 412393 701981 531675 711048 351470 902351
16414I02351p0017j94033j51042n2305K16137j17995J14635l17277K72595j59989
$$ 902351 832334 638301 487259 434954 651091 533096 647731 330454 603049 443060
16404D43060Q3449k30064J65188J34936k39347L2714K36263J7498j42469O4860
$$ 443060 526509 296445 461633 596569 357222 389936 626199 643697 501228 566088
16394E66088k19987K92366j06945L5080j10235O8849B37765J35831O0281M5594
$$ 566088 346101 638467 531522 566602 456367 525216 237765 373596 433877 479471
16384D79471j97074m4290J84080m8739A31487K82942L5832P6065J40517A63944
$$ 479471 282397 238107 422187 373448 131487 414429 450261 526326 666843 163944
16373B75724j31446J86413K69512n2k03694j93816G5921L67072c9890B07497J52992
$$ 275724 144278 330691 600203 600151 396457 202641 75921 442993 -39890 207497 360489
16362C60489r5846q0236K4257l7738G824K04257K97433l7801B27036J17012J01258
$$ 360489 264643 184407 208664 170926 7824 212081 509514 471713 227036 344048 445306
16351D45306O8339I1040K50247H7108K12850J81974A03766K86947j95341q8012
$$ 445306 513645 91040 341287 87108 299958 481932 103766 390713 195372 107360
16341A07360a0597E8113L97780k00185J14484m0737r1571M49226l18816j70192
$$ 107360 -10597 58113 455893 255708 370192 329455 237884 687110 368294 198102
16331A98102K03652j16796J89114I0911J06890L083j199J13749r4832K56196B0913
$$ 198102 401754 284958 474072 90911 197801 200884 199685 313434 218602 474798 20913
16319A72058F8892L52836O2977A70564o6329l5236L82615A18047R8130J95668
$$ 172058 68892 421728 484705 170564 104235 68999 451614 118047 216177 411845
16309D11845A65861J90405E128M63293r4574D5525K16457a13962E93539A46391
$$ 411845 165861 356266 5128 468421 373847 45525 261982 -113962 593539 146391
16298C38520p2184L05389A62380K3695K73930E1616N51359A85377A3687L1916
$$ 338520 266336 571725 162380 186075 460005 51616 602975 185377 13687 45603
16288D5603K36848f2052H4376J53346J99126B16356O5605a20255N1985E90738
$$ 45603 282451 -62052 84376 237722 436848 216356 281961 -120255 -68270 590738
16277B01756B5505J43550I971b5273B91799R2770d1213A30773J02874b20297P2251
$$ 201756 25505 169055 9971 -25273 291799 384569 -41213 130773 233647 -220297 -148046
16266a48046B05081K25134F8364J55827N277O3847j03614I3508J12438k7645L42839
$$ -148046 205081 430215 68364 224191 229468 293315 189701 93508 205946 178301 521140
16255E21140B40475J12885r4456J72892A88421K4317A04109M3997o0176J82350
$$ 521140 240475 353360 258904 431796 188421 212738 104109 148106 87930 270280
16245B70280A25207L8K94878a03673A41591J011m4993L82628f4498A36064J78630
$$ 270280 125207 125245 420123 -103673 141591 142602 97609 480237 -64498 136064 314694
16234C14694A53691a20270A43127J16392A06520h513l0189C06701M4002J46821
$$ 314694 153691 -120270 143127 259519 106520 -8513 -38702 306701 350703 497524
16224D97524k17286l4163d5082B50970j15252D8652K78375g2132B12747c6632
$$ 497524 280238 246075 -45082 250970 135718 48652 327027 -72132 212747 -36632
16213B36775b91516E0667q21g3884C06519A31606O5649B3767b1263A19124j9299
$$ 236775 -291516 50667 49846 -73884 306519 131606 197255 23767 -21263 119124 99825
16202I9825A2642R2817a05614c3716A27847b62260a08636I6142L63924A74005
$$ 99825 12642 105459 -105614 -33716 127847 -262260 -108636 96142 460066 174005
16191b49037C97794j35865a28594E3397K6584P0487J36002j24166o104R1497a47354
$$ -249037 397794 261929 -128594 53397 79981 150468 286470 162304 156200 247697 -147354
16179B42347A17438a21837A72041b81506a3934C79026A17374a59651B42539O0941
$$ 242347 117438 -121837 172041 -281506 -13934 379026 117374 -159651 242539 303480
16169C03480A5200J3704B905h3141B06902C7086J95495A04925Q7706G8678B4431
$$ 303480 15200 28904 2905 -83141 206902 37086 232581 104925 192631 78678 24431
16157A7322J46724f9570k20257b9719a2388C79442b9829A42303K26513c5716A63648
$$ 17322 164046 -69570 -289827 -29719 -12388 379442 -29829 142303 368816 -35716 163648
16145I9874m1352k759J37971b2327k04262A58034g988B34247j9869b05397G5755
$$ 99874 58522 55763 193734 -22327 -226589 158034 -7988 234247 214378 -205397 75755
16133b7395B2103p60R1689M5591D5370b12823D2585J19142b6507B66202c7173
$$ -27395 22103 21343 113032 158623 45370 -212823 42585 161727 -26507 266202 -37173
16121i0993m6700E387J48902L732E4863k2804L5220b31371d7361r1062j3706B35360
$$ -90993 -137693 5387 154289 158021 54863 32059 67279 -231371 -47361 -138423 -152129 235360
16108a10565q7678A00007K28194c3154r744A05135a8058C08335A25261b04547
$$ -110565 -198243 100007 328201 -33154 -42898 105135 -18058 308335 125261 -204547
16097A08198J34439e4831F8830J86278A13567J30973a88888F0471d7788j37122
$$ 108198 242637 -54831 68830 255108 113567 244540 -188888 60471 -47788 -184910
16087a84910j2469A41704J4588e6523j4510D0170b2671c133D82955C7835K13767
$$ -184910 -197379 141704 156292 -56523 -71033 40170 -22671 -3133 482955 37835 251602
16076B51602a28827o3559C29322a15930N6092A02199b08849R24N2570j22760e5336
$$ 251602 -128827 -192386 329322 -115930 -59838 102199 -208849 -207925 -155355 -278115 -55336
16064i5663A18098k6844b63446J28234k7126M2572B18498L34372a02989j93514
$$ -95663 118098 91254 -263446 -135212 -162338 -119766 218498 552870 -102989 -296503
16054b96503Q4669e1208j36999B58860O0599a72643d2464B41211a1309d059j12380
$$ -296503 -211834 -51208 -188207 258860 319459 -172643 -42464 241211 -11309 -4059 -116439
16043a16439H6753N2179F5830j6237a64538C7701L7929a02000D9356f3143B30899
$$ -116439 86753 138932 65830 49593 -164538 37701 75630 -102000 49356 -63143 230899
16031b39932g6840j60626C7541R397a68330m16062a68436c1719p2270C08948i1031
$$ -239932 -76840 -237466 37541 46938 -168330 -584392 -168436 -31719 -103989 308948 -91031
16019D0988A0246M6455h3780j4025m7988I7001K72662j12318a90681A09088J20711
$$ 40988 10246 56701 -83780 -97805 -145793 97001 369663 257345 -190681 109088 229799
16008B29799o2690f9032j09201B00339j187a15240j04018A41280B2918c42437
$$ 229799 167109 -69032 -178233 200339 199152 -115240 -219258 141280 22918 -342437
15997a5082F5188e1636j22954M4659I5401b76371B89593H8074D3696b03853A55605
$$ -15082 65188 -51636 -174590 -129931 95401 -276371 289593 88074 43696 -203853 155605
15985B80086J31696A86733G408K99898o9434h170k464B83203d1589B2330b05167
$$ 280086 411782 186733 7408 307306 237872 -8170 -10634 283203 -41589 22330 -205167
15973a2046j42880j54903A77530g496j11708e8624K2645j17260n5124I5387k7081
$$ -12046 -154926 -309829 177530 -7496 -119204 -58624 -35979 -153239 -208363 95387 68306
15962F8306L3713a81743A60697B2034J28691a8923A68628b9430B9694a87258G3561
$$ 68306 102019 -181743 160697 22034 150725 -18923 168628 -29430 29694 -187258 73561
15950A46931J22497f7481C5612K63689a47274e0844A28849j8587l2418b9134j70317
$$ 146931 269428 -67481 35612 299301 -147274 -50844 128849 110262 77844 -29134 -199451
15939a99451d9989B14869o0594k3633b22793K7449i7227H6108o648K2320L2320
$$ -199451 -49989 214869 154275 130642 -222793 -195344 -97227 86108 79460 101780 134100
15928A34100j890k208a50605C09379a55693C37161b6587C5846c36239d8745j53598
$$ 134100 132210 130002 -150605 309379 -155693 337161 -26587 35846 -336239 -48745 -202343
15917b02343k2675J8581n8595A04104a41789l95178K05754C13583G9855c84615
$$ -202343 -225018 -206437 -265032 104104 -141789 -536967 -331213 313583 79855 -384615
15906g5671G9320K0204m1931n742h8516k8657A60419d10777b3528A65007b88921
$$ -75671 79320 99524 57593 51851 -88516 -117173 160419 -410777 -23528 165007 -288921
15894B70625b4512k9480l52733a22296k5696A38120i1803A41380c1971l4461m0430
$$ 270625 -24512 -53992 -406725 -122296 -147992 138120 -91803 141380 -31971 -66432 -106862
15883a06862j1659F2254k7721K32112h4716L3249m8401j57589Q1870q0955D2913
$$ -106862 -118521 62254 34533 266645 -84716 -51467 -99868 -257457 -175587 -256542 42913
15871h045k98763A67918a3832j74154H9436f9493J2034D3439J93182a39463j25271
$$ -8045 -306808 167918 -13832 -187986 89436 -69493 -57459 43439 236621 -139463 -264734
15860b64734f2650j03357B42310D4911a3122l5359n04624B28973c10703j9576
$$ -264734 -62650 -166007 242310 44911 -13122 -48481 -553105 228973 -310703 -330279
15850c30279A23736a23813c0868q1429A63244a9132E2311j7615J36500d9788l9862
$$ -330279 123736 -123813 -30868 -112297 163244 -19132 52311 34696 171196 -49788 -89650
15839h9650j93627B94927q6223G6576J21793e2597A93986H6326b0762F6850P4026
$$ -89650 -283277 294927 208704 76576 198369 -52597 193986 86326 -20762 66850 140876
15828A40876p15a70658j47675h3056q8105O5201E5224O1524j4360b06080Q0436
$$ 140876 140161 -170658 -318333 -83056 -171161 -105960 55224 116748 102388 -206080 -125644
15817a25644j05899J6592A33760a467n6386a7213m0656m38979e9902A22815c52312
$$ -125644 -231543 -214951 133760 -1467 -57853 -17213 -57869 -496848 -59902 122815 -352312
15805C7650j3285a22180j03858A70547K14378B0171K0811f9768j53272n5638L0947
$$ 37650 24365 -122180 -226038 170547 384925 20171 40982 -69768 -223040 -278678 -247731
15794b47731G7336J53744H5627J3073d81138b9042B17199I91b25384J1537j1589
$$ -247731 77336 231080 85627 98700 -481138 -29042 217199 991 -225384 -213847 -225436
15783b25436B33657r1647m7171O6201b49681A52435N8495e3103k37330H2766b48371
$$ -225436 233657 142010 94839 161040 -249681 152435 210930 -53103 -290433 82766 -248371
15771A35035l8153N7495a01454D3631K81829j17848C0374b70836b1453r2481A82286
$$ 135035 96882 154377 -101454 43631 325460 207612 30374 -270836 -21453 -113934 182286
15759B49095J54272J41347A79154b61053A02412C0201b70115a1734j64341j5758
$$ 249095 403367 544714 179154 -261053 102412 30201 -270115 -11734 -176075 -191833
15749a91833D86168j17365F9265b29401k7166b3920j06019A98284H1204J13031
$$ -191833 486168 368803 69265 -229401 -256567 -23920 -129939 198284 81204 194235
15739A94235J36375A48169a59323r8875E3720J74997a88216H450J95982a24048
$$ 194235 330610 148169 -159323 -258198 53720 228717 -188216 8450 204432 -124048
15728c08954J41949q8768g9541E3401J42054a76396b7481o8428k39905C60183
$$ -308954 -167005 -255773 -79541 53401 195455 -176396 -27481 -95909 -335814 360183
15717c71329A52639L7696a10506j8017b2887H543a68350B76952o5121b55028a5044
$$ -371329 152639 190335 -110506 -128523 -22887 8543 -168350 276952 211831 -255028 -15044
15705d22571A01360J86641p6707j5499n3716o6276a98172A05598M3989i7766E9604
$$ -422571 101360 288001 211294 195795 142079 75803 -198172 105598 149587 -97766 59604
15693A76872F3752a89224A54518L6489b47033G3399a8637m39653A83005f6719
$$ 176872 63752 -189224 154518 191007 -247033 73399 -18637 -458290 183005 -66719
15682b97529A3198e882B69696f1287j99527D57886G7880K91935p3422G6167N3154
$$ -297529 13198 -5882 269696 -61287 -260814 457886 77880 369815 296393 76167 129321
15671A29321N1062a33243j19667d2707k12227D5438c14135J32802j86088P6230
$$ 129321 180383 -133243 -252910 -42707 -254934 45438 -314135 -181333 -367421 -291191
15661b91191J07483j87442A72883a36316j43826A49294a81707A6259b14051C6710
$$ -291191 -183708 -371150 172883 -136316 -280142 149294 -181707 16259 -214051 36710
15650a8397B31681C8873K10634A12958K04732A07004a3763A69356l23E0970J75460
$$ -18397 231681 38873 249507 112958 317690 107004 -13763 169356 169033 50970 226430
15639B26430K07013c74855B3069J28255n7676K68602b68374b5225k28538P6287
$$ 226430 433443 -374855 23069 151324 93648 362250 -268374 -25225 -253763 -177476
15629a77476B23129I0037a74970h6461j4452C3984f0306B88675b42467B40761
$$ -177476 223129 90037 -174970 -86461 -100913 33984 -60306 288675 -242467 240761
15618a84069A96167F6347P2821J8100a08072r7981D0417a68115C20360h4125B37972
$$ -184069 196167 66347 139168 157268 -108072 -206053 40417 -168115 320360 -84125 237972
15606a63056A18760J75362g1334D2464b7208o3192c2260j77258P8628A745b80722
$$ -163056 118760 294122 -71334 42464 -27208 -90400 -32260 -209518 -130890 1745 -280722
15594a6530j32933j95224a60197c2826A31116b62204e9089A56675K77614a75048
$$ -16530 -149463 -344687 -160197 -32826 131116 -262204 -59089 156675 434289 -175048
15583a57842A06525a12652A33443i4888L6792j28917H0724f7444K3873l33686
$$ -157842 106525 -112652 133443 -94888 -58096 -187013 80724 -67444 -43571 -377257
15573c77257J72673A66363N1763D4406a54543D3553a90894B46247G2180J3501
$$ -377257 -204584 166363 218126 44406 -154543 43553 -190894 246247 72180 85681
15563H5681l0625a4065I0233K050M29530f4585j87543B43847A19709c38718B28810
$$ 85681 55056 -14065 90233 92283 521813 -64585 -252128 243847 119709 -338718 228810
15551a78494A08410j6783Q9262b49261a08896B96587a51485d4624N235a9261r0863
$$ -178494 108410 91627 180889 -249261 -108896 296587 -151485 -44624 -39389 -19261 -110124
15540a10124k34530J44783f2710B64820d275p8055j87851A44447b92245e7585
$$ -110124 -344654 -199871 -62710 264820 -4275 -82330 -270181 144447 -292245 -57585
15529a50853n176A61328K53256a02859K4203l18890H0804c56793J59893d9462
$$ -150853 -156029 161328 414584 -102859 -78656 -397546 80804 -356793 -196900 -49462
15518i6649K3245b2646O193j66901b1581A26139E7926a27200J7638j40727B46960
$$ -96649 -73404 -22646 -16453 -183354 -21581 126139 57926 -127200 -109562 -250289 246960
15506D209c94523Q812l082B096a60895e8166B06303J9826C5659K52003o2246a6603
$$ 4209 -394523 -385711 -388793 2096 -160895 -58166 206303 226129 35659 287662 225416 -16603
15493d1126j54656j37914a43331E65701B3223i1617R808A24763a55470m0504B5160
$$ -41126 -195782 -333696 -143331 565701 23223 -91617 -81809 124763 -155470 -195974 25160
15481e5538B28397k3849I937a26684a5152E9178g6541F963a35315b3417k12158
$$ -55538 228397 204548 9937 -126684 -15152 59178 -76541 6963 -135315 -23417 -235575
15470b35575a02220A48780G769N3721B5397K03933p2545a56933D56054D2514M3248
$$ -235575 -102220 148780 7769 61490 25397 229330 156785 -156933 456054 42514 85762
15459H5762a00097C27720j06548f2863A07977e2762C2462K1977N0007q685C4163
$$ 85762 -100097 327720 221172 -62863 107977 -52762 32462 54439 104446 95761 34163
15447b80915a8218O162n1046K4875B1076e1618K1327m72729J87189E2767B0724
$$ -280915 -18218 -12056 -63102 -38227 21076 -51618 -30291 -503020 -315831 52767 20724
15435c26575C23063b39520a4833A97681B0685g6354B12783c49916A23087h6600
$$ -326575 323063 -239520 -14833 197681 20685 -76354 212783 -349916 123087 -86600
15424a20318A97520q5242e5235B52452r8212h81B00554a53808D7206g0481i554
$$ -120318 197520 112278 -55235 252452 154240 -881 200554 -153808 47206 -70481 -9554
15412a9028F0170a36226C54741a04388A05089h9268K5009B40851j2558b36625
$$ -19028 60170 -136226 354741 -104388 105089 -89268 -64259 240851 228293 -236625
15401B46623f2149l27469B07975b03917B4299L40822a00640k9530c3354D1353
$$ 246623 -62149 -389618 207975 -203917 24299 365121 -100640 -130170 -33354 41353
15390A76166c014M43k52444G9841l001b92888B47919i98D12163a488A75765a3204
$$ 176166 -3014 -2571 -255015 79841 76840 -292888 247919 -998 412163 -1488 175765 -13204
15377c9197j55097k65432B72020a25698B45378p1194J46721j13520a8689G844
$$ -39197 -194294 -459726 272020 -125698 245378 174184 320905 207385 -18689 7844
15366C21004E7167D716a68809q1603B24021R3953a32796D17218b03317H1006k4129
$$ 321004 57167 4716 -168809 -250412 224021 317974 -132796 417218 -203317 81006 56877
15355E6877a64244A02978g2340L0752B67833b62467b7460A08625e6388p4816k48484
$$ 56877 -164244 102978 -72340 -41588 267833 -262467 -27460 108625 -56388 -131204 -379688
15344c79688A72655J8020C7432K26029a04841k94963e1117l1096j23020a0390
$$ -379688 172655 190675 37432 263461 -104841 -399804 -51117 -82213 -205233 -10390
15333B2928b0082j25806I8189k7351A1468J01791q932B5975h4843A11197b05690
$$ 22928 -20082 -145888 98189 70838 11468 113259 104327 25975 -84843 111197 -205690
15321C4554e6915B20894D124J37526J15484b3181D14996b64583a05849I5803L63448
$$ 34554 -56915 220894 4124 141650 257134 -23181 414996 -264583 -105849 95803 459251
15310D59251e8565F0971N3560m4853l884L7234a25306A7294J06278d3704k83435
$$ 459251 -58565 60971 114531 69678 65794 103028 -125306 17294 123572 -43704 -327139
15299c27139e5282p4064E5571J70787r87B4854R9579c1650l8303j27204A2140
$$ -327139 -55282 -129346 55571 226358 225371 24854 124433 -31650 -69953 -197157 12140
15287G3667K13162n6230I0193O2571c3475B04435r3585k7041b4071A09797b17194
$$ 73667 286829 230599 90193 152764 -33475 204435 110850 83809 -24071 109797 -217194
15275A18124M5673a10591L1803j06674B70932K85031E3508K97442a18306p7031
$$ 118124 163797 -110591 -78788 -185462 270932 555963 53508 350950 -118306 -195337
15265a95337C475a21508B72406O8759i2615C08663I7424K13726j34994m4720P6132
$$ -195337 3475 -121508 272406 341165 -92615 308663 97424 311150 176156 131436 207568
15254B07568b74069c8274A58391f2783F08179K82873N41636L6363k16004J80735
$$ 207568 -274069 -38274 158391 -62783 608179 891052 1432688 1469051 1253047 1433782
15244A433782E25284A53583J88508a99302l8719D6633J57088b66814b5612A66100
$$ 1433782 525284 153583 342091 -199302 -238021 46633 203721 -266814 -25612 166100
15233C61789a5180k23090b2843B48991E1556A1830g1224B04783j3484G3874a73213
$$ 361789 -15180 -238270 -22843 248991 51556 11830 -71224 204783 191299 73874 -173213
15221d5675j91813E0774N2717a11289b3889o8672B05743H0766i8034H5683m1768
$$ -45675 -237488 50774 103491 -111289 -23889 -92561 205743 80766 -98034 85683 43915
15210D3915c3060C38770a5165A44233d3649n7993j3595A52244K3358m4291K4727
$$ 43915 -33060 338770 -15165 144233 -43649 -101642 -115237 152244 175602 131311 156038
15199A56038O7952e354j02824j5855C50389H2824J4545j8176J05938G6797a09964
$$ 156038 223990 -5354 -108178 -124033 350389 82824 97369 79193 185131 76797 -109964
15187A09380a2805k02215D05760G1392a51199r5483B06202o0772D5206K0173k6777
$$ 109380 -12805 -215020 405760 71392 -151199 -246682 206202 145430 45206 65379 38602
15176C8602L15980q6192b22565B25181E2115Q6052d2873n3497A76979J85918b14568
$$ 38602 354582 268390 -222565 225181 52115 138167 -42873 -96370 176979 362897 -214568
15164A23948K6776J4661h4571A36098b29216C85685c0868C8483L5016g9526q7403
$$ 123948 150724 165385 -84571 136098 -229216 385685 -30868 38483 73499 -79526 -166929
15153a66929E4969f6855A89178F6574J13606a73549A33844l7919K05380e0526
$$ -166929 54969 -66855 189178 66574 180180 -173549 133844 95925 301305 -50526
15142C12701I6438J48750A7602Q6813p997L6349b00856A68661L4636k8958M1905
$$ 312701 96438 245188 17602 104415 96418 132767 -200856 168661 203297 174339 216244
15131B16244c8064A80454R0733E1124N2012k5012M64565j63823C6753A4700K31128
$$ 216244 -38064 180454 271187 51124 103136 78124 542689 378866 36753 14700 245828
15120B45828I5619K51749a72603B29641j04236a47731C10236l3298O4442g3293
$$ 245828 95619 347368 -172603 229641 125405 -147731 310236 276938 341380 -73293
15109B26438F5011J4162f0770j11096c3372D59302j84136H4769P0593O0998l2059
$$ 226438 65011 79173 -60770 -171866 -33372 459302 275166 84769 155362 216360 184301
15098A84301N126J44004b08395I4857b4482A0634L17191e0755E3383i4031A04154
$$ 184301 189427 333431 -208395 94857 -24482 10634 327825 -50755 53383 -94031 104154
15086A46888K22189j79856H8656h6659A5748K43877c39163C05681P1431j82271
$$ 146888 369077 189221 88656 -86659 15748 259625 -339163 305681 377112 194841
15076A94841i740j6741E11550A95046g1835A76503k7904b7381B62776a53763A64911
$$ 194841 -9740 -26481 511550 195046 -71835 176503 148599 -27381 262776 -153763 164911
15064h7554B46772r388K00837E9058J41465J83564j28139G2012M2143J4581C1309
$$ -87554 246772 237384 438221 59058 200523 384087 255948 72012 114155 128736 31309
15052D8973L7735J10507F6371K95762a50560b2380D30969k10640l1603c2165A11305
$$ 48973 86708 197215 66371 362133 -150560 -22380 430969 220329 188726 -32165 111305
15040B7675J27470c5622B11664C6739h0676H3748m1694g8913A43610M46068J03975
$$ 27675 155145 -35622 211664 36739 -80676 83748 42054 -78913 143610 589678 693653
15029F93653l24830L0051j77512K97258j76050A42262K06814C1832L5320L29384
$$ 693653 368823 398874 221362 518620 342570 142262 349076 31832 67152 396536
15019C96536j02863n1074J69875f2610B13634q5438K63331A1296K11453L4086
$$ 396536 293673 242599 412474 -62610 213634 128196 391527 11296 222749 256835
15009B56835J47476l9096o7800H1915K57889j02201Q3651j58489h949K308A67191
$$ 256835 404311 365215 297415 81915 339804 237603 321254 162765 -8949 -6641 167191
14997d12137A76805J46590b555A07133a38981D30636j90278j14345K16986J49293
$$ -412137 176805 323395 -2555 107133 -138981 430636 240358 126013 342999 492292
14987D92292k15055J65805j97798o9582M48228k75796l2613q6688F5706a82371
$$ 492292 277237 443042 245244 175662 623890 348094 315481 228793 65706 -182371
14976F7387k8587L55628j74955M9112J43283J24058A41869K00785j20425C797
$$ 67387 38800 394428 219473 268585 411868 535926 141869 342654 222229 3797
14965C63845j27071L03164e0356D23513j89615J61852K86477a48314r3621C93956
$$ 363845 236774 539938 -50356 423513 233898 395750 682227 -148314 -241935 393956
14954B55925K55056j36185L662I2446l3728N62779B46378r3247a39751B89333
$$ 255925 510981 374796 378458 92446 58718 621497 246378 153131 -139751 289333
14943B66584o1709H1507J41366Q8404j29895J24240G5316K33770J59158B19928
$$ 266584 204875 81507 222873 311277 181382 305622 75316 309086 468244 219928
14932D70126I5455J26149m8466M20962B52531J22804L24901k03070D4216L40175
$$ 470126 95455 221604 173138 594100 252531 375335 700236 497166 44216 384391
14922C84391n1134J64655k37381f926D58407j30519p8517j06819k0169J77516
$$ 384391 333257 497912 260531 -6926 458407 327888 249371 142552 122383 299899
14912B99899l8509J14331l8984p2822O1750K09528j45782j53855K10345J7279
$$ 299899 261390 375721 336737 263915 325665 535193 389411 235556 445901 463180
14902D63180j29368j15157j07368K75728A56166a67310A32101J02205J19701A51042
$$ 463180 333812 218655 111287 387015 156166 -167310 132101 234306 354007 151042
14891A78397K44222j63796R2260j44253a248C65068A60859L38975m060Q2066k27725
$$ 178397 422619 258823 351083 206830 -1248 365068 160859 499834 495774 577840 350115
14880C50115L4701J87600j89279K8386K2368A65553J59589K27403j33700j04549
$$ 350115 384816 572416 383137 411523 433891 165553 325142 552545 418845 314296
14870C14296j23804R3397O6734O995K5529g3407E44399q4671j53174K92761k05338
$$ 314296 190492 283889 350623 357618 383147 -73407 544399 459728 306554 599315 393977
14859C93977L48492C25011J68578B32266L24411A21693K43783j1655m4277J54998
$$ 393977 742469 325011 493589 232266 556677 121693 365476 353821 309544 464542
14849D64542A29025N39076A91711L08724j21106j03337N3089l0677J58934m0437
$$ 464542 129025 668101 191711 500435 379329 275992 329081 298404 457338 416901
14839D16901L58803C27014J86681m1036M95164B03361J92932q0459Q4248L67854
$$ 416901 775704 327014 513695 472659 967823 203361 396293 315834 400082 767936
14829G67936k94607j34963K01985r8054p0002J81868q8735j10817J30978J1379
$$ 767936 473329 338366 540351 442297 372295 554163 465428 354611 485589 496968
14819D96968K03857n5166k28082K88568C33806K52541K8931k031K01135k15864
$$ 496968 700825 645659 417577 706145 333806 586347 615278 613247 814382 598518
14809E98518k74884K17946j4516L12565l98608K37905k98283L44490j88048O1009
$$ 598518 323634 541580 527064 839629 441021 678926 380643 725133 537085 598094
14799E98094j88047j34048L87516K85708B91289L24547j23630P286J39227l17846
$$ 598094 410047 275999 663515 949223 291289 615836 492206 499492 638719 320873
14789C20873O0628j44522K60884L9024j27746l7128K60333j11380m7823K08884
$$ 320873 381501 236979 497863 536887 409141 372013 632346 520966 473143 682027
14779F82027j09032j30214L8189B37836L44124o193j28907J48291p7211j26060
$$ 682027 572995 442781 480970 237836 581960 575767 446860 595151 517940 391880
14769C91880J44752Q9487p8381K81662K04628l58337r7628K64561j73967r8374
$$ 391880 536632 626119 547738 829400 1034028 675691 578063 842624 668657 570283
14759E70283J04488K21522j18344k1775p8688M03393m68270L0024j20601K76841
$$ 570283 674771 896293 777949 756174 677486 1080879 612609 642633 522032 798873
14749G98873m4276L6074r5691j28886j78115L49949R9267M5092r9096J0550o0870
$$ 798873 754597 790671 694980 566094 387979 737928 837195 882287 783191 793741 732871
14738G32871Q078m0328J58983k27659M98290l73221p3173K0910n2941J6517P9207
$$ 732871 740949 700621 859604 631945 1130235 757014 683841 704751 651810 668327 747534
14727G47534J77447M9196j29518j82463J28358l4343M38215m53976j19278J99141
$$ 747534 924981 974177 844659 662196 790554 756211 1194426 740450 621172 820313
14717H20313m7886k6507N5553J74004J69796k40778J1458K30706k12152j39755
$$ 820313 772427 745920 801473 975477 1145273 904495 915953 1146659 934507 794752
14707G94752K29354l85554L19334J46453K8967l83230J60926j49495K75069l46082
$$ 794752 1024106 638552 957886 1104339 1133306 750076 911002 761507 1036576 690494
14697F90494J35210j01872L70728l23675Q7478R5582j22518K04696l52387K98183
$$ 690494 825704 723832 1094560 770885 858363 953945 831427 1036123 683736 981919
14687I81919j72606l1830j46408L94869o2798j75402k18751L17712r0183N76912
$$ 981919 809313 777483 631075 1025944 963146 787744 568993 886705 796522 1373434
14677A373434m07009j11763L78293l47160j97223M01231k3827k1813J06412r6714
$$ 1373434 966425 854662 1232955 885795 688572 1089803 1065976 1044163 1150575 1053861
14667A053861k9689L1810L505K09741j83651j25830k89319L61713n0309k08895
$$ 1053861 1024172 1055982 1059487 1269228 1085577 959747 670428 1032141 981832 772937
14657G72937O01948l13527Q4988K6570J55034n2817J29842j42205j9618O3679
$$ 772937 1374885 1061358 1146346 1172916 1327950 1275133 1404975 1262770 1243152 1306831
14647A306831n1461r9708M9242P5135J18644m5363J52401J4998l49031K46708
$$ 1306831 1255370 1155662 1204904 1280039 1398683 1353320 1505721 1520719 1171688 1418396
14637A418396J7936L6329l32995n9470K70262j13184L09878J050o8975l531K00797
$$ 1418396 1436332 1472661 1139666 1080196 1350458 1237274 1547152 1548202 1479227 1475696 1676493
14626A676493n48176N31719l53032M01494o59983L91306j13115K18704J01600
$$ 1676493 1128317 1660036 1307004 1708498 1048515 1439821 1326706 1545410 1647010
14617A647010k82837J49469K11098k17633L3687J47900q7317K49450m62460K9323
$$ 1647010 1364173 1513642 1724740 1507107 1540794 1688694 1601377 1850827 1388367 1417690
14607A417690L49074L4478N2852K4236J80111n74450M71909j33696m3680l55427
$$ 1417690 1766764 1801242 1854094 1878330 2058441 1483991 1955900 1822204 1778524 1423097
14597A423097L61450L20461l27340p9644K58515P1742n9829k21754k44127L90776
$$ 1423097 1784547 2105008 1777668 1698024 1956539 2028281 1968452 1746698 1502571 1893347
14587A893347K4015K3053P0821l75374O37632k27250k18603L18676q9268J52579
$$ 1893347 1917362 1940415 2011236 1635862 2273494 2046244 1827641 2146317 2057049 2209628
14577B209628k3895M1554j57132P9690j43114K76069j04147m045r4085L31593
$$ 2209628 2185733 2227287 2070155 2149845 2006731 2282800 2178653 2174608 2080523 2412116
14567B412116l76153O21900l7062p3747K31441j2425o9878J517K70223k38524
$$ 2412116 2035963 2657863 2620801 2547054 2778495 2766070 2696192 2697709 2967932 2729408
14557B729408L20286J32524k3554N56032K15964K98728M99275J320427J758478
$$ 2729408 3049694 3182218 3158664 3714696 3930660 4229388 4728663 6049090 7807568
14548G807568N115197J0420208J8318764O197027k3146694I025411D201445j228124
$$ 7807568 12922765 23342973 41661737 47858764 24712070 9025411 4201445 2973321
14540B973321p08905j3084J73160r09990P98895k46845L8241q7241k71211M36127
$$ 2973321 2264416 2251332 2424492 1514502 2313397 2066552 2104793 2017552 1746341 2182468
14530B182468J15438j8713M1503M68777j91918n5561L25846j49281k10906J14386
$$ 2182468 2297906 2279193 2320696 2789473 2597555 2541994 2867840 2718559 2507653 2622039
14520B622039M21239m04692K73631l21868O03114j69727l03506J86500j20429
$$ 2622039 3043278 2638586 2912217 2590349 3193463 3023736 2720230 2906730 2786301
14511B786301k24135N09047m70543N18710k05672J24879L7791J20195R4983l8393
$$ 2786301 2562166 3071213 2600670 3119380 2913708 3038587 3076378 3196573 3291556 3253163
14501C253163o8873j29845L40643r7140j18312K62760l55330K81712J69360K5688
$$ 3253163 3184290 3054445 3395088 3297948 3179636 3442396 3087066 3368778 3538138 3563826
14491C563826j70827M83698k84999K36595l32430L25878J91672k52955M65440
$$ 3563826 3392999 3876697 3591698 3828293 3495863 3821741 4013413 3760458 4225898
14482D225898j09260j71796J1720R3096Q5348K68201l45485K41310j6190K4226
$$ 4225898 4116638 3944842 3956562 4049658 4135006 4403207 4057722 4299032 4282842 4307068
14472D307068j60811J41206K32116l94303N00810J67528j68318o4797J32184L53389
$$ 4307068 4146257 4287463 4519579 4125276 4626086 4793614 4625296 4560499 4692683 5046072
14462E046072j64480m16999N96653K1444j93314K16065L02615o1025o540M40795
$$ 5046072 4881592 4464593 5061246 5082690 4889376 5105441 5408056 5347031 5340491 5781286
14452E781286l60151J10941j37082J48470L12784k9588P0687K28132k84486M76372
$$ 5781286 5421135 5532076 5394994 5543464 5856248 5826660 5897347 6125479 5840993 6317365
14442F317365n8871K84065l38433K58063O0381J74276J44394j17329K26347J5028
$$ 6317365 6258494 6542559 6204126 6462189 6522570 6696846 6841240 6723911 6950258 6965286
14432F965286K61288O6525j64673L99346o367J66055j80251K90957Q6628P7641
$$ 6965286 7226574 7293099 7128426 7527772 7521405 7687460 7507209 7798166 7884794 7962435
14422G962435R6099L69864Q65J54141K07801j68833J75669L19700k91921L96968
$$ 7962435 8058534 8428398 8429263 8583404 8791205 8622372 8798041 9117741 8825820 9222788
14412I222788J63951j6955J40431J46798J32724M68477m53843N93960J10129p6173
$$ 9222788 9386739 9369784 9510215 9657013 9789737 10258214 9804371 10398331 10508460 10432287
14402A0432287J82380L58328L16078n4505J22477M95535L4887L09796K5369J49730
$$ 10432287 10614667 10972995 11289073 11234568 11357045 11852580 11887467 12197263 12222632 12372362
14392A2372362N57836j66256J81730L97246L32959J97376L54521j66218M08731
$$ 12372362 12930198 12763942 12945672 13342918 13675877 13873253 14227774 14061556 14470287
14383A4470287K75342J94518L74888L75562o791M66646L53042L60138K06063K22594
$$ 14470287 14745629 14940147 15315035 15690597 15683806 16150452 16503494 16863632 17069695 17292289
14373A7292289M80274M96164J61256M40638L20334M37448M60857L33454M86602
$$ 17292289 17772563 18268727 18429983 18870621 19190955 19628403 20089260 20422714 20909316
14364B0909316K49810L42029N07894N18832P96509L91111L18298Q38025P13008
$$ 20909316 21159126 21501155 22009049 22527881 23324390 23715501 24033799 24871824 25584832
14355B5584832L06335M85715O78332R07088P57110J59809P53664O12690J242958
$$ 25584832 25891167 26376882 27055214 27962302 28719412 28879221 29632885 30245575 31488533
14346C1488533M15221R29681J234173L54268J075463J147780M82812J183614J561721
$$ 31488533 31903754 32833435 34067608 34421876 35497339 36645119 37127931 38311545 39873266
14337C9873266P90354J010524J776891J053954R08261J351364J642157J535558
$$ 39873266 40663620 41674144 43451035 44504989 45413250 46764614 48406771 49942329
14329D9942329J477114J790735J393432J454106K047232K112285K218482J863118
$$ 49942329 51419443 53210178 54603610 56057716 58104948 60217233 62435715 64298833
14321F4298833K373311K316452K280417K916348K848755K559740L277407K840776
$$ 64298833 66672144 68988596 71269013 74185361 77034116 79593856 82871263 85712039
14313H5712039L734762L457376L696084L801037M118114M934242M244983M766098
$$ 85712039 89446801 92904177 96600261 100401298 104519412 109453654 113698637 118464735
14305A18464735N671808N771304N706068O500859O406915O880281P571474Q099649
$$ 118464735 124136543 129907847 135613915 142114774 148521689 155401970 162973444 171073093
14297A71073093Q279904R052181Q682844J0136731J0771312J0494280J1913812
$$ 171073093 179352997 188405178 197088022 207224753 217996065 228490345 240404157
14290B40404157J1905327J2502487J3598505J3586874J4305395J5029189J5099085
$$ 240404157 252309484 264811971 278410476 291997350 306302745 321331934 336431019
14283C36431019J5385819J5461018J5621772J4917867J4944819J3614120J3434062
$$ 336431019 351816838 367277856 382899628 397817495 412762314 426376434 439810496
14276D39810496J1785696J0132351P544130L839553R22166m80042j281689m151827
$$ 439810496 451596192 461728543 469272673 473112226 474034392 473554350 472272661 468120834
14268D68120834M83929j904002p007177r434840j1115903j2132284j3631478j4785424
$$ 468120834 468604763 466700761 459693584 450258744 439142841 427010557 413379079 398593655
14260C98593655j5784329j5640302j5891206j5848317j5516079j4671711j3866388
$$ 398593655 382809326 367169024 351277818 335429501 319913422 305241711 291375323
14253B91375323j4250427j3226841j3233215j2023876j2048122j0792258j0722510
$$ 291375323 277124896 263898055 250664840 238640964 226592842 215800584 205078074
14246B05078074r648630r268773q600260q192987p802875p517490o803551o814965
$$ 205078074 195429444 186160671 177560411 169367424 161564549 154047059 147243508 140428543
14238A40428543o192755n234082n777844m937700n273347m841730m113557l738809
$$ 140428543 134235788 129001706 123223862 118286162 113012815 108171085 104057528 100318719
14230A00318719l675285m393235l595816l395796k920232l183180k902903k833659
$$ 100318719 96643434 92250199 88654383 85258587 82338355 79155175 76252272 73418613
14222G3418613k277949k488636k021366k278557k354155k363214j722736j826741
$$ 73418613 71140664 68652028 66630662 64352105 61997950 59634736 57912000 56085259
14214E6085259j510918j566207j491701j804341j524091j494037j092395o51908
$$ 56085259 54574341 53008134 51516433 49712092 48188001 46693964 45601569 44949661
14206D4949661j065700j574843j340051j460105j198606k10169r30267j301793
$$ 44949661 43883961 42309118 40969067 39508962 38310356 38100187 37169920 35868127
14198C5868127j217239o87227j024728p18200q07175m28054j013249r99224m96277
$$ 35868127 34650888 33963661 32938933 32220733 31413558 30985504 29972255 28973031 28476754
14189B8476754o19569p43095n57219n44100r55531j15550o71059q56753m3794
$$ 28476754 27857185 27114090 26556871 26012771 25057240 24941690 24270631 23413878 23370084
14180B3370084n48191n35689n44960l48373p89938J79617o91252o38878N885n83492
$$ 23370084 22821893 22286204 21741244 21392871 20602933 20782550 20091298 19452420 19458305 18874813
14170A8874813k31343l81055l95162p05936l3768m68962p2034l68297j25781j12333
$$ 18874813 18643470 18262415 17867253 17161317 17127549 16658587 16586553 16218256 16092475 15980142
14160A5980142n28329m78923j48618m0941m54729q9363j70231k03056k15937j58769
$$ 15980142 15451813 14972890 14824272 14783331 14328602 14239239 14069008 13865952 13650015 13491246
14150A3491246m16898j6092n20748n6319j00308m23116K72332n48085M0093p26276
$$ 13491246 13074348 13058256 12537508 12481189 12380881 11957765 12230097 11682012 11722105 10995829
14140A0995829m8714K34604k85782j33051k28519l86832j75598J73422k82111
$$ 10995829 10947115 11181719 10895937 10762886 10534367 10147535 9971937 10145359 9863248
14131I863248l52937J58093P0215n23875p6598J37651k67539k89430p5485j92292
$$ 9863248 9510311 9668404 9738619 9214744 9138146 9275797 9008258 8718828 8643343 8451051
14121H451051l15826L38050k07076n3150k88349J2373K07369j09880j6553m02785
$$ 8451051 8135225 8473275 8266199 8213049 7924700 7937073 8144442 8034562 8018009 7615224
14111G615224q3575k58052r493k93624J60722m9168P4702k85082k38693L9990
$$ 7615224 7531649 7273597 7264104 6970480 7131202 7082034 7156736 6871654 6632961 6672951
14101F672951l34725K37979n4039j53863K47387n19456J15108j8251K9787j28678
$$ 6672951 6338226 6576205 6522166 6368303 6615690 6096234 6211342 6193091 6222878 6094200
14091F094200q2766m05925L55626j54924K41633j82781m53710J07170L2081j08406
$$ 6094200 6011434 5605509 5961135 5806211 6047844 5865063 5411353 5518523 5550604 5442198
14081E442198k16865k34214K42938j51783j68727O5475m38235J67965j173K41158
$$ 5442198 5225333 4991119 5234057 5082274 4913547 4979022 4540787 4708752 4707579 4948737
14071D948737m4600j52255n0937m09660J48106R4484k74183L65028K10786l83309
$$ 4948737 4904137 4751882 4700945 4291285 4439391 4533875 4259692 4624720 4835506 4452197
14061D452197L22014m44037K78450O4903j60856k36797l01093J93595k3468j9198
$$ 4452197 4774211 4330174 4608624 4673527 4512671 4275874 3974781 4168376 4144908 4125710
14051D125710R4605k40836K8621j59718r6007M1469j21432j04469L3037k46604
$$ 4125710 4220315 3979479 4008100 3848382 3752375 3793844 3672412 3567943 3600980 3354376
14041C354376L86374m7604m6498K5168l50625K22947k11324k48555J39111K46610
$$ 3354376 3740750 3693146 3646648 3671816 3321191 3544138 3332814 3084259 3223370 3469980
14031C469980p0212j69549j26778j28260K32873J28909k69771J53867k60434O4463
$$ 3469980 3399768 3230219 3103441 2975181 3208054 3336963 3067192 3221059 2960625 3025088
14021C025088k39382J325j57734L39583m40863K35807J55460q0706J13027j96285
$$ 3025088 2785706 2787031 2629297 2968880 2528017 2763824 2919284 2838578 2951605 2755320
14011B755320k23783J38189m29689K84694J92720o36618J92077L48212k05999
$$ 2755320 2531537 2669726 2240037 2524731 2717451 2080833 2272910 2621122 2415123
14002B415123m0973K10789l31605O9011J13475j13982L8128k37501k72803K71549
$$ 2415123 2374150 2584939 2253334 2322345 2435820 2321838 2359966 2122465 1849662 2121211
13992B121211K04239q4692O42725J002913L031572Q297318J8928827J3849829
$$ 2121211 2325450 2240758 2883483 3886396 6917968 15215286 34144113 47993942
13984D7993942j7285762A4357299o045749k376930p82565o50702q27917L0910
$$ 47993942 30708180 14357299 8311550 5934620 5152055 4501353 3673436 3704346
13976C704346k03177j7051n56266j33237J01922k17483P1368p32k44083k6578
$$ 3704346 3501169 3484118 2927852 2794615 2896537 2679054 2750422 2749690 2505607 2479029
13966B479029J13130N9852j66371k00323N7695p6027r2879M43266k00959m75616
$$ 2479029 2592159 2652011 2485640 2285317 2343012 2266985 2174106 2617372 2416413 1940797
13956A940797K09513k25716K55519J49775l09780L28087n52196M27470k23345
$$ 1940797 2150310 1924594 2180113 2329888 2020108 2348195 1795999 2223469 2000124
13947B000124j9255k13381N03430k54627J65839j91955L68945o90981K67973M5666
$$ 2000124 1980869 1767488 2270918 2016291 2182130 1990175 2359120 1668139 1936112 1981778
13937A981778k07199M85490m17411K9440o3717J27723l4439k07496K90585l39942
$$ 1981778 1774579 2260069 1842658 1872098 1808381 1936104 1901665 1694169 1984754 1644812
13927A644812J10790L33334l15373j09794j84950M83697m54404K35385k16222
$$ 1644812 1755602 2088936 1773563 1663769 1478819 1962516 1508112 1743497 1527275
13918A527275O4152k75604P06742k05150l36476O2068N2380P5256j33061J41233
$$ 1527275 1591427 1315823 2022565 1817415 1480939 1543007 1595387 1670643 1537582 1678815
13908A678815n19066L70844O3229q2391o1120J52594m66479M28216q2350j68598
$$ 1678815 1159749 1530593 1593822 1511431 1450311 1602905 1136426 1564642 1482292 1313694
13898A313694O2030j7086K31428j45204r5212k327M19243m41949K31438l20485
$$ 1313694 1375724 1358638 1590066 1444862 1349650 1347323 1766566 1324617 1556055 1235570
13888A235570l5859K69733M6414q1062J99163l45726j55352L28319J60614l62493
$$ 1235570 1199711 1469444 1515858 1434796 1633959 1288233 1132881 1461200 1621814 1259321
13878A259321K6562j46172J31771L38096j15795j2023J13721k37062K35694n54336
$$ 1259321 1285883 1139711 1271482 1609578 1493783 1481760 1595481 1358419 1594113 1039777
13868A039777j41471M51993k18519k3561M64514n58958J42155k78667K50093K94923
$$ 1039777 898306 1350299 1131780 1108219 1572733 1013775 1155930 877263 1127356 1422279
13858A422279j87266n2820O6655j97295J40701O3237m15131J52979L6039M2915
$$ 1422279 1235013 1182193 1248848 1051553 1192254 1255491 840360 993339 1029378 1072293
13848A072293J1682L07878k87476j39930k36635O33315j56105k89249K13637l9082
$$ 1072293 1083975 1391853 1104377 964447 727812 1361127 1205022 915773 1129410 1090328
13838A090328N04309m61954p2112j9668K00411k39347O0150k22917k2582K48869
$$ 1090328 1594637 1132683 1060571 1040903 1241314 1001967 1062117 839200 816618 1065487
13828A065487l1756n6811j03333L68626l52938k40647L26650k61878K93983K73322
$$ 1065487 1033731 976920 873587 1242213 889275 648628 975278 713400 1007383 1280705
13818A280705j13938k47858k31747K61849j67136O9716o3687J35327O3362k86815
$$ 1280705 1166767 918909 687162 949011 781875 851591 787904 923231 986593 699778
13808F99778O68500m80122k56822O32312m17770l11078J36676K06197J07501m50840
$$ 699778 1368278 888156 631334 1263646 845876 534798 671474 877671 985172 534332
13798E34332M64560j25135K4600j81557M1341L30475K3509j93261l33480K31472
$$ 534332 998892 873757 898357 716800 758141 1088616 1112125 918864 585384 816856
13788H16856q6622j80549J16774M09590n12344L3122K58816l34130M78984J5920
$$ 816856 730234 549685 666459 1076049 563705 596827 855643 521513 1000497 1016417
13778A016417m09659R2267l6806L55218l36308N7576Q0024k08304l0599M2141
$$ 1016417 606758 699025 662219 1017437 681129 738705 818729 610425 579826 621967
13768F21967J67684j86419k2894K09526J72089j70717j08725K37713l37588K18412
$$ 621967 789651 603232 580338 789864 961953 791236 682511 920224 582636 801048
13758H01048l72219L58529k29881J17069J37204n5151l46169J15062K48084O4080
$$ 801048 428829 787358 557477 674546 811750 756599 410430 525492 773576 837656
13748H37656K085j99859K22538k40461K01287l26658L95174k00381j76870N52463
$$ 837656 839741 639882 862420 621959 823246 496588 891762 691381 514511 1066974
13738A066974m14648J28061C84717N082L50195m6736k03616L04729P0818N9390
$$ 1066974 652326 780387 384717 389799 739994 693258 489642 794371 865189 924579
13728I24579p5069j02689P1213j31398J26221J37212l34928k02468M4525J89637
$$ 924579 849510 746821 818034 686636 812857 950069 615141 412673 457198 646835
13718F46835M038J40323k1574k07505j14563J40991N0239k33743L89989C71877
$$ 646835 650873 791196 769622 562117 447554 588545 638784 405041 795030 371877
13707F21342R2474J11109l07603L2595K12710j56391K0919K954L47831C49926
$$ 621342 713816 824925 517322 549917 762627 606236 627155 630109 977940 349926
13696B84867L61433j59427N9828K84167k80212j57124Q0580Q9775Q9674L4646
$$ 284867 646300 486873 546701 830868 550656 393532 474112 563887 653561 688207
13686F88207J9926k27474J3003p2345N5118K97033l63702L32967m6563l00756
$$ 688207 708133 480659 493662 421317 476435 773468 409766 742733 696170 395414
13676C95414K00193q458n5882j74045L33092p5494J3874j78328j515K9762J67644
$$ 395414 595607 587149 531267 357222 690314 614820 628694 450366 448851 478613 646257
13665F46257j73199o8695Q070K05792k90192L05782K636j94591K11011j4608j4680
$$ 646257 473058 404363 412433 618225 328033 633815 636451 441860 652871 638263 623583
13654F23583J12382n8352l09832O9009j7857K97314k8702B93885J89038k11819
$$ 623583 735965 677613 367781 436790 418933 716247 687545 293885 482923 271104
13644B71104K22665j98788q9386K59720K14109M2960l56092K19401k37794R4910
$$ 271104 493769 294981 205595 465315 679424 722384 366292 585693 347899 442809
13634D42809r1416A33665J37512K86156B00140M2119K28976j1940J16701k13551
$$ 442809 351393 133665 271177 557333 200140 242259 471235 459295 575996 362445
13624C62445J02026o2362l4735l4630J01001j78434M53951A80114L29931r7956
$$ 362445 464471 402109 367374 332744 433745 255311 709262 180114 510045 412089
13614D12089M4237r3173J06925l7118J41115k01429l9607N9423O8955J75277r6362
$$ 412089 456326 363153 470078 432960 574075 372646 333039 392462 461417 636694 540332
13603E40332j28346J28396k17327m1859J40409O7868p2054A39277M06191H1095
$$ 540332 411986 540382 323055 281196 421605 489473 417419 139277 545468 81095
13592B17184J37573j7479j61242J01714R6051K65998j98580j01690L29076B89721
$$ 217184 354757 337278 176036 277750 373801 639799 441219 339529 668605 289721
13581D35666R1026k16818L71179k93131Q8632Q9063k05394J82232k44729q7562
$$ 435666 526692 309874 681053 387922 476554 565617 360223 542455 297726 210164
13571B10164Q9070J01873A82647J92365L1858k02886J08213K7976A47910l4556
$$ 210164 299234 401107 182647 375012 406870 203984 312197 340173 147910 113354
13561A13354N9981R3304O2022j49406K72863j38938K20265c2205j45330E38423
$$ 113354 173335 266639 328661 179255 452118 313180 533445 -32205 -177535 538423
13550I5365M26026r2299j6594q8195K84670p4730k13128k3369j45951l6702K59319
$$ 95365 521391 429092 412498 324303 608973 534243 321115 297746 151795 115093 374412
13539C74412J52180j81710q7156K92486A87871M731l3513K75302j11828J08567
$$ 374412 526592 344882 257726 550212 187871 192602 159089 434391 322563 431130
13529D31130p8284k5525n2528M11184G4602L61624A85695f890D35288A86005E8980
$$ 431130 352846 327321 274793 685977 74602 436226 185695 -6890 435288 186005 58980
13517C02858M9705l6333j23398L45067k47380K72702A72220M0795J68378A01560
$$ 302858 352563 316230 192832 537899 290519 563221 172220 213015 381393 101560
13506C06229P0623J84739B03892M03K80387k09512J22974j62776J99370r4060
$$ 306229 376852 561591 203892 204295 484682 275170 398144 235368 434738 340678
13496C40678a48833B09924P0021j22571C0695J93569B9247J11785M02439i69B90475
$$ 340678 -148833 209924 279945 157374 30695 224264 29247 141032 543471 -969 290475
13484C25630l9885R8429K85753C00508D4280N0285L7623K29399E1864E15K44786
$$ 325630 285745 384174 669927 300508 44280 94565 132188 361587 51864 515 245301
13473B45301K62771k48755A01039J49687N1999I4443K37654J01701J19043a3155
$$ 245301 508072 259317 101039 250726 302725 94443 332097 433798 552841 -13155
13462f0653D30114j37084k0672c1956B29841L72894j78995A41475K02313L893
$$ -60653 430114 293030 272358 -31956 229841 602735 423740 141475 343788 347681
13452C47681f4487E09729A81151J85956p7504E1585J50293q7754O1389J09143
$$ 347681 -64487 509729 181151 367107 289603 51585 201878 114124 175513 284656
13442B84656K40923E5449L44434J27719D4711J87776p0096O6443K27768A13536
$$ 284656 525579 55449 399883 527602 44711 232487 162391 228834 456602 113536
13431C46331Q5754d0341D9259J08880N24810l39803a44013A36649M50875I8396
$$ 346331 432085 -40341 49259 158139 682949 343146 -144013 136649 587524 98396
13420c6362C79364r0524j06397J44500F3239M60824A40106E8263K28920j04623
$$ -36362 379364 288840 182443 326943 63239 524063 140106 58263 287183 182560
13410A82560P2879K22934j11973M1599j79064J50802a99635B52411N4661I7410
$$ 182560 255439 478373 366400 407999 228935 379737 -199635 252411 307072 97410
13399a17080B7898J07160K73379j37796M1768I7867l4005A963L88739K7143D7257
$$ -117080 27898 135058 408437 270641 312409 97867 63862 1963 390702 417845 47257
13387B36049j6009c9281B90398j2273J48599q0626n4391C9243M76893j14824C8672
$$ 236049 220040 -39281 290398 278125 426724 346098 291707 39243 516136 401312 38672
13375B48932q7067L4901J24148G3512J43813L13980A66605J19664J37746J07749
$$ 248932 161865 196766 320914 73512 217325 531305 166605 286269 424015 531764
13365E31764F8988h8764B50900O9813L4413A48938O7483j00161Q0520J60628J9175
$$ 531764 68988 -88764 250900 320713 355126 148938 216421 116260 196780 357408 376583
13354C76583A77615e1730B19118m8229M902p7958k129M9510M2217J51583J08804
$$ 376583 177615 -51730 219118 170889 175791 97833 95704 145214 187431 339014 447818
13343D47818A87708p9780K36167j35061b9648B84693O3341J98398k09063K102
$$ 447818 187708 107928 344095 209034 -29648 284693 348034 546432 337369 339471
13333C39471J66310Q3853f3636B41582J3425K13872F9588K79626A35478g8030
$$ 339471 505781 589634 -63636 241582 255007 468879 69588 349214 135478 -78030
13322a10155B06793K3779o527J46681A5554L29096a13428A40034O3270J71581
$$ -110155 206793 230572 224045 370726 15554 344650 -113428 140034 203304 374885
13312C74885A86281K18289c0170C05812k0922A39375D8073N16509A44388h1186
$$ 374885 186281 404570 -30170 305812 284890 139375 48073 564582 144388 -81186
13301D29407j72462J02261p2632j38779c6499j51531A74899L8409K51488j76348
$$ 429407 256945 359206 286574 147795 -36499 -188030 174899 213308 464796 288448
13291B88448p5343G9101J68968n9779R2156a2308B87127F7919O8901n1728l8679
$$ 288448 213105 79101 248069 188290 280446 -12308 287127 67919 136820 85092 46413
13280D6413J56724O4520n080b6967B95368C3823K25944r148c2762E7992J53864
$$ 46413 203137 267657 262577 -26967 295368 33823 259767 250619 -32762 57992 211856
13269B11856G4157J49884H1958a4443B75281D1654J86483G0411B64L82093a9086
$$ 211856 74157 224041 81958 -14443 275281 41654 228137 70411 264 382357 -19086
13257f1755A06789L67313j06839G0873L00561A09385Q6509j689n8607n6652a35964
$$ -61755 106789 474102 367263 70873 371434 109385 195894 194205 135598 78946 -135964
13245c7438B47590b42558A34706F6991q842K13760l1563C8738K65131B7495f8582
$$ -37438 247590 -242558 134706 66991 58149 271909 240346 38738 303869 27495 -68582
13233B83915a84040H6545f4562D8633M71442C1961J35822A7018L0374n611M47733
$$ 283915 -184040 86545 -64562 48633 520075 31961 167783 17018 47392 41781 489514
13222D89514a8880C65288g4928n7888F7484J30663J9110J63877A53827i8036L6867
$$ 489514 -18880 365288 -74928 -132816 67484 198147 217257 381134 153827 -98036 -61169
13211f1169A5032J18712b04301C00024a51760C08092A45173J75470O4371A03295
$$ -61169 15032 133744 -204301 300024 -151760 308092 145173 320643 385014 103295
13200a80708B08715r0487Q6953J42088B9967e8759K7554k7866e878C3947a94116
$$ -180708 208715 118228 205181 347269 29967 -58759 -31205 -59071 -5878 33947 -194116
13188I8562R7538q6161o306L10469A01535M2755G0151g938B14330H4212L37165
$$ 98562 196100 109939 103633 414102 101535 144290 70151 -7938 214330 84212 421377
13177D21377j82126B5412P9512b39910c0810I4818a48575l6864A7464A393b2696
$$ 421377 239251 25412 104924 -239910 -30810 94818 -148575 -185439 17464 1393 -22696
13165A34386J92705q0229k3857r5477h1154R789j30534D13563H1170J03451H2923
$$ 134386 327091 246862 223005 127528 -81154 -71365 -201899 413563 81170 184621 82923
13153c2393C76213A23078J56624h8223A21818J12153m7661n6152m9361K31157
$$ -32393 376213 123078 279702 -88223 121818 233971 186310 130158 80797 311954
13143C11954k5326Q730j8808K890a02028A00804R636K7258l39d65085I9760a61477
$$ 311954 286628 295358 276550 279440 -102028 100804 110440 137698 137359 -465085 99760 -161477
13130B32851b64361h1750j37373A38252M6319K5855C7378L2812J42264a99485
$$ 232851 -264361 -81750 -219123 138252 184571 210426 37378 70190 212454 -199485
13119C9630a2529E367J80427o0324n2482a25387B980P5537J35813Q0810N7017
$$ 39630 -12529 5367 185794 125470 72988 -125387 2980 78517 214330 295140 352157
13108C52157H2476K5862a16486L2004A252a5683B16786H8523b52812D3524K66486
$$ 352157 82476 108338 -116486 -84482 1252 -15683 216786 88523 -252812 43524 310010
13097C10010D8055c5104E0306J04266a30553B52934a57589c6230l5719B57636
$$ 310010 48055 -35104 50306 154572 -130553 252934 -157589 -36230 -71949 257636
13086I2979L4475J60353A14729E909J13182a72985A81669K53013L5099B2380O6489
$$ 92979 127454 287807 114729 5909 119091 -172985 181669 434682 469781 22380 88869
13075H8869r247K26787f116A89441p2033K01505b1336I9367K73344g2310j25600
$$ 88869 79622 306409 -6116 189441 117408 318913 -21336 99367 372711 -72310 -197910
13064a97910A19535b8797G5564O2001e3781A69083K9064K67172j35115c24206
$$ -197910 119535 -28797 75564 137565 -53781 169083 198147 465319 330204 -324206
13053C63008j50163c7480p4845I8037J63499J35564r2713A10020N6193J30167
$$ 363008 212845 -37480 -112325 98037 261536 397100 304387 110020 166213 296380
13043B96380b51277F1226k2142P3543C8929A5652J45544J70726I2870K52701k6045
$$ 296380 -251277 61226 39084 112627 38929 15652 161196 331922 92870 345571 319526
13032C19526I0146j1153P9215F0499O3591J62981A00218k1542J90009H5278M04004
$$ 319526 90146 78993 158208 60499 124090 287071 100218 78676 268685 85278 489282
13021D89282D5541l986e6555A31110L8949q1933L8136r71i0200h93r159A23288
$$ 489282 45541 41555 -56555 131110 170059 88126 126262 125291 -90200 -893 -10052 123288
13008a6547B2130J11838F129R9692j1520K3306J03052L37383A59597K25947B0756
$$ -16547 22130 133968 6129 105821 94301 117607 220659 558042 159597 385544 20756
12996A95282a10975A56729B460J49067e1512I9640j8169j0932d9521B85913b41405
$$ 195282 -110975 156729 2460 151527 -51512 99640 81471 70539 -49521 285913 -241405
12984h8438E0670d8257E20348a26496D5248g9394C33966n8413a76666B2724J65112
$$ -88438 50670 -48257 520348 -126496 45248 -79394 333966 275553 -176666 22724 187836
12973A87836E9649J51328D7058a154H6205k3140Q9954i6373A96713j5105a58141
$$ 187836 59649 210977 47058 -1154 86205 63065 153019 -96373 196713 181608 -158141
12961E2759L05389A23750a13841a1731o096Q645G3405J20503E0018J96413L26248
$$ 52759 358148 123750 -113841 -11731 -17827 -9182 73405 193908 50018 246431 572679
12950E72679B20054J81325A5178a86875O6917B54118i1032n2144k63805A01487
$$ 572679 220054 401379 15178 -186875 -119958 254118 -91032 -143176 -406981 101487
12939B26853C2947i3950E0386K89275C6742a96063D158Q7488O1408K27734b05562
$$ 226853 32947 -93950 50386 339661 36742 -196063 4158 91646 153054 380788 -205562
12927A5375K0918c47062A02075K2201h6556k50869C47704d2883k3894j40326r9903
$$ 15375 36293 -347062 102075 124276 -86556 -337425 347704 -42883 -66777 -207103 -307006
12916c07006D94865a16613c1529A41745K7361E2235c2746J2391A48218f2358j16356
$$ -307006 494865 -116613 -31529 141745 169106 52235 -32746 -20355 148218 -62358 -178714
12905a78714A43832c27128a32014C3915J54133H4870C6427J13741a97125i3175
$$ -178714 143832 -327128 -132014 33915 188048 84870 36427 150168 -197125 -93175
12894A35809d3H2509e2880A47198a79455A96132D1580a1687A80249C5409B455
$$ 135809 -43 82509 -52880 147198 -179455 196132 41580 -11687 180249 35409 2455
12882B3847b7365j86922f1558l6690A54050L8535F0563L7821c15709A14013b45966
$$ 23847 -27365 -214287 -61558 -98248 154050 192585 60563 98384 -315709 114013 -245966
12870f2536n0322j30646C00748c19162A39262H064a0070l75472c002A05078b05228
$$ -62536 -112858 -243504 300748 -319162 139262 8064 -10070 -385542 -3002 105078 -205228
12858i7482B13082b61336d2575B20045D1047G61J12687k2445c1515j21231B91175
$$ -97482 213082 -261336 -42575 220045 41047 761 113448 91003 -31515 -152746 291175
12846e7521n7575c8577C4047N01588b03128A09687J36812j5040I3999c67852A91869
$$ -57521 -115096 -38577 34047 535635 -203128 109687 246499 231459 93999 -367852 191869
12834D0691b9240A41388L3462H3776J19655C7472J34991f3312B05845H7375b15707
$$ 40691 -29240 141388 174850 83776 203431 37472 172463 -63312 205845 87375 -215707
12822d756B3657K55046a96983e1956A69916P2246j14449a32854B37504g0299C5893
$$ -4756 23657 278703 -196983 -51956 169916 242162 127713 -132854 237504 -70299 35893
12810a37412e3668C74328b35757d208D6235h0159j00870A17393K50387A75205
$$ -137412 -53668 374328 -235757 -4208 46235 -80159 -181029 117393 367780 175205
12799B61954K3945b67945A16875J8106d2000G4993c7780r304j78288l1196A46606
$$ 261954 285899 -267945 116875 134981 -42000 74993 -37780 -47084 -225372 -256568 146606
12787A21656b22590J03408A7308J17002L620J80407m5554j01099R574d5043B79066
$$ 121656 -222590 -119182 17308 134310 137930 318337 272783 171684 181258 -45043 279066
12775a26285b6672j6464B45846b2606j14204A30846F1605K94057b13216e1768
$$ -126285 -26672 -43136 245846 -22606 -136810 130846 61605 355662 -213216 -51768
12764H9544f4949b3556j66C7739e4517B59746c22207k9660g3296C18500B1914
$$ 89544 -64949 -23556 -23722 37739 -54517 259746 -322207 -351867 -73296 318500 21914
12752B80400C0293J00200E7742b12745C84871b62693N1565A94848B6347f1464
$$ 280400 30293 130493 57742 -212745 384871 -262693 -211128 194848 26347 -61464
12741A10019J19008E9398J70586N5534i0908A09381a86032A06084a9328B63189
$$ 110019 229027 59398 229984 285518 -90908 109381 -186032 106084 -19328 263189
12730F0757P4098A9185R1636H270a4231B47992e2124j44452A85279a59895K6E4840
$$ 60757 134855 19185 110821 8270 -14231 247992 -52124 -196576 185279 -159895 -159869 54840
12717C16318A38279L3637B0611a43631O0071j79662B32213k0581g4879D96470
$$ 316318 138279 171916 20611 -143631 -83560 -263222 232213 211632 -74879 496470
12706B15827n8539L52981j91321A07664J96873J17338A78712o1898h8930F1802
$$ 215827 157288 510269 318948 107664 304537 421875 178712 116814 -88930 61802
12695C9072a03757b4831j493k9625j08447B56341F3050g4148A30869K4961M8711
$$ 39072 -103757 -24831 -26324 -55949 -164396 256341 63050 -74148 130869 155830 204541
12684B04541G6701k0803a2299C60428A7157J34558j7282J26156p9501O6585f51
$$ 204541 76701 55898 -12299 360428 17157 151715 134433 260589 181088 247673 -651
12672C3068M6296b01711A22957d42283a98853A84123K8083Q5694B8171a28415
$$ 33068 79364 -201711 122957 -442283 -198853 184123 212206 297900 28171 -128415
12661a65940A96306b0985A82216M0531J26007j53141a3773C75956a43247O8493
$$ -165940 196306 -20985 182216 222747 348754 195613 -13773 375956 -143247 -74754
12651g4754H912J47659b23014E3292g6873H977J55044a53349G4525O180P947P3720
$$ -74754 8912 156571 -223014 53292 -76873 8977 164021 -153349 74525 80705 88652 162372
12639A62372J6399g1079D808L815J47319G4640A6674K92275k5865A27231n4236
$$ 162372 178771 -71079 4808 8623 155942 74640 16674 308949 283084 127231 72995
12628G2995L9196b10892B39427G9854J52003D7511K44834F4684J18500K57971
$$ 72995 112191 -210892 239427 79854 231857 47511 292345 64684 183184 441155
12618D41155G1671A963J2594J982P0079B2544L7686K955r91Q8857i68A90089F4788
$$ 441155 71671 1963 14557 16539 86618 22544 60230 63185 62194 151051 -968 190089 64788
12604c8483j46015E7893K47344A51134l3597L42003r4170A79563C5815J23421
$$ -38483 -184498 57893 305237 151134 117537 459540 365370 179563 35815 159236
12594A59236c9949A50820b02975L6072B29861F0694a76387C72519h6600A29108
$$ 159236 -39949 150820 -202975 -166903 229861 60694 -176387 372519 -86600 129108
12583A1716c155A31675g7313c6703l1408C665g631A26241J6801C1072e29l44572
$$ 11716 -3155 131675 -77313 -36703 -68111 3665 -7631 126241 143042 31072 -529 -345101
12571c45101a53218B29478I9959O4881K24784a22902A11362M1107J15591D4137
$$ -345101 -153218 229478 99959 164840 389624 -122902 111362 152469 268060 44137
12560C11133A34392b8563l3737A08834D200J26806E5809A3367J08324C6972a4509
$$ 311133 134392 -28563 -62300 108834 4200 131006 55809 13367 121691 36972 -14509
12548D1917e4011k9297q2887A1770K24308a28917i715I710K38907c40278A29883
$$ 41917 -54011 -83308 -166195 11770 236078 -128917 -9715 9710 248617 -340278 129883
12536b3036F2715r791K49234A3547J86258C8141h7606A29269b913p6512H5408
$$ -23036 62715 52924 302158 13547 199805 38141 -87606 129269 -2913 -79425 85408
12524F5240a30170A8720f7272k3995A54269a40698r672j52497E0824b30370D4510
$$ 65240 -130170 18720 -67272 -91267 154269 -140698 -150370 -302867 50824 -230370 44510
12512C37458A5084h9872A23058b00345p7341P1348M6560A71039a06298M4195j48538
$$ 337458 15084 -89872 123058 -200345 -277686 -206338 -159778 171039 -106298 -62103 -210641
12501b10641q2279F2291R156i7007B8024g9281b3293B4652N5802k5106g0818A46786
$$ -210641 -292920 62291 71447 -97007 28024 -79281 -23293 24652 80454 55348 -70818 146786
12488A37870f2317B21946b38407Q4251A76278C2313J12031o9038R9890B5746a181
$$ 137870 -62317 221946 -238407 -154156 176278 32313 144344 75306 175196 25746 -1181
12476a16729K4806l1239A15760m6884J16135d17559J95527Q3983B38012C8832
$$ -116729 -91923 -123162 115760 68876 185011 -417559 -222032 -138049 238012 38832
12465A8464b02986G0714J58726f0640o1097C03439m0372b00354A5370J97405m4228
$$ 18464 -202986 70714 229440 -60640 -121737 303439 263067 -200354 15370 212775 168547
12454A68547K37661a99934E3217b61959J00939A74977R9547C9545K58095A37799
$$ 168547 406208 -199934 53217 -261959 -161020 174977 274524 39545 297640 137799
12443i0848k7465C93807C3529L06773a23655n0833G7341b94725i9634B6312p101
$$ -90848 -118313 393807 33529 340302 -123655 -174488 77341 -294725 -99634 26312 19211
12432A9211R0934K04404a53404C17823c26753C5683N8096K3955h3776G6501a47260
$$ 19211 110145 314549 -153404 317823 -326753 35683 93779 117734 -83776 76501 -147260
12420c36472f0071j41380j23711J53793C55765c04362K6107A75882a27981a9516
$$ -336472 -60071 -201451 -325162 -171369 355765 -304362 -278255 175882 -127981 -19516
12409A77898b4397C4191A4832J85275Q027c162h80j8651l62507a25957k44060
$$ 177898 -24397 34191 14832 200107 208134 -3162 -880 -19531 -382038 -125957 -370017
12398c70017C28148A57986C4424c64146J23245h0427A08198c13345P1984b436
$$ -370017 328148 157986 34424 -364146 -240901 -80427 108198 -313345 -241361 -2436
12387G4399M5832d4366A5250R6576j9957e1981A40990M2278b4605E9556P8996
$$ 74399 120231 -44366 15250 111826 91869 -51981 140990 183268 -24605 59556 138552
12376A38552F7015d8946l13736A40303J21791b10744R3279A49707a74863g5806
$$ 138552 67015 -48946 -362682 140303 262094 -210744 -117465 149707 -174863 -75806
12365a26580N7318b3477D6493N2267A9221L0280a43377A19981h3415b6433A71711
$$ -126580 -69262 -23477 46493 98760 19221 49501 -143377 119981 -83415 -26433 171711
12353b9058A17491N552d43348C51896j61118a0140D242h0814j45851A21275J35785
$$ -29058 117491 123043 -443348 351896 190778 -10140 4242 -80814 -226665 121275 257060
12342B57060K8480A6625b2210C43720A17902h7463c2822k99154A70790a23672
$$ 257060 285540 16625 -22210 343720 117902 -87463 -32822 -331976 170790 -123672
12331h2021p7557g7205A37627b0053j99326d2734o9596L9851C008J41837c12990
$$ -82021 -159578 -77205 137627 -20053 -219379 -42734 -112330 -72479 3008 144845 -312990
12319f7715q3281P07o4302I610f1740a698D18027b0846j96014G2434a37883D56610
$$ -67715 -150996 -150289 -214591 9610 -61740 -1698 418027 -20846 -216860 72434 -137883 456610
12306f9190k10215B88807K8753b08181A66929a10596A11673b10410i9045c5580
$$ -69190 -279405 288807 317560 -208181 166929 -110596 111673 -210410 -99045 -35580
12295a71275A982J22258a13956k3941B36322A07992K36663c7710B84842G8755
$$ -171275 1982 124240 -113956 -137897 236322 107992 344655 -37710 284842 78755
12284C25688a06301A04025a35664B83862a03914A16721E3963P1407L42417A64799
$$ 325688 -106301 104025 -135664 283862 -103914 116721 53963 125370 467787 164799
12273H2163l0272B5499g6496A54071J79088i6420C21454c4745c402A08170h3797
$$ 82163 51891 25499 -76496 154071 333159 -96420 321454 -34745 -3402 108170 -83797
12261c0036B94559B4090L9858K85116H1586J42042m1412j7205J33949a95288b4575
$$ -30036 294559 24090 63948 349064 81586 223628 182216 165011 298960 -195288 -24575
12249B00324J13489g6281m8667a739D7848a28241A37638J942k5239M1500K51047
$$ 200324 313813 -76281 -124948 -1739 47848 -128241 137638 139580 114341 155841 406888
12238D06888a5393j37824G7656h773E4646c1844k80717H2968J02175J03507k4794
$$ 406888 -15393 -153217 77656 -8773 54646 -31844 -312561 82968 185143 288650 263856
12227B63856b28629A24753K47752j84925J77839a44595F9831k7595J27505n5884
$$ 263856 -228629 124753 372505 187580 365419 -144595 69831 42236 169741 113857
12217A13857J37490B7689J61336f2214A71365J33582M0649i7338o5745j00832
$$ 113857 251347 27689 189025 -62214 171365 304947 345596 -97338 -163083 -263915
12207b63915A86597g7683a5082B8642R0532b2122B98536E1048J45521H0147e3683
$$ -263915 186597 -77683 -15082 28642 119174 -22122 298536 51048 196569 80147 -53683
12195D05519Q6087A07464a7753C47948j66273R9998A08922J38498a11770A6970
$$ 405519 491606 107464 -17753 347948 181675 281673 108922 247420 -111770 16970
12184B01312J6472L1639n3754c0884B72887K83746B7979J16824c606C54029A18582
$$ 201312 217784 249423 195669 -30884 272887 556633 27979 144803 -3606 354029 118582
12172B700h1551A16913b9395B86682K90034k42159H3638J68290j19823K34197
$$ 2700 -81551 116913 -29395 286682 576716 334557 83638 251928 132105 366302
12162C66302E5092J99053a83184q8303L5058A1375c1881B355J40612k8423K4083
$$ 366302 55092 254145 -183184 -271487 -236429 11375 -31881 2355 142967 114544 138627
12151A38627D7187K1144a1536k71307A91439a92783H0398g927k16940h2305A29062
$$ 138627 47187 68331 -11536 -282843 191439 -192783 80398 -7927 -224867 -82305 129062
12139B2369B104J81981D411a46889A01961Q3771a67271l7835B26360a1165B59081
$$ 22369 2104 184085 4411 -146889 101961 185732 -167271 -205106 226360 -11165 259081
12127I3786k6540M3706i274A37861C7798a34111j4647F8134J74249a60286E2566
$$ 93786 67246 110952 -9274 137861 37798 -134111 -148758 68134 242383 -160286 52566
12115F0500i7100J3132B30313a06470D6163f7086A27568e77589b40014C26739
$$ 60500 -97100 -83968 230313 -106470 46163 -67086 127568 -577589 -240014 326739
12104b23880E0316a59465B4742Q8795a44388D71513m1258A86082G7770P0774C5450
$$ -223880 50316 -159465 24742 113537 -144388 471513 430255 186082 77770 148544 35450
12092a53273j21969b3457H5590K7486a01206l0880j92565C21445a34817B674a34517
$$ -153273 -275242 -23457 85590 113076 -101206 -132086 -324651 321445 -134817 2674 -134517
12080c0162C33748L62238N62351O47103G78701j04055g2680p1607A761O2695N0035
$$ -30162 333748 695986 1258337 1905440 778701 674646 -72680 -144287 1761 64456 114491
12069A14491a20037A58333K8647L22776A29669k1382b7851j21938D23158j89097
$$ 114491 -120037 158333 186980 509756 129669 108287 -27851 -149789 423158 234061
12059B34061g3199E2339e9803r2465c1205r2289L5797f541q6640A02714b89038
$$ 234061 -73199 52339 -59803 -152268 -31205 -123494 -87697 -6541 -93181 102714 -289038
12047G2825G385a69261b8035j85376O5524a9272k16133B7809f4379A41130K60540
$$ 72825 7385 -169261 -28035 -213411 -147887 -19272 -235405 27809 -64379 141130 401670
12036D01670A9561P0097k1886l1127b93130k4925A58712a67043a2726p1616l3141
$$ 401670 19561 89658 67772 36645 -293130 -318055 158712 -167043 -12726 -84342 -117483
12025a17483A27706a30144B23260N9615b47976J05659A50811N6727P5768b18849
$$ -117483 127706 -130144 223260 282875 -247976 -142317 150811 207538 283306 -218849
12014B9133J06579j4041a15940p4188A36154B7136g6295l4132j31082I1867k8660
$$ 29133 135712 121671 -115940 -190128 136154 27136 -76295 -110427 -241509 91867 63207
12003F3207e6728l04039A98242c0368J3504I9233N4079L3707Q7859B548d47222
$$ 63207 -56728 -360767 198242 -30368 -16864 99233 153312 187019 274878 2548 -447222
11991B09959c78703H8125k1481M3559b79353A75252q375c11668a41033A17123
$$ 209959 -378703 88125 66644 110203 -279353 175252 166877 -311668 -141033 117123
11980C04268A12869l5144a65004j31362C17474b82910a17442j22742f8493J5003
$$ 304268 112869 77725 -165004 -296366 317474 -282910 -117442 -240184 -68493 -53490
11970e3490B18081d3677k79204B91744r3689q9851l5300J6007a11826j25649m8278
$$ -53490 218081 -43677 -322881 291744 198055 108204 72904 88911 -111826 -237475 -285753
11959b85753a16824A69635C4937E489K94095a1838k25609E9375h5819K8762j24180
$$ -285753 -116824 169635 34937 5489 299584 -11838 -237447 59375 -85819 -57057 -181237
11948a81237A08397a31912q8852C6463L5683B3407h0644b1015A13745J00573a21517
$$ -181237 108397 -131912 -220764 36463 72146 23407 -80644 -21015 113745 214318 -121517
11936A33222K8058b15137j63423B2337L1264a12222B49399a11903P643j59358
$$ 133222 161280 -215137 -378560 22337 53601 -112222 249399 -111903 -104260 -263618
11926b63618G120d755A07435J76504d260G6104d41289a10537F0997a83312F1196
$$ -263618 7120 -4755 107435 283939 -4260 76104 -441289 -110537 60997 -183312 61196
11914A55227a11061J6198A78112F8147K18805C5146L19417A1205a29919b9575
$$ 155227 -111061 -94863 178112 68147 286952 35146 354563 11205 -129919 -29575
11903B9332J27319a30328B91471G3934m727a16456p9532M121F5875b693j88425
$$ 29332 156651 -130328 291471 73934 69207 -116456 -195988 -191867 65875 -2693 -191118
11892a91118A66922b44583J08880j00421b4678p7986E1106M4256J02644I8245
$$ -191118 166922 -244583 -135703 -236124 -24678 -102664 51106 95362 198006 98245
11881b79838J319a6718b393j97181A34035b51712A59918J3372l562e6465l48170
$$ -279838 -278519 -16718 -2393 -199574 134035 -251712 159918 173290 169728 -56465 -404635
11870d04635i272C2491b38188N3248A6215a3749B82992j26545a06155a0547j97812
$$ -404635 -9272 32491 -238188 -184940 16215 -13749 282992 156447 -106155 -10547 -208359
11859b08359J00490A4534N9257b70086C20159b02248E1778M3815b9292k7979G7105
$$ -208359 -107869 14534 73791 -270086 320159 -202248 51778 95593 -29292 -57271 77105
11847h1863n5760k2572I380e0409A20905e250A80975L6406H1175A4473h7551c6547
$$ -81863 -137623 -160195 9380 -50409 120905 -5250 180975 217381 81175 14473 -87551 -36547
11834F0951a11758H4305a70878e2254k95684a5239p6064E363M0513a16314k06029
$$ 60951 -111758 84305 -170878 -52254 -347938 -15239 -91303 5363 45876 -116314 -322343
11823c22343A92488F2865g7886o178j52728C45852e1957A11177A0866a90867B9633
$$ -322343 192488 62865 -77886 -84064 -236792 345852 -51957 111177 10866 -190867 29633
11811G8989J11156b13820P0619p5807f0294F2263a09588k5424n455K9841l1680
$$ 78989 190145 -213820 -143201 -219008 -60294 62263 -109588 -135012 -140467 -110626 -142306
11800a42306B13282c5112m8874O362o755o5748j97107N6009B46725c67070E8479
$$ -142306 213282 -35112 -83986 -77624 -84379 -150127 -347234 -291225 246725 -367070 58479
11788h8176j40137P9003A89235I2857l2714a16750c1284E8827f7703B9101J72313
$$ -88176 -228313 -149310 189235 92857 60143 -116750 -31284 58827 -67703 29101 201414
11777B01414H578b23121E8398J40798F148d9527j35498D9953a49895G8351b31689
$$ 201414 8578 -223121 58398 199196 6148 -49527 -185025 49953 -149895 78351 -231689
11765b8151C63b43117B99460j24563q09J63058i7298A25876c15558A38311a28398
$$ -28151 363 -243117 299460 174897 174088 337146 -97298 125876 -315558 138311 -128398
11753A69700E7676c4417j99004G3832H497K1004f2709D68L91J20815a28197A60768
$$ 169700 57676 -34417 -233421 73832 8497 29501 -62709 468 859 121674 -128197 160768
11740a18175A02861a67593A76887o8603g9591A55921g7782L159j5563A89152c0604
$$ -118175 102861 -167593 176887 108284 -79591 155921 -77782 -74623 -90186 189152 -30604
11728b00482l7610N4669Q7993B8135a67767Q959q873M7974L5282j85947A60857
$$ -200482 -238092 -183423 -95430 28135 -167767 -158808 -167681 -119707 -84425 -270372 160857
11716a75912H1086K72116K0149a50753r435r9728J12048C75221e2734r8566A35297
$$ -175912 81086 353202 373351 -150753 -160188 -259916 -147868 375221 -52734 -151300 135297
11704I6475J32603k2006a07367A91549f1819A87254p0944b4970A74877d7053j3725
$$ 96475 229078 207072 -107367 191549 -61819 187254 116310 -24970 174877 -47053 -60778
11693f0778l4180J9884F4904j6040J8247j2074g1302C71072e7309A21676m3410
$$ -60778 -94958 -75074 64904 48864 67111 55037 -71302 371072 -57309 121676 78266
11682G8266J35271c01473J03620C44087b43904f2818I6826K69700D9450K61888
$$ 78266 213537 -301473 -197853 344087 -243904 -62818 96826 366526 49450 311338
11672C11338a16816k52247J25880C16375b53847a00490a4948B41604b50408C35333
$$ 311338 -116816 -369063 -243183 316375 -253847 -100490 -14948 241604 -250408 335333
11661A59251D9521b01648g9204B12725E1709E62K138R1449L22717j20058B6397
$$ 159251 49521 -201648 -79204 212725 51709 562 2700 94149 416866 296808 26397
11649C25036A55525b19168L2111K7993B33467b03045R1621A80963h9335F4173
$$ 325036 155525 -219168 -187057 -159064 233467 -203045 -111424 180963 -89335 64173
11638a86164j586A20457B5534a87445a706l5511e719A42147f2357A96130a6211
$$ -186164 -187750 120457 25534 -187445 -1706 -37217 -5719 142147 -62357 196130 -16211
11626C00302e076F6004A8262J43381F9024N1424J18729C4275K05987a4165k38865
$$ 300302 -5076 66004 18262 161643 69024 120448 239177 34275 240262 -14165 -253030
11615b53030E4202J70591a72692D66226G0385J29943l1230A7523a44283A91600
$$ -253030 54202 224793 -172692 466226 70385 200328 169098 17523 -144283 191600
11604A88644a8530q9851A5469a07868A8778O8284m2239c04851A98030a05256I1648
$$ 188644 -18530 -108381 15469 -107868 18778 87062 44823 -304851 198030 -105256 91648
11592A83228D314e6891F6131J58745L50165B25399K14329K4081A38199J07383
$$ 183228 4314 -56891 66131 224876 575041 225399 439728 463809 138199 245582
11582B45582I7156d04434B01505m3602D41N26483D5094J78759R653a0982B27261
$$ 245582 97156 -404434 201505 157903 441 526924 45094 223853 233506 -10982 227261
11570B0340L41376j03036A05415J25245a23649B15741A07476B4365b51664A44857
$$ 20340 361716 258680 105415 230660 -123649 215741 107476 24365 -251664 144857
11559i5490B00233o7480h7494A17564j7240m4592b02075i1327A7533K07817I390
$$ -95490 200233 132753 -87494 117564 100324 55732 -202075 -91327 17533 225350 9390
11547c7474E7754A4474d7059B07623J08779G2993L08063a08273D8132J34238p7068
$$ -37474 57754 14474 -47059 207623 316402 72993 381056 -108273 48132 182370 105302
11536A05302i6368A9150c5759D71715j56427A9814J53470A8452J4567c88248A91631
$$ 105302 -96368 19150 -35759 471715 315288 19814 173284 18452 33019 -388248 191631
11524d1604J3038r3018A38247K7354c15661C17474A48735B8342J84464G3037K23531
$$ -41604 -28566 -121584 138247 165601 -315661 317474 148735 28342 212806 73037 296568
11513B96568B3440J78069J81316E501L99421A33426h3153I4370J63305i0340B70974
$$ 296568 23440 201509 382825 5501 404922 133426 -83153 94370 257675 -90340 270974
11501B16564D5747J06149k5859G47K75713A06268J22222A2136g4920J9051D2415
$$ 216564 45747 151896 126037 747 276460 106268 228490 12136 -74920 -55869 42415
11489I3765l5j2458C5026N392J61619d3554I66L52930A76537F2665L79074E4667
$$ 93765 93730 81272 35026 40418 202037 -43554 966 353896 176537 62665 441739 54667
11476B12639n8110A933h9132B32989G6356J16333K02162A83474K1336l4070c4816
$$ 212639 154529 1933 -89132 232989 76356 192689 394851 183474 204810 170740 -34816
11464c1710A84861a86425L1138G2142J37414O9012D6691J18310J03271a00655
$$ -31710 184861 -186425 -155287 72142 209556 278568 46691 165001 268272 -100655
11453B64123G8746K58238n3332p9766d0091H0880J32109g8946A92236k8196a5679
$$ 264123 78746 336984 283652 203886 -40091 80880 212989 -78946 192236 164040 -15679
11441a04028A16865K3374l1506a96502O5293B49932A10741r74k366a92265B98186
$$ -104028 116865 140239 108733 -196502 -131209 249932 110741 109767 107401 -192265 298186
11429a61513j38942A62181p1792k6052a11044j48932m4087C8376e9118q5738e0543
$$ -161513 -300455 162181 90389 64337 -111044 -259976 -304063 38376 -59118 -144856 -50543
11417a24358L7157A57121J391j9857c0026n1614F0287b6298A37352C1137b52784
$$ -124358 -87201 157121 158512 138655 -30026 -81640 60287 -26298 137352 31137 -252784
11405a00027C40351B4856Q6237a6321A27183Q5350J34508B0819K31647c3477B12840
$$ -100027 340351 24856 111093 -16321 127183 212533 347041 20819 252466 -33477 212840
11393H3995J64859b2362k5554q2205o94k42372a763l3581B40447J3487b32589
$$ 83995 248854 -22362 -47916 -130121 -130815 -373187 -1763 -35344 240447 253934 -232589
11381a49058A25712R1921j05895r651A0744R4472g0173K541C5608e1487n4164
$$ -149058 125712 217633 111738 102087 10744 105216 -70173 -67632 35608 -51487 -105651
11370a05651o634J297h407m7339K994o8065A2225e67322I7620A0100J8267J32027
$$ -105651 -112285 -110988 -8407 -55746 -52752 -120817 12225 -567322 97620 10100 28367 160394
11358A60394j6517a25626L766j72653J6158J09214A51696k6403j8509a57711g2819
$$ 160394 143877 -125626 -121860 -294513 -278355 -169141 151696 125293 106784 -157711 -72819
11346A35797i1108j20519A01343J36901B4629J57843Q5140A6896m971a6804l04782
$$ 135797 -91108 -211627 101343 238244 24629 182472 267612 16896 11925 -16804 -321586
11335c21586J42760B8854J4090E500J06133i644F7051C2931b37920N1026A51296
$$ -321586 -178826 28854 42944 5500 111633 -9644 67051 32931 -237920 -186894 151296
11323I5527a38633j5053B33798g881C37952f8233B66145C2002b30576C42633d8358
$$ 95527 -138633 -153686 233798 -7881 337952 -68233 266145 32002 -230576 342633 -48358
11311B4268c3531I9039j7796L20293A12338L4694a1164B47654a95386E8930b10346
$$ 24268 -33531 99039 81243 401536 112338 147032 -11164 247654 -195386 58930 -210346
11299B69621l9962O39L2226C9005K81150g9375m6218k57707H5387k140a37792
$$ 269621 229659 230298 262524 39005 320155 -79375 -125593 -383300 85387 83247 -137792
11287B60130b03403D0564b31828B06434b27294j69028a29996j95666J5103G404
$$ 260130 -203403 40564 -231828 206434 -227294 -396322 -129996 -325662 -310559 7404
11276b1316H3585a36280f2237m4133H7717g4299A6932J92251g2062G8168a69851
$$ -21316 83585 -136280 -62237 -106370 87717 -74299 16932 209183 -72062 78168 -169851
11264A4781b20717a8935j13131f0965I5403J07113r8034B2174a34391j6392I0063
$$ 14781 -220717 -18935 -132066 -60965 95403 202516 104482 22174 -134391 -150783 90063
11252H3831K79820a55308K4238B15889r9414C7915a00331l53881a38556E7242
$$ 83831 363651 -155308 -131070 215889 116475 37915 -100331 -454212 -138556 57242
11241i8371A44467d3399B01059F0907d11357g3606k27962A66376b37414O0011
$$ -98371 144467 -43399 201059 60907 -411357 -73606 -301568 166376 -237414 -177403
11231a77403q3712B45091G7990b80601I44J3004b56965a5457q6913H5058c4662
$$ -177403 -261115 245091 77990 -280601 944 13948 -256965 -15457 -102370 85058 -34662
11219b53458B35104a5112B5481a0070j06209n2916j27081J25009A47697K1974
$$ -253458 235104 -15112 25481 -10070 -116279 -169195 -296276 -171267 147697 169671
11209A69671b319A49932A5818b18472j6336C99088j31469F5038B3887a7762E0514
$$ 169671 -2319 149932 15818 -218472 -234808 399088 267619 65038 23887 -17762 50514
11197b36264A67245E1732J67803c68544B06947b5277A74235J15090M9041b76731
$$ -236264 167245 51732 219535 -368544 206947 -25277 174235 289325 338366 -276731
11186b01321k60090a9262B0826K5132a62626b1260k93594A01506o95h607H6985
$$ -201321 -461411 -19262 20826 45958 -162626 -21260 -314854 101506 100811 -8607 86985
11174A62853L1196D7726b92883Q2672A86976o9119l6811R8931B3896h465D9329
$$ 162853 194049 47726 -292883 -210211 186976 117857 81046 179977 23896 -8465 49329
11162B37988B7952d25882d0210A87619F4830b93631O3027Q9404B59094a96410
$$ 237988 27952 -425882 -40210 187619 64830 -293631 -230604 -141200 259094 -196410
11151g3123G6953Q1838a85330l5209A17992c54211a53587a8165m7239j29812A68994
$$ -73123 76953 158791 -185330 -220539 117992 -354211 -153587 -18165 -65404 -195216 168994
11139A88960a30162P911B1550J8122d38635a17265K7100D48209A58687Q0434a02624
$$ 188960 -130162 -122251 21550 39672 -438635 -117265 -90165 448209 158687 239121 -102624
11127b08262P20k7841g4160B5282d9496C03760a60683B27354H718N9689b21697
$$ -208262 -207542 -235383 -74160 25282 -49496 303760 -160683 227354 8718 68407 -221697
11115D95933H8154P0426P6053a03605I7947b8907g736B80585m1836G7703N7279
$$ 495933 88154 158580 234633 -103605 97947 -28907 -7736 280585 238749 77703 134982
11104A34982E8602b60413D42946A39731J19161a41183A20494E5178J30571q2370
$$ 134982 58602 -260413 442946 139731 258892 -141183 120494 55178 185749 103379
11094A03379K13393a8800q5622C83525b9219B32791q6603j9201L49110j91077
$$ 103379 316772 -18800 -104422 383525 -29219 232791 146188 126987 476097 285020
11084B85020G7726C0895J7232K75376l8647K44367E0064M83655B40287n2083D8928
$$ 285020 77726 30895 48127 323503 284856 529223 50064 533719 240287 188204 48928
11072A16022L45681K5133A69423m4365L9535L26071A77761J09687J84865r0761
$$ 116022 461703 486836 169423 125058 164593 490664 177761 287448 472313 381552
11062C81552K38992p5531k0010J05165m885K43473k97637j0986K37187J9757j91731
$$ 381552 620544 545013 525003 630168 625283 868756 571119 560133 797320 817077 625346
11051F25346K88774k66693K24533n5325Q5250j25577l9524l48136M44301r7961
$$ 625346 914120 647427 871960 816635 901885 776308 736784 388648 832949 734988
11041G34988m2176l13350M72346j59028p1312J70491j00567o3860K74528m17455
$$ 734988 692812 379462 851808 692780 621468 791959 691392 627532 902060 484605
11031D84605P2943L39549k45020m8866k7133J92671n8460j4316L44527k09482
$$ 484605 557548 897097 652077 603211 576078 768749 710289 695973 1040500 831018
11021H31018j56632k7729k9051J57695C26838J71329R5633J35339j37229m6005
$$ 831018 674386 646657 617606 775301 326838 498167 593800 729139 591910 545905
11011E45905j7121L2856j02320P8451n689j50992J81842J02162N3137l7499N1139
$$ 545905 528784 561640 459320 537771 532082 381090 562932 665094 718231 680732 731871
11000G31871J23747Q5400j86243j27176L5998k63258J97845j32986N39892o34
$$ 731871 855618 941018 754775 627599 663597 400339 598184 465198 1005090 1004456
10990A004456k24315l676j326l01108L63621O1648J3243K62931J03837J8758k28471
$$ 1004456 780141 776465 775139 474031 837652 899300 912543 1175474 1279311 1298069 1069598
10979A069598K36894r491K19287J79830j4181M78723N30462j58984K38716k26155
$$ 1069598 1306492 1297001 1516288 1696118 1681937 2160660 2691122 2532138 2770854 2544699
10969B544699L74742l15681q6379n3543j21182m46318n9359r915j2386j33633
$$ 2544699 2919441 2603760 2517381 2463838 2342656 1896338 1836979 1827064 1814678 1681045
10959A681045m7068l35586M24528p1732L79768k23930l27536j76343R109l28838
$$ 1681045 1633977 1298391 1722919 1651187 2030955 1807025 1479489 1303146 1312255 983417
10949I83417k16143j98071K36261k24949p7721k14601R5713J64398j69838o9015
$$ 983417 767274 569203 805464 580515 502794 288193 383906 548304 378466 309451
10939C09451j26173n9750A4278K33760c7394A03480j0202e50A49669J8259i2756
$$ 309451 183278 123528 14278 248038 -37394 103480 93278 -550 149669 167928 -92756
10927a52614e8903A13634J753a54155F6883a0509A93690J4149b80534H8805a94078
$$ -152614 -58903 113634 115387 -154155 66883 -10509 193690 207839 -280534 88805 -194078
10915a65009g0777A43692A7917m894g3544K2899P227A1548j984b28981R1587A27776
$$ -165009 -70777 143692 17917 13023 -73544 -50645 -43418 11548 9564 -228981 -137394 127776
10902A18350a65192E965J05086i8294r5084B18276M1648j10470l9417a37712A82654
$$ 118350 -165192 5965 111051 -98294 -193378 218276 259924 149454 110037 -137712 182654
10890a71520A40062J159O5809B4492a33686d5348E2523j6900b07012F5928a874
$$ -171520 140062 141221 207030 24492 -133686 -45348 52523 35623 -207012 65928 -1874
10878a48037M5879d2655j77050F5708L0917b09493A84483H8247l9638A4664a68833
$$ -148037 -102158 -42655 -219705 65708 96625 -209493 184483 88247 48609 14664 -168833
10866D6947J01110p0975d08073e665k89328R7019H1928b2122J0657A18731i6424
$$ 46947 148057 77082 -408073 -5665 -294993 -197974 81928 -22122 -11465 118731 -96424
10854a38046F2368a20897H0531a01404c8824f933A42515a3845D0141c57200F2377
$$ -138046 62368 -120897 80531 -101404 -38824 -6933 142515 -13845 40141 -357200 62377
10842b1080I4205M5939i3862A55312a1658B7643h4047G5520N1594a02576B43966
$$ -21080 94205 140144 -93862 155312 -11658 27643 -84047 75520 127114 -102576 243966
10830a9152j55321A75513f475o5164B31000a23434N1897j9007m9401A25611f7160
$$ -19152 -174473 175513 -6475 -71639 231000 -123434 -71537 -90544 -139945 125611 -67160
10818B01708g4588a1320H2627b98478E9090P9519l6426b37637a6852j71080j38033
$$ 201708 -74588 -11320 82627 -298478 59090 138609 102183 -237637 -16852 -187932 -325965
10807c25965C0044J14053a5062q8194B92335c1835i126n8238j2860E00537a92497
$$ -325965 30044 144097 -15062 -103256 292335 -31835 -9126 -67364 -80224 500537 -192497
10795c55372A70236a17905l5898c6542I354a05886b4770m1989N683A22297a7584
$$ -355372 170236 -117905 -153803 -36542 9354 -105886 -24770 -66759 -61076 122297 -17584
10783E5471J45708d90587h4813d0185A41364b935q6267r1332d9762j33983A15175
$$ 55471 201179 -490587 -84813 -40185 141364 -2935 -89202 -180534 -49762 -183745 115175
10771A94284D2556L04201c093G1121c2836l08810C5858c0244A3229b85540J10172
$$ 194284 42556 346757 -3093 71121 -32836 -341646 35858 -30244 13229 -285540 -175368
10760a75368C48037A66064a67408f7778M54A62302J60221d67402h3296n6870a7974
$$ -175368 348037 166064 -167408 -67778 -67324 162302 322523 -467402 -83296 -140166 -17974
10748g9193H8350N3381B9297a16667p9235d2509m5920j46823g1991G5871a26950
$$ -79193 88350 141731 29297 -116667 -195902 -42509 -88429 -235252 -71991 75871 -126950
10736c28121C42453B1639K1297b02612i8029c6336j82130J4988G5610b84283A34197
$$ -328121 342453 21639 42936 -202612 -98029 -36336 -218466 -203478 75610 -284283 134197
10724b15119g70k43692J16965d3269a0430m3792j8453A01266J47912b91624D3273
$$ -215119 -770 -244462 -127497 -43269 -10430 -54222 -72675 101266 249178 -291624 43273
10712f0694j0261I9299a43962b2187d516j46549I6206e8655p9957B36876c8185
$$ -60694 -70955 99299 -143962 -22187 -4516 -151065 96206 -58655 -138612 236876 -38185
10700c1206J0453p4292C5514a2126A13745c23399J08098A51683J44712J870e0857
$$ -31206 -20753 -95045 35514 -12126 113745 -323399 -215301 151683 296395 298265 -50857
10688b00564J294j13395J42774A08643a91419J0206L7466K3113M9396l88478C6909
$$ -200564 -199270 -312665 -169891 108643 -191419 -181213 -143747 -120634 -71238 -459716 36909
10676F3849a92990M1126I4394h7210m02559E01594a02747H6011J8890a31926A85771
$$ 63849 -192990 -151864 94394 -87210 -489769 501594 -102747 86011 104901 -131926 185771
10664a48475A49635a03943A50504A9466M9531J13408a70315d3902C0561a64058
$$ -148475 149635 -103943 150504 19466 68997 182405 -170315 -43902 30561 -164058
10653a96895f015B88320F1629e6463n5830d523j70236k2822j23386a36426j94645
$$ -196895 -6015 288320 61629 -56463 -112293 -4523 -174759 -197581 -320967 -136426 -331071
10642c31071C04425c3447A0463h9147h969r119r81j74133L9071A1983J14985b17638
$$ -331071 304425 -33447 10463 -89147 -8969 -18088 -19069 -193202 -154131 11983 126968 -217638
10629B42836a14548j91892j3103A18782i3387A15935L0109a1990j19407B16837
$$ 242836 -114548 -306440 -319543 118782 -93387 115935 146044 -11990 -131397 216837
10618B8143a67028J210O7329j12818e7571C5323g173q1106A77923F6002B2308
$$ 28143 -167028 -165818 -98489 -211307 -57571 35323 -7173 -88279 177923 66002 22308
10606c80123J15957I7188c6419E9342J08562a34268A09595d46661D1563d3897
$$ -380123 -264166 97188 -36419 59342 167904 -134268 109595 -446661 41563 -43897
10595h9782G9499B4616C18b71437Q3565A92727F8878c8157j31175C23462h2146
$$ -89782 79499 24616 318 -271437 -187872 192727 68878 -38157 -169332 323462 -82146
10583a18064b0129k19778C1974b42985E708a27822k36950J1239a22339B04244
$$ -118064 -20129 -239907 31974 -242985 5708 -127822 -364772 -353533 -122339 204244
10572b51701a13994m0318K4492k27896A41110a29848j9783N7281j46928a6013
$$ -251701 -113994 -154312 -129820 -357716 141110 -129848 -149631 -92350 -239278 -16013
10561B16051n9474f3599G2868g5731e505A07894b95793B37436F4778J49451A05959
$$ 216051 156577 -63599 72868 -75731 -5505 107894 -295793 237436 64778 214229 105959
10549g8484A8148l811P5280b66646J15111B66664p2074a5071l7708j54814G4351
$$ -78484 18148 14337 89617 -266646 -151535 266664 194590 -15071 -52779 -207593 74351
10537b9444l04389a63189k09049H6683f8329L1761F8945J15441a14772B52192
$$ -29444 -333833 -163189 -372238 86683 -68329 -36568 68945 184386 -114772 252192
10526B33747c623j20117j52077e5865A06812a31249d1188j05114d1334A880b68392
$$ 233747 -3623 -123740 -275817 -55865 106812 -131249 -41188 -146302 -41334 1880 -268392
10514E308K2038P2148b2011o4935A71365g5791B35573j08566b03298B7180O2084
$$ 5308 27346 99494 -22011 -86946 171365 -75791 235573 127007 -203298 27180 89264
10503H9264A7608R2956C5995c5016l2111j27707e2155k8689j76651F2912f3620
$$ 89264 17608 110564 35995 -35016 -67127 -194834 -52155 -80844 -257495 62912 -63620
10491d26556B75957a87816B63624i162l2486A84022C6388J3492a05603E8322K62277
$$ -426556 275957 -187816 263624 -9162 -41648 184022 36388 49880 -105603 58322 320599
10480C20599k7763R7579A93263R4008a0656d780B91095b11625N3608l6054B95828
$$ 320599 292836 390415 193263 287271 -10656 -4780 291095 -211625 -158017 -194071 295828
10468d2355o3980o2356D2583i346A49901C8494j0772O4011J15815a6910j55037
$$ -42355 -106335 -168691 42583 -9346 149901 38494 27722 91733 207548 -16910 -171947
10457a71947p1879I7456a4391a293m00935L1352B25a31888F2634K89a6665A27554
$$ -171947 -243826 97456 -14391 -1293 -402228 -370876 225 -131888 62634 62923 -16665 127554
10444a70558P5297j08349C19493K0847a22595A0708b40240J1521J05543E5042
$$ -170558 -95261 -203610 319493 340340 -122595 10708 -240240 -228719 -123176 55042
10433B0644M8722a32445A80372c022C44836A70373b8908D3188L6497a03210A31010
$$ 20644 69366 -132445 180372 -3022 344836 170373 -28908 43188 79685 -103210 131010
10421F5747b64748a24498k08255A61201b17635o1610A78949a6330b620G0618a20845
$$ 65747 -264748 -124498 -332753 161201 -217635 -279245 178949 -16330 -2620 70618 -120845
10409b68637P2922k9867c2458J5016F4523L93714H8149c29900J61245A92629G0052
$$ -268637 -195715 -225582 -32458 -17442 64523 458237 88149 -329900 -168655 192629 70052
10397B8592c28923A90657O279a45641E3032K40488g0700j02462C57701F68J29288
$$ 28592 -328923 190657 196936 -145641 53032 293520 -70700 -173162 357701 668 129956
10386A29956F3578J76854K37714c45798a17367B76320A6708K87045g0273C27223
$$ 129956 63578 240432 478146 -345798 -117367 276320 16708 303753 -70273 327223
10375B54405j18253K98701k8419j041E939M65718J3695P6465A61994M14266p4770
$$ 254405 136152 434853 406434 405393 5939 471657 485352 561817 161994 576260 501490
10364E01490A97121J13226K1277b1815C1075L32743A05150L6367M0971d2876D710
$$ 501490 197121 310347 331624 -21815 31075 363818 105150 141517 182488 -42876 4710
10352D15256k9763M0090k6957K69562j21823j59835C7504L93127N085B604N46880
$$ 415256 385493 425583 398626 668188 546365 386530 37504 430631 435716 2604 549484
10341E49484k51129J20219A86977a12198C75538A56968B504e7198q5048H4057
$$ 549484 298355 418574 186977 -112198 375538 156968 2504 -57198 -142246 84057
10330B53970P325j16315J09817b0523k1293A531P2755A3546M9694L90034A7426
$$ 253970 261295 144980 254797 -20523 -41816 1531 74286 13546 63240 453274 17426
10318b6464C47238b52250B32117l1077a9036G8889j918j0407b04145B20232g4560
$$ -26464 347238 -252250 232117 201040 -19036 78889 76971 66564 -204145 220232 -74560
10306A2253e2632q1920e4067D0831K81436j09311a76687f2828A47010b48849h3447
$$ 12253 -52632 -134552 -54067 40831 322267 212956 -176687 -62828 147010 -248849 -83447
10294G3895P8149J06259i3837B4428K02371E9744a41127E9349O0732b66166K1387
$$ 73895 152044 258303 -93837 24428 226799 59744 -141127 59349 120081 -266166 -244779
10283b44779A42884m9315c08358c919q0747A29148J25754B7051a5024A76803F2978
$$ -244779 142884 93569 -308358 -3919 -84666 129148 254902 27051 -15024 176803 62978
10271I5034C7492J07964l4965C0305a45598B35978b19541a01323I2093b49094
$$ 95034 37492 145456 110491 30305 -145598 235978 -219541 -101323 92093 -249094
10260a98832c8880C51775A51947K23900b759C84669J30232F9966a47193E6017
$$ -198832 -38880 351775 151947 375847 -2759 384669 514901 69966 -147193 56017
10249c99789J33450j8112a0446G9999O2023o3217I560N6989L19755b01566c5952
$$ -399789 -266339 -284451 -10446 79999 142022 78805 9560 66549 386304 -201566 -35952
10237A08128n0900b85829I6873K64348E1832b03495M7782b0713I9718m8232i0488
$$ 108128 57228 -285829 96873 361221 51832 -203495 -155713 -20713 99718 51486 -90488
10225B0063M9206h8514m75167B13475a41189l60163a65732d8250j33967C00530
$$ 20063 69269 -88514 -563681 213475 -141189 -501352 -165732 -48250 -182217 300530
10214a51591j2894j84384B7198d45714a4091l261j97023j6931J12481j99214h1987
$$ -151591 -164485 -348869 27198 -445714 -14091 -17352 -214375 -231306 -118825 -318039 -81987
10202C14724G5177K71084C8492c94333a54942p7970G2878b8148j32755b6052k25353
$$ 314724 75177 346261 38492 -394333 -154942 -232912 72878 -28148 -160903 -26052 -251405
10191b51405a03148j43807H6954a11341k22582A96630d42049J17832G0410c10136
$$ -251405 -103148 -246955 86954 -111341 -333923 196630 -442049 -324217 70410 -310136
10180B99137a89078B2131a07252d7998k15088i8430j55078a10239L9824l5931
$$ 299137 -189078 22131 -107252 -47998 -263086 -98430 -253508 -110239 -70415 -106346
10170a06346M601K3526l2625j65706A63545a3121k50468a7610G1102a43709O5175
$$ -106346 -101745 -78219 -110844 -276550 163545 -13121 -263589 -17610 71102 -143709 -78534
10159g8534j87871C3562c01400Q3364e4287p2749o0182j48619B11303e0042m1031
$$ -78534 -266405 33562 -301400 -218036 -54287 -127036 -187218 -335837 211303 -50042 -91073
10148i1073A32419f4134C0634g9101j64868B6263e0013A06742a73660d9834K025
$$ -91073 132419 -64134 30634 -79101 -243969 26263 -50013 106742 -173660 -49834 -47809
10137d7809C4948h6527I0351J14132A9199b7649I7074R5274b68101d7724A21963
$$ -47809 34948 -86527 90351 204483 19199 -27649 97074 192348 -268101 -47724 121963
10125d82056D2274l533b78793A13500k5638c80860J44438a7870C39887D7001a70864
$$ -482056 42274 38741 -278793 113500 87862 -380860 -236422 -17870 339887 47001 -170864
10113B16241A6146K9481N7371a15601L5914C06284b62619A50225d7421l43384
$$ 216241 16146 45627 102998 -115601 -79687 306284 -262619 150225 -47421 -390805
10103c90805e9193N506B26575d15403a06595A02523J32003D7121e3024j29247
$$ -390805 -59193 -53687 226575 -415403 -106595 102523 234526 47121 -53024 -182271
10093a82271g5404k64737C81613A03117h5732G9512K3298d1637r1298c2953j86155
$$ -182271 -75404 -340141 381613 103117 -85732 79512 102810 -41637 -132935 -32953 -219108
10082b19108b8013k19968a07565k45824A12103D5861k1694J89581p8295a66040
$$ -219108 -28013 -247981 -107565 -353389 112103 45861 24167 213748 135453 -166040
10071f4731H3780a11252A33726a44444q0699M070B7198c25180H9660J5387d3139
$$ -64731 83780 -111252 133726 -144444 -225143 -221073 27198 -325180 89660 105047 -43139
10059c80221A42608a56717J4143p4717b5657j98379l00308h6592c844A65004a79895
$$ -380221 142608 -156717 -142574 -217291 -25657 -224036 -524344 -86592 -3844 165004 -179895
10047B41063g9226L3326l26252e6460j6540j75050B06285B7680a0940H2557K1440
$$ 241063 -79226 -45900 -372152 -56460 -73000 -248050 206285 27680 -10940 82557 103997
10036A03997a51292i435l3586B4280c08149a24277B6587J94867b70576K4929f9094
$$ 103997 -151292 -9435 -43021 24280 -308149 -124277 26587 221454 -270576 -245647 -69094
10024a44044b5881r7377D7461b89751b115j39575P0397k88719A43345n0744e16260
$$ -144044 -25881 -123258 47461 -289751 -2115 -141690 -71293 -360012 143345 92601 -516260
10012A94741b01724A13846a02906j22362a02533C30683j21107g0600j9833I8930
$$ 194741 -201724 113846 -102906 -225268 -102533 330683 209576 -70600 -90433 98930
10001a08806j10234A33494d9490B45636q5622C1326c70246R5205a29008F5398
$$ -108806 -219040 133494 -49490 245636 160014 31326 -370246 -275041 -129008 65398
9990d13735a20483D6268P1932a20746j525d0927A55989b19457A74985a88834d9523
$$ -413735 -120483 46268 118200 -120746 -122271 -40927 155989 -219457 174985 -188834 -49523
9978C4106a70378n5394n5997C72726a27755e27A3825b03080M2187O5982L9826
$$ 34106 -170378 -225772 -281769 372726 -127755 -527 13825 -203080 -160893 -94911 -55085
9967e5085j50376d5006B76594b86966A20965b00110H0999c81859g6018r2268k46269
$$ -55085 -205461 -45006 276594 -286966 120965 -200110 80999 -381859 -76018 -168286 -414555
9956d14555a77353J8180A30418l5349d13455a65776f0528B9633c01821a41344
$$ -414555 -177353 -159173 130418 95069 -413455 -165776 -60528 29633 -301821 -141344
9945i7579L9946A21156b51942h4099j11975G0659a21614c6126k16608d3298I6380
$$ -97579 -57633 121156 -251942 -84099 -196074 70659 -121614 -36126 -252734 -43298 96380
9933a08969C58474A6340a14093d4298E7290a67583M4392r321m0259A28460b21040
$$ -108969 358474 16340 -114093 -44298 57290 -167583 -123191 -132512 -172771 128460 -221040
9921A08977k3919b8413A6988L11024a36093O2952F3504a75965j05332g7474H2810
$$ 108977 85058 -28413 16988 328012 -136093 -73141 63504 -175965 -281297 -77474 82810
9909a47156B09508N98b9141C2363J05111B5210A1310J71050c3897k97075E237
$$ -147156 209508 210106 -29141 32363 137474 25210 11310 182360 -33897 -330972 5237
9897b59870A42858M29068A00540b17433j61611E8519a37674C02810n6335a18920
$$ -259870 142858 571926 100540 -217433 -379044 58519 -137674 302810 246475 -118920
9886a06453A19395d3596j82456e3745A12668H866b00894P9498B32942a45522j00778
$$ -106453 119395 -43596 -226052 -53745 112668 8866 -200894 -121396 232942 -145522 -246300
9875b46300J10575l69201B39766i7222D7112b23760J02396r9562J5529h2943b4611
$$ -246300 -135725 -504926 239766 -97222 47112 -223760 -121364 -220926 -205397 -82943 -24611
9863B01189a41966F4576J37694a69099n8477J7452p2847g3776D7785J93564c20305
$$ 201189 -141966 64576 202270 -169099 -227576 -210124 -282971 -73776 47785 241349 -320305
9851a43529N415M1273j46620B48179b10174l7091d5534k11603A55592i259p1527
$$ -143529 -138114 -96841 -243461 248179 -210174 -247265 -45534 -257137 155592 -9259 -80786
9840h0786m5103A67518L5295g0412k42858a14113j17534A01643b52071g9533r7358
$$ -80786 -125889 167518 202813 -70412 -313270 -114113 -231647 101643 -252071 -79533 -176891
9829a76891G6664e4225D5431b10411m8765C16997d97644D333J70683c22042P5217
$$ -176891 76664 -54225 45431 -210411 -259176 316997 -497644 4333 175016 -322042 -246825
9818b46825Q6393A9524c01618L2349J19378j10267O454f2758c0457o8501j9955
$$ -246825 -160432 19524 -301618 -269269 -149891 -260158 -253704 -62758 -30457 -98958 -118913
9807a18913o7430d2074o7201j61216E9673C381i6617K474n7635g575A10052b08278
$$ -118913 -186343 -42074 -109275 -270491 59673 3381 -96617 -94143 -151778 -7575 110052 -208278
9794A04380b73186a03137A48123a4691A03251b31805i5760k72922J70893j85415
$$ 104380 -273186 -103137 148123 -14691 103251 -231805 -95760 -368682 -197789 -383204
9784c83204f7441b9112C5646a94275k042f3402j57673c4549A01508j9768c24225
$$ -383204 -67441 -29112 35646 -194275 -196317 -63402 -221075 -34549 101508 81740 -324225
9772D7546H013O1152a50477q5720o9804R0464d9254q8236j06719g7834b6497j83977
$$ 47546 8013 69165 -150477 -236197 -306001 -215537 -49254 -137490 -244209 -77834 -26497 -210474
9760b10474o1287J35450H449e19800N7080D7705d8390j98896m0308O0238q9616
$$ -210474 -271761 -136311 8449 -519800 -462720 47705 -48390 -247286 -287594 -227356 -316972
9749c16972D1810J69423j01025K93422j93304K539r1204n477b71954h1840j01839
$$ -316972 41810 211233 110208 403630 210326 212865 121661 116184 -271954 -81840 -183679
9738a83679b0296I095b62216J15773A88103O4247b6839B21025i3999p5347j38227
$$ -183679 -20296 9095 -262216 -146443 188103 252350 -26839 221025 -93999 -169346 -307573
9727c07573B18525b32325f605E4498d1501j34364j24713A27378a44561E0133K7420
$$ -307573 218525 -232325 -6605 54498 -41501 -175865 -300578 127378 -144561 50133 77553
9716G7553O0955L62553a02838o2815P8051C92365H3178D1122a79631B5576a89825
$$ 77553 138508 501061 -102838 -165653 -87602 392365 83178 41122 -179631 25576 -189825
9704a01811e0064C7846j7202d18943a67109k03920F4222a3807j40770A84443a95352
$$ -101811 -50064 37846 20644 -418943 -167109 -371029 64222 -13807 -154577 184443 -195352
9692a72680n5406E7456O0913L4587c028k3131j21693B3394a00067d4840Q155E4875
$$ -172680 -228086 57456 118369 152956 -3028 -26159 -147852 23394 -100067 -44840 -36685 54875
9679A15898a31145A49515J196d42227B799N5084b05555c6283j09968G6921N0254
$$ 115898 -131145 149515 150711 -442227 2799 57883 -205555 -36283 -146251 76921 127175
9668A27175g7964C3353K12960c77718J8171A77996A9888J072d4703C30936a77445
$$ 127175 -77964 33353 246313 -377718 -359547 177996 19888 20960 -44703 330936 -177445
9656C8M09920a64900B7925d73421J32378f254l72218A27179n9040b89936J34135
$$ 38 409958 -164900 27925 -473421 -341043 -6254 -378472 127179 68139 -289936 -155801
9645a55801P727B01881J5791e6885l51298B93645A4162b84313B5478f4274j79300
$$ -155801 -148074 201881 217672 -56885 -408183 293645 14162 -284313 25478 -64274 -243574
9634b43574d3684A30021J11968c73844c4472p3221A45214b57738j88231B10173
$$ -243574 -43684 130021 241989 -373844 -34472 -107693 145214 -257738 -445969 210173
9623c98478a31519j08702b3791o3802C6622a61521A50757B6716R7771L328a62408
$$ -398478 -131519 -240221 -23791 -87593 36622 -161521 150757 26716 124487 127815 -162408
9611a98686b4009k52054C0828d4449j2005A19680i2621B0553K28795A05874j7224
$$ -198686 -24009 -276063 30828 -44449 -56454 119680 -92621 20553 249348 105874 88650
9600H8650b78062Q6109O8966B4661b66608A29111f1399A42092K1483b37830e6850
$$ 88650 -278062 -191953 -122987 24661 -266608 129111 -61399 142092 163575 -237830 -56850
9588c86816D65840E8490a41536C8079K34501j04408C1860b90806a22104E3073
$$ -386816 465840 58490 -141536 38079 272580 168172 31860 -290806 -122104 53073
9577i9799k85455E0120O4840a03781A988h2682A24737b16546F6156J04827A6635
$$ -99799 -385254 50120 114960 -103781 1988 -82682 124737 -216546 66156 170983 16635
9565a72824A58271a93824l9661A69720k0642d2632k65209C45254A4980c51469
$$ -172824 158271 -193824 -233485 169720 149078 -42632 -307841 345254 14980 -351469
9554c66710a49742n8972B27425a84672k22008g9793B5275K16885a48427M1465
$$ -366710 -149742 -208714 227425 -184672 -406680 -79793 25275 242160 -148427 -106962
9544a06962K8308j18817A19781g1968j10070C9898L31903a66545F0275K11939
$$ -106962 -78654 -197471 119781 -71968 -182038 39898 371801 -166545 60275 272214
9534B72214a70276n839j33336R892B76693b39742e1542C64415a23973E891Q4923
$$ 272214 -170276 -176115 -309451 -299559 276693 -239742 -51542 364415 -123973 5891 90814
9523I0814b12150F3375k3119a40878F6876p742b41049Q3426A3850e6349H1640
$$ 90814 -212150 63375 40256 -140878 66876 59134 -241049 -157623 13850 -56349 81640
9511B607K37523c45444k7958a30162j50378A261J62601a50487A23813b34192R4796
$$ 2607 240130 -345444 -373402 -130162 -280540 1261 163862 -150487 123813 -234192 -139396
9500a39396e5297k58558J21985i0327q0923j5407b8376k14103O7359p3029h3929
$$ -139396 -55297 -313855 -191870 -90327 -171250 -186657 -28376 -242479 -175120 -248149 -83929
9488a05492A34517g325A43538B8356J6601c6717q4467j77685J02444A51750a1309
$$ -105492 134517 -7325 143538 28356 44957 -36717 -121184 -298869 -196425 151750 -11309
9476a60623q4761A39753a00736k90357B30126F0955a45356c191l20272M0407O6060
$$ -160623 -245384 139753 -100736 -391093 230126 60955 -145356 -3191 -323463 -283056 -216996
9465b16996C44700c57252J66931k9169n4697a36440q9270M0783d7946j71194A08191
$$ -216996 344700 -357252 -190321 -219490 -274187 -136440 -225710 -184927 -47946 -219140 108191
9453C92207a57753p6907L5171Q5484k8631O8630j34755L8915A74496e608G9527
$$ 392207 -157753 -234660 -199489 -114005 -142636 -74006 -208761 -169846 174496 -5608 79527
9441i3045A04030l12e1509m868A50587b75447A49883c86378j23099J89494A54129
$$ -93045 104030 103718 -51509 -56377 150587 -275447 149883 -386378 -509477 -319983 154129
9429c39505k6060A44297a79467l44305a98423n8777N8335A83383a31284J0409
$$ -339505 -365565 144297 -179467 -523772 -198423 -257200 -198865 183383 -131284 -120875
9419a20875B63324b95988E8005o818b18871D6206L7881a04382A59362a34027B6514
$$ -120875 263324 -295988 58005 51187 -218871 46206 84087 -104382 159362 -134027 26514
9407b70842m2646Q6178N4219N0612A72521J1283b36306A17094P523J4623d41350
$$ -270842 -313488 -227310 -173091 -122479 172521 183804 -236306 117094 124617 139240 -441350
9395c75621J79985A05366r702a53805B71621i3559n2950d8294k68666B99916D5846
$$ -375621 -195636 105366 95664 -153805 271621 -93559 -146509 -48294 -316960 299916 45846
9383a62676F5815d3164A28197a90228G494c5571j04659e3574k06532n7870N9900
$$ -162676 65815 -43164 128197 -190228 7494 -35571 -140230 -53574 -260106 -317976 -258076
9372b58076J28446F7565b4743J1767k91607n700K4059c8431I9673L6418c30229
$$ -258076 -129630 67565 -24743 -12976 -304583 -310283 -286224 -38431 99673 136091 -330229
9360A7804a4115j40441A33278a20633F5253e3770r4925k1160L281k5034G2544
$$ 17804 -14115 -154556 133278 -120633 65253 -53770 -148695 -169855 -166574 -191608 72544
9348h0404A83852b74440A58963b21487A02500p385P7125d32237d4252l19577H5822
$$ -80404 183852 -274440 158963 -221487 102500 95115 172240 -432237 -44252 -363829 85822
9336A5027c64948B9888g9045j32184B21372b54381h0641j48049M153f6156B35207
$$ 15027 -364948 29888 -79045 -211229 221372 -254381 -80641 -228690 -224537 -66156 235207
9324E6621g824k31980k09827a62915K1601O7942A40478j657d2437j51146H5109
$$ 56621 -7824 -239804 -449631 -162915 -141314 -73372 140478 138821 -42437 -193583 85109
9312a42597A1359Q3734J08925b92899E654J79636b35147A11616r431a79916a184
$$ -142597 11359 95093 204018 -292899 5654 185290 -235147 111616 102185 -179916 -1184
9300d713j43439B847J25775k8833h4101G4636a92946a5042r5154l8092e7888l9425
$$ -4713 -148152 2847 128622 99789 -84101 74636 -192946 -15042 -110196 -148288 -57888 -97313
9288i7313j44088O0951f3383B44410c7274B11009j4614a36293D9784b3919B2654
$$ -97313 -241401 -180450 -63383 244410 -37274 211009 196395 -136293 49784 -23919 22654
9276c18506M0361m0109B3119d5871l57590A19237b19796P7477p4623N7417A3303
$$ -318506 -278145 -318254 23119 -45871 -403461 119237 -219796 -142319 -216942 -159525 13303
9264a65940F8075P1970B0485N7945b05919c603I7387a58990j59781a17420G5227
$$ -165940 68075 140045 20485 78430 -205919 -3603 97387 -158990 -318771 -117420 75227
9252b81551N1247H8814e7295l85392A35022K5292B9659b05319i0327A26530n4855
$$ -281551 -230304 88814 -57295 -442687 135022 160314 29659 -205319 -90327 126530 71675
9241G1675K09203e9434A54521n5088i1236C90448A26780a64449O8040j50228O1531
$$ 71675 280878 -59434 154521 99433 -91236 390448 126780 -164449 -96409 -246637 -185106
9230a85106N5872A36520c47309B7745a90503k57074A8082a50292B27333f5287
$$ -185106 -129234 136520 -347309 27745 -190503 -447577 18082 -150292 227333 -65287
9219a35350n6415f5730J2428D1493P261a41757l4916A06685a80428j75820c0489
$$ -135350 -191765 -65730 -53302 41493 48754 -141757 -176673 106685 -180428 -356248 -30489
9207b95057f2126o4974o8601A53935h5537l95l60775F2378c17714F1267f6354
$$ -295057 -62126 -127100 -195701 153935 -85537 -85932 -446707 62378 -317714 61267 -66354
9195a72551L0250B5482Q8174k6844J23294c4148j22535j80988J28762B12197a96714
$$ -172551 -142301 25482 113656 86812 210106 -34148 -156683 -337671 -208909 212197 -196714
9183d06106I4819l4104e5833j52586E4499O894d4532k30216H0824k2224a93847
$$ -406106 94819 60715 -55833 -208419 54499 61393 -44532 -274748 80824 58600 -193847
9171a53040r5155j83626I5278B49g9394m5179B33068H8933a22520C34137a69260
$$ -153040 -248195 -431821 95278 249 -79394 -124573 233068 88933 -122520 334137 -169260
9159g3989j58163g0199D2305b04118L7669j409l04874a23736e4720j08988E4047
$$ -73989 -232152 -70199 42305 -204118 -166449 -167858 -472732 -123736 -54720 -163708 54047
9147G3930b61101N2370n8006c0944A0938J3073e72096E8099h0862L4232B58182
$$ 73930 -261101 -208731 -266737 -30944 10938 24011 -572096 58099 -80862 -46630 258182
9135f03935a87948A02850a88690d9382B28121b85271a09142L334j21367h2222
$$ -603935 -187948 102850 -188690 -49382 228121 -285271 -109142 -105808 -227175 -82222
9124A01211c81350Q2751a13589A79229d5162C9172R8304C8657a63371d5739j1277
$$ 101211 -381350 -298599 -113589 179229 -45162 39172 137476 38657 -163371 -45739 -57016
9113e7016j67724o9039f3183L0103J6441j77253C0335O2265b07669A9045e5947
$$ -57016 -224740 -293779 -63183 -33080 -16639 -193892 30335 92600 -207669 19045 -55947
9101a57942j0347c5554C23755a88652B03849m0067o8864L7866C6767Q0457d38089
$$ -157942 -168289 -35554 323755 -188652 203849 163782 94918 132784 36767 117224 -438089
9089A28549a7194A09826b89458a30473E0884J90012E1763a64838A11476c25302
$$ 128549 -17194 109826 -289458 -130473 50884 240896 51763 -164838 111476 -325302
9078A22364a59398A46482E711O1643g1202j95857e7200k58634J10183b3120A49888
$$ 122364 -159398 146482 5711 67354 -71202 -267059 -57200 -315834 -205651 -23120 149888
9066A77325c0694A22899J26913B689a62531f1436l53004a68997A0297a43947p9825
$$ 177325 -30694 122899 249812 2689 -162531 -61436 -414440 -168997 10297 -143947 -223772
9055b23772B43173A6590b58910e8479A25703e3031A57473b0246q9095a9580l43335
$$ -223772 243173 16590 -258910 -58479 125703 -53031 157473 -20246 -109341 -19580 -362915
9044c62915A370J97963f8006c2705B63415A25886a71755j68341j26892C5003b6711
$$ -362915 1370 199333 -68006 -32705 263415 125886 -171755 -340096 -466988 35003 -26711
9032a99234J267Q8596o2971b2304G1553k0304b64050n0028C61650a9966H3285
$$ -199234 -197967 -109371 -172342 -22304 71553 51249 -264050 -314078 361650 -19966 83285
9020D9803e8231I6602a75871j8733K6946A04029f2287o8440B06492a99281B31061
$$ 49803 -58231 96602 -175871 -194604 -167658 104029 -62287 -130727 206492 -199281 231061
9008a8493m0291k13281i054k00660B73480c53520k05043b4373D046a88115J4617
$$ -18493 -58784 -272065 -9054 -209714 273480 -353520 -558563 -24373 4046 -188115 -173498
8997a73498K2456f2791k02375L8183A5623g2531r6022L4046j44784a26694B2509
$$ -173498 -151042 -62791 -265166 -226983 15623 -72531 -168553 -134507 -279291 -126694 22509
8985G3972g025C7368a59769m59794b1983m1514F5280b12547A39680b739j53321
$$ 73972 -7025 37368 -159769 -619563 -21983 -63497 65280 -212547 139680 -2739 -156060
8974a56060l0172Q4073A40971i1756m5270L3558E6805b9914j9543k13573B1461
$$ -156060 -186232 -102159 140971 -91756 -137026 -103468 56805 -29914 -49457 -263030 21461
8962g0262I3781b85846F2661J56204d29683d8514p1647K1613A30875d6775j9703
$$ -70262 93781 -285846 62661 218865 -429683 -48514 -120161 -98548 130875 -46775 -66478
8951f6478j09028j10441B96641f7934A44229b24816R3115A38863E1736Q8522D5782
$$ -66478 -175506 -285947 296641 -67934 144229 -224816 -131701 138863 51736 140258 45782
8939e7153C0539b458p013k02654C05806J96353F0190R8129K37142g7209A58504
$$ -57153 30539 -2458 -9471 -212125 305806 502159 60190 158319 395461 -77209 158504
8927B03358G0366K24553J21388P71457J362880N934117P311071p284884A982182
$$ 203358 70366 294919 416307 1187764 2550644 8484761 15795832 8510948 1982182
8917H30208k69864J9207A20623l2940B9015L9824e5605B42448K71505A86634J64958
$$ 830208 560344 579551 120623 87683 29015 68839 -55605 242448 513953 186634 351592
8906C51592E3758g9697e194k39554A02329f5913l9022d9251E5032a09381A34229
$$ 351592 53758 -79697 -5194 -244748 102329 -65913 -104935 -49251 55032 -109381 134229
8894i3949l72290j9186i3412j86097J05848Q0907R631D4442R1241o7193a65234
$$ -93949 -466239 -485425 -93412 -279509 -173661 -92754 -83123 44442 135683 68490 -165234
8882a06979A4487K92738E4889n140K02936b66490p6085a55421k308q9172O0005
$$ -106979 14487 307225 54889 49749 252685 -266490 -342575 -155421 -157729 -246901 -186896
8871a86896C32538a98919o1702H1006a04745C66473b27225B9146a32967A8949
$$ -186896 332538 -198919 -260621 81006 -104745 366473 -227225 29146 -132967 18949
8860e86367a43558H6147J9680j8387e9866k50252B4480a27795B7624b50096B70454
$$ -586367 -143558 86147 105827 87440 -59866 -310118 24480 -127795 27624 -250096 270454
8848a4093k49304k22087a69804f7212j1021k39412B41167c00695B41911b66911
$$ -14093 -263397 -485484 -169804 -67212 -78233 -317645 241167 -300695 241911 -266911
$$ [...]
##END NTUPLES=NMR SPECTRUM
##END=
