
##TITLE=UV1270_M13_1250-1169_5_7414377_yad8vE2ShB
##JCAMPDX= 6.0         $$ Bruker NMR JCAMP-DX V2.0
##DATA TYPE= NMR SPECTRUM
##DATA CLASS= NTUPLES
##ORIGIN= BRUKER
##OWNER= Administrator
$$ 1.72 TOPSPIN		Version 2.1
$$ 2013-01-26 01:44:18.481 -0500  Administrator@X
$$ Compression mode = diff/dup
##.OBSERVE FREQUENCY= 400.02188249412
##.OBSERVE NUCLEUS= ^1H
##.ACQUISITION MODE= SIMULTANEOUS (DQD)
##.ACQUISITION SCHEME= undefined
##.AVERAGES= 64
##.DIGITISER RES= 22
##SPECTROMETER/DATA SYSTEM= spect
##.PULSE SEQUENCE= noesygpps1d.comp
##.SOLVENT NAME= COFFEE_meoh
##.SHIFT REFERENCE= INTERNAL, COFFEE_meoh, 1, 14.96127
##AUDIT TRAIL= $$ (NUMBER, WHEN, WHO, WHERE, PROCESS, VERSION, WHAT)
$$ ##TITLE= Audit trail, TOPSPIN		Version 2.1
$$ ##JCAMPDX= 5.01
$$ ##ORIGIN= Bruker BioSpin GmbH
$$ ##OWNER= Administrator
$$ $$ E:\/data/COFFEE/nmr/UV1270_M13_1250-1169_5_7414377_yad8vE2ShB/12/pdata/1/auditp.txt
$$ ##AUDIT TRAIL=  $$ (NUMBER, WHEN, WHO, WHERE, PROCESS, VERSION, WHAT)
(   1,<2013-01-26 01:44:12.590 -0500>,<Administrator>,<X>,<go>,<TOPSPIN 2.1>,
      <created by zg
	started at 2013-01-26 01:32:43.090 -0500,
	POWCHK enabled, PULCHK disabled,
       configuration hash MD5:
       86 BA 57 50 F2 9D 5C 9B 26 00 A9 28 5F 66 2E 89
       data hash MD5: 64K
       63 EE 7F 0F B2 D6 68 AF 50 2C 40 1B E8 64 8B C7>)
(   2,<2013-01-26 01:44:15.684 -0500>,<Administrator>,<X>,<proc1d>,<TOPSPIN 2.1>,
      <Start of raw data processing
       efp LB = 0.3 FT_mod = 6 PKNL = 1 PHC0 = 0 PHC1 = 0 SI = 128K 
       data hash MD5: 128K
       38 94 7A 15 AD 79 8B 75 F7 07 16 CD A1 0D 8F 34>)
(   3,<2013-01-26 01:44:16.762 -0500>,<Administrator>,<X>,<proc1d>,<TOPSPIN 2.1>,
      <pk PHC0 = -79.7937 PHC1 = 0 
       data hash MD5: 128K
       AD 9F AE C9 29 1B 3C 83 C1 63 6F 55 BB 82 72 21>)
(   4,<2013-01-26 01:44:17.387 -0500>,<Administrator>,<X>,<proc1d>,<TOPSPIN 2.1>,
      <abs ABSG = 1 
       data hash MD5: 128K
       E0 D2 66 6D DB 77 E5 31 B5 B1 9F 13 C8 0C 3C B8>)
(   5,<2013-01-26 01:44:17.559 -0500>,<Administrator>,<X>,<proc1d>,<TOPSPIN 2.1>,
      <abs ABSG = 2 
       data hash MD5: 128K
       7E 8B 07 AA C5 C7 0C CD 61 03 DF E3 7D 95 ED C4>)
(   6,<2013-01-26 01:44:17.746 -0500>,<Administrator>,<X>,<proc1d>,<TOPSPIN 2.1>,
      <abs ABSG = 3 
       data hash MD5: 128K
       CF 8D EE 0B 01 A0 78 52 1B 61 21 91 1D EE CF 51>)
(   7,<2013-01-26 01:44:17.934 -0500>,<Administrator>,<X>,<proc1d>,<TOPSPIN 2.1>,
      <abs ABSG = 4 
       data hash MD5: 128K
       16 8C 95 B1 2A 73 C4 A8 2E D4 BF 2F 8E D9 F1 84>)
(   8,<2013-01-26 01:44:18.137 -0500>,<Administrator>,<X>,<proc1d>,<TOPSPIN 2.1>,
      <abs ABSG = 5 
       data hash MD5: 128K
       B5 B3 8A DE AD 81 41 B0 5B 80 04 F9 07 6A B2 C8>)
$$ ##END=
$$ 
$$ $$ hash MD5
$$ $$ A5 76 6D 48 FE 80 31 61 CC 26 35 F9 0F 19 C6 D0
##$RELAX= 
##$RELAX= 
##$RELAX= 
##$RELAX= 
##$RELAX= 
##$RELAX= 
##$RELAX= 
##$RELAX= 
$$ Bruker specific parameters
$$ --------------------------
##$DU= <E:\>
##$EXPNO= 12
$$ [...]
##$TP07= 0
##$TPNAME0= <>
##$TPNAME1= <>
##$TPNAME2= <>
##$TPNAME3= <>
##$TPNAME4= <>
##$TPNAME5= <>
##$TPNAME6= <>
##$TPNAME7= <>
##$TPOAL= (0..7)
0.5 0.5 0.5 0.5 0.5 0.5 0.5 0.5
##$TPOFFS= (0..7)
0 0 0 0 0 0 0 0
##$TUNHIN= 0
##$TUNHOUT= 0
##$TUNXOUT= 0
##$USERA1= <user>
##$USERA2= <user>
##$USERA3= <user>
##$USERA4= <user>
##$USERA5= <user>
##$V9= 5
##$VALIST= <valist>
##$VCLIST= <CCCCCCCCCCCCCCC>
##$VD= 0
##$VDLIST= <DDDDDDDDDDDDDDD>
##$VPLIST= <PPPPPPPPPPPPPPP>
##$VTLIST= <TTTTTTTTTTTTTTT>
##$WBST= 2048
##$WBSW= 25
##$XGAIN= (0..3)
0 0 0 0
##$XL= 0
##$YL= 0
##$YMAX_a= 6064390
##$YMIN_a= -13485443
##$ZGOPTNS= <>
##$ZL1= 120
##$ZL2= 120
##$ZL3= 120
##$ZL4= 120
##$ABSF1= 14.96127
##$ABSF2= -5.596911
##$ABSG= 5
##$ABSL= 3
##$ALPHA= 0
##$AQORDER= 0
##$ASSFAC= 0
##$ASSFACI= 0
##$ASSFACX= 0
##$ASSWID= 0
##$AUNMP= <proc_prof1d_extract.lims>
##$AXLEFT= 0
##$AXNAME= <>
##$AXNUC= <1H>
##$AXRIGHT= 0
##$AXTYPE= 0
##$AXUNIT= <>
##$AZFE= 0.1
##$AZFW= 0.1
##$BCFW= 0
##$BC_mod= 0
##$BYTORDP= 0
##$COROFFS= 0
##$CY= 15
##$DATMOD= 1
##$DC= 0
##$DFILT= <>
##$DTYPP= 0
##$F1P= 0
##$F2P= 0
##$FCOR= 0.5
##$FTSIZE= 131072
##$FT_mod= 6
##$GAMMA= 0
##$GB= 0
##$INTBC= 1
##$INTSCL= 1
##$ISEN= 128
##$LB= 0.3
##$LEV0= 0
##$LPBIN= 0
##$MAXI= 10000
##$MC2= 0
##$MEAN= 0
##$ME_mod= 0
##$MI= 0
##$NCOEF= 0
##$NC_proc= -2
##$NLEV= 6
##$NOISF1= 0
##$NOISF2= 0
##$NSP= 0
##$NTH_PI= 0
##$NZP= 0
##$OFFSET= 14.96127
##$PC= 1
##$PHC0= -79.7937
##$PHC1= 0
##$PH_mod= 1
##$PKNL= yes
##$PPARMOD= 0
##$PPDIAG= 0
##$PPIPTYP= 0
##$PPMPNUM= 2147483647
##$PPRESOL= 1
##$PSCAL= 4
##$PSIGN= 0
##$PYNMP= <proc.py>
##$REVERSE= no
##$SF= 400.020009528897
##$SI= 131072
##$SIGF1= 0
##$SIGF2= 0
##$SINO= 400
##$SIOLD= 131072
##$SPECTYP= <>
##$SREGLST= <1H.CDCl3>
##$SSB= 0
##$STSI= 131072
##$STSR= 0
##$SW_p= 8223.68421052631
##$SYMM= 0
##$S_DEV= 0
##$TDeff= 65536
##$TDoff= 0
##$TI= <>
##$TILT= no
##$TM1= 0
##$TM2= 0
##$TOPLEV= 0
##$USERP1= <user>
##$USERP2= <user>
##$USERP3= <user>
##$USERP4= <user>
##$USERP5= <user>
##$WDW= 1
##$XDIM= 131072
##$YMAX_p= 427419932
##$YMIN_p= -12770
##$CURPLOT= <Network HP LaserJet P1505>
##$CURPRIN= <$Network HP LaserJet P1505>
##$DFORMAT= <normdp>
##$LAYOUT= <+/1D_H.xwp>
##$LFORMAT= <normlp>
##$PFORMAT= <normpl>
##$SURQMSG= 1
$$ End of Bruker specific parameters
$$ ---------------------------------
##NTUPLES= NMR SPECTRUM
##VAR_NAME=  FREQUENCY,     SPECTRUM/REAL,   SPECTRUM/IMAG
##SYMBOL=    X,             R,               I
##VAR_TYPE=  INDEPENDENT,   DEPENDENT,       DEPENDENT
##VAR_FORM=  AFFN,          ASDF,            ASDF
##VAR_DIM=   131072,        131072,          131072
##UNITS=     HZ,            ARBITRARY UNITS, ARBITRARY UNITS
##FACTOR=    0.0627417313425164, 1,          1
##FIRST=     8223.62146879497, 4061,         -61987
##LAST=      0,             4963,            -61503
##MIN=       0,             -12770,          0
##MAX=       8223.62146879497, 427419932,    0
$$ Real data points
##PAGE= N=1
##DATA TABLE= (X++(R..R)), XYDATA
$$ [...]
65186 141994 142423 143280 144276 145247 146231 147000 147080 146440 145775 145815 146494 147016 146712 145742 145040 145545 147296 149244 150200
65167 150200 150029 149661 149839 150294 150459 150607 151679 154037 156924 159311 160888 162055 163222 164451 165660 167000
65151 167000 169018 172422 177527 183932 190953 198413 206756 216274 226608 237230 248097 259416 270996
65138 270996 282290 293077 303576 313730 322847 330303 336354 341778 346722 350331 351728 351116 349535
65125 349535 347591 344814 340474 334759 328742 323174 317610 310914 302439 292592 282369 272550 263295 254327
65111 254327 245415 236610 228022 219513 210918 202587 195330 189582 184859 180405 176184 172762 170195 167568
65097 167568 164008 159846 156361 154369 153481 152862 152345 152407 153162 153964 154209 154149 154476 155337 156242 156903 157564 158364
65079 158364 158979 159176 159297 159760 160434 160959 161362 161900 162522 163055 163733 164845 165917 165970 164836 163608 163443 164371
65061 164371 165637 166715 167498 167757 167099 165571 163932 163078 163278 163956 164207 163573 162410 161468 161096 160946 160497
65044 160497 159700 158995 158784 158997 159123 158586 157170 155137 152897 150613 148209 145665 143089 140566 138240 136516
65028 136516 135799 135879 135968 135552 134950 134764 135080 135578 136174 137083 138329 139566 140517 141297 142245 143617 145446 147525
65010 147525 149525 151335 153281 155751 158579 161099 162908 164343 165988 167876 169418 170086 169990 169719 169770 170164
64994 170164 170598 170900 171278 172130 173613 175484 177355 179043 180607 182113 183494 184640 185495 186016 186131 185861
64978 185861 185398 184908 184257 183128 181467 179681 178257 177258 176242 174632 172154 169049 165966 163477 161618
64963 161618 159999 158382 156955 155880 154917 153781 152661 151997 151837 151767 151448 150866 150088 149207 148575 148674 149585
64946 149585 150860 152072 153139 153992 154267 153667 152438 151219 150538 150597 151355 152566 153815 154734 155187 155207 154844
64929 154844 154150 153223 152183 151148 150172 149115 147686 145819 143920 142478 141485 140643 140086 140430 141950 144097
64913 144097 146050 147448 148469 149555 151208 153688 156663 159467 161865 164250 167039 170336 174397 179677
64899 179677 185990 192180 197318 201858 207020 213282 220082 226709 232780 237962 241985 245041 247631 249893
64885 249893 251421 251735 250581 247864 243814 239107 234348 229525 224522 220011 217012 215389 213626 210557
64871 210557 206757 203745 202210 201595 201097 200467 199783 198952 197703 195900 193711 191442 189241 187022 184671
64856 184671 182195 179571 176635 173354 170130 167525 165702 164375 163292 162507 162127 162059 162076 162015 161908 161997 162487
64839 162487 163117 163219 162499 161592 161400 161974 162506 162382 161774 161139 160677 160417 160415 160626 160958 161625 163142 165752 169110
64820 169110 172651 176046 179247 182502 186415 191552 197757 204171 210158 215909 221877 227898 233157 236872
64806 236872 238858 239548 239563 239064 237570 234670 230790 226777 222717 217844 211875 205774 200775 197130 194268
64791 194268 191749 189510 187536 185888 184890 184766 185194 185691 186258 187243 188669 190138 191332 192201 192753 193140
64775 193140 193980 196151 200047 205183 210564 215375 219478 223444 227979 233129 238211 242686 246837 251269
64761 251269 256007 260507 264389 267820 271346 275630 281066 287153 292509 296081 298193 299808 300939 300507
64747 300507 297758 293033 286992 279859 271792 263321 254925 246599 238345 230762 224680 220381 217503 215510
64733 215510 213991 212781 212144 212636 214429 216889 219082 220573 221484 222098 222837 224432 227495 231773 236187
64718 236187 239770 242369 244437 246477 248778 251299 253574 254848 254556 252670 249529 245523 241045 236521
64704 236521 232151 227667 222599 216867 210942 205338 200185 195463 191470 188728 187406 187069 187049 186914 186540
64689 186540 186000 185567 185637 186398 187658 189157 191011 193673 197493 202425 208092 214011 219841 225618 231627
64674 231627 237868 243773 248723 252653 255820 258101 259043 258568 257028 254440 250308 244613 238445 233078 228758
64659 228758 224998 221743 219461 218127 216977 215602 214651 214967 216388 217936 219025 220021 221634 224167 227440
64644 227440 231208 235521 240823 247699 256375 266344 276546 286008 294302 301453 307499 312257 315506 317384
64630 317384 318486 319433 320284 320465 319314 316634 312752 308232 303616 299196 294859 290318 285624 281283 277649
64615 277649 274500 271577 269291 268350 268648 269047 268422 266539 263828 260805 257983 255810 254180 252288 249404
64600 249404 245648 241659 237708 233566 229133 224716 220746 217613 215757 215466 216450 217968 219498 221159 223425
64585 223425 226692 231043 236139 241324 246147 250777 255647 260720 265458 269463 272682 274946 275832 275233 273621
64570 273621 271476 268761 265270 261161 256787 252206 247216 241785 236213 230894 226077 221770 217790 214028
64556 214028 210715 208212 206433 204773 202766 200630 199001 198350 198740 199850 201019 201574 201431 201169 201364 202094
64540 202094 203283 205050 207309 209378 210560 210998 211424 212112 212536 212099 210774 208903 206725 204325 201890
64525 201890 199866 198855 199241 200735 202387 203350 203636 203958 204823 205996 206904 207393 207956 209239 211372 213944
64509 213944 216648 219702 223326 227108 230509 233972 238710 245056 251746 257371 261923 266297 270777 274808
64495 274808 277804 279308 278645 275501 270840 266333 262693 259324 255702 252244 249588 247805 246691 246144 245884
64480 245884 245417 244588 243642 242480 240556 237841 235126 232868 230510 227565 224701 222929 222255 221989 222019 222874
64464 222874 224738 227252 230165 233380 236427 238749 240446 241904 242645 241586 238766 235882 234536 234579 234769
64449 234769 234467 233999 233816 234157 235345 237598 240480 243209 245695 248734 252952 258043 263373 268934 275209
64434 275209 282327 289857 297518 305781 315636 327954 343095 360954 381396 404803 432228 464800
64422 464800 502988 546752 596482 653348 718377 791394 871096 955831 1043779 1132515 1219049
64411 1219049 1300556 1374899 1440506 1496238 1541517 1576143 1599620 1610868 1608828 1593184 1564393
64400 1564393 1523328 1471181 1409443 1339568 1262664 1179744 1092311 1002591 913405 827905 749051
64389 749051 678711 617069 563081 515588 474029 438296 408266 383491 363133 346200 332012
64378 332012 320384 311142 303583 296790 290467 285041 280728 276855 272444 267311 262242 258068 254786 251674
64364 251674 248064 243889 239578 235635 232413 230194 229258 229653 230906 232190 232944 233274 233704 234631 236187 238507
64348 238507 241738 245578 249042 251049 251289 250349 248981 247439 245546 243148 240324 237314 234397 231768 229409
64333 229409 227168 225098 223606 223112 223674 225066 227145 229971 233593 237797 242021 245527 247906 249517 251101
64318 251101 252774 253765 253488 252479 251671 251048 249720 247286 244309 241289 237941 233906 229551 225502 221776
64303 221776 217877 213525 208868 204191 199809 196129 193497 192042 191807 192747 194394 195859 196608 197017 197869
64288 197869 199512 201871 204912 208572 212465 216284 220364 225222 230564 235452 239590 243818 248990 254860
64274 254860 260501 265431 269818 273710 276579 277806 277457 276378 275511 275142 274910 274502 274143 274277 274950 275763
64258 275763 276244 275969 274492 271608 267668 263248 258488 253166 247429 241930 237084 232668 228406 224496 221214
64243 221214 218456 216120 214530 213908 213660 212931 211812 211326 212033 213214 213786 213583 213384 213945 215358 217137
64227 217137 218588 219197 219057 218824 219018 219432 219507 219092 218406 217378 215664 213431 211471 210223 209252 208137 207307
64210 207307 207333 207812 207805 207266 207149 208037 209514 211044 212621 214167 215141 215391 215752 217092 219241 221642 224611
64193 224611 229022 235004 241929 249625 258552 268553 278428 287229 295220 302920 309809 314640 316662 315894
64179 315894 312550 306939 299868 292402 285001 277361 269233 261001 253236 246082 239370 233118 227534 222681
64165 222681 218488 215132 213004 212106 211679 210744 209062 207383 206730 207568 209634 212328 215085 217556 219677
64150 219677 221603 223534 225648 228186 231295 234598 237137 238132 237714 236658 235572 234697 234302 234581 235011 234479
64134 234479 232488 229911 228094 227462 227420 227411 227514 227936 228475 228791 229023 229890 232159 236052 241077 246395 251489
64117 251489 256488 261831 267686 273859 280251 287098 294559 302203 309179 314904 319454 323225 326416 329002
64103 329002 331179 333596 336986 341589 347025 352701 358208 363349 367960 371868 374946 377081 378126 378019
64089 378019 376958 375268 373019 369941 365881 361204 356534 352093 347567 342657 337499 332345 327132 321737
64075 321737 316512 312165 308954 306335 303601 300662 298059 296353 295668 295623 295502 294580 292586 289959 287604
64060 287604 286377 286673 288248 290324 292098 293450 295127 298109 302847 309079 316116 323187 329859 336524
64046 336524 344259 353801 364716 375878 386770 397870 409792 422390 434846 446371 456671 465867
64034 465867 474041 480750 485030 486123 484162 479954 474172 467111 459172 451116 443622 436923 430966 425603
64020 425603 420413 414658 407836 400165 392318 384725 377273 369577 361430 353110 345391 339085 334394 330764
64006 330764 327517 324535 322243 321014 320723 320815 320750 320454 320357 320903 322072 323517 325135 327191 329872 332962
63990 332962 336128 339321 342812 347035 352403 358955 366090 373046 379804 387194 395937 405962 416920 428870
63976 428870 442000 456008 470342 484889 499854 515081 530033 544509 558845 573329 587899
63965 587899 602584 617745 633687 650463 668459 688876 713212 742340 776417 815608 860625
63954 860625 912587 972711 1042284 1122742 1215585 1322209 1443863 1581597 1736077 1907360
63944 1907360 2094938 2298007 2515570 2746117 2987177 3235299 3486503 3736723 3981795
63935 3981795 4217098 4437250 4636248 4808224 4948481 5054010 5123021 5154139 5146374 5099807
63925 5099807 5015881 4896845 4745307 4564678 4359748 4136283 3900004 3656128 3409642 3165407
63915 3165407 2927760 2700197 2485348 2284900 2099523 1929302 1774491 1635533 1512150
63906 1512150 1402834 1305751 1220105 1146169 1083886 1031706 986960 947207 911177 878707 850075
63895 850075 825348 803938 784570 765830 747001 728409 710804 694448 678965 664069 650134
63884 650134 637868 627590 619113 612310 607593 605683 606966 611179 617750 626377 637199 650374 665734
63871 665734 683093 702758 725276 750505 777268 804255 831092 858253 886044 914076 941670
63860 941670 968378 993895 1017668 1038844 1056595 1070414 1080158 1085881 1087734 1085993 1080992 1072772 1060844
63847 1060844 1044654 1024413 1001165 975840 948574 919235 888220 856198 823348 789522 755135
63836 755135 721233 688604 657382 627663 599781 573641 548477 523846 500397 479020 459618
63825 459618 441404 424182 408547 394840 382639 371427 361133 351787 343210 335335 328408 322527
63813 322527 317352 312566 308229 304417 300947 297861 295701 294693 293984 292366 289578 286292 282975 279582
63799 279582 276270 273484 271022 267911 263777 259698 257033 255822 254957 253584 251640 249311 246814 244720
63785 244720 243666 243463 243008 241412 238922 236554 235124 234721 234800 234540 233414 231690 230257 229788 230159 230706
63769 230706 230896 230735 230690 231187 232031 232419 231787 230519 229439 228742 227991 227084 226515 226503 226545 226241 225941 226121 226596
63750 226596 226942 227316 228252 229849 231714 233567 235461 237479 239668 242113 244656 246746 248011 248876 250103
63735 250103 251852 253682 255413 257360 259733 262346 265020 267755 270409 272790 275265 278725 283582 289153
63721 289153 294368 298834 302947 307183 311521 315410 318141 319412 319553 318981 317464 314397 309976 305568 302494
63706 302494 300769 299441 297940 296590 295875 295738 295745 295674 295809 296759 298966 302201 305594 308382 310672 313226
63690 313226 316465 319938 322933 325310 327369 329005 329512 328483 326579 324953 324034 323320 322356 321371 320762 320471
63674 320471 320301 320420 320988 321628 321898 322196 323448 325823 328395 330221 331178 331480 331012 329559 327230 324241
63658 324241 320649 316727 313163 310328 307629 304208 300164 296500 293880 291991 290232 288524 287228 286594
63644 286594 286507 286619 286650 286766 287670 290016 293629 297534 300871 303597 306273 309472 313520 318496 324214 330331
63628 330331 336685 343404 350640 358460 367184 377504 389843 403705 418080 432517 447596 464371
63616 464371 483633 505641 530033 555891 582361 609521 638304 669166 701043 731995 760661
63605 760661 786602 809340 827708 840380 846758 847255 843094 835981 827526 818556 809067 798934 788449
63592 788449 777973 767337 755770 742290 726028 706548 684218 660169 635633 611380 587859
63581 587859 565568 545066 526822 511254 498641 488762 480957 474875 470792 468869 468547 469220 471089
63568 471089 474642 479559 484952 490598 497156 505127 514326 524388 535011 545685 556109 567151 580505
63555 580505 596938 615708 636217 659412 686760 718470 753480 790645 828918 866684 901909
63544 901909 932996 958693 977216 986481 985791 976865 962868 946638 929934 913817 899107 886346
63532 886346 875501 865890 856437 846061 833820 818868 800629 779170 755111 728908 700491 669946
63520 669946 638341 607451 578590 551946 527044 503655 482176 463290 447311 433890 422366
63509 422366 412237 403056 394129 385003 376322 369458 364841 361309 357639 354122 351781 350550 349294 347550
63495 347550 346134 345760 345891 345381 343733 341371 339134 337841 337913 339029 340419 341681 343057 344814 346776
63480 346776 348681 350639 352926 355637 358791 362485 366579 370417 373140 374226 373627 371657 368882 365861
63466 365861 362787 359480 355835 352042 348319 344756 341579 339152 337527 336339 335415 335097 335600 336491 337351
63451 337351 338729 341813 347158 354180 361969 370146 378915 388665 399765 412486 426987 443497 462520
63438 462520 484633 509953 537932 567629 597901 627312 654182 677046 695075 708123 716650 721827
63426 721827 725552 730018 737062 747786 762586 781423 804140 830715 861152 894951 930630 965904
63414 965904 998427 1026390 1048561 1064095 1072638 1074624 1071222 1063876 1053874 1042321 1030210 1018279
63402 1018279 1006745 995231 982891 968539 950861 928882 902467 872343 839567 804985 769250
63391 769250 733311 698700 667032 639019 614076 591138 569915 551122 535517 523063 513203 505518
63379 505518 499794 495713 492999 491758 492298 494724 499105 505869 515415 527281 540270 553711 568176
63366 568176 584750 603968 625711 649741 675897 704019 734048 766102 800166 835743 871936
63355 871936 907673 941687 972543 998961 1019999 1034842 1042786 1043868 1039317 1031010 1020498 1008665
63343 1008665 996055 983041 969688 955780 940934 924503 905587 883560 858596 831354 802275
63332 802275 771620 740165 709337 680440 654030 630213 609315 592051 579106 570536 565412 562066
63320 562066 558839 554603 548488 539445 526637 510274 491603 472014 452539 434229 418349 405722
63308 405722 396141 388691 382479 376883 371526 366447 362121 358961 356875 355402 354067 352427 350154 347439
63294 347439 344991 343202 341540 339290 336678 334623 333398 332262 330568 328632 327121 326081 325029 323739
63280 323739 322410 321181 319934 318660 317700 317461 317968 318794 319418 319635 319688 319975 320665 321694 323037 324786 326875
63263 326875 328948 330671 332065 333431 335077 337224 339973 343191 346556 349936 353598 357800 362264 366360
63249 366360 369851 373209 377162 382155 388332 395769 404512 414462 425388 437048 449319 462297 476336
63236 476336 491880 509158 528044 548279 569744 592527 616755 642339 668813 695449 721689
63225 721689 747502 773175 798710 823597 847285 869782 891707 913813 936436 959298 981722
63214 981722 1003166 1023576 1043081 1061226 1076695 1087969 1094230 1095446 1091689 1082619 1067738 1047023
63202 1047023 1021226 991643 959728 926900 894477 863427 834078 806320 780384 757292 738183
63191 738183 723276 711949 703862 699424 698840 701283 705679 712052 721378 734084 749386 766279 784590
63178 784590 804551 825716 846925 867362 887201 907059 927036 946562 965120 982836 1000119
63167 1000119 1016795 1031841 1044095 1053046 1058713 1060967 1059316 1053350 1043045 1028470 1009507 986050
63155 986050 958396 927309 893848 859248 824763 791334 759415 729175 700821 674636 650835
63144 650835 629512 610655 594051 579279 566010 554313 544507 536682 530559 525819 522342 519950 518135
63131 518135 516379 514754 513902 514259 515535 517194 519196 521825 524884 527621 529709 531798 534666 538180 541584
63116 541584 544560 547353 550003 552256 554397 557389 561670 566336 570068 572551 574422 576085 577317 578008
63102 578008 578622 579570 580553 580806 579839 577761 575107 572585 570768 569713 568863 567541 565652 563842 562939 563260
63086 563260 564432 565865 567334 569125 571671 575097 579126 583302 587308 591160 595227 599966 605601 612062
63072 612062 619260 627225 635872 644829 653755 662789 672470 683290 695529 709431 725172 742631 761610
63059 761610 782418 805848 832350 861587 893219 927813 966415 1009311 1055738 1104896 1156708
63048 1156708 1211335 1268432 1327238 1387111 1447539 1507836 1567299 1625624 1682830 1738790 1793233
63037 1793233 1846183 1898002 1948943 1999029 2048450 2097479 2145645 2191350 2232699 2268440 2297662
63026 2297662 2318864 2329929 2329097 2315611 2289546 2251533 2202806 2145103 2080295 2010239 1936892 1862080
63014 1862080 1787124 1713239 1642444 1577418 1519940 1469931 1426616 1390241 1361937 1342103 1329802
63003 1329802 1323918 1324191 1330769 1343285 1360916 1383013 1409210 1439020 1471682 1506359 1542212 1578488
62991 1578488 1614869 1651623 1688940 1726093 1761656 1794674 1825260 1853859 1880237 1903345 1921788
62980 1921788 1934023 1938486 1934161 1921122 1900042 1871058 1833516 1787147 1733218 1674209 1612427 1549150
62968 1549150 1485018 1420869 1357979 1297597 1240469 1186900 1137114 1091269 1049121 1010001 973440
62957 973440 939631 908873 880681 854006 828456 804758 783650 764721 746740 728890 711227
62946 711227 694130 677796 662242 647415 633273 620033 608277 598411 590031 582175 574272 566568
62934 566568 559644 553864 549271 545604 542314 538901 535413 532409 530387 529468 529494 530011 530181 529321 527691 526237
62918 526237 525292 524082 521819 518744 515656 512888 510379 508384 507267 506602 505254 502590 499184 496061 493621
62903 493621 491584 489669 487943 486598 485747 485478 485808 486431 486653 485867 484125 482103 480448 479296 478398 477447
62887 477447 476223 474744 473566 473592 475174 477571 479646 480903 481402 481093 480021 478979 478982 479878 480384 479784 478732
62870 478732 477953 477086 475490 473376 471307 469248 467079 465504 465311 466002 466269 465835 465798 467064 469331 471736
62854 471736 473634 474542 474225 473210 472553 472695 473183 473761 474990 477298 480084 482341 483689 484230 483836 482248
62838 482248 479664 476715 474008 472069 471345 471671 471968 471168 469461 468059 467654 467636 467112 466247 466210 467877 470904
62821 470904 474114 476623 478468 480261 482511 485417 489067 493462 498296 503093 507659 512204 516948 521951
62807 521951 527401 533643 540630 547663 554107 560176 566674 574068 582146 590521 599154 608416 618903 631201
62793 631201 645526 661617 679285 699068 722061 748975 779662 813723 851323 893163 939779
62782 939779 991224 1047413 1108529 1174965 1247055 1324918 1408360 1496640 1588322 1681615 1774930
62771 1774930 1866978 1956268 2040660 2117512 2184148 2238209 2277878 2302077 2310422 2302891 2279663 2241392
62759 2241392 2189405 2125401 2051167 1968735 1880509 1788891 1695934 1603591 1513868 1428132 1346539
62748 1346539 1268832 1195577 1127851 1065795 1008443 955219 906683 863359 824657 789692 758465
62737 758465 731354 707817 686552 666923 649499 635050 623514 614049 605730 598095 591285 585708
62725 585708 581412 577978 575183 573413 573068 573905 575493 578006 581961 587346 593775 601394 610847 622249
62711 622249 634976 648733 664184 682209 703135 727066 754402 785489 820112 857803 898479
62700 898479 942533 990604 1043470 1101723 1165131 1232702 1303693 1378027 1455157 1533027 1608910
62689 1608910 1680996 1748239 1808908 1860365 1900505 1928466 1943581 1944579 1930635 1902644 1862711 1812657
62677 1812657 1753608 1686729 1613613 1536043 1456052 1376141 1298675 1224861 1154852 1088948 1028069
62666 1028069 972763 922406 875893 832751 793144 757193 724880 696344 671563 649761 629740
62655 629740 610935 593647 578134 563989 550745 538628 528199 519424 511566 504054 497081 491152
62643 491152 486266 481774 477110 472430 468371 465243 462684 460187 457701 455464 453436 451266 448817 446407
62629 446407 444414 442851 441494 440210 439029 438000 437137 436449 435973 435776 435959 436572 437593 439092 441249 444000
62613 444000 446786 449119 451356 454504 459049 464459 470108 476295 483942 493544 504881 517633 531788
62600 531788 547517 565161 585450 609283 637047 668399 702879 740418 780915 823650 867634
62589 867634 912537 958702 1005870 1052197 1094943 1132057 1162706 1186378 1202149 1209239 1207855 1198882
62577 1198882 1182891 1159928 1130287 1094976 1055347 1012702 968419 924008 880678 839019 799325
62566 799325 761984 727345 695406 665922 638748 613925 591491 571365 553379 537481 523990
62555 523990 513411 505588 499177 492579 485548 479287 474698 471232 467916 464790 462484 460815 458832 456246
62541 456246 453908 452656 452355 452342 452192 451727 450822 449661 448850 448831 449474 450653 452959 457310 463863 471778 480177
62524 480177 489015 498893 510349 523667 539158 557191 577823 600701 625514 652381 681637 713505
62512 713505 748251 786369 828096 872659 918456 964097 1008855 1052005 1092186 1127810 1157705
62501 1157705 1181107 1197417 1206491 1208914 1205470 1196453 1181987 1162969 1141246 1118827 1097163 1077144
62489 1077144 1059362 1044372 1032934 1025939 1023782 1025901 1031279 1039242 1049373 1060796 1072141 1082227
62477 1082227 1090180 1094768 1094337 1087862 1075703 1058937 1038196 1013470 984801 952703 917989 881487
62465 881487 844029 806489 769728 734450 701078 669776 640681 614125 590542 570208 553186
62454 553186 539424 528642 520166 513183 507294 502653 499507 497779 497211 497725 499512 502755 507303 512619
62440 512619 518172 523906 530155 536977 543816 549959 554981 558484 559843 558808 556086 552648 548491 542753
62426 542753 535002 525748 515632 504868 493878 483724 475366 468813 463364 458383 453574 448930 444817
62413 444817 441723 439493 437106 433651 429385 425488 422950 421943 421972 422204 421870 420790 419487 418592 418366 419002
62397 419002 420903 424089 427609 430285 432030 433806 436217 438794 440932 442981 445906 450202 455630 461822
62383 461822 468558 475379 481585 487094 492984 500564 509856 519527 528493 537054 546049 555485 564804 574241
62369 574241 584932 597485 611288 625666 641159 659095 680366 705162 733668 766354 803618
62358 803618 845545 892027 942721 996791 1052872 1109401 1164937 1218260 1268205 1313252 1351346
62347 1351346 1380508 1399927 1410328 1413193 1409816 1400980 1386940 1367359 1341755 1310505 1275108 1237077
62335 1237077 1196972 1155019 1112375 1071005 1032369 996795 964132 934430 907777 883885 862157
62324 862157 842010 823063 805106 787866 770736 752973 734429 715864 698246 681896 666698
62313 666698 652916 641213 631844 624319 618077 613156 610028 609007 609936 612275 615386 618807 622272 625530
62299 625530 628401 631115 634210 637764 640984 642924 643377 642654 640794 637653 633660 629698 626083 622193 617354
62284 617354 611680 605896 600714 596587 593670 591773 590595 590140 590661 592073 593802 595418 597238 600143 604973
62269 604973 612153 621574 632719 645120 658985 675262 695005 718758 746548 778284 814058 854188
62257 854188 899002 948566 1002615 1060644 1121686 1183849 1244546 1301601 1353812 1400059 1438459
62246 1438459 1467245 1486240 1496479 1498441 1491602 1475894 1452537 1422889 1387249 1345401 1297812 1245790
62234 1245790 1190936 1134947 1079551 1026052 975100 927124 882697 842222 805763 773524 746002
62223 746002 723226 704333 688274 674489 662477 651378 640683 630859 622514 615322 608570 602313
62211 602313 596969 592054 586550 580684 576174 574196 573940 573803 573370 573539 575058 577723 580979 584724 589284
62196 589284 594824 601072 607691 614861 623213 633007 643563 653866 663685 673757 684885 697180 710214
62183 710214 723484 736512 748775 759802 769261 776955 782963 787851 792520 797743 804009 811839 821935
62170 821935 834858 850836 870085 893109 920418 952023 987393 1025800 1066426 1108110 1149155
62159 1149155 1187568 1221556 1249878 1271809 1286906 1294969 1296235 1291460 1281626 1267482 1249327 1227077
62147 1227077 1200528 1169836 1135921 1100266 1064121 1028096 992679 958876 927923 900521 876715
62136 876715 856381 839387 825313 813536 803708 795731 789205 783424 778046 773320 769394 765942 762829
62123 762829 760700 760398 762090 765474 770638 778082 787822 798970 810331 821055 830583 838236 843217 844973
62109 844973 843514 839422 833598 826897 819943 813219 807131 801696 796224 789692 781676 772855 764478 757445
62095 757445 752019 748290 746557 747106 749732 753713 758306 763169 768320 773908 780114 787105 794812 802816
62081 802816 810716 818604 826979 836187 846284 857548 870683 886157 903560 922083 941555 962528
62069 962528 985234 1008995 1032998 1057313 1082624 1109066 1135880 1162324 1188374 1213996 1238087
62058 1238087 1258783 1274913 1286615 1294281 1297508 1295707 1289414 1280187 1268946 1254912 1236522 1213085
62046 1213085 1185266 1154238 1120780 1085168 1047580 1008539 969056 930361 893330 858137 824585
62035 824585 792697 762881 735549 710746 688127 667225 647796 630046 614426 601033 589302
62024 589302 578485 568342 559073 550615 542447 534276 526519 519679 513419 506712 499050 491180 484450 479576
62010 479576 476233 473722 471776 470662 470679 471796 473741 476295 479356 482759 486165 489253 492004 494693 497500
61995 497500 500132 501920 502346 501486 499906 498127 496106 493118 488198 480921 471952 462690 454194 446493 439115
61980 439115 432086 426025 421234 417208 413318 409601 406514 404130 402066 400100 398414 397241 396684 396929 398060
61965 398060 399504 400182 399622 398672 398709 400369 403403 407400 412019 416602 420304 422903 425062 427549 430608
61950 430608 434286 438909 444784 451747 459526 468366 478753 490588 503200 516234 529987 544756 560376
61937 560376 576694 593936 612136 630535 648156 664795 680908 696593 711302 724622 736731
61926 736731 747703 756825 763025 765780 765292 761987 756303 748918 740732 732455 724428 716995 710891 707139
61912 707139 706592 709491 715341 723262 732711 743912 757297 772438 787804 801792 813771 823793 831440
61899 831440 835491 834909 829853 821401 810462 797289 782024 765343 748299 731672 715699 700358
61887 700358 685728 671960 659051 646747 634676 622562 610408 598487 587150 576525 566439
61876 566439 556704 547483 539291 532565 527281 523115 519970 518197 518125 519455 521375 523438 526150 530518 537094
61861 537094 545666 555787 567333 580443 595179 611427 629050 648091 668930 692250 718568 747603
61849 747603 778290 809621 841296 873314 905120 935526 963426 988217 1009447 1026415 1038357
61838 1038357 1044900 1046202 1042790 1035416 1025019 1012713 999796 987705 977798 971047 967970 968752 973334
61825 973334 981319 991974 1004365 1017471 1030238 1041594 1050384 1055246 1054840 1048535 1036728 1020111 998781
61812 998781 972616 942516 910566 878675 847527 817192 788147 761104 736237 713299 692351
61801 692351 673750 657419 642792 629539 617865 607937 599443 591875 584921 578436 572391 567017 562669
61788 562669 559336 556479 553461 549998 546160 542225 538647 535834 533803 532170 530544 528693 526394 523546
61774 523546 520544 518123 516602 515605 514693 513895 513303 512561 511230 509483 508051 507492 507802 508585 509389 509973 510501
61757 510501 511384 512739 514130 515055 515461 515515 515146 514189 512829 511443 510000 507979 504951 501009 496695 492778
61741 492778 490002 488636 488198 487965 487803 488161 489167 490161 490428 490139 490201 491234 492993 494838 496491 498142
61725 498142 499920 501618 503080 504587 506521 508765 510840 512695 514858 517631 520569 523036 524838 526001
61711 526001 526312 525569 523929 521550 518181 513670 508621 503851 499364 494486 488920 483002 477018 471019 465342
61696 465342 460477 456297 452157 447935 444188 441019 437722 433998 430660 428478 427027 425436 423634 421990
61682 421990 420200 417525 413999 410509 407735 405690 404246 403333 402550 401306 399569 397890 396558 395283 393973
61667 393973 393203 393470 394318 394698 394143 393270 393071 393878 395129 396183 397206 398960 401649 404399 406214 407150
61651 407150 408071 409487 411183 412927 414912 417362 420197 423258 426449 429497 432019 433998 435803 437526
61637 437526 438674 438785 438006 436727 434968 432458 429132 425238 421106 417095 413562 410558 407701 404692 401870
61622 401870 399869 398739 397823 396670 395768 396069 397826 400118 401593 401567 400392 398879 397515 396190 394461
61607 394461 391976 388741 385057 381090 376565 371184 365438 360511 356995 354065 350511 346388 342931 340844
61593 340844 339432 337685 335518 333459 331676 329924 328187 326776 325825 325136 324450 323584 322433 321160 320298
61578 320298 320266 320803 321139 320724 319552 317926 316222 314802 313843 313213 312798 312805 313500 314752 316220 317800 319453
61561 319453 320757 321240 321192 321474 322382 323338 323967 324757 326188 327796 328811 329332 330171 331689 333499 335231 336924
61544 336924 338544 339772 340493 341059 341863 343034 344658 346842 349290 351259 352286 352676 353013 353533 354242 355222
61528 355222 356344 356979 356597 355475 354324 353318 352059 350417 348754 347252 345613 343666 341740 340143 338780
61513 338780 337563 336750 336433 336107 335233 334027 333202 333071 333386 333946 334850 336086 337287 338060 338334 338303 338185 338090
61495 338090 337984 337778 337584 337700 338228 338884 339504 340510 342408 344900 346973 347982 348285 348682 349560 350705 351664
61478 351664 352112 352096 351986 352065 352156 351943 351532 351312 351243 350795 349741 348530 347653 347100 346696 346507 346502 346196 345157 343710
61458 343710 342693 342603 343279 344231 344976 345210 345049 344990 345364 345991 346697 347880 350023 352748 354938 355886 355921 355859
61440 355859 356262 357313 358995 361137 363523 366100 368986 372317 376266 381031 386376 391279 394624 396333
61426 396333 397346 398391 399381 400239 401592 404044 407221 410158 412429 414315 416078 417623 418821 419571 419537
61411 419537 418423 416687 415389 415041 414914 413859 411568 408787 406480 405042 404213 403426 402263 400788 399446
61396 399446 398597 398228 398212 398613 399481 400455 400896 400484 399517 398613 398347 399083 400842 403184 405448 407330 409109
61379 409109 411194 413620 416163 418713 421266 423631 425488 426794 427858 428947 430023 430897 431408 431333 430410
61364 430410 428733 426982 425987 426002 426610 427358 428332 430078 433068 437340 442591 448536 455130 462417 470189 477950
61348 477950 485278 492090 498401 503985 508595 512489 516336 520398 524084 526697 528484 530495 533303 536217
61334 536217 537987 538050 536792 534804 532252 529022 525113 520764 516432 512755 510307 509173 508881 508908 509066 509361
61318 509361 509834 510870 513319 517758 523675 529900 535943 542490 550461 560043 570830 582505 594981 608135
61304 608135 621718 635302 648123 659169 667736 673717 677221 678272 677181 674700 671283 666486 659742
61291 659742 651490 642770 633878 624351 614406 605388 598259 592410 586629 580694 575238 570521 566279 562693
61277 562693 560579 560333 561343 562776 564507 566876 569869 572923 575482 577491 579356 581617 584648 588635
61263 588635 593782 600365 608383 617242 626139 634799 643509 652271 660270 666468 670490 672628 673153 672043
61249 672043 669401 665755 661765 657720 653434 648507 642758 636506 630474 625254 620834 616828 613129 610092
61235 610092 607950 606340 604696 603024 601986 602192 603641 605971 609083 613231 618526 624513 630426 635826
61221 635826 640953 646453 652826 660122 668009 676075 684070 691924 699564 706735 713134 718777 724040 729209
61207 729209 734123 738502 742569 747036 752456 758850 766112 774520 784633 796793 810873 826397 842805
61194 842805 859670 876746 893626 909334 922580 932745 940419 946674 951880 955542 957149 956788 954871
61181 954871 951627 947023 940981 933464 924446 913948 902134 889441 876562 864077 851892 839263
61169 839263 825621 811248 796811 782474 767940 753253 738968 725411 712348 699636 687747
61158 687747 677352 668705 661707 656229 652121 649227 647650 647772 649733 653161 657517 662251 666408 668640
61144 668640 668175 665423 661139 655431 648177 640094 632568 626509 622153 619936 620701 624730 631192 638892 647218
61129 647218 656192 666072 677245 690106 704723 720887 738688 758687 781205 805684 831089 856806
61117 856806 882914 909742 937453 966005 995249 1024934 1054575 1083350 1110310 1134991 1157736
61106 1157736 1179141 1199156 1217008 1231993 1243929 1252760 1258160 1259795 1257724 1252381 1244390 1234524 1223499
61093 1223499 1211601 1198739 1185085 1171398 1158597 1147270 1137760 1130338 1125004 1121354 1118921 1117516
61081 1117516 1117197 1118288 1121564 1127843 1137028 1147994 1159861 1172905 1187577 1203055 1217622 1230420
61069 1230420 1242032 1253212 1263750 1272929 1280506 1286710 1291536 1294580 1295621 1295077 1293686 1291818 1289263
61056 1289263 1285800 1281789 1277949 1274572 1271345 1268101 1265309 1263536 1262754 1262625 1263252 1265135 1268472 1272947 1278247
61041 1278247 1284469 1291945 1300849 1310979 1321847 1333125 1345137 1358607 1373709 1389803 1406477 1424434
61029 1424434 1444773 1467753 1492867 1519855 1548884 1579873 1612490 1646859 1683655 1723586 1767589
61018 1767589 1817538 1875914 1944574 2024496 2116779 2223073 2345129 2485252 2647825 2839675
61008 2839675 3068720 3343459 3674347 4074696 4559987 5148165 5861969 6729307 7778590
60999 7778590 9032212 10501743 12181721 14038335 15999356 17956822 19783522 21352643
60991 21352643 22555934 23328326 23679726 23710426 23581784 23447427 23388562 23393486 23379282 23224339
60981 23224339 22794257 21972315 20703156 19028237 17080084 15032299 13040129 11208107
60973 11208107 9590133 8203132 7039146 6074915 5281306 4630159 4096438 3658163 3296881
60964 3296881 2997765 2748340 2537538 2356486 2199235 2061725 1940381 1832270 1735865 1650551
60954 1650551 1575420 1509133 1450647 1399305 1354244 1314265 1278200 1244870 1212771 1180464 1147412
60943 1147412 1114090 1081155 1048850 1017271 986765 957767 930369 904348 879628 856550 835493
60932 835493 816274 798206 780898 764723 750199 737213 725286 714388 704830 696399 688387 680645
60920 680645 673903 668708 664705 661302 658410 656046 653805 651350 648908 646739 644590 642328 640629 640191
60906 640191 640588 640676 639944 638627 636669 633506 628972 623647 618107 612394 606294 599546 591746 582759 573375
60891 573375 564876 557722 551195 544550 537895 531677 525931 520485 515504 511329 507958 504958 501803 498219
60877 498219 494437 491108 488610 486414 483542 479720 475686 472394 470377 469898 471021 473294 475977 478895
60863 478895 482568 487205 492105 496480 500452 504825 510179 516434 522858 528212 531474 532867 533810 535417
60849 535417 537462 539179 540536 542063 543766 544910 544781 543195 540420 536999 533445 529681 525014 518997
60835 518997 512033 504742 497233 489524 482199 475862 470200 464449 458649 453592 449571 445963 442201 438353
60821 438353 434552 430526 426065 421492 417310 413635 410195 406656 402920 399303 396343 394173 392238 390035
60807 390035 387919 386606 386058 385568 384895 384536 384795 385384 386178 387508 389331 390813 391355 391490 392211 393725 395401
60790 395401 396693 397647 398683 400188 402229 404390 406068 407092 407856 408821 410197 412142 414642 416967 417866
60775 417866 416802 414611 412496 410767 409018 407131 405431 404084 402937 401886 400961 400092 399147 398093 396835
60760 396835 395078 392700 390093 387801 386044 384883 384508 384903 385537 385904 386166 386796 387856 389185 390922 393128
60744 393128 395141 396162 396372 396548 396584 395422 392706 389488 386769 384215 380988 377160 373516 370463 367949
60729 367949 366187 365563 365819 366053 365686 365003 364665 365088 366301 367981 369523 370452 370992 371981 374071 377120 380411
60712 380411 383263 385402 386994 388421 389932 391385 392407 392773 392534 391875 391040 390329 389815 389069 387513 385235
60696 385235 383145 382106 382079 382357 382400 382155 381658 380743 379278 377484 375817 374601 373875 373575 373828 375009 377362
60679 377362 380535 383687 386224 388361 390723 393518 396356 398844 400970 402763 403932 404052 402872 400258
60665 400258 396172 391096 386243 382793 380812 379296 377442 375605 374806 375503 377117 378731 380056 381615 384000
60650 384000 387113 390312 393244 396164 399215 401743 402818 402296 400830 398858 396207 392901 389697 387328
60636 387328 385606 383792 381639 379559 377908 376680 375911 375852 376544 377612 378685 379758 380966 382255 383527
60621 383527 384940 386794 389109 391461 393251 394109 394086 393497 392589 391380 389924 388566 387722 387368 386982 386190
60605 386190 385279 384851 385068 385453 385541 385506 386011 387436 389388 391035 391940 392510 393563 395482 397817 399750 400871
60588 400871 401475 402142 403161 404362 405443 406332 407249 408445 409966 411567 412899 413773 414322 414887 415761 417081
60572 417081 418958 421566 425102 429773 435923 443928 453699 464428 475196 485895 497193 509423 521726
60559 521726 532482 540475 545478 547904 548188 546503 542887 537572 531222 524804 519148 514684 511610 510127
60545 510127 510343 512094 515063 519094 524247 530634 538374 547720 559039 572586 588326 605972 625121
60532 625121 645346 666153 686779 706071 722699 735654 744497 749142 749542 745824 738620 729102 718568
60519 718568 707922 697422 686865 676186 665920 657015 650089 645042 641439 639061 637911 637963 639267
60506 639267 642183 647197 654488 663931 675521 689590 706608 727038 751413 780294 814000 852468
60494 852468 895383 942288 992502 1045014 1098428 1150849 1199906 1243223 1279140 1306868 1325874
60483 1325874 1335188 1333463 1319725 1294060 1257669 1212432 1160489 1104084 1045463 986569 928817 873324
60471 873324 821360 774198 732349 695248 662006 632377 606735 585175 567036 551321 537358
60460 537358 524960 514109 504623 496099 488155 480712 473933 467874 462391 457476 453424 450438 448225 446219
60446 446219 444050 441598 438817 435851 433176 431221 429910 428887 428060 427534 427081 426194 424718 423031 421554
60431 421554 420431 419764 419659 419854 419686 418726 417237 415860 415046 414884 415228 415893 416957 418833 421658 424617
60415 424617 426438 426778 426671 427352 429050 431257 433647 436218 438822 441168 443222 445166 446992 448479 449520
60400 449520 450195 450603 450954 451742 453482 456234 459613 463200 466713 469868 472418 474380 476020 477617 479362
60385 479362 481396 483678 485944 488069 490402 493379 496851 500156 502892 505239 507489 509660 511827 514357
60371 514357 517400 520371 522411 523426 524291 525868 528039 529924 530964 531542 532569 534684 537955 542175 547165
60356 547165 552838 559183 566274 574155 582666 591540 600743 610473 620698 630751 639576 646242 650141 650880
60342 650880 648321 642784 634978 625680 615556 605302 595685 587249 579976 573366 566881 560343 553950 548057
60328 548057 542991 538958 535914 533434 530940 528210 525585 523472 521796 520286 519229 519522 521854 526193
60314 526193 532228 539938 549353 560069 571460 583343 596012 609578 623544 637036 649258 659733
60302 659733 668463 675946 682752 688876 693618 696211 696436 694501 690414 683686 673723 660512 644985 628699
60288 628699 613064 598702 585490 573136 561703 551600 543198 536485 531003 526015 520832 515217 509643
60275 509643 505036 501991 500112 498253 495527 492019 488481 485503 483149 481183 479325 477309 475059 472935
60261 472935 471582 471354 471980 472864 473628 474340 475358 476967 479086 481339 483490 485654 487894 489822 491005
60246 491005 491611 492133 492473 491928 490301 488413 487145 486465 485857 485258 485005 485131 485330 485542 486049 487040 488509
60229 488509 490523 493161 496199 499285 502407 505814 509486 513114 516643 520434 524768 529590 534804 540461
60215 540461 546468 552447 558154 563837 570018 576968 584421 591730 598317 604150 609724 615393 620820 625387
60201 625387 629022 632262 635536 638778 641742 644215 645818 646057 644810 642439 639278 635319 630557 625262
60187 625262 619725 614122 608804 604299 600651 597178 593284 589220 585647 582738 580149 577635 575197 572866
60173 572866 570848 569736 569922 570828 571345 571222 571389 572639 574461 575558 575234 573884 572357 571249 570724 570700
60157 570700 571125 572091 573598 575204 576226 576484 576594 577266 578491 579730 580705 581671 583012 584908 587321 589950
60141 589950 592353 594547 597456 602178 608718 615952 623004 630089 637671 645405 652437 658324 663025 666343
60127 666343 668142 669056 670193 671975 673732 674590 674335 673309 671974 670738 669775 668808 667432 665756 664283
60112 664283 663074 661612 659700 657865 656443 654832 652305 649148 646344 644316 642545 640304 637262 633536
60098 633536 629723 626776 625268 624733 624182 623288 622596 622618 623288 624419 626119 628464 631108 633463 635056 635673
60082 635673 635527 635366 635986 637410 638834 639475 639110 637656 634679 629756 623055 615251 606991 598686 590662
60067 590662 583229 576562 570593 564918 558921 552320 545693 540057 535773 532253 529033 526608 525698 526043 526580
60052 526580 526753 526952 527634 528752 530387 533300 538128 544218 549921 554179 557348 560317 563266 565674 567241
60037 567241 568273 569091 569536 569207 567937 565801 562921 559509 555916 552355 548619 544307 539269 533610 527382
60022 527382 520564 513315 505956 498574 490931 482928 475032 468095 462764 459086 456586 454633 452802 451045
60008 451045 449625 448896 448957 449329 449126 447857 446075 444843 444537 444597 444587 444864 445824 447123 448310 449781 452259
59991 452259 455567 458776 461509 464236 467172 469776 471577 472729 473380 473250 472312 471223 470508 469781 468338
59976 468338 466160 463801 461679 460030 459242 459548 460520 461370 461751 461862 461964 462278 463266 465522 469252 474107
59960 474107 479474 484760 489570 493889 497878 501242 503058 502651 500374 497085 493147 488541 483794 480056
59946 480056 478069 477546 477602 477357 476184 473995 471466 469380 467580 465112 461675 458389 456751 457285 459523
59931 459523 462853 466787 470822 474713 478841 483764 489326 494651 498977 502092 503924 504270 503205 501382
59917 501382 499605 498257 497431 497323 498123 499571 501083 502486 504374 507562 512344 518301 524599 530202 534109
59902 534109 535832 535745 534708 533337 531860 530640 530330 531278 533046 534886 536519 538198 540165 542410 544889
59887 544889 547627 550585 553767 557499 562219 567898 574041 580438 587503 595472 603521 610228 614930 618229
59873 618229 621098 623863 626235 627927 628872 629035 628428 627305 626070 624986 624177 623838 624090 624568 624564 623796 622701
59856 622701 621785 620991 620079 619293 619197 620033 621786 624801 629637 636119 643102 649534 655225 660208 663818 665189
59840 665189 664512 663103 662094 661608 661373 661519 662290 663372 664097 664113 663327 661297 657445 652067 646468 641594
59824 641594 636972 631535 625134 618570 612368 606367 600562 595423 591099 587026 582840 579038 576151 573833
59810 573833 571459 569206 567730 567044 566534 565940 565444 564794 563245 560609 557619 554876 552059 548588 544618
59795 544618 540910 537978 535661 533373 530660 527722 525388 524244 523799 522940 521195 519017 516887 514853 513080
59780 513080 512012 511608 511121 510140 509297 509449 510608 512166 513683 515039 516293 517884 520459 523990 527560
59765 527560 530610 533821 538079 543121 548065 552878 558330 564691 571479 578473 586000 594080 602099 609598
59751 609598 616798 624117 631750 639830 648489 657478 666126 673880 680563 686094 690331 693298 695241 696467
59737 696467 697390 698479 699670 700040 698742 696180 693579 691444 689248 686692 684340 682691 681437 680132 678906
59722 678906 677993 677071 675699 673949 672058 669818 666957 663947 661782 660970 661145 661716 662506 663652 665142 666605
59706 666605 667565 667901 668047 668577 669587 670639 671310 671501 671201 670327 669024 667782 667002 666588 666194 665649 664868
59689 664868 663528 661212 657951 654364 651079 648072 644757 640830 636870 633727 631303 628394 624069 618755
59675 618755 613482 608414 602885 596702 590563 585018 579803 574521 569319 564487 559963 555760 552435 550593
59661 550593 550158 550549 551316 552210 552912 553240 553566 554604 556701 559508 562282 564359 565447 565639 565107 563820
59645 563820 561742 559226 556778 554366 551477 548072 544905 542519 540477 538103 535587 533734 532864 532602 532553
59630 532553 532538 532249 531302 529726 527870 525752 522978 519462 515779 512598 510050 507807 505509 503039 500597
59615 500597 498612 497330 496457 495469 494354 493708 493972 494864 495778 496560 497673 499705 502773 506318 509388 511326
59599 511326 512306 513105 514295 515844 517515 519339 521456 523744 525929 527963 529971 531830 533138 533692 533708
59584 533708 533402 532619 531144 529174 527092 524857 522077 518866 516190 514977 515071 515440 515315 514811 514407 514257
59568 514257 514196 514177 514470 515431 517116 519031 520269 520128 518770 517242 516731 517682 519508 521027 521341 520482 519262
59551 519262 518466 518287 518589 519393 520788 522606 524678 527378 531431 537171 544499 553616 565202 579534 595840
59536 595840 612859 629660 645458 658924 668274 672250 670942 665817 659077 652749 647950 644832 643130
59523 643130 642569 642713 642856 642398 641221 639465 637068 633710 629143 623389 616730 609568 602125 594237 585650
59508 585650 576622 567972 560393 554018 548795 544805 541840 539053 535600 531545 527759 524953 523160 522041
59494 522041 521300 520771 520458 520516 520990 521568 521767 521336 520334 519042 518105 518524 520991 525111 529634 533535 536654
59477 536654 539374 542106 545256 549245 554163 559479 564368 568430 572006 575821 580277 585039 589238 592185
59463 592185 593959 595308 597037 599530 602889 607351 613348 620996 629600 637944 645229 651596 657591 663335
59449 663335 668498 672925 676734 679738 681222 680576 677922 673881 668919 663101 656400 649124 642093 636279
59435 636279 632069 629026 626681 625317 625424 626523 627476 628190 630141 634712 641785 650537 660854 673002
59421 673002 686465 700281 714479 730200 748271 768448 790227 813558 838346 863710 888085
59410 888085 909710 926771 937543 940943 937081 927274 913676 898909 885675 876229 871803 872224 876023
59397 876023 881065 885173 886128 881539 869743 851331 829215 806566 784921 764583 746057 730128
59385 730128 716809 705216 694542 684524 675126 666575 659668 655146 652589 650674 648666 646935 645946
59372 645946 645585 645768 646848 649004 651891 655233 659119 663415 667723 672344 678416 686412 695240 703644 711897
59357 711897 721242 732123 744012 756653 770337 784899 799543 814015 829174 845892 863803 881550
59345 881550 897906 912312 924607 934646 942196 946954 948631 947127 942621 935415 925630 913043 897360
59332 897360 878823 858532 837963 818058 798882 780223 762208 745165 729164 714006 699588
59321 699588 686080 673793 663025 653861 645932 638528 631195 624158 618012 613148 609628 607354 606120
59308 606120 605667 606035 607678 610930 615491 620839 627051 634838 644759 656727 670157 684132 697309 708139
59294 708139 715379 718251 716223 709245 698364 685553 672547 660132 648831 639693 633775 631039 630464
59281 630464 631304 633732 638190 644570 652302 660906 670243 680516 692201 705702 720728 736155 750779
59268 750779 764087 776138 786919 796194 803852 809924 814200 816210 815755 813250 809362 804528 798950 792880
59254 792880 786679 780707 775281 770681 767068 764419 762612 761522 760961 760657 760424 760359 760844 762290 764747 767651
59238 767651 770066 771424 771971 772189 771799 769694 765011 758007 749709 741013 732307 723636 714773 705215 694531
59223 694531 682878 671119 660340 651208 643661 637161 631283 626003 621355 617040 612769 608799 605626
59210 605626 603151 600811 598647 597478 597643 598310 598638 599015 600398 602856 605568 608014 610325 612528 614254
59195 614254 615270 615746 615941 616145 616794 618038 619233 619586 619276 619264 619910 620556 620683 620741 621438 622809 624365 625792
59177 625792 627107 628489 630171 632190 634164 635770 637559 640673 645440 650826 655626 659713 663669 667639
59163 667639 671115 673524 674553 674001 671732 667674 661740 654018 645225 636511 628462 620650 612539 604468
59149 604468 597258 591173 585828 580927 576499 572488 568649 564874 561203 557452 553236 548503 543778 539784
59135 539784 536941 535242 534367 533923 533729 533911 534620 535800 537425 539848 543578 548679 554655 561016 567782
59120 567782 575312 583776 592957 602511 612248 622101 631960 641760 651671 662023 672915 684092 695211
59107 695211 705931 715592 723268 728627 732466 735853 738855 740633 740678 739301 736939 733732 729986 726367
59093 726367 723304 720700 718494 716888 715669 713967 711262 708145 705477 703146 700308 696557 692146 687157
59079 687157 681197 674099 666417 658932 651854 644718 636992 628763 620824 614091 608903 604940 601637 598451
59065 598451 594978 591305 588203 586308 585038 583053 580010 577112 575430 574452 572950 570666 568273 566155
59051 566155 564208 562656 562069 562460 563128 563594 564060 564756 565381 565542 565399 565571 566483 567849 568801 568769 568389 569173
59033 569173 571915 575799 579526 583005 587273 593097 600462 609348 620052 632497 645912 659517 673070
59020 673070 686550 699712 712062 722797 730720 734794 735027 732364 727675 721388 714153 707072 700892
59007 700892 695645 691459 688987 688511 689299 690607 692821 696795 702375 708444 714230 719740 724906 729221 732464
58992 732464 735026 737155 738358 737968 735889 732498 728239 723678 719624 716687 714842 713703 713051 712826 712949
58977 712949 713626 715617 719638 725607 733019 742023 753389 767222 782349 797345 811707 825628 839139
58964 839139 852096 864673 877184 889386 900403 909313 915443 918279 917598 913721 907132 897828 885466
58951 885466 870246 853238 835712 818455 801737 785573 769909 754924 741182 729167 718739
58940 718739 709449 701343 694887 690152 686742 684633 684243 685348 686607 686790 685934 684822 683818 682858 682149
58925 682149 682033 682238 681911 680472 678026 674910 671276 667244 663271 660161 658609 658577 659189 659568 659802 660688
58909 660688 662579 665129 668371 673280 680690 690212 700852 712273 724771 738329 752511 767146 782365
58896 782365 797960 813386 828547 844063 860550 877981 895914 914088 932646 951863 971618
58885 971618 991030 1008792 1023976 1036332 1045690 1051490 1053287 1051417 1046683 1039506 1029712 1017069 1001784
58872 1001784 984628 966875 949875 934387 920468 908129 897752 889575 883212 878055 873722 869695
58860 869695 864967 858706 851060 842771 834221 825337 816170 807008 798109 789749 782234 775380 768341 760422
58846 760422 751757 742714 733186 723144 713327 704382 695679 685996 675267 664692 655196 646764 639252
58833 639252 632842 627502 622880 618960 616103 614278 613015 612260 612463 613662 615262 617007 619494 623388 628679
58818 628679 634840 641117 646559 650498 653293 656002 659140 662241 664701 666302 666855 666230 664991 664177 663993
58803 663993 663415 661435 657985 653330 647448 640636 634011 628586 624151 619645 614390 608535 602600 596987
58789 596987 591755 586667 581712 577619 575374 575145 576259 578305 581481 585574 589501 592388 594472 596357
58775 596357 598070 599410 600544 601486 601488 599752 596412 592106 587037 581274 575641 571305 568528 566598 565081
58760 565081 564299 564502 565291 566217 567374 569036 571111 573356 575796 578480 580974 582589 583199 583468 584130 585376
58744 585376 587222 590117 594541 600018 605265 609624 613783 618629 624005 629243 634427 640284 647034 654274
58730 654274 661851 669888 677928 685052 691119 696956 703008 708710 713749 719043 725731 733727 742053 750241
58716 750241 758670 767681 776975 785856 793589 799527 803280 804853 804456 802094 797375 789745 779089 766184
58702 766184 752200 737384 720642 701064 679599 658459 638990 621080 604585 590136 578068
58691 578068 567588 557761 548680 541033 535059 530507 527118 524444 521610 517913 513569 509453 506211 503841
58677 503841 501897 499954 498159 497425 498618 501531 505211 509374 514748 521880 530464 540258 551745 565228
58663 565228 579946 594673 608552 620725 629855 634879 635877 633611 628637 621537 613427 605360 597440
58650 597440 589251 580953 573322 566865 561501 556988 553181 550033 547673 546320 545779 545402 544852 544523 544831
58635 544831 545533 546154 546572 546735 546298 545156 543810 542657 541345 539477 537531 536339 536010 536044 536256 536922 538239
58618 538239 540308 543431 547841 553240 559030 564742 569857 573710 576167 578035 580176 582492 584316 585364
58604 585364 585714 585295 584163 582922 582082 581258 579744 577638 575669 574165 573015 572460 573074 575011 577993 582025
58588 582025 587405 594068 601561 609724 618781 628705 638997 649105 658657 667368 675177 682343 689012 694898
58574 694898 699902 704788 710669 718003 726684 736927 749423 764663 782647 803191 826002 850558
58562 850558 876381 903266 930758 957563 981975 1002782 1019374 1031282 1038229 1040421 1038292 1032178
58550 1032178 1022817 1011848 1001062 991188 981976 973178 964707 955946 945749 933361 918859 902632
58538 902632 884890 865838 846009 826327 807886 791464 777044 764088 752496 742840 735416 729598
58526 729598 724635 720542 717660 715773 714225 712530 710353 707363 703694 700145 697274 694726 691948 689028
58512 689028 686207 683232 679999 677197 675371 673893 671935 669980 669171 669405 669334 668224 666683 665375 664069
58497 664069 662300 660302 658883 658709 659808 661573 663408 665495 668509 672456 676597 680937 686788 695067
58483 695067 704978 715413 726772 740080 754956 769875 783998 797289 809090 818032 823372 825222
58471 825222 823589 818475 810882 802432 793862 784967 776091 768424 762686 758537 755558 753962 754211 756751
58457 756751 762066 770159 780006 790357 800908 811812 822271 830644 835808 837508 835627 830310 822685
58444 822685 814309 805910 797579 789871 783515 778297 773576 769793 768130 768688 770287 772072 774074 776285
58430 776285 778639 781934 787280 794358 801531 807905 814036 820434 826655 832124 836543 839208 839187 836504 832094
58415 832094 826457 819520 811873 804705 798225 791435 783793 775949 768672 762312 757447 754629 753237 751923
58401 751923 750515 750194 751534 753821 756538 760023 764202 768244 772037 776580 782233 787883 792551 796664
58387 796664 801032 805652 810177 814587 818874 822897 826891 831260 835736 839744 843616 848234 853428 858064
58373 858064 861808 865430 869273 872996 877014 882546 889857 897968 906430 915852 926351 937123 947858
58360 947858 958876 969483 978057 984377 990115 996364 1002342 1007155 1011075 1014331 1016391 1017332 1018389 1020377
58346 1020377 1022995 1026273 1031022 1037268 1044041 1051400 1060872 1073083 1086809 1101155 1116709 1133547 1150049
58333 1150049 1164924 1178713 1192131 1204562 1215291 1224645 1232816 1239187 1243766 1247638 1251032 1252807 1252992
58320 1252992 1253913 1257442 1262792 1268309 1273775 1279657 1285803 1292340 1300368 1310339 1321058 1331446 1341969
58307 1341969 1353389 1365657 1378913 1393836 1410014 1425749 1440442 1455330 1470948 1486060 1500193
58296 1500193 1514959 1531455 1548507 1564935 1581422 1598664 1615866 1632723 1650759 1670984 1692161
58285 1692161 1713018 1734260 1756857 1780492 1805232 1832478 1862487 1893205 1923262 1953923 1986366
58274 1986366 2019556 2052768 2087686 2125717 2165520 2205504 2246591 2290227 2335804 2382370 2430827
58263 2430827 2482128 2535219 2588939 2643993 2701037 2758895 2816665 2875420 2935949 2997195 3058783
58252 3058783 3122532 3189568 3258690 3329583 3404675 3485671 3571296 3660569 3755048 3855639 3960810
58241 3960810 4070382 4187328 4313139 4445329 4582305 4726638 4880541 5042550 5212051
58232 5212051 5392555 5586698 5792598 6009125 6240197 6489632 6756522 7040251 7345300
58223 7345300 7676292 8033094 8415779 8829612 9280175 9768802 10298032 10876159 11511103
58214 11511103 12205935 12966412 13806810 14742516 15784207 16946433 18255025 19739537 21427279
58205 21427279 23353749 25571932 28145321 31144192 34660464 38817488 43757474 49635420
58197 49635420 56642506 65028886 75100150 87220041 101844339 119536815 140912334
58190 140912334 166515203 196632464 231000681 268488967 307033315 343968002 376467962
58183 376467962 401711035 416889820 419639214 409008129 386234199 354489617 317697369
58176 317697369 279338087 241944745 207179473 176028661 148919143 125838151 106497089
58169 106497089 90467728 77262350 66397210 57445232 50048635 43903875 38758888
58162 38758888 34420100 30740606 27597842 24889755 22542362 20502111 18719561 17148934
58154 17148934 15757666 14523267 13422311 12431774 11537634 10732044 10004159 9342068 8740577
58145 8740577 8198231 7708769 7263153 6857336 6490282 6156543 5848225 5562322 5299103
58136 5299103 5055096 4824240 4604347 4396219 4198211 4007730 3826468 3658181 3502451
58127 3502451 3355876 3217828 3089799 2970759 2858406 2753442 2657431 2567919 2480890 2396769
58117 2396769 2318939 2247510 2179496 2114072 2052665 1994666 1937930 1882919 1831759 1783664 1735650
58106 1735650 1687383 1641119 1597264 1554128 1511835 1472439 1436142 1401053 1366635 1334032 1303140
58095 1303140 1272684 1243066 1215944 1191179 1167161 1143865 1122614 1103166 1084050 1065433 1048722
58084 1048722 1033665 1018701 1003740 989687 975602 959386 941122 922834 905112 886732 867502
58073 867502 848682 830658 812834 795770 780783 767401 753725 739357 725639 713106 701120
58062 701120 689979 680937 673894 667260 660199 653094 645879 637994 629872 622463 615359 607316 598507 590366
58048 590366 583445 577226 571659 566965 562351 556896 551224 546324 541369 534904 527618 521454 516437 510894
58034 510894 504545 498769 493852 488568 482612 477017 471827 465680 458120 450242 442698 435079 427589 421404
58020 421404 416977 413611 410859 408647 406204 402788 399383 397620 396988 395337 392211 389454 388237 387707 387055
58005 387055 386716 386893 386837 386320 386081 386228 385936 385254 385499 387235 389465 391387 393400 395743 397667 398549 398551 397719
57987 397719 395749 392973 390241 387566 384230 380357 376847 373618 369603 364773 360464 357291 354381 351069
57973 351069 347726 344513 341006 337558 335357 334563 333944 332943 332450 332908 333353 333100 332840 333138 333315 332728 331849
57956 331849 331156 330184 328512 326561 324603 322120 318940 315899 313592 311549 309420 307965 308021 309448 311863
57941 311863 315557 320907 327604 335137 343393 352317 361631 371242 381158 390799 399246 406291 412252 416613
57927 416613 418107 416353 412209 406213 398060 387961 377046 365828 353720 340782 328624 318750 311189
57914 311189 305415 301313 298424 295612 292547 290395 290017 290550 290767 290809 291422 292375 292869 292844 292724 292351 291159
57897 291159 289082 286529 283932 281860 280982 281313 282131 283268 285672 289946 295069 299481 302832 305825 308922
57882 308922 312076 315349 318851 322274 325079 326994 327942 327914 327322 326973 327210 327544 327530 327429 327535 327506 326982 326377
57864 326377 326454 327514 329487 332312 335699 338906 341299 342919 344207 345496 346983 348703 350298 351326 351927
57849 351927 352637 353416 353587 352922 351953 350903 349183 346344 342779 339060 335384 332061 329727 328544 327909 327463
57833 327463 327659 328880 330767 332913 335531 338871 342667 346654 350928 355311 359142 362232 365269 368657
57819 368657 371678 373446 374015 373975 373519 372502 370808 368099 363767 357535 349637 340196 329276 317782 307179
57804 307179 297845 288803 279692 271704 265741 260912 256082 251831 249360 248130 246184 242602 238380 234885
57790 234885 232517 230958 229937 229545 230151 231947 234359 236425 238082 240507 244742 250595 257288 264359 271339
57775 271339 277395 282176 286333 290390 293775 295751 296579 296767 295917 293458 289980 286635 283609 280320 276855
57760 276855 274008 271920 269748 266800 263268 259847 257256 256034 256210 257304 259082 261919 265925 270279
57746 270279 274207 278109 282816 288078 292709 295968 297934 298766 298511 297555 296457 295355 294103 292745 291233
57731 291233 289073 286011 282734 280094 277963 275712 273481 271952 271082 270126 268937 268212 268270 268369 267533 265535
57715 265535 262953 260674 259255 258354 256980 254804 252873 252411 253216 253990 254040 253842 254024 254571 255054 255046 254320 253155
57697 253155 252370 252597 253638 254859 255832 256145 255230 253151 251097 250197 250156 249901 249112 248207 247205 245853 244730
57680 244730 245031 247114 250291 254226 259739 268031 279886 295818 316336 341945 373318 411305 456089
57667 456089 506372 559841 613990 665630 709999 741674 756632 753027 730606 690913 638287 579284
57655 579284 520236 465452 417317 376823 343640 316603 294716 277333 263496 251995 242210 234103
57643 234103 227292 221023 215228 210713 207939 206332 205075 203836 202491 200924 199475 198858 199224 199859 200146
57628 200146 200261 200578 200864 200452 198930 196508 193941 191984 190518 188491 185265 181755 179421 178361 177343
57613 177343 175619 173590 171608 169326 166603 164070 162381 161647 161893 163184 165019 166508 167526 168823 170645
57598 170645 172146 172575 172144 171236 169723 167669 165750 164219 162247 159104 155347 152014 149228 146439 143571
57583 143571 141027 138883 136848 134835 132912 130913 128698 126604 125044 123738 121897 119107 115693 112290
57569 112290 109394 107241 105796 104868 104307 103978 103579 102878 102166 102039 102578 103160 103193 102650 101810 101000 100685 101134
57551 101134 101824 101841 101099 100532 100837 101773 102990 104631 106637 108298 109259 110234 111954 113996 115497 116536
57535 116536 117873 119661 121276 122300 122815 122804 121998 120448 118700 117306 116476 116116 115849 115202 114145 113323
57519 113323 113343 114033 114810 115532 116495 117715 118777 119386 119734 120274 121403 123205 125243 126801 127643 128339 129459
57502 129459 130682 131167 130643 129643 128688 127652 125985 123296 119733 116074 113385 112208 111996 111565 110210
57487 110210 108295 106758 106133 106002 105392 103774 101624 99857 98772 97892 96801 95709 95094 95191 96048 97577
57471 97577 99257 100164 99748 98437 97222 96785 97211 98161 99069 99372 98855 97697 96158 94436 92867 91821
57455 91821 91210 90467 89250 87856 86782 86241 86259 86802 87592 88233 88790 89802 91433 93038 93855 93754 93097
57438 93097 92325 91889 92034 92303 91799 90345 88893 88398 88785 89394 89838 89930 89471 88749 88696 89731 90921 91011 89969
57419 89969 88813 88247 88203 88377 88446 87988 86945 85976 85620 85350 84272 82591 81518 81764 82904 84206 85246
57402 85246 85669 85190 84119 83216 82792 82476 82002 81639 81637 81809 81918 82012 82128 82100 81917 81967 82653 83986 85634 87163
57382 87163 88225 88812 89363 90327 91608 92718 93402 93768 93910 93816 93627 93484 93125 92104 90567 89354 89138
57365 89138 89763 90579 91104 91235 91119 91045 91236 91637 92025 92426 93255 94949 97470 100176 102158 102880 102597 102047
57347 102047 101660 101306 100887 100733 101125 101769 102158 102150 101856 101264 100455 99879 99872 100109 100092 99932 100091 100520 100697 100470
57327 100470 100243 100368 100910 101942 103391 104569 104484 102891 100678 99133 99122 100831 103698 106594 108559 109496
57311 109496 109824 109678 108985 108121 107735 107923 108293 108824 109848 111137 111923 112067 112364 113267 114180 114543 114910 116203
57293 116203 118378 120541 122109 123230 124238 125316 126648 128461 130866 133910 137719 142354 147556 152859
57279 152859 157971 163026 168496 174821 181935 189161 195768 201551 206643 210945 214180 216483 218450 220482
57265 220482 222460 224032 224793 224266 222323 219720 217557 216015 214284 211963 209780 208498 207840 207143 206542
57250 206542 206730 207834 209254 210520 211643 212618 213127 212917 212238 211868 212798 215651 220043 224665 228398 231337
57234 231337 234474 238428 242821 246891 250414 253849 257796 262465 267713 273530 280312 288473 297785 307354
57220 307354 316377 324753 332943 341459 350595 360378 370470 380289 389472 398276 407410 417444 428342
57207 428342 439517 450465 461473 473573 487565 503173 519358 535312 550852 566151 581604
57196 581604 597886 615422 633694 651656 668998 686392 704252 721925 738546 754160 769467
57185 769467 784842 800218 815708 831735 848607 866326 884887 904491 925523 948480 973743
57174 973743 1001136 1029744 1058372 1086257 1113381 1140313 1167784 1196144 1225164 1254581 1284780
57163 1284780 1316558 1350162 1384982 1420251 1455480 1490004 1522748 1552979 1581016 1607890 1634578
57152 1634578 1661806 1690203 1720203 1751870 1784932 1818759 1852425 1885473 1918803 1954176 1992601
57141 1992601 2033876 2077928 2125553 2177175 2231782 2288069 2345954 2405973 2467759 2530336 2593652
57130 2593652 2658606 2725570 2793924 2863186 2933730 3006290 3081684 3161248 3246770 3339629 3440416
57119 3440416 3549398 3666736 3792273 3925894 4068273 4220798 4384819 4561805 4754293
57110 4754293 4965887 5200210 5460706 5751862 6080099 6453541 6881903 7377202 7954274
57101 7954274 8631074 9429994 10379710 11515190 12875575 14502584 16440603 18736044 21434499
57092 21434499 24577291 28198642 32321823 36953689 42079985 47662903 53639511 59921666
57084 59921666 66401383 72961478 79484041 85851456 91943136 97629946 102759449 107131942
57076 107131942 110491614 112563021 113127049 112087763 109486143 105465782 100230972 94023765
57068 94023765 87113035 79779043 72292195 64894800 57789301 51130574 45022301 39519718
57060 39519718 34637486 30358732 26643791 23439295 20686354 18325523 16299202 14554253
57052 14554253 13045095 11734867 10593899 9597676 8725892 7961861 7291388 6701848 6182146
57043 6182146 5722911 5316225 4955278 4634329 4348547 4093488 3864899 3659299 3474545
57034 3474545 3309508 3163267 3034911 2924084 2831356 2757765 2703981 2669913 2654795 2656865 2672141
57023 2672141 2693160 2709114 2707725 2678000 2613064 2512613 2383716 2238466 2089193 1944691
57013 1944691 1809918 1687714 1579622 1485481 1403599 1331961 1269028 1213516 1164209 1120271 1081188
57002 1081188 1046167 1014064 984159 956518 931303 908129 886425 866066 847335 830528 815908
56991 815908 803801 794458 788037 784844 785267 789223 795950 804612 814754 825788 836200 843599 845494
56978 845494 840028 826448 805470 779229 750536 721881 694841 670024 647446 627253 610181 597082
56966 597082 587955 581918 578374 577780 581048 588663 600749 617410 638270 661802 685686 707716 725888
56953 725888 737798 740807 733289 715624 689933 659111 626112 593638 563904 538351 517484 501107
56941 501107 488903 480929 477511 478820 484792 495477 511120 531830 557436 587547 621221 656355
56929 656355 689822 718421 739304 749528 746268 728415 697785 658274 614074 568886 525854 486979
56917 486979 452569 422096 395626 373797 356530 342647 330903 320725 311769 303566 295974 289411
56905 289411 284186 279961 276225 272985 270637 269373 269037 269483 270847 273501 277765 283689 291281 301079 314267
56890 314267 331756 353287 377838 404757 433837 464198 493766 520115 541305 555742 561974 559382
56878 559382 548900 532667 513157 492868 474297 459377 448814 442349 439727 441180 447142 458087
56866 458087 474805 498425 529864 569418 616936 671972 733237 797886 861671 919817 967566
56855 967566 1000092 1012918 1003574 973340 927224 872029 814271 759230 710761 671097 640973 620499
56843 620499 610111 610547 622157 644759 678402 724016 783097 856610 943955 1042494 1147597 1252898
56831 1252898 1350554 1431709 1487530 1510799 1497601 1448654 1369833 1271173 1164125 1058412 960599
56820 960599 874680 802975 746185 703507 673661 655913 650004 655720 673178 703170 746347 801896
56808 801896 867225 938605 1011481 1080357 1139071 1181421 1201520 1194548 1158810 1097774 1019501 933459
56796 933459 847558 767343 696343 636211 586985 547997 518675 498508 486776 482722 485861 495901
56784 495901 512607 535885 565560 600623 638667 676125 708883 732737 743922 739950 720341 686733
56772 686733 642529 592228 540410 490669 445226 405230 371050 342319 318234 298159 281802
56761 281802 268726 258045 248800 240441 232829 226010 220139 215292 211178 207217 203017 198599 194150 189907
56747 189907 186344 183995 182800 181942 180668 179016 177508 176384 175520 174841 174391 173994 173216 171799 169961 168194
56731 168194 166876 166106 165790 165762 165852 165912 165953 166205 166876 167811 168627 169278 170232 171833 173764 175441 176760 178092
56713 178092 179694 181529 183582 185850 188003 189464 189961 189772 189434 189456 190217 191736 193584 195346 197073 198923
56697 198923 200533 201340 201485 201763 202565 203429 203866 204111 204830 206403 208735 211458 214113 216361 218158 219547
56681 219547 220398 220641 220596 220631 220593 220114 219364 218870 218601 217938 216683 215405 214621 214245 214038 213938 213749 213157 212357
56662 212357 212042 212448 213003 213219 213329 213683 214099 214255 214202 214127 214056 214071 214287 214404 213965 213368 213902 216285 219816
56643 219816 223360 226419 228687 229503 228649 227093 225967 225218 224082 222564 221488 221242 221240 220619 218892 216038
56627 216038 212500 209008 205903 202811 199335 195824 192998 191156 190183 190011 190468 190997 191119 190971 190932 191023 191156
56610 191156 191585 192435 193161 193126 192449 191660 190875 190071 189761 190499 191875 192944 193549 194359 195629 196834 197625 198311
56592 198311 199123 199731 199781 199387 198884 198591 198910 200115 201823 203135 203458 202874 201774 200612 200006 200424 201588
56575 201588 202724 203543 204481 205798 207058 207864 208647 210211 212674 215307 217441 219275 221658 225174 229629
56560 229629 234507 239666 245271 251126 256604 261337 265468 269005 271462 272542 272694 272533 272149 271449 270750
56545 270750 270408 270184 269556 268494 267396 266521 265893 265461 264922 263767 261987 260277 259037 257667 255528 253013
56529 253013 250873 249020 246967 245017 243987 243986 244487 245341 246613 247665 247702 247166 247313 248173 248191 246313 243317
56512 243317 240595 238517 236638 234777 233242 232428 232563 233541 234811 235829 236655 237577 238274 238151 237533 237625 239000
56495 239000 240885 242247 242866 243093 243235 243520 244043 244439 244168 243303 242383 241399 239723 237307 235110 233926 233519
56478 233519 233323 233247 233324 233222 232734 232252 232173 232248 232025 231600 231495 231975 232794 233447 233549 233211 233064 233546 234245 234394
56458 234394 233947 233541 233420 233156 232532 231957 231834 232198 233045 234279 235222 235090 234214 233912 234839 236253 237258 237872
56440 237872 238452 238929 239200 239503 239867 239864 239479 239497 240450 241768 242566 242714 242623 242533 242626 243314 244816 246773 248701
56421 248701 250392 251596 251913 251426 250927 251039 251571 252025 252164 251861 251104 250506 250987 252485 253788 254160 254308
56404 254308 255123 256313 257069 257367 257757 258368 258917 259278 259382 259007 258268 257756 257603 257028 255518 253874 253289 253886
56386 253886 254953 256140 257568 259110 260431 261572 262864 264450 266335 268564 270844 272490 273193 273404 273482
56371 273482 273144 272263 271497 271405 271694 272139 273458 276236 279651 282396 284360 286246 287988 288877 289069 289666 291201
56354 291201 293088 294683 295957 296958 297563 297987 298786 300073 301302 302048 302490 302983 303583 304201 304904 305917
56338 305917 307452 309390 311089 311808 311598 311414 312028 313209 314329 315339 316724 318824 321651 325043 328692
56323 328692 332304 335907 339537 342565 344193 344857 346092 348524 351024 352500 353435 354767 356384 357906 359977
56308 359977 363386 367574 371381 374726 378222 381659 384427 387085 390938 396039 401051 405204 409114 413469
56294 413469 418108 422706 427392 432341 437537 443118 449307 455929 462660 469663 477264 485146 492674 499986
56280 499986 507908 516831 526399 536269 546454 557003 568050 580072 593400 607656 622382 637980
56268 637980 655224 674108 694098 715364 738848 765124 794024 825388 859542 897154 939236
56257 939236 987072 1041551 1102872 1171474 1248746 1336082 1433780 1541617 1659798 1788328 1926120
56246 1926120 2071844 2225027 2384945 2549017 2713643 2876168 3034446 3184804 3322109
56237 3322109 3441877 3540974 3616474 3665548 3686783 3680419 3647276 3588731 3507691 3408133 3293486
56226 3293486 3166506 3030487 2889002 2744419 2598199 2452738 2311336 2176076 2047228
56217 2047228 1924954 1810091 1702883 1602545 1508711 1422086 1343145 1271361 1206126 1147223
56207 1147223 1093956 1044993 999610 958070 920482 886301 855253 827595 803117 780925 760540
56196 760540 742229 726079 711725 699028 687905 677517 666933 656659 648143 641706 636365 631669
56184 631669 628079 625356 622378 619015 616531 615545 615078 614148 612864 611467 609835 608496 608611 610296 612344
56169 612344 614138 616365 619338 622238 624779 628106 633201 639747 647232 655796 665252 674675 683770 693422
56155 693422 704319 716402 730132 746689 766203 787420 809928 835228 864898 899314 939016
56144 939016 985587 1040150 1102588 1173286 1253993 1345670 1446767 1554545 1666509 1779357 1888197
56133 1888197 1988499 2078017 2156054 2222349 2277922 2325480 2367310 2403464 2432822 2454684 2468372
56122 2468372 2472725 2467353 2453341 2431749 2402605 2366122 2323218 2273535 2214449 2143498 2060727 1967745
56110 1967745 1866278 1759247 1651747 1549015 1454118 1368671 1294369 1232102 1180651 1137907
56100 1137907 1102782 1074781 1052743 1035359 1022096 1012476 1005308 999634 995499 992886 991051 989758 989844
56087 989844 991565 993832 996150 999822 1006009 1013891 1021953 1029776 1037576 1045449 1054126 1064849 1077401 1089911
56073 1089911 1101626 1114042 1128138 1142620 1156371 1170499 1186206 1202601 1218481 1234409 1251103
56062 1251103 1267504 1282403 1296400 1310381 1323683 1335559 1346835 1358379 1369615 1380264 1391667
56051 1391667 1404612 1417870 1430770 1445085 1462276 1481005 1499628 1519051 1540709 1563796 1587011
56040 1587011 1611095 1637096 1663986 1690608 1718091 1747789 1778666 1809268 1840418 1873453 1907791
56029 1907791 1942788 1979918 2020381 2062632 2104987 2148413 2193981 2240088 2285295 2331540 2381206
56018 2381206 2433395 2486399 2541426 2600328 2662052 2725028 2790709 2861014 2934768 3010525 3090338
56007 3090338 3176507 3267138 3359371 3454673 3556416 3664502 3776964 3894648 4019604 4151089
55997 4151089 4287882 4432303 4587178 4751156 4921900 5101393 5293066 5496416 5709839
55988 5709839 5936134 6179646 6440637 6718157 7015638 7337873 7685496 8058413 8461390
55979 8461390 8900032 9375044 9887228 10444253 11055489 11724676 12455586 13260437 14154568
55970 14154568 15148255 16253522 17494383 18901095 20500750 22325450 24425376 26864408
55962 26864408 29712409 33057636 37021674 41749789 47397503 54147237 62235437 71954252
55954 71954252 83649895 97754758 114817354 135464625 160296350 189726613 223722576
55947 223722576 261457031 301110254 340055307 375278968 403644043 421969374 427419932
55940 427419932 418476448 395902455 362787513 323486700 282232253 242267880 205666949
55933 205666949 173490740 146019797 123017110 103990450 88367305 75571161 65068517
55926 65068517 56411767 49244888 43276056 38263331 34020205 30407486 27310317 24631310
55918 24631310 22299374 20265088 18483379 16910921 15517302 14283827 13190104 12212558
55910 12212558 11335067 10549306 9844212 9205134 8623107 8095228 7615699 7175220 6768921
55901 6768921 6396400 6054159 5735943 5439995 5168137 4918134 4684432 4465806 4264724
55892 4264724 4079672 3905643 3741870 3591598 3454287 3325358 3203890 3093437 2994630 2903660
55882 2903660 2818797 2741816 2671973 2604687 2537330 2470796 2404443 2335224 2263062 2191795 2123355
55871 2123355 2055775 1988051 1922218 1859331 1797900 1737684 1681002 1629056 1580687 1535587 1494857
55860 1494857 1457545 1420470 1382487 1345384 1309908 1274615 1239446 1206669 1177142 1149075 1121526
55849 1121526 1095847 1072633 1050294 1027680 1005281 983065 959952 936193 913548 892461 871684
55838 871684 851100 832047 814428 796462 777971 761031 746727 733899 721728 710861 701364 692215
55826 692215 683452 676269 670456 664237 657127 650343 643969 636419 627278 618053 609486 600730 591758 584010
55812 584010 577994 572757 568317 566012 565814 565973 566188 568552 574436 582773 592231 602615 613182 622043
55798 622043 628344 632942 635995 635961 631827 624226 613639 599750 583521 567621 553767 541578 530782
55785 530782 522281 516097 510628 505144 500804 497962 494629 489244 483283 479650 479971 484656 493993 507672
55771 507672 524267 542185 560049 575460 584937 586110 578949 564427 543542 518253 491566 465669
55759 465669 441204 418906 400277 385804 374147 363983 355334 348319 342176 336329 331014 326064 320542
55746 320542 314347 308716 304410 300870 297803 296037 295992 296810 297730 298816 299651 298971 296441 293259 290196 286674
55730 286674 282526 278907 276448 274120 270967 267398 263817 259629 254704 250229 246980 244293 241840 240803
55716 240803 242024 244546 247315 250882 256012 262014 267878 273771 279905 285073 287841 288298 287299 284934 280960
55701 280960 275820 270053 263595 256669 250303 244926 239615 233820 228588 224826 221678 218099 214881 213464
55687 213464 213662 214208 214839 216257 218616 221530 225119 229691 234720 239326 243417 247426 251329 254722 257319
55672 257319 258591 257705 254710 251001 247752 244699 241337 238273 236276 234980 233774 233131 233837 235610 237743
55657 237743 240388 243991 248136 252137 256129 260362 264109 266478 267662 268147 267344 264395 259799 254882 250036
55642 250036 244699 238695 232334 225610 218488 211658 205849 200673 195263 189704 184758 180566 176756 173452
55628 173452 171026 169106 167001 164869 163398 162506 161424 159824 157874 155412 152209 148904 146654 145750 145373
55613 145373 144632 143210 141214 139129 137680 137071 136636 135782 134803 134087 133199 131576 129582 127909 126504 125071
55597 125071 124037 123899 124026 123282 121604 119930 118854 118358 118577 119695 121178 122067 121993 121287 120383 119734 119779
55580 119779 120189 119725 117819 115732 115161 116235 117917 119733 121828 123827 125046 125577 125937 125991 125463 125174
55564 125174 126328 128720 130974 132389 133311 133909 134046 134196 134946 135593 134833 133010 132066 132899 134222 134585 134088
55547 134088 133466 132746 131706 130696 130235 130487 131654 134089 137404 140275 141859 142856 144568 147240 149863
55532 149863 151281 151074 149576 147401 144926 142223 139485 137176 135381 133434 130811 128092 126284 125392 124518
55517 124518 123243 122030 121239 120609 119830 118888 117673 115944 113833 111839 110200 108820 107723 106984 106269 105178
55501 105178 104001 103431 103544 103734 103634 103367 102912 101958 100428 98504 96179 93520 91278 90420 90983 92106
55485 92106 93196 94342 95622 96781 97682 98378 98797 98981 99423 100389 101175 100974 100254 100149 100661 100711 100037 99657
55467 99657 100164 100814 100807 100375 100059 99859 99678 99784 100267 100742 101037 101545 102484 103411 103821 103611 102799 101483 100272
55448 100272 99941 100399 100752 100648 100689 101277 101981 102426 102844 103267 103128 102253 101425 101253 101209 100419 98890 97333 96332
55429 96332 96200 97110 98813 100625 102067 103074 103403 102642 101149 100091 99986 100060 99667 99497 100516 102382 103854
55412 103854 104328 104119 103679 103406 103894 105384 107043 107619 106867 105679 104809 104087 103002 101496 99938 98618
55396 98618 97513 96476 95557 95065 95216 95771 96290 96652 97022 97350 97356 97056 96805 96723 96583 96454 96886 98134 99653
55377 99653 100655 100797 100126 98760 96982 95272 93973 93163 92948 93514 94703 96009 97120 98075 98849 99357
55361 99357 99923 101042 102456 103235 103134 103141 104162 105798 107005 107464 107663 108032 108541 108952 109017 108615 107962 107391
55343 107391 106803 105805 104552 103761 103561 103040 101526 99670 98587 98426 98557 98744 99296 100192 100891 101060 100949
55326 100949 100908 100921 100705 100083 99267 98861 99335 100424 101341 101713 101875 102081 101979 101315 100662 100883 102057 103415
55308 103415 104165 104069 103398 102668 102240 101954 101344 100377 99607 99412 99491 99381 99116 99002 99197 99796 100972 102598 104078
55289 104078 104921 105194 105165 104930 104676 104816 105390 105757 105387 104621 104231 104580 105577 107022 108436 109034 108508 107585
55271 107585 107209 107426 107645 107737 108190 109282 110720 112102 113280 114225 114882 115189 115052 114429 113581 112973 112681 112265
55253 112265 111520 110929 110976 111360 111400 110930 110318 109811 109346 108802 108034 106854 105378 104183 103746 103914 104223 104369
55235 104369 104046 102863 100962 99349 98949 99528 100117 100225 100044 99764 99467 99591 100783 103083 105730 107814
55219 107814 108795 108513 107231 105677 104618 104322 104635 105353 106178 106575 106239 105614 105490 106048 106696 106794 106219 105367
55201 105367 104865 105116 105827 106232 106112 106233 107292 108808 109637 109308 108276 107137 106292 106128 106698 107263 106966
55184 106966 105964 105188 104954 104627 103819 103060 102957 103380 103989 104920 106382 107940 108777 108586 107842 107305 107524 108651
55166 108651 110385 112080 113153 113443 113166 112607 112023 111747 112077 112876 113454 113203 112443 112265 113242 114603 115119
55149 115119 114582 113801 113235 112437 111035 109537 108754 109008 110194 111968 113432 113425 111857 110222 109999 110954 111831
55132 111831 112192 112575 113106 113167 112645 112449 113385 115192 117061 118590 119752 120342 119975 118565 116606 114902 114038
55115 114038 113998 114276 114389 114176 113646 112919 112403 112579 113342 113930 113853 113465 113284 113261 113206 113378 114044 114892 115569 116360
55095 116360 117587 118752 119197 119295 119920 120924 121210 120444 119595 119543 120030 120384 120461 120469 120490 120630 121181 122196 123234
55076 123234 123765 123588 122807 121744 120878 120403 119895 118992 118326 119058 121305 123744 125033 125079 124669 124460 124622 124979
55058 124979 125137 124849 124462 124595 125257 125790 125878 126036 126741 127572 127600 126312 123934 121187 118923 117644 117088 116639
55040 116639 116227 116381 117242 118084 118193 117743 117430 117566 117885 117954 117477 116491 115566 115536 116736 118615 120275 121143
55022 121143 121060 120133 118765 117531 116708 116159 115817 115910 116459 116954 116880 116332 115788 115504 115467 115722 116346 117142 117680
55003 117680 117744 117592 117679 118145 118631 118708 118468 118498 119142 120112 121029 122026 123352 124716 125620 126192 126998 128022 128556
54984 128556 128240 127626 127463 127887 128534 128995 128992 128540 128108 128208 128749 129174 129306 129482 129853 130195 130564 131381 132622
54965 132622 133653 134257 135096 136646 138338 139365 139745 139955 140021 139738 139429 139608 140101 140285 140084 139974 139947 139304
54947 139304 137730 135939 134829 134438 134165 133764 133609 134052 134968 136090 137394 138852 140059 140589 140727 141330
54931 141330 142790 144653 146593 149200 153169 158092 162850 167103 171617 177075 183238 189449 195286 200411
54917 200411 204294 206402 206461 204553 201302 197768 194472 190532 184595 176783 168906 162503 157521 153295 149872
54902 149872 147653 146380 145389 144499 143965 143833 143936 144281 144863 145357 145535 145835 146934 148866 150957 152584 153614
54885 153614 154308 155170 156804 159569 163451 168371 174340 181057 187683 193404 197993 201573 204189 205935 207038
54870 207038 207274 205628 201227 194586 187424 181184 176080 171464 166717 161720 156815 152462 148845 145798
54856 145798 143153 140954 139257 137958 136902 135959 134917 133653 132493 131942 131819 131146 129310 126936 125211
54841 125211 124624 124829 125393 126150 126902 127270 126941 125953 124758 124029 124154 124893 125827 127109 129190 131689 133268
54824 133268 133066 131722 130510 129933 129677 129446 129203 128913 128624 128625 129049 129593 130026 130625 131640 132717 133396 133827
54806 133827 134427 135171 135831 136568 137538 138214 137889 136780 135917 135976 136807 138020 139334 140337 140615 140276 139904 139876
54788 139876 140135 140641 141540 142803 144054 144839 144884 144228 143378 143138 143930 145451 147329 149766 153055 156801 160337
54771 160337 163792 168048 173643 180255 187207 193900 199773 204505 208372 211899 215003 216874 216809 214777 211143
54756 211143 206225 200212 193239 185563 177864 171174 166111 162355 159235 156606 154689 153325 152041 150752
54742 150752 149839 149556 149812 150454 151224 151600 151284 150787 150999 152220 154146 156659 159983 164097 168668 173571
54726 173571 178891 184400 189640 194543 199368 204040 208113 211364 213763 214848 213842 210448 205021 197977
54712 197977 189732 181187 173516 167344 162687 159591 157998 157041 155475 153097 150890 149515 148514 147288
54698 147288 146005 145085 144520 144075 143551 142621 141138 139831 139793 140910 141735 141374 140531 140093 139743 138873 137973 137954
54680 137954 138612 138902 138418 137652 137012 136475 136095 135962 135692 134757 133375 132437 132456 133112 133890 134611 135278 135827 136234
54661 136234 136543 136724 136702 136543 136417 136434 136628 136951 137177 137051 136694 136541 136752 137080 137506 138442 139938 141266 141836
54642 141836 142035 142475 142858 142404 141163 139984 139255 138540 137609 137026 137299 138005 138200 137438 136108 134990 134684
54625 134684 135316 136574 138019 139319 140185 140327 139769 139041 138770 139105 139738 140329 140635 140451 139806 139097 138667 138368
54607 138368 137942 137586 137688 138128 138514 139011 140137 141608 142189 141180 139480 138626 139094 140051 140538 140367 139922
54590 139922 139556 139311 138974 138382 137776 137759 138667 140079 141157 141479 141335 141216 141331 141610 141859 141732 140814 139108
54572 139108 137350 136510 136870 137780 138398 138466 138240 137921 137553 137386 137866 139024 140103 140168 139081 137646 136751 136574
54554 136574 136741 137013 137562 138576 139913 141306 142767 144525 146631 148821 150791 152359 153367 153719 153647 153618
54538 153618 153786 153783 153353 152913 153072 153751 154190 153862 152938 151855 150803 149799 148908 148174 147516 146864 146218 145490
54520 145490 144532 143435 142626 142476 142975 143861 144928 146028 146884 147096 146425 145127 143952 143637 144273 145265 146045
54503 146045 146637 147323 148017 148354 148247 147941 147581 147164 146925 147293 148348 149664 150731 151223 150929 149922 148830
54486 148830 148420 148723 149058 149051 149124 149767 150825 151846 152677 153414 154154 155136 156703 158771 160645 161713 162056 162127
54468 162127 162237 162618 163498 164611 165088 164421 163253 162654 162819 163091 163075 163113 163588 164317 164796 164751 164374 164215 164725
54449 164725 165691 166257 165802 164622 163417 162318 160944 159277 157881 157100 156548 155654 154492 153772 154121 155403
54433 155403 156743 157254 156818 156085 155626 155326 154784 154062 153686 154002 154862 155891 156779 157326 157494 157461 157455 157535 157604 157531
54413 157531 157185 156590 156217 156777 158381 160184 161236 161494 161586 161853 162190 162667 163581 164784 165615 165748 165647 165903
54395 165903 166534 167232 167902 168568 169029 169095 169060 169495 170499 171504 171993 172182 172717 173812 174959 175527 175395 174876
54377 174876 174333 174083 174417 175323 176300 176990 177907 180008 183385 186988 189923 192499 195565 199297 203167 206745
54361 206745 209940 212579 214330 215029 214696 213353 211169 208639 206196 203782 201166 198443 195816 193132 190243
54346 190243 187567 185571 183777 181161 177702 174742 173469 173629 174133 174352 174361 174323 174219 173972 173454 172526 171372
54329 171372 170551 170348 170269 169598 168396 167580 167974 169517 171394 172671 172777 171665 169735 167617 165922 165066
54313 165066 165152 165891 166762 167405 167857 168333 168838 169126 168939 168156 166688 164550 162211 160667 160713 162057 163476
54296 163476 164086 164207 164726 165869 167116 168140 169140 170095 170368 169518 168130 167321 167603 168601 169692 170515 170980
54279 170980 171199 171417 171723 171912 171870 171930 172521 173592 174704 175544 176013 176008 175618 175403 175886 176718 176963 176410 176057
54260 176057 176947 178940 181017 182540 183745 185051 186328 186942 186354 184570 182139 179826 178223 177454 177167
54245 177167 176893 176526 176398 176829 177716 178748 179857 181062 182009 182119 181333 180236 179329 178645 178286 178743 180213
54228 180213 182073 183532 184504 185353 186069 186251 185689 184489 182787 180829 179060 177614 175996 173875 171967
54213 171967 171419 172448 174223 175916 177149 177587 177017 175949 175315 175342 175430 175275 175251 175442 175145 173946 172609
54196 172609 172243 173007 174181 175158 175800 176080 175962 175597 175203 174785 174298 173989 174242 175009 175637 175456 174474 173376
54178 173376 172764 172532 172223 171866 171987 172687 173361 173663 174063 174826 175129 174196 172845 172691 173950 175286 175865 176203
54160 176203 176684 176663 175826 175196 175732 176722 176733 175629 174600 174442 174797 174988 174784 174317 173885 173883 174424 175026 175124 174837
54140 174837 174787 175231 175799 176091 176111 176044 175937 175758 175666 176104 177500 179708 181843 183033 183396 183844 184867 185998
54122 185998 186655 186908 187158 187623 188579 190540 193652 197338 201046 204981 209561 214571 219504 224496 230286
54107 230286 237330 245439 254124 262809 270816 277539 282529 285201 284860 281487 276177 270262 264264 258073
54093 258073 251741 245494 239306 233207 227746 223397 219636 215401 210486 205867 202589 200895 200391 200437 200348
54078 200348 199769 198992 198552 198576 198871 199395 200070 200343 199650 198240 196887 195876 194933 194046 193564 193526 193645 194018
54060 194018 195020 196454 197637 198444 199360 200308 200464 199689 199172 200049 202126 204568 207106 209891 212772 215585
54044 215585 218668 222372 226388 230220 233986 238091 242485 246951 251751 257130 262420 266643 269970 273672
54030 273672 278483 283905 289330 294925 300829 306205 309906 311835 312988 314257 315719 317054 318107 318820
54016 318820 318967 318276 316711 314428 311478 307727 303094 297816 292384 287198 282265 277217 271667 265647 259749
54001 259749 254785 251209 248821 247019 245331 243675 242171 240835 239452 237683 235242 232083 228541 225289
53987 225289 222978 221775 221253 220852 220471 220490 221228 222595 224335 226328 228413 230194 231503 233007 235840 240571
53971 240571 246949 254726 264084 274887 286002 295905 303736 309295 312266 312055 308359 301540 292449 282206
53957 282206 272109 263302 256389 251444 248185 245947 243809 241295 238855 237308 236978 237792 239897 243416
53943 243416 247713 251696 255043 258460 262519 266900 271096 275240 279719 284382 288682 292378 295697 298973
53929 298973 302445 306200 310011 313354 315885 317805 319655 321875 324687 328189 332338 337043 342412 348744
53915 348744 356132 364262 372643 380853 388530 395526 402133 408803 415417 421219 425564 428345 429596 429332
53901 429332 428101 426985 426426 425556 423291 419704 415607 411192 405994 400013 393807 387343 379774 370782 361417
53886 361417 352999 345654 338511 331012 323455 316393 310041 304327 299100 294108 289038 283812 278822 274760
53872 274760 272085 270607 269537 267973 265414 261940 258046 254357 251352 249130 247418 245841 244195 242460
53858 242460 240707 239091 237761 236643 235433 233924 232209 230367 228244 225939 224333 224510 226432 228598
53844 228598 229364 228449 226914 225867 225484 225260 224866 224567 224826 225678 226648 227329 227808 228308 228638 228375 227617 227076
53826 227076 227244 227859 228420 228899 229522 230144 230358 230122 229766 229386 228814 228306 228671 230300 232526 234437 236094
53809 236094 238381 241777 245870 250105 254406 258789 262943 266703 270632 275535 281392 287245 292321 296932
53795 296932 302050 308164 314789 320927 325794 329133 331091 332060 332588 333252 334324 335455 335811 334731 332272
53780 332272 329019 325380 321211 316176 310313 304127 298146 292539 287162 281905 276885 272269 268035 264062
53766 264062 260434 257465 255335 253870 252781 251937 251192 250147 248425 246115 243690 241522 239729 238429 237685
53751 237685 237194 236453 235374 234369 233663 233036 232466 232510 233475 234633 234969 234528 234307 234811 235469 235655 235571 235726
53733 235726 236155 236672 237430 238568 239601 239869 239519 239404 239963 240838 241710 242815 244282 245601 246370 247140 248824
53716 248824 251347 253586 254714 255114 255763 257206 259337 261770 264100 266092 267963 270328 273561 277361 281202
53701 281202 284995 288941 292877 296265 298912 301306 304050 307265 310730 314277 317682 320355 321625 321490
53687 321490 320794 320419 320453 320397 320023 319636 319388 318832 317571 316125 315557 316190 317221 317789 317928 318155 318594 319057
53669 319057 319648 320573 321385 321151 319598 317549 315954 314903 313978 313195 313084 313914 315224 316252 316602 316518 316647
53652 316647 317533 319092 320561 321115 320707 320197 320602 322199 324407 326457 328071 329470 330897 332344 333676
53637 333676 334773 335502 335856 336317 337805 340848 344927 349008 352690 356400 360472 364589 368364 371970 375750
53622 375750 379465 382421 384264 385239 385745 386015 386323 387103 388604 390633 392819 395039 397383 399870 402398
53607 402398 404961 407729 410856 414352 418198 422433 426973 431387 435034 437575 439284 440811 442592 444501
53593 444501 446013 446674 446430 445540 444268 442752 441193 439975 439358 439105 438656 437670 436179 434195 431564 428374
53577 428374 425239 422860 421472 420881 420783 420698 419924 418076 415642 413541 412092 410814 409251 407553 406124 405147
53561 405147 404659 404647 404791 404464 403414 402292 402083 403034 404394 405251 405438 405559 406193 407158 407682 407371 406874 407236
53543 407236 408632 410115 410839 411194 412420 415256 419289 423541 427401 430957 434675 438923 443774 449204 455339
53528 455339 462353 470118 478220 486472 495286 505311 516725 529000 541381 553541 565772 578607
53516 578607 592289 606707 621865 638201 656207 675794 696397 717763 740309 764476 789971
53505 789971 815826 841177 865787 889916 913829 937459 960541 983022 1005223 1027484 1049806
53494 1049806 1072036 1094273 1116717 1139165 1161001 1181801 1201667 1220973 1240127 1259577 1279553
53483 1279553 1299639 1319051 1337553 1355759 1374287 1393090 1411815 1430358 1448600 1466069 1482376
53472 1482376 1497719 1512367 1525800 1536881 1544785 1549338 1550623 1548836 1544493 1538199 1530089 1519914 1507752
53459 1507752 1494194 1479667 1464050 1447233 1429733 1412417 1395638 1378881 1361206 1342035 1321585
53448 1321585 1300684 1280127 1260107 1240201 1219788 1198505 1176521 1154600 1133778 1114811 1097959
53437 1097959 1083354 1071268 1061747 1054232 1047999 1042988 1039770 1038577 1038662 1038859 1038600 1038334 1039033 1041436 1045675
53422 1045675 1051501 1058734 1067377 1077440 1088923 1102058 1117237 1134461 1153152 1172746 1193257 1214939
53410 1214939 1237676 1261137 1285390 1310858 1337755 1366011 1395750 1427325 1460806 1495889 1532502
53399 1532502 1571139 1612387 1656409 1703052 1752138 1803408 1856430 1910761 1966143 2022421 2079443
53388 2079443 2137108 2195341 2253927 2312528 2370849 2428524 2484867 2539166 2591383 2642114 2691514
53377 2691514 2738558 2781816 2820792 2856045 2887961 2915849 2938501 2955455 2967418 2975377 2979414 2978490
53365 2978490 2971307 2957212 2936279 2908824 2875205 2835978 2791859 2743448 2691322 2636522 2580613
53354 2580613 2524905 2469697 2414506 2359000 2303545 2248980 2196167 2145694 2097654 2051533 2006589
53343 2006589 1962569 1919898 1878872 1838874 1798870 1758768 1719757 1682971 1648242 1614725 1582492
53332 1582492 1552696 1526093 1502114 1479777 1458902 1439925 1422932 1407512 1393337 1380271 1367915
53321 1367915 1355579 1342770 1329382 1315452 1301110 1286777 1273010 1260097 1248087 1237193 1227728
53310 1227728 1219657 1212594 1206427 1201520 1198181 1196322 1195859 1197108 1200392 1205428 1211440 1217942 1225283 1234336
53296 1234336 1245634 1258841 1273229 1288687 1306014 1326003 1348518 1372785 1398332 1425109 1452817
53285 1452817 1480688 1508004 1534428 1559778 1583908 1606795 1628231 1647440 1663630 1677006 1688551
53274 1688551 1698567 1706082 1710028 1710232 1706860 1699712 1688917 1675692 1661385 1645910 1628049 1607207
53262 1607207 1583985 1558963 1531929 1502793 1472499 1442350 1412752 1383205 1353308 1323228 1293225
53251 1293225 1263252 1233271 1203650 1175019 1147815 1122102 1097673 1074143 1050976 1027633 1003834
53240 1003834 979623 955215 930916 907208 884589 863165 842628 822874 804421 787860 773015
53229 773015 759127 745858 733654 722991 713659 704986 696431 687710 678691 669463 660273 651110 641478
53216 641478 630800 618876 605823 591837 577288 562808 548970 535980 523844 512610 502217
53205 502217 492378 482952 474202 466355 459112 451969 444800 437697 430447 422708 414579 406419 398158 389453
53191 389453 380581 372439 365392 358763 351923 345289 339667 335012 330580 326146 322288 319314 316566 313148
53177 313148 309017 304971 301714 299243 297074 294763 292159 289355 286574 284094 282156 280834 279905 278922 277609
53162 277609 276216 275325 275186 275403 275414 275171 275094 275387 275630 275182 273829 271984 270381 269604 269744 270386 270990 271360
53144 271360 271645 271940 272035 271658 270733 269327 267620 266053 265260 265539 266498 267467 268105 268456 268658 268953 269770 271353
53126 271353 273368 275278 277075 279190 281686 284013 285747 287161 288802 290758 292580 293783 294253 294258 294114
53111 294114 293798 292923 291324 289524 288297 287791 287470 286902 286166 285395 284373 282830 280762 278324 275806 273859
53095 273859 273248 273997 275190 275984 276438 276954 277298 276788 275291 273499 272232 271836 272152 272676 272768 272064 270762
53078 270762 269329 268080 267244 267132 267750 268403 268240 267232 266158 265585 265349 265121 264953 264898 264468 262956 260266
53061 260266 257171 254687 253309 252820 252687 252589 252592 252914 253622 254608 255712 256768 257630 258358 259338 260975 263227
53044 263227 265604 267652 269328 270762 271789 271913 270888 269272 268145 268096 268610 268705 268080 267202 266321 265023
53028 265023 263113 261451 261222 262476 263965 264513 264108 263527 263328 263506 263857 264304 264812 265258 265477 265418 265145 264687
53010 264687 263985 263117 262520 262749 263866 265214 265982 265958 265663 265795 266612 267796 268822 269460 269933 270471 270857 270650
52992 270650 269876 269183 269133 269670 270435 271253 272006 272364 272131 271757 272010 273111 274515 275614 276394 277262 278449 279741
52974 279741 280746 281332 281745 282300 283066 284060 285633 288227 291561 294432 295714 295400 294380 293389 292448 291211
52958 291211 289494 287481 285664 284523 284022 283540 282498 280971 279487 278441 277938 277971 278357 278587 278124 276855
52942 276855 275044 272980 270952 269323 268261 267525 266862 266425 266365 266250 265509 264384 263749 263920 264248 264098 263671
52925 263671 263478 263538 263526 263478 263835 264778 265838 266295 265933 265337 265327 266090 267052 267695 268175 268808 269325 269175 268452 267842
52905 267842 267552 266896 265280 263198 261954 262526 264785 267553 269358 269456 268368 267309 267061 267531 268243 268908
52889 268908 269503 270186 271172 272417 273451 273872 273883 273845 273440 271948 269474 267190 266124 266265 267143 268637 270705
52872 270705 272874 274579 275764 276721 277610 278551 279872 281761 283814 285351 286105 286326 286350 286240 285691 284075
52856 284075 280935 276672 272411 268893 265864 262907 260312 258523 257125 255289 253137 251799 251866 252466 252250
52841 252250 250837 248935 247382 246515 246321 246724 247540 248398 248945 249228 249674 250529 251364 251496 250950 250639 251263 252308
52823 252308 252588 251699 250483 250006 250422 251063 251381 251564 252256 253839 256063 258326 260252 261881 263306 264293
52807 264293 264432 263573 262004 260196 258444 256769 255134 253693 252661 251875 250735 248952 247190 246455 246834
52792 246834 247417 247594 247739 248236 248504 247694 246034 244688 244479 245390 247207 249783 252509 254369 254956 254931 255100
52775 255100 255450 255511 255261 255067 254942 254431 253315 251958 250847 250067 249394 248711 248189 248161 248876 250230 251700 252684
52757 252684 253006 252958 252786 252411 251815 251460 251930 253225 254714 255823 256419 256542 256261 255950 256268 257455 259032
52740 259032 260588 262485 265207 268251 270403 271141 271144 271353 272125 273421 275119 276795 277783 277892 277700 277732 277777
52723 277777 277375 276589 275766 274883 273715 272438 271494 270939 270407 269686 268912 268200 267547 267095 267074 267432 267855 268161
52705 268161 268339 268256 267742 267048 266789 267276 268146 268829 269082 268968 268623 268242 268097 268341 268876 269511 270141 270674 270928
52686 270928 270725 270008 268809 267217 265452 263877 262792 262214 261919 261701 261603 261874 262673 263863 265185 266644
52670 266644 268556 271077 273791 275924 276871 276517 275215 273595 272257 271505 271422 272181 273984 276570 279166 281275
52654 281275 283239 285635 288317 290528 291800 292270 292165 291548 290637 289811 289075 287883 285820 283163 280567 278453
52638 278453 276910 275960 275671 276151 277618 280263 283802 287371 290156 292111 293808 295671 297521 298786 298908
52623 298908 297542 294696 290856 286884 283573 281288 280029 279674 279978 280400 280339 279760 279339 279632 280197 280035 278892
52606 278892 277650 277200 277389 277469 277180 276885 276868 277103 277635 278608 279869 281015 281923 282793 283552 283742 283217 282499
52588 282499 282133 282075 282020 282022 282358 283055 283975 285172 286728 288314 289354 289694 289725 289807 289893 289896 290082 290841 292179 293674
52568 293674 294842 295404 295280 294552 293531 292605 291812 290618 288415 285379 282673 281509 282014 283214 284131 284621
52552 284621 285025 285339 285166 284399 283553 283177 283213 283145 282709 282145 281781 281608 281384 281058 280898 281220 282073 283184 284182
52533 284182 284897 285478 286199 287149 288185 289170 290101 290918 291368 291237 290664 290020 289542 289213 288966 288812 288774 288866 289163
52514 289163 289772 290798 292475 295118 298634 302172 304731 306234 307559 309319 310953 311336 310020 307559 304771
52499 304771 302041 299357 296721 294367 292571 291313 290264 289215 288379 288034 288008 287892 287718 287917 288595 289358
52483 289358 290033 290951 292220 293301 293771 293995 294499 295069 295152 294875 294968 295786 297039 298471 300164 302077 303814
52466 303814 305077 306053 307204 308838 310863 312760 313949 314400 314692 315185 315402 314672 313063 311129 308995 306380
52450 306380 303431 300764 298567 296382 293897 291386 289199 287458 286478 286808 288438 290462 291940 292738 293164
52435 293164 293204 292612 291506 290451 289926 289917 289978 289633 288865 288229 288240 288683 288902 288735 288716 289267 290149 290956 291705 292733
52415 292733 294318 296597 299474 302485 305211 308048 312102 318050 325606 334337 344405 355905 367840
52402 367840 378389 386116 390570 391989 390818 387437 382015 374737 366312 357928 350390 343620 337284 331577
52388 331577 326994 323661 321315 319669 318384 317015 315543 314689 315120 316500 317874 318835 319733 320879 322262
52373 322262 324032 326497 329472 332288 334774 337652 341550 346013 349971 352892 355056 356801 358000 358389
52359 358389 358092 357626 357392 357376 357377 357454 357937 359039 360695 362876 365695 368940 371769 373361 373841 374230 375430
52342 375430 377595 380461 383852 387637 391489 395081 398562 402645 408067 414886 422335 429493 436196 443171
52328 443171 451201 460390 470355 480856 491863 503261 515020 527666 541980 557955 574497 590503
52316 590503 606013 621902 638631 655813 673011 690501 708926 728418 748402 768244 787847
52305 787847 807549 827674 848307 869282 890165 910298 929114 946420 962291 976757 989752
52294 989752 1001270 1011288 1019532 1025579 1029237 1030661 1030089 1027740 1023987 1019377 1014391 1009352 1004514 999911
52280 999911 995113 989620 983617 977975 973325 969538 966347 964046 963205 964007 966248 969746 974366 979834 985854
52265 985854 992288 999073 1006243 1014223 1023718 1034942 1047353 1060538 1074916 1091023 1108478 1126268
52253 1126268 1143788 1160956 1177562 1193252 1207991 1221712 1233569 1242471 1248508 1252980 1256694 1258963
52241 1258963 1258674 1255679 1250682 1244368 1237208 1229628 1221735 1213140 1203542 1193201 1182421 1170956 1158572
52228 1158572 1145923 1134141 1123519 1113238 1102583 1091907 1082125 1073652 1066228 1059575 1053828 1049242
52216 1049242 1045693 1042739 1040185 1038474 1038246 1039483 1041329 1042970 1044484 1046547 1049353 1052255 1054630 1056775
52202 1056775 1059622 1063684 1068590 1073694 1078841 1084410 1090765 1097885 1105450 1113010 1120053 1126142 1131108 1135003
52188 1135003 1137783 1139141 1138763 1136663 1133193 1128829 1123989 1118935 1113686 1108023 1101627 1094229 1085745 1076571
52174 1076571 1067776 1060615 1055527 1051697 1047859 1043494 1039156 1035803 1034010 1033654 1034116 1034835 1035828 1037553 1040099
52159 1040099 1042772 1044738 1045861 1046538 1046974 1047146 1047406 1048440 1050360 1052311 1053385 1053780 1054727 1057240 1061028
52144 1061028 1064666 1066858 1067541 1067674 1067960 1068113 1067512 1066158 1064529 1062860 1061228 1060178 1060519 1062470 1065721
52129 1065721 1070488 1077679 1087594 1099259 1111724 1125428 1141478 1159904 1179574 1199797 1221093 1244015
52117 1244015 1267891 1291278 1313362 1334495 1355547 1377143 1399461 1422336 1445326 1467882 1489652
52106 1489652 1510647 1531071 1551021 1570334 1588607 1605290 1619843 1632016 1641943 1649775 1655206 1657575
52094 1657575 1656538 1652399 1645669 1636510 1624865 1610966 1595434 1578969 1562197 1545741 1530140 1515651
52082 1515651 1502275 1489931 1478440 1467509 1457043 1447369 1438845 1431391 1424784 1419324 1415675 1414043 1414088
52069 1414088 1415793 1419813 1426616 1435675 1445940 1456780 1468129 1480109 1493002 1507397 1523759 1541797
52057 1541797 1560585 1579210 1597014 1613344 1627563 1639337 1648552 1654939 1658240 1658811 1657551 1654944 1650595
52044 1650595 1644043 1635693 1626449 1616665 1606046 1594586 1582869 1571182 1558885 1545192 1530269 1514941
52032 1514941 1499455 1483244 1466008 1448311 1430652 1412488 1392804 1371557 1349997 1329541 1310704
52021 1310704 1293165 1276469 1260437 1245103 1230464 1216404 1202946 1190521 1179711 1170454 1161736 1152363
52009 1152363 1141913 1130611 1118516 1105331 1090916 1075449 1059016 1041660 1024048 1007511 992940
51998 992940 979859 966959 953412 939401 925516 912010 898648 885016 870832 856027 840601
51987 840601 824463 807507 789871 772068 754831 738695 723537 708515 692747 676305 660350
51976 660350 646030 633527 622453 612861 605291 600013 596855 595774 596932 600048 604272 608863 613542
51963 613542 618073 622098 625575 628728 631201 631858 629919 625868 620795 615319 609697 604577 600901 599159
51949 599159 599265 601176 605235 611923 621540 634063 649159 666584 686791 710756 738757 769522 800911
51936 800911 831129 858806 882242 899338 908329 908210 898693 880494 855796 827653 798456 769118
51924 769118 739773 710755 682639 655826 630647 607758 587941 571365 557344 545068 534441
51913 534441 525990 519934 515688 512490 510220 509267 509689 511052 513086 515975 519662 523248 525387 525099 522117
51898 522117 516835 510114 502753 494829 485875 475969 466226 457859 451222 446174 442857 441402 441209 441406 441978
51883 441978 443814 447618 453363 460740 469467 479041 488781 498360 507840 516979 524885 530534 533361 533356 531017
51868 531017 527277 523113 518993 514930 511054 507687 504874 502330 500047 498504 498039 498384 499064 499934 500974
51853 500974 501768 501548 499761 496440 492030 486921 481149 474596 467447 460228 453306 446666 440441 435285 431762
51838 431762 429607 428130 427124 426834 427163 427661 428327 429664 431769 433965 435593 436632 437310 437584 437304 436497
51822 436497 435289 433880 432662 431932 431488 431034 430972 432042 434125 436240 437881 439386 440645 440621 438856 436437
51806 436437 434444 432319 429022 425254 423095 423532 425529 427554 429009 430005 430800 431817 433403 435130 435964
51791 435964 435407 434000 432526 431361 430818 431414 433286 435770 437931 439247 439657 439445 439314 440018 441568 443269
51775 443269 444815 446834 449960 453954 458259 462882 468066 473461 478440 482991 487498 491626 494173 494148 491425
51760 491425 486250 478824 469719 460131 451197 443283 436216 429908 424392 419558 415300 411812 409312 407595
51746 407595 406238 405214 404869 405235 405840 406420 407455 409577 412651 415845 418561 420952 423489 426375 429519
51731 429519 432762 435851 438382 440117 441268 442196 442871 442977 442630 442546 443239 444270 444674 443977 442521 440885
51715 440885 439394 438227 437589 437545 437973 438880 440511 442883 445461 447637 449428 451318 453445 455358 456642
51700 456642 457401 457896 458028 457455 456150 454597 453524 453540 454887 457258 459858 461801 462458 461441 458553 454093
51684 454093 449071 444682 441396 438800 436430 434466 433436 433477 434153 434873 435235 435075 434504 433984 434106 435190
51668 435190 437193 439997 443559 447639 451640 454952 457384 459040 459879 459683 458492 456841 455460 454934 455736
51653 455736 458299 462817 469019 476315 484106 491904 499218 505398 509469 510198 506839 500131 492206 484938
51639 484938 478493 471934 465016 458657 453565 449198 444513 439209 433783 428755 424427 421153 419203 418243
51625 418243 417400 416045 414343 412897 411930 410867 408732 405062 400395 395760 391745 388282 385201 382545 380307
51610 380307 378377 376916 376278 376331 376462 376610 377628 380090 383414 386916 391167 397257 405104 413626 422453
51595 422453 432240 443128 454041 463864 472225 478558 481518 480298 475916 470331 464727 459446 455159 453066
51581 453066 453932 457677 463954 472561 483200 495364 508611 522638 537094 551687 566437 581428
51569 581428 596268 610196 622770 634137 644632 654624 664952 677216 693225 714145 740101 770304
51557 770304 803445 838104 872940 906466 936711 961414 978757 987873 988686 981528 967144 946905
51545 946905 922604 895752 867057 836698 805132 773544 743420 715760 690780 668236 647770
51534 647770 628993 611566 595365 580388 566402 552948 539841 527488 516453 506828 498202 490108
51522 490108 482294 474693 467415 460763 455067 450460 446844 443897 441020 437525 433175 428436 423981 420064
51508 420064 416648 413942 412281 411400 410284 408051 404824 401574 399289 398446 399032 400709 402916 405090 407018
51493 407018 408944 411195 413712 416034 417799 419120 420342 421522 422361 422647 422521 422200 421671 420771 419429 417681
51477 417681 415591 413235 410625 407561 403796 399447 394991 390725 386578 382668 379537 377350 375255 372340
51463 372340 369065 366940 366627 367156 367333 367194 367482 368277 369001 369579 370819 373481 377592 382822 389060 396303
51447 396303 404408 413365 423608 435646 449409 464186 479085 493224 505601 515320 522203 526895
51435 526895 530094 531827 531655 529333 524876 518091 508529 496145 481887 467424 454276 443020 433191
51422 433191 424032 415511 408504 403750 400759 398228 395477 393028 391629 391255 391402 391859 392736 394004 395589
51407 395589 397743 400789 404513 408304 411968 415930 420471 425159 429343 432940 436464 440429 444986 450123
51393 450123 455949 462656 470291 478731 487967 498307 510196 523876 539419 557171 577898 602366
51381 602366 630884 663426 699978 740521 784783 832181 881786 931996 980354 1024090 1060945
51370 1060945 1089343 1108038 1116167 1113740 1101595 1080619 1051401 1014875 972890 927671 880752 832794
51358 832794 784418 736902 691955 650959 614487 582384 554244 529852 509266 492521 479236
51347 479236 468574 459612 451835 445336 440448 437160 434846 432650 430131 427508 425310 423769 422536 420958
51333 420958 418707 416191 414197 413068 412285 410912 408321 404474 399791 395012 390978 388159 386360 385122
51319 385122 384355 384288 384877 385634 386163 386562 387175 388193 389636 391414 393203 394457 394868 394696 394462 394397 394351 394091
51301 394091 393461 392379 390999 389858 389517 389914 390288 389911 388769 387401 386220 385237 384408 383921 384053 384878 386330
51284 386330 388435 391301 394982 399546 405193 411960 419257 425984 431251 434767 436480 436292 434489 432132
51270 432132 430392 429501 428805 427915 427288 427449 428091 428448 428357 428397 428893 429214 428393 426287 423791 421838 420408 418698
51252 418698 416155 413066 410122 407650 405510 403597 402136 401390 401252 401345 401476 401822 402547 403415 404035 404467 405234
51235 405234 406545 407836 408440 408467 408523 408685 408384 407387 406217 405300 404293 402716 400804 399181 398057 397291 396962
51218 396962 397244 397858 398307 398608 399240 400392 401856 403698 406326 409705 413080 415891 418547 421954 426487
51203 426487 431627 436437 440210 442861 444802 446330 447187 446968 445873 444629 443633 442564 440967 438836 436564
51188 436564 434704 433794 433942 434535 434854 435096 436167 438322 440705 442557 444149 446021 447940 449277 449885 449820
51172 449820 448561 445459 440910 436286 432595 429741 427154 424558 422032 419852 418495 418397 419488 421189 422910
51157 422910 424289 425035 424972 424309 423443 422395 420856 418913 417247 416318 415718 414750 413466 412711 413132 414382 415427
51140 415427 415534 414911 414440 414841 416114 417717 419065 419781 419712 419013 418138 417507 417189 417140 417589 418819 420609 422376
51122 422376 423995 426027 428904 432249 435376 438128 440727 443030 444540 445213 445743 446774 448174 449398 450327
51107 450327 451375 452826 454473 455980 457313 458668 460179 461868 463707 465517 466956 467827 468284 468508 468309
51092 468309 467400 466064 465156 465279 466212 467282 468064 468575 469004 469478 469994 470367 470423 470357 470738 471943 473786 475896
51074 475896 478258 481085 484234 487203 489760 492341 495659 500032 505251 511056 517719 526098 537042 550718
51060 550718 566614 584118 602855 622382 641857 660245 676689 690526 701282 709040 714759 719806
51048 719806 725018 730242 734634 737210 737286 734718 729850 723075 714531 704308 692798 680629 668455 657063
51034 657063 647374 639822 633712 627643 620630 612548 603570 593760 583470 573712 565744 560347 557647 557405
51020 557405 559324 563209 569033 576842 586529 597766 610134 623221 636638 650152 663722 677132
51008 677132 689611 700161 708412 714932 720566 725627 729827 732780 734421 734969 734551 732851 729314 723951
50994 723951 717813 712332 708259 705577 704358 705050 707813 712166 717726 724862 734216 745911 759622 775135
50980 775135 792301 810577 829166 847724 866618 886465 907726 930801 956266 984859 1017328
50969 1017328 1054267 1095913 1142030 1192102 1245751 1302998 1364184 1429525 1498470 1569448 1640461
50958 1640461 1710147 1778123 1844173 1907321 1965861 2018120 2063124 2100835 2131983 2157361 2177020
50947 2177020 2190385 2197519 2199913 2199633 2197885 2194895 2190869 2186311 2181295 2174995 2166220 2154195 2138869
50934 2138869 2120839 2100914 2079342 2055407 2028248 1997913 1964965 1929037 1888658 1842958 1792896
50923 1792896 1740334 1686394 1631218 1574796 1517371 1459429 1402015 1346907 1295738 1248891 1205695
50912 1205695 1165690 1129204 1096711 1068096 1042582 1019035 996444 974646 954630 937599 923591
50901 923591 911387 899792 888556 878021 868510 860300 853657 848485 844238 840527 837552 835714 835089
50888 835089 835463 836542 837854 838851 839502 840551 842882 846824 852290 859268 867786 877656 888603 900471
50874 900471 913013 925882 939228 953937 970726 989257 1008765 1029330 1051811 1076645 1103476
50863 1103476 1132064 1162829 1196286 1232603 1272089 1315666 1364555 1419793 1482217 1552480 1630898
50852 1630898 1717647 1813260 1918432 2033175 2156650 2288125 2427480 2574385 2727471 2884781
50842 2884781 3044543 3204886 3363091 3515711 3659230 3790175 3904988 4000649 4075562 4129425
50832 4129425 4162393 4174998 4168914 4147203 4113560 4071602 4024825 3976677 3930336 3888517 3853445
50821 3853445 3826529 3807760 3795558 3787281 3779808 3769812 3753940 3729023 3692211 3641234 3574993 3493877
50809 3493877 3399150 3291992 3173459 3045268 2910101 2770947 2630561 2491678 2357238 2229957
50799 2229957 2111761 2003770 1906589 1820364 1744774 1679309 1623624 1577554 1540782 1512381 1490639
50788 1490639 1473608 1460209 1450677 1445529 1444119 1444638 1445409 1445599 1444667 1441964 1437310 1431303 1424501 1416701
50774 1416701 1407507 1397137 1386057 1374194 1361161 1346979 1331842 1315314 1296607 1275734 1253664
50763 1253664 1231185 1208337 1185233 1162800 1142147 1123650 1107172 1092927 1081571 1073574 1068970 1067727
50751 1067727 1069971 1075767 1085025 1097687 1113741 1132915 1154629 1178492 1204772 1234237 1267536 1304792
50739 1304792 1345717 1390019 1437722 1489244 1545186 1605976 1671610 1741684 1815632 1892915 1973024
50728 1973024 2055356 2139051 2222931 2305671 2386129 2463433 2536588 2603960 2663303 2712327 2749201
50717 2749201 2772628 2781847 2776812 2758237 2727428 2686385 2638228 2587066 2536858 2490430 2449772 2416750
50705 2416750 2392668 2377122 2368148 2363884 2363431 2365723 2368221 2367423 2360315 2344833 2319468 2283423 2237176
50692 2237176 2182108 2119467 2050246 1976114 1899644 1823325 1748963 1678350 1613773 1557158 1509084
50681 1509084 1469250 1437584 1414218 1398632 1389754 1387083 1391054 1402008 1419377 1442212 1469972 1502181
50669 1502181 1537543 1574018 1609844 1644132 1676525 1706729 1734465 1759511 1781576 1800443 1816436
50658 1816436 1830493 1843428 1855288 1865787 1875218 1884496 1894143 1903667 1912276 1920053 1928170 1938105 1950933
50645 1950933 1967299 1987577 2011752 2039369 2069900 2103204 2139533 2179163 2222089 2267873 2315530
50634 2315530 2363713 2411311 2457985 2503899 2548981 2592810 2635201 2676255 2715351 2750359 2778323
50623 2778323 2796678 2803302 2795811 2772096 2732408 2680607 2622801 2564666 2510042 2461364 2420419 2388394
50611 2388394 2365613 2351572 2345129 2344640 2348135 2353571 2358991 2362519 2362346 2356753 2344060 2322656 2291354
50598 2291354 2249893 2199096 2140534 2076016 2007196 1935359 1861504 1786735 1712563 1640763 1572846
50587 1572846 1509609 1451085 1396896 1346856 1301325 1260857 1225442 1194412 1167266 1144239 1125693
50576 1125693 1111255 1100152 1092268 1088243 1088415 1092261 1099053 1108491 1120333 1133862 1148316 1163719 1180883
50563 1180883 1200579 1222873 1247158 1272631 1298879 1326241 1355521 1387151 1420758 1455619 1491330
50552 1491330 1527764 1564615 1601333 1637515 1673047 1707834 1741578 1773880 1804436 1833292 1861106
50541 1861106 1889157 1918881 1951355 1987239 2026973 2070714 2118232 2169311 2224380 2284527 2350761
50530 2350761 2423536 2503100 2590068 2685272 2789014 2900605 3018624 3141477 3267593 3395110
50520 3395110 3521572 3644075 3759744 3865949 3960142 4039706 4102185 4145606 4168579 4170351 4151027
50509 4151027 4111595 4053453 3977969 3886880 3783130 3670901 3554604 3438087 3325055 3219733
50499 3219733 3126390 3048047 2986055 2941066 2913932 2905216 2914087 2938133 2974218 3019064 3069032 3119862
50487 3119862 3166878 3205193 3229651 3235315 3218764 3179003 3116945 3034354 2933765 2819097 2695363
50476 2695363 2567297 2438484 2311751 2189662 2074087 1965655 1864277 1770214 1684229 1606687
50466 1606687 1536923 1473776 1416617 1365631 1321191 1283307 1251790 1226588 1207429 1193198 1182329
50455 1182329 1174189 1169557 1169301 1173021 1179629 1188836 1201125 1216342 1233347 1251259 1270155 1290202 1310938
50442 1310938 1331862 1352895 1373610 1392637 1408585 1421061 1430193 1435751 1437642 1436854 1434944 1432693 1430030
50429 1430030 1427096 1424548 1422849 1422111 1422650 1424994 1429263 1435280 1443361 1454330 1468663 1486359 1507730
50416 1507730 1533571 1564394 1600248 1641488 1688825 1742247 1800656 1863019 1929084 1998430 2069538
50405 2069538 2140525 2210217 2277738 2341589 2399982 2451782 2496335 2532639 2559441 2575888 2581199
50394 2581199 2573850 2552120 2515749 2466418 2406510 2338152 2263621 2185738 2107158 2029731 1955018
50383 1955018 1885072 1822152 1767975 1723605 1689710 1666349 1652767 1648059 1651962 1664310 1683618 1706843
50371 1706843 1730791 1753251 1772435 1785949 1791113 1786257 1771246 1746813 1713975 1674251 1629926 1583662
50359 1583662 1537863 1494355 1454201 1417495 1383558 1351656 1321333 1291833 1261485 1228204 1190753
50348 1190753 1149539 1106390 1063810 1024011 988033 955739 926982 902591 883711 870261 860725
50337 860725 853616 848521 845520 844294 844377 845805 848822 853065 857593 861807 866047 871189 877835 885767 894098
50322 894098 902070 909779 917873 926474 934910 942762 950656 959367 968469 976575 982845 987599 991441 994521
50308 994521 996898 999016 1001371 1004069 1007069 1010559 1014717 1019313 1023971 1028715 1033909 1039679 1045623 1051160
50294 1051160 1055984 1060172 1063962 1067450 1070399 1072327 1072797 1071591 1068610 1063817 1057449 1050221 1043174 1037294
50280 1037294 1033262 1031401 1031654 1033613 1036801 1041062 1046680 1054111 1063582 1074865 1087369 1100555 1114429
50267 1114429 1129670 1147044 1166582 1187417 1208641 1230341 1253569 1279156 1306601 1334276 1360686
50256 1360686 1385348 1408467 1430061 1449675 1466865 1481610 1494121 1504422 1512260 1517328 1519327 1517752
50244 1517752 1511770 1500616 1484280 1463801 1440763 1416502 1392018 1368653 1348369 1332767 1321731
50233 1321731 1313356 1305295 1295826 1283625 1267240 1245632 1219169 1189456 1158074 1125989 1094354 1065114
50221 1065114 1039970 1018813 999848 981518 963878 947864 933654 920346 907107 894038 881682
50210 881682 870132 859040 848273 838040 828367 818949 809751 801356 794361 788628 783559 778943 774968
50197 774968 771420 767537 762956 758318 754501 751562 748939 746336 743817 741192 738033 734443 731178 728788
50183 728788 727141 726013 725599 726065 727089 728368 730204 733021 736532 739970 743041 746080 749267 752270 754763
50168 754763 756797 758550 760187 762167 765226 769704 775170 780927 786685 792611 799098 806823 816703 829372
50154 829372 844803 862751 883430 907382 934770 965190 998209 1033801 1072165 1113349 1157178
50143 1157178 1203289 1251110 1299887 1348860 1397351 1444733 1490522 1534664 1577624 1619968 1661724
50132 1661724 1702049 1739344 1771470 1795874 1809857 1811273 1799316 1774723 1739110 1694144 1641380
50121 1641380 1582777 1520988 1458868 1398644 1341606 1288480 1239857 1196130 1157183 1122450 1091347
50110 1091347 1063429 1038012 1013964 990401 967530 946320 927207 909669 893331 878825 866847
50099 866847 856804 847300 837880 829404 822619 817276 812992 810045 808600 807870 806860 805594 804776 804482 804090
50084 804090 803431 803185 803951 805655 808115 811562 816209 821800 828039 835112 843375 852679 862357 871757 880640
50069 880640 889198 897831 906658 915059 921985 926981 930624 933560 935434 935311 933087 929845 926622 923340
50055 923340 919265 914236 909061 904832 902106 900689 899946 899318 898829 899208 901372 905698 911854 919368 928206
50040 928206 938686 950912 964508 979011 994473 1011581 1031094 1053120 1076918 1101545 1126775
50029 1126775 1153390 1182445 1214170 1247635 1281432 1314574 1346751 1377928 1407924 1436357 1462750
50018 1462750 1486572 1507232 1524219 1537373 1547073 1554081 1558999 1561696 1561162 1555942 1544707 1526567 1501181
50005 1501181 1468878 1430674 1387953 1342118 1294649 1247401 1202448 1161359 1124692 1092242 1063573
49994 1063573 1038229 1015708 995557 977445 960934 945274 929697 913876 897855 881646 865235
49983 865235 848984 833532 819113 805325 791816 778888 767172 757034 748587 741928 736870 732679
49971 732679 728613 724654 721231 718324 715455 712571 710308 709151 708873 709136 710141 712303 715691 720213 726035
49956 726035 733318 741785 750983 760789 771151 781453 790677 798253 804347 809271 812911 814842 814718 812513
49942 812513 808568 803447 797509 790657 782610 773319 762905 751412 738924 725798 712433 699004 685808
49929 685808 673674 663475 655269 648462 642746 638336 635280 633232 632099 632281 633952 636636 639770 643198
49915 643198 646799 650203 653387 657091 662082 668224 674817 681664 689275 698094 707989 718536 729466 740687
49901 740687 752016 762925 772651 780787 787736 794192 799933 803569 803751 800287 793726 784367 772296 758177
49887 758177 743304 728813 715192 702535 690820 679853 669342 659130 649257 639883 631375 624279
49875 624279 618915 615064 612282 610335 609094 608304 607899 608271 609770 612097 614845 618482 624117 632193 642034
49860 642034 652860 664641 677672 691745 706099 719883 732389 743099 751777 758368 762773 765047
49848 765047 765823 766023 765780 764054 759680 752600 743684 733581 722322 710106 697988 687377 678965 672409
49834 672409 667127 663032 660267 658522 657241 656558 657334 659905 663395 666908 670913 676582 684039 692276 700813
49819 700813 710333 721320 733013 744254 754563 763749 771230 776673 780843 784822 788533 790871 791248
49806 791248 790129 787963 784346 778655 771003 762275 753521 745506 738474 732043 725553 718724 711788 704935
49792 704935 697970 690802 684037 678694 675312 673520 672432 671389 670318 669590 669589 670402 671801 673489 675315
49777 675315 677391 680130 684082 689502 695976 702618 708689 713969 718561 722503 725700 728107 729834 731058
49763 731058 731794 731753 730449 727558 723089 717107 709479 700215 690038 680096 670901 661934 652625 643398 635266
49748 635266 628573 622755 617350 612647 609122 606718 605021 603775 602880 602217 601867 602228 603390 604637 605211
49733 605211 605556 607128 610723 615608 620688 626060 632815 641485 651290 661009 670163 679116 688268 697507
49719 697507 706415 714695 722137 728249 732370 734402 735175 735613 735556 733854 729678 723324 715596 706967 697719
49704 697719 688450 679863 672215 665503 660073 656519 654920 654658 655134 656324 658522 661862 666306 671812 678240
49689 678240 685221 692405 699893 708210 717620 727478 736530 744172 751377 760017 771121 784108 797784
49676 797784 811586 825429 838750 850431 859599 865922 869149 869015 865907 861121 856092 851537 847557
49663 847557 844238 841752 839916 837970 834946 830238 823802 815827 806240 794718 781313 766965 753126
49650 753126 740856 730281 720883 712199 704360 698103 694137 692357 691867 691949 692742 694674 697488 700244 702123
49635 702123 702776 702062 700034 697204 694271 691417 688246 684447 680108 675384 670372 665418 660935 656726 652041
49620 652041 646699 641655 638084 636261 635747 636218 637537 639183 640284 640418 640049 640025 640769 642015 643262 644394
49604 644394 645819 647882 650204 651846 652161 651353 650177 649231 648620 648113 647578 647347 648013 649622 651214 651623
49588 651623 650769 649715 649344 649403 649108 648294 647637 647919 649317 651313 653196 654669 655986 657451 659042 660864
49572 660864 663682 668353 674692 681533 688057 694563 701818 710258 720003 730991 742670 754026 764290
49559 764290 773196 780337 784890 786446 785640 783444 780273 776269 772037 768369 765437 762775 760003 757140
49545 757140 754367 751859 749740 747930 746180 744498 743294 742852 742956 743264 743765 744643 746172 749091 754607
49530 754607 763479 775289 788984 803818 819546 836190 854087 873676 894717 915977 935989 953614
49518 953614 967625 976675 980550 980919 979982 978757 977377 976318 976174 976589 976601 975857 974445 971733 966579 958746
49502 958746 949076 938261 926474 914216 902299 890802 879249 868098 858888 852405 847759 843784
49490 843784 840291 837363 834557 831724 829747 829460 830377 831465 832679 834773 837819 840871 843039 844286 845166
49475 845166 846354 848355 851094 853757 855407 855828 855610 855571 856313 858035 860454 863026 865502 868023 870461
49460 870461 872056 872102 870731 868676 866473 864305 862309 860563 858866 856947 854823 852579 849971 846653 842802
49445 842802 839182 836521 835040 834498 834530 834981 836095 838280 841569 845446 849340 853135 857151 861891 867910
49430 867910 875539 884413 893592 902460 911340 920868 930984 940762 948999 954662 957109 956346 952986 947638
49416 947638 940548 932166 923753 916875 912374 910240 910382 912932 917799 924466 932475 941850 952983 966251
49402 966251 981638 998384 1015117 1030816 1045745 1061056 1077378 1094146 1110366 1125572 1139742
49391 1139742 1152669 1163820 1172710 1179061 1182625 1183098 1180339 1174696 1167078 1158544 1149614 1139971 1129004
49378 1129004 1116764 1104243 1092763 1083265 1076170 1071518 1068996 1068016 1068093 1069146 1071288 1074460 1078433 1083025
49364 1083025 1087981 1092699 1096489 1099197 1101218 1102659 1102863 1101131 1097732 1093677 1089531 1084905 1079202 1072447
49350 1072447 1065199 1058066 1051534 1045865 1040789 1035592 1029897 1024140 1018919 1014176 1009500 1004970 1001064 997863
49336 997863 995063 992905 992420 994484 999135 1006089 1015412 1027262 1041258 1056501 1071987 1086667 1099287
49323 1099287 1108570 1113652 1114280 1110745 1103764 1094260 1083052 1070760 1057972 1045272 1033016 1021229 1009758
49310 1009758 998414 987021 975707 965161 956254 949353 944308 941131 940200 941563 944473 947915 951288
49297 951288 954404 957164 959574 961751 963606 964711 964663 963339 960660 956519 951178 945320 939375 933194 926754
49282 926754 920750 915971 912440 909760 908172 908643 911849 917497 924662 932481 940545 948907 957797 967153
49268 967153 976440 984988 992409 998643 1003923 1008787 1013781 1018957 1024043 1029328 1035879 1044502 1054939 1066480
49254 1066480 1078842 1091730 1103923 1113580 1119415 1121026 1118278 1111131 1100053 1085970 1069705 1051964
49242 1051964 1033791 1016378 1000296 985445 971889 960245 951121 944608 940477 938520 938561 940459 944152
49229 944152 949446 955827 962884 970836 980244 991246 1003479 1016556 1030059 1043194 1055169 1065997
49217 1065997 1076253 1085974 1094414 1101064 1106305 1110919 1115603 1121120 1128108 1136444 1145518 1155485 1167513
49204 1167513 1182320 1199207 1217105 1235814 1255435 1275225 1294070 1311828 1329224 1346512 1363027
49193 1363027 1378005 1391106 1402140 1411075 1418512 1425442 1432276 1438647 1444408 1450272 1457213 1465740 1476090
49180 1476090 1488642 1503686 1521156 1541127 1564398 1592097 1624761 1662118 1703533 1748024 1793674
49169 1793674 1837540 1876518 1908252 1931299 1945060 1950078 1948236 1942079 1933706 1924396 1915047 1906483 1899191
49156 1899191 1893165 1888315 1884837 1882970 1882701 1884014 1887326 1893309 1902209 1913529 1926317 1939657 1952988
49143 1952988 1966271 1979880 1994210 2009353 2025184 2041601 2058451 2075378 2091976 2108013 2123412
49132 2123412 2138193 2152751 2167891 2184133 2201036 2217651 2233599 2249324 2265391 2282108 2299812
49121 2299812 2318905 2339388 2360919 2383511 2407659 2433636 2461463 2492011 2527429 2569746 2619492
49110 2619492 2676312 2740413 2812357 2891496 2975509 3061570 3147133 3229414 3305203 3372019 3428899
49099 3428899 3475031 3507484 3520977 3510593 3475261 3419161 3349963 3275127 3198801 3121462 3042306
49088 3042306 2962065 2883807 2811456 2747846 2694012 2649763 2614506 2587505 2567601 2553032 2541886
49077 2541886 2532915 2525790 2520341 2515687 2510499 2504227 2497651 2491940 2487396 2483402 2479378 2475347 2471634 2468455
49063 2468455 2465849 2463591 2461018 2457375 2452606 2447536 2442961 2438846 2434729 2430710 2427590 2426130 2426557 2428780
49049 2428780 2432668 2437887 2443735 2449318 2453755 2456156 2455611 2451440 2443562 2432678 2420165 2407677 2396608
49036 2396608 2387783 2381609 2378419 2378482 2381678 2387364 2394670 2402900 2411576 2420202 2428110 2434709 2439898 2444153
49022 2444153 2448047 2451771 2455229 2458504 2461932 2465770 2470043 2474756 2479876 2485157 2490480 2496461 2504015 2513013
49008 2513013 2522023 2530032 2537837 2546915 2557387 2568045 2578186 2588208 2598287 2607589 2615344 2621794 2627409
48995 2627409 2631840 2634409 2635227 2635091 2634505 2633507 2632281 2631238 2630340 2628880 2626152 2622089 2617087 2611508 2605501
48980 2605501 2599102 2592248 2584716 2576200 2566585 2556091 2545059 2533584 2521491 2508777 2496001 2484048
48968 2484048 2473565 2464729 2457415 2451368 2446355 2442476 2440331 2440592 2443434 2448653 2456211 2466211 2478368
48955 2478368 2492034 2506843 2522847 2539838 2557104 2574154 2591215 2608632 2626206 2643536 2660641
48944 2660641 2677787 2695028 2712513 2731049 2751732 2774984 2800453 2827886 2857619 2890105 2925410
48933 2925410 2963399 3004055 3047293 3092659 3139525 3187641 3237374 3289416 3344270 3401952 3462085
48922 3462085 3524199 3587957 3653139 3719515 3786759 3854425 3921944 3988716 4054259 4118303 4180763
48911 4180763 4241672 4301085 4358979 4415288 4470041 4523362 4575219 4625386 4673828 4720879 4766661
48900 4766661 4810447 4851001 4887527 4919942 4948321 4972672 4993378 5011270 5026994 5040674 5052384
48889 5052384 5062451 5070932 5077252 5080802 5081561 5079734 5075177 5067690 5057587 5045267 5030283 5011433 4987889
48876 4987889 4959780 4927557 4891249 4850598 4805608 4756658 4704254 4648920 4591319 4532288 4472628
48865 4472628 4412889 4353366 4294299 4235987 4178663 4122464 4067710 4015118 3965370 3918346 3873033
48854 3873033 3828325 3783830 3739962 3697608 3657827 3621537 3589258 3561248 3537829 3519206 3504899
48843 3504899 3493813 3485135 3478857 3475203 3473985 3474809 3477558 3482254 3488767 3497076 3507592 3520719 3536185
48830 3536185 3553143 3570834 3588927 3607426 3626563 3646569 3667203 3687740 3707753 3727733 3748536
48819 3748536 3770394 3792886 3815611 3838430 3861159 3883609 3905926 3928495 3951419 3974419 3997172
48808 3997172 4019524 4041554 4063798 4087194 4112328 4138809 4165866 4193350 4221621 4250527 4279236
48797 4279236 4307150 4334329 4360790 4385994 4409377 4430973 4451143 4470053 4487756 4504504 4520550
48786 4520550 4535664 4549092 4559968 4567711 4572166 4573486 4571787 4566889 4558479 4546529 4531344 4513266
48774 4513266 4492584 4469682 4444883 4417995 4388317 4355335 4319223 4280451 4239130 4195033 4148253
48763 4148253 4099558 4049992 4000244 3950487 3900744 3851212 3802201 3753971 3706815 3661139 3617134
48752 3617134 3574449 3532604 3491754 3452637 3415622 3380228 3345837 3312471 3280656 3250961 3224023
48741 3224023 3200565 3180846 3164375 3150603 3139560 3131317 3125213 3120300 3116274 3113293 3111077 3109059 3107412
48728 3107412 3107149 3108981 3112693 3117752 3123924 3131121 3139149 3147817 3156871 3165745 3173851 3181155 3187967 3194102
48714 3194102 3198940 3202463 3205621 3209307 3213498 3217674 3221587 3225264 3228729 3232087 3235553 3239163 3242780 3246561
48700 3246561 3250922 3255825 3260649 3265138 3269936 3275671 3281909 3287536 3291909 3295132 3297419 3298761 3299213 3299149 3299210
48685 3299210 3300119 3302428 3306173 3310835 3315765 3320508 3324668 3327795 3329689 3330643 3331178 3331618 3331971 3332044 3331552 3330305
48669 3330305 3328314 3325512 3321445 3315607 3308003 3298820 3287517 3272960 3254694 3233410 3209738 3183252
48657 3183252 3153295 3120250 3085296 3049228 3012256 2974775 2937654 2901783 2867849 2836456 2807845
48646 2807845 2781416 2756026 2730919 2706042 2681525 2657277 2633220 2609510 2586334 2563681 2541424
48635 2541424 2519464 2497745 2476276 2455070 2433901 2412196 2389435 2365681 2341526 2317546 2294075
48624 2294075 2271516 2250560 2231844 2215452 2200911 2187777 2176195 2166759 2159770 2154821 2151253 2148801
48612 2148801 2147442 2146761 2145968 2144506 2142121 2138296 2132375 2124627 2116577 2109746 2104423 2100107 2096640 2094165
48598 2094165 2092213 2089682 2085833 2080752 2074683 2067403 2058516 2048095 2036851 2025704 2015161 2004941 1994276
48585 1994276 1982770 1970834 1959095 1947625 1936119 1924735 1914258 1905271 1897497 1890189 1883080 1876849
48573 1876849 1872597 1870844 1871066 1872328 1874368 1877720 1882639 1888169 1892535 1894294 1892912 1888546 1881578 1872258
48559 1872258 1860527 1846356 1830468 1814395 1799481 1786017 1773693 1762521 1752692 1743667 1734154 1723224
48547 1723224 1711049 1698311 1685198 1671229 1655964 1639726 1623683 1609158 1596735 1586013 1576177
48536 1576177 1566664 1557292 1548217 1540066 1533816 1530106 1528880 1529944 1533641 1540555 1550844 1564383 1581247
48523 1581247 1601322 1623443 1645597 1666077 1683742 1697037 1703578 1701433 1690650 1673228 1651881 1629176
48511 1629176 1607497 1589026 1575270 1566603 1562332 1561314 1562669 1566168 1572108 1580918 1592823 1607682 1624912
48498 1624912 1643572 1662615 1680948 1697029 1708456 1712249 1705967 1688901 1662513 1629816 1594163 1558275
48486 1558275 1524018 1492538 1464245 1438886 1416171 1396459 1380413 1367908 1357813 1349086 1341571 1335395
48474 1335395 1330136 1325182 1320614 1317093 1314984 1314019 1313736 1313827 1314188 1314963 1316513 1319043 1322441 1326662 1331875
48459 1331875 1337837 1343448 1347526 1349842 1350922 1350984 1349697 1346874 1342821 1337910 1332212 1325640 1318168 1309901
48445 1309901 1301088 1291847 1281761 1270185 1257252 1244082 1231509 1219168 1206499 1194058 1182872 1172917
48433 1172917 1163352 1154037 1145639 1138218 1130968 1123572 1116716 1110857 1105487 1100139 1095136 1090705 1086123 1080568
48419 1080568 1074312 1068355 1063200 1058547 1053913 1048992 1043607 1037806 1031919 1026255 1020848 1015656 1010779 1006285
48405 1006285 1002012 997723 993297 988782 984514 981149 979097 977871 976452 974497 972731 971940 971912 971653 970404
48390 970404 968293 966141 964740 964169 963906 963693 963962 965056 966507 967736 969088 971343 974349 977090 979129
48375 979129 981142 983870 987384 991558 996463 1002053 1008165 1015152 1023992 1035589 1050303 1067925 1087424
48362 1087424 1106960 1125092 1141818 1157458 1170790 1179705 1183773 1184782 1184564 1183728 1182886 1183549 1186997 1193375
48348 1193375 1202557 1214856 1230399 1248944 1270815 1296858 1327071 1360554 1397314 1438734 1485887
48337 1485887 1538954 1598880 1667905 1747760 1839096 1943561 2064861 2207308 2375494 2576300
48327 2576300 2818928 3112008 3463344 3883990 4390443 5002502 5743506 6645423 7749836
48318 7749836 9099496 10727606 12648682 14842185 17229135 19664067 21956216 23897454
48310 23897454 25271863 25868322 25537661 24278496 22272868 19822957 17235512 14740804
48302 14740804 12478150 10515129 8866196 7508953 6403939 5510305 4790332 4209198
48294 4209198 3737254 3351991 3036027 2774770 2556934 2374816 2222068 2092396 1981177
48285 1981177 1886322 1806197 1738071 1679533 1629898 1588966 1555505 1527846 1504926 1485952 1469998
48274 1469998 1456658 1446179 1438463 1432922 1429681 1429682 1432933 1437788 1442728 1447898 1454286 1462328 1472083 1483839
48260 1483839 1497662 1512890 1528648 1544313 1558966 1571018 1578824 1581194 1577184 1566447 1550412 1532280
48248 1532280 1515093 1500047 1486880 1475032 1464032 1453551 1443798 1435446 1428778 1423404 1418983 1415475
48236 1415475 1412451 1409118 1405468 1402442 1400355 1398101 1394659 1390508 1386578 1382531 1377102 1369724 1360810 1350707
48222 1350707 1339250 1326206 1311442 1294712 1275879 1255169 1232774 1208533 1182537 1155693 1129051
48211 1129051 1102780 1076425 1049941 1023919 998979 975510 953813 933959 915567 898211 881910
48200 881910 866857 852892 839699 827290 815829 805194 795185 785880 777336 769214 761228 753685
48188 753685 747000 740913 734855 728886 723624 719340 715765 712712 710230 708149 706107 704069 702318 700907
48174 700907 699677 698749 698376 698224 697502 696014 694520 693771 693641 693474 692890 691966 690921 689931 689083 688327 687543
48157 687543 686690 685771 684748 683743 683189 683443 684239 684891 685053 684984 685076 685441 685980 686535 686973 687340 687846 688455 688716
48138 688716 688385 688007 688308 689196 690033 690762 691942 693595 694921 695502 696008 697204 698933 700710 702758 705665
48122 705665 709257 712558 714884 716477 718067 720159 722785 725635 728441 731433 735334 740591 746759 752958
48108 752958 758869 764985 771870 779524 787575 795864 804676 814531 825821 838560 852377 866793 881523
48095 881523 896518 911778 927193 942604 957964 973439 989340 1005891 1023119 1040960 1059301
48084 1059301 1077747 1095506 1111978 1127534 1143297 1159876 1176534 1191937 1205522 1217755 1229209
48073 1229209 1239931 1249891 1259584 1269730 1280467 1291295 1301905 1312753 1324540 1337324 1350420 1363041
48061 1363041 1374696 1384967 1393341 1399564 1403899 1406745 1408098 1407551 1404754 1399788 1393216 1385833 1378060 1369482
48047 1369482 1359284 1347402 1334847 1322593 1310544 1297980 1284537 1270098 1254125 1236084 1216572
48036 1216572 1197187 1178999 1161700 1144344 1126313 1107335 1087278 1066374 1045259 1024478 1004219
48025 1004219 984600 965737 947379 929046 910813 893413 877280 862025 847196 833000 819807
48014 819807 807529 795927 785090 775037 765377 755950 747390 740289 734150 727935 721474 715603 710930
48001 710930 707186 703804 700530 697376 694504 692296 691080 690674 690516 690217 689646 688630 687112 685659 685196
47986 685196 685980 687159 687572 686762 685136 683417 682087 681190 680514 679945 679505 679015 678054 676523 674939 673754
47970 673754 672665 671121 669281 667859 667063 666279 664925 663106 661335 660017 659288 659031 658977 659064 659585 660710
47954 660710 662108 663547 665529 668606 672304 675654 678761 682830 688495 695138 702221 710161 719255 728732
47940 728732 737801 746905 756901 767483 777520 786747 796072 806140 816466 826190 835001 843045 850439
47927 850439 857093 862630 866398 867990 867898 867260 866729 865892 863895 860339 855392 849401 842652 835373 827715
47912 827715 819739 811463 802861 793863 784586 775535 767258 759733 752440 745212 738670 733524 729730 726738
47898 726738 724401 723144 723177 724065 725324 727084 729747 733214 736881 740411 744089 748372 753418 759171 765550
47883 765550 772338 779260 786426 794407 803494 813097 822241 830503 838036 844909 850942 856111 860552 864079
47869 864079 866265 867105 867081 866312 864167 860034 854059 846763 838397 829157 819681 810671 802022 792879 782674
47854 782674 771766 760932 750548 740488 730622 721129 712285 704156 696683 690070 684896 681664 680336
47841 680336 680450 681554 683331 685463 687783 690536 694107 698415 702985 707690 713006 719279 726130 732859
47827 732859 739134 745061 750860 756803 763189 770104 777415 785217 793940 803674 813776 823642 833720 845259
47813 845259 859078 875006 892424 910958 930555 951254 972959 995248 1017396 1038736 1058856
47802 1058856 1077149 1092381 1103223 1109408 1112080 1112828 1112403 1110344 1105606 1097541 1086460 1073332 1058997
47789 1058997 1043808 1028092 1012648 998501 986289 976185 968307 962800 959443 957456 955912 954302
47777 954302 952764 951765 951503 951572 951268 950164 948120 944820 939814 933244 925966 918586 910789 902061 892678
47762 892678 883424 874646 866247 858321 851040 843989 836523 828872 822186 817240 813699 810893 808757 807643
47748 807643 807804 809443 812791 817603 822905 827782 832380 837750 844761 853479 863533 874729 887082 900381
47734 900381 914042 927634 941551 956755 973594 991167 1008251 1024588 1040650 1056284 1070415
47723 1070415 1082274 1092173 1100611 1107203 1111079 1112095 1111061 1108857 1105716 1101309 1095196 1087157 1077270 1065687
47709 1065687 1052366 1037253 1020801 1003960 987433 971219 955176 939776 925914 914068 903969
47698 903969 895045 886984 879907 874168 869950 867016 864999 864033 864789 867736 872640 879014 886738 895934 906480
47683 906480 918115 930839 944783 959736 975274 991335 1008248 1026055 1044099 1061396 1077216
47672 1077216 1091309 1103821 1115088 1125248 1133940 1140557 1144860 1147200 1148051 1147493 1145221 1140909 1134463
47659 1134463 1126086 1116225 1105384 1093841 1081503 1068030 1053193 1037213 1020776 1004621 989150 974571
47647 974571 961378 950271 941446 934356 928562 924494 922815 923247 924714 926728 930018 935519 943241 952574
47633 952574 963276 975639 989841 1005669 1023014 1042333 1064376 1089424 1116688 1144440 1170947
47622 1170947 1195473 1218338 1239895 1259635 1276388 1289160 1297450 1300883 1298947 1291229 1277738 1258915
47610 1258915 1235457 1208043 1177121 1143041 1106601 1069274 1032516 996819 961792 927231 893786
47599 893786 862557 834457 810030 789360 771769 756015 741301 727933 716620 707356 699386 692086
47587 692086 685327 679021 672904 666890 661293 656494 652670 649868 647945 646355 644367 641713 638771 635995
47573 635995 633517 631475 630250 629995 630157 629873 628750 627026 625024 622682 619605 615475 610526 605632 601667
47558 601667 598624 595546 591519 586535 581310 576572 572758 570078 568495 567697 567347 567262 567224 566863 565955 564650
47542 564650 563196 561661 560146 558933 558148 557499 556694 555832 555065 554251 553395 553117 554011 555741 557325 558283 558901
47525 558901 559458 559817 559919 560059 560472 561024 561553 562161 563017 564062 565006 565462 565153 564210 563142 562240 561246 560012
47507 560012 559133 559313 560293 561121 561438 561756 562482 563453 564582 566140 568049 569587 570218 570172 569901 569544 569316 569807
47489 569807 571306 573189 574503 574927 574920 575180 576219 578093 580321 582434 584725 587943 592064 596001 598900
47474 598900 601073 603249 605615 608205 611542 615968 620738 624676 627653 630625 634230 637985 640949 642702
47460 642702 643632 644573 646105 647953 649210 649456 649363 649865 651149 652942 655438 659306 664951 672315 681231 691371
47444 691371 702031 712652 723487 735222 748036 761649 776124 791899 809056 827246 846255
47433 846255 865827 884865 901734 915807 928045 939568 950085 958162 962697 963785 962406 959575
47421 959575 955642 950240 943057 934634 926067 917878 909705 901200 892682 884502 876239 867050 856700 845863
47407 845863 835446 825833 816719 807526 797994 788447 779445 771229 763663 756599 749999 743699 737526 731795
47393 731795 727291 724449 722739 721108 718959 716602 714970 714997 717055 720835 725850 732056 739725 748692 758129
47378 758129 767302 776224 785261 794401 803263 811675 819767 827449 834159 839260 842442 843668 842912 840161
47364 840161 835571 829360 821556 812078 801149 789489 777898 766696 755623 744182 731917 718613
47352 718613 704593 690770 678027 666474 655641 645357 635974 627699 620298 613729 608444 604585 601403
47339 601403 597941 593982 589838 585705 581823 578875 577383 576926 576662 576502 577025 578373 580058 581885 584226
47324 584226 587230 590476 593609 596660 599601 602224 604632 607145 609547 611112 611657 611806 611953 611730 610964
47309 610964 610316 610292 610232 609084 606832 604461 602760 601769 601166 600640 600019 599501 599688 600931 602811 604632 606277
47292 606277 608285 611335 616011 622737 631433 641354 651793 662844 675184 689279 705263 723301 743467
47279 743467 765224 787488 809170 829258 846493 859582 867964 872020 872536 870294 866224 861424 856694
47266 856694 852225 847862 843545 839430 835816 832949 830703 828367 825057 820457 815036 809446 803880 798045
47252 798045 791605 784530 777143 769930 763222 757010 751080 745360 740052 735467 731779 728927 726669 724742
47238 724742 723071 721839 721320 721643 722748 724559 727117 730560 735019 740604 747440 755565 764596 773647 781937
47223 781937 789653 797883 807435 817959 828474 838463 848003 857163 865836 873985 881390 887240 890740 892226
47209 892226 892855 893008 891794 888487 883623 878099 871918 864588 856286 847793 839609 831878 824919 819024 813782
47194 813782 808415 802936 798308 795284 793595 792596 792313 793527 796916 802261 808578 815069 821965 830270 840633
47179 840633 852808 866275 880884 896558 912901 929636 947154 966032 986178 1006924 1027677
47168 1027677 1047930 1066896 1083825 1098643 1111723 1123080 1132377 1139565 1144809 1147818 1148000 1145419 1140958
47155 1140958 1135357 1128687 1120941 1112465 1103538 1094084 1084105 1073903 1063610 1053025 1042291 1032214 1023411
47142 1023411 1015538 1007866 1000413 994043 989586 987206 986549 987135 988598 990772 993680 997489 1002457 1008747
47128 1008747 1016073 1023656 1030898 1037991 1045394 1052771 1059090 1063921 1067934 1071636 1074152 1073853 1069935 1062957
47114 1062957 1054030 1043994 1033252 1021875 1009762 996930 983682 970315 956799 942941 928762
47103 928762 914531 900617 887522 875823 865668 856386 846947 836856 826386 816056 806183 796952
47091 796952 788561 781141 774732 769416 765291 762275 760134 758856 758876 760696 764250 768725 773085 776833 780296
47076 780296 784221 789079 794741 800703 806586 812396 818343 824416 830171 835071 839012 842373 845438 847977
47062 847977 849562 850115 849902 849165 848091 846982 846064 845234 844442 844249 845436 847911 850623 852876 855207 858540
47046 858540 862961 867957 873555 880473 889052 898632 908166 917005 924932 931922 938339 945095 953009 961878
47032 961878 970550 978157 985107 992596 1001294 1010799 1020363 1029706 1038948 1048108 1057036 1065621 1073742 1081179
47018 1081179 1087914 1094353 1100748 1106505 1110558 1112517 1112966 1112544 1111212 1108583 1104474 1098828 1091679 1083592
47004 1083592 1075743 1069015 1063193 1057514 1051800 1046612 1042407 1039067 1036318 1034220 1033041 1032855 1033379 1034142 1034898
46989 1034898 1035976 1038131 1041912 1047209 1053514 1060421 1067774 1075568 1084010 1093476 1104110 1115546 1127306
46976 1127306 1139384 1152193 1166041 1180872 1196305 1211609 1225741 1237938 1248304 1257631 1266607 1275482
46964 1275482 1284353 1293306 1302187 1310583 1318142 1324653 1329713 1332722 1333496 1332755 1331723 1331186 1330954 1330215 1328449
46949 1328449 1326138 1324566 1324768 1326664 1329285 1331738 1333785 1335658 1337760 1340618 1344782 1350517 1357663 1365832
46935 1365832 1374576 1383429 1392052 1400477 1409014 1417853 1426911 1436095 1445469 1455073 1464793 1474499 1484155 1493713
46921 1493713 1503064 1512068 1520358 1527054 1531044 1531707 1529157 1523747 1515741 1505602 1494094 1481674 1468141
46908 1468141 1453339 1437965 1423158 1409396 1396351 1383814 1372262 1362441 1354866 1349888 1347798 1348595
46896 1348595 1351923 1357547 1365696 1376732 1390656 1407117 1425727 1446181 1468243 1491831 1516846 1542637
46884 1542637 1567827 1591175 1612595 1632998 1653011 1672141 1689269 1703701 1715549 1725307 1733306 1739532
46872 1739532 1743826 1746317 1747748 1749284 1751877 1755798 1760778 1766470 1772743 1779725 1787793 1797439 1808976 1822297
46858 1822297 1837041 1852908 1869698 1887032 1904216 1920530 1935667 1949845 1963425 1976345 1987860
46847 1987860 1996948 2003053 2006439 2007784 2007471 2005348 2001079 1994618 1986294 1976505 1965454 1953357 1940912
46834 1940912 1929316 1919419 1910970 1903111 1895767 1890110 1887291 1887106 1888429 1890824 1895155 1902460 1912676 1924744
46820 1924744 1937733 1951604 1966926 1983940 2001954 2019752 2036691 2053183 2069822 2086124 2100446
46809 2100446 2111133 2117502 2119898 2119224 2116445 2112054 2105822 2097380 2087051 2075690 2063710 2050873 2037241
46796 2037241 2023587 2010371 1996930 1982472 1967590 1953973 1942623 1932966 1923828 1914721 1906036 1898519
46784 1898519 1892861 1889466 1888174 1888278 1889001 1889996 1891303 1892963 1894733 1896200 1897140 1897777 1898601 1899841 1901217
46769 1901217 1902327 1903230 1904496 1906719 1910084 1914290 1918790 1923215 1927767 1933205 1940345 1949587 1960880 1973861
46755 1973861 1987934 2002506 2017494 2033348 2050270 2067577 2084192 2099610 2114052 2127814 2140925
46744 2140925 2153337 2164966 2175453 2184348 2191657 2197892 2203503 2208604 2213174 2217121 2220129 2221951 2223016
46731 2223016 2224205 2225884 2227582 2228908 2230333 2232781 2236836 2242629 2250009 2258442 2267142 2275785 2284735 2294142
46717 2294142 2303222 2311062 2317771 2324068 2329831 2333862 2335235 2334170 2331234 2326232 2318295 2306855 2292205
46704 2292205 2275240 2256750 2236874 2215200 2191544 2166509 2140918 2114804 2087505 2058863 2029777
46693 2029777 2001267 1973508 1946139 1919104 1892643 1866752 1841290 1816542 1793164 1771555 1751699
46682 1751699 1733662 1717689 1703593 1690440 1677207 1663652 1650328 1637945 1626934 1617485 1609634 1603156
46670 1603156 1597535 1592344 1587763 1584610 1583583 1584491 1586465 1589116 1593164 1599692 1608977 1620416 1633362 1647513
46656 1647513 1662525 1677838 1693051 1708021 1722413 1735621 1747399 1757997 1767301 1774305 1778160 1779432
46644 1779432 1779670 1779779 1779416 1777975 1775543 1772721 1770139 1768474 1768509 1770832 1775716 1783447 1794376 1808356 1824560
46629 1824560 1842381 1862271 1885194 1911196 1938917 1966517 1992785 2017325 2040042 2060720 2078893
46618 2078893 2093897 2104994 2111544 2113122 2109614 2101338 2089047 2073601 2055510 2034832 2011590 1986262
46606 1986262 1959813 1933272 1907277 1881977 1857246 1832969 1809211 1786287 1764666 1744683 1726256
46595 1726256 1708981 1692576 1677126 1662867 1649898 1638177 1627550 1617554 1607493 1597056 1586735
46584 1586735 1577223 1568483 1559890 1551164 1542563 1534065 1525121 1515591 1506329 1498236 1491126 1484152 1477119 1470697
46570 1470697 1465418 1461095 1457366 1454281 1452073 1450683 1449839 1449460 1449722 1450682 1451949 1452827 1452881 1452379 1452068 1452488
46554 1452488 1453641 1455376 1457820 1461231 1465641 1470824 1476491 1482391 1488491 1495266 1503404 1512893 1522746 1532105
46540 1532105 1541375 1551739 1563724 1576811 1590369 1604368 1619137 1634993 1652223 1670932 1690784
46529 1690784 1711403 1733140 1756858 1782762 1809949 1837474 1865370 1894282 1924519 1955872 1987995
46518 1987995 2020439 2052474 2083325 2112574 2140101 2165715 2189029 2209557 2226849 2240764 2251783
46507 2251783 2260759 2268123 2273567 2276672 2277500 2276349 2273375 2268937 2263971 2259399 2255227 2250637 2244968 2238238
46493 2238238 2230839 2223117 2215230 2207043 2198159 2188275 2177370 2165273 2151339 2135032 2116608 2096644
46481 2096644 2075019 2051112 2024952 1997403 1968953 1939122 1907504 1874677 1841542 1808296 1774796
46470 1774796 1741531 1709435 1678831 1649339 1620942 1594507 1571043 1550970 1534380 1521587 1512939
$$ [...]
##END NTUPLES=NMR SPECTRUM
##END=
