
##TITLE=UV1271_M13_1250-1169_10_7414421_m5Ir4aHx2Y
##JCAMPDX= 6.0         $$ Bruker NMR JCAMP-DX V2.0
##DATA TYPE= NMR SPECTRUM
##DATA CLASS= NTUPLES
##ORIGIN= BRUKER
##OWNER= Administrator
$$ 1.72 TOPSPIN		Version 2.1
$$ 2013-01-25 23:42:45.227 -0500  Administrator@X
$$ Compression mode = diff/dup
##.OBSERVE FREQUENCY= 400.02188249412
##.OBSERVE NUCLEUS= ^1H
##.ACQUISITION MODE= SIMULTANEOUS (DQD)
##.ACQUISITION SCHEME= undefined
##.AVERAGES= 8
##.DIGITISER RES= 22
##SPECTROMETER/DATA SYSTEM= spect
##.PULSE SEQUENCE= zg30
##.SOLVENT NAME= COFFEE_meoh
##.SHIFT REFERENCE= INTERNAL, COFFEE_meoh, 1, 14.98509
##AUDIT TRAIL= $$ (NUMBER, WHEN, WHO, WHERE, PROCESS, VERSION, WHAT)
$$ ##TITLE= Audit trail, TOPSPIN		Version 2.1
$$ ##JCAMPDX= 5.01
$$ ##ORIGIN= Bruker BioSpin GmbH
$$ ##OWNER= Administrator
$$ $$ E:\/data/COFFEE/nmr/UV1271_M13_1250-1169_10_7414421_m5Ir4aHx2Y/10/pdata/1/auditp.txt
$$ ##AUDIT TRAIL=  $$ (NUMBER, WHEN, WHO, WHERE, PROCESS, VERSION, WHAT)
(   1,<2013-01-25 23:42:37.446 -0500>,<Administrator>,<X>,<go>,<TOPSPIN 2.1>,
      <created by zg
	started at 2013-01-25 23:41:30.587 -0500,
	POWCHK enabled, PULCHK disabled,
       configuration hash MD5:
       86 BA 57 50 F2 9D 5C 9B 26 00 A9 28 5F 66 2E 89
       data hash MD5: 64K
       82 26 74 8F F4 FA 96 78 0B FB 43 7D 4F FD 8E 89>)
(   2,<2013-01-25 23:42:40.446 -0500>,<Administrator>,<X>,<proc1d>,<TOPSPIN 2.1>,
      <Start of raw data processing
       efp LB = 0 FT_mod = 6 PKNL = 1 PHC0 = 0 PHC1 = 0 SI = 32K 
       data hash MD5: 32K
       6D BE A1 4A 87 DB AB E9 91 DA 28 12 CE 2C C1 E2>)
(   3,<2013-01-25 23:42:40.899 -0500>,<Administrator>,<X>,<proc1d>,<TOPSPIN 2.1>,
      <pk PHC0 = 95.91614 PHC1 = 0 
       data hash MD5: 32K
       21 2A F1 91 EE FD E9 9D 0B B9 41 06 B9 46 F9 97>)
(   4,<2013-01-25 23:42:41.149 -0500>,<Administrator>,<X>,<proc1d>,<TOPSPIN 2.1>,
      <abs ABSG = 1 
       data hash MD5: 32K
       74 E4 7A 1B E0 F8 CF 25 06 4D 01 FF 6D 0D C1 21>)
(   5,<2013-01-25 23:42:41.305 -0500>,<Administrator>,<X>,<proc1d>,<TOPSPIN 2.1>,
      <abs ABSG = 2 
       data hash MD5: 32K
       8E 53 F8 E7 CD B4 F6 71 D6 B4 48 46 5F 0F 4E 85>)
(   6,<2013-01-25 23:42:41.446 -0500>,<Administrator>,<X>,<proc1d>,<TOPSPIN 2.1>,
      <abs ABSG = 3 
       data hash MD5: 32K
       7C 1E 19 5C 47 77 DB A3 57 63 F5 C8 A7 CB 02 EA>)
(   7,<2013-01-25 23:42:41.587 -0500>,<Administrator>,<X>,<proc1d>,<TOPSPIN 2.1>,
      <abs ABSG = 4 
       data hash MD5: 32K
       5F 36 BF 92 90 D2 0D 04 EE 7E 22 00 DE 55 CA 8E>)
(   8,<2013-01-25 23:42:41.743 -0500>,<Administrator>,<X>,<proc1d>,<TOPSPIN 2.1>,
      <abs ABSG = 5 
       data hash MD5: 32K
       16 9F 97 DA A0 26 BF 00 0C D0 17 7B 8D 1F 3E 3D>)
$$ ##END=
$$ 
$$ $$ hash MD5
$$ $$ 7B D4 B3 3C 4A B7 2B D3 2B 60 9A 18 D4 EE 65 92
##$RELAX= 
##$RELAX= 
##$RELAX= 
##$RELAX= 
##$RELAX= 
##$RELAX= 
##$RELAX= 
$$ Bruker specific parameters
$$ --------------------------
##$DU= <E:\>
##$EXPNO= 10
$$ [...]
150 150 150 150 150 150 150 150
##$TP07= 0
##$TPNAME0= <>
##$TPNAME1= <>
##$TPNAME2= <>
##$TPNAME3= <>
##$TPNAME4= <>
##$TPNAME5= <>
##$TPNAME6= <>
##$TPNAME7= <>
##$TPOAL= (0..7)
0.5 0.5 0.5 0.5 0.5 0.5 0.5 0.5
##$TPOFFS= (0..7)
0 0 0 0 0 0 0 0
##$TUNHIN= 0
##$TUNHOUT= 0
##$TUNXOUT= 0
##$USERA1= <user>
##$USERA2= <user>
##$USERA3= <user>
##$USERA4= <user>
##$USERA5= <user>
##$V9= 5
##$VALIST= <valist>
##$VCLIST= <CCCCCCCCCCCCCCC>
##$VD= 0
##$VDLIST= <DDDDDDDDDDDDDDD>
##$VPLIST= <PPPPPPPPPPPPPPP>
##$VTLIST= <TTTTTTTTTTTTTTT>
##$WBST= 2048
##$WBSW= 25
##$XGAIN= (0..3)
0 0 0 0
##$XL= 0
##$YL= 0
##$YMAX_a= 673578
##$YMIN_a= -571954
##$ZGOPTNS= <>
##$ZL1= 120
##$ZL2= 120
##$ZL3= 120
##$ZL4= 120
##$ABSF1= 14.98509
##$ABSF2= -5.573092
##$ABSG= 5
##$ABSL= 3
##$ALPHA= 0
##$AQORDER= 0
##$ASSFAC= 0
##$ASSFACI= 0
##$ASSFACX= 0
##$ASSWID= 0
##$AUNMP= <proc_prof1d_extract_pilot.lims>
##$AXLEFT= 0
##$AXNAME= <>
##$AXNUC= <1H>
##$AXRIGHT= 0
##$AXTYPE= 0
##$AXUNIT= <>
##$AZFE= 0.1
##$AZFW= 0.1
##$BCFW= 0
##$BC_mod= 0
##$BYTORDP= 0
##$COROFFS= 0
##$CY= 15
##$DATMOD= 1
##$DC= 0
##$DFILT= <>
##$DTYPP= 0
##$F1P= 0
##$F2P= 0
##$FCOR= 0.5
##$FTSIZE= 32768
##$FT_mod= 6
##$GAMMA= 0
##$GB= 0
##$INTBC= 1
##$INTSCL= 1
##$ISEN= 128
##$LB= 0
##$LEV0= 0
##$LPBIN= 0
##$MAXI= 10000
##$MC2= 0
##$MEAN= 0
##$ME_mod= 0
##$MI= 0
##$NCOEF= 0
##$NC_proc= -8
##$NLEV= 6
##$NOISF1= 0
##$NOISF2= 0
##$NSP= 0
##$NTH_PI= 0
##$NZP= 0
##$OFFSET= 14.98509
##$PC= 1
##$PHC0= 95.91614
##$PHC1= 0
##$PH_mod= 1
##$PKNL= yes
##$PPARMOD= 0
##$PPDIAG= 0
##$PPIPTYP= 0
##$PPMPNUM= 2147483647
##$PPRESOL= 1
##$PSCAL= 4
##$PSIGN= 0
##$PYNMP= <proc.py>
##$REVERSE= no
##$SF= 400.02
##$SI= 32768
##$SIGF1= 0
##$SIGF2= 0
##$SINO= 400
##$SIOLD= 32768
##$SPECTYP= <>
##$SREGLST= <1H.CDCl3>
##$SSB= 0
##$STSI= 32768
##$STSR= 0
##$SW_p= 8223.68421052631
##$SYMM= 0
##$S_DEV= 0
##$TDeff= 65536
##$TDoff= 0
##$TI= <>
##$TILT= no
##$TM1= 0
##$TM2= 0
##$TOPLEV= 0
##$USERP1= <user>
##$USERP2= <user>
##$USERP3= <user>
##$USERP4= <user>
##$USERP5= <user>
##$WDW= 1
##$XDIM= 32768
##$YMAX_p= 473445468
##$YMIN_p= -755841
##$CURPLOT= <Network HP LaserJet P1505>
##$CURPRIN= <$Network HP LaserJet P1505>
##$DFORMAT= <normdp>
##$LAYOUT= <+/1D_H.xwp>
##$LFORMAT= <normlp>
##$PFORMAT= <normpl>
##$SURQMSG= 1
$$ End of Bruker specific parameters
$$ ---------------------------------
##NTUPLES= NMR SPECTRUM
##VAR_NAME=  FREQUENCY,     SPECTRUM/REAL,   SPECTRUM/IMAG
##SYMBOL=    X,             R,               I
##VAR_TYPE=  INDEPENDENT,   DEPENDENT,       DEPENDENT
##VAR_FORM=  AFFN,          ASDF,            ASDF
##VAR_DIM=   32768,         32768,           32768
##UNITS=     HZ,            ARBITRARY UNITS, ARBITRARY UNITS
##FACTOR=    0.250966925370066, 1,           1
##FIRST=     8223.43324360094, 127003,       -90075
##LAST=      0,             -200076,         141110
##MIN=       0,             -755841,         0
##MAX=       8223.43324360094, 473445468,    0
$$ Real data points
##PAGE= N=1
##DATA TABLE= (X++(R..R)), XYDATA
$$ [...]
19535a67183k03841J31126A20031A2610i048I5343J35456b43296c407l3200k23925
19524b60532a09965A22733B7374b28619N1457K3542L1732k75118G3594h4373o816
19513i1189E6327N0073B4164b28481A76039a64880e4171I6731m7732a83934Q9172
19502i4762j70664C6885R3192o1915c75862h0017i094m7914a2470j8590G2161
19490a38591L2868A54758G05a7415l62325f6214A74506a59254a1374q8769n358
19479a05501j79533P4530j46160g7693m01738a69568c6350j05835O8634k24581
19469b98132e5034r2797F6453c1764k12347e2213q4173B25095b58240c0203j52129
19458a82332D049a9256j12616J9194J0570c8361l64717b9884l51842a68801k0168
$$ y = [-167183, -371024, -239898, 120031, 12610, -9048, 95343, 230799, -243296, -3407, -36607, -260532, -109965, 122733, 27374, -228619, -177162, -153620, -121888, -397006, 73594, -84373, -91189, 56327, 106400, 24164, -228481, 176039, -164880, -54171, 96731, 48999, -183934, -94762, -265426, 36885, 130077, 68162, -375862, -80017, -9094, -57008, -12470, -31060, 72161, -138591, -105723, 154758, 705, -17415, -379740, -66214, 174506, -159254, -11374, -100143, -105501, -285034, -210504, -356664, -77693, -479431, -169568, -36350, -142185, -73551, -298132, -55034, -147831, 66453, -31764, -244111, -52213, -136386, 225095, -258240, -30203, -182332, 4049, -19256, -131872, -112678, -102108, -38361, -403078, -29884, -381726, -168801, -188969]
19447a88969h1878k7358k62113B70224c80110J29082E7929a88944C0271d41748
19436a74325b0607A07756b20438E3643J29293e7l25148E6635a46461e6459j2692
19425f9151c060j12471G0407e2829I4399d733l2260k04438O4497Q8258j45084
19414b33760i5212K9596j64941k24130J67079r3345A7822c23097A26933C6094
19403B36490a96223J689B42069E0150F451c6887j79196A83197D1865I649a41811
19391A26481K62986b7037B7135a52084B03219c16225a13367j11305C8289a53136
19380F4086l0452a1942A7082g7776B39848b20824I3793k1799a86414C09379c08594
19368a74381j44367J43485D7078a75994A29583D5457o603Q605K00077a93743g4746
$$ y = [-188969, -81878, -109236, -371349, 270224, -380110, -251028, 57929, -188944, 30271, -441748, -174325, -20607, 107756, -220438, 53643, 182936, -57, -325205, 56635, -146461, -56459, -69151, -3060, -115531, 70407, -52829, 94399, -4733, -36993, -241431, -176934, -88676, -233760, -95212, -65616, -230557, -454687, -287608, -380953, 17822, -323097, 126933, 36094, 236490, -196223, -194534, 242069, 50150, 6451, -36887, -216083, 183197, 41865, 9649, -141811, 126481, 389467, -27037, 27135, -152084, 203219, -316225, -113367, -224672, 38289, -153136, 64086, 33634, -11942, 17082, -77776, 239848, -220824, 93793, 71994, -186414, 309379, -308594, -174381, -318748, -175263, 47078, -175994, 129583, 45457, 38854, 47459, 247536, -193743, -74746]
19356C92961A69372a82675r9839i151A18724B5067b52637i3903n516I2593K0520
19345A13113b8218E269b1734B43769i6311j7893c8184j38920C9256d852k6144
19334c0996j45505E2145c98681A31498N2451b70086R3243o426g077I3443c15363
19322b2851B8309L7270N8829C898b62813a977j73760b5590l27245a73005F2306
19310b49111A52451a2256n2759C5598b6395p7091D7837b5017j00625d1345l15654
19299c56999B22863c28991C296a62705j04528A68940R1607f1081C3948K62156
19289B96104F6028b13010h7470k5167A64935H0393a0814m0114o0841E5415b97460
19277e9196F4594K8705f9967a9405j55393l9300E5394a58257j6793j11508F4164
$$ y = [392961, 169372, -182675, -282514, -9151, 118724, 25067, -252637, -93903, -99419, 92593, 113113, -28218, 5269, -21734, 243769, -96311, -114204, -38184, -177104, 39256, -4852, -30996, -176501, 52145, -398681, 131498, 183949, -270086, -176843, -183269, -7077, 93443, -315363, -22851, 28309, 65579, 124408, 3898, -262813, -1977, -175737, -25590, -352835, -173005, 62306, -249111, 152451, -12256, -65015, 35598, -26395, -103486, 47837, -25017, -125642, -41345, -356999, 222863, -328991, 3296, -162705, -267233, 168940, 260547, -61081, 33948, 296104, 66028, -213010, -87470, -112637, 164935, 80393, -10814, -50928, -111769, 55415, -297460, -59196, 64594, 93299, -69967, -19405, -174798, -214098, 55394, -158257, -175050, -286558, 64164]
19265a61745H1281C4476Q5231b58320A01990A4452a21236E3405J28904b0991k09993
19254b30984p1568A34428E8003K74473a76678b5144D2596a48668J4565e130B52043
19242a91128n2762C17402b03694B05895r8492D0227b26198A91227p7090g1655
19231b65387K1338D8514b19833C54804D1351N6276a36224B12542a33937L6893
19221i7044j7082D1224A5885J0842d5466a0280j04058B9201A0387J34359i8556
19209a30737l627b1349C8808c35199A69301a1114A20433f16791K86962A8193N0797
19198F8990Q7949l2279a76098j95309o7366A98105a65931a1099p791k19387E3340
19186c2272l43523a87661A73776l2768k9308C1295b50357H9751c57839k36396
$$ y = [-161745, 81281, 34476, 119707, -258320, 101990, 14452, -121236, 53405, 182309, -20991, -230984, -302552, 134428, 58003, 332476, -176678, -25144, 42596, -148668, -134103, -5130, 252043, -191128, -243890, 317402, -203694, 205895, 107403, 40227, -226198, 191227, 114137, -71655, -265387, -244049, 48514, -219833, 354804, 41351, 97627, -136224, 212542, -133937, -97044, -114126, 41224, 15885, 26727, -45466, -10280, -114338, 29201, 10387, 144746, -98556, -130737, -134364, -21349, 38808, -335199, 169301, -11114, 120433, -616791, -329829, 18193, 68990, 156939, 124660, -176098, -371407, -438773, 198105, -165931, -11099, -18890, -238277, 53340, -32272, -375795, -187661, 173776, 141008, 111700, 31295, -250357, 89751, -357839, -594235]
19176e94235a83948A91792a52922j8948C11964c26714A13969a7961C1346h2635
19165b95360J18382L1779H3494A2649a23376p7134O1975c842l08410a04370j69986
19154b74356I622O172b87188J11649l180A69593h7228j00126j79505b86l7296
19143c7582A82170g9420j6419B3068e4178o4076n8222c7355j49123B53130F8866
19131C0638g5946m9360e2698C67688H4215a4339a808B902K78083b30658n4444
19120b85102C4354c5693j8172g483A40052a10305p6593j76703A44317D7205a21987
19108I0759b44401b2404C82026A7480c36456a65571I035a40913B3779D266M4907
19097D9173d36046e0098A89805b93080j86232D80c25814O2904B30018c1213a0855
$$ y = [-594235, -183948, 191792, -152922, -171870, 311964, -326714, 113969, -17961, 31346, -82635, -295360, -176978, -145199, 83494, 12649, -123376, -200510, -138535, -3842, -312252, -104370, -274356, 9622, 15794, -287188, -175539, -178719, 169593, -87228, -187354, -366859, -286, -37582, 182170, -79420, -95839, 23068, -54178, -118254, -176476, -37355, -186478, 253130, 68866, 30638, -75946, -125306, -52698, 367688, 84215, -14339, -1808, 2902, 280985, -230658, -285102, 34354, -35693, -53865, -7483, 140052, -110305, -186898, -363601, 144317, 47205, -121987, 90759, -244401, -22404, 382026, 17480, -336456, -165571, 9035, -140913, 23779, 4266, 49173, -436046, -50098, 189805, -293080, -479312, 480, -325814, -262910, 230018, -31213, -10855]
19085f675A16234n2731i8619o6975J5418E8249c83676C6793f6769k08323E5050
19073a28733H9103a13527l94908c4645l8734L2290l50077e9918C9758A1594a84427
19061c59200Q2171R8285j46650g4044N265A63328D3418J53385a78239A17216a34499
19049C72240b11674K9746Q1449C24974b49545J01896j36755R5328N4044B63447
19038d2638D0387j0822a486m09588c2982n8400A07427b3066A88949b6729A57467
19026A51679b75515A57196b34273C14512b44412i7687j17241i5618k32348D5290
19015b44329j5014G6154a46783e0034B56665a87995E3551J02106b6978E8304a6067
19003i6237B84123c45129C87137F3038d18339C39388f0034C028L6838a43858G2063
$$ y = [-6675, 116234, 63503, -98619, -165594, -150176, 58249, -383676, 36793, -66769, -275092, 55050, -128733, 89103, -113527, -508435, -34645, -73379, -41089, -391166, -59918, 39758, 11594, -184427, -359200, -277029, -178744, -325394, -74044, -68779, 163328, 43418, 196803, -178239, 117216, -134499, 372240, -211674, -181928, -100479, 324974, -249545, -147649, -284404, -189076, -135032, 263447, -42638, 40387, 29565, -1486, -411074, -32982, -91382, 107427, -23066, 188949, -26729, 157467, 151679, -275515, 157196, -234273, 314512, -244412, -97687, -214928, -95618, -327966, 45290, -244329, -259343, 76154, -146783, -50034, 256665, -187995, 53551, 155657, -26978, 58304, -16067, -96237, 284123, -345129, 387137, 63038, -418339, 339388, -60034, 3028, 39866, -143858, 72063]
18991D1833j0337c6285j78211C8984b09691d8033A11341P6013a22679j40914J27874
18980a35719D1863a1552l5338m43517a37767B79531b60592Q6723F2210c50001
18969b36629a03272r1301b9194o4686m418n00623a58908k4467G6451a38218R305
18958a28913k8102B68541b08895O7658O7558l18413J31749B9993N4160d7030C0143
18946C06261a7374k040l1040a7719A59553C8784a16536M4104j62023J8561C16112
18934C85801E5556d3991A86802r0033a63635o0721B4981a9689k87053G6086b22036
18922A25537d19171f3939A75495c76150a38172E33464c42790a29846j57912C65755
18911b62932f044k7447j96041I9356b69702a10482J5267j32312r8952a12103B0580
$$ y = [41833, 31496, -36285, -214496, 38984, -209691, -48033, 111341, 187354, -122679, -263593, -135719, 41863, -11552, -46890, -490407, -137767, 279531, -260592, -173869, 62210, -350001, -236629, -103272, -194573, -29194, -93880, -98298, -598921, -158908, -183375, 76451, -138218, -128913, -157015, 268541, -208895, -141237, -73679, -392092, -260343, 29993, 84153, -47030, 30143, 306261, -17374, -19414, -50454, -17719, 159553, 38784, -116536, -72432, -234455, -215894, 316112, 385801, 55556, -43991, 186802, 96769, -163635, -224356, 24981, -19689, -306742, 76086, -222036, 125537, -419171, -63939, 175495, -376150, -138172, 533464, -342790, -129846, -287758, 365755, -262932, -6044, -33491, -229532, 99356, -269702, -110482, -95215, -227527, -326479, -112103, 20580]
18899a97864j89774C18621d11j04005k12364q1642F2161P9685i3646j70246D9681
18887A26396b93870e3744q6454A09438a10502B29381a26428m2536c5339l86781
18877d22120C1969O1389a70802C0471J4990b76587P6793F0448a33034F0457b12521
18865A46386h3269p9603g8107L3780G9355M9612b05183j20005e8278j90107J19590
18854a28795C5407O9777B7926a93950b9726m653j42675c5435j37981M1190k11846
18843c44072R3554R1809I1410g9646C02625g5039j80622e6113H2158b9213m6124
18832g5337A31324J092b49557i0488m3880k4392I6994b15126Q2902b3339F3942
18820c8131A26480c32555a08894D69953a33996N9251A07349a40510A21566K03165
$$ y = [-197864, -387638, 318621, -411, -104416, -316780, -398422, 62161, 141846, -93646, -263892, 49681, 126396, -293870, -53744, -140198, 109438, -110502, 229381, -126428, -168964, -35339, -422120, 31969, 93358, -170802, 30471, 45461, -276587, -199794, 60448, -133034, 60457, -212521, 146386, -83269, -162872, -78107, -44327, 79355, 128967, -205183, -325188, -58278, -248385, -128795, 35407, 105184, 27926, -193950, -29726, -34379, -177054, -35435, -173416, -132226, -344072, -250518, -158709, 91410, -79646, 302625, -75039, -255661, -56113, 82158, -29213, -75337, 131324, 132416, -249557, -90488, -134368, -158760, 96994, -215126, -132224, -23339, 63942, -38131, 126480, -332555, -108894, 469953, -133996, -74745, 107349, -140510, 121566, 324731]
18810C24731g4113A57316g6258A90178f5011k3026L1911b1473j7314D311a85642
18798G294a62531P4915M0617D3182K61763H524a10587B22648i4343j37947A81573
18786H5040C5321L01964C9640M3270c11540A03162a48579G0089a61297B57091
18775c28068Q0611A8856i61k414C86093A08050J0092a06557J1739K0835B20454
18763d7480A33675a35705j04869I9381a31211j21987J12424A10115E0841b3459
18752c311B83442g0737m3510r5637l5390D8009d84138A52700l3860b43791o0845
18741c04636A92457a77875E8468a20993c1523B88399C6854J92100e9158j8610
18731g7768B1995b95784J4829d4675j52607B21329A09854h2908p9134k62589G7352
$$ y = [324731, -74113, 157316, -76258, 190178, -65011, -88037, -56126, -21473, -38787, 4311, -185642, 7294, -162531, -87616, -46999, 43182, 304945, 8524, -110587, 222648, -94343, -232290, 181573, 85040, 35321, 337285, 39640, 82910, -311540, 103162, -148579, 70089, -161297, 257091, -328068, -247457, 18856, -961, -3375, 386093, 108050, 118142, -106557, -94818, -73983, 220454, -47480, 133675, -135705, -240574, 99381, -131211, -253198, -140774, 110115, 50841, -23459, -3311, 283442, -70737, -114247, -209884, -245274, 48009, -484138, 152700, 118840, -243791, -304636, 192457, -177875, 58468, -120993, -31523, 288399, 36854, 228954, -59158, -77768, 21995, -295784, -280955, -44675, -197282, 221329, 109854, -82908, -162042, -424631, 77352]
18719g3367a6462A8955a57855L7584D9405b849r1315C7412c3247A70371b05765
18707b72989B33484c8678A11304n1876K1435a5899A7761i4333F2605b27350B1707
18695a36861f1697j41205c7585j30524q1687M9832B73188i0908B25770a71903
18684H2557a99945b6205k56293A42995l2925m6192K51893a59077b2005p6044k06383
18673c04432k0197N7874L5082e2513j79118B00076l3318n9485a57783D8088J0464
18662E8552h5237j35408C10469m4811D6847a59400A24315b73147C05070A7436
18651d4769j3758F2142j6010G90K52404a90880j50346h6026A50911i515k37463
18640b46978j03928A22153f7505A7103J10826b66762e6891A39662o4783J00392
$$ y = [-73367, -16462, 18955, -157855, -120271, 49405, -2849, -94164, 37412, -33247, 170371, -205765, -272989, 233484, -38678, 111304, 59428, 80863, -15899, 17761, -94333, 62605, -227350, 21707, -136861, -61697, -202902, -37585, -168109, -249796, -199964, 273188, -90908, 225770, -171903, 82557, -199945, -26205, -282498, 142995, 110070, 63878, 315771, -159077, -22005, -98049, -304432, -324629, -266755, -231673, -52513, -231631, 200076, 166758, 107273, -157783, 48088, 58552, -85237, -220645, 310469, 265658, 46847, -159400, 124315, -273147, 305070, 17436, -44769, -58527, 62142, 46132, 790, 253194, -190880, -341226, -86026, 150911, -9515, -246978, -350906, 122153, -67505, 17103, 127929, -266762, -56891, 139662, 74879, 175271]
18630A75271d946k03682h6785r4206r8386d5561n0250C23055G5869a33077B01227
18618a36130O7806j15445f6661l17261A43614d7053j79233G7380J10100b38637
18607A765d5609m3166j26465A24702a49816K6008l554A31810b17712a07047j8647
18596a25694A17382a26281D4381f204o1124m61373H0489a22416N5119C62344o4860
18585B97484A34623a35669A0931K66529b12833b0806m1822r191A21173h6536B74134
18573B98425c7948A96570c6168C0194J4367c0358l15722j7943J40741A40242a8444
18561b29846r037E6255L5324c29185J60138O1551A1005b15799A39071J03988a3345
18549a73194j45778a3862C42074c3205k24055R5284o24f9238B90381a22375A44103
$$ y = [175271, -4946, -208628, -86785, -180991, -279377, -45561, -95811, 323055, 75869, -133077, 201227, -136130, -68324, -183769, -66661, -383922, 143614, -47053, -226286, 77380, 187480, -238637, 1765, -45609, -88775, -215240, 124702, -149816, -123808, -127362, 131810, -217712, -107047, -125694, 117382, -126281, 44381, -6204, -67328, -528701, 80489, -122416, -67297, 362344, 297484, 134623, -135669, 10931, 277460, -212833, -20806, -62628, -71819, 121173, -86536, 274134, 298425, -37948, 196570, -36168, 30194, 44561, -30358, -346080, -364023, -223282, 140242, -18444, -229846, -238883, 56255, 91579, -329185, -169047, -107496, 11005, -215799, 139071, 243059, -13345, -173194, -318972, -13862, 342074, -33205, -257260, -161976, -162600, -69238, 290381, -122375, 144103]
18537A81943a40195n3292l4323i9684A30557f9117l31624A14447J2879c95011
18526f0887k95598a21365A01559d9798E0789c67877f6857j4975j82486f9645O354
18515f3291G5366a30487A92036O4235a17451k4036A66616p3152c1662F253J3147
18504A9400J98442a62825B13945b32300Q7199p9737B71568f9006j3433C12403
18493h5541q0948j51244c9264A32071a14498R398j9445M5569K1330G0503a31641
18481f402m26672J14651e5466M230n273k01965j33736N904E4046O5439a93567
18469a53923j62648B355e4190A93787c20409A40236C5753c388j59861n0638O78
18458b13209c8907j82624m974B49310A05657K50060j75757J3001J8910L6915f043
$$ y = [181943, -140195, -193487, -227810, -99684, 130557, -69117, -400741, 114447, 127326, -395011, -60887, -356485, -121365, 101559, -49798, 50789, -367877, -66857, -81832, -264318, -69645, -63291, 75366, -130487, 192036, 256271, -117451, -141487, 166616, 93464, -31662, 6253, 19400, 217842, -162825, 213945, -232300, -145101, -224838, 271568, -69006, -82439, 312403, -85541, -166489, -317733, -39264, 132071, -114498, -105100, -124545, -78976, -57646, 70503, -131641, -6402, -433074, -318423, -55466, -51236, -56509, -258474, -392210, -386306, 54046, 119485, -193567, -153923, -316571, 2355, -54190, 193787, -320409, 140236, 35753, -3388, -163249, -213887, -213209, -38907, -221531, -226505, 249310, 105657, 355717, 179960, 192961, 211871, 248786, -6043]
18446A66982F112a94725k919c3562D7335c21031c18m65055F4929a58380d8881
18434a30262A04587J02352D4898c95974J02408e0380j24920Q7497a9528l3358
18424e2886B72501a53607O0856D6186a38146R098A67973H678f1395B48823D0684
18412D1991f1052E05373I2350N1402E5253b25058j46716B44365o9086D8937g6729
18400E3139i0983H1697a3779j46563n9565A86380c19461O4671F5741K92027a79970
18388b30952A65327g5647C695J32578b00095A9302e6996j8743L0565b1074j75567
18377a96641F4911k0856K39267a32386A95489F2388d69993G2848A2202a34337
18366d54451A4736a88262A76789a86412Q7441K6718D9636Q3846a7625k2201j72013
$$ y = [166982, 6112, -194725, -197644, -33562, 47335, -321031, -318, -465373, 64929, -158380, -48881, -130262, 104587, 206939, 44898, -395974, -293566, -50380, -175300, -87803, -19528, -52886, 272501, -153607, -92751, 46186, -138146, -129048, 167973, 8678, -61395, 248823, 40684, 41991, -61052, 505373, 92350, 143752, 55253, -225058, -371774, 244365, 175279, 48937, -76729, 53139, -90983, 81697, -13779, -160342, -219907, 186380, -319461, -254790, 65741, 357768, -179970, -230952, 165327, -75647, 3695, 136273, -200095, 19302, -56996, -75739, -45174, -21074, -196641, 64911, 44055, 283322, -132386, 195489, 62388, -469993, 72848, 12202, -134337, -454451, 14736, -188262, 176789, -186412, -98971, -72253, 49636, 133482, -17625, -39826, -211839]
18355b11839f2203p7060o9730L8214D6160O9043R9896a22602L0436I817J6224
18344B6041J63965j2809f0609J6863A63102b40209Q3823A15972J41385a74462
18333D2461a40370I9845b82280b7220m50181J73236e0153B3039c6815B44355j10326
18322A34029P4171A01968L9569a64099m2496i9158A1427J16372f8972D3646a25543
18310A43907A6852d2264r4238F2827b75585A6798a93290R2656d4629G1091A4718
18298e2200m32020a74924r0903N3501F7796a34548a6446l68749B22536E8442i4413
18286c69077A03514j1502f912j10433A2225J75941q5707C5554M8113A1212b0842
18274A7457J24840o7128k9563B1527J96837b61078B08170i9858l8239B40158H8458
$$ y = [-211839, -62203, -139263, -208993, -170779, 46160, 115203, 215099, -122602, -92166, 9817, 26041, 190006, 177197, -60609, -43746, 163102, -240209, -156386, 115972, 257357, -174462, 42461, -140370, 99845, -282280, -27220, -477401, -304165, -50153, 23039, -36815, 244355, 134029, 208200, 101968, 141537, -164099, -206595, -99158, 11427, 127799, -68972, 43646, -125543, 143907, 16852, -42264, -136502, 62827, -275585, 16798, -193290, -100634, -44629, 71091, 14718, -52200, -484220, -174924, -265827, -212326, 67796, -134548, -16446, -385195, 222536, 58442, -94413, -369077, 103514, 92012, -6912, -117345, 12225, 188166, 102459, 35554, 83667, 11212, -20842, 17457, 142297, 75169, 45606, 21527, 218364, -261078, 208170, -99858, -138097, 240158, 88458]
18262b07884J00284I3075J85180j6880d1119m0659G481A576g7551j4255I2864
18250C60924C7215a14428j57628l56752a16973N5683J6536k12438A09525c58351
18239A08906E76J3319i5693A20961A8468c7190a304r1203E2420d36179A58679
18227B7291b34471O5133E4693a36331d5167H4081a27326m304B63647h9500p9009
18216a68509d8949k78440K3113O0070A2041K23J55724A3297B873e68869a37655
18204A31830a05607A48071g4817C90862c0223o4594k97804a19667G0464b8229
18193B33276b45672B75308A37022a5683D4120A5466d11353b4453l95798a54281
18182G203b766I8983K5146b8721q2342e0187A69366F7938b56389a7107j16164
$$ y = [-207884, -107600, 93075, 278255, 261375, -41119, -81778, 7481, 1576, -77551, -91806, 92864, 360924, 37215, -114428, -272056, -628808, -116973, -61290, -44754, -257192, 109525, -358351, 108906, 576, 13895, -95693, 120961, 18468, -37190, -1304, -92507, 52420, -436179, 158679, 27291, -234471, -169338, 54693, -136331, -45167, 84081, -127326, -131630, 263647, -89500, -168509, -48949, -327389, -304276, -244206, 12041, 12264, 167988, 13297, 2873, -568869, -137655, 131830, -105607, 148071, -74817, 390862, -30223, -94817, -392621, -119667, 70464, -28229, 233276, -245672, 275308, 137022, -15683, 44120, 15466, -411353, -24453, -420251, -154281, 7203, -2766, 98983, 124129, -28721, -111063, -50187, 169366, 67938, -256389, -17107, -133271]
18171a33271b5979l3881K6891m8076A87673e7134B9914a88760K0798B29952j04735
18160A25217H653J8899J06305c0462C07271B7732b00955b4872I7903J71072a00079
18148a17728A21631J4216a0411j17088q6310R8795A12240j0057C1456b71435O6692
18137b04743C385a68004j24385E1655J28658c54548A77630a44230c3895A62653
18126c0348J1513A95893a38913q2090a9926k85562B12761b1338A60338a38847
18115a76286n0665K2330k92613h1027k8527A54249b7170j43164D36372j43827
18105B92545b7533j31244c9325a0818A07317a18519A67149a66955C03807i9699
18094A48053m5966K2318D1433J04617a04353n3127e5409j95174B23134F0279J0021
$$ y = [-133271, -25979, -59860, -32969, -81045, 187673, -57134, 29914, -188760, -167962, 229952, 125217, 8653, 27552, 133857, -30462, 307271, 27732, -200955, -24872, 97903, 268975, -100079, -117728, 121631, 135847, -10411, -127499, -213809, -115014, 112240, 102183, 31456, -271435, -204743, 3385, -168004, -292389, 51655, 180313, -354548, 177630, -144230, -33895, 162653, -30348, -18835, 195893, -138913, -221003, -19926, -305488, 212761, -21338, 160338, -138847, -176286, -226951, -204621, -497234, -81027, -109554, 154249, -27170, -170334, 436372, 292545, -27533, -158777, -39325, -10818, 107317, -118519, 167149, -166955, 303807, -99699, 148053, 102087, 124405, 41433, 146050, -104353, -157480, -55409, -250583, 223134, 60279, 70300]
18083G0300d0716A46286c23681i5635j50018B36644d8643J860k68816b699k20046
18072b22745A15956k6588K20910c02852a16228A09586c0809B74308d7181o9303
18062a16484A35949J1605F4346a89008e1106K0777C7029b87488J30686A5362i0506
18050b47768d5239m3759j41809a12698B54605i6002B32502e2491k29218g2944
18039a73649F2270P3556K70902A24670K10345j64779a14543n2922b3005A55274
18028g8037F3634A4742e9306C9184K41616a28928j69948b3826k07197A48600a80397
18016c3594p0790j72813G5506d26117B26070a03181A31416I585J34959a7872A06999
18004c5020G331b72122A94984a81036d6267C243P6995J16411d88355A16458g469
$$ y = [70300, -40716, 146286, -323681, -95635, -245653, 236644, -48643, -46783, -315599, -2699, -222745, 115956, 89368, 310278, -302852, -116228, 109586, -30809, 274308, -47181, -116484, 135949, 147554, 64346, -189008, -51106, -30329, 37029, -287488, -156802, 15362, -90506, -247768, -45239, -88998, -230807, -112698, 254605, -96002, 232502, -52491, -281709, -72944, -173649, 62270, 135826, 406728, 124670, 335015, 170236, -114543, -167465, -23005, 155274, -78037, 63634, 14742, -59306, 39184, 280800, -128928, -298876, -23826, -231023, 148600, -180397, -33594, -104384, -277197, 75506, -426117, 226070, -103181, 131416, 9585, 144544, -17872, 106999, -35020, 7331, -272122, 194984, -181036, -46267, 3243, 80238, 196649, -488355, 116458, -7469]
17992A13785e5716j71595G9767a25691A28073e9601A6827P7222f5597j94470D14793
17980H3847L82207a61393A44411G042b15967A71885a17814c574H6582b51940q7837
17969c39777J52326G1523b30932f9119B1826a63322A22975h877H3494K6321B469
17957h4156A76799J8876c01468A12236h6905A54699p5175e7395C17965D8170a94870
17945e0309o6750C91017A24455J0317J0683J25095j8428b15219B3036J4248K997
17934D0281K03536I3576L3350d5183j61812D5135K606a73770b8228D0218K70872
17923C11090b7325q7608B18355a37747M3681C65642H4052a24582B60590b48260
17912A78822G7486b26608K5181J6320n5957A17446P3539M3628D488c1178j9358
$$ y = [113785, -55716, -227311, 79767, -125691, 128073, -59601, 16827, 94049, -65597, -260067, 414793, 83847, 466054, -161393, 144411, 7042, -215967, 171885, -117814, -3574, 86582, -251940, -339777, -187451, 71523, -230932, -69119, 21826, -163322, 122975, -8877, 83494, 109815, 2469, -84156, 176799, 195675, -301468, 112236, -86905, 154699, 79524, -57395, 317965, 48170, -194870, -50309, -117059, 391017, 124455, 134772, 145455, 270550, 252122, -215219, 23036, 37284, 40281, 243817, 93576, 126926, -45183, -206995, 45135, 47741, -173770, -28228, 40218, 311090, -27325, -114933, 218355, -137747, -94066, 365642, 84052, -124582, 260590, -248260, 178822, 77486, -226608, -201427, -185107, -241064, 117446, 190985, 234613, 4488, -31178, -50536]
17901e0536m09018B642d2741j60988j9283o8491Q2356A88720i3284G341J18238
17890A25579N2061k9286L4856c33289i8894A32336f9485D8320h8026k6465e0915
17878a30908d3995B02726p1311a22316N9020p0775J8411A69631A6941J45071f0776
17866F9105J5184J41078c9140B97977a57257O5j08508J504D9653a20026A09924
17854g7671A79251d2667A21680a65318L4943A44426n36a67688B04594D0746K9066
17843F9812a29406C59925F7353K01085o2986l3201a15972F0305b23942l870o9718
17832b97530B5349Q7587P9735b09579L8303c9687A24213j009d1278k2405A65816
17820A24534R8428a48096A39015i5839B96512a10183C3509f3367k5755p0205A48459
$$ y = [-50536, -459554, 2642, -42741, -203729, -223012, -291503, -209147, 188720, -93284, 7341, 125579, 177640, 148354, 183210, -333289, -98894, 132336, -69485, 48320, -88026, -114491, -50915, -130908, -43995, 202726, 131415, -122316, -63296, -134071, -115660, 169631, 16941, 162012, -60776, 69105, 84289, 225367, -39140, 297977, -157257, -157192, -265700, -264196, 49653, -120026, 109924, -77671, 179251, -42667, 121680, -165318, -130375, 144426, 143890, -167688, 204594, 40746, 69812, -129406, 359925, 67353, 268438, 205452, 172251, -115972, 60305, -223942, -227812, -297530, 25349, 112936, 192671, -209579, -171276, -39687, 124213, 123204, -41278, -63683, 165816, 124534, 222962, -148096, 139015, -95839, 296512, -110183, 33509, -63367, -89122, -159327, 148459]
17808a02080r7486C043J38548h5506A88531a44451E0686J23507k5083E5764a80794
17796A09237f4012C59749j09528m2316a2269k36804a10753A35317J41544a94623
17785A09644A4830L4142P6296B7433a59831A79501J2823a86789D5605L0170h6746
17773a56974a9730f951k6555j4728l7113B16124A4032f182B96584b8728A01263
17761b25149A68508a45261l6286m6542B7571J23971B9443d9408j28186I987L57037
17750C67024b34789B16074F5430b06678h8198E8034I454a2333o1665j54208I6803
17738f0963b8455j57920A00519J08335k5099G9308a669j32195j4501E6330b01498
17726A6438c57871A78569a04212p7330C45339a69182L7360B45011A4437J04074
$$ y = [-102080, -199566, 3043, 141591, -85506, 188531, -144451, 50686, 174193, 149110, 55764, -180794, 109237, -64012, 359749, 250221, 207905, -12269, -249073, -110753, 135317, 276861, -194623, 109644, 14830, 48972, 125268, 27433, -159831, 179501, 192324, -186789, 45605, 75775, -86746, -156974, -19730, -6951, -33506, -48234, -85347, 216124, 14032, -6182, 296584, -28728, 101263, -225149, 168508, -145261, -181547, -228089, 27571, 151542, 29443, -49408, -177594, 9987, 367024, -234789, 216074, 65430, -206678, -88198, 58034, 9454, -12333, -73998, -228206, 96803, -60963, -28455, -186375, 100519, 208854, 183755, 79308, -1669, -133864, -148365, 56330, -201498, 16438, -357871, 178569, -104212, -181542, 345339, -169182, -131822, 245011, 14437, 118511]
17716A18511a43401A19137a85769G1397l5578a71390q4583H6522a98164G9689
17705A82215p5382D4849A2074N3356O7924B432a64335A12377N6650a08923B73
17693A3651J06909c50634A26842a20103A19026J40810b61067a18311l1340D23522
17682G3475K99495A78549c1790j616B27180b18676A47045L71310k4325f110j07158
17671a13268e0776q1685B69175E0461a59812A60975K33919D1528L43177b46086
17660G3833R4624J80146a5055q3925F5595a87778A17107J34951J04878C8043J70026
17649B08069N7802a28465p7576F4929g8081j19866C36844a49634j35660A02968
17638a52610f332j54844K1981B44339b47400A31434A8924e4468A25801J99254
$$ y = [118511, -143401, 119137, -185769, 71397, 35819, -171390, -255973, 86522, -198164, 79689, 182215, 106833, 44849, 12074, 65430, 133354, 2432, -164335, 112377, 169027, -108923, 273, 13651, 120560, -350634, 126842, -120103, 119026, 259836, -261067, -118311, -149651, 423522, 73475, 372970, 178549, -31790, -33406, 227180, -218676, 147045, 518355, 494030, -6110, -113268, -50776, -132461, 269175, 50461, -159812, 160975, 394894, 41528, 384705, -246086, 73833, 168457, 348603, -15055, -98980, 65595, -187778, 117107, 252058, 356936, 38043, 208069, 265871, -128465, -206041, 64929, -78081, -197947, 336844, -149634, -285294, 102968, -152610, -6332, -161176, -139195, 244339, -247400, 131434, 18924, -54468, 125801, 325055]
17628C25055a47378A65525Q1618j8740a18064b7783A09537b921C54636a8072c413
17616H316b2718A66483a14261d6635o489B40950k7369M5109p7956o6167i5671
17604a12999B13671A4984J41303b05137j33423B07897a30976b2362l87551B63344
17593F4601R5610J81596a4100E9108b1551n60154b0336B9617a61264F6259f8341
17581B28067E0895K08422I6024M1850h688A67790F1145d1758o5792k57484A13986
17569A91592k5836e0201A12703K22473D5517f0042J2383l0994A66730K31132j58928
17558B38934i3259A89598Q3594m2369n3849B8245J51922l684o5411R5270l3920
17547A72422a37412j09023e7895A27660a67066A62675f3059C28348G910b7620
$$ y = [325055, -147378, 165525, 247143, 228403, -118064, -27783, 109537, -2921, 354636, -18072, -3413, 8316, -22718, 166483, -114261, -46635, -53124, 240950, 213581, 258690, 180734, 114567, -95671, -112999, 213671, 14984, 156287, -205137, -338560, 207897, -130976, -22362, -409913, 263344, 64601, 160211, 341807, -14100, 59108, -21551, -581705, -20336, 29617, -161264, 66259, -68341, 228067, 50895, 259317, 96024, 137874, -8688, 167790, 61145, -41758, -107550, -365034, 113986, 191592, 165756, -50201, 112703, 335176, 45517, -60042, -47659, -78653, 166730, 397862, 238934, -93259, 189598, 273192, 230823, 176974, 28245, 180167, 176483, 111072, 206342, 172422, -137412, -246435, -57895, 127660, -167066, 162675, -63059, 328348, 7910, -27620]
17536B2671e0786b0128A20493a48735A71929q5173C2702M2005K02949A3346h5418
17524c6809j589A65898G0852h7233A64403D5167c4388j7561H9840j2383A3622
17512e5228A98261E0798K96992H7381O2634c84318G794L9850a13292a7293C24062
17500A31624b63579J11709d5286B15395K11804A64434L09094A9339M66944c4768
17489C38725A64225E0730M417J06938O9322a34217b4546B00221a47305G0762J08356
17478A79118a04577B12898b998C09022K5124A56051J41120b819F2998J7981K27360
17467C08339i0348d437A44561B1412J43176M1776d5817f639A31010j8774J22629
17456B34865d4463D78136j88671a37103F9402L10259B2285f2492E09310k36024
$$ y = [22671, -50786, -20128, 120493, -148735, 171929, 86756, 32702, 74707, 277656, 13346, -85418, -36809, -38398, 165898, 70852, -87233, 164403, 45167, -34388, -51949, 89840, 77457, 13622, -55228, 198261, 50798, 347790, 87381, 150015, -384318, 7794, 47644, -113292, -17293, 324062, 131624, -263579, -151870, -45286, 215395, 427199, 164434, 473528, 19339, 486283, -34768, 338725, 164225, 50730, 55147, 162085, 231407, -134217, -24546, 200221, -147305, 70762, 179118, -104577, 212898, -2998, 309022, 334146, 156051, 297171, -2819, 62998, 80979, 308339, -90348, -4437, 144561, 21412, 164588, 206364, -45817, -6639, 131010, 112236, 234865, -44463, 478136, 289465, -137103, 69402, 379661, 22285, -62492, 509310, 273286]
17446B73286L8717J22732K32681A85333K38571n2203K73891B98882a21145D3740
17435A74200J55503n0449g6271A97986J80450j37807L33193k21425j3235j55731
17425A83431J94179L6727f0365C64445A69290p905p7397M0443A6401K14167p8536
17414A52032L66644j62401K2063E6020g2613n6223B86725A15855J57627n533D5322
17402h0543D42595a25877A10657E084d5310H7008P2294a5498n732A87570J52271
17391C39841b96980B39501J53661A35575k4514J35726K15912A36661L58300A67191
17380B62661a09225a5072A45156b09712A09284L25527A092Q4916K23079m1840
17370B67247E7781M22278k13572J73235J53918B76773c16556B64823m9557M946
$$ y = [273286, 312003, 434735, 667416, 185333, 423904, 371701, 645592, 298882, -121145, 43740, 174200, 329703, 279254, -76271, 197986, 378436, 240629, 573822, 352397, 339162, 183431, 377610, 414337, -60365, 364445, 169290, 161385, 83988, 124431, 16401, 230568, 152032, 518676, 356275, 378338, 56020, -72613, -128836, 286725, 115855, 273482, 267949, 45322, -80543, 442595, -125877, 110657, 5084, -45310, 87008, 159302, -15498, -21230, 187570, 339841, -296980, 239501, 393162, 135575, 111061, 246787, 462699, 136661, 494961, 167191, 262661, -109225, -15072, 145156, -209712, 109284, 434811, 1092, 86008, 309087, 267247, 57781, 480059, 266487, 439722, 593640, 276773, -316556, 264823, 215266, 220212]
17360B20212h1783G0638Q9957K51819D9745J60687n3869K02939L4140A92235l3381
17349A58854h906B65021o3361m7627J09259r9363R7077I8978N6400J56347j7196
17338B94529r5395B5006n111L14168A33095L52348A14189b128C82528q6362E8754
17326H106J79405l1761r469B1920J16520l0535J67882q733g941B72406I0767J31546
17314B22313r0766J79273j32446C3954K68508M6809A21495n346M9062K23556E9454
17302i457l0207C9146P4862J27474K03931A49162j3011K29451q4635m4785R3647
17291C29829A51804K23731j45714K14102A02078K95417A28695J34736C5044h3691
17280c6485B54860E7619K93341j01522J27091j52966L02423b7114D06730A839
$$ y = [220212, -81783, 70638, 160595, 412414, 49745, 210432, 156563, 359502, 393642, 192235, 158854, -8906, 265021, 201660, 154033, 263292, 163929, 261006, 98978, 155378, 311725, 294529, 199134, 25006, 19895, 334063, 133095, 485443, 114189, -2128, 382528, 296166, 58754, 8106, 187511, 155750, 146281, 21920, 138440, 107905, 275787, 267054, -7941, 272406, 90767, 222313, 131547, 310820, 178374, 33954, 302462, 349271, 121495, 116149, 165211, 388767, 59454, -9457, -39664, 39146, 114008, 241482, 445413, 149162, 136151, 365602, 280967, 236182, 329829, 151804, 375535, 229821, 443923, 102078, 397495, 128695, 263431, 35044, -83691, -36485, 254860, 57619, 350960, 249438, 376529, 223563, 525986, -27114, 406730, 1839]
17269A36089O9771I57M15699a93505E7669a67670B844J20720K62054j36623n5649
17258A93346J45428J11573m2224j98089l3419a67745D15719j5575j67051h4145
17247A11491a34149A36096e0446D27620A83882J26788J07973j19635a81994C30102
17236B89231H9172K40550I2029K5482L07141A38872J54132K10854A42680J03181
17226B45861J6646L3909L9163j37387E1612L73205k84l1203N5014G3576j3843
17215E9733L4554J88928j31386J31581A25795K25391j59286l7211J94592q6576
17205B62705j16630K95832j04924J07211B14772P103J78914A58047O9354J86248
17195D13649j53297A6362N54402A17319J54279L7260A1037J39025J26985K0985
$$ y = [136089, 205860, 957, 416656, -193505, 57669, -167670, 2844, 123564, 385618, 248995, 193346, 338774, 450347, 408123, 210034, 176615, -167745, 415719, 400144, 233093, -84145, 111491, -134149, 136096, -50446, 427620, 183882, 310670, 418643, 299008, -181994, 330102, 289231, 89172, 329722, 92029, 117511, 424652, 138872, 293004, 503858, 142680, 245861, 262507, 296416, 335579, 198192, 51612, 424817, 424533, 393330, 448344, 73576, 59733, 94287, 283215, 151829, 283410, 125795, 351186, 191900, 154689, 349281, 262705, 146075, 441907, 336983, 444194, 214772, 221875, 400789, 158047, 227401, 413649, 260352, 16362, 570764, 117319, 271598, 308858, 11037, 150062, 277047, 298032]
17185B98032j46200L29008j22691N4757A39007R3999c5043A93945K60243j70819
17175B83369H0623N43236B89139q9298J67550j57287K76960o7908r903M4925J11945
17164E66123j64573K4247p3873j07928J75448j03607j448o7705J01548J68168
17154E16400k26026M1365O1705n2353A20481M51250B31703P3766p158J92202j06285
17143C84228K13359q2131P0346j60503R7976J46127k40436k1399j17968M4253
17133C33852O7966o85l3738J67971k26908N9700L835r9808A03703K18902q0607
17122B41998P02156C69583D475L28044N9401K8847m3247m2108L4695N1231j19001
17111C02337k7252r1364L51546B05517m5343L72186Q7200q8297r2465j72982o188
$$ y = [298032, 151832, 480840, 358149, 412906, 139007, 233006, -35043, 193945, 454188, 283369, 80623, 623859, 289139, 199841, 367391, 210104, 487064, 419156, 409253, 454178, 566123, 401550, 425797, 351924, 243996, 419444, 315837, 314389, 246684, 348232, 516400, 290374, 331739, 393444, 341091, 120481, 571731, 231703, 305469, 298311, 490513, 384228, 597587, 515456, 585802, 425299, 523275, 669402, 428966, 407567, 289599, 333852, 401818, 401133, 367395, 535366, 308458, 368158, 371993, 272185, 103703, 322605, 241998, 944154, 369583, 4475, 332519, 391920, 420767, 377520, 335412, 370107, 421338, 302337, 275085, 183721, 535267, 205517, 160174, 532360, 619560, 531263, 438798, 265816, 259628]
17100B59628L95861k56811J88061H4734N44109k1900B96408K13931r8474K94914
17090G06779B51056M68209p2847j38018B43267M55983C24774K18851j68202K5540
17080D00963M7405j91231J43176R5115j7844J87426q4124j68698K79096k07336
17070D83948M7217J67276l34770L00878J68187l63153K57718l09435J93420J59639
17060G70925k84590j56841L57367j53819J29630B71225J2025J92416J33837J54099
17050G63602k33275J50476R7761C14438L32696q5692P2595j71417L0947J54280
17040F47847M3747J32986j59995K97065j2257C64013L94190B80791J49541p2570
17030C57762J87492L0702K73551N2595l69450K11392j53738O40764j07467m82410
$$ y = [259628, 655489, 398678, 586739, 84734, 628843, 606943, 296408, 510339, 411865, 706779, 251056, 719265, 646418, 508400, 243267, 699250, 324774, 543625, 375423, 400963, 448368, 257137, 400313, 495428, 477584, 665010, 580886, 412188, 691284, 483948, 531165, 698441, 363671, 664549, 832736, 469583, 727301, 417866, 611286, 770925, 486335, 329494, 686861, 533042, 662672, 271225, 283250, 475666, 609503, 763602, 530327, 680803, 778564, 314438, 647134, 561442, 634037, 462620, 493567, 647847, 691594, 824580, 664585, 961650, 949393, 364013, 758203, 280791, 430332, 357762, 545254, 575956, 849507, 902102, 532652, 744044, 590306, 1231070, 1123603, 641193]
17020F41193J2188j71518L24121N4907q739q2331K455r106J19810j97162m5323
17009F40495K37476k7225K8572j13223R540o7426P9818j94294j1903M89287m3381
16998A027736J58918k92519n2376K30859E24733M09032j14550K07034p2934J31692
16988A085007j81270L69905N3212k05430j89613j42536L7108j40627J19979L43390
16978A149125k65154K66341j72348r466Q7544j34171J26749M595j0256J23808
16968A166767j9691j27842N64011o07108P0062N3580J24242j5525q8645L12121
16958A431972j55463j19236J99451l60098L26996N363j0138J502j53142M2798
16948A210005R8729m1049j47119J77577R8267P2791l05510L81046J4387k92418
$$ y = [641193, 653381, 481863, 805984, 860891, 852152, 769821, 772276, 763170, 882980, 685818, 640495, 877971, 850746, 879318, 766095, 775635, 708209, 788027, 593733, 581830, 1071117, 1027736, 1186654, 894135, 841759, 1072618, 524733, 933765, 819215, 1026249, 953315, 1085007, 903737, 1273642, 1326854, 1121424, 931811, 789275, 826383, 685756, 805735, 1149125, 883971, 1150312, 977964, 968498, 1056042, 921871, 1048620, 1053215, 1042959, 1166767, 1147076, 1019234, 1583245, 976137, 1046199, 1099779, 1224021, 1208496, 1119851, 1431972, 1276509, 1157273, 1356724, 996626, 1323622, 1328985, 1318847, 1320349, 1167207, 1210005, 1308734, 1267685, 1120566, 1298143, 1396410, 1469201, 1163691, 1544737, 1559124, 1266706]
16938A266706L20717l11675j65492O13015j23474j27116K79857j63298m4132O417
16928A551525K18082l79739J72603K49654n2943k50785M71397m56673K20333K8809
16918A772263m7031J88156l70077R198J01550P922l53485K13120K75485j68604
16908A628497P6926K21874P2479K18199j35130K0128N130L9999l39332L36186
16898B144956o3296K48689j93860j72687L24463m32237L34367l0271j96987M18027
16888B381164O9000p2814l40687P50754j47698J9103n67531L92537L8911L91596
16878B914335j16941j91427L15696L5588k37486K60996p8557K94281k88581J20499
16868C028403j93500o7250M95532k53305K29300l14055P9325K80119l765J2790
$$ y = [1266706, 1587423, 1275748, 1110256, 1723271, 1599797, 1472681, 1752538, 1589240, 1545108, 1551525, 1769607, 1389868, 1562471, 1812125, 1759182, 1508397, 1979794, 1523121, 1743454, 1772263, 1725232, 1913388, 1543311, 1552509, 1654059, 1661981, 1308496, 1521616, 1797101, 1628497, 1705423, 1927297, 1999776, 2217975, 2082845, 2102973, 2108103, 2148102, 1808770, 2144956, 2081660, 2330349, 2136489, 1963802, 2288265, 1856028, 2190395, 2160124, 1963137, 2381164, 2450164, 2377350, 2036663, 2787417, 2639719, 2658822, 2091291, 2483828, 2522739, 2914335, 2797394, 2605967, 2921663, 2957251, 2719765, 2980761, 2902204, 3196485, 2907904, 3028403, 2834903, 2767653, 3263185, 3009880, 3239180, 2925125, 3004450, 3284569, 3280804, 3293594]
16858C293594L40884M7316m1350J1658o1260K42201j80086K78721j45083M32879
16848D219474k71948J74243m050q0906q1744L09821J055J55848K17681p2666j8591
16837D548217J17803J34766J79629j96423P9283M76117J74820j22117q2979J07117
16827E416233k5530M90792m2451J49840N9299O3850L43134J56818M47074l68750
16817F690309q4858P03870j88126Q8437K87712j064K04706j62840M61528O3873
16807H063547N5966M39050R7354L43641k1059J49695M64260Q1712J95250J80867
16797A0050283L24433L37737J73604M14557O4235L75843K86216L06775K02240
16788A2535923J41484N63510N64272J68386M20579K04152O55771K19337O58816
$$ y = [3293594, 3634478, 3681794, 3640444, 3652102, 3590842, 3833043, 3652957, 3931678, 3786595, 4219474, 3947526, 4121769, 4117719, 4036813, 3955069, 4264890, 4265945, 4421793, 4639474, 4566808, 4548217, 4666020, 4800786, 4980415, 4783992, 4863275, 5339392, 5514212, 5392095, 5309116, 5416233, 5390703, 5881495, 5839044, 5988884, 6048183, 6112033, 6455167, 6611985, 7059059, 6690309, 6605451, 7309321, 7121195, 7209632, 7497344, 7496280, 7700986, 7538146, 7999674, 8063547, 8119513, 8558563, 8655917, 8999558, 8978499, 9128194, 9592454, 9674166, 9869416, 10050283, 10374716, 10712453, 10886057, 11300614, 11364849, 11740692, 12026908, 12333683, 12535923, 12677407, 13240917, 13805189, 13973575, 14394154, 14598306, 15254077, 15473414, 16132230]
16779A6132230M89370O80755N34540O46660K91456L45438J110982M08673P34266
16770B1374370P73576J134339P61149K42047R87863J271808R55677R95371J096828
16761B9593028J326077J138317J356445J208017J663798J492541J504394J531954
16753D0814571K001687K047865K161404J690587K850454K426457K504022K666740
16745E9163787K643299L170788L604336L797470L870508L809704M091918M529574
16737H8681384M391326N141801N295551N227636N893689N669056O169174N891358
16729A32360975O151928N935788O013939N770078N394592M741259M368073L630616
16721A74367248L263600J900418J136618L25089j130370j757454k528525l416658
$$ y = [16132230, 16621600, 17302355, 17836895, 18483555, 18775011, 19120449, 20231431, 20640104, 21374370, 22147946, 23282285, 24043434, 24285481, 25273344, 26545152, 27500829, 28496200, 29593028, 30919105, 32057422, 33413867, 34621884, 36285682, 37778223, 39282617, 40814571, 42816258, 44864123, 47025527, 48716114, 51566568, 53993025, 56497047, 59163787, 61807086, 64977874, 68582210, 72379680, 76250188, 80059892, 84151810, 88681384, 93072710, 98214511, 103510062, 108737698, 114631387, 120300443, 126469617, 132360975, 138512903, 144448691, 150462630, 156232708, 161627300, 166368559, 170736632, 174367248, 177630848, 179531266, 180667884, 180992973, 179862603, 178105149, 175576624, 172159966]
16713A72159966l949140m967591m923232n855565n920073o038531o216805o323761
16705A27965268n777666n981419n968814n411763n612101n035861n464143l958295
16697H4755206m599265l765309m282071l418424l925687k975610l038666k764013
16689E5986161k511347k928284k093558k415659j953521k170432j849003j700265
16681C8364092j662817j415200j361546j601359j303578j097000j450398j121110
16673B7351084r89794r32030q39559j161579n87113q54394n73430j246131r6632
16664B0070422j268662l72199n08606p53258o76428n96987j32406o00153n04660
16655A4657063l89983n24500J7382m38003n52010n01561k99795m90862J75293
$$ y = [172159966, 168210826, 163243235, 158320003, 152464438, 146544365, 140505834, 134289029, 127965268, 122187602, 116206183, 110237369, 104825606, 99213505, 94177644, 88713501, 84755206, 80155941, 76390632, 72108561, 68690137, 64764450, 61788840, 58750174, 55986161, 53474814, 50546530, 48452972, 46037313, 44083792, 41913360, 40064357, 38364092, 36701275, 35286075, 33924529, 32323170, 31019592, 29922592, 28472194, 27351084, 26361290, 25429260, 24589701, 23428122, 22841009, 21986615, 21413185, 20167054, 20070422, 18801760, 18429561, 17920955, 17167697, 16491269, 15894282, 15761876, 15161723, 14657063, 14267080, 13742580, 13759962, 13321959, 12769949, 12268388, 11968593, 11477731, 11653024]
16646A1653024o10425l57172l45177K16737n98865k20003L9839m50082j63934
16637I163942k29937k56861m86005L33061n74694l01518j19041J7595l18830n8861
16627G168851j890j49095j72268n11961P1237l6087J95814o74025J1992m5757
16617E856811l37935j54134K74874j02737l93228O7403l14644J57110k88080n57985
16607D207455O43488l0756j45250Q7403l47102j85947j87611J94110m31283L04705
16597D109212j29490j35508k04252j98834K54787n1477L2213k56931K04928l06784
16587C317864j42789j32769L36604m33577K37972Q1476l30726N3030K30071j83161
16577C033995k21030k27103M32977j71032j27649J03662o073m05244l5796j66479
$$ y = [11653024, 11042599, 10685427, 10340250, 10556987, 9958122, 9738119, 9777958, 9327876, 9163942, 8934005, 8677144, 8191139, 8524200, 7949506, 7647988, 7528947, 7546542, 7227712, 7168851, 7166961, 7017866, 6845598, 6333637, 6404874, 6368787, 6564601, 5890576, 5902568, 5856811, 5518876, 5364742, 5639616, 5536879, 5143651, 5211054, 4896410, 5053520, 4765440, 4207455, 4850943, 4820187, 4674937, 4762340, 4415238, 4229291, 4041680, 4235790, 3804507, 4109212, 3979722, 3844214, 3639962, 3441128, 3695915, 3644438, 3676651, 3419720, 3624648, 3317864, 3175075, 3042306, 3378910, 2945333, 3183305, 3264781, 2934055, 2987085, 3217156, 3033995, 2812965, 2585862, 3018839, 2847807, 2720158, 2823820, 2817747, 2412503, 2376707, 2210228]
16567B210228L68135R452M5638m47273N44469p28140J63077K03038l72506K87178
16557B283296j37795l756n8046l9317L2704o4118n7129k02936K56112J1521J57041
16546B177577l20716j98221J51596o5500l5060j23274m2936R4866K38700k54885
16536A622147k2800J60773k95835J74745j31375R5364j95953J47446K73192j95461
16526A632243j46993j15050j40930K71384r8218N283j18354o1261K14297Q3062
16516A525463m33056J10481K97278k91267k6665J96106J12838l90064q210K04468
16506A297372j49869j2264J56198k51457k41280L76446J03139J31360k01573j09071
16496A099001K61793F01565J59092N98959k72552J02213k2094j63869L3351q1395
$$ y = [2210228, 2578363, 2587815, 2633453, 2186180, 2730649, 2002509, 2165586, 2368624, 1996118, 2283296, 2145501, 2141745, 2083699, 2044382, 2077086, 2012968, 1955839, 1752903, 2009015, 2020536, 2177577, 1856861, 1658640, 1810236, 1744736, 1709676, 1586402, 1543466, 1638332, 1877032, 1622147, 1599347, 1760120, 1464285, 1639030, 1507655, 1603019, 1407066, 1554512, 1827704, 1632243, 1485250, 1370200, 1229270, 1500654, 1402436, 1407719, 1289365, 1228104, 1442401, 1525463, 1092407, 1202888, 1500166, 1208899, 1182234, 1378340, 1491178, 1101114, 1092904, 1297372, 1147503, 1135239, 1291437, 1039980, 798700, 1175146, 1278285, 1409645, 1208072, 1099001, 1360794, 601565, 760657, 1359616, 1087064, 1189277, 1167183, 1003314, 1036665, 955270]
16486I55270p0373K07828K2301m41731J72236Q4345L08647l22598L19821m89047
16476G46699J39698J07336J06163l17110J47460J22444k58049k10485r126L7785
16466F12815L47631j58311L738k01627L05275j55635k65543J74207K89389l04066
16456F47873J07182O01152m59033l53219P2965j35842N05347D79131N6989K06226
16446G42346k00296j66474K08710J22072j03708N7239j04609J49053j25672k45468
16436C33193K96042K3344O0852q7689l7396Q9969j48711K56848k21470q6780k19460
16425B58742M21162j77065o6586J81698l4255j10637n1926I5348L31968J78997
16415F06313q4576J8058K06622j365k21068N4372j33232J4307L13228C70949J22396
$$ y = [955270, 884897, 1092725, 1115026, 673295, 845531, 929876, 1238523, 915925, 1235746, 746699, 886397, 993733, 1099896, 782786, 930246, 1052690, 794641, 584156, 575030, 612815, 960446, 802135, 805873, 604246, 909521, 753886, 488343, 662550, 951939, 647873, 755055, 1356207, 897174, 543955, 616920, 481078, 986425, 479131, 536120, 742346, 542050, 375576, 584286, 706358, 602650, 659889, 555280, 704333, 578661, 333193, 629235, 652579, 713431, 625742, 588346, 678315, 529604, 786452, 564982, 478202, 258742, 679904, 502839, 436253, 617951, 583696, 473059, 421133, 95348, 427316, 606313, 521737, 539795, 746417, 745052, 523984, 578356, 445124, 459431, 772659, 370949, 493345]
16404D93345Q8213M6109B81409Q0930r7750l6498M17813J89038l86817j9753j37598
16393B90774R5648A20028Q4148M82082j90811r3062j27976M7799F9272J28949
16383A98221J55148m7719K19316j70830J0312K59963q6732j91716P2567J35537
16373E54067B00907k8450o5453K5244N44855A48044J47989J55847j56255J58542
16363D54167j17608K2962L73021A90854J27727L2690P9537O4632J21080j97367
16353D19153n8569H4977K33994j38907J25443j13677L12780k32123j1281K24573
16343D85779j52605C2789J53922j0504K87432j58187A49342K03156A37460n361
16333A32099K69456r9809K18537A50374L9160l9828D260K45983n7577K33505A99832
$$ y = [493345, 581558, 627667, 281409, 362339, 264589, 228091, 645904, 834942, 448125, 428372, 290774, 386422, 120028, 204176, 686258, 495447, 402385, 274409, 322208, 69272, 198221, 353369, 305650, 524966, 354136, 364448, 624411, 537679, 345963, 418530, 554067, 200907, 172457, 107004, 132248, 677103, 148044, 296033, 451880, 295625, 454167, 336559, 359521, 732542, 190854, 318581, 351271, 430808, 495440, 616520, 419153, 360584, 84977, 318971, 180064, 305507, 191830, 504610, 272487, 261206, 485779, 333174, 32789, 186711, 176207, 463639, 305452, 149342, 352498, 137460, 132099, 401555, 301746, 520283, 150374, 189534, 149706, 4260, 250243, 192666, 426171, 199832]
16321A31201L45797j93315J8489j26749p8471l0520L54134j65072I4818J85115
16311B79933P4418O9308D9853J81383a67857C80515J53031L9669b04996B75174
16300C89606A58866K30021o2663K6421j44287K07620c2264F8408Q5876J66373
16290C20657r4804q9704J26078A2328K46543P9728B3712e761A34208P7190R9941
16279C11339J87157a46857B41129E4222J30008L1343n1107l4511J10629J63071
16269D03655G5291R268a65148B1744K16407l9944H4524J39409A0148K74079d693
16257B45521J00172h9127K7961A93720M7308j15661K15724a99386A65749C908
16246D99208a77121D88997j64926l7735m8108k8430q7297K37595d6130B77548
$$ y = [131201, 476998, 283683, 302172, 175423, 96952, 66432, 420566, 255494, 94818, 279933, 354351, 423659, 49853, 231236, -167857, 380515, 533546, 573215, -204996, 275174, 389606, 158866, 388887, 326224, 352645, 208358, 415978, -32264, 68408, 154284, 320657, 225853, 136149, 262227, 12328, 258871, 338599, 23712, -5761, 134208, 211398, 311339, 498496, -146857, 241129, 54222, 184230, 215573, 164466, 129955, 240584, 403655, 75291, 84559, -165148, 21744, 238151, 198207, 84524, 223933, 10148, 284227, -4693, 245521, 345693, -89127, -61166, 193720, 241028, 125367, 341091, -199386, 165749, 3908, 499208, -177121, 488997, 324071, 286336, 238228, 209798, 122501, 360096, -46130, 277548]
16235b94595B88637m732c275D00765a1190C06356m2211N54423A45634d6627B19168
16223A74465K54943F5786K11510n2677q2921a12157A8716b2631B87528j34594
16213A52934D2340g1587A32260J0797a64213L8275B6766f9136I9719B747J11428
16202A14175b0770C38178A39909o0897O6516A205R7180a84104H7718k1577J74314
16191B40455A04387J1191L12954G383L75601A70477K24065j32516I4172C9717
16180A40869M5660a04801E6937a3925k27850h6751q6027A05777A6396K82045d1198
16168A84675D2025e5187K4055A15179j0776e7407j7924j40728o2182p07B46759
16156D4453b54200C2681M46353A23004a00044L1354k4281G8865P2798C6857i4174
$$ y = [-294595, 288637, 283905, -3275, 400765, -11190, 306356, 264145, 818568, 145634, -46627, 219168, 174465, 429408, 65786, 277296, 224619, 141698, -112157, 18716, -22631, 287528, 152934, 42340, -71587, 132260, 143057, -164213, -125938, 26766, -69136, 99719, 2747, 114175, -20770, 338178, 139909, 79012, 145528, 1205, 98385, -184104, 87718, 66141, 240455, 104387, 115578, 428532, 7383, 382984, 170477, 394542, 262026, 94172, 39717, 140869, 186529, -104801, 56937, -13925, -241775, -86751, -172778, 105777, 16396, 298441, -41198, 184675, 42025, -55187, -31132, 115179, 104403, -57407, -75331, -216059, -278241, -278948, 246759, 44453, -254200, 32681, 479034, 123004, -100044, -68690, -92971, 78865, 151663, 36857, -94174]
16144a22237A00689L9760n2924k0401K08498j28226a56714L3234B12652G9243
16133h2115A34443K31275I1636h5610C2272J82265p4299f8541q3239F3646K2387
16122H6033L06697j78880k9357O0358g0819j50686J04996D1210A1407a9156B2714
16110A00151D902a76841a9746n561e893D50612j35949o6319E1932b98214D8393
16098A67994G1173M972g5075K1884j1315j1105j00151G329d74168B4117J83398
16087B07515J6755q9093m2513d5868E3243a69828A20870N588b18387O3299B9001
16075a25193j41313K7893h9494j40224M8784j21308A71786J63568C1465N1999
16065H3464c7098j62383b4534j75144L5129A86347J43094q8098a86742a2585m7926
$$ y = [-122237, 100689, 140449, 87525, 67124, 275622, 147396, -156714, -123480, 212652, 79243, -82115, 134443, 365718, 91636, -85610, 32272, 214537, 140238, -68541, -151780, 63646, 86033, 392730, 213850, 184493, 244851, -70819, -221505, -116509, 41210, 11407, -19156, 22714, 100151, 4902, -176841, -19746, -25307, -5893, 450612, 314663, 248344, 51932, -298214, 48393, 167994, 71173, 76145, -75075, -53191, -64506, -75611, -175762, 7329, -474168, 24117, 207515, 224270, 135177, 92664, -45868, 53243, -169828, 120870, 126458, -218387, -155088, 29001, -125193, -266506, -238613, -89494, -229718, -180934, -302242, 171786, 335354, 31465, 83464, -37098, -199481, -24534, -199678, -164549, 186347, 329441, 241343, -186742, -12585, -60511]
16054f0511E3351J13992D2428a71729e0643j29007P3729D84997A97454l3690a71226
16042A06045b93234J11175a6250j28633H1261J77550n4524J0549f7123A23387
16031G1707L86832j29490o6817a2335j17741B41510e5051k5043J4260j48269p5083
16020b89186k4220d828A62503a08486B10572a95675C48406e3033A78564e8014
16009I7810f1442q6967j6437A34769J3534b47893c0493o3341a0208j13571A70503
15997I1856h025p9518h270j53832G4529L65837b02668e2472j38340I1937C0009
15985B52099O9100G7650L60932k01758b7142C41275J3795A39992c7528B7215K20114
15974B47329a49831O8748A34260g5541F856b05066f3113C2306h1162o8136M2214
$$ y = [-60511, 53351, 167343, 42428, -171729, -50643, -179650, -105921, 484997, 197454, 163764, -171226, 106045, -293234, -182059, -16250, -144883, 81261, 258811, 204287, 214836, -67123, 123387, 71707, 458539, 329049, 262232, -12335, -130076, 241510, -55051, -80094, -65834, -214103, -289186, -313406, -4828, 162503, -108486, 210572, -195675, 348406, -53033, 178564, -58014, 97810, -61442, -148409, -164846, 134769, 148303, -247893, -30493, -93834, -10208, -123779, 170503, 91856, -8025, -87543, -8270, -162102, 74529, 440366, -202668, -52472, -190812, 91937, 30009, 252099, 321199, 77650, 438582, 236824, -27142, 341275, 355070, 139992, -37528, 27215, 247329, -149831, -81083, 134260, -75541, 6856, -205066, -63113, 32306, -81162, -149298, -107084]
15963a07084I7512J10366q2449i1630J8249C9851a14157g529p3659A72659a25609
15951d76225B4846J28259b51496e5330o5005L6890j4873B83817d48270a48820
15940B10013a79735O203G3035K8332a70152f8855l0005l0036C0091a00507A32294
15928i7266q038A3168J1612H096b25990d0347j61007K8969M8021r9638A46933
15916b33091C3096a21877B34032j6037a647B2292d9879F0279b84628i7649b7908
15904b53573B7872b53331d128A40355b46975a17556C88358d1495A18434i6452
15893a26349C6391N26d9938j11367B0147J6036L59304A25618h7820l34715A0777
15881h5950j47396B05052f3990D6052L1652a34168H7546b61708c8416r7609e2025
$$ y = [-107084, 97512, 207878, 125429, -91630, -73381, 39851, -114157, -7529, -81188, 172659, -125609, -476225, 24846, 153105, -251496, -55330, -120335, -83445, -98318, 283817, -448270, -148820, 210013, -179735, -173532, 73035, 101367, -170152, -68855, -98860, -128896, 30091, -100507, 132294, -97266, -105304, 13168, 24780, 8096, -225990, -40347, -201354, -172385, -124364, -224002, 146933, -233091, 33096, -121877, 234032, 217995, -1647, 22292, -49879, 60279, -284628, -97649, -27908, -253573, 27872, -253331, -4128, 140355, -246975, -117556, 388358, -41495, 118434, -96452, -126349, 36391, 36917, -49938, -161305, 20147, 36183, 395487, 125618, -87820, -422535, 10777, -85950, -233346, 205052, -63990, 46052, 77704, -134168, 87546, -261708, -38416, -136025, -52025]
15869A76255d8713B00317f9729j89407A93437I2112J47127i9296K8764j17752
15859a88284D78196c11928B1046e989I016c66123D9621a80777K3648k6778N8401
15848a25506C5156J171J43077a77345B99287I982P6219a22424H3426a71378h0587
15836h8002g152C3271a49504o7289g3095j15423N9240b0035C63185A33966c37496
15824A8256a39157B44967j3863C5069L3638J8797e4261j8062A07496c57203O2163
15813b95040G0796c05723a21809j96498C8768N5281A9049J54096d367B1449R4515
15802A15964n5383a71622F0007a14886I9461a77605N1886b4586F8527J36122o8917
15791A35732R7278j16415n6617j5359a50575A39206i1443G8883N6510A3942Q6082
$$ y = [176255, -48713, 200317, -69729, -259136, 193437, 92112, 239239, -99296, -70532, -188284, 478196, -311928, 21046, -5989, 9016, -366123, 49621, -180777, -157129, -183907, -125506, 35156, 36327, 179404, -177345, 299287, 9982, 86201, -122424, 83426, -171378, -80587, -88002, -7152, 33271, -149504, -216793, -73095, -188518, -129278, -20035, 363185, 133966, -337496, 18256, -139157, 244967, 231104, 35069, 68707, 87504, -54261, -72323, 107496, -357203, -295040, 70796, -305723, -121809, -318307, 38768, 94049, 19049, 173145, -4367, 21449, 115964, 60581, -171622, 60007, -114886, 99461, -177605, -125719, -24586, 68527, 204649, 135732, 233010, 116595, 59978, 44619, -150575, 139206, -91443, 78883, 135393, 13942, 100024]
15780A00024a82932E1661c38674f092k079A1589c65058O0857A09410c04271C8347
15768c23250d4226a5959I2730b38437D1328j3243a61701C31684r5767J17302A14108
15756c9993B98416F7282M6113L068J0080J87389B4201b32597d0359C35225b48193
15744a93750B90928b9280B80931d42355J92451B52683A10526g0031B98445i9908
15733C01702q8068b22547A04351a16672A21210K5142b27836d3223k70936D1832
15722d813A46226a12142J6062d0131m6703K7116C8290K94126i1402I9770a70192
15710a78425j00135f388k2339k40866c3528j23374B03436D8782K68048A42820
15699G3093d78076J68090C0702g7932r943A16834a87699A17049L54831a09349
$$ y = [100024, -182932, 51661, -338674, -6092, -8171, 11589, -365058, -304201, 109410, -304271, 38347, -323250, -44226, -15959, 92730, -238437, 41328, 28085, -161701, 331684, 235917, 353219, 114108, -39993, 298416, 67282, 113395, 116463, 126543, 313932, 24201, -232597, -40359, 335225, -248193, -193750, 290928, -29280, 280931, -442355, -249904, 252683, 110526, -70031, 298445, -99908, 301702, 213634, -222547, 104351, -116672, 121210, 146352, -227836, -43223, -314159, 41832, -4813, 146226, -112142, -96080, -40131, -86834, -59718, 38290, 332416, -91402, 99770, -170192, -178425, -278560, -6388, -28727, -269593, -33528, -156902, 203436, 48782, 316830, 142820, 73093, -478076, -309986, 30702, -77932, -87875, 116834, -187699, 117049, 471880, -109349]
15688e9971B07843b95284g281E0801O8874a412F1789c2661n2085F3628c23416
15676D8502b00076D2828N6886e9002B74741J6829b84372f9541K5841I0273O4258
15665A54531G4949h9796b9238l39210A85038R0790E6135B0401b59385b1587L248
15654a8339o5639B52062B1278J00932c16813C04594H5891F096M0726b579j11462
15643a14041B4242a38683A0626f356j45383B22299b20420b9742k8923m84431K24385
15632c18711R1945C9300K3105c99050L0283G9062O8012e0802p3702k36892A14451
15620E0469a7041A05121b63796e9600A46374B0346Q3694d83258B56286m091b94714
15608a55297M2908l8495C7233M9931B1997i3270B48028A4650K67775c35765E7207
$$ y = [-59971, 207843, -295284, -7281, 50801, 119675, -1412, 61789, -32661, -84746, 63628, -323416, 48502, -200076, 42828, 99714, -59002, 274741, 291570, -284372, -69541, -43700, 90273, 154531, 74949, -89796, -29238, -368448, 185038, 275828, 56135, 20401, -259385, -21587, -18339, -83978, 252062, 21278, 122210, -316813, 304594, 85891, 6096, 46822, -2579, -114041, 24242, -138683, 10626, -6356, -151739, 222299, -220420, -29742, -58665, -543096, -318711, -226766, 39300, 62405, -399050, -368767, 79062, 147074, -50802, -124504, -361396, 114451, 50469, -17041, 105121, -263796, -59600, 146374, 20346, 104040, -483258, 256286, 252195, -294714, -155297, -112389, -150884, 37233, 87164, 21997, -93270, 248028, 14650, 282425, -335765, 57207]
15596H8804f7710c1680B40873A16135C3033b67989j7371d2191C47832d4671o193
15585e0864G7584b85640a39072K8003n2519A24088c7580C632a36367k51139a79091
15573D83847A94019H8440a86896A96845n8290c16487a31484A44544A0541i4238
15562b41272h1487E9047B9160g876j07999e0985E0080J9823a41556a4877I8036
15550f0487J201B96917A10152M34757A11650B1087a12209A84474c7330l13778
15540c51108A5750L38181A28234b6016A27262K08233a28838A24359q604E6688
15529b14865A5264O3603a37504A39164K40460i0584k00541B25170J47970i4887
15518a024k82354A90568h424A16729i631k34888Q2636a6167A29893b63946a7772
$$ y = [88804, -67710, -31680, 240873, 116135, 33033, -267989, -285360, -42191, 347832, -44671, -50864, 77584, -285640, -139072, -111069, -163588, 124088, -37580, 3632, -136367, -387506, -179091, 483847, 194019, 88440, -186896, 196845, 138555, -316487, -131484, 144544, 10541, -94238, -241272, -81487, 59047, 29160, -7876, -115875, -50985, 50080, 69903, -141556, -14877, 98036, -60487, -59286, 296917, 110152, 544909, 111650, 21087, -112209, 184474, -37330, -351108, 15750, 353931, 128234, -26016, 127262, 335495, -128838, 124359, 115755, 56688, -214865, 15264, 78867, -137504, 139164, 379624, -90584, -291125, 225170, 373140, -94887, -1024, -283378, 190568, -8424, 116729, -9631, -244519, -161883, -16167, 129893, -263946, -17772]
15506c39405C35557r2814D1849P048l765L1432b17169h0466b3995q0589A86385
15494G2426a06136m0860d3672A77421E042g0963b0316A48044a47444A6616b9169
15482B67935b09268A17018P5018a34040A5873K8445c5865D8468N4803d3165j68812
15471b11977N8304e6055m7888k5725E032J41521n3604m6053J75514c96A45420
15459h9756G7334N3499f9461i265k77966c2185B26378a45570C55459h9593d0675
15447a35382d0672j1877q2641A08459D9367J37272D7286M5730B6358a21072A74526
15435c00904J12084O2918e4340j94902h3882d0577j90583G8446l0647d2719G8771
15423A74868J06726b18166d300p8964o0719k58914A19602M7660j5126P9984b72331
$$ y = [-339405, 335557, 242743, 41849, 48897, 45132, 76564, -217169, -80466, -23995, -104584, 186385, 72426, -106136, -146996, -43672, 177421, 5042, -70963, -20316, 148044, -147444, 16616, -29169, 267935, -209268, 117018, 192036, -134040, 15873, 44318, -35865, 48468, 103271, -43165, -211977, -153673, -56055, -103943, -129668, 5032, 146553, 92949, 46896, 222410, -396, 145420, -89756, 77334, 130833, -69461, -9265, -287231, -32185, 226378, -145570, 355459, -89593, -40675, -135382, -40672, -52549, -135190, 108459, 49367, 186639, 47286, 93016, 26358, -121072, 174526, -300904, -188820, -125902, -54340, -249242, -83882, -40577, -231160, 78446, 47799, -42719, 78771, 174868, 281594, -218166, -4300, -83264, -143983, -402897, 119602, 167262, 152136, 232120, -272331]
15411A95470o5925O127n5915h3035A6593P2599a26146B7410H93J15508a23349
15399A40611o3866b8279r5543G0080K2807e2174A62792M9429E2342K34861a72084
15387c93936a16501A68752C5814O8337c1390F8279K16549A00627a44656B8121
15376B11163H2832P725C9602b57030E5507c89847C40612K20853d3277C60237b44160
15364B78607N5714b96569b2040l9515j39478A18405B898K59045n7336H1294e1590
15352E3903j6650K35648c12883B03737D5929R831a93183A15430J54482e5329q5427
15341a40756o0859g5393A95051r938e8936F3822a35648A58914K17557a13477A10801
15329B57376d5196o138C6358J04970G40Q0316B6490a66662N0475A15786J37963
$$ y = [195470, 129545, 135672, 79757, -83035, 16593, 89192, -126146, 27410, 893, 116401, -123349, 140611, 76745, -28279, -123822, 70080, 92887, -52174, 162792, 212221, 52342, 287203, -172084, -393936, -116501, 168752, 35814, 104151, -31390, 68279, 284828, 100627, -144656, 28121, 211163, 82832, 90557, 39602, -257030, 55507, -389847, 340612, 561465, -43277, 360237, -244160, 278607, 334321, -296569, -22040, -61555, -201033, 118405, 2898, 261943, 204607, 81294, -51590, 53903, 37253, 272901, -312883, 203737, 45929, 55760, -193183, 115430, 269912, -55329, -140756, -201615, -75393, 195051, 185113, -58936, 63822, -135648, 158914, 376471, -113477, 110801, 257376, -45196, -51334, 36358, 141328, 740, 81056, 26490, -166662, -116187, 115786, 253749]
15318B53749C3484e8012B48865h7423k20375P8012A03783b24229C46055C8731
15307h4489A10220B5329L3693b48538E6028A429d5481B6677K00486h7083I3160
15295a3197E9585K49339A12031j4454K4843Q3031K6286a45531D5935a82612A88027
15283b27785R2623a7026A49975J03067h328j29147A95447l6499p6779J12318n3691
15272A40796F4189K21925E2439J46081i4776k33682J06324I0600K69885b90339
15261B02746F0718J25764n5727L2850p0950K57592D0625J08828j534e8485D51108
15249C07066L95117P16949j2675p2495R0932o51608B76734K0290B4295J03060
15239A27355J34512a25083A12733J01464J8043j09400a73587k5634D4345J86911
$$ y = [253749, 33484, -58012, 248865, -87423, -307798, -229786, 103783, -224229, 346055, 38731, -84489, 110220, 25329, 59022, -248538, 56028, 1429, -45481, 26677, 227163, -87083, 93160, -13197, 59585, 308924, 112031, 97577, 122420, 205451, 231737, -145531, 45935, -182612, 188027, -227785, -135162, -17026, 149975, 253042, -8328, -137475, 195447, 158948, 82169, 194487, 140796, 64189, 286114, 52439, 198520, -94776, -328458, -222134, 90600, 360485, -290339, 202746, 60718, 186482, 130755, 163605, 92655, 350247, 40625, 149453, 147919, -58485, 451108, 307066, 702183, 1419132, 1406457, 1333962, 1424894, 773286, 276734, 297024, 24295, 127355, 261867, -125083, 112733, 214197, 232240, 122840, -173587, -199221, 44345, 231256]
15229B31256a4004B49507E151e5052C1417i736B18634p0965A0534L76394d7455
15217e290j36553E1438N0893g9538I60a32979B20970f7746C4390M35797j59431
15206C10756Q2245h7281K6023C57169b69268E04699C7765A6207b69936I7604L6837
15195A34441c29733A11878N4297F6529M7935b42192A07110J56758j19729i5870
15184A93323O5139H0325J02642a07352B89274l4675G0355J43330N2600a66176
15173E4121A2436M3032J01692h0322j17753G5109A6441a61243B30096J64398b40415
15161B52644l1027j9131N2737R3095o8465F8101a61827f3207o147A2418P466L11889
15149C31773I9045J32311K17141k09148o2819b9229A20708a37045E1838i6821
$$ y = [231256, -14004, 249507, 5151, -55052, 31417, -9736, 218634, 147669, 10534, 386928, -47455, -5290, -141843, 51438, 102331, -79538, 960, -132979, 220970, -67746, 34390, 470187, 310756, 393001, -87281, -61258, 357169, -269268, 504699, 37765, 16207, -269936, 97604, 134441, -329733, 111878, 166175, 66529, 114464, -242192, 107110, 263868, 144139, -95870, 193323, 258462, 80325, 182967, -107352, 289274, 254599, 70355, 213685, 266285, -166176, 54121, 12436, 55468, 157160, -80322, -198075, 75109, 16441, -161243, 230096, 394494, -240415, 252644, 221617, 202486, 255223, 348318, 279853, 68101, -161827, -63207, -69354, 12418, 19884, 331773, 99045, 231356, 448497, 239349, 176530, -29229, 120708, -137045, 51838, -96821]
15138g8144c4106B15312K9991j00454J08310g3419G3804K4224a11418E5857K42638
15127B98495a2415E06J32246a7320I7514K90114K8632F7253M47755k34501K31053
15116E11560c82705a73289h0142B05668l8684b3387j22566E2569M8386J27632
15106B28587G9787a41050A21942N9378p6447N65499e5480c430B87005A4111d3759
15094G2567K4092J84721A40N2909K11986j0306O7365N8500j72304D11K8040K50931
15082B79382O7550A48412a32270A31778M0455f5021C61461p7600r8082P4079D9833
15070i102C54537j39957K31194a46935B32328E599O0092N95762H9514L36885A33376
15058d2536B6513M15086e359G2054a5039C68952A66613n3202c9174O243B96085
$$ y = [-78144, -34106, 215312, 245303, 144849, 253159, -73419, 73804, 98028, -111418, 55857, 298495, -12415, 506, 132752, -17320, 97514, 387628, 416260, 67253, 515008, 280507, 511560, -382705, -173289, -80142, 205668, 166984, -23387, -145953, 52569, 100955, 228587, 79787, -141050, 121942, 181320, 104873, 670372, -55480, -3430, 287005, 14111, -43759, 72567, 96659, 281380, 140, 53049, 265035, 254729, 322094, 380594, 208290, 411, 28451, 279382, 346932, 148412, -132270, 131778, 172233, -65021, 361461, 283861, 185779, 259858, 49833, -9102, 354537, 214580, 445774, -146935, 232328, 5599, 65691, 661453, 89514, 426399, 133376, -42536, 26513, 441599, -5359, 72054, -15039, 368952, 166613, 113411, -39174, -32931, 296085]
15046C28142M9728A86959L40382k61593A14450K00191q0409q609J77592M1165
15036D44380b16271g9743A10905K41405n0871j39101N8418K89201k44709n7489
15026B07759I8418f7251F406J87736m0899N3480o5271J95576q6097R5043A52451
15014D23904A72588L11131C087J09879K5369j6001L77646A89036q643K68309A07273
15002B83851K029O5787k3112j46882J71813f4070D14107m8323g735C33303j07588
14991B25715P2529L3530l3932H9587a64883D97260j00294M7662j76847Q3798j15857
14980B35722k7111F0771K36490m0158b861B65262r2183L26758A47775k8881M13458
14969E32352B02786i5139B45821R6089J6143j78645K61074R1256R5844k37156
$$ y = [328142, 377870, 186959, 527341, 265748, 114450, 314641, 234232, 225623, 403215, 444380, -216271, -79743, 110905, 352310, 301439, 162338, 220756, 509957, 265248, 207759, 98418, -67251, 6406, 194142, 153243, 206723, 141452, 337028, 250931, 345974, 152451, 423904, 172588, 483719, 3087, 112966, 138335, 122334, 499980, 189036, 180393, 448702, 107273, 283851, 285880, 351667, 328555, 181673, 353486, -64070, 414107, 365784, -7735, 333303, 225715, 298244, 331774, 297842, 89587, -164883, 497260, 396966, 444628, 267781, 351579, 235722, 208611, 60771, 297261, 257103, -2861, 265262, 173079, 499837, 147775, 118894, 532352, 202786, -95139, 245821, 341910, 358053, 179408, 440482, 531738, 627582, 390426]
14959C90426A87243k1162b5424A46268K06166O3307j29484m7266j8998Q0204c18339
14947C36674P1900M4480D8588K60219A08936b20869B80067m4374K08973A37834
14936B02015G4796L98788D4405M88654A93704K77489G5060K77818n1264A42331
14925G3513M14663j14622j67271p7315P812K16721O2159j73819L03999k48675
14915B97165M43451k55304r8407j1770m7539P835c8519N161F61206B91816L06043
14904E97859A59487K68865j57965i0313E04906k6461k31428L26560n1775k4153
14894D97649c4129B08519L08713E7974M41344j19138J94707j58712q8043K24072
14884E52204j89239J17030o4104J5262J18107q1262j70188K64624p034p8553j89647
$$ y = [390426, 187243, 166081, -25424, 146268, 352434, 415741, 286257, 238991, 219993, 300197, -318339, 336674, 408574, 453054, 48588, 308807, 108936, -220869, 280067, 235693, 444666, 137834, 202015, 74796, 473584, 44405, 533059, 193704, 471193, 75060, 352878, 301614, 142331, 73513, 488176, 373554, 206283, 128968, 136780, 353501, 415660, 241841, 545840, 297165, 740616, 485312, 386905, 375135, 327596, 335431, -38519, -33358, 661206, 291816, 597859, 159487, 428352, 270387, -90313, 504906, 478445, 247017, 573577, 521802, 497649, -34129, 208519, 517232, 57974, 499318, 380180, 574887, 416175, 328132, 552204, 362965, 479995, 415891, 431153, 549260, 467998, 297810, 562434, 555400, 476847, 287200]
14873B87200j4046N03558C57320L02894C14968Q9754j6232K42309k04899j03295
14863C22605K09675o1633A96979L78082k22610K44870j54249J42665k2130P2723
14853F36330r8794l2476j65650L37880k7492B10091J81824J80165K69116l48849
14843D92347B12118J45421K04823L561j16742K95473k58757J60317m8457O8809
14833F66566B69535K7312K25080q8443J56442B45526r6547O53087j46327k10490
14823D45249j38830L90366j39576k7506J92844p4528Q9297l34194K72548J28123
14813H03793k11653j12718K35270j08287j96617M02636k66936l9936J26326j7418
14803F14460j52657L02106l10867M7271l5694R4343p247L39617C46940J41745
$$ y = [287200, 273154, 776712, 357320, 660214, 314968, 404722, 388490, 630799, 425900, 322605, 532280, 470647, 196979, 575061, 352451, 597321, 443072, 585737, 563607, 636330, 537536, 505060, 339410, 677290, 649798, 210091, 391915, 572080, 841196, 492347, 212118, 357539, 562362, 565923, 449181, 744654, 485897, 646214, 597757, 666566, 269535, 296847, 521927, 433484, 589926, 245526, 148979, 802066, 655739, 445249, 306419, 696785, 557209, 529703, 722547, 648019, 737316, 403122, 675670, 803793, 592140, 479422, 714692, 606405, 409788, 812424, 545488, 505552, 631878, 614460, 461803, 763909, 453042, 500313, 464619, 558962, 551715, 891332, 346940, 488685]
14793D88685J05088j56468j4879j58523O60287m08506K56986k92167j6164R5748
14783E60087o0742j56924j04387K57200j5864K35052l13429J00257r1445K65237
14773F75042q7740N7839k95555M00726O67431o21835k06117K8830l1833j51399
14763D35389k4998j3338L19302p4395J96514k7259j87262l9611R8595k41230L92194
14752H33901k954l05497q7461K06110p0522L02113k50296J50817k2655j28623
14742F24933m6182L17347l19399K87438Q384j6110k20729P812J42273Q2841J26029
14731I94637D31325L92944o6735L4542p9886m1572J01291J13751K9505k67370
14721F47795J07396L30482m11638K58667l9496J00558l8877j82011J76311j17850
$$ y = [488685, 593773, 437305, 422426, 263903, 924190, 515684, 772670, 480503, 464339, 560087, 499345, 342421, 238034, 495234, 479370, 714422, 400993, 501250, 409805, 675042, 587302, 645141, 349586, 750312, 1417743, 795908, 589791, 618621, 586788, 435389, 410391, 397053, 716355, 641960, 838474, 811215, 623953, 584342, 682937, 441707, 833901, 830947, 525450, 437989, 644099, 573577, 875690, 625394, 776211, 753556, 624933, 578751, 896098, 576699, 864137, 872521, 856411, 635682, 643494, 785767, 868608, 994637, 431325, 824269, 757534, 792076, 712190, 670618, 771909, 885660, 915165, 647795, 755191, 1085673, 674035, 932702, 893206, 993764, 954887, 772876, 949187, 831337]
14711H31337K09515k53226M17557l97846K67744j86548k2274J00309L0373j43407
14701H53534m04M5704J51557l18832M35350j30829K60501k82649J0552M7927E13333
14689H81253K15917l17687L22090l31704J40714K65506L9725l67988P6255r7371
14679H26710J79959l6306P6634m09384N87707j62186j96756Q2176O3837J68297
14669A180688J4091R7446l22211L79264j56479K50979k25886j005k41943j04221
14659H70723L63454k21904J27113L59465j54737l94786K41766R7690j97801l00856
14649G90127Q03364j31128l98827k917J45107n2244l467N35477l47610K98678
14639A636560n14358K53434j7821N8518l20490O4042J26371O0761L89817l23413
$$ y = [831337, 1040852, 787626, 1205183, 807337, 1075081, 888533, 866259, 966568, 996941, 853534, 853130, 898834, 1050391, 731559, 1166909, 1036080, 1296581, 1013932, 1024484, 1072411, 513333, 881253, 1097170, 779483, 1101573, 769869, 910583, 1176089, 1215814, 847826, 924081, 826710, 1006669, 970363, 1046997, 637613, 1225320, 1063134, 866378, 948554, 1012391, 1180688, 1194779, 1292225, 970014, 1349278, 1192799, 1443778, 1217892, 1216887, 974944, 870723, 1234177, 1012273, 1139386, 1498851, 1344114, 949328, 1191094, 1288784, 1090983, 790127, 1593491, 1462363, 1063536, 1060619, 1205726, 1153482, 1150015, 1685492, 1337882, 1636560, 1122202, 1375636, 1357815, 1416333, 1095843, 1159885, 1286256, 1347017, 1736834, 1413421]
14629A413421K62878l39993K64730J91649l00821J21179O6058o0251k63557L48973
14619A704266j94686J11575K09278k99881j42151K76054l2625p5574l32296L19969
14609A543929k49936J95589j7549L99292o8236O0535N6504j69229K05685j68011
14599A788573K02341l32004j67571K66042K87549N0522m07458J84651j13532l23534
14589A435579L20512M92956l46785j0958J05668j07295J82063l38755K73825n907
14579B000903p7917J60976K17704o4685K70179k37019N3581J5987o2759k00415
14569B076535M11102q3466O2751P1583M5648L3874O1155j09393J23013L14636
14559C007438J57984k18914k14124L64780L63131n4228N20188J19823Q09513J080985
$$ y = [1413421, 1676299, 1336306, 1601036, 1792685, 1491864, 1613043, 1679101, 1618850, 1355293, 1704266, 1509580, 1621155, 1830433, 1530552, 1388401, 1664455, 1631830, 1556256, 1223960, 1543929, 1293993, 1489582, 1472033, 1871325, 1803089, 1863624, 1920128, 1750899, 1956584, 1788573, 1990914, 1658910, 1491339, 1757381, 2044930, 2095452, 1687994, 1872645, 1759113, 1435579, 1756091, 2249047, 1902262, 1891304, 1996972, 1889677, 2071740, 1732985, 2006810, 2000903, 1922986, 2083962, 2301666, 2236981, 2507160, 2270141, 2323722, 2339709, 2276950, 2076535, 2487637, 2404171, 2466922, 2538505, 2584153, 2618027, 2679182, 2569789, 2692802, 3007438, 3165422, 2946508, 2732384, 3097164, 3460295, 3406067, 3926255, 4046078, 4855591, 5936576]
14549E936576K293531L143920R713152K0088029J0648933B4410217I049495C836426
14540B883227p04741m1431j39501j34393K66770L48575m42918K54510q1761N7086
14530B265423k04335M21418j31020j19458N99413m54907N8350J20969l12233M66149
14520B709769O0003J79392j20466J24250R9136j02777j84197M14904q7930j7988
14510C074096n3580n2068k0970N5005K97353j56668Q8664K4568n4452J73996l91163
14499B984781L44101j35532K37554j42767N06253J59916m19310K05976n004n3146
14489C682822K7336N969O2491K74584l01432K45108K98799l61780J2032L97240
14479D343169k62180M12192j46548K74554O7159o57782M75648L5077l215J87063
$$ y = [5936576, 8230107, 11374027, 21087179, 41175208, 51824141, 24410217, 9049495, 3836426, 2883227, 2178486, 2137055, 1997554, 1863161, 2129931, 2478506, 2035588, 2290098, 2208337, 2265423, 2061088, 2482506, 2351486, 2232028, 2831441, 2376534, 2434884, 2555853, 2243620, 2709769, 2769772, 2949164, 2828698, 2952948, 3052084, 2949307, 2765110, 3180014, 3092084, 3074096, 3020516, 2968448, 2947478, 3002483, 3299836, 3143168, 3231832, 3256400, 3201948, 3375944, 2984781, 3328882, 3193350, 3430904, 3288137, 3794390, 3954306, 3534996, 3740972, 3735968, 3682822, 3710158, 3716127, 3778618, 4053202, 3751770, 3996878, 4295677, 3933897, 3945929, 4343169, 4080989, 4493181, 4346633, 4621187, 4688346, 4030564, 4506212, 4541289, 4538074, 4725137]
14469D725137J08072j14631k68621M21934P6916K231q7288j06934K27200K89993
14459E274009m75561O10224m52682M82085N9769K0197L71388n81396j0507M40035
14449E737561J07978j01608J13747P6355M1192L83253j77496L47992j8076o8873
14439F442025k50109M26418J69590Q3544K2668L17629q5286K52439j85197J88596
14429G382317M14190k75457L80918l79324J55027L69346k23896N97918J42032
14420H563071k14585L01407K40942Q3884k44948O15878k25547J60406K18932L07301
14410I806741l11341L91525K15714J28416n5248K65445L81214J14281K34102K13890
14400A1384739J8113L05226J14436J15920K06535j44523N96175r5742M05104L90379
$$ y = [4725137, 4833209, 4718578, 4449957, 4871891, 4948807, 4951038, 4863750, 4756816, 4984016, 5274009, 4798448, 5408672, 4955990, 5438075, 5497844, 5518041, 5889429, 5308033, 5297526, 5737561, 5845539, 5743931, 5857678, 5934033, 5975225, 6358478, 6180982, 6528974, 6510898, 6442025, 6191916, 6618334, 6787924, 6871468, 6894136, 7211765, 7126479, 7378918, 7193721, 7382317, 7796507, 7521050, 7901968, 7522644, 7677671, 8047017, 7823121, 8421039, 8563071, 8348486, 8649893, 8890835, 8974719, 8729771, 9345649, 9120102, 9280508, 9499440, 9806741, 9495400, 9886925, 10102639, 10231055, 10175807, 10441252, 10822466, 10936747, 11170849, 11384739, 11402852, 11708078, 11822514, 11938434, 12144969, 12000446, 12596621, 12500879, 12905983, 13296362]
14390A3296362k9589J38809j34047R16638m0572J72376L86177M34861J7975K60492
14380A5419482M35068O7182L74577L61241O09881J68745K28052N00503J9296M29439
14370A8613466O37148p5453N80343N20067L89294K61958L95263O67944N39014
14361B2529044K45043K83958R19564M98991Q43872L23859N91902N15869M72333
14352B7224435R15797M83736N92088J81186J205310J026084N98608J189545N38756
14343C3955545P04682J071811J153697N60410J110234J204540J383889J098877
14335D2243685J301698J173854R71139J580102J361380J669252J455768J663933
14327E3420811J472070K138771J698311K110012K137073K324281K120407K254180
$$ y = [13296362, 13266773, 13405582, 13271535, 14188173, 14147601, 14319977, 14706154, 15141015, 15158990, 15419482, 15854550, 15921732, 16296309, 16657550, 17267431, 17436176, 17664228, 18164731, 18184027, 18613466, 19250614, 19175161, 19755504, 20275571, 20664865, 20926823, 21322086, 21990030, 22529044, 22774087, 23058045, 23977609, 24476600, 25320472, 25644331, 26236233, 26752102, 27224435, 28140232, 28623968, 29216056, 29397242, 30602552, 31628636, 32227244, 33416789, 33955545, 34660227, 35732038, 36885735, 37446145, 38556379, 39760919, 41144808, 42243685, 43545383, 44719237, 45690376, 47270478, 48631858, 50301110, 51756878, 53420811, 54892881, 57031652, 58729963, 60839975, 62977048, 65301329, 67421736, 69675916]
14319F9675916K231421K622031K716167L094013K966459L508384L214748L484532
14311I3513671M276647L859470M066610M672969M728553M693709N589601N454303
14303A30855533N974341O632398O452947O938117P343036P983063Q743948Q824571
14295A89747954R521461R825284J0140987J1305016J1311945J2513473J2836499
14288B67202619J2896548J4397490J4143069J4795757J5245587J5125221J5455120
14281C69261411J4905924J5171522J4511209J3808975J2646146J1616319R286802
14274D61208308P035688L429599J771873k69817k771866o79191j469707n865856
14266D62389031p566822q943619j1280123j2924140j3995757j4772454j5406485
$$ y = [69675916, 71907337, 74529368, 77245535, 80339548, 83306007, 86814391, 90029139, 93513671, 97790318, 101649788, 105716398, 110389367, 115117920, 119811629, 125401230, 130855533, 136829874, 143462272, 149915219, 156853336, 164196372, 172179435, 180923383, 189747954, 199269415, 209094699, 219235686, 230540702, 241852647, 254366120, 267202619, 280099167, 294496657, 308639726, 323435483, 338681070, 353806291, 369261411, 384167335, 399338857, 413850066, 427659041, 440305187, 451921506, 461208308, 468243996, 471673595, 473445468, 473175651, 470403785, 469724594, 468254887, 462389031, 454822209, 445878590, 434598467, 421674327, 407678570, 392906116, 377499631]
14259C77499631j6087901j5453964j5343899j5384425j4502515j3644028j3894468
14252B73188431j3267744j2806458j1776130j1674115j0985668j0373015r490625
14245A92814676r068431q259110q271186p941006p107217o817196o659262n802558
14237A32888710n229713n922419n023717n250960m300042m435384l679940l870193
14229I5176342l796737l508275l481404k890418k953722l159856k816842k559155
14221G0009933k446486j796741k202184k354613j868259k029256j400779k207508
14213E3704107j221436j802264j475270j666377j229081j186501m91193j001034
14205D3630951j996886j308978j031906j094354q90111l99589j333612j248869
$$ y = [377499631, 361411730, 345957766, 330613867, 315229442, 300726927, 287082899, 273188431, 259920687, 247114229, 235338099, 223663984, 212678316, 202305301, 192814676, 183746245, 175487135, 167215949, 159274943, 152167726, 145350530, 138691268, 132888710, 127658997, 121736578, 116712861, 111461901, 107161859, 102726475, 99046535, 95176342, 91379605, 87871330, 84389926, 81499508, 78545786, 75385930, 72569088, 70009933, 67563447, 65766706, 63564522, 61209909, 59341650, 57312394, 55911615, 53704107, 52482671, 50680407, 49205137, 47538760, 46309679, 45123178, 44631985, 43630951, 41634065, 40325087, 39293181, 38198827, 37308716, 36909127, 35575515, 34326646]
14197C4326646r28565q52703j092120j44862j050363m59607q79341q68026l75613
14188B7675446r94664k59544r52863l87233m09126q56610p86326j44283m47738
14179B2437059m05224n80653m27802n22045n21446k37120l77710l56959l12195
14170A8695905o02943j65074n28755j88742j81949n38984J29001q27504j00307
14161A5690648k22330m89430j71765j63342l30686q1385k76277l93650J14071
14152A3675854o16180o843k65268m07347l4145k29205k91929k77951l29366K52805
14142A1470425l07771l36375R5247k98532m23652K08111j69049M7383m53536k63979
14132I568272K01087L9352m97633j39151J11101o12003J77148J73271k05416n46151
$$ y = [34326646, 33398081, 32545378, 31453258, 31308396, 30258033, 29798426, 28919085, 28051059, 27675446, 26680782, 26421238, 25468375, 25081142, 24672016, 23815406, 23029080, 22884797, 22437059, 22031835, 21451182, 21023380, 20501335, 19979889, 19742769, 19365059, 19008100, 18695905, 18092962, 17927888, 17399133, 17210391, 17028442, 16489458, 16618459, 15790955, 15690648, 15468318, 14978888, 14807123, 14643781, 14313095, 14231710, 13955433, 13561783, 13675854, 13059674, 13052831, 12787563, 12380216, 12346071, 12116866, 11824937, 11546986, 11217620, 11470425, 11162654, 10826279, 10921526, 10622994, 10199342, 10407453, 10238404, 10285787, 9832251, 9568272, 9769359, 9808711, 9311078, 9171927, 9283028, 8671025, 8848173, 9021444, 8816028, 8269877]
14122H269877J69225l58203n8311K05951r7549k65293O9156l17888L5335j95236
14112G457064q3925j68193R7351n9662k88443M5791K71427m03670J94072m83805
14102F578007j69675L53364m82066j84184M1003l21007J17410L00238m1545m80792
14092E710753P9432L1874n2796k19183l6411N8311M2131l43841J30815k19761
14082E181324j42559k60289K44812k2925J3853P5225k16980J20863m5720M0638
14072D988242n9486o3615m42820L54497m95611K14792k54394K00056k48663K74472
14062D467470j39918L04708k75188Q431J66050l45403n9888m1006k11503P6744
14052C950497Q973l99728L05265m8787m73066N01048l46165K38072k70457J41361
$$ y = [8269877, 8439102, 8080899, 8022588, 8228539, 8130990, 7865697, 7934853, 7616965, 7652300, 7457064, 7373139, 7204946, 7302297, 7242635, 6954192, 6999983, 7271410, 6867740, 7061812, 6578007, 6408332, 6761696, 6279630, 6095446, 6136449, 5815442, 5932852, 6233090, 6191545, 5710753, 5790185, 5822059, 5769263, 5550080, 5513669, 5571980, 5614111, 5270270, 5401085, 5181324, 5038765, 4778476, 5023288, 5000363, 5014216, 5089441, 4872461, 4993324, 4947604, 4988242, 4928756, 4865141, 4422321, 4776818, 4281207, 4495999, 4241605, 4441661, 4192998, 4467470, 4327552, 4632260, 4357072, 4365503, 4531553, 4186150, 4126262, 4085256, 3873753, 3950497, 3959470, 3559742, 3865007, 3816220, 3343154, 3844202, 3498037, 3736109, 3465652, 3607013]
14042C607013J94656l94475K69209k70863o532K3725p266K05599k20866j23352
14032C276848n2920L17246o36326L55587l30076N22403l57070k51246L09156N4811
14022C208413m16171m351m934J05374p8605j95856k2190P2363J61289k73202J76866
14011B728996J94181l10828j59953k9495K41680J5282r2743j10579j13606m69036
14001A893899L30432n452J14677p8054J93112k64698m7172j14225L27688m9618
13991B300589n4271N26613J109294J991808P088443J9269480J9473206k1900611
13983B9804551A3775966n329873k505896j162535m42600j35498p31594o3623o12929
13974B791418K67882k98131J54921k16049k77709O1282O5115m702j08378j95922
$$ y = [3607013, 3801669, 3407194, 3676403, 3405540, 3399008, 3422733, 3415467, 3621066, 3400200, 3276848, 3223928, 3541174, 2904848, 3260435, 2930359, 3452762, 3095692, 2844446, 3153602, 3208413, 2792242, 2787891, 2782957, 2888331, 2809726, 2613870, 2591680, 2664043, 2825332, 2552130, 2728996, 2923177, 2612349, 2452396, 2422901, 2664581, 2679863, 2587120, 2476541, 2362935, 1893899, 2224331, 2218879, 2333556, 2255502, 2448614, 2183916, 2136744, 2022519, 2350207, 2300589, 2246318, 2772931, 3882225, 5874033, 12962476, 32231956, 51705162, 29804551, 13775966, 8446093, 5940197, 4777662, 4335062, 4199564, 3467970, 3404347, 2791418, 3059300, 2761169, 2916090, 2700041, 2422332, 2483614, 2548729, 2544027, 2435649, 2239727]
13964B239727L42948k64576n3297l3501j6597m4783k55651L03509k28323J73703
13954B163159N7736j11251l5142m2685k88689M72162k37634j85184K08730k37304
13944A763898K80881o6949J76139k33764l23J28057l29000j23798j39305O51666
13934B107502j09167l52702K06223o08048L30655L71244j76632M056n7049M28333
13924B144415p66288K56051L061K6539j17304J64162o2664k86062L62700l20736
13914A403874K14853j08297l6429j41707K24805K96988k95443R3643j36825l14334
13904A201128K95007l27749O93688k90662q6010l30474L14787n4781l8051L63004
13894A739887o78124L31066J2296l90373O85867l36430L5635K32607m04369j24400
$$ y = [2239727, 2582675, 2318099, 2264802, 2231301, 2214704, 2169921, 1914270, 2217779, 1989456, 2163159, 2220895, 2109644, 2074502, 2031817, 1743128, 2215290, 1977656, 1792472, 2001202, 1763898, 2044779, 1977830, 2153969, 1920205, 1919882, 2047939, 1718939, 1595141, 1455836, 2107502, 1998335, 1645633, 1851856, 1243808, 1574463, 1945707, 1769075, 1773131, 1716082, 2144415, 1378127, 1634178, 1637239, 1663778, 1546474, 1710636, 1647972, 1361910, 1724610, 1403874, 1618727, 1510430, 1474001, 1332294, 1557099, 1854087, 1558644, 1652287, 1515462, 1201128, 1496135, 1168386, 1862074, 1571412, 1485402, 1154928, 1469715, 1414934, 1376883, 1739887, 1061763, 1392829, 1405125, 1014752, 1700619, 1364189, 1399824, 1632431, 1228062, 1103662]
13884A103662r1025K98484K07969n4205O4025R513j84408k20005L99010r1098
13874A441922O9351k32515J56520l7163r883k04304P1895j5388l05890K68701
13864A203246k53347J84435j96562K25220r742j61655J67875J26375k88880K74531
13854A271496j88828q3258j78028L6085K45568l13394L24010j86187L945N4473
13844I85882J10385j32844j4546q2693j8942L72265k11958J26349j75457J21645
13834A080086J95202n3699j71895J24565k56334K5039K44618q2095l47623l8247
13824G19617L67035J83773l92296L36048m69648M5031l5659K28323L54741k98061
13814A038904n3316L7125j98169J31110j48535K20797m52690J60147J60028j39519
$$ y = [1103662, 1012637, 1311121, 1519090, 1464885, 1528910, 1538423, 1354015, 1134010, 1533020, 1441922, 1511273, 1278758, 1435278, 1398115, 1388232, 1183928, 1255823, 1240435, 934545, 1203246, 949899, 1134334, 937772, 1162992, 1153250, 991595, 1159470, 1285845, 996965, 1271496, 1082668, 999410, 821382, 857467, 1103035, 789641, 1113651, 927464, 931409, 985882, 1096267, 963423, 948877, 866184, 847242, 1219507, 1007549, 1133898, 958441, 1080086, 1275288, 1221589, 1049694, 1174259, 917925, 942964, 1187582, 1105487, 757864, 719617, 1086652, 1270425, 878129, 1214177, 744529, 789560, 753901, 982224, 1336965, 1038904, 985588, 1022713, 824544, 955654, 807119, 1027916, 575226, 735373, 895401, 755882]
13804G55882K95352j7638j49988P5198j16191j24629m6109M61427l70722O7838
13794H30420J05562o1110j49448L23249P1382r3519k87644O4794R6730j66232
13784G34184j02946K48654J95790m46873M4648K69596J50102l67544n2385R4333
13774G67559J00897j31458j22018J28417R0003j23410k67614M2847K50855J00375
13764H36453J11089k31687k99067N47225k45620j8342K51821D21534J89499j68317
13754D42716L33532n7515j73729K47515j7072k51566K62345j38617k5085j36867
13744D85657J28973j95959L35008C61097M07980M7385j09559j27524K90819l35174
13734E35024Q0743C03165P25539k57075P7963l20278M04114m9133m12169M0419
$$ y = [755882, 1051234, 1033596, 883608, 958806, 842615, 717986, 671877, 1133304, 762582, 830420, 935982, 874872, 725424, 1048673, 1120055, 1026536, 738892, 803686, 900416, 734184, 631238, 879892, 1075682, 628809, 673457, 943053, 1093155, 725611, 673226, 767559, 868456, 736998, 614980, 743397, 833400, 709990, 442376, 485223, 736078, 836453, 947542, 715855, 416788, 964013, 718393, 700051, 951872, 421534, 611033, 442716, 776248, 718733, 545004, 792519, 775447, 523881, 786226, 647609, 622524, 485657, 614630, 418671, 753679, 361097, 769077, 816462, 706903, 579379, 870198, 535024, 615767, 303165, 1028704, 771629, 849592, 529314, 933428, 884295, 472126, 512545]
13724E12545L64318l03383K8914J96842p8230k08007j91786J19366L0682K70403
13714G41664l61290L16576k09990M8784j84547j13114J60613M01422k10060J03367
13704F93425l06464K1243j148K09202K45235K5341l62595K38867l5412k38370
13694D89324j87323K81581o3701J81858o4111Q6240k40743J73189j40716j7251
13684D98347J76462j13290p9436O0796J86452l44586j03699M14096j39079k34691
13674C21372P7313N050J75480j27145L5140l1507K5862N0738j29923M43767j94712
13663F51435P6267k86506j42528N0832B9977L76442p4144r0953n5922L30079j45112
13652C70367m0217A56011L2770M67170j37413k4935J7296O4715j97818j60569
$$ y = [512545, 876863, 573480, 602394, 799236, 721006, 512999, 321213, 440579, 471261, 741664, 380374, 696950, 486960, 535744, 351197, 238083, 398696, 800118, 590058, 693425, 386961, 408204, 407056, 616258, 861493, 886834, 524239, 763106, 727694, 489324, 302001, 583582, 519881, 701739, 637628, 723868, 483125, 656314, 515598, 498347, 674809, 561519, 482083, 542879, 729331, 384745, 281046, 695142, 556063, 321372, 398685, 403735, 579215, 452070, 487210, 455703, 481565, 532303, 402380, 846147, 651435, 727702, 441196, 298668, 349500, 29977, 406419, 332275, 241322, 185400, 515479, 370367, 330150, 156011, 188781, 655951, 518538, 493603, 510899, 575614, 377796, 217227]
13642B17227J14357I1368N16218l02529K68725B72398O2395K46293L26667B70115
13631C96893K52800k5500j59147j95909J11033J81380p9876r3942j36914H4665
13620D91094o8708j36738K18567B37025L75659A73823j5311J39700J20343k04787
13610B13768m5599K60283J2402k08006L11394k50745K17791B49042M50345I0083
13599C63768J79244B49038k3361K01131j03951O2405j50405K48056k26218K77805
13589E34500A94362H6724M13867A95370K60557p0618A87247J21537K2334j5203
13579C15915J47107l9436K1038L720K37192B89358H580K83609O5096J67780j13960
13568D11105j36153q7237L12343P1349g3456A77751J78408J22988k34910L32217
$$ y = [217227, 331584, 91368, 607586, 305057, 573782, 272398, 334793, 581086, 907753, 270115, 396893, 649693, 624193, 465046, 269137, 380170, 561550, 481674, 387732, 250818, 84665, 491094, 422386, 285648, 504215, 237025, 612684, 173823, 158512, 298212, 418555, 213768, 168169, 428452, 440854, 232848, 544242, 293497, 511288, 249042, 699387, 90083, 363768, 543012, 249038, 225677, 426808, 322857, 385262, 234857, 482913, 256695, 534500, 194362, 86724, 500591, 195370, 455927, 385309, 187247, 308784, 331118, 315915, 463022, 423586, 444624, 448344, 685536, 289358, 8580, 292189, 357285, 525065, 411105, 274952, 187715, 500058, 571407, -73456, 177751, 356159, 479147, 244237, 576454]
13558E76454A74245L99269J3304j26074J9953k5980B25594l2745N2609K3474M0950
13547C09882a20363A96481M2467k6163a08687D00834J68933k83398L0499h4870
13536F38219h937I8168J72150J7787J93346j14503A31782J94452P548b44296D1372
13524A82286K00354l1764j26320K3684J54211j41333C7946L52110l937J61754
13514E47873B26449J3865q4132a63660B40500j1946I6958J65104j3578K42016
13504D90500k44171J20053j00719D3435J51301L18156A58681K33744A8883K92841
13494C11724j49151K50319c7930D99904j27594F0693L02923j35445r3756e6525
13483C18332j20177I7716M65922j30842A72100o360b58053B52209K0028j20597
$$ y = [576454, 174245, 573514, 586818, 460744, 480697, 454717, 225594, 192849, 245458, 268932, 309882, -120363, 196481, 238948, 212785, -108687, 400834, 569767, 286369, 316868, -84870, 638219, -8937, 98168, 270318, 288105, 481451, 366948, 131782, 326234, 333782, -244296, 41372, 182286, 382640, 350876, 224556, 248240, 402451, 261118, 37946, 390056, 386119, 547873, 226449, 240314, 156182, -163660, 240500, 228554, 96958, 262062, 248484, 490500, 246329, 366382, 265663, 43435, 194736, 512892, 158681, 392425, 18883, 311724, 162573, 412892, -37930, 499904, 372310, 60693, 363616, 228171, 134415, -56525, 318332, 198155, 97716, 563638, 432796, 172100, 165740, -258053, 252209, 272237, 151640]
13473A51640L68035M0357B20852P3511K80555J93753B11252m2215E2590L17078
13463C69668r3168D4299L0882L15038j03804M2599j19756J17199D2577K94832
13453C37409O2119o4795l6197d8634D8131K97807J7278J38448r1436l1185f222
13441D33678j25811b8536B23373f0278A66521C8482n942b49116C35664j12054
13431B23610r016M8314r4491C0570L71119J21277A19361e3628A15501j0988K16462
13420C20975c0477F03932B96657m9029J14538G5077L82754c2419A28183K37264
13410C65447H8325D2840L2136k5331L55425a14721B52600m3327J6027a3591F2158
13398a08386j3437b5718A71050K78593F8032j2005L64081M9407A35893J58378
$$ y = [151640, 519675, 560032, 220852, 294363, 574918, 768671, 211252, 169037, 52590, 369668, 276500, 44299, 75181, 390219, 286415, 329014, 209258, 326457, 42577, 337409, 399528, 334733, 298536, -48634, 48131, 345938, 363216, 501664, 410228, 379043, -6222, 433678, 307867, -28536, 223373, -60278, 166521, 38482, 32540, -249116, 335664, 223610, 214594, 262908, 168417, 30570, 401689, 522966, 119361, -53628, 115501, 104513, 320975, -30477, 603932, 296657, 247628, 362166, 75077, 457831, -32419, 128183, 365447, 88325, 42840, 74976, 49645, 405070, -114721, 252600, 209273, 225300, -13591, 62158, -108386, -121823, -25718, 171050, 449643, 68032, 56027, 420108, 469515, 135893, 294271]
13388B94271p9666D9655K53350A07979j1558K44577A14154m9823Q5308l4366C3082
13376c5742A38865L72048j24932I5429A1847O2362K07969N6466j56919L76363
13366E58088j67469j16596J9211A23123N1921J52525j60395O7604a62585F74130
13355A55223J66494J45360j41396G9342N2566K0149e8788A08776N60400j30851
13345E38325r6682r4631R6292j63199P7754M4012j1862j01120K5950D6790M10733
13334D57523a52234D12545j84238k2392R2129j47772d5170C71487a01160j39984
13324b41144g5466E0788J91696n7906R0182J17055j56510Q1900k0665N2715E4430
13312B52383J60624J12127A59073p943i4268D54846f5793B58629e8119j01247
$$ y = [294271, 214605, 49655, 303005, 107979, 96421, 340998, 114154, 64331, 149639, 115273, 33082, -35742, 138865, 510913, 385981, 95429, 11847, 74209, 282178, 338644, 181725, 558088, 390619, 274023, 293234, 123123, 175044, 327569, 167174, 234778, -162585, 674130, 155223, 321717, 467077, 325681, 79342, 131908, 152057, -58788, 108776, 669176, 538325, 441643, 347012, 443304, 280105, 357859, 401871, 390009, 288889, 314839, 46790, 457523, -152234, 412545, 228307, 205915, 298044, 150272, -45170, 371487, -101160, -241144, -75466, 50788, 242484, 184578, 274760, 391815, 235305, 317205, 296540, 349255, 54430, 252383, 413007, 525134, 159073, 151130, -94268, 454846, -65793, 258629, -58119, -159366]
13302a59366A57616R7070g2680g669F7048o806J99333A01406J3056m2504i9255
13290F37179B77705a54109o480C04133D0741c4152C35098C7793a22039r900o2318
13279a94257A73530l6237K39163C887J99222g9334L129A55718g5207M971D07990
13267B13623L5453b15141E8861B8517j3022K31746J34476Q5549k08979H8936J12982
13256B01918L6129c68375a14786A65897Q1184J30712b12231d6337B32343d4870
13245c0422h892j52688c2036A47305e8221E3098j4006j6058J72763H3682K21077
13234C04759j05052R3192K5026E5428K3555P906n227L0762a19982C50825j23672
13223B27153m8753l4214a14996B00833M3938M26O9436f655A33472e4451A11385
$$ y = [-159366, 157616, 254686, -72680, -7669, 67048, 60242, 259575, 101406, 114462, 71958, -99255, 637179, 277705, -154109, -160589, 304133, 40741, -34152, 335098, 37793, -122039, -131939, -194257, 173530, 137293, 376456, 3887, 203109, -79334, -76205, 155718, -75207, -70236, 407990, 213623, 249076, -215141, 58861, 28517, 15495, 247241, 381717, 467266, 258287, 88936, 201918, 238047, -368375, -114786, 165897, 247081, 377793, -212231, -46337, 232343, -44870, -30422, -8892, -161580, -32036, 147305, -58221, 53098, 39092, 23034, 195797, 83682, 304759, 199707, 292899, 317925, 55428, 78983, 86889, 81662, 112424, -119982, 350825, 227153, 178400, 144186, -114996, 200833, 244771, 245197, 314633, -6655, 133472, -54451, 111385]
13211D14460o5329q2970B0876K15051F9918l852J87752h8742I6249J5219m6247
13200F5221N12638c0111E3351a12649b3913C31377G3612J09715D9744J27716E1081
13188A54394h6800C62504g9062A20609R1918c11106C6116K19545F2038a67688
13177a7947G186P5411h9899C92816G0217a14902A43669d1961B52067J56846M5176
13166D54089b85403b8974D660K3399K9471L79045f8394n3926A58346F2525K76613
13155C39138a11469D3073M5190k6812J23250a40257E04242C268J00146Q1110N0814
13144B35338J6289O0929A10749a98805A36250F27K19098L1222L1426j09597a33281
13132B55804q2848b46083D7793a06805A67755Q5049a09473A28348J2843J034J31469
$$ y = [414460, 349131, 266161, 20876, 235927, 69918, 66066, 253818, -88742, 96249, 111468, 65221, 577859, -30111, 53351, -112649, -23913, 331377, 73612, 183327, 49744, 177460, 51081, 154394, -86800, 362504, -79062, 120609, 212527, -311106, 36116, 255661, 62038, -167688, -17947, 7186, 82597, -89899, 392816, 70217, -114902, 143669, -41961, 252067, 408913, 454089, -285403, -28974, 4660, 28059, 57530, 436575, -68394, -122320, 158346, 62525, 339138, -111469, 43073, 88263, 61451, 184701, -140257, 504242, 3268, 103414, 184524, 235338, 251627, 312556, 110749, -198805, 136250, 627, 219725, 250947, 282373, 172776, -133281, 255804, 172956, -246083, 47793, -106805, 167755, 252804, -109473, 128348, 141191, 142225, 273694]
13121B73694l3922J7875b50071d8965A14396n6147b17804A84981M7017J13222
13111C45220A56259m1402L38454b44750I0988L2337a59247m2904B71748r0327
13101A81421k2527F6826A1431L6462K74959K633i1395j67637A51582D3885M4005
13090H7890a95590j94528D80863a46423E3840j9133J03950J1784a3426k73480
13080b86906P1392P7110F89185C35430H6564h7321B09248g0004B65292a97353
13069C02097A15444a2974B75132A07736B3322N20591B8193a15642A99334F7698
13058F9593J05977J21347h731A22891b3911A19428k1424O9343J7742l3195c2194
13046C41745F5615g7499A03877l5275j7976c0010l8355I4315j4895K41008O3137
$$ y = [273694, 239772, 257647, -250071, -48965, 114396, 58249, -217804, 184981, 231998, 345220, 156259, 114857, 453311, -244750, 90988, 123325, -159247, -202151, 271748, 181421, 158894, 66826, 11431, 47893, 322852, 325485, -91395, -259032, 151582, 43885, 87890, -195590, -390118, 480863, -146423, 53840, 34707, 138657, 150441, -13426, -286906, -215514, -138404, 689185, 335430, 86564, -87321, 209248, -70004, 265292, -197353, 302097, 115444, -12974, 275132, 107736, 23322, 543913, 28193, -115642, 199334, 67698, 69593, 175570, 296917, -8731, 122891, -23911, 119428, 98004, 167347, 185089, 151894, -32194, 341745, 65615, -77499, 103877, 68602, 50626, -30010, -68365, 94315, 79420, 320428, 383565]
13035C83565o8399B6847L9667a52919C97962A5340g757q7086I6892m0780J7209
13024G3321B8554M23265F6161J36863H6576K3765f4252A48829c9177B6047K1441
13013D7488r9K78543d104H3597J23664p0442M6989h997D2573K77943i6451B438
13000C41813j38487p320R103a61426A74770o9211P8506E1329a37059C30077B4993
12988C00480d4414A87607r3187N1300J80706a22192d4864B85857F5662J98313
12978B63975a00759A641R5410E841K91463a0292H2577J4104a2381F0543K74671
12967C35214j59878m1720k6660a31007G56487b75869G7176J00270H0667e5192
12956a99159A09666g5231H8582B7221b6788k70836C4120R4289K05695h1514c1489
$$ y = [383565, 315166, 26847, 66514, -152919, 397962, 15340, -7757, -94843, 96892, 56112, 73321, 28554, 451819, 66161, 203024, 86576, 110341, -64252, 148829, -39177, 26047, 47488, 47389, 325932, -4104, 83597, 207261, 136819, 183808, -8997, 42573, 320516, -96451, 2438, 341813, 203326, 196006, 205109, -161426, 174770, 105559, 184065, 51329, -137059, 330077, 24993, 300480, -44414, 187607, 94420, 145720, 326426, -122192, -44864, 285857, 65662, 263975, -100759, 1641, 97051, 5841, 297304, -10292, 82577, 96681, -12381, 60543, 335214, 175336, 133616, 106956, -131007, 756487, -275869, 77176, 177446, 80667, -55192, -199159, 109666, -75231, 88582, 27221, -26788, -297624, 34120, 128409, 334104, -81514, -31489]
12944f3813E3553b05452h4789B6097b43692Q0737B1292M23059a51793j07934A64878
12932f511B6276J26791K70987a2858A59894c13775A37080O0681b47840A46497
12921A2536R9175J40791k5623d1751A3282c28507e9377B12679a24695j15772A36180
12909d08107B56886k8529C0097a30087A13536D7286K35867g6554I198d4929B7802
12897C8933e669E5645J8805e9096o4493B57307K11504A17563J14665j06516E678
12885A05859A1087O2672J39329c58802A56212e6417A60188A6418a84707A73985
12874a64850e0643p2348A83538a28877I2216J10321a96031r9719B8077M6702J18041
12863A92820b74747D49003e0042H5944A9615a04367A89456b49217J12742m7628
$$ y = [-63813, 53553, -205452, -84789, 26097, -243692, -162955, 21292, 444351, -151793, -259727, 164878, -6511, 26276, 153067, 424054, -12858, 159894, -313775, 137080, 197761, -247840, 146497, 12536, 111711, 252502, 226879, -41751, 13282, -328507, -59377, 212679, -124695, -240467, 136180, -408107, 256886, 228357, 30097, -130087, 113536, 47286, 283153, -76554, 9198, -44929, 27802, 38933, -5669, 55645, 74450, -59096, -123589, 257307, 468811, 117563, 232228, 125712, 5678, 105859, 11087, 73759, 213088, -358802, 156212, -56417, 160188, 16418, -184707, 173985, -164850, -50643, -122991, 183538, -128877, 92216, 202537, -196031, -295750, 28077, 74779, 192820, -274747, 449003, -50042, 85944, 19615, -104367, 189456, -249217, -136475, -184103]
12853a84103A3971J95355a85427o0140B92766d8395G6534L15264A78630a05643
12842d8862A18246a03790B63169c0744C50505d1811A44912D2959a38094d4069
12831A64109b31748m5229a33165B0234P5752c09668B06992C9757J57062a47180
12820b05323j6178k14754a86970H0405e4352k2716D16362G4949f5004I8087C5136
12808d6964A33629c05849J23711g368B7000g7352G0747h6242C7191D557a95743
12796G4214K5007K2917i4420A50551a56976F8443a4224A04413j4244J57635a5964
12784A74238J30167a4878E1761L61702f5099A48016D0464O4694j4852L0457a6061
12772B09419a31672A03325K04297a75912A30541a07092n013M4302I7246a93460
$$ y = [-184103, 13971, 209326, -185427, -245567, 292766, -48395, 76534, 391798, 178630, -105643, -48862, 118246, -103790, 263169, -30744, 350505, -41811, 144912, 42959, -138094, -44069, 164109, -231748, -276977, -133165, 20234, 95986, -309668, 206992, 39757, 196819, -147180, -205323, -221501, -436255, -186970, 80405, -54352, -77068, 416362, 74949, -65004, 98087, 35136, -46964, 133629, -305849, -182138, -7368, 27000, -77352, 70747, -86242, 37191, 4557, -195743, 74214, 99221, 122138, -94420, 150551, -156976, 68443, -14224, 104413, 90169, 247804, -15964, 174238, 304405, -14878, 51761, 413463, -65099, 148016, 40464, 105158, 90306, 120763, -16061, 209419, -131672, 103325, 307622, -175912, 130541, -107092, -112105, -67803, 97246, -193460]
12761a2660l06127A98492a184A34532k6371j7072f5845G7452b9406J2447A46274
12749C09705l1452b523j12912I8164f185j88994B97202M1932j28581o8363A4325
12737C76104b32592A77304E2216K10508f775A05085J74140E6791a17832r4498
12727b12330A97730a46876O5181L769E9015J37450H8957c77920B75895F290K72594
12716B78884j01100H8599b85598E425a48437j28450B53180J08261a142A95368
12705D9368i9692C27599f1832D1709J34424O2381d4461A7237b16430F9279M94694
12694E63973A68742G3055L5974j6533k485b17012i8225C04228g3479j20513C1282
12682A09019m7932K23257h1063B47227j19411l4173M3276l3815a36529B02652
$$ y = [-12660, -318787, 198492, -1184, 134532, 108161, 91089, -65845, 77452, -29406, -16959, 146274, 309705, 278253, -2523, -115435, 98164, -6185, -195179, 297202, 339134, 210553, 142190, 14325, 376104, -232592, 177304, 52216, 262724, -6775, 105085, 279225, 56791, -117832, -212330, 197730, -146876, -81695, -77926, 59015, 196465, 88957, -377920, 275895, 6290, 278884, 177784, 88599, -285598, 5425, -148437, -276887, 253180, 361441, -1142, 195368, 49368, -99692, 327599, -61832, 41709, 176133, 238514, -44461, 17237, -216430, 69279, 563973, 168742, 73055, 109029, 92496, 90011, -217012, -98225, 304228, -73479, -193992, 31282, 109019, 61087, 284344, -81063, 247227, 127816, 93643, 136919, 103104, -136529, 202652]
12671a21526e6223j40352A48365i6106L2646F2781M0525K42632f9704B08407A2427
12659c4360p5125B84132j03117Q4088c2340A32203b13230F628K11685k2971e402
12647f6961h906A02685J978a06155H1867a91242p8429d8961D03066i1164j07980
12636a99144A78314C1508J8784J96168G707K0015L60155f3014D75360j37075a05614
12624C24589r0873J93951a0924D11095G3844a305A7264f2586j84391H5879h8890
12612i6020m1161F9497d1547I1565j8112k9609h8682A19468P7053l9185R8080
12601B55416P0884a34330A28675D7708K1296O4352A7558d1497o1039A08344g9349
12589b7953j29203N9477A16183m1561J33124J1793a10539A47664b11201g4280
$$ y = [-121526, -56223, -196575, 148365, -96106, -63460, 62781, 103306, 345938, -69704, 208407, 12427, -34360, -109485, 284132, 181015, 265103, -32340, 132203, -213230, 6628, 218313, 195342, -5402, -66961, -8906, 102685, 104663, -106155, 81867, -191242, -269671, -48961, 403066, -91164, -199144, 178314, 31508, 50292, 246460, 7707, 27722, 387877, -63014, 475360, 338285, -105614, 324589, 233716, 427667, -10924, 411095, 73844, -1305, 17264, -62586, -246977, 85879, -88890, -96020, -137181, 69497, -41547, 91565, 73453, 43844, -88682, 119468, 196521, 157336, 255416, 326300, -134330, 128675, 47708, 69004, 133356, 17558, -41497, -102536, 108344, -79349, -27953, -157156, -97679, 116183, 74622, 207746, 219539, -110539, 147664, -211201, -74280]
12578A35249h6147A07341J16646a688H2968l5341g6319a8440k9258I170c09294
12566B25070c21095A10954K95203k02287a78835D9457N0731L2864d1269k41965
12556b83234a30499e7714C04269e0436j236p3299j37073a29211A23922d2262M275
12545c7987A4932b75783C9202a799E9508a51384B1508i304I9602K30147o8951
12534B60798k7321k4005q3802a71220K6636C4237q957J00401C1848J20217J3277
12523A65342g7891q4560B13949K3314a78526C93482a24837A38720a46357n1750
12513a98107b1041r2658B02300b802H1526a41497A22073A7363b66007H0551J71423
12502B51974H6775a09473A64199j650a94535J6974A75707a88019A6448J96238
$$ y = [135249, -86147, 107341, 223987, -1688, 82968, 47627, -76319, -18440, -47698, 9170, -309294, 225070, -321095, 110954, 406157, 203870, -178835, 49457, 100188, 133052, -41269, -283234, -130499, -57714, 304269, -50436, -51672, -124971, -262044, -129211, 123922, -42262, -37987, 14932, -275783, 39202, -1799, 59508, -151384, 21508, -9304, 99602, 329749, 260798, 233477, 209472, 125670, -171220, -144584, 34237, 25280, 125681, 31848, 152065, 165342, -77891, -162451, 213949, 237263, -178526, 393482, -124837, 138720, -146357, -198107, -21041, -113699, 202300, -2802, 81526, -141497, 122073, 17363, -266007, 80551, 251974, 86775, -109473, 164199, 162549, -194535, -177561, 175707, -188019, 16448, 212686]
12492B12686f7857B76332A24628g2974e424B57448c2575j39356D1924e6191I0676
12480A76506b35506o5943a31931B90916B4753P423f617j97180D3627a21177B96884
12468b01399d4741j96484A93855H0084J71712d7892m8533M3074o8800G3899c58995
12456f226A87393E5404J03535C7123J05188a90382A77352b7878p9333R099j6443
12445a14555A60964K8905b08223g1655A17472E6040g3336l80875a37354A3575
12434C62262i349l148A84380D4075J21121c52525E1677a28377l4057A43794Q5903
12423B29697C2000L1193a72837A50353F3679a37079d0513I7294i6910j01521F1646
12411D87454j33745b25395a2432A42266b07023A27918h9603F4349c12608a03470
$$ y = [212686, -67857, 276332, 124628, -72974, -5424, 257448, -32575, -171931, 41924, -56191, 90676, 176506, -235506, -301449, -131931, 290916, 24753, 32176, -6617, -203797, 43627, -121177, 296884, -201399, -44741, -241225, 193855, 80084, 251796, -47892, -96425, -53351, -122151, 73899, -358995, -6226, 187393, 55404, 158939, 37123, 142311, -190382, 177352, -27878, -107211, -98112, -114555, 160964, 189869, -208223, -71655, 117472, 56040, -73336, -454211, -137354, 13575, 362262, -9349, -12497, 184380, 44075, 165196, -352525, 51677, -128377, -162434, 143794, 229697, 32000, 63193, -172837, 150353, 63679, -137079, -40513, 97294, -96910, -198431, 61646, 487454, 353709, -225395, -12432, 142266, -207023, 127918, -89603, 64349, -312608, -103470]
12400D69792A40829j3891d81691A87361b16069l798A73104L1496b44685N2187
12390a92498A08500J37221a45285B15358j01271E1702K07050j18939B7552K74133
12380C01685a45162K2125c8098I5887K88715j48265J96578b26731a10831A37531
12369b094m6017o5950j43705f0889K2891j50930L4755F0437M3603a74421b3953
12357d7908j06491k04477a23512A76752M9770A5142L505b06364N0987A16948d0361
12345C38759H8955g6894K292K5461k61108H7399A8301a86057k50848h9980E7259
12333g6020L3768n0907k72290a086A11640J07413b4175n5867C00853a15299K756
12322a12543b5759r9744b7940j22750j59234B47023a26176A44103Q11h0207C7528
$$ y = [469792, 140829, 126938, -481691, 187361, -216069, -219867, 173104, 204600, -244685, -192498, 108500, 245721, -145285, 215358, 114087, 51702, 258752, 139813, 27552, 301685, -145162, -123037, -38098, 95887, 384602, 236337, 432915, -226731, -110831, 137531, -2094, -48111, -114061, -257766, -60889, -37998, -188928, -154173, 60437, 104040, -174421, -23953, -47908, -154399, -358876, -123512, 176752, 226522, 15142, 18647, -206364, -155377, 116948, -40361, 338759, 88955, -76894, -74602, -49141, -310249, 87399, 18301, -186057, -436905, -89980, 57259, -76020, -42252, -93159, -365449, -1086, 111640, 219053, -24175, -80042, 300853, -115299, -112543, -25759, -125503, -27940, -150690, -309924, 247023, -126176, 144103, 144914, -80207, 37528]
12310G3312a72866c0633n3405L7278m8628A53864g9145j41501K7570d5125A31747
12298G1104K23670l1893H3956h7821C9881J96842a75086D77057a82835h7054H3259
12286a02539f357J93B03443K01594D9411c06686G4735K55220C1809b27088A48429
12274B38068F8681B4473J83773a72279B48501b1998A46041K35212j47855H4557
12263b4980j5366A78841n5388a20417A63008d5560D13292j92820G7508K23712
12253C01220e194A20368J72108o9040M9125h9469b6224j20739A27663C3367a46474
12241D0452J67477J387o0236K15408A62645k3826K46103a12166C29514A23850
12230G9876c7298m3937E39534A45071a9560A46557m9388O58468A20093K4409L10370
$$ y = [73312, -172866, -30633, -84038, -46760, -95388, 153864, -79145, -220646, -193076, -45125, 131747, 71104, 294774, 262881, 83956, -87821, 39881, 236723, -175086, 477057, -182835, -87054, 83259, -102539, -6357, -6164, 203443, 405037, 49411, -306686, 74735, 329955, 31809, -227088, 148429, 238068, 68681, 24473, 208246, -172279, 248501, -21998, 146041, 381253, 233398, 84557, -24980, -40346, 178841, 123453, -120417, 163008, -45560, 413292, 220472, 77508, 301220, -5194, 120368, 292476, 223436, 272561, -89469, -26224, -146963, 127663, 33367, -146474, 40452, 207929, 209316, 149080, 364488, 162645, 138819, 384922, -112166, 329514, 123850, 79876, -37298, -81235, 539534, 145071, -19560, 146557, 97169, 755637, 120093, 144502, 454872]
12219D54872j69901P5747j38620a47251M3726r6786f8319A42768L3680k9897a10595
12207D6609K93496A1466M35785B19476J19764H1825K04489e035B01859M3735C5346
12195A06870K85316A73176J13224A40999J96175b7438A36554n6619j0601K15730
12185B85064j19139k3018c28975E47076G9024J22888R1451H8502B9882J34948
12175A64830P4022A6681K07579n1936L3967r861M2138J9176l1088f0867H2578
12163B89100j31471a47126A61965B7628J46499q1179D0222b30630b5568C6913
12152B13332m8941F2686K38575b01339i3235f333n7604k90529o3281A18172J17635
12141B35807I0774N4299l6862Q6473b69898D8333E049P6182b3404k9015I1770
$$ y = [454872, 284971, 360718, 222098, -147251, -103525, -200311, -68319, 142768, 176448, 146551, -110595, 46609, 340105, 11466, 447251, 219476, 339240, 81825, 286314, -5035, 201859, 245594, 35346, 106870, 392186, 173176, 286400, 140999, 337174, -27438, 136554, 79935, 69334, 285064, 165925, 142907, -328975, 547076, 79024, 201912, 293363, 88502, 29882, 164830, 238852, 16681, 224260, 172324, 206291, 196430, 238568, 257744, 226656, -60867, 82578, 289100, 157629, -147126, 161965, 27628, 174127, 92948, 40222, -230630, -25568, 36913, 213332, 164391, 62686, 301261, -201339, -93235, -6333, -63937, -354466, -417747, 118172, 235807, 90774, 145073, 108211, 194684, -269898, 48333, 5049, 81231, -23404, -52419, 91770]
12129G1344R7775B9302K5741a11190c8081A32859a43530o2044A10111K25381d10220
12117A29421L0544B8718L82582e5147D39834b25308B811b10187g7691K0704l2587
12106h9574P015C1895M375K6059a64361G7374N1334b40480K7245k16555E5758
12094A66267i6554j00050C2364b03372C5828b79092h3458A89849E3248a30158
12083h8536j19840G3291b00777B68479q6691O4755R76938P50006H22943A54017
12072A40944J89897b3377j45771j84398F6717g635l9973F9862g2600k1707l9321
12061a33628p1061C61321A08082K68725B6202g8911E0319c5392B8137K95492I2103
12049d6029F0362M6319b79237N6220d4902j14037k22500a59269N1937b1268B36956
$$ y = [71344, 169119, 29302, 55043, -111190, -38081, 132859, -143530, -205574, 110111, 335492, -410220, 129421, 159965, 28718, 411300, -55147, 439834, -225308, 2811, -210187, -77691, -56987, -89574, -82559, 31895, 36270, 62329, -164361, 77374, 128708, -240480, -213235, -429790, 55758, 166267, -96554, -196604, 32364, -203372, 35828, -279092, -83458, 189849, 53248, -130158, -88536, -208376, 73291, -200777, 268479, 181788, 246543, 1223481, 1973487, 822943, 154017, 140944, 330841, -23377, -169148, -353546, 66717, -7635, -47608, 69862, -72600, -94307, -133628, -204689, 361321, 108082, 376807, 26202, -78911, 50319, -35392, 28137, 323629, 92103, -46029, 60362, 106681, -279237, -223017, -44902, -158939, -381439, -159269, -107332, -21268, 236956]
12037E8795c92315a12281A53756a09055j52104J03001c3149m3055j6323F2772
12026B2050f1351E8755E219K51983F5621a29684j27984d2289B09274b14675B32359
12014C32938H7890b25261k04434c3761j31642B09048F6830a22032C96899a25358
12003E35718B03497E4898k4953d324j58740n3104A07331A6568J18106J4394b06823
11991B00829G3512J9895L88022c35038A41564b87258g1916A66867h6685A09189
11980A06776a43809B4105J48244a34662A47865B6342a03674d4927c655C42601
11969b8008l3872c090m4067k56383c850j9967j68464A19435J5875f2382A99687
11957B65727a07932A56001f8657I666a63047M7911A28529A5855a48738L1304D0787
$$ y = [58795, -392315, -112281, 153756, -109055, -261159, -158158, -33149, -76204, -92527, 62772, 22050, -61351, 58755, 5219, 257202, 65621, -129684, -257668, -42289, 209274, -214675, 232359, 332938, 87890, -225261, -429695, -33761, -165403, 209048, 66830, -122032, 396899, -125358, 535718, 203497, 54898, 29945, -4324, -163064, -216168, 107331, 16568, 134674, 149068, -206823, 200829, 73512, 93407, 481429, -335038, 141564, -287258, -71916, 166867, -86685, 109189, 106776, -143809, 24105, 172349, -134662, 147865, 26342, -103674, -44927, -3655, 342601, -28008, -61880, -3090, -47157, -303540, -3850, -23817, -192281, 119435, 135310, -62382, 199687, 265727, -107932, 156001, -68657, 9666, -163047, -115136, 128529, 15855, -148738, -117434, 40787]
11945h6590A70234A421L03960I2695a87856M312L5241A845B28c518F1376B811
11932A72597L1857i8054C84199a57831A05945b50166O6752A15458k4553g0155
11921c9401j30885A93693c9151G6295L103a95573K2825b0813B93966q5171e1715
11909A96599b42710a6027A5667a40216A96180D8276J12950N2144H531b37722E27786
11897i5999A76569G0212a42638I3978h9789C86239a54104K5895A8669b23654h5911
11885B22490k9758B3623a13333p812p2398g6324b0849D32946a33533e8687A2091
11873C4089L57846a29839j35018M4295j66735N2213a38316m5468P4726A89812
11862a62071A0265K3237e0185e92j30018j09821Q1870D236a63464N2183j22579
$$ y = [-86590, 170234, 1421, 305381, 92695, -187856, -183544, -148303, 1845, 228, -3518, 61376, 2811, 172597, 204454, -98054, 384199, -157831, 105945, -250166, -183414, 115458, 90905, -70155, -39401, -170286, 193693, -39151, 76295, 79398, -195573, -172748, -20813, 293966, 208795, -51715, 196599, -242710, -16027, 15667, -140216, 196180, 48276, 161226, 213370, 8531, -237722, 527786, -95999, 176569, 70212, -142638, 93978, -89789, 386239, -154104, -128209, 18669, -223654, -85911, 222490, 192732, 23623, -113333, -121145, -193543, -76324, -20849, 432946, -133533, -58687, 12091, 34089, 391935, -129839, -264857, -220562, -387297, -335084, -138316, -183784, -109058, 189812, -162071, 10265, 33502, -50185, -592, -130610, -240431, -158561, 4236, -163464, -111281, -233860]
11851b33860A23270d6469l6294L1023E4813b22758m3829h4526A79465h520A64241
11839D97502D7728d35862a16522C0581L9277K53184E3516g2045j85157J08953
11829a48249A4863j735K50902A28375a36438a1037k45184J9289A7485d8733J9273
11818b9460j59631m1070a232B08962a24617j80233l7066N8097J25703J6075d8294
11806E958b57483B8816a71965n2810i641A2831i1204A85913b76083h3065L3803
11795d9262B53068c33723a7408k531j98500M8066C4541b8594A63236b28974A43215
11783d2041A63707l0445b95211D406f6842C9634J59856B3870J3572J72668A04389
11771b19265B5994q856b8753q1164H4935d2684B01163r2737b1499C064h6817A2075
$$ y = [-233860, 123270, -46469, -82763, -51740, 54813, -222758, -266587, -84526, 179465, -8520, 164241, 497502, 47728, -435862, -116522, 30581, 69858, 323042, 53516, -72045, -257202, -148249, 14863, 13128, 264030, 128375, -136438, -11037, -256221, -236932, 17485, -48733, -29460, -189091, -230161, -1232, 208962, -124617, -304850, -341916, -283819, -158116, -142041, -48294, 5958, -257483, 28816, -171965, -224775, -9641, 12831, -91204, 185913, -276083, -83065, -49262, 253068, -333723, -17408, -19939, -218439, -170373, 34541, -28594, 163236, -228974, 143215, -42041, 163707, 133262, -295211, 4406, -66842, 39634, 199490, 23870, 37442, 210110, 104389, -219265, 25994, 17138, -28753, -109917, 84935, -42684, 201163, 108426, -21499, 3064, -86817, 12075]
11758h8876c3761o9462A48174o1678Q5114N6400E1404J2653b24325C04503j40381
11747A64122j5199a56034q5986a9052A27732B0857J59319g4999E0203j3766a46352
11735a34143m105a2997B69881p125b1322A73058J77330b14633b3437q0028B7549
11723G0006M3445L0140m1722a47762c0943B54518I055b21980P5595F2803K27521
11712B90324I9247i7876D83807F3L00505j02049g1612j7149k9787G1723a41195
11700e2280C43563d79859G5423b47052a09645A23212K0008b32072A83227h3065
11689A9228d60437I867e9122B12875P6451A40617b81897C0139a10166B67115a48835
11677B65149a3865B24968O961E4144R0518E5095L8537a85977p3227a05775g911
$$ y = [-88876, -33761, -103223, 148174, 86496, 171610, 228010, 51404, 64057, -224325, 304503, 164122, 148923, -156034, -242020, -19052, 127732, 20857, 180176, -74999, 50203, 36437, -146352, -134143, -138248, -12997, 269881, 262756, -21322, 173058, 350388, -214633, -23437, -103465, 27549, 70006, 113451, 143591, 101869, -147762, -30943, 254518, 9055, -221980, -146385, 62803, 290324, 99247, -97876, 483807, 63, 300568, 198519, -71612, -88761, -118548, 71723, -141195, -52280, 343563, -479859, 75423, -247052, -109645, 123212, 143220, -232072, 183227, -83065, 19228, -460437, 9867, -59122, 212875, 289326, 140617, -281897, 30139, -110166, 267115, -148835, 265149, -13865, 224968, 231929, 54144, 144662, 55095, 93632, -185977, -259204, -105775, -7911]
11665a56487j56949A23929A9640f1434l1710c6903m561A89022p2705J36907a26350
11653C53096D7945J61088G4476c9216o6669A9429i3950j14726N234A40808c9246
11641A47106K2673C8649K03867e30806B60347J03348h377k74407D2395d0235B6012
11629D1107g2214j4167E905h0232q598B25142r2885a77293m4979C38095a72480
11617B96635F0631a59458B0114P540A1942l530R0442a62428F6359L42305A93576
11605b46120j393B76886b51224D75485a85436B80316D4909N8931A6828P8889J49222
11594B44939j1563E8405K3036B5386K11684Q823H6064N907B455a32818A7286L55444
11582C72730D6695B2295J85118H1820B1848I7g9060A41985J62113H1726i4044
$$ y = [-156487, -313436, 123929, 19640, -61434, -93144, -36903, -41464, 189022, 116317, 253224, -126350, 353096, 47945, 209033, 74476, -39216, -105885, 19429, -93950, -208676, -203442, 140808, -39246, 147106, 169779, 38649, 242516, -530806, 260347, 363695, -8377, -282784, 42395, -40235, 26012, 41107, -72214, -86381, 5905, -80232, -88830, 225142, 132257, -177293, -222272, 338095, -172480, 296635, 60631, -159458, 20114, 27654, 11942, 8412, 98854, -162428, 66359, 408664, 193576, -246120, -247513, 276886, -251224, 475485, -185436, 280316, 44909, 103840, 16828, 95717, 244939, 233376, 58405, 81441, 25386, 237070, 245893, 86064, 91971, 2455, -132818, 17286, 372730, 46695, 22295, 207413, 81820, 21848, 97, -79060, 141985, 304098, 81726, -94044]
11570h0326J0609C9410b19925c2113I1987P0040J11852d0083I4319F307a89174
11558h1197B44132H0377J53657r7139R4407C2671b33766A23916a21537A71221
11547a29048B0412K57186C7831p942O4352c3312H7727L40404a08785M645A13106
11535B57515I2828E618P3386b68020I995D503J42619i493A78217a14385A64786
11523A42501F0365a51794F3314K36455B5862b11597i0897F2631c2541F1588K08687
11512B70275G2918a68171A23907C615K53104A03271K38714A62481L84545k02451
11502C44575R5953I2965J26034m1154J56524e8246A28158E6983K81043B0292J75887
11491A96179H0727B3537b88353B14844L2402j2457D7946a40000N5679K1126D34453
$$ y = [-80326, -69717, 39410, -219925, -32113, 91987, 162027, 273879, -40083, 94319, 6307, -189174, -81197, 244132, 80377, 234034, 136895, 231302, 32671, -233766, 123916, -121537, 171221, -129048, 20412, 277598, 37831, 29889, 94241, -33312, 87727, 428131, -108785, -104140, 113106, 257515, 92828, 5618, 79004, -268020, 9995, 4503, 147122, -9493, 178217, -114385, 164786, 142501, 60365, -151794, 63314, 299769, 25862, -211597, -90897, 62631, -32541, 61588, 270275, 72918, -168171, 123907, 3615, 256719, 103271, 341985, 162481, 547026, 344575, 440528, 92965, 218999, 177845, 334369, -58246, 128158, 56983, 338026, 20292, 196179, 80727, 23537, -288353, 214844, 247246, 234789, 47946, -140000, -84321, -63195, 434453]
11479A38426J62875d5374H9103J39443j8054n3476L6619K52851d3585A07827e9586
11467C15400K44664b0886j64089A44732M1489i5051G4711K15901M2655G8782K27291
11456C06073B7441K18048H1889k5430J71797M7104A29173J11787f9843H2146J94331
11445B76477J963e296o3318J3598j08175A49801p0894c02489A66277d8423G5221
11433B09789b39339C28861j51300J09446h9641b8748p7514p0129A75556C3249
11422b0891D8904K73716A33339e6542C50041A05960k2978b49615a05316A29352
11411a41614k9449n2636i6555H6471K40990a81206B43683D9237M1488h4388C7663
11399D1583a39664A63420a69703k7689D09b3903j03322r5890i8437D0433a9176
$$ y = [138426, 301301, -45374, 89103, 228546, 210492, 157016, 193635, 446486, -43585, 107827, -59586, 315400, 560064, -20886, -184975, 144732, 186221, -95051, 74711, 290612, 333267, 78782, 306073, 27441, 245489, 81889, 56459, 228256, 275360, 129173, 240960, -69843, 82146, 276477, 278440, -5296, -68614, -55016, -163191, 149801, 78907, -302489, 166277, -48423, 75221, 209789, -239339, 328861, 177561, 287007, -89641, -28748, -106262, -176391, 175556, 33249, -20891, 48904, 322620, 133339, -56542, 350041, 105960, 82982, -249615, -105316, 129352, -141614, -171063, -223699, -96555, 86471, 327461, -181206, 243683, 49237, 90725, -84388, 37663, 41583, -139664, 163420, -169703, -197392, 409, -23903, -127225, -223115, -98437, 40433, -19176]
11387B1330M5536d5248l8844j62682J09973H2101L44295d611A24339b33660A07051
11375A19496a18516C33151q2706A17344M7639f6821K0246j38386p587j17427h9477
11363A987L4223b19211A70245i2745j58008P3191L1609j35707a25939o1474H5608
11351I4568b957k78304A23985C904a6568B0576a42840N9368B53428B6483a65669
11339B7313N3843b32331d0658N133k81049g9392H7705N658D11b18228i756k36355
11327b46111j82952F0175J21352a877B4557J35019g9317J2982r8610C7153Q242
11316D5395L4572g9554K2551D0099a62046A9066O8180f7728J6280p2173A02852
11304h5083k45118B67523e4327a9479E2450K69870j61065F48b00467R7955j07474
$$ y = [21330, 66866, -45248, -84092, -246774, -136801, 82101, 426396, -4611, 124339, -233660, 107051, 119496, -118516, 333151, 250445, 117344, 164983, -66821, -46575, -184961, -192548, -309975, -89477, 1987, 36210, -219211, 170245, -92745, -250753, -177562, -145953, -281660, -125939, -187413, 85608, 94568, -2957, -281261, 123985, 3904, -16568, 20576, -142840, -83472, 253428, 26483, -165669, 27313, 81156, -232331, -40658, -35525, -316574, -79392, 87705, 93363, 411, -218228, -9756, -246111, -429063, 60175, 181527, -1877, 24557, 159576, -79317, -66335, -164945, 37153, 45395, 79967, -79554, -57003, 40099, -162046, 19066, 87246, -67728, -51448, -123621, 102852, -85083, -330201, 267523, -54327, -19479, 52450, 322320, 161255, 648, -200467, -102512, -209986]
11293b09986D8185c18049d9907n5893A9654b09311k5527B87983A30849n8927C1079
11281b60668B63883n4428c0417B64285a51501e3577j19446d6591r8868j6798A67853
11269d3958H6326R0455A339c29559A04684D7559d739r6665q9118j81568B16432
11257b6446k29850A2591a76982C20J19320c68233H3541e0786l6621p1777g9224
11245b24004d6799j04601j08190A24081a4089j98106A45712c3535k59284I2548
11234b7618F2788h5411m9657E3961e5149D4421A8046f9296k9790j8136A68321
11222D5494J58957G916b41602A12648Q1472d8518o0018j69840K1883A0738b44350
11210c95156e9821D0409b68043J32908j09815a187A60123a85969O2275j90150
$$ y = [-209986, 48185, -318049, -49907, -105800, 19654, -209311, -234838, 287983, 130849, 71922, 31079, -260668, 263883, 209455, -30417, 264285, -151501, -53577, -173023, -46591, -145459, -162257, 167853, -43958, 86326, 176781, 1339, -329559, 104684, 47559, -4739, -101404, -190522, -372090, 216432, -26446, -256296, 12591, -176982, 320, 119640, -368233, 83541, -50786, -87407, -159184, -79224, -224004, -46799, -151400, -259590, 124081, -14089, -212195, 145712, -33535, -292819, 92548, -27618, 62788, -85411, -135068, 53961, -55149, 44421, 18046, -69296, -99086, -117222, 168321, 45494, 204451, 7916, -241602, 112648, 194120, -48518, -108536, -278376, -256493, 10738, -244350, -395156, -59821, 40409, -268043, -135135, -244950, -1187, 160123, -185969, -123694, -313844]
11200c13844A01896A0241a0883j56954p5152G2778K60357F864a6400A08626l8495
11189G0131j8810a06277k34361a47808A77602a25632l56829I6080M5629E8049
11178F3729Q9061a87515i3177e224q2108g748C38049b33653C3845a72775q3719
11167b56494A05510M2889L9415m6953b43896A74206a20107a2965C2127e7886B53657
11155a68983A58827A9082a58686E194K43183b26561J00237A53437a75052K058
11145a72994M0405A04648O3768F7882a22936c6945A48662O9497c9929j33089e7140
11133d7231H8534a63466A36165J96828d7396j05559a8203l0055A50954b31112
11122b41991F3890b0086B6646K64263A3629a34857C1390L87055A6202K54751p2475
$$ y = [-313844, 101896, 10241, -10883, -167837, -242989, 72778, 333135, 6864, -16400, 108626, 70131, 51321, -106277, -340638, -147808, 177602, -125632, -482461, 96080, 141709, 58049, 63729, 152790, -187515, -93177, -5224, -87332, -7748, 338049, -233653, 33845, -172775, -256494, 105510, 148399, 187814, 140861, -243896, 174206, -120107, -12965, 32127, -57886, 253657, -168983, 158827, 19082, -158686, 5194, 248377, -226561, -126324, 153437, -175052, -172994, -132589, 104648, 168416, 67882, -122936, -36945, 148662, 218159, -39929, -173018, -57140, -47231, 88534, -163466, 136165, 332993, -47396, -152955, -18203, -48258, 150954, -231112, -241991, 63890, -20086, 26646, 290909, 13629, -134857, 31390, 418445, 16202, 270953, 198478]
11111A98478K04357j14257A8458L27927E6739K41083q5575a19017j07742I9898
11100G3323Q9624j2746P5675J28585D1092h775A05320M70456F6094K01516m7289
11089B20321L23280j18400r4189B6453L11211j50373N0861L18531k63660g0180
11078f2329A49733a45302A98591M436J07694A4267M29255j85556L04096j71047
11068C91015R8103q8639J17887K17088j27176j04962B24951J79236N0644A32055
11057G30867k20443K92371k18381j79844K20215L3857K69120K6664r3298j81240
11047F79888K494L15908m59783K9016j48550K10869L92436j30116k10386j06264
11037E75512q416K55123J00036l50416K61300L5872k43004J6291J61657k32909
$$ y = [198478, 402835, 288578, 18458, 346385, 56739, 297822, 212247, -119017, -226759, 99898, 73323, 162947, 150201, 225876, 354461, 41092, -8775, 105320, 575776, 66094, 267610, 220321, 543601, 425201, 331012, 26453, 337664, 187291, 238152, 556683, 293023, -70180, -62329, 149733, -145302, 198591, 203027, 310721, 14267, 443522, 257966, 562062, 391015, 489118, 400479, 518366, 735454, 608278, 503316, 224951, 404187, 454831, 132055, 730867, 510424, 802795, 584414, 404570, 624785, 658642, 927762, 954426, 861128, 679888, 682382, 998290, 538507, 567523, 418973, 629842, 1022278, 892162, 681776, 575512, 567096, 822219, 922255, 571839, 833139, 869011, 626007, 642298, 803955, 571046]
11027E71046K96889l50895M23597l96082J48148J94650j8665m05191J53301M16411
11017A033209r0409l61188k33912K57224J90191R0454j26809k44384L39108k23440
11007F30044k87093L76617j01615J56693l31660K30366k7542j70632J95043J41526
10997H11747m01853L23417k3361K7092k64362N6293o6650O7478m7519N00L43713
10986H26495J31321p0108k7737j56650M20700j4716j72826N20283R2616j68611
10976A380767K33957L54443L03318j5916L34289Q0321J3346J07279l17639j99035
10966B275130l368m66250m0276M5739K3595l35730L9706j76724K9473M48677r1951
10955A748021j73007j58018j58949l02129n6204L51401l17452j99865J18362l61201
$$ y = [571046, 867935, 517040, 940637, 544555, 692703, 887353, 868688, 463497, 616798, 1033209, 942800, 581612, 347700, 604924, 795115, 885569, 758760, 514376, 853484, 630044, 342951, 719568, 617953, 774646, 442986, 673352, 645810, 475178, 670221, 811747, 409894, 733311, 709950, 737042, 472680, 528973, 462323, 529801, 482282, 482782, 826495, 957816, 887708, 859971, 703321, 1124021, 1109305, 936479, 1456762, 1549378, 1380767, 1614724, 1969167, 2272485, 2256569, 2590858, 2671179, 2684525, 2791804, 2474165, 2275130, 2271762, 1805512, 1765236, 1810975, 1834570, 1498840, 1538546, 1361822, 1391295, 1839972, 1748021, 1575014, 1416996, 1258047, 955918, 899714, 1251115, 933663, 733798, 852160, 490959]
10945D90959j05119l0319k496p5397A27713L33346A82319D2151J59375n1708h8304
10933C95410b53355C0422c25693b5534H4878d9706B7828K65048I2956b0793A25360
10921a6140C4908f6683q8399P5512G2951a97702k0596A51784a51527B10100b23732
10909a44562m9311g157p9607k37468a9741k04946B252g313A05673e8205r8854
10898a57059M9967k1541r333C651L7275J58074a96848E3809B2588a87400e0829
10886c00953f3682b7157P022o080A54678a46482f071B4409d27479A63101j9240
10875A43861P6426F3030K66391D2779L25594B6492L16547j17050a28316q8213
10865b16529A34223J9994b5681q4749K4655A2211c15615G5831b5194A83337a40806
$$ y = [490959, 385840, 355521, 353025, 277628, 127713, 461059, 182319, 42151, 201526, 149818, -88304, 395410, -253355, 30422, -325693, -25534, 84878, -49706, 27828, 292876, 92956, -20793, 125360, -16140, 34908, -66683, -155082, -79570, 72951, -197702, -218298, 151784, -151527, 210100, -223732, -144562, -193873, -7157, -86764, -324232, -19741, -224687, 2252, -7313, 105673, -58205, -157059, -107092, -128633, -137966, 3651, 40926, 199000, -196848, 53809, 22588, -187400, -50829, -300953, -63682, -27157, -20135, -26215, 154678, -146482, -6071, 24409, -427479, 163101, 143861, 220287, 63030, 329421, 42779, 368373, 26492, 343039, 225989, -128316, -216529, 134223, 154217, -25681, -110430, -85775, 12211, -315615, 75831, -25194, 183337, -140806]
10853a10265B66561a03814E9656J94195b75157p3127B0935Q0134a0660j93138
10843b03798c3000l8329B68091O2600b47686g9419A60988J37252d68347E23162
10832a76397B66422a61185A46381c26346N9763A4527a92958K3372j7002F3706
10821b30715b3107E9259m72c05187B43363a7056j37234j5243c6911m4450l6365
10810a17726A57961m7442g0804a2973B26314p8249g3062l3309Q360a7437A5793
10798c32855O4194E22221B8014K01134a79530g792A36436C7561b9894B16036a04703
10786B33663b38261c8119E8737A6773d68536a8293j38493j35043A60745E8553
10775a77047j2570j07143C15338A30646e7234j32745q0821C22831g3693j65989
$$ y = [-110265, 266561, -103814, 59656, 253851, -275157, -348284, 20935, 101069, -10660, -203798, -33000, -71329, 268091, 330691, -247686, -79419, 160988, 298240, -468347, 523162, -176397, 266422, -161185, 146381, -326346, -266583, 14527, -192958, -169586, -186588, 63706, -230715, -23107, 59259, 58787, -305187, 243363, -17056, -154290, -169533, -36911, -81361, -117726, 157961, 110519, -70804, -12973, 226314, 148065, -73062, -106371, -98011, -17437, 15793, -332855, -268661, 522221, 28014, 229148, -179530, -7792, 136436, 37561, -29894, 216036, -104703, 233663, -238261, -38119, 58737, 16773, -468536, -18293, -156786, -291829, 160745, 58553, -177047, -189617, -296760, 315338, 130646, -57234, -189979, -270800, 322831, -73693, -239682]
10765b39682l19159g2905k8392j05845h9573J0753c3669C9881a54262B16713F379
10753G5716J61487b53982C45658j43176b04104a9513n6106C85557r0810c63878
10742A39064c34971b9907j35813q6275A4456J2900i0787A99783F7187a76936D35156
10730e5175k13314A83647p8236f6347A28196a03009C8320b78520i1217q2109L7683
10719a35643k64676J99193C2084d38205A8651J12124g772C8550R7994D3688g8085
10707b41963E2963g3458A144O3340N3798N6059a56125P7658A77701m0011a94808
10695b62594f6460j89467K1631M5284c9869A31850b10945C6738a02833A58565
10684d432A73325O6840b04689A41423g9993L0083B2254i8789E870a3468I9876
$$ y = [-239682, -558841, -72905, -101297, -207142, -89573, -78820, -33669, 39881, -154262, 216713, 6379, 75716, 237203, -253982, 345658, 202482, -204104, -19513, -75619, 385557, 294747, -363878, 139064, -334971, -29907, -165720, -251995, 14456, 27356, -90787, 199783, 67187, -176936, 435156, -55175, -268489, 183647, 105411, -66347, 128196, -103009, 38320, -278520, -91217, -173326, -135643, -400319, -201126, 32084, -438205, 18651, 130775, -7772, 38550, 136544, 43688, -78085, -241963, 52963, -73458, 1144, 64484, 118282, 174341, -156125, -78467, 177701, 137690, -194808, -262594, -66460, -255927, -234296, -189012, -39869, 131850, -210945, 36738, -102833, 158565, -4432, 173325, 240165, -204689, 141423, -79993, -49910, 22254, -98789, 5870, -13468, 99876]
10672f2836j40896J5688A58148J45093G6544c49621h3610l6039j07707B32093
10661a02953L6823K6231j72524B05923g1480r1837A53167K35443D0800a89773
10650i3557c259C7572r266a99224N5637D7784h6496F0329E895a53699k4526L7514
10638a40711B91181a893j02009A14448b50788K4022o7505E7639c26883a47073
10627i5550p636j72076A85399m2376n320c0832n4957o3419L6363h656j83950G3377
10614B14789i417j67256A36601E7159l958a89913l89834b05249A55415d5425l6651
10603h2076C29562e8477A13642i6872B89520I361c8653a5641k88630E5615J47151
10592B02766b0338D4725a89029a7780I2853b03624E7028a11953B36825A06617
$$ y = [-62836, -203732, -188044, 158148, 303241, 76544, -349621, -83610, -119649, -227356, 232093, -102953, -66130, -39899, -212423, 205923, -71480, -163317, 153167, 388610, 40800, -189773, -93557, -3259, 37572, 28306, -199224, -143587, 47784, -86496, 60329, 5895, -153699, -178225, -140711, 291181, -1893, -103902, 114448, -250788, -226766, -294271, 57639, -326883, -147073, -95550, -103186, -275262, 185399, 143023, 137703, -30832, -85789, -149208, -112845, -8656, -192606, 73377, 214789, -9417, -176673, 136601, 57159, 53201, -189913, -579747, -205249, 155415, -45425, -82076, 329562, -58477, 113642, -96872, 289520, 9361, -38653, -15641, -304271, 55615, 202766, -20338, 44725, -189029, -17780, 92853, -203624, 57028, -111953, 236825, 106617]
10581D5496f2106A8883a76962A19277d19842H6216a73790M6923b9042k2043j19135
10570a70220k49382g0257L3847a6216j66297h7034F990f4509L0387n2203q000
10559i4325H6519k517L33802d59226K1766e9647A95572b60868h2125l15649g7709
10547a1060p4092j79870d8535l76556d9413D32886e6550j01976L6214B64218I4156
10535a9650A2682N0509a22112B46577a88539B38993b00949k17915E4530K59361
10525C13891f5944A37144a64343j14048K0228c3393o8183k08153Q4847P9230G7730
10513a12873e3030A14231J00361a0451B85849g2469b8371D883L36684E3633a68094
10501h7065j80097J390h7232A08925J74392A8409a08598j2989K6796g907j05216
$$ y = [45496, -62106, 18883, -176962, 119277, -419842, 86216, -173790, -126867, -29042, -51085, -170220, -419602, -70257, -36410, -16216, -182513, -87034, 6990, -64509, -34122, -86325, -94325, 86519, 84002, 417804, -459226, -437460, -59647, 195572, -260868, -82125, -397774, -77709, -11060, -85152, -265022, -48535, -425091, -49413, 432886, -56550, -158526, -122312, 264218, 94156, -19650, 12682, 63191, -122112, 246577, -188539, 238993, -200949, -418864, 54530, 313891, -65944, 137144, -164343, -278391, -258163, -33393, -101576, -309729, -224882, -145652, 77730, -112873, -53030, 114231, 214592, -10451, 285849, -72469, -28371, 4883, 341567, 53633, -168094, -87065, -267162, -265772, -87232, 108925, 283317, 18409, -108598, -121587, -94791, -7907, -113123]
10490a13123C3340B437a12770A18852b8073B40743a55211H9507J78674n2745N5941
10479B71377P7292L1280E8338M23725D7325K11383H706c78408A00461m8323b77
10467g3846G8316K978B781J8337K27208m5813e4062B08586A03098m9949a72223
10455b15770a4630o7017k36632J54583B2617K6941f4151j34023E274J20062c2179
10443D3484K64840b53085B70041D3708J94277a60666d3056p821r1866E6941b78861
10431C884a50467B08832l4028f1084B73089a75456c2254r7761K3884f207A04107
10419A61547a1135C1223a49132j36523f4666I0845a19010l4628D6142b68881M783
10408b64098J6039C9567J43122f551C1567J48161o1867L5685a7053D2322a78544
$$ y = [-113123, 33340, 2437, -112770, 118852, -28073, 240743, -155211, 89507, 268181, 215436, 271377, 348669, 379949, 58338, 482063, 47325, 258708, 8706, -378408, 100461, 52138, -277, -73846, 78316, 81294, 2781, 21118, 248326, 202513, -54062, 208586, 103098, 53149, -172223, -215770, -14630, -81647, -318279, -163696, 22617, 49558, -64151, -198174, 5274, 125336, -32179, 43484, 308324, -253085, 270041, 43708, 237985, -160666, -43056, -50877, -142743, 56941, -278861, 3884, -150467, 208832, 174804, -61084, 273089, -175456, -32254, -130015, -106131, -6207, 104107, 161547, -11135, 31223, -149132, -285655, -64666, 90845, -119010, -153638, 46142, -268881, -264098, -248059, 39567, 182689, -6551, 31567, 179728, 117861, 153546, -17053, 42322, -178544]
10396a14113I9736K07086H2350m0722J1855L28980a57306G8088a13869A47784
10385d5887j52059A80176b87453A08217J24191b17228g5655B07034F4815d221
10374g4095C30378j01996J90354j7149j17324j18702J49531K60989j63451L2661
10364D45291A75521J8506p0702J51246K41804A68992m5466J28919J60823l0766
10354C82502A19513N3015J57235J00112J27570k53195r825K65696j06164j971
10344D51986j74519R1257J68934A58025k3373N8292J43938J64149k28692l63A05542
10332A15842n1370P5084c07637c8304J8723A52440b20304C36016N324j0908a71880
10320A07635L61789I4382N9815c1719A02990b38605A69431P2059a15681A780J38927
$$ y = [-114113, 99736, 306822, 82350, 41628, 53483, 382463, -157306, 78088, -113869, 147784, -45887, -197946, 180176, -287453, 108217, 232408, -217228, -75655, 207034, 64815, -4221, -74095, 330378, 228382, 418736, 401587, 284263, 165561, 315092, 576081, 412630, 445291, 175521, 194027, 123325, 274571, 516375, 168992, 123526, 252445, 413268, 382502, 119513, 172528, 329763, 429875, 557445, 304250, 294425, 560121, 453957, 451986, 277467, 368724, 537658, 158025, 134652, 192944, 336882, 501031, 272339, 271976, 105542, 115842, 64472, 139556, -307637, -38304, -19581, 152440, -220304, 336016, 341340, 330432, -171880, 107635, 469424, 94382, 154197, -31719, 102990, -238605, 169431, 241490, -115681, 1780, 140707]
10309A40707J49611I6893c4096j02922A3284a26943d5698A23035K794n1063g1847
10297F7719j1538a41019j33826A4151J67120B960a45773j20402a2732k68681A70509
10285a06502j44225J4083A3452a39654A92930b18548O2104A76419D5003b74989
10274a24357N3482F1285J62230e274C49424j37324a21908k59832A22773K30586
10264C53359d4386A24782a8710A83145c3217A25990C3055M42911D1241K60047
10254C01288A07368K50949m9585c0494o9060A46827a3503q3376j48355l2389H5821
10242h1461G5620N5870C4634J04718b25413d0908k67599J8227b9248A3014i4091
10230c0324A40954a33238B06132l9376B6467d95j25848a0914j49409g3146B00389
$$ y = [140707, 290318, 96893, -34096, -137018, 13284, -126943, -45698, 123035, 125829, 74766, -71847, 67719, 56181, -141019, -274845, 14151, 181271, 2960, -145773, -266175, -12732, -281413, 170509, -106502, -250727, -236644, 13452, -139654, 192930, -218548, -156444, 176419, 45003, -274989, -124357, -70875, 61285, 223515, -5274, 349424, 212100, -121908, -381740, 122773, 353359, -44386, 124782, -18710, 183145, -33217, 125990, 33055, 475966, 41241, 301288, 107368, 358317, 308732, -30494, -99554, 146827, -13503, -96879, -245234, -277623, 85821, -81461, 75620, 131490, 34634, 139352, -225413, -40908, -308507, -290280, -29248, 13014, -94091, -30324, 140954, -133238, 206132, 166756, 26467, -495, -126343, -10914, -160323, -73146, 200389]
10218a53333H335L16120q6185b35816L77h764j97122j77494a64517q041m5332
10207b17890H5447j7849Q1220c60192B67145d2023n1683A60871a02689j10009
10197b12698N0791n0294p1166B16361a27522B9304b42688A77519h2069j33645
10187b15714G7061c48500A41526G0476a68474C2415a10898k06983I4402J37708
10177B32110d4662j4228j26768C32118e53052H3435h5755o506j51863m998A2247
10165g0563A47864n8901i1064J4780k16373J17854j7502h5363j1723k15005a35574
10153a30403B12773b3115k35413B16302a79455B27032C7946a37803K3577k393
10143a16619b5220A55196b19914f7387a93A63862b28834j33411f9317j20258a574
$$ y = [-153333, 8335, 324455, 238270, -235816, -235439, -8764, -205886, -383380, -164517, -172558, -217890, 85447, 67598, 148818, -360192, 267145, -42023, -93706, 160871, -102689, -212698, -161907, -212201, -283367, 216361, -127522, 29304, -242688, 177519, -82069, -215714, 77061, -348500, 141526, 70476, -168474, 32415, -110898, -317881, 94402, 232110, -44662, -58890, -185658, 332118, -553052, 83435, -85755, -92261, -244124, -249122, 12247, -70563, 147864, 88963, -91064, -76284, -292657, -174803, -192305, -85363, -97086, -312091, -135574, -130403, 212773, -23115, -258528, 216302, -179455, 227032, 37946, -137803, -114226, -116619, -25220, 155196, -219914, -67387, -193, 163862, -228834, -362245, -69317, -189575, -1574]
10131a90728A38446f04831G9508L02939B8772b96705j7138A31282J07340i6396
10120A919c3001r0710A92831d23122a26540j86009D5269g3915k9398m3835m3218
10109a90366l6249D9689a8369j31307n9755l3474a10757A10424a88541A9800c88300
10097a28185j17125A4533a51505B5387J91950J69451A07137C7811A3052a61132
10086a2154I1042a00435a4141A09004f9932q0681G5524O6530n2013a16662M3296
10075g3366A21648b33862B02196b14939J04419a5212A13699J44414a83939O4141
10065a19798C1640i0503A52424A4290J56193a99164A27345c62036J69576L2426
10055a60034e7862E4866J44779b0043A83929i2724p9057l8072L4442g5991a2265
$$ y = [-190728, 138446, -604831, 79508, 382447, 28772, -296705, -313843, 131282, 238622, -96396, 1919, -33001, -123711, 192831, -423122, -126540, -312549, 45269, -73915, -103313, -147148, -190366, -226615, 49689, -18369, -149676, -209431, -242905, -110757, 110424, -188541, 19800, -388300, -128185, -245310, 14533, -151505, 25387, 217337, 386788, 107137, 37811, 13052, -161132, -12154, 91042, -100435, -14141, 109004, -69932, -150613, 75524, 142054, 90041, -116662, -73366, 121648, -233862, 202196, -214939, -110520, -15212, 113699, 258113, -183939, -119798, 31640, -90503, 152424, 14290, 170483, -199164, 127345, -362036, -192460, -160034, -57862, 54866, 199645, -20043, 183929, -92724, -171781, -209853, -175411, -75991, -12265]
10043G4424J122B1638J12995c32496K9750N8741a15151G654c16533O7624i1571
10031a33488A67935c16249C5977a84212C12385d2401j62810i2861A10771N2772
10021A63543E1477O8606k4317a99817h3717P466A90190p8632C2749J36898b89760
10009a60730A01830J11216B0055a47625B22497a93930D9654l858L6943a73264
9998c17078j02173J97874j67559A30596n0685e4408n90K5177B19954g1688k71634
9987c43322A98690I1976b5152q4670O794j40760j21523a42852M8264B2010J23951
9976A45961h3219A11318a59399d7226m0407E81b42611B32412a84312e0446j04921
9965a55367f0554m5992d7830B36232b10248A41278d21823a12265K9776k38556
$$ y = [74424, 75546, 21638, 134633, -332496, -302746, -244005, -115151, 7654, -316533, -248909, -91571, -133488, 167935, -316249, 35977, -184212, 312385, -42401, -205211, -92861, 110771, 163543, 51477, 120083, 95766, -199817, -83717, -76251, 190190, 111558, 32749, 169647, -289760, -160730, 101830, 213046, 20055, -147625, 222497, -193930, 49654, 45796, 82739, -173264, -317078, -419251, -221377, -388936, 130596, 79911, -54408, -54998, -29821, 219954, -71688, -343322, 198690, 91976, -25152, -109822, -103028, -243788, -365311, -142852, -94588, 22010, 145961, -83219, 111318, -159399, -47226, -87633, 581, -242611, 232412, -184312, -50446, -155367, -60554, -106546, -47830, 236232, -210248, 141278, -421823, -112265, -82489, -321045]
9955c21045c1946A13444a26109H5859A4107K18421m3384a47714c6200B67252a5464
9943C09788i502j17529A54508b80438O5531F4746O3204A2825a19145P140k36874
9932c48879a54410k03946c8262J5902m26309D3914h6635A57963o0397f3609k00387
9921b63996L7884K5599C1715f5277j21047d3808J6G5199e454k597j91616j13447
9909c13114A8632J65427h7398q5039A90506c86107F5786b35307N5898A09467a90961
9897b81331b0919Q043D9484L51584D7083a30490N1973k31021c3766J5056m102
9886b2812o5110j23517g5888L189q1133A83216d50B4773b71228j14719a54151
9874c6918m82680C7580h1888A16807B9073a22529a1161I8521d84430g9854j22667
$$ y = [-321045, -31946, 113444, -126109, 85859, 14107, 232528, 189144, -147714, -36200, 267252, -15464, 309788, -9502, -127031, 154508, -280438, -214907, 64746, 127950, 12825, -119145, -112005, -348879, -154410, -358356, -38262, -22360, -448669, 43914, -86635, 157963, 97566, -63609, -263996, -226112, -200513, 31715, -65277, -186324, -43808, -43792, 75199, -5454, -8051, -199667, -313114, 18632, 184059, -87398, -172437, 190506, -386107, 65786, -235307, -179409, 109467, -190961, -281331, -20919, -12876, 49484, 401068, 47083, -130490, -78517, -309538, -33766, -18710, -22812, -87922, -211439, -75888, -72699, -153832, 183216, -450, 24773, -271228, -385947, -154151, -36918, -519598, 37580, -81888, 116807, 29073, -122529, -11161, 98521, -484430, -79854, -202521]
9863b02521j2506j6418q4715J29806l9841L5037h6211I890c71543g8799D1159
9851b28619J3899A05993b55204B51491b0363B8836N4427j3352f3658C5639i0564
9839b9806l22578F5188d7964C67158a51117k36311j58775b9589B93992c24235
9828e2939n2710M8716j25431D35235c0568j34821c8265J2302E8267M8916J24789
9817B31972a83852p2444A00075i6070j47409c4326F725a4786k71825G3365J25191
9806A98556e1915k52337Q0649J02613A66916J02628a70625B7070b5683C10971
9795b02025K4732B72861a74991p5358L8255A65465P1100a01087l30596A28987
9784f7851D20482j87873g2454B64468b9985A71728b04742L0608D2908b53901J07778
$$ y = [-202521, -215027, -231445, -316160, -186354, -226195, -191158, -86211, 9890, -371543, -78799, 41159, -228619, -214720, 105993, -255204, 251491, -20363, 28836, 83263, 69911, -63658, 35639, -90564, -29806, -352384, 65188, -47964, 367158, -151117, -387428, -546203, -29589, 293992, -324235, -52939, -105649, -56933, -182364, 435235, -30568, -165389, -38265, -25963, 58267, 107183, 231972, -183852, -256296, 100075, -96070, -243479, -34326, 6725, -14786, -286611, 73365, 198556, -51915, -304252, -223603, -120990, 166916, 269544, -170625, 27070, -25683, 310971, -202025, -177293, 272861, -174991, -250349, -212094, 165465, 236565, -101087, -431683, 128987, -67851, 420482, 232609, -72454, 264468, -29985, 171728, -204742, -174134, 42908, -253901, -146123]
9773a46123B9160N2765c4833a7190j17202p315O4830b1725B21113c23131l6471
9762c59602K593Q2528a06076l46616h1787F1426b84836A1784b4809A11413b96780
9750g0926m0938H487i3715I1086J75777m2843E6238f3282l1959M2250G7377a15719
9737a18671j49348l4088A9709a17201n4528A69720h1201H5274e5936A12874b76732
9725A64339N8938g0598C45368e9002n6434N4808l7007A03578A5054R8563n5426
9714E8191d5012j47950A4240a23987A93036a21275B57955j14932c73732m4962
9704d18694B5987a3655j98114j60873A95541b26396i0287I8823b25422B22899
9693a01956k08133Q1656j3155o1531j91354D4917e4592A45465a66929O9950B11150
$$ y = [-146123, 29160, 81925, -34833, -17190, -134392, -141707, -76877, -21725, 221113, -323131, -359602, -357009, -274481, -106076, -452692, -81787, 61426, -284836, 11784, -24809, 111413, -296780, -70926, -111864, 8487, -93715, 91086, 266863, 224020, 56238, -63282, -95241, -52991, 77377, -115719, -118671, -268019, -302107, 19709, -117201, -171729, 169720, -81201, 85274, -55936, 112874, -276732, 164339, 223277, -70598, 345368, -59002, -115436, -60628, -97635, 103578, 15054, 113617, 58191, -45012, -192962, 14240, -123987, 193036, -121275, 257955, 143023, -373732, -418694, 25987, -13655, -211769, -372642, 195541, -226396, -90287, 98823, -225422, 222899, -101956, -310089, -228433, -241588, -303119, -494473, 44917, -54592, 145465, -166929, -96979, 211150]
9681f1346r9672f4356m09234J97510I7491d991q3811P77j11464c1471r3935J9340
9669a06066n5555n6737A39750D8170N9716h6468A50665L9571a5125k30883e1608
9657b04915B07972D8901d14769j14649B5712J6426a06256B62166m3461h7191q2430
9646a69621r5148L8755F7841a76190j43993J59405P6960C40377c316l00855e6476
9634b3700l0857j65989i6150l1907F5584c48320B82047a71322C59886d5734B11237
9622b22793K7878i4134p3595Q0294q3282r3066f7569A62705B0278b52884O4364
9611a88520A88793c1110k71432E7446A1805a82903N0038k5365G4824K01020a35818
9599a29580L2040k12858n8971R8348D7839O3991a07253B80196b44870A01971i252
$$ y = [-61346, -161018, -64356, -473590, -276080, 97491, -4991, -88802, -88025, -199489, -31471, -125406, -106066, -161621, -218358, 139750, 48170, 107886, -86468, 150665, 190236, -15125, -246008, -51608, -204915, 207972, 48901, -414769, -529418, 25712, 42138, -106256, 262166, 218705, -87191, -169621, -264769, -226014, 67841, -176190, -320183, -160778, -83818, 340377, -3316, -304171, -56476, -23700, -54557, -220546, -96150, -128057, 65584, -348320, 282047, -171322, 359886, -45734, 211237, -222793, -194915, -94134, -167729, -87435, -170717, -263783, -67569, 162705, 20278, -252884, -188520, 188793, -31110, -302542, 57446, 11805, -182903, -132865, -158230, 74824, 275844, -135818, -129580, -97540, -310398, -369369, -271021, 47839, 111830, -107253, 280196, -244870, 101971, -9252]
9587c73384B47075b35726J15360A15936B0464h2603k66362B29208n9727d07844
9576b45626B69264G1466h231j8682D7527b63419d4066k04067R7475k50753F8361
9564a76373e2239J6047m6536F6444j4908a24670k31986c9623A82793b96887a27056
9552F2503a18330j77096B49658b24866G7069K08210e21661B50636g2331m16801
9542d89132A00209c42766A7196a26157K3040r3654A23520c26803j49567h0807
9531a06437A61467g1359j89542B6254f1630R77a0977p8193q9443a9337A10177
9519a3492o906j13489n2708C18997c4377l17273J39540K4170j24321J21797O4654
9508a25810b3151k89195J39996H6845c71998D5280a71104O8196B04275j4498c60836
$$ y = [-373384, 247075, -235726, -120366, 115936, 20464, -82603, -348965, 229208, 169481, -407844, -245626, 269264, 71466, -8231, -26913, 47527, -263419, -44066, -248133, -150658, -401411, 68361, -176373, -52239, -36192, -82728, 66444, 51536, -124670, -356656, -39623, 182793, -296887, -127056, 62503, -118330, -295426, 249658, -224866, 77069, 285279, -521661, 250636, -72331, -489132, 100209, -342766, 17196, -126157, -103117, -196771, 123520, -326803, -476370, -80807, -106437, 161467, -71359, -260901, 26254, -61630, -60653, -10977, -89170, -178613, -19337, 110177, -13492, -20398, -133887, -186595, 318997, -34377, -351650, -212110, -187940, -312261, -190464, -125810, -23151, -312346, -172350, 86845, -371998, 45280, -171104, -102908, 204275, 189777, -360836]
9496a18425a0704B43618b00432A160K65188a15078A37189c1790A0042a60601J8148
9485a42453c1668B3588a70762j6207g1772G2962g1772B60054a75538N9476D6676
9473a73284D6516a83865A20589b13931e2422j20358A94456F3590e8399q4272F342
9461B78448A20460c77018D4226d21651a74480E347c3820m50840b11698J4949C1258
9449a13343J8158j41070h6895a7814A5091g3635B16281H7478c9852j04778O3820
9438h0810r3992f2281O156r3630A9083c9231m3257J9007j84266L0875e1678A75188
9425a5088i60B11091c1247A30920e5756E4694A075c0471m2345j73658c2603o2779
9413i5382b0955G027b05559j44097C0465K12899H1322h5185F7435f0744o6120
$$ y = [-118425, -10704, 243618, -200432, 1160, 266348, -115078, 137189, -31790, 10042, -160601, -142453, -31668, 23588, -170762, -186969, -71772, 72962, -71772, 260054, -175538, -116062, 46676, -173284, 46516, -183865, 120589, -213931, -52422, -172780, 194456, 63590, -58399, -142671, 6342, 278448, 120460, -377018, 44226, -421651, -174480, 5347, -33820, -484660, -211698, -196749, 31258, -113343, -95185, -236255, -86895, -17814, 15091, -73635, 216281, 87478, -39852, -144630, -80810, -174802, -62281, -56125, -149755, 19083, -39231, -82488, -63481, -247747, -216872, -51678, 175188, -15088, -960, 211091, -31247, 130920, -55756, 54694, 1075, -30471, -72816, -246474, -32603, -95382, -20955, 7027, -205559, -349656, 30465, 243364, 81322, -85185, 67435, -60744, -126864]
9402a26864B3304a62943q0589J6867p9205R7499j6730A7079a75340r9081F073
9390D8875a80409D21544i5156A53228a42421j22492C51901F097c57119P6854H737
9378b14108D5767a20463D5426a76173o5049n776f3784A56453N1862a19216I0411
9366b20422M2481A08946a00704c9057a313j27084I4064b66977B07846J17836a41099
9354B17451c1258B17924P0779D0802a12162A85297b98356A281O1535k9058b90367
9342c00113Q8489a01413p1542h1712F6158b42850c9059m4762n9807a598q3825
9331h5423d0269A62416f4143l2608j27203N5709N9531J3022C8317J07982o2391
9320H3908a1654k89527F3348b07506r0138A87129G1710b04813A04606C723J04360
$$ y = [-126864, 23304, -162943, -243532, -226665, -305870, -208371, -225101, 17079, -175340, -274421, 6073, 48875, -180409, 421544, -95156, 153228, -142421, -264913, 351901, 6097, -357119, -280265, 8737, -214108, 45767, -120463, 45426, -176173, -241222, -246998, -63784, 156453, 208315, -119216, 90411, -220422, -177941, 108946, -100704, -39057, -1313, -128397, 94064, -266977, 207846, 325682, -141099, 217451, -31258, 217924, 288703, 40802, -112162, 185297, -298356, 1281, 62816, 33758, -290367, -300113, -211624, -101413, -172955, -81712, 66158, -242850, -39059, -83821, -143628, -1598, -85423, -40269, 162416, -64143, -96751, -223954, -168245, -108714, -95692, 38317, 146299, 83908, -11654, -301181, 63348, -207506, -297644, 187129, 71710, -204813, 104606, 3723, 108083]
9309A08083a57818A85394a2886q685k09959C84494j36658h5717l07801i8707C15839
9297b82641e2415h502D9004b77991E1132h98A66975J09923E8194c70853H9200
9285a05093L8662n6456A81487e5310C69768a72645r7963B63790a47471G5513B1149
9273a12212j36767k5729A67878F4581c7134l8421G9605b91390g9010j87628b4333
9261g3765E1906c36926P8072K1714A03263L9228a56814j87186C0579a69937q8940
9250b58877C8465J64971p2426a03952H2003f4678D43239g3806l77876J33306b0965
9238b83628A8395c26121a4731k00496B03924A1017d0440o0224k25215J37430d853
9226A25310a55625a0925p921E5812K71978a57874C4742A7066a79449j0699c1494
$$ y = [108083, -157818, 185394, -12886, -21571, -231530, 384494, 247836, -85717, -393518, -98707, 315839, -282641, -52415, -8502, 49004, -277991, 51132, -898, 166975, 276898, 58194, -370853, 89200, -105093, -66431, -122887, 181487, -55310, 369768, -172645, -270608, 263790, -147471, 75513, 21149, -112212, -248979, -274708, 167878, 64581, -37134, -75555, 79605, -291390, -79010, -266638, -24333, -73765, 51906, -336926, -258854, -237140, 103263, 142491, -156814, -344000, 30579, -169937, -258877, 38465, 203436, 131010, -103952, 82003, -64678, 443239, -73806, -451682, -318376, -20965, -283628, 18395, -326121, -14731, -215227, 203924, 11017, -40440, -100664, -325879, -188449, -4853, 125310, -155625, -10925, -18846, 55812, 327790, -157874, 34742, 17066, -179449, -190148, -31494]
9214a68966D9938a87485k32064c4579r0232p1608e869B46850n2825j7228g846
9202D29815a43887j06121a4883A4110J39002c62427A42249o6322J42888b5886
9191b73612m7839A58930b63036A06975b21733n06j22293a19494B2824d19298a9658
9179c6280l0543j63749A75705b264r6079K4419A50568l3402a46144r7274E6865
9167B02771i4140H1993c11226e3542j79272a15554I9605a95032G6819a24973d3103
9155a01835A72649f8247A5697J55649a9236B0999N547h829m24719c3666A79391
9143F5880d28005f9967m4474o4639A05801K43453B1833a26114A03265D0432J24354
9132A64786R4545P1090a71324c2049k91084e5313k66491D038c6664A70286a89562
$$ y = [-168966, 49938, -187485, -419549, -34579, -124811, -196419, -5869, 246850, 194025, 176797, -7846, 429815, -143887, -250008, -14883, 14110, 153112, -362427, 142249, 75927, 218815, -25886, -273612, -321451, 158930, -263036, 106975, -221733, -222239, -344532, -119494, 22824, -419298, -19658, -36280, -66823, -230572, 175705, -2264, -98343, -73924, 150568, 117166, -146144, -243418, 56865, 202771, -94140, 81993, -311226, -53542, -232814, -115554, 99605, -195032, 76819, -124973, -43103, -101835, 172649, -68247, 15697, 171346, -19236, 20999, 26546, -8829, -433548, -33666, 179391, 65880, -428005, -69967, -114441, -179080, 105801, 349254, 21833, -126114, 103265, 40432, 164786, 259331, 330421, -171324, -32049, -323133, -55313, -321804, 4038, -36664, 170286, -189562]
9120a30490K6361j69849d5086j03095f0802j02130F8136J8230h594A41611h4284
9108I6738b36512A7822a48031e1486r8111r6935K4922j20131J43593R4306p7822
9097a81664K0854M1863D8818c29463B5331e6307A93811A3852b30850m6782a36411
9085A18415c63048P5637d9170n0756M942d4436k40914J24236D2419a56145C24740
9073D7018J06019A6121R8443a36630O5185n5873k06702J16559b3647A44272a90095
9061a37205B44639A04021g9348B93783H7475m1758b56559J18562A69779C6980
9050a83749e2445k84832G7120a13314J7851k71296D0272a61229A2184a32669A32852
9038A28375l6568B1937c89950C4845J62949c5726k8901j34152c421E5739a44866
$$ y = [-130490, -104129, -273978, -45086, -148181, -60802, -162932, 68136, 86366, -8594, 141611, -84284, 96738, -236512, 17822, -148031, -51486, -149597, -246532, -221610, -341741, -198148, -103842, -181664, -160810, -118947, 48818, -329463, 25331, -56307, 193811, 13852, -230850, -277632, -136411, 118415, -363048, -287411, -49170, -99926, -94984, -44436, -285350, -161114, 42419, -156145, 324740, 47018, 153037, 16121, 114564, -136630, -71445, -127318, -334020, -217461, -23647, 144272, -190095, -137205, 244639, 104021, -79348, 293783, 87475, 45717, -256559, -137997, 169779, 36980, -183749, -52445, -337277, 77120, -113314, -95463, -366759, 40272, -161229, 12184, -132669, 132852, 128375, 91807, 21937, -389950, 34845, 197794, -35726, -64627, -198779, -3421, 55739, -144866]
9026b78530L0056F6626d2737j1971j26014A9895a67547a7970r3593j13214m7929
9015b72706g9461k51906J64096J4442B58926r9714b31601A813i7740k25761a25814
9003C0548K67012j29883D9707K08705j01252J49336r1685i784l98616g722q9100
8992i6822A4937b02666B14975n1906b23799f8184A39526m6924c29697I4841b24537
8980I1034a04476B34487c23738D22960A04661a14125j90089I3036b15473c0448
8969a56283B5389a12696A28733a918l24890R3304n0462J05975A6351J20257M1859
8958A78467d6510B4756J54109E6099d143m8976p3376D699b28891c6831D0945b3363
8945C67134a28131p2209A6526J37312a63335D79873b15572d6736l9565K6386C81474
$$ y = [-278530, -248474, 66626, -42737, -54708, -180722, 19895, -167547, -17970, -111563, -224777, -272706, -79461, -331367, -167271, -152829, 258926, 159212, -231601, 1813, -97740, -323501, -125814, 30548, 297560, 167677, 49707, 258412, 157160, 306496, 214811, -9784, -408400, -7722, -96822, 14937, -202666, 214975, 163069, -223799, -68184, 139526, 92602, -329697, 94841, -224537, 91034, -104476, 234487, -323738, 422960, 104661, -114125, -304214, 93036, -215473, -30448, -156283, 25389, -112696, 128733, -1918, -326808, -233504, -283966, -177991, 16351, 136608, 178467, -46510, 24756, 178865, 56099, -4143, -53119, -126495, 4699, -228891, -36831, 40945, -23363, 367134, -128131, -200340, 16526, 153838, -163335, 479873, -215572, -46736, -86301, -59915, 381474]
8933D09295i9357d1624j92936A61635b5652C59315a35194A90856P03407J89258
8923A083521J016086N369574J1074785G838888A885294F16667B91023J49503B00498
8913c3675j23272j10188J01009g8950j08820A02802K11786r5834m7533B0743d0717
8901a41932j13860B23275e7862A91834g9697o3023C608K77056e9473B9662b43548
8889c20121q470B7405b8568j08649A75885D6958K13430A2684b6371B78238j26817
8878A51421C3090e2874j5844L0746F4897b64271E3532f0964k30744a18527c6598
8866a48405f5299j4354B72923J131E744a08453H9005Q730C3915a62426l27409
$$ y = [409295, -99357, -41624, -234560, 161635, -25652, 359315, -135194, 190856, 894263, 1083521, 2099607, 7469181, 18543966, 7838888, 1885294, 616667, 291023, 440526, 200498, -33675, -156947, -267135, -166126, -78950, -187770, 102802, 314588, 218754, 171221, 20743, -40717, -141932, -255792, 223275, -57862, 191834, -79697, -142720, 3608, 280664, -59473, 29662, -243548, -320121, -328591, 27405, -28568, -137217, 175885, 46958, 260388, 12684, -26371, 278238, 151421, 33090, -52874, -68718, -37972, 64897, -264271, 53532, -60964, -291708, -118527, -36598, -148405, -65299, -79653, 272923, 274054, 5744, -108453, 89005, 97735, 33915, -162426, -489835]
$$ [...]
##END NTUPLES=NMR SPECTRUM
##END=
