
##TITLE=UV1271_M13_1250-1169_10_7414421_m5Ir4aHx2Y
##JCAMPDX= 6.0         $$ Bruker NMR JCAMP-DX V2.0
##DATA TYPE= NMR SPECTRUM
##DATA CLASS= NTUPLES
##ORIGIN= BRUKER
##OWNER= Administrator
$$ 1.72 TOPSPIN		Version 2.1
$$ 2013-01-25 23:55:47.509 -0500  Administrator@X
$$ Compression mode = diff/dup
##.OBSERVE FREQUENCY= 400.02188249412
##.OBSERVE NUCLEUS= ^1H
##.ACQUISITION MODE= SIMULTANEOUS (DQD)
##.ACQUISITION SCHEME= undefined
##.AVERAGES= 64
##.DIGITISER RES= 22
##SPECTROMETER/DATA SYSTEM= spect
##.PULSE SEQUENCE= noesygpps1d.comp
##.SOLVENT NAME= COFFEE_meoh
##.SHIFT REFERENCE= INTERNAL, COFFEE_meoh, 1, 14.96126
##AUDIT TRAIL= $$ (NUMBER, WHEN, WHO, WHERE, PROCESS, VERSION, WHAT)
$$ ##TITLE= Audit trail, TOPSPIN		Version 2.1
$$ ##JCAMPDX= 5.01
$$ ##ORIGIN= Bruker BioSpin GmbH
$$ ##OWNER= Administrator
$$ $$ E:\/data/COFFEE/nmr/UV1271_M13_1250-1169_10_7414421_m5Ir4aHx2Y/12/pdata/1/auditp.txt
$$ ##AUDIT TRAIL=  $$ (NUMBER, WHEN, WHO, WHERE, PROCESS, VERSION, WHAT)
(   1,<2013-01-25 23:55:41.805 -0500>,<Administrator>,<X>,<go>,<TOPSPIN 2.1>,
      <created by zg
	started at 2013-01-25 23:44:11.790 -0500,
	POWCHK enabled, PULCHK disabled,
       configuration hash MD5:
       86 BA 57 50 F2 9D 5C 9B 26 00 A9 28 5F 66 2E 89
       data hash MD5: 64K
       A6 39 8B DC C9 2B 2C A2 87 AF F7 B9 E6 67 9F C2>)
(   2,<2013-01-25 23:55:44.821 -0500>,<Administrator>,<X>,<proc1d>,<TOPSPIN 2.1>,
      <Start of raw data processing
       efp LB = 0.3 FT_mod = 6 PKNL = 1 PHC0 = 0 PHC1 = 0 SI = 128K 
       data hash MD5: 128K
       9C 97 29 EA D5 F5 83 DD D1 99 29 30 FE 74 A3 65>)
(   3,<2013-01-25 23:55:45.852 -0500>,<Administrator>,<X>,<proc1d>,<TOPSPIN 2.1>,
      <pk PHC0 = -81.09558 PHC1 = 0 
       data hash MD5: 128K
       47 30 1A 54 D0 A9 2D E8 1F 6A 8F 96 1C A3 B7 0D>)
(   4,<2013-01-25 23:55:46.477 -0500>,<Administrator>,<X>,<proc1d>,<TOPSPIN 2.1>,
      <abs ABSG = 1 
       data hash MD5: 128K
       B1 48 63 DA E2 7E BF CF B3 FD C6 6D D3 6A B2 10>)
(   5,<2013-01-25 23:55:46.649 -0500>,<Administrator>,<X>,<proc1d>,<TOPSPIN 2.1>,
      <abs ABSG = 2 
       data hash MD5: 128K
       3A 03 36 59 BF 31 DC 14 8B 4C 94 B5 0D 96 DF 06>)
(   6,<2013-01-25 23:55:46.837 -0500>,<Administrator>,<X>,<proc1d>,<TOPSPIN 2.1>,
      <abs ABSG = 3 
       data hash MD5: 128K
       E9 97 4C 60 4D 71 A6 1D A7 30 75 03 13 FD 02 01>)
(   7,<2013-01-25 23:55:47.024 -0500>,<Administrator>,<X>,<proc1d>,<TOPSPIN 2.1>,
      <abs ABSG = 4 
       data hash MD5: 128K
       29 19 8A 8E D6 D0 79 68 22 29 B3 86 1B 49 6A 38>)
(   8,<2013-01-25 23:55:47.196 -0500>,<Administrator>,<X>,<proc1d>,<TOPSPIN 2.1>,
      <abs ABSG = 5 
       data hash MD5: 128K
       89 18 F3 31 DF 66 39 C7 99 E3 42 C8 24 8F C6 97>)
$$ ##END=
$$ 
$$ $$ hash MD5
$$ $$ 96 5B 0D C3 57 C8 C0 68 F7 1A A8 EB 7E 0E 44 10
##$RELAX= 
##$RELAX= 
##$RELAX= 
##$RELAX= 
##$RELAX= 
##$RELAX= 
##$RELAX= 
##$RELAX= 
$$ Bruker specific parameters
$$ --------------------------
##$DU= <E:\>
##$EXPNO= 12
$$ [...]
##$TP07= 0
##$TPNAME0= <>
##$TPNAME1= <>
##$TPNAME2= <>
##$TPNAME3= <>
##$TPNAME4= <>
##$TPNAME5= <>
##$TPNAME6= <>
##$TPNAME7= <>
##$TPOAL= (0..7)
0.5 0.5 0.5 0.5 0.5 0.5 0.5 0.5
##$TPOFFS= (0..7)
0 0 0 0 0 0 0 0
##$TUNHIN= 0
##$TUNHOUT= 0
##$TUNXOUT= 0
##$USERA1= <user>
##$USERA2= <user>
##$USERA3= <user>
##$USERA4= <user>
##$USERA5= <user>
##$V9= 5
##$VALIST= <valist>
##$VCLIST= <CCCCCCCCCCCCCCC>
##$VD= 0
##$VDLIST= <DDDDDDDDDDDDDDD>
##$VPLIST= <PPPPPPPPPPPPPPP>
##$VTLIST= <TTTTTTTTTTTTTTT>
##$WBST= 2048
##$WBSW= 25
##$XGAIN= (0..3)
0 0 0 0
##$XL= 0
##$YL= 0
##$YMAX_a= 6325217
##$YMIN_a= -13009585
##$ZGOPTNS= <>
##$ZL1= 120
##$ZL2= 120
##$ZL3= 120
##$ZL4= 120
##$ABSF1= 14.96126
##$ABSF2= -5.596922
##$ABSG= 5
##$ABSL= 3
##$ALPHA= 0
##$AQORDER= 0
##$ASSFAC= 0
##$ASSFACI= 0
##$ASSFACX= 0
##$ASSWID= 0
##$AUNMP= <proc_prof1d_extract.lims>
##$AXLEFT= 0
##$AXNAME= <>
##$AXNUC= <1H>
##$AXRIGHT= 0
##$AXTYPE= 0
##$AXUNIT= <>
##$AZFE= 0.1
##$AZFW= 0.1
##$BCFW= 0
##$BC_mod= 0
##$BYTORDP= 0
##$COROFFS= 0
##$CY= 15
##$DATMOD= 1
##$DC= 0
##$DFILT= <>
##$DTYPP= 0
##$F1P= 0
##$F2P= 0
##$FCOR= 0.5
##$FTSIZE= 131072
##$FT_mod= 6
##$GAMMA= 0
##$GB= 0
##$INTBC= 1
##$INTSCL= 1
##$ISEN= 128
##$LB= 0.3
##$LEV0= 0
##$LPBIN= 0
##$MAXI= 10000
##$MC2= 0
##$MEAN= 0
##$ME_mod= 0
##$MI= 0
##$NCOEF= 0
##$NC_proc= -2
##$NLEV= 6
##$NOISF1= 0
##$NOISF2= 0
##$NSP= 0
##$NTH_PI= 0
##$NZP= 0
##$OFFSET= 14.96126
##$PC= 1
##$PHC0= -81.09558
##$PHC1= 0
##$PH_mod= 1
##$PKNL= yes
##$PPARMOD= 0
##$PPDIAG= 0
##$PPIPTYP= 0
##$PPMPNUM= 2147483647
##$PPRESOL= 1
##$PSCAL= 4
##$PSIGN= 0
##$PYNMP= <proc.py>
##$REVERSE= no
##$SF= 400.020009534779
##$SI= 131072
##$SIGF1= 0
##$SIGF2= 0
##$SINO= 400
##$SIOLD= 131072
##$SPECTYP= <>
##$SREGLST= <1H.CDCl3>
##$SSB= 0
##$STSI= 131072
##$STSR= 0
##$SW_p= 8223.68421052631
##$SYMM= 0
##$S_DEV= 0
##$TDeff= 65536
##$TDoff= 0
##$TI= <>
##$TILT= no
##$TM1= 0
##$TM2= 0
##$TOPLEV= 0
##$USERP1= <user>
##$USERP2= <user>
##$USERP3= <user>
##$USERP4= <user>
##$USERP5= <user>
##$WDW= 1
##$XDIM= 131072
##$YMAX_p= 456152929
##$YMIN_p= -14094
##$CURPLOT= <Network HP LaserJet P1505>
##$CURPRIN= <$Network HP LaserJet P1505>
##$DFORMAT= <normdp>
##$LAYOUT= <+/1D_H.xwp>
##$LFORMAT= <normlp>
##$PFORMAT= <normpl>
##$SURQMSG= 1
$$ End of Bruker specific parameters
$$ ---------------------------------
##NTUPLES= NMR SPECTRUM
##VAR_NAME=  FREQUENCY,     SPECTRUM/REAL,   SPECTRUM/IMAG
##SYMBOL=    X,             R,               I
##VAR_TYPE=  INDEPENDENT,   DEPENDENT,       DEPENDENT
##VAR_FORM=  AFFN,          ASDF,            ASDF
##VAR_DIM=   131072,        131072,          131072
##UNITS=     HZ,            ARBITRARY UNITS, ARBITRARY UNITS
##FACTOR=    0.0627417313425164, 1,          1
##FIRST=     8223.62146879497, 3170,         -64645
##LAST=      0,             4950,            -64506
##MIN=       0,             -14094,          0
##MAX=       8223.62146879497, 456152929,    0
$$ Real data points
##PAGE= N=1
##DATA TABLE= (X++(R..R)), XYDATA
$$ [...]
$$ plain form
63905 1453062 1346324 1252968 1171635 1101224 1040827 989417 945832 908883 877359 850069 826044
63894 826044 804550 784841 766139 747994 730388 713288 696348 679276 662282 645918 630731
63883 630731 617323 606419 598393 592919 589558 588577 590607 595502 602153 609720 618661 630252 645335
63870 645335 663742 684600 706838 729615 752709 776577 801884 828861 857100 885798 914061
63859 914061 941079 966243 989167 1009572 1027176 1041693 1052838 1060316 1063922 1063693 1059772 1052067 1040271
63846 1040271 1024379 1004969 982750 957942 930394 900271 868345 835536 802402 769150 735902
63835 735902 702751 669770 637222 605786 576287 549076 523796 499949 477652 457604 440199
63824 440199 424886 410625 396916 384100 372613 362287 352657 343715 335927 329490 323934 318673 313660
$$ packed form
63905A453062j06738r3356q1333p0411o0397n1410m3585l6949l1524k7290k4025
63894H26044k1494j9709j8702j8145j7606j7100j6940j7072j6994j6364j5187
63883F30731j3408j0904q026n474l361r81K030M895O651P567Q941J1591J5083
63870F45335J8407K0858K2238K2777K3094K3868K5307K6977K8239K8698K8263
63859I14061K7018K5164K2924K0405J7604J4517J1145P478L606k29l921p705j1796
63846A040271j5892j9410k2219k4808k7548l0123l1926l2809l3134l3252l3248
63835G35902l3151l2981l2548l1436k9499k7211k5280k3847k2297k0048j7405
63824D40199j5313j4261j3709j2816j1487j0326r630q942p788o437n556n261n013
$$ plain form
63811 313660 309235 305433 301788 297904 294004 290767 288668 287507 286477 284651 281548 277440 273120 269255
63797 269255 265928 262804 259644 256578 253906 251793 250158 248788 247504 246288 245197 244114 242739 241015
63783 241015 239476 238805 238919 238833 237697 235712 233723 232112 230569 228945 227770 227665 228516 229513 229872 229317
63767 229317 228083 226751 225997 226114 226655 226748 225876 224285 222697 221765 221745 222377 222960 222842 222103 221602 222076 223274
63749 223274 224261 224515 224403 224591 225390 226840 229097 232324 236291 240316 243629 245804 247024 248029 249505
63734 249505 251305 252591 253028 253464 254869 256974 258740 260064 262039 265321 269177 272683 276042 279971 284449
63719 284449 288957 293482 298260 302715 305778 307300 308182 308854 308536 306410 302815 298789 295086 292082 290024
63704 290024 288696 287311 285398 283511 282534 282653 283616 285615 288979 293170 296973 299893 302615 305837 309362
$$ packed form
63811C13660m425l802l645l884l900l237k099j161j030j826l103m108m320l865
63797B69255l327l124l160l066k672k113j635j370j284j216j091j083j375j724
63783B41015j539o71J14q6j136j985j989j611j543j624j175j05Q51R97L59n55
63767B29317j234j332p54J17N41R3q72j591j588r32k0O32N83j18p39n01M74J198
63749B23274R87K54j12J88P99J450K257L227L967M025L313K175J220J005J476
63734B49505J800J286M37M36J405K105J766J324J975L282L856L506L359L929M478
63719B84449M508M525M778M455L063J522Q82O72l18k126l595m026l703l004k058
63704B90024j328j385j913j887r77J19R63J999L364M191L803K920K722L222L525
$$ plain form
63689 309362 312708 315965 319420 322683 324865 325599 325378 324797 323883 322347 320224 317984 316075 314610 313564
63674 313564 313112 313591 315129 317429 319919 322069 323650 324843 326091 327660 329309 330534 331092 331008 330138 328180
63658 328180 325315 322331 319736 317133 313925 310309 306980 304031 300821 296911 292540 288109 283861 280245
63644 280245 277969 277334 277903 279166 281134 283952 287321 290726 293964 297060 299963 302775 306002 310088 314838
63629 314838 319839 325320 331935 339722 347958 356317 365531 376431 388796 401753 415108 429658 446174
63616 446174 464654 484743 506365 529580 554238 580254 608066 638268 670759 704602 738713
63605 738713 772177 803695 831248 852820 867389 875007 876211 871787 863043 851797 839888 828720
63593 828720 819073 810961 803554 795457 785273 772004 755209 735048 712078 686866 659973 632450
$$ packed form
63689C09362L346L257L455L263K182P34k21n81r14j536k123k240j909j465j046
63674C13564m52M79J538K300K490K150J581J193J248J569J649J225N58q4q70j958
63658C28180k865k984k595k603l208l616l329k949l210l910m371m431m248l616
63644B80245k276o35N69J263J968K818L369L405L238L096K903K812L227M086M750
63629C14838N001N481O615P787Q236Q359R214J0900J2365J2957J3355J4550J6516
63616D46174J8480K0089K1622K3215K4658K6016K7812L0202L2491L3843L4111
63605G38713L3464L1518K7553K1572J4569P618J204m424q744j1246j1909j1168
63593H28720r647q112p407q097j0184j3269j6795k0161k2970k5212k6893k7523
$$ plain form
63581 632450 605917 581629 559707 539751 521961 506982 494761 484433 475527 468599 464402 463018
63569 463018 464067 467151 471751 477247 483442 490600 498715 507276 516121 525801 536553 547574 558105
63556 558105 568828 581370 596699 614742 635400 659131 686553 718129 754210 794723 838621
63545 838621 883834 927555 966241 995997 1014065 1020196 1016128 1004037 986178 965586 945673 928620
63533 928620 914786 903791 895230 888153 880913 872145 861206 847261 828880 805290 777384 746803
63521 746803 714596 681443 648515 617061 587424 559332 533020 509240 488210 469351 452136
63510 452136 436594 422906 411089 401183 393162 386518 380414 374449 368861 363886 359340 354997 350975
63497 350975 347532 344763 342668 341228 340210 339162 337828 336367 335076 334045 333241 332723 332654 333257 334802
$$ packed form
63581F32450k6533k4288k1922j9956j7790j4979j2221j0328q906o928m197j384
63569D63018J049L084M600N496O195P158Q115Q561Q845R680J0752J1021J0531
63556E58105J0723J2542J5329J8043K0658K3731K7422L1576L6081M0513M3898
63545H38621M5213M3721L8686K9756J8068O131m068j2091j7859k0592j9913j7053
63533I28620j3834j0995q561p077p240q768j0939j3945j8381k3590k7906l0581
63521G46803l2207l3153l2928l1454k9637k8092k6312k3780k1030j8859j7215
63510D52136j5542j3688j1817r906q021o644o104n965n588m975m546m343m022
63497C50975l443k769k095j440j018j048j334j461j291j031q04n18o9O03J545
$$ plain form
63482 334802 337379 340606 343854 346951 350361 354466 358953 363261 367344 371513 375574 378656 380017 379610
63468 379610 377703 374463 370311 366250 363073 360289 356556 351460 346215 342218 339421 336800 334054 331990
63454 331990 331264 331594 332487 334064 336656 340078 343864 347977 352851 358874 366243 375188 385940 398469
63440 398469 412619 428560 446994 468858 494838 524883 557885 591858 624523 653692 677332
63429 677332 694022 703918 709015 712008 714926 718993 725259 734739 748179 766327 790291 820887 857528
63416 857528 898248 940807 983222 1023267 1058340 1086311 1106152 1117565 1120565 1115872 1105319 1091381
63404 1091381 1076266 1061483 1047824 1035324 1023374 1011052 997235 980423 958991 932056 900053
63393 900053 864390 826767 788818 751778 716128 681871 649448 619994 594313 572024 552180
$$ packed form
63482C34802K577L227L248L097L410M105M487M308M083M169M061L082J361m07
63468C79610j907l240m152m061l177k784l733n096n245l997k797k621k746k064
63454C31990p26L30Q93J577K592L422L786M113M874O023P369Q945J0752J2529
63440C98469J4150J5941J8434K1864K5980L0045L3002L3973L2665K9169K3640
63429F77332J6690R896N097K993K918M067O266R480J3440J8148K3964L0596L6641
63416H57528M0720M2559M2415M0045L5073K7971J9841J1413L000m693j0553j3938
63404A091381j5115j4783j3659j2500j1950j2322j3817j6812k1432k6935l2003
63393I00053l5663l7623l7949l7040l5650l4257l2423k9454k5681k2289j9844
$$ plain form
63382 552180 534475 519369 507359 498681 493410 491164 490877 491591 493534 497701 504305 512357 521035 530815
63368 530815 542791 557396 574229 592783 612807 634165 656921 681589 708951 739496 773148
63357 773148 809467 847911 887902 928673 968883 1006328 1038372 1063044 1079686 1088493 1089789 1084212
63345 1084212 1073340 1059453 1044494 1029555 1015288 1002074 989433 975853 959781 940634 918449
63334 918449 892903 863442 830424 795453 760330 726114 693485 663491 637303 615404 597558
63323 597558 583585 573726 568015 565511 564191 561497 555169 544138 528916 511007 491819 472300 453428
63310 453428 436428 422000 409689 398524 388158 378999 371340 364917 359424 354943 351603 349202 347441
63297 347441 346235 345444 344521 342879 340553 338110 335887 333669 331182 328500 325777 322951 320060 317643 316401
$$ packed form
63382E52180j7705j5106j2010q678n271k246k87P14J943M167O604Q052Q678R780
63368E30815J1976J4605J6833J8554K0024K1358K2756K4668K7362L0545L3652
63357G73148L6319L8444L9991M0771M0210L7445L2044K4672J6642Q807J296n577
63345A084212j0872j3887j4959j4939j4267j3214j2641j3580j6072j9147k2185
63334I18449k5546k9461l3018l4971l5123l4216l2629k9994k6188k1899j7846
63323E97558j3973r859n711k504j320k694o328j1031j5222j7909j9188j9519j8872
63310D53428j7000j4428j2311j1165j0366r159p659o423n493m481l340k401j761
63297C47441j206p91r23j642k326k443k223k218k487k682k723k826k891k417j242
$$ plain form
63282 316401 316417 317009 317430 317481 317332 316994 316218 314862 313164 311559 310292 309343 308726 308789 309946 311993 313897
63265 313897 314628 314234 313810 314304 315665 317329 319220 321797 325233 329018 332543 335841 339497 343873 348594
63250 348594 352839 356151 358933 362094 366171 370979 376219 382175 389473 398231 407858 417817 428285 439924
63236 439924 453280 468563 485651 504023 522940 542157 562412 584751 609240 634649 659594
63225 659594 683740 707666 731745 755535 778295 799754 820180 839887 859070 878155 897966
63214 897966 919159 941480 963729 984481 1002709 1017721 1028791 1035024 1035613 1030154 1018791 1002116
63202 1002116 980900 955873 927766 897482 866090 834666 804308 776196 751324 729965 711671
63191 711671 696022 683202 673604 667067 663031 661446 663117 668795 678142 689898 703068 717667 734171
$$ packed form
63282C16401J6N92M21N1j49l38p76j356j698j605j267r49o17O3J157K047J904
63265C13897P31l94m24M94J361J664J891K577L436L785L525L298L656M376M721
63250C48594M245L312K782L161M077M808N240N956P298Q758R627R959J0468J1639
63236D39924J3356J5283J7088J8372J8917J9217K0255K2339K4489K5409K4945
63225F59594K4146K3926K4079K3790K2760K1459K0426J9707J9183J9085J9811
63214H97966K1193K2321K2249K0752J8228J5012J1070O233N89n459j1363j6675
63202A002116k1216k5027k8107l0284l1392l1424l0358k8112k4872k1359j8294
63191G11671j5649j2820r598o537m036j585J671N678R347J1756J3170J4599J6504
$$ plain form
63178 734171 752458 771597 790747 809969 829829 850327 870610 889908 908263 926021 942938
63167 942938 958378 972322 985470 998042 1008953 1016565 1019909 1018733 1012669 1001089 983935 962128
63155 962128 936854 908753 878102 845533 812200 779302 747715 717937 690116 664108 639833
63144 639833 617571 597708 580227 564831 551517 540504 531385 522963 514470 506630 500789 497107 494290
63131 494290 491217 488197 486231 485626 485822 486335 487218 488677 490689 493115 495868 498869 502076 505625 509687
63116 509687 514132 518583 522859 527124 531470 535637 539357 542778 546178 549399 551917 553534 554673 555775
63102 555775 556665 556828 556246 555620 555615 556119 556498 556445 556281 556380 556657 556838 557034 557601 558467 558978 558677 557996 557821 558433
63082 558433 559264 559829 560537 562215 564986 568085 570860 573609 577190 582064 587980 594454 601222 608284 615826
$$ packed form
63178G34171J8287J9139J9150J9222J9860K0498K0283J9298J8355J7758J6917
63167I42938J5440J3944J3148J2572J0911P612L344j176o064j1580j7154k1807
63155I62128k5274k8101l0651l2569l3333l2898l1587k9778k7821k6008k4275
63144F39833k2262j9863j7481j5396j3314j1013r119q422q493p840n841l682k817
63131D94290l073l020j966o05J96N13Q83J459K012K426K753L001L207L549M062
63116E09687M445M451M276M265M346M167L720L421L400L221K518J617J139J102
63102E55775Q90J63n82o26nN04L79n3j64R9K77J81J96N67Q66N11l01o81j75O12
63082E58433Q31N65P08J678K771L099K775K749L581M874N916O474O768P062P542
$$ plain form
63067 615826 624129 633327 643239 653690 664976 677707 692087 707765 724608 743301 764843 789654
63055 789654 817514 848223 881912 918729 958613 1001466 1047271 1095899 1147033 1200367 1255702
63044 1255702 1312716 1370757 1428925 1486271 1541967 1595565 1647174 1697191 1745802 1792991 1839139
63033 1839139 1885187 1931772 1978366 2023600 2066316 2105848 2141157 2170151 2190215 2199337 2196623 2181982
63021 2181982 2155660 2118054 2069733 2011570 1945049 1872522 1796951 1721238 1647716 1578164 1513962
63010 1513962 1455990 1404513 1359483 1321071 1289807 1266214 1250459 1242341 1241383 1246839 1257824 1273623
62998 1273623 1293798 1317863 1345008 1374360 1405385 1437814 1471224 1505103 1539340 1574247 1609830
62987 1609830 1645282 1679528 1712040 1742717 1771035 1795827 1816019 1831089 1840442 1842722 1836383 1820920
$$ packed form
63067F15826Q303R198R912J0451J1286J2731J4380J5678J6843J8693K1542K4811
63055G89654K7860L0709L3689L6817L9884M2853M5805M8628N1134N3334N5335
63044A255702N7014N8041N8168N7346N5696N3598N1609N0017M8611M7189M6148
63033A839139M6048M6585M6594M5234M2716L9532L5309K8994K0064R122k714j4641
63021B181982k6322l7606m8321n8163o6521p2527p5571p5713p3522o9552o4202
63010A513962n7972n1477m5030l8412l1264k3593j5755q118r58N456J0985J5799
62998A273623K0175K4065K7145K9352L1025L2429L3410L3879L4237L4907L5583
62987A609830L5452L4246L2512L0677K8318K4792K0192J5070R353K280o339j5463
$$ plain form
62975 1820920 1797064 1765592 1726423 1679261 1624951 1565762 1504297 1442306 1380521 1319336 1259474
62964 1259474 1202117 1148528 1099492 1054996 1014442 977163 942778 911065 881666 854059 827860
62953 827860 803107 780178 759338 740379 722723 705844 689481 673508 657813 642411 627517
62942 627517 613388 600255 588454 578345 569799 561920 553686 544925 536449 529221 523583 519189 515397
62929 515397 511757 508431 506117 505224 505165 504874 504033 503197 502639 501748 500047 498154 497004 496441 495374 493321
62913 493321 491039 489420 488342 486986 484884 482199 479139 475604 471626 467897 465429 464528 464347 463788 462737
62898 462737 461996 461966 462059 461725 461432 462005 463378 464805 466105 467800 469858 471197 470927 469514 468188 467535 467227
62881 467227 466838 466369 465984 465690 465425 465212 465080 464905 464386 463214 461429 459627 458534 458220 457898 456717 454607
$$ packed form
62975A820920k3856l1472l9169m7162n4310n9189o1465o1991o1785o1185n9862
62964A259474n7357n3589m9036m4496m0554l7279l4385l1713k9399k7607k6199
62953H27860k4753k2929k0840j8959j7656j6879j6363j5973j5695j5402j4894
62942F27517j4129j3133j1801j0109q546p879q234q761q476p228n638m394l792
62929E15397l640l326k314q93n9k91q41q36n58q91j701j893j150n63j067k053
62913D93321k282j619j078j356k102k685l060l535l978l729k468r01j81n59j051
62898D62737p41l0R3l34k93N73J373J427J300J695K058J339k70j413j326o53l08
62881D67227l89m69l85k94k65k13j32j75n19j172j785j802j093l14l22j181k110
$$ plain form
62864 454607 452141 449754 447476 445391 443990 443816 444922 446799 448835 450734 452531 454288 455890 457179
62850 457179 458191 459137 460128 460965 461263 460760 459545 458047 456715 455610 454376 452735 450895 449260 447832
62835 447832 446245 444424 442877 442169 442287 442648 442626 442038 441298 441068 441555 442180 442293 442154 442750 444567 447106
62818 447106 449825 452894 456600 460566 464223 467680 471436 475491 479500 483690 488776 494871 501223 507276
62804 507276 513350 519987 527245 535038 543539 552649 561542 569509 577133 585938 596747 608941 621546
62791 621546 634598 649175 666422 686960 711068 738915 770421 805241 843260 885061 931609
62780 931609 983422 1040345 1102291 1169834 1243643 1323472 1408100 1496244 1586991 1679151 1770556
62769 1770556 1858355 1939786 2012454 2074170 2123048 2157804 2177673 2182093 2170774 2144139 2103386
$$ packed form
62864D54607k466k387k278k085j401j74J106J877K036J899J797J757J602J289
62850D57179J012R46R91Q37K98n03j215j498j332j105j234j641j840j635j428
62835D47832j587j821j547p08J18L61k2n88p40k30M87O25J13j39N96J817K539
62818D47106K719L069L706L966L657L457L756M055M009M190N086O095O352O053
62804E07276O074O637P258P793Q501R110Q893P967P624Q805J0809J2194J2605
62791F21546J3052J4577J7247K0538K4108K7847L1506L4820L8019M1801M6548
62780I31609N1813N6923O1946O7543P3809P9829Q4628Q8144R0747R2160R1405
62769A770556Q7799Q1431P2668O1716M8878L4756J9869M420j1319k6635m0753
$$ plain form
62758 2103386 2050033 1985592 1911834 1831096 1746062 1659166 1572238 1486571 1403195 1323051 1246970
62747 1246970 1175485 1108714 1046552 989052 936466 888865 845831 806802 771634 740605 713768
62736 713768 690511 669893 651321 634691 620004 607102 595879 586438 578827 572627 567056 561514
62724 561514 556093 551535 548665 547709 548086 548960 550025 551656 554359 558359 563900 571490 581392 593030 605489
62709 605489 618687 633611 651207 671506 694122 719184 747307 778883 813935 852660 895663
62698 895663 943442 995879 1052414 1112697 1176991 1245841 1319142 1395438 1472348 1547752 1620207
62687 1620207 1688004 1748365 1798298 1836099 1861362 1873585 1871615 1854795 1824041 1781308 1728464
62676 1728464 1667118 1599093 1526409 1450931 1374464 1298945 1226015 1156474 1090653 1029196 972872
$$ packed form
62758B103386n3353o4441p3758q0738q5034q6896q6928q5667q3376q0144p6081
62747A246970p1485o6771o2162n7500n2586m7601m3034l9029l5168l1029k6837
62736G13768k3257k0618j8572j6630j4687j2902j1223r441p611o200n571n542
62724E61514n421m558k870r56L77Q74J065J631K703M000N541P590R902J1638J2459
62709F05489J3198J4924J7596K0299K2616K5062K8123L1576L5052L8725M3003
62698H95663M7779N2437N6535O0283O4294O8850P3301P6296P6910P5404P2455
62687A620207O7797O0361M9933L7801K5263J2223j970j6820l0754m2733n2844
62676A728464o1346o8025p2684p5478p6467p5519p2930o9541o5821o1457n6324
$$ plain form
62665 972872 921637 874569 830949 790933 754910 722757 694065 668672 646451 626806 608894
62654 608894 592262 576925 562898 549975 537936 526647 515932 505643 495915 487137 479587 473246
62642 473246 467963 463560 459761 456277 453160 450911 450014 450280 450691 449972 447462 443598 439535 436204 433706
62627 433706 431637 429759 428146 426774 425366 423775 422245 421166 420770 421246 422825 425452 428540 431409 433981
62612 433981 436713 439858 443185 446545 450335 455063 460711 466881 473511 481058 489999 500551 512978 527745
62598 527745 545075 564697 586412 610742 638513 669839 704059 740830 780672 823985 869833
62587 869833 916200 961330 1004262 1044080 1079210 1107852 1128787 1141514 1145815 1141625 1129295 1109652
62575 1109652 1083708 1052461 1017022 978663 938650 898055 857776 818507 780598 744132 709370
$$ packed form
62665I72872n1235m7068m3620m0016l6023l2153k8692k5393k2221j9645j7912
62654F08894j6632j5337j4027j2923j2039j1289j0715j0289r728q778p550o341
62642D73246n283m403l799l484l117k249q97K66M11p19k510l864m063l331k498
62627D33706k069j878j613j372j408j591j530j079l96M76J579K627L088K869K572
62612D33981K732L145L327L360L790M728N648O170O630P547Q941J0552J2427J4767
62598E27745J7330J9622K1715K4330K7771L1326L4220L6771L9842M3313M5848
62587H69833M6367M5130M2932L9818L5130K8642K0935J2727M301m190j2330j9643
62575A109652k5944l1247l5439l8359m0013m0595m0279l9269l7909l6466l4762
$$ plain form
62564 709370 677035 647886 621994 598676 577230 557570 540039 524833 511826 500823 491641 483908
62552 483908 477118 471033 465829 461624 457989 454304 450603 447739 446423 446217 445797 444260 441898 439576 437657
62537 437657 435893 434190 432943 432458 432459 432479 432541 433166 434877 437914 442279 447713 453760 460196 467403 476037
62521 476037 486422 498540 512520 528671 547122 567956 591722 619185 650305 684022 719412
62510 719412 756609 796147 837817 880676 923790 966312 1006993 1044280 1076969 1104360 1125803
62499 1125803 1140573 1148280 1148977 1142880 1130460 1112896 1091975 1069262 1045677 1022029 999625 980062
62487 980062 964598 953874 948030 946833 949861 956749 967146 980312 994874 1009144 1021575 1030895
62475 1030895 1036115 1036814 1033370 1026573 1016706 1002976 983959 958774 927952 893236 856498 818922
$$ packed form
62564G09370l2335k9149k5892k3318k1446j9660j7531j5206j3007j1003r182p733
62552D83908o790o085n204m205l635l685l701k864j316k06m20j537k362k322j919
62537D37657j764j703j247m85JK0O2O25J711L037M365N434O047O436P207Q634
62521D76037J0385J2118J3980J6151J8451K0834K3766K7463L1120L3717L5390
62510G19412L7197L9538M1670M2859M3114M2522M0681L7287L2689K7391K1443
62499A125803J4770P707O97o097j2420j7564k0921k2713k3585k3648k2404j9563
62487I80062j5464j0724n844j197L028O888J0397J3166J4562J4270J2431R320
62475A030895N220O99l444o797r867j3730j9017k5185l0822l4716l6738l7576
$$ plain form
62463 818922 781131 743808 707884 674158 642997 614487 588751 566052 546653 530609 517659
62452 517659 507373 499362 493243 488395 484143 480410 477933 477441 478708 480759 482967 485555 489072 493732
62438 493732 499374 505741 512539 519385 525803 531345 535733 538877 540554 540022 536377 529562 520706 511056
62424 511056 500981 490463 480158 471116 463589 456968 450904 445626 441008 436205 430717 425163 420499
62411 420499 416924 413930 410988 407804 404380 401282 399495 399553 401024 403119 405376 407470 408825 409085 408767
62396 408767 408956 410389 413016 416213 419172 421319 422702 423896 425445 427643 430817 435251 440670 446408
62382 446408 452363 459149 466941 474836 481982 488774 496295 504973 514404 524077 533656 542988 552492 563164
62368 563164 575555 589159 603520 619414 638076 659675 683604 709998 739871 773832 811781
$$ packed form
62463H18922l7791l7323l5924l3726l1161k8510k5736k2699j9399j6044j2950
62452E17659j0286q011o119m848m252l733k477m92J267K051K208K588L517M660
62438D93732N642O367O798O846O418N542M388L144J677n32l645o815q856r650
62424E11056j0075j0518j0305r042p527o621o064n278m618m803n488n554m664
62411D20499l575k994k942l184l424l098j787N8J471K095K257K094J355K60l18
62396D08767J89J433K627L197K959K147J383J194J549K198L174M434N419N738
62382D46408N955O786P792P895P146O792P521Q678R431R673R579R332R504J0672
62368E63164J2391J3604J4361J5894J8662K1599K3929K6394K9873L3961L7949
$$ plain form
62357 811781 853911 900921 953015 1009519 1069613 1132461 1196289 1258241 1315519 1366046 1407960
62346 1407960 1439528 1460150 1470792 1472912 1467457 1455047 1436305 1411482 1380473 1343737 1302716 1258959
62334 1258959 1213466 1167232 1121676 1077931 1036322 997171 961448 929925 902163 877124 854324
62323 854324 833564 813932 794077 773474 752617 731920 711174 690226 669537 649732 630998
62312 630998 613193 596328 580740 566858 554822 544275 534686 526044 519004 514102 511010 508891 507380
62299 507380 506853 507777 510152 513610 517825 522754 528656 535860 544431 554123 564725 576222 588479 601040
62285 601040 613464 625629 637358 647926 656443 662736 667555 671801 675752 679030 681060 681508 680518 678733
62271 678733 677073 676380 677128 679346 682818 687498 693729 702032 712830 726713 744802 768299 797528
$$ packed form
62357H11781M2130M7010N2094N6504O0094O2848O3828O1952N7278N0527M1914
62346A407960L1568K0622J0642K120n455j2410j8742k4823l1009l6736m1021m3757
62334A258959m5493m6234m5556m3745m1609l9151l5723l1523k7762k5039k2800
62323H54324k0760j9632j9855k0603k0857k0697k0746k0948k0689j9805j8734
62312F30998j7805j6865j5588j3882j2036j0547r589q642p040m902l092k119j511
62299E07380n27R24K375L458M215M929N902P204Q571R692J0602J1497J2257J2561
62285F01040J2424J2165J1729J0568Q517O293M819M246L951L278K030M48r90j785
62271F78733j660o93P48K218L472M680O231Q303J0798J3883J8089K3497K9229
$$ plain form
62258 797528 831862 870852 914994 965024 1020834 1081426 1145504 1211503 1277144 1339573 1396129
62247 1396129 1444753 1483844 1512166 1529228 1535599 1532714 1522141 1504711 1480169 1447781 1407409 1359897
62235 1359897 1306591 1248973 1188869 1128377 1069083 1011741 957048 906282 860597 820070 784090
62224 784090 752506 725645 703262 684190 667173 651609 637404 624610 613407 604021 596438 590326
62212 590326 585232 580555 575524 569686 563520 558131 554219 551722 550421 550337 551285 552553 553476 554164 555432
62197 555432 558081 562398 568126 574735 581803 589263 597216 605576 614108 622824 632028 641855 652029 662235
62183 662235 672534 683253 694604 706449 718254 729142 738221 745119 750246 754554 759105 764889 772801
62170 772801 783645 798159 817009 840667 869245 902518 940115 981587 1026381 1073797 1122788
$$ packed form
62258G97528L4334L8990M4142N0030N5810O0592O4078O5999O5641O2429N6556
62247A396129M8624L9091K8322J7062O371k885j0573j7430k4542l2388m0372m7512
62235A359897n3306n7618o0104o0492n9294n7342n4693n0766m5685m0527l5980
62224G84090l1584k6861k2383j9072j7017j5564j4205j2794j1203r386p583o112
62212E90326n094m677n031n838o166n389l912k497j301q4R48J268R23O88J268
62197E55432K649M317N728O609P068P460P953Q360Q532Q716R204R827J0174J0206
62183F62235J0299J0719J1351J1845J1805J0888R079O898N127M308M551N784P912
62170G72801J0844J4514J8850K3658K8578L3273L7597M1472M4794M7416M8991
$$ plain form
62159 1122788 1171545 1217434 1257734 1290645 1315558 1332532 1341818 1343870 1339403 1329173 1313716 1293286
62147 1293286 1267909 1237578 1202680 1164306 1124016 1083290 1043308 1005113 969592 937254 908267
62136 908267 882770 860948 842752 827783 815466 805215 796450 788750 781966 776002 770549 765344 760623
62123 760623 756950 754582 753457 753833 756470 761911 769966 780055 791580 803552 814240 821835 825534
62110 825534 825700 823088 818340 812250 805936 800288 795267 790014 783680 775963 766874 756397 744811 733213
62096 733213 723237 716053 711904 710673 712379 716742 722682 728852 734671 740437 746614 753372 760668 768328
62082 768328 776115 784198 793416 804557 817455 831425 846520 863599 883012 903953 925449 947329
62070 947329 969837 992898 1016250 1039904 1063995 1088550 1113855 1140686 1169632 1200258 1231198
$$ packed form
62159A122788M8757M5889M0300L2911K4913J6974R286K052m467j0230j5457k0430
62147A293286k5377l0331l4898l8374m0290m0726l9982l8195l5521l2338k8987
62136I08267k5497k1822j8196j4969j2317j0251q765p700o784n964n453n205m721
62123G60623l673k368j125L76K637N441Q055J0089J1525J1972J0688P595L699
62110H25534J66k612m748o090o314n648n021n253o334p717r089j0477j1586j1598
62096G33213r976p184m149j231J706M363N940O170N819N766O177O758P296P660
62082G68328P787Q083R218J1141J2898J3970J5095J7079J9413K0941K1496K1880
62070I47329K2508K3061K3352K3654K4091K4555K5305K6831K8946L0626L0940
$$ plain form
62059 1231198 1260819 1287590 1310203 1327843 1340198 1347032 1348074 1343589 1334576 1321927 1305745 1285850
62047 1285850 1262444 1235634 1204784 1169241 1129620 1087638 1044681 1001237 957691 914929 873910
62036 873910 835207 799170 766135 736240 709405 685598 664767 646520 630312 615993 603659
62025 603659 592902 582845 573215 564797 558388 553591 549044 543608 537083 529980 522902 516056 509163 501944
62011 501944 494680 488047 482406 477688 474070 472195 472398 474107 476398 478852 481597 484885 489003 494232
61997 494232 500337 506344 511265 514871 517288 518194 517083 514176 510369 506239 501754 496930 491984 486602
61983 486602 479857 471327 461800 452459 443853 436140 429826 425470 422820 420899 418965 416903 414734 412264
61969 412264 409336 406048 402650 399568 397454 396623 396324 395187 392768 390248 389128 389519 390238 390446 390580 391545
$$ packed form
62059A231198K9621K6771K2613J7640J2355O834J042m485r013j2649j6182j9895
62047A285850k3406k6810l0850l5543l9621m1982m2957m3444m3546m2762m1019
62036H73910l8703l6037l3035k9895k6835k3807k0831j8247j6208j4319j2334
62025F03659j0757j0057r630q418o409m797m547n436o525p103p078o846o893p219
62011E01944p264o633n641m718l618j875K03J709K291K454K745L288M118N229
61997D94232O105O007M921L606K417R06j111k907l807m130m485m824m946n382
61983D86602o745q530r527r341q606p713o314m356k650j921j934k062k169k470
61969D12264k928l288l398l082k114q31k99j137k419k520j120L91P19K08J34R65
$$ plain form
61953 391545 393485 395744 397876 400355 404175 409875 417154 425458 434816 445852 458904 473360 488169
61940 488169 503003 518665 536231 555955 577133 598819 620350 641213 660805 678701 695054
61929 695054 710448 725323 739716 753363 765632 775318 781126 782712 780974 776939 770723 762045 751424
61916 751424 740185 729334 719200 710312 703924 701266 702649 707600 715497 725846 738334 752923 769463
61903 769463 786878 803106 816275 825646 831153 832565 829722 823227 814123 802962 789756 774719 758422
61890 758422 741236 723255 704969 687466 671735 658044 646046 635130 624569 613752 602532
61879 602532 591207 580106 569334 558878 548731 539002 530120 522732 517036 512452 508442 505429 504254
61866 504254 504850 506249 507987 510698 515051 520854 527653 535600 545189 556594 569780 584924 602226
$$ packed form
61953C91545J940K259K132K479L820N700P279Q304R358J1036J3052J4456J4809
61940D88169J4834J5662J7566J9724K1178K1686K1531K0863J9592J7896J6353
61929F95054J5394J4875J4393J3647J2269R686N808J586j738m035o216q678j0621
61916G51424j1239j0851j0134q888o388k658J383M951P897J0349J2488J4589J6540
61903G69463J7415J6228J3169R371N507J412k843o495r104j1161j3206j5037j6297
61890G58422j7186j7981j8286j7503j5731j3691j1998j0916j0561j0817j1220
61879F02532j1325j1101j0772j0456j0147r729q882p388n696m584m010l013j175
61866E04254N96J399J738K711M353N803O799P947R589J1405J3186J5144J7302
$$ plain form
61853 602226 621580 642941 666777 693606 723163 754441 786561 819285 852664 886371 919342
61842 919342 949995 976959 999672 1018070 1031657 1039309 1040254 1034943 1024752 1011223 995956 980788
61830 980788 967424 956813 949209 944766 943860 946961 954425 966207 981392 998093 1014104 1027658 1037519
61817 1037519 1042712 1042522 1036557 1024576 1006520 982979 955342 925053 892956 859690 826349 794184
61805 794184 763885 735741 710298 688099 668780 651212 634723 619624 606331 594650 584303
61794 584303 575558 568751 563475 558828 554381 550401 547127 544243 541248 538023 534802 531730 528760 525904
61780 525904 523293 520866 518277 515372 512553 510287 508370 506124 503398 500872 499168 498110 497208 496443 496103
61765 496103 496111 496092 496030 496367 497396 498850 500130 500755 500773 500987 502523 505662 509197 511409 511670 510712 509465 508260
$$ packed form
61853F02226J9354K1361K3836K6829K9557L1278L2120L2724L3379L3707L2971
61842I19342L0653K6964K2713J8398J3587P652R45n311j0191j3529j5267j5168
61830I80788j3364j0611p604m443r06L101P464J1782J5185J6701J6011J3554R861
61817A037519N193j90n965j1981j8056k3541k7637l0289l2097l3266l3341l2165
61805G94184l0299k8144k5443k2199j9319j7568j6489j5099j3293j1681j0347
61794E84303q745o807n276m647m447l980l274k884k995l225l221l072k970k856
61780E25904k611k427k589k905k819k266j917k246k726k526j704j058r02p65l40
61765D96103Qj9o2L37J029J454J280O25J8K14J536L139L535K212K61r58j247j205
$$ plain form
61747 508260 507198 506519 506187 505545 503864 501053 497561 493821 490160 487106 485315 484977 485447 485677 485147 484386
61731 484386 484490 486011 488420 490687 492208 493020 493398 493673 494322 495726 497732 499806 501725 503793 506217
61716 506217 508663 510692 512382 514187 516310 518472 520208 521104 520779 518927 515552 511056 505968 500559 494863
61701 494863 489095 483825 479478 475736 471796 467342 462928 459196 456006 452690 448897 444764 440401 435738
61687 435738 430957 426628 423187 420491 418021 415350 412413 409524 407190 405667 404656 403573 402134 400509
61673 400509 398980 397716 396847 396413 396160 395697 394968 394321 393955 393598 392889 391932 391245 391255 391984 393183 394635 396275
61655 396275 398048 399723 401034 402014 402993 404119 405096 405641 406049 407022 409065 412222 416205 420426 424125 426905
61639 426905 429126 431361 433528 434949 435222 434526 433060 430680 427304 423275 419107 415118 411404 407870 404218
$$ packed form
61747E08260j062o79l32o42j681k811l492l740l661l054j791l38M70K30n30p61
61731D84386J04J521K409K267J521Q12L78K75O49J404K006K074J919K068K424
61716E06217K446K029J690J805K123K162J736Q96l25j852l375m496n088n409n696
61701D94863n768n270m347l742l940m454m414l732l190l316l793m133m363m663
61687D35738m781m329l441k696k470k671k937k889k334j523j011j083j439j625
61673D00509j529j264q69m34k53m63p29o47l66l57p09r57o87J0P29J199J452J640
61655C96275J773J675J311R80R79J126R77N45M08R73K043L157L983M221L699K780
61639D26905K221K235K167J421K73o96j466k380l376m029m168l989l714l534l652
$$ plain form
61624 404218 400244 396280 393018 390799 389394 388499 388028 387835 387615 387341 387387 387945 388613 388822 388396 387473 386114
61607 386114 384220 381606 377974 373127 367451 361967 357571 354272 351299 347847 343677 339217 335190 332033
61593 332033 329668 327911 326860 326419 325673 323493 319938 316457 314379 313682 313495 313213 312705 311927 310944 310100
61577 310100 309724 309788 310114 310597 310961 310697 309721 308745 308545 309070 309689 310069 310295 310329 309954 309314 309073 309910 312012
61558 312012 314970 318007 320445 322155 323423 324309 324503 324080 323912 324850 326758 328806 330435 331578 332201 332250
61542 332250 332006 331960 332330 333065 334150 335508 336783 337803 339072 341174 343721 345548 346048 345749 345422 345219
61526 345219 344930 344569 344277 343924 343164 341739 339623 337062 334624 332897 331990 331447 330749 329774 328697 327713 326932
61509 326932 326359 325879 325417 325109 325198 325706 326419 327151 327843 328500 329226 330225 331412 332160 331863 330803 329976 329952 330336
$$ packed form
61624D04218l974l964l262k219j405q95m71j93k20k74M6N58O68K09m26r23j359
61607C86114j894k614l632m847n676n484m396l299k973l452m170m460m027l157
61593C32033k365j757j051m41p46k180l555l481k078o97j87k82n08p78r83q44
61577C10100l76O4L26M83L64k64r76r76k00N25O19L80K26L4l75o40k41Q37K102
61558C12012K958L037K438J710J268Q86J94m23j68R38J908K048J629J143O23M9
61542C32250k44m6L70P35J085J358J275J020J269K102K547J827N00k99l27k03
61526C45219k89l61k92l53p60j425k116k561k438j727r07n43o98r75j077r84p81
61509C26932n73m80m62l08Q9N08P13P32O92O57P26R99J187P48k97j060q27k4L84
$$ plain form
61490 330336 330516 330476 330521 330600 330400 330011 330046 330987 332640 334351 335680 336773 338097 339927 342187 344693 347307
61473 347307 349734 351493 352395 352891 353552 354274 354369 353445 351829 350130 348803 348189 348433 349063 349114 348095 346648
61456 346648 345806 345773 345861 345595 345361 345730 346556 347135 347157 347018 347072 347006 346363 345494 345383 346416 347846 348815 349574 351228
61436 351228 354403 358610 362893 366701 370098 373401 376723 379745 381994 383493 384946 386944 389177 390863
61422 390863 391899 393033 394834 397010 398964 400584 402201 404027 405918 407486 408261 407943 406724 405228 403995
61407 403995 403137 402494 401841 400863 399301 397306 395374 393735 392069 390077 387964 386044 384218 382304 380706
61392 380706 380168 380785 381741 382149 381833 381118 380282 379583 379569 380813 383178 385698 387456 388451 389383 390780 392626
61375 392626 394775 397250 399947 402446 404427 406054 407676 409417 411369 413914 417293 420974 423982 425971
$$ packed form
61490C30336J80m0M5P9k00l89L5R41J653J711J329J093J324J830K260K506K614
61473C47307K427J759R02M96O61P22R5r24j616j699j327o14K44O30N1j019j447
61456C46648q42l3Q8k66k34L69Q26N79K2j39N4o6o43q69j11J033J430R69P59J654
61436C51228L175M207M283L808L397L303L322L022K249J499J453J998K233J686
61422C90863J036J134J801K176J954J620J617J826J891J568P75l18j219j496j233
61407D03995q58o43o53r78j562j995j932j639j666j992k113j920j826j914j598
61392C80706n38O17R56M08l16p15q36o99j4J244K365K520J758R95R32J397J846
61375C92626K149K475K697K499J981J627J622J741J952K545L379L681L008J989
$$ plain form
61361 425971 427511 429230 431128 432972 435007 437950 442413 448442 455491 462794 470053 477730 486340 495371
61347 495371 503397 509493 514112 518270 522206 525315 527165 528097 528821 529743 530761 531515 531750 531464 530640 528950
61331 528950 526013 522064 517967 514364 511043 507398 503233 498857 494770 491633 490213 490745 492387 493892
61317 493892 494872 495969 497790 500226 503041 506587 511458 517630 524414 531343 538889 548174 559988 574116
61303 574116 589533 605125 620081 633652 644899 653042 658013 660363 660617 658977 655703 651448 646905
61290 646905 642215 636880 630285 622322 613648 605361 598172 591749 585116 577907 571027 565768 562388 560024
61276 560024 558001 556688 556822 558430 560844 563493 566122 568376 569880 570877 572284 574801 578319 582460 587280
61261 587280 593102 600047 608175 617728 628539 639348 648389 654786 658946 661613 663165 663962 664597 665237
$$ packed form
61361D25971J540J719J898J844K035K943M463O029P049P303P259P677Q610R031
61347D95371Q026O096M619M158L936L109J850R32P24R22J018P54K35k86q24j690
61331E28950k937l949m097l603l321l645m165m376m087l137j420N32J642J505
61317D93892R80J097J821K436K815L546M871O172O784O929P546R285J1814J4128
61303E74116J5417J5592J4956J3571J1247Q143M971K350K54j640l274m255m543
61290F46905m690n335o595p963q674q287p189o423o633p209o880n259l380k364
61276E60024k023j313J34J608K414K649K629K254J504R97J407K517L518M141M820
61261E87280N822O945Q128R553J0811J0809R041O397M160K667J552P97O35O40
$$ plain form
61247 665237 665089 663077 658894 653098 646387 639231 632035 625235 619177 614144 610364 607654 605123 601658
61233 601658 596918 591642 586982 583759 582413 583237 586287 591082 596663 602123 607106 611846 616790 622198
61219 622198 628032 634132 640414 646910 653651 660516 667209 673411 679018 684202 689203 694086 698789 703313
61205 703313 707737 712127 716593 721465 727177 733911 741531 750030 759973 772392 788107 807040 828016
61192 828016 849260 869223 887030 902277 914639 923878 930113 933802 935447 935484 934332 932273 929242
61179 929242 924989 919456 912796 905054 896083 885855 874655 862961 851198 839443 827177 813585
61167 813585 798527 783040 768406 754844 741617 728245 714856 701411 687566 673572 660443
61156 660443 648789 638309 629007 622086 618736 618590 620279 623106 627169 632058 636483 639300 640074 638513
$$ packed form
61247F65237j48k012m183n796o711p156p196o800o058n033l780k710k531l465
61233F01658m740n276m660l223j346Q24L050M795N581N460M983M740M944N408
61219F22198N834O100O282O496O741O865O693O202N607N184N001M883M703M524
61205G03313M424M390M466M872N712O734P620Q499R943J2419J5715J8933K0976
61192H28016K1244J9963J7807J5247J2362R239O235L689J645L7j152k059l031
61179I29242m253n533o660p742q971j0228j1200j1694j1763j1755j2266j3592
61167H13585j5058j5487j4634j3562j3227j3372j3389j3445j3845j3994j3129
61156F60443j1654j0480r302o921l350j46J689K827M063M889M425K817P74j561
$$ plain form
61142 638513 634194 627251 618744 609989 601813 594624 588777 584611 582404 582377 584495 588244 593029 598837 606139
61127 606139 615125 625501 637108 650182 664789 680513 697023 714557 733545 754112 776174 799621
61115 799621 824065 848764 873269 897912 923273 949302 975352 1000881 1025630 1049145 1070565
61104 1070565 1089012 1103950 1115156 1122639 1126648 1127513 1125283 1119643 1110267 1097228 1081117 1062954 1043955
61091 1043955 1025008 1006080 986297 965024 943018 922239 904251 888906 874845 861280 848897
61080 848897 838905 831599 826265 822283 819805 819287 820755 823824 828198 833881 841006 849639 859727 871034
61066 871034 883181 895923 909428 924157 940402 958042 976834 996854 1018431 1041647 1066140
61055 1066140 1091534 1117904 1145542 1174431 1204279 1235039 1266970 1300090 1333934 1368013 1402144
$$ packed form
61142F38513m319o943q507q755q176p189n847m166k207k7K118L749M785N808P302
61127F06139Q986J0376J1607J3074J4607J5724J6510J7534J8988K0567K2062K3447
61115G99621K4444K4699K4505K4643K5361K6029K6050K5529K4749K3515K1420
61104A070565J8447J4938J1206P483M009Q65k230n640r376j3039j6111j8163j8999
61091A043955j8947j8928j9783k1273k2006k0779j7988j5345j4061j3565j2383
61080H48897r992p306n334l982k478n18J468L069M374N683P125Q633J0088J1307
61066H71034J2147J2742J3505J4729J6245J7640J8792K0020K1577K3216K4493
61055A066140K5394K6370K7638K8889K9848L0760L1931L3120L3844L4079L4131
$$ plain form
61044 1402144 1436035 1468932 1500082 1529364 1557064 1583230 1607599 1630075 1650873 1670260 1688461
61033 1688461 1705790 1722552 1738943 1755310 1772349 1790649 1810178 1830595 1851786 1873605 1895365
61022 1895365 1916508 1937902 1961901 1991018 2027187 2072263 2128197 2196143 2276014 2367475 2471117
61011 2471117 2588744 2723639 2881328 3069437 3296252 3570145 3901230 4303071 4792695
61002 4792695 5391086 6126000 7033638 8155599 9534389 11210034 13206327 15491168 17924502
60993 17924502 20245805 22144856 23391274 23936257 23917979 23584888 23205794 23007642 23124933
60984 23124933 23543119 24070139 24390403 24197685 23327952 21808960 19814028 17573578 15301940
60975 15301940 13159399 11241827 9587571 8194541 7038905 6088083 5307776 4666586
$$ packed form
61044A402144L3891L2897L1150K9282K7700K6166K4369K2476K0798J9387J8201
61033A688461J7329J6762J6391J6367J7039J8300J9529K0417K1191K1819K1760
61022A895365K1143K1394K3999K9117L6169M5076N5934O7946P9871R1461J03642
61011B471117J17627J34895J57689J88109K26815K73893L31085M01841M89624
61002D792695N98391P34914R07638J121961J378790J675645J996293K284841K433334
60993A7924502K321303J899051J246418N44983j8278l33091l79094j98152J17291
60984B3124933M18186N27020L20264j92718q69733j518992j994932k240450k271638
60975A5301940k142541j917572j654256j393030j155636r50822p80307o41190
$$ plain form
60967 4666586 4138913 3704581 3346364 3048818 2798977 2586721 2403914 2243842 2101652
60958 2101652 1974487 1860617 1758608 1667302 1586043 1514556 1452720 1400304 1356283 1318211 1282846
60947 1282846 1247812 1212508 1177303 1142300 1107290 1072475 1038580 1006248 975697 946989 920201
60936 920201 895171 871347 848193 825756 804679 785595 768450 752511 737145 722544 709518
60925 709518 698506 689059 680470 672613 665795 659938 654392 648696 643163 638463 634840 631994 629598 627684
60911 627684 626542 626415 627310 628966 630987 633028 634840 636120 636462 635644 633968 632105 630511 628995 626856
60896 626856 623354 618073 611006 602563 593525 584761 576735 569251 561841 554352 546992 539834 532643 525407
60882 525407 518672 512929 507834 502521 496697 490933 485767 481023 476271 471545 467234 463648 461087 460019
$$ packed form
60967D666586n27673m34332l58217k97546k49841k12256j82807j60072j42190
60958B101652j27165j13870j02009r1306q1259p1487o1836n2416m4021l8072l5365
60947A282846l5034l5304l5205l5003l5010l4815l3895l2332l0551k8708k6788
60936I20201k5030k3824k3154k2437k1077j9084j7145j5939j5366j4601j3026
60925G09518j1012r447q589p857o818n857n546n696n533m700l623k846k396j914
60911F27684j142j27Q95J656K021K041J812J280L42q18j676j863j594j516k139
60896F26856l502n281p067q443r038q764q026p484p410p489p360p158p191p236
60882E25407o735n743n095n313n824n764n166m744m752m726m311l586k561j068
$$ plain form
60868 460019 460598 462096 463405 464175 465059 466714 469062 471706 474684 478368 482845 487728 492558 497096 501185
60853 501185 504581 507120 509024 510892 513261 516186 519339 522521 525819 529155 531850 532978 532177 529908
60839 529908 526871 523361 519296 514663 509734 504850 500099 495292 490229 484955 479727 474815 470413 466666
60825 466666 463489 460298 456267 451162 445769 441178 437678 434619 431285 427581 423825 420173 416505 412691
60811 412691 408772 404839 400818 396509 391933 387599 384168 381841 380285 379236 378771 378824 378858 378408 377583 376585
60795 376585 375146 373063 371051 370200 370584 371176 371283 371372 372299 374373 377457 381266 385155 388243 390317 392174
60779 392174 394585 397287 399478 400868 401717 402188 402368 402672 403522 404556 404760 403559 401473 399656 398977 399466
60763 399466 400368 400783 400483 400037 399978 400148 400112 399863 399619 399170 397992 396025 393880 392268 391528 391651 392405 393465
$$ packed form
60868D60019N79J498J309P70Q84J655K348K644K978L684M477M883M830M538M089
60853E01185L396K539J904J868K369K925L153L182L298L336K695J128q01k269
60839E29908l037l510m065m633m929m884m751m807n063n274n228m912m402l747
60825D66666l177l191m031n105n393m591l500l059l334l704l756l652l668l814
60811D12691l919l933m021m309m576m334l431k327j556j049m65N3L4m50q25r98
60795C76585j439k083k012q51L84N92J07Q9R27K074L084L809L889L088K074J857
60779C92174K411K702K191J390Q49M71J80L04Q50J034K04j201k086j817o79M89
60763C99466R02M15l00m46n9J70l6k49k44m49j178j967k145j612p40J23P54J060
$$ plain form
60745 393465 394718 396290 397972 398907 398375 396651 394496 392016 388717 384534 379987 375337 370533 366109 363134
60730 363134 361785 360837 359140 356926 355071 353776 352736 352004 351764 351576 350810 349712 349236 349878 351373 353464
60714 353464 356103 358788 360593 361288 361843 363403 366173 369544 372860 375719 377989 379949 382090 384415 386248
60699 386248 387135 387536 388150 388899 389237 389225 389461 389862 389344 387108 383748 380672 378771 378000 377850 377746 377278 376615
60681 376615 376624 378056 380598 383200 385397 387823 391223 395384 399321 402213 403850 404456 404447 404182 403551 401807
60665 401807 398173 392778 386859 382017 379202 378268 378226 377987 377070 375701 374280 372975 371943 371652 372592 374776
60649 374776 377834 381483 385547 389581 392955 395378 396935 397533 396792 394723 392096 389768 387929 386246 384456
60634 384456 382510 380464 378628 377614 377761 378654 379584 380351 381247 382391 383552 384534 385134 384835 383246 381060
$$ packed form
60745C93465J253J572J682R35n32j724k155k480l299m183m547m650m804m424k975
60730C63134j349r48j697k214j855j295j040p32k40j88p66j098m76O42J495K091
60714C53464K639K685J805O95N55J560K770L371L316K859K270J960K141K325J833
60699C86248Q87M01O14P49L38j2K36M01n18k236l360l076j901p71j50j04m68o63
60681C76615RJ432K542K602K197K426L400M161L937K892J637O06rk65o31j744
60665D01807l634n395n919m842k815r34m2k39r17j369j421j305j032k91R40K184
60649C74776L058L649M064M034L374K423J557N98p41k069k627k328j839j683j790
60634C84456j946k046j836j014J47Q93R30P67Q96J144J161R82O00k99j589k186
$$ plain form
60618 381060 379864 380503 382130 383263 383361 382865 382158 381333 380817 381316 382817 384221 384403 383335 381907 380906
60602 380906 380496 380424 380348 380014 379442 379056 379410 380686 382513 384291 385670 386797 388155 390104 392495 394755
60586 394755 396457 397708 398872 400033 400949 401499 401945 402624 403530 404316 404688 404749 404989 405977 408008 411019 414901
60569 414901 419863 426341 434486 443916 454172 465359 478063 492515 507965 523029 536545 547894
60557 547894 556615 562117 563991 562408 557930 551076 542410 533012 524413 517810 513448 510824 509287 508433
60543 508433 508314 509554 513046 519165 527403 537054 548120 561258 576985 595314 616064 638938 663093
60530 663093 686958 708726 726870 740237 748147 750647 748459 742487 733594 722903 711781 701113
60518 701113 690892 680923 671641 663707 657029 650817 644686 639169 635042 632677 632207 633738 636985 641135
$$ packed form
60618C81060j196O39J627J133R8m96p07q25n16M99J501J404J82j068j428j001
60602C80906m10p2p6l34n72l86L54J276J827J778J379J127J358J949K391K260
60586C94755J702J251J164J161R16N50M46O79R06P86L72O1K40R88K031L011L882
60569D14901M962O478Q145R430J0256J1187J2704J4452J5450J5064J3516J1349
60557E47894Q721N502J874j583m478o854q666r398q599o603m362k624j537q54
60543E08433j19J240L492O119Q238R651J1066J3138J5727J8329K0750K2874K4155
60530F63093K3865K1768J8144J3367P910K500k188n972q893j0691j1122j0668
60518G01113j0221r969r282p934o678o212o131n517m127k365m70J531L247M150
$$ plain form
60504 641135 645692 651365 659656 671602 687282 706539 729738 757660 790963 829908 874305 923479
60492 923479 976454 1032338 1090266 1148722 1205143 1256613 1300950 1336813 1362891 1377488 1379134 1367343
60480 1367343 1342648 1306195 1259544 1204618 1143624 1079100 1014044 951511 893536 840474 791658
60469 791658 746688 705942 670082 639395 613549 591673 572700 555893 541028 527944 516192
60458 516192 505448 495964 488026 481158 474563 468314 463314 459843 456954 453745 450487 447834 445454 442310
60444 442310 438095 433686 430157 427907 426746 426204 425588 424180 421718 418603 415590 413416 412531 412823 413526
60429 413526 413751 413232 412424 411878 411699 411596 411190 410330 409299 408689 408853 409559 410435 411573 413328 415617 417955
60412 417955 420171 422529 424976 426849 427644 427678 427616 427698 427828 428094 428676 429427 430076 430831 432250 434409 436596
$$ packed form
60504F41135M557N673Q291J1946J5680J9257K3199K7922L3303L8945M4397M9174
60492I23479N2975N5884N7928N8456N6421N1470M4337L5863K6078J4597J646j1791
60480A367343k4695l6453m6651n4926o0994o4524o5056o2533n7975n3062m8816
60469G91658m4970m0746l5860l0687k5846k1876j8973j6807j4865j3084j1752
60458E16192j0744r484p938o868o595o249n000l471k889l209l258k653k380l144
60444D42310m215m409l529k250j161n42o16j408k462l115l013k174q85K92P03
60429D13526K25n19q08n46j79j03m06q60j031o10J64P06Q76J138J755K289K338
60412D17955K216K358K447J873P95L4o2Q2J30K66N82P51O49P55J419K159K187
$$ plain form
60395 436596 438074 438901 439826 441563 444345 448004 452177 456420 460308 463563 466088 467949 469401 470864 472684
60380 472684 474877 477143 479236 481217 483279 485413 487401 489164 490954 493105 495639 498196 500329 501822
60366 501822 502825 503702 504707 505778 506743 507772 509426 512093 515528 519192 523047 527742 533955 541795 550945
60351 550945 561212 572620 584945 597372 608767 618287 625612 630548 632590 631173 626396 619230 610827
60338 610827 601765 592186 582478 573409 565491 558570 552237 546447 541488 537448 533922 530264 526024 521203
60324 521203 516252 511881 508728 507004 506377 506187 505908 505570 505848 507581 511058 515845 521471 528244 537113
60309 537113 548595 562034 576143 590121 603963 617764 631125 643425 654435 664400 673608 682034
60297 682034 689206 694245 696102 694061 688034 678358 665477 650012 632872 614997 597091 579884 564434
$$ packed form
60395D36596J478Q27R25J737K782L659M173M243L888L255K525J861J452J463J820
60380D72684K193K266K093J981K062K134J988J763J790K151K534K557K133J493
60366E01822J003Q77J005J071R65J029J654K667L435L664L855M695O213P840R150
60351E50945J0267J1408J2325J2427J1395R520P325M936K042j417m777p166q403
60338F10827r062r579r708r069p918o921o333n790m959m040l526l658m240m821
60324E21203m951m371l153j724o27j90k79l38K78J733L477M787N626O773Q869
60309E37113J1482J3439J4109J3978J3842J3801J3361J2300J1010R965R208Q426
60297F82034P172N039J857k041o027r676j2881j5465j7140j7875j7906j7207j5450
$$ plain form
60284 564434 551594 541167 532101 523691 516254 510491 506557 503938 501875 499684 497047 494238 491814 489812
60270 489812 487533 484382 480718 477550 475597 474805 474583 474246 473489 472656 472418 472982 473846 474407 474447 473942 472962
60253 472962 472112 472485 474516 477202 479075 479749 479950 480327 480917 481630 482488 483260 483478 482947 481840 480291 478438
60236 478438 476817 476035 475872 475345 474005 472722 472795 474620 477539 480798 484208 487892 491627 494721 496685
60221 496685 497986 499738 502520 505883 509345 513330 518503 524532 530317 535314 539877 544347 548768 553594
60207 553594 559743 567497 576005 584213 591697 598271 603567 607591 611124 614903 618744 622010 624550 626576
60193 626576 627846 627678 625778 622634 618967 615048 610630 605478 600018 595334 592178 590025 587575 584230
60179 584230 580508 576876 572954 568408 563980 560875 559377 558711 558120 557518 557176 557278 557782 558357 558489 557940
$$ packed form
60284E64434j2840j0427r066q410p437n763l934k619k063k191k637k809k424k002
60270D89812k279l151l664l168j953p92k22l37p57q33k38N64Q64N61M0n05r80
60253D72962q50L73K031K686J873O74K01L77N90P13Q58P72K18n31j107j549j853
60236D78438j621p82j63n27j340j283P3J825K919L259L410L684L735L094J964
60221D96685J301J752K782L363L462L985N173O029N785M997M563M470M421M826
60207E53594O149P754Q508Q208P484O574N296M024L533L779L841L266K540K026
60193F26576J270j68j900l144l667l919m418n152n460m684l156k153k450l345
60179E84230l722l632l922m546m428l105j498o66n91o02l42J02N04N75J32n49
$$ plain form
60163 557940 556992 556023 555067 554110 553546 553829 554735 555442 555423 555027 555129 556372 558651 561177 563087 564134 564739
60146 564739 565442 566568 568339 570825 573679 576473 579423 583164 587614 591842 595524 599740 605565 612570
60132 612570 619556 626243 633152 640177 646366 651015 653968 654960 653793 651345 649293 648453 648217 647921 647819
60117 647819 648284 648922 649194 649295 649726 650476 651251 652045 652822 652988 651918 649867 647653 645462 642648 638783 634293
60100 634293 629792 625286 620476 615617 611600 609139 608142 607999 608305 609076 610397 612126 613997 615826 617509
60085 617509 619060 620757 623012 625864 628768 631114 632730 633632 633535 632062 629308 625724 621440 616166 609815
60070 609815 602817 595671 588585 581696 575231 569224 563364 557420 551671 546622 542351 538332 533916 528960
60056 528960 523966 519644 516310 513804 512016 511217 511651 513000 514644 516413 518765 522229 526925 532491 538134
$$ packed form
60163E57940r48r69r56r57n64K83R06P07j9l96J02J243K279K526J910J047O05
60146E64739P03J126J771K486K854K794K950L741M450M228L682M216N825P005
60132F12570O986O687O909P025O189M649K953R92j167k448k052q40k36k96j02
60117F47819M65O38K72J01M31P50P75P94P77J66j070k051k214k191k814l865m490
60100F34293m501m506m810m859m017k461r97j43L06P71J321J729J871J829J683
60085F17509J551J697K255K852K904K346J616R02r7j473k754l584m284n274o351
60070F09815o998p146p086o889o465o007n860n944n749n049m271m019m416m956
60056E28960m994m322l334k506j788p99M34J349J644J769K352L464M696N566N643
$$ plain form
60041 538134 542828 546017 548245 550686 553847 557010 559001 559152 557470 554408 550835 547827 545983 544968
60027 544968 543906 542100 539242 535214 530018 523855 517031 509744 502070 494165 486400 479267 473025 467407
60013 467407 461861 456283 451391 448022 446070 444505 442498 440247 438600 438122 438632 439414 439781 439613 439388 439572
59997 439572 440102 440703 441483 442757 444399 445958 447395 449084 450975 452490 453544 454960 457403 460409 463006
59982 463006 464866 466216 466966 466638 465134 462999 460847 458850 456838 454661 452468 450760 450025 450170 450558
59967 450558 450800 451229 452345 454085 456002 457878 459785 461825 464253 467550 471846 476396 480196 483011 485259
59952 485259 487008 487734 487171 485774 484146 482520 480998 479843 479176 478674 477879 476543 474485 471463 467527
59937 467527 463314 459622 456705 454251 452026 450355 449879 450927 453207 456153 459547 463713 468994 475213
$$ packed form
60041E38134M694L189K228K441L161L163J991J51j682l062l573l008j844j015
60027E44968j062j806k858m028n196o163o824p287p674p905p765p133o242n618
60013D67407n546n578m892l369j952j565k007k251j647m78N10P82L67j68k25J84
59997D39572N30O01P80J274J642J559J437J689J891J515J054J416K443L006K597
59982D63006J860J350P50l28j504k135k152j997k012k177k193j708p35J45L88
59967D50558K42M29J116J740J917J876J907K040K428L297M296M550L800K815K248
59952D85259J749P26n63j397j628j626j522j155o67n02p95j336k058l022l936
59937D67527m213l692k917k454k225j671m76J048K280K946L394M166N281O219
$$ plain form
59923 475213 481759 488024 493443 497268 498822 498194 496351 494369 492746 491571 491001 491217 492137 493526 495395
59908 495395 498010 501448 505342 509119 512368 515027 517289 519350 521134 522337 522811 522850 522934 523250 523652 524053
59892 524053 524670 525832 527716 530281 533315 536493 539637 543007 547143 552256 557918 563601 569433 576105
59878 576105 584018 592706 601166 608593 614800 620114 624973 629448 633067 635221 635806 635255 633959 631966 629408
59863 629408 626877 624967 623559 621946 619636 616740 613619 610552 607773 605483 603658 602109 600933 600678
59849 600678 601882 604645 608851 614598 622001 630538 638873 645505 649563 651014 650309 648092 645234 642885
59835 642885 642113 643279 645801 648564 650534 651048 649845 647130 643556 639888 636583 633646 630721 627223 622576
59820 622576 616661 609997 603320 597035 591246 586073 581601 577577 573580 569456 565292 561034 556581 552236
$$ packed form
59923D75213O546O265N419L825J554o28j843j982j623j175n70K16R20J389J869
59908D95395K615L438L894L777L249K659K262K061J784J203M74L9Q4L16M02M01
59892E24053O17J162J884K565L034L178L144L370M136N113N662N683N832O672
59878E76105P913Q688Q460P427O207N314M859M475L619K154N85n51j296j993k558
59863F29408k531j910j408j613k310k896l121l067k779k290j825j549j176k55
59849F00678J204K763M206N747P403Q537Q335O632M058J451p05k217k858k349
59835F42885p72J166K522K763J970N14j203k715l574l668l305k937k925l498m647
59820F22576n915o664o677o285n789n173m472m024l997m124m164m258m453m345
$$ plain form
59806 552236 548531 545476 542453 539044 535510 532246 529260 526499 524218 522528 520890 518552 515357 511773
59792 511773 508309 505286 502985 501507 500454 499156 497384 495586 494361 493841 493642 493335 492939 492924 493626 494730
59776 494730 495555 495935 496458 497733 499786 502412 505727 509948 514827 519709 524079 527796 531031 534252 538022
59761 538022 542447 547036 551435 555996 561199 566840 572391 577924 583953 590416 596555 601890 606700 611407
59747 611407 616149 621170 626955 633529 640055 645597 650028 653875 657528 660855 663423 664844 665138 664889 664812
59732 664812 665031 665077 664660 664051 663504 662803 661678 660272 658910 657859 657629 658865 661274 663179 662981 660882
59716 660882 658351 656118 653698 650950 648924 648512 649046 649026 647846 646137 644659 643537 642476 641086 638948
59701 638948 635952 632716 630224 628877 628237 627832 627724 627983 628069 627316 625832 624403 623424 622444 620920 618992
$$ packed form
59806E52236l705l055l023l409l534l264k986k761k281j690j638k338l195l584
59792E11773l464l023k301j478j053j298j772j798j225n20j99l07l96j5P02J104
59776D94730Q25L80N23J275K053K626L315M221M879M882M370L717L235L221L770
59761E38022M425M589M399M561N203N641N551N533O029O463O139N335M810M707
59747F11407M742N021N785O574O526N542M431L847L653L327K568J421K94k49p7
59732F64812K19M6m17o09n47p01j125j406j362j051k30J236K409J905j98k099
59716F60882k531k233k420k748k026m12N34k0j180j709j478j122j061j390k138
59701F38948k996l236k492j347o40m05j08K59Q6p53j484j429r79r80j524j928
$$ plain form
59685 618992 617162 615538 613821 611952 610262 608879 607361 605180 602315 599054 595346 590721 584896 578166
59671 578166 571134 564295 558076 553013 549493 547312 545718 544038 542084 539913 537480 534764 532142 530297
59657 530297 529635 529989 530978 532521 534775 537615 540470 542832 544784 546796 548960 550630 550972 549762 547490
59642 547490 544734 541642 538100 534228 530495 527377 524962 522926 520915 519000 517726 517565 518296 519117 519422
59627 519422 519273 518939 518213 516545 513792 510477 507242 504379 502021 500433 499673 499074 497532 494595 491126
59612 491126 488631 487904 488403 488960 488915 488513 488396 488955 490131 491617 493169 494845 496903 499304 501373 502258
59596 502258 501886 501238 501514 503161 505770 508596 510976 512515 513246 513563 513799 514008 514254 514814 515771 516683 517024
59579 517024 516763 516100 514913 513070 511109 509849 509280 508503 507020 505410 504347 503509 502080 500082 498634
$$ packed form
59685F18992j830j624j717j869j690j383j518k181k865l261l708m625n825o730
59671E78166p032o839o219n063l520k181j594j680j954k171k433k716k622j845
59657E30297o62L54R89J543K254K840K855K362J952K012K164J670L42j210k272
59642E47490k756l092l542l872l733l118k415k036k011j915j274j61P31Q21L05
59627E19422j49l34p26j668k753l315l235k863k358j588p60n99j542k937l469
59612D91126k495p27M99N57m5m02j17N59J176J486J552J676K058K401K069Q85
59596E02258l72o48K76J647K609K826K380J539P31L17K36K09K46N60R57R12L41
59579E17024k61o63j187j843j961j260n69p77j483j610j063q38j429j998j448
$$ plain form
59564 498634 498831 500660 503083 504981 505993 506481 506756 506586 505621 504075 502494 500993 499291 497569 496642 496979
59548 496979 498086 499261 500515 502359 505115 508971 514385 521769 530879 541193 552990 567545 585886
59535 585886 607352 629330 648257 661154 666816 666052 660915 653603 645816 638719 633132 629615 628285
59522 628285 628598 629534 630339 630933 631257 630457 627395 622079 615827 609657 603175 595491 586661 577504 568533 559841
59506 559841 551807 545046 539613 534891 530316 525751 521170 516612 512486 509322 507080 505184 503385 502027
59492 502027 501281 500657 499701 498755 498562 499283 500336 501196 501970 503068 504515 505877 506988 508610 511945 517329
59476 517329 523620 529234 533693 537810 542466 547567 552356 556309 559440 561924 563845 565428 567247 569879
59462 569879 573282 576755 579737 582510 585862 590184 595293 601091 607822 615452 623238 630332 636536 642205
$$ packed form
59564D98634J97J829K423J898J012M88K75j70r65j546j581j501j702j722r27L37
59548D96979J107J175J254J844K756L856N414P384R110J0314J1797J4555J8341
59535E85886K1466K1978J8927J2897N662p64n137p312p787p097n587l517j330
59522F28285L13R36Q05N94L24q00l062n316o252o170o482p684q830r157q971q692
59506E59841q034o761n433m722m575m565m581m558m126l164k242j896j799j358
59492E02027p46o24r56r46j93P21J053Q60P74J098J447J362J111J622L335N384
59476E17329O291N614M459M117M656N101M789L953L131K484J921J583J819K632
59462E69879L403L473K982K773L352M322N109N798O731P630P786P094O204N669
$$ plain form
59448 642205 647616 652671 656934 659714 660454 659362 657243 654371 650000 643518 635664 627874 620770 614099
59434 614099 607992 603308 600584 599434 599324 600261 602359 605259 608498 612216 617147 624009 633057 644045
59420 644045 656458 669921 684534 700722 718734 738411 759562 782493 808042 836685 866986
59409 866986 894742 914353 921939 917415 903694 884542 863566 844362 830118 822756 822876 830273 843373
59396 843373 858058 868350 869402 859954 842020 818965 794161 770465 749671 732147 717302 704501
59384 704501 693484 684189 676459 669951 664245 659146 654843 651606 649332 647564 645883 644025 641775 639170
59370 639170 636835 635718 636352 638530 641589 644793 647711 650701 654768 660419 666856 672922 678649 685095
59356 685095 692872 701824 712146 724575 739047 754266 769286 784727 801637 819786 837798 854532
$$ packed form
59448F42205N411N055M263K780P40j092k119k872m371o482p854p790p104o671
59434F14099o107m684k724j150j10R37K098K900L239L718M931O862R048J0988
59420F44045J2413J3463J4613J6188J8012J9677K1151K2931K5549K8643L0301
59409H66986K7756J9611P586m524j3721j9152k0976j9204j4244p362J20P397J3100
59396H43373J4685J0292J052r448j7934k3055k4804k3696k0794j7524j4845j2801
59384G04501j1017r295p730o508n706n099m303l237k274j768j681j858k250k605
59370F39170k335j117O34K178L059L204K918K990M067N651O437O066N727O446
59356F85095P777Q952J0322J2429J4472J5219J5020J5441J6910J8149J8012J6734
$$ plain form
59344 854532 869617 883043 894972 905696 915113 922414 926784 928214 927073 923147 915709 904520 890254
59331 890254 873937 856356 838014 819295 800531 782065 764185 747013 730656 715533 702135
59320 702135 690306 679172 668101 657413 647811 639453 631970 625042 618587 612592 607197 602804 599798
59307 599798 598286 598256 599675 602305 605899 610879 618329 628908 642236 657672 674917 692957 708920
59294 708920 719096 721290 715702 703868 687721 669668 652373 637658 625814 616278 608674 603048
59282 603048 599488 597908 598101 599873 603203 608296 615325 624166 634575 646508 659974 674557 689458
59269 689458 704059 718182 731729 744335 755487 764800 772097 777395 780899 782826 783105 781375 777459
59256 777459 771822 765433 759070 752841 746467 739977 733879 728567 723891 719638 716189 714279 714203 715684 718435
$$ packed form
59344H54532J5085J3426J1929J0724R417P301M370J430j141l926p438j1189j4266
59331H90254j6317j7581j8342j8719j8764j8466j7880j7172j6357j5123j3398
59320G02135j1829j1134j1071j0688r602q358p483o928o455n995n395m393l006
59307E99798j512l0J419K630L594M980P450J0579J3328J5436J7245J8040J5963
59294G08920J0176K194n588j1834j6147j8053j7295j4715j1844r536p604n626
59282F03048l560j580J93J772L330N093P029Q841J0409J1933J3466J4583J4901
59269F89458J4601J4123J3547J2606J1152R313P297N298L504J927K79j730l916
59256G77459n637o389o363o229o374o490o098n312m676m253l449j910p6J481K751
$$ plain form
59241 718435 722267 726679 731013 735263 740132 745896 751687 756218 758823 759483 758281 755208 750189 743072
59227 743072 733983 723829 713781 703926 693136 680834 668152 656661 646596 637263 628628 621398
59215 621398 615755 611114 607143 603964 601256 598161 594450 590970 588536 587016 585895 585140 584986 585298 585698
59200 585698 586090 586670 587570 588783 590292 592034 593852 595671 597618 599761 601866 603633 605140 606893 609333
59185 609333 612362 615414 618029 620251 622406 624577 626491 627856 628570 628655 628376 628416 629471 631440 633486 635129
59169 635129 636895 639661 643732 648819 654320 659257 662577 664125 664878 665604 665671 663911 660220 655440 649964
59154 649964 643471 635985 628144 620231 611878 603104 594923 588429 583747 580169 576849 573078 568433 563099
59140 563099 557760 552807 547914 542621 537100 532043 528001 525070 523037 521599 520560 520011 520287 521657 524072
$$ packed form
59241G18435L832M412M334M250M869N764N791M531K605O60j202l073n019p117
59227G43072r089j0154j0048r855j0790j2302j2682j1491j0065r333q635p230
59215F21398n643m641l971l179k708l095l711l480k434j520j121p55j54L12M00
59200E85698L92N80R00J213J509J742J818J819J947K143K105J767J507J753K440
59185F09333L029L052K615K222K155K171J914J365P14Q5k79M0J055J969K046J643
59169F35129J766K766M071N087N501M937L320J548P53P26O7j760l691m780n476
59154F49964o493p486p841p913q353q774q181o494m682l578l320l771m645n334
59140E63099n339m953m893n293n521n057m042k931k033j438j039n49K76J370K415
$$ plain form
59125 524072 527228 530795 534694 539236 544900 551831 559715 568267 577543 587555 597914 608287 618932
59112 618932 630231 641887 653222 664186 675358 686845 697774 707124 714583 720382 724769 727966
59100 727966 730273 731823 732361 731466 728966 725141 720695 716463 712874 709729 706792 704517 703706 704368 705343
59085 705343 705267 703584 700473 696191 690792 684345 677076 669279 661227 653213 645672 639117 633765 629187 624594
59070 624594 619608 614527 609718 605167 600867 597212 594507 592428 590446 588509 586742 584820 582364 579725
59056 579725 577582 575816 573644 570943 568572 567126 566170 565135 564287 564205 564736 565061 564695 563964 563512 563546 563689
59039 563689 563547 563363 563792 564897 565790 565798 565722 567178 570674 575041 578939 582351 586349 591923 599361 608429
59023 608429 618810 630545 644045 659355 675360 690199 702562 712233 719353 723753 725266 724153
$$ packed form
59125E24072L156L567L899M542N664O931P884Q552R276J0012J0359J0373J0645
59112F18932J1299J1656J1335J0964J1172J1487J0929R350P459N799M387L197
59100G27966K307J550N38q95k500l825m446m232l589l145k937k275q11O62R75
59085G05343p6j683l111m282n399o447p269p797q052q014p541o555n352m578m593
59070F24594m986n081m809m551m300l655k705k079j982j937j767j922k456k639
59056E79725k143j766k172k701k371j446r56j035q48q2N31L25l66p31m52L4J43
59039E63689j42j84M29J105Q93Qp6J456L496M367L898L412L998N574P438R068
59023F08429J0381J1735J3500J5310J6005J4839J2363R671P120M400J513j113
$$ plain form
59011 724153 720866 715730 709139 701762 694231 686904 680198 674958 672122 672061 674359 678171 682766 687913 693753
58996 693753 700232 706729 712437 717029 720696 723646 725869 727276 727750 727096 725249 722412 718806 714467 709601
58981 709601 704851 700831 697694 695615 695325 697463 701691 707113 713425 720925 729641 739287 749973 761985
58967 761985 774860 787526 799542 811374 823367 835267 846879 858313 869299 879036 886908 892594
58955 892594 895370 894302 889412 881698 871634 858637 842536 824591 806377 788451 770816 753942
58943 753942 738471 724477 711815 700857 692189 685793 681059 677358 674234 671399 668952 667299 666550
58930 666550 666328 666349 666700 667329 667851 668123 668355 668396 667657 666139 664741 663972 663083 661159 658430 655836 653858
58913 653858 652419 651449 650853 650354 650005 650425 652053 654720 658494 664252 672589 682776 693720 705512 719053
$$ packed form
59011G24153l287n136o591p377p531p327o706n240k836o1K298L812M595N147N840
58996F93753O479O497N708M592L667K950K223J407M74o54j847k837l606m339m866
58981G09601m750m020l137k079k90K138M228N422O312P500Q716R646J0686J2012
58967G61985J2875J2666J2016J1832J1993J1900J1612J1434J0986R737P872N686
58955H92594K776j068m890p714j0064j2997j6101j7945j8214j7926j7635j6874
58943G53942j5471j3994j2662j0958q668o396m734l701l124k835k447j653p49
58930F66550k22K1L51O29N22K72K32M1p39j518j398p69q89j924k729k594j978
58913F53858j439r70n96m99l49M20J628K667L774N758Q337J0187J0944J1792J3541
$$ plain form
58898 719053 734424 750578 766509 781906 796764 811209 825785 841248 857912 875623 894282
58887 894282 913949 934486 955462 976259 995899 1013063 1026775 1036966 1044001 1047869 1048147 1044504
58875 1044504 1036881 1025502 1011088 994704 977118 958692 940201 923118 908549 896470 886539 878954
58863 878954 873710 869606 865042 859494 853377 846754 839127 830310 820612 810278 799618 789516 780848
58850 780848 773358 765987 758390 751273 745044 738999 732203 724490 716162 707164 697084 685751 673576
58837 673576 661384 649972 639736 630717 623029 616974 612521 609013 605766 602747 600300 598515 597332
58824 597332 597027 598026 600251 603135 606249 609612 613439 617921 623154 628967 634877 640392 645273 649384 652593
58809 652593 655000 656866 658168 658617 658318 657836 657286 655938 653173 649236 644600 639259 633239 627165 621593
$$ packed form
58898G19053J5371J6154J5931J5397J4858J4445J4576J5463J6664J7711J8659
58887H94282J9667K0537K0976K0797J9640J7164J3712J0191P035L868K78l643
58875A044504p623j1379j4414j6384j7586j8426j8491j7083j4569j2079r931p585
58863H78954n244m104m564n548o117o623p627q817r698j0334j0660j0102q668
58850G80848p490p371p597p117o229o045o796p713q328q998j0080j1333j2175
58837F73576j2192j1412j0236r019p688o055m453l508l247l019k447j785j183
58824E97332l05R99K225K884L114L363L827M482N233N813N910N515M881M111L209
58809F52593K407J866J302M49k99m82n50j348k765l937m636n341o020o074n572
$$ plain form
58794 621593 616252 610656 604901 599136 592889 585923 579294 574492 571825 570580 570402 571390 573055 574507 575808
58779 575808 578048 581734 585971 589576 592316 594774 597444 600155 601924 601415 598057 592749 587004 581496
58765 581496 575899 569942 563989 558684 554660 552468 552136 552854 553742 554874 556957 560123 563692 567023 569909
58750 569909 572234 573969 575485 577241 579153 580887 582620 584795 587250 589436 591571 594761 599729 606042
58736 606042 612769 619398 625954 632762 640206 648333 656643 664622 672366 680273 688276 695868 702730 708808
58722 708808 713981 718234 722071 726193 730938 736505 743388 751918 761567 771321 780548 788927 795903 800907
58708 800907 803827 804545 802424 797098 789417 780597 770650 758578 743913 727072 708447 688319 667619
58695 667619 647702 629199 611972 596166 582346 570550 560167 550863 542744 535615 528978 522831
$$ packed form
58794F21593n341n596n755n765o247o966o629m802k667j245j78R88J665J452J301
58779E75808K240L686M237L605K740K458K670K711J769n09l358n308n745n508
58765E81496n597n957n953n305m024k192l32P18Q88J132K083L166L569L331K886
58750E69909K325J735J516J756J912J734J733K175K455K186K135L190M968O313
58736F06042O727O629O556O808P444Q127Q310P979P744P907Q003P592O862O078
58722G08808N173M253L837M122M745N567O883Q530R649R754R227Q379O976N004
58708H00907K920P18k121n326p681q820r947j2072j4665j6841j8625k0128k0700
58695F67619j9917j8503j7227j5806j3820j1796j0383r304q119p129o637o147
$$ plain form
58683 522831 517614 513313 509521 506350 504356 503517 503159 502937 502998 503260 503485 504046 505688 508551 512374 517523
58667 517523 524752 534075 544971 557551 572173 587950 602960 616003 626868 634870 638763 638410 635063
58654 635063 629654 622221 613392 604800 597325 590293 583099 576346 570638 565487 560291 555368 551346 548463
58640 548463 546975 547157 548364 549277 549621 550367 551661 552019 550473 548056 546063 544166 541505 538461 535932
58625 535932 533765 531348 529065 527844 527829 528710 530781 534395 538844 543082 547309 552643 559386 566625 573477
58610 573477 579687 585014 588909 591058 591756 591650 591370 591193 590756 589324 586671 583406 580288 577651 575664
58595 575664 574483 573827 573065 572124 571774 572690 574867 578229 582960 588865 595258 602100 610377 620718 632344
58580 632344 643969 654971 665142 674221 682428 690595 698839 705883 710676 714148 718433 724843 733421
$$ packed form
58683E22831n217m301l792l171j994q39l58k22O1K62K25N61J642K863L823N149
58667E17523P229R323J0896J2580J4622J5777J5010J3043J0865Q002L893l53l347
58654F35063n409p433q829q592p475p032p194o753n708n151n196m923m022k883
58640E48463j488J82J207R13L44P46J294L58j546k417j993j897k661l044k529
58625E35932k167k417k283j221j5Q81K071L614M449M238M227N334O743P239O852
58610E73477O210N327L895K149O98j06k80j77m37j432k653l265l118k637j987
58595E75664j181o56p62r41l50R16K177L362M731N905O393O842Q277J0341J1626
58580F32344J1625J1002J0171R079Q207Q167Q244P044M793L472M285O410Q578
$$ plain form
58567 733421 743973 756569 771369 788813 809690 834284 861648 890259 918996 946910 972539
58556 972539 994226 1010903 1022067 1027481 1027531 1023552 1017187 1009630 1001742 994280 987450 980641 973128 964634
58542 964634 954906 943406 929878 914630 897808 879104 858716 837932 818109 799672 782631 767384
58530 767384 754379 743562 734774 728123 723488 720262 718114 717257 717428 717411 716257 714308 712353 710493 708455
58515 708455 706275 703958 701139 697743 694338 691275 688209 685035 682393 680580 678882 676751 674748 673510
58501 673510 672743 672023 671656 671713 671153 669051 666053 663588 662281 662037 662889 664720 666855 669010 672029 676677
58485 676677 682385 688241 694570 702442 712211 723581 736524 750914 765728 779720 792518 804132
58473 804132 813822 820406 823293 822436 817830 809939 800042 789380 778563 768442 760521 755424 751894 748586
$$ packed form
58567G33421J0552J2596J4800J7444K0877K4594K7364K8611K8737K7914K5629
58556I72539K1687J6677J1164N414N0l979o365p557p888p462o830o809p513q494
58542I64634r728j1500j3528j5248j6822j8704k0388k0784j9823j8437j7041j5247
58530G67384j3005j0817q788o651m635l226k148q57J71j7j154j949j955j860k038
58515G08455k180k317k819l396l405l063l066l174k642j813j698k131k003j238
58501F73510p67p20l67N7n60k102k998k465j307k44Q52J831K135K155L019M648
58485F76677N708N856O329P872R769J1370J2943J4390J4814J3992J2798J1614
58473H04132R690O584K887q57m606p891r897j0662j0817j0121p921n097l530l308
$$ plain form
58459 748586 746121 746141 749059 754104 761029 770295 781815 794646 807728 819964 829983 836736 840017
58446 840017 839781 835708 828265 819306 810559 802264 794235 787213 781985 778137 775059 773263 773234 773840 773601
58431 773601 772929 773486 775853 779486 784515 791782 801147 811247 820949 829831 837402 843068 846816 848893
58417 848893 848997 846709 842363 836604 829596 821564 813418 805794 798110 789724 781302 773925 767596 761872
58403 761872 757201 754301 752903 752393 752982 754936 757472 759824 762588 766632 771415 775861 780007 784252 787845
58388 787845 789767 790341 790428 789927 788808 788665 791222 795939 800941 805733 811264 818063 826153 835986 847448
58373 847448 858672 867925 876047 884964 894475 902792 909680 916748 924921 933872 943683 954797 966452
58360 966452 977213 987062 997124 1007528 1017262 1025782 1032966 1038040 1040489 1041540 1042766 1043815 1043537 1042664
$$ packed form
58459G48586k465K0K918N045O925R266J1520J2831J3082J2236J0019O753L281
58446H40017k36m073p443q959q747q295q029p022n228l848l078j796k9O06k39
58431G73601o72N57K367L633N029P267R365J0100R702Q882P571N666L748K077
58417H48893J04k288m346n759p008q032q146p624p684q386q422p377o329n724
58403G61872m671k900j398n10N89J954K536K352K764M044M783M446M146M245L593
58388G87845J922N74Q7n01j119j43K557M717N002M792N531O799Q090R833J1462
58373H47448J1224R253Q122Q917R511Q317O888P068Q173Q951R811J1114J1655
58360I66452J0761R849J0062J0404R734Q520P184N074K449J051J226J049k78q73
$$ plain form
58346 1042664 1043151 1045461 1048795 1053370 1060085 1068380 1076943 1086173 1097606 1111290 1126071 1141935 1159572
58333 1159572 1178101 1195779 1212517 1229120 1244543 1256721 1265703 1273190 1279289 1282672 1283822 1285183
58321 1285183 1287993 1291553 1295466 1300007 1304528 1308243 1312348 1318663 1326546 1334008 1341433 1351162 1363749 1377695
58307 1377695 1392499 1408705 1425317 1440544 1454933 1470510 1487098 1502851 1517992 1534360 1551619
58296 1551619 1567754 1583102 1599914 1618086 1635461 1652292 1671127 1692122 1712857 1733131 1755473
58285 1755473 1780337 1805189 1829098 1853947 1880386 1906891 1933523 1962291 1992987 2023036 2052273
58274 2052273 2083559 2117943 2153645 2190496 2230632 2273970 2317810 2361891 2409036 2459875 2511944
58263 2511944 2564945 2621675 2682477 2744043 2805017 2867539 2931873 2995006 3056178 3118444 3183157
$$ packed form
58346A042664M87K310L334M575O715Q295Q563R230J1433J3684J4781J5864J7637
58333A159572J8529J7678J6738J6603J5423J2178Q982P487O099L383J150J361
58321A285183K810L560L913M541M521L715M105O315P883P462P425R729J2587J3946
58307A377695J4804J6206J6612J5227J4389J5577J6588J5753J5141J6368J7259
58296A551619J6135J5348J6812J8172J7375J6831J8835K0995K0735K0274K2342
58285A755473K4864K4852K3909K4849K6439K6505K6632K8768L0696L0049K9237
58274B052273L1286L4384L5702L6851M0136M3338M3840M4081M7145N0839N2069
58263B511944N3001N6730O0802O1566O0974O2522O4334O3133O1172O2266O4713
$$ plain form
58252 3183157 3248277 3313598 3382088 3454535 3528640 3604900 3687471 3777645 3872571 3971887 4079067
58241 4079067 4194686 4315294 4440754 4575427 4720139 4870495 5025446 5189685 5365151
58232 5365151 5548350 5738950 5942684 6162561 6395625 6641638 6906215 7192058 7496273
58223 7496273 7820038 8171375 8554551 8966584 9408250 9888160 10411934 10978618 11592520
58214 11592520 12267061 13012274 13831090 14733294 15740046 16869548 18133138 19551934 21162243
58205 21162243 22999126 25093160 27491880 30266909 33494215 37251174 41644354 46818931
58197 46818931 52935983 60177890 68801673 79172046 91747774 107089902 125900858
58190 125900858 148989162 177139390 210996732 250881924 296179972 344306380 390138343
$$ packed form
58252C183157O5120O5321O8490P2447P4105P6260Q2571R0174R4926R9316J07180
58241D079067J15619J20608J25460J34673J44712J50356J54951J64239J75466
58232E365151J83199J90600K03734K19877K33064K46013K64577K85843L04215
58223G496273L23765L51337L83176M12033M41666M79910N23774N66684O13902
58214A1592520O74541P45213Q18816R02204J006752J129502J263590J418796J610309
58205B1162243J836883K094034K398720K775029L227306L756959M393180N174577
58197D6818931O117052P241907Q623783J0370373J2575728J5342128J8810956
58190A25900858K3088304K8150228L3857342L9885192M5298048M8126408M5831963
$$ plain form
58183 390138343 426978449 448920452 453078225 440196458 413617837 377739658 336902509
58176 336902509 294819741 254292533 217122056 184232076 155900153 131964591 111992198
58169 111992198 95437483 81760078 70465568 61110920 53322515 46808108 41336144
58162 41336144 36711037 32774686 29411368 26530293 24047517 21891027 20009179 18360762
58154 18360762 16904180 15604347 14439946 13394203 12446397 11579973 10790056 10074559 9425026
58145 9425026 8832736 8295506 7811091 7371103 6968239 6602414 6273029 5971836 5689785
58136 5689785 5424579 5175442 4937093 4705457 4483604 4275785 4080773 3896518 3725651
58127 3725651 3570281 3426304 3288791 3158573 3038097 2925264 2816874 2714061 2619023 2530020
$$ packed form
58183C90138343L6840106K1942003M157773j2881767k6578621l5878179m0837149
58176C36902509m2082768m0527208l7170477l2889980k8331923k3935562j9972393
58169A11992198j6554715j3677405j1294510r354648p788405o514407n471964
58162D1336144m625107l936351l363318k881075k482776k156490j881848j648417
58154A8360762j456582j299833j164401j045743r47806q66424p89917p15497o49533
58145I425026n92290n37230m84415m39988m02864l65825l29385l01193k82051
58136E689785k65206k49137k38349k31636k21853k07819j95012j84255j70867
58127C725651j55370j43977j37513j30218j20476j12833j08390j02813r5038q9003
$$ plain form
58117 2530020 2444558 2363942 2289919 2220250 2152117 2086658 2025874 1968387 1912312 1858997 1809790
58106 1809790 1762388 1714399 1667434 1623713 1581777 1539474 1498181 1460085 1424107 1388395 1354142
58095 1354142 1323155 1294193 1265341 1237568 1212431 1188756 1165008 1142555 1123231 1105990 1089164
58084 1089164 1073584 1060175 1046880 1031271 1014023 996699 978433 957995 936900 917206 898308
58073 898308 878938 860148 843246 826955 809829 793383 779655 767651 755359 743363 733280
58062 733280 724489 715625 707590 701854 697255 691529 684612 677568 669840 660424 650316 640940 631572 621056
58048 621056 610537 601758 594159 586452 579464 574516 570493 565426 559608 554274 548652 541436 533920 528477
58034 528477 524881 521053 516511 512220 507897 502354 495828 489325 482443 474383 466234 459648 454085 448012
$$ packed form
58117B530020q5462q0616p4023o9669o8133o5459o0784n7487n6075n3315m9207
58106A809790m7402m7989m6965m3721m1936m2303m1293l8096l5978l5712l4253
58095A354142l0987k8962k8852k7773k5137k3675k3748k2453j9324j7241j6826
58084A089164j5580j3409j3295j5609j7248j7324j8266k0438k1095j9694j8898
58073H98308j9370j8790j6902j6291j7126j6446j3728j2004j2292j1996j0083
58062G33280q791q864q035n736m599n726o917p044p728r416j0108r376r368j0516
58048F21056j0519q779p599p707o988m948m023n067n818n334n622p216p516n443
58034E28477l596l828m542m291m323n543o526o503o882q060q149o586n563o073
$$ plain form
58020 448012 441920 437408 434056 430088 425558 422133 420109 418242 416190 414567 412973 410442 407632 406135
58006 406135 405807 405080 403736 403103 403511 403793 403376 403010 403348 404401 406320 409217 412446 415317 418036 420718
57990 420718 422368 422275 421418 420836 419696 416731 412448 407992 403004 396748 390231 384897 380184 374805 369524
57975 369524 366070 363976 361182 357352 354102 352211 351004 350261 350385 350821 350491 349640 349295 349296 348900 348785 350149
57958 350149 352290 353461 353650 354057 354251 352603 349365 346507 344440 341649 337818 334496 332179 329431 325771
57943 325771 322938 322305 323159 324576 327138 331766 338372 346509 355957 366075 375875 385229 394766 404388
57929 404388 413200 420844 427229 431026 430399 425547 418661 411063 402272 392182 382028 372528 362959 352933
57915 352933 343420 335192 327783 320789 314862 310672 308077 306853 307024 308052 309034 310030 311892 314445 316335
$$ packed form
58020D48012o092m512l352l968m530l425k024j867k052j623j594k531k810j497
58006D06135l28p27j344o33M08K82m17l66L38J053J919K897L229K871K719K682
57990D20718J650r3q57n82j140k965m283m456m988o256o517n334m713n379n281
57975C69524l454k094k794l830l250j891j207p43J24M36l30q51l45Jl96j15J364
57958C50149K141J171J89M07J94j648l238k858k067k791l831l322k317k748l660
57943C25771k833o33Q54J417K562M628O606Q137R448J0118R800R354R537R622
57929D04388Q812P644O385L797o27m852o886p598q791j0090j0154r500r569j0026
57915C52933r513q228p409o994n927m190k595j224J71J028R82R96J862K553J890
$$ plain form
57900 316335 317018 317362 317878 317968 317414 316997 317037 316917 316745 317941 321329 325998 330781 335557 340373 344625 348000
57883 348000 351068 354208 357035 359436 361914 364267 365224 364166 361999 359560 356415 352095 347344 343133
57869 343133 339413 335736 332239 329178 326297 323445 321104 319638 318773 318377 318896 320500 322603 324843 327684
57854 327684 331505 335916 340494 345328 350284 354533 357417 359091 359940 360163 360245 360817 361560 361216 359249 356635
57838 356635 354573 353325 352795 353151 354226 355261 355971 357061 359082 361560 363861 366035 368158 369672 370074
57823 370074 369619 368801 367794 366817 366274 366080 365613 364793 364346 364577 364728 363958 361953 358136 351447 341796 330799
57806 330799 320239 310492 301187 292570 285316 279511 274667 270341 266284 262400 258935 256154 253633 250660
57792 250660 247494 245227 244055 242884 241205 240094 240541 241890 242979 243874 245367 247584 250275 253869 259040
$$ packed form
57900C16335O83L44N16R0n54m17M0j20j72J196L388M669M783M776M816M252L375
57883C48000L068L140K827K401K478K353R57j058k167k439l145m320m751m211
57869C43133l720l677l497l061k881k852k341j466q65l96N19J604K103K240K841
57854C27684L821M411M578M834M956M249K884J674Q49K23Q2N72P43l44j967k614
57838C56635k062j248n30L56J075J035P10J090K021K478K301K174K123J514M02
57823C70074m55q18j007r77n43j94m67q20m47K31J51p70k005l817o689r651j0997
57806C30799j0560r747r305q617p254n805m844m326m057l884l465k781k521k973
57792B50660l166k267j172j171j679j111M47J349J089Q95J493K217K691L594N171
$$ plain form
57777 259040 265530 272355 278959 285369 291504 297116 302242 307085 311617 315742 319525 322808 324976 325531
57763 325531 324605 322629 319989 317233 314970 313189 311341 309419 308242 308269 308957 309739 310740 311945 312616 312415
57747 312415 312335 313569 315998 318561 320564 321853 322228 321568 320178 318291 315545 311572 306630 301169 295347
57732 295347 289664 285393 283461 283288 283511 283504 283499 283664 283919 284378 285132 285753 285716 285244 285124 285777 286928 288005 288482
57713 288482 288072 287004 285881 285028 284288 283667 283621 284328 285112 285022 283617 281029 277840 275087 273609 272954 271643
57696 271643 268927 265546 262437 259622 256903 254593 252704 250350 246890 242969 239507 236441 233459 231221
57682 231221 230575 231045 231422 231653 233037 236577 242140 249291 258196 269669 284939 305305 331553 363922
57668 363922 403086 450633 507713 573177 643096 711205 769157 807663 819751 804100 765207
$$ packed form
57777B59040O490O825O604O410O135N612N126M843M532M125L783L283K168N55
57763C25531r26j976k640k756k263j781j848j922j177K7O88P82J001J205O71k01
57747C12415q0J234K429K563K003J289L75o60j390j887k746l973m942n461n822
57732B95347n683m271j932j73K23pnJ65K55M59P54O21l7m72j20O53J151J077M77
57713B88482m10j068j123q53p40o21m6P07P84r0j405k588l189k753j478o55j311
57696B71643k716l381l109k815k719k310j889k354l460l921l462l066k982k238
57682B31221o46M70L77K31J384L540N563P151Q905J1473J5270K0366K6248L2369
57668C63922L9164M7547N7080O5464O9919O8109N7952L8506J2088j5651l8893
$$ plain form
57657 765207 710599 648067 584315 524200 470359 423864 385276 354696 331146 312770 297833
57646 297833 285272 274533 265408 257802 251278 245097 239138 234263 231212 229581 228448 227484 226733 225841
57632 225841 224424 222824 221616 220626 219302 217779 216717 216249 215878 215272 214439 213352 212110 211175 210700 209899
57616 209899 207918 205037 202188 199584 196857 194269 192687 192266 192232 192031 191895 192096 192470 192850 193321 193911 194585
57599 194585 195511 196738 197673 197520 196165 194048 191362 188147 185019 182856 181711 180782 179558 178270 177132
57584 177132 175878 174234 172289 170241 168258 166577 165254 163926 162254 160420 158637 156511 153620 150498
57570 150498 148214 147017 146252 145514 145036 144880 144528 143490 141729 139518 137354 135901 135384 135183 134650 134021
57554 134021 133811 133765 133366 132999 133430 134318 134537 134038 134073 135397 137417 139345 141004 142168 142373 141965 142230 143780
$$ packed form
57657G65207n4608o2532o3752o0115n3841m6495l8588l0580k3550j8376j4937
57646B97833j2561j0739r125p606o524o181n959m875l051j631j133r64p51q92
57632B25841j417j600j208r90j324j523j062m68l71o06q33j087j242r35m75q01
57616B09899j981k881k849k604k727k588j582m21l4k01j36K01L74L80M71N90O74
57599A94585R26J227R35j53j355k117k686l215l128k163j145r29j224j288j138
57584A77132j254j644j945k048j983j681j323j328j672j834j783k126k891l122
57570A50498k284j197p65p38m78j56l52j038j761k211k164j453n17k01n33o29
57554A34021k10m6l99l67M31Q88K19m99L5J324K020J928J659J164K05m08K65J550
$$ plain form
57536 143780 145651 146586 146442 145805 144966 143882 142550 140908 138922 137091 136085 135618 134572 132734 131436
57521 131436 131774 133139 134370 135583 137752 141026 144570 147858 151081 154303 157109 159303 161335 163720
57507 163720 166398 168813 170419 171050 170944 170430 169607 168430 167058 165833 164795 163567 161868 159890 158012
57492 158012 156404 155064 153933 152793 151325 149429 147340 145330 143553 142250 141733 141962 142355 142220 141289
57477 141289 139797 138192 136781 135557 134394 133490 133350 134095 135124 135842 136424 137327 138330 138714 138275 137481
57461 137481 136654 135606 134153 132463 130866 129765 129596 130315 131046 130862 129831 128722 127935 127448 127512 128408 129588
57444 129588 130160 130309 131203 133294 135703 137513 138649 139200 138978 138227 137776 137915 137968 137544 137323 137920 138775 138948
57426 138948 138401 137823 137680 138027 138778 139625 140181 140596 141426 142477 142579 141111 139062 137840 137637 137689 137638 137852
$$ packed form
57536A43780J871R35j44o37q39j084j332j642j986j831j006m67j046j838j298
57521A31436L38J365J231J213K169L274L544L288L223L222K806K194K032K385
57507A63720K678K415J606O31j06n14q23j177j372j225j038j228j699j978j878
57492A58012j608j340j131j140j468j896k089k010j777j303n17K29L93j35r31
57477A41289j492j605j411j224j163r04j40P45J029P18N82R03J003L84m39p94
57461A37481q27j048j453j690j597j101j69P19P31j84j031j109p87m87O4Q96J180
57444A29588N72J49Q94K091K409J810J136N51k22p51m51J39N3m24k21N97Q55J73
57426A38948n47n78j43L47P51Q47N56M15Q30J051J02j468k049j222k03N2n1K14
$$ plain form
57408 137852 138790 140765 143907 147661 150695 152039 152061 151758 151426 150642 149228 147531 145962 144793 144155 143749
57392 143749 142901 141457 140278 140284 141381 142904 144719 147075 149655 151628 152628 153028 153225 153201 152863 152397 152225
57375 152225 152790 154207 155888 156835 156627 155920 155666 156187 157237 158481 159525 160005 160142 160747 162105 163307
57359 163307 163304 162200 160907 159982 159506 159664 160589 161841 162883 163917 165501 167489 169125 170099 170830 171666 172469
57342 172469 172989 173145 172983 172839 173328 174623 175944 176406 176209 176251 176780 177237 177300 177208 177030 176486 175716 175383 175706
57323 175706 176043 175813 175277 175043 175226 175432 175345 175076 175111 175922 177394 178706 179115 178759 178258 177748 176913 175852
57305 175852 175169 175070 175018 174531 173780 173193 172960 173158 173895 175062 176358 177752 179559 181850 184199 186244 188127
57288 188127 190171 192417 194788 197332 199972 202233 203585 204050 204307 205158 206885 209000 210685 211621 212397
$$ packed form
57408A37852R38J975L142L754L034J344K2l03l32p84j414j697j569j169o38m06
57392A43749q48j444j179OJ097J523J815K356K580J973J000M00J97k4l38m66j72
57375A52225N65J417J681R47k08p07k54N21J050J244J044M80J37O05J358J202
57359A63307lj104j293r25m76J58R25J252J042J034J584J988J636R74P31Q36Q03
57342A72469N20J56j62j44M89J295J321M62j97M2N29M57O3r2j78n44p70l33L23
57323A75706L37k30n36k34J83K06q7k69L5Q11J472J312M09l56n01n10q35j061
57305A75852o83r9n2m87p51n87k33J98P37J167J296J394J807K291K349K045J883
57288A88127K044K246K371K544K640K261J352M65K57Q51J727K115J685R36P76
$$ plain form
57273 212397 213935 216579 219904 223256 226190 228503 230240 231694 233213 235035 237439 240687 244471 247764
57259 247764 249795 250984 252318 254055 255832 257884 261151 265904 271125 275727 279772 284126 289514 296275
57245 296275 304422 313332 321853 329308 336132 343115 350438 357941 365886 374619 383729 392295 400067 407765
57231 407765 416054 424735 433215 441373 449652 458490 467903 477558 487118 496543 506109 516135 526671 537484
57217 537484 548229 558611 568539 578335 588661 600003 612260 625104 638705 653762 670658 688815
57205 688815 707139 724954 742272 759258 775836 791936 807862 824081 840696 857343 873661
57194 873661 889731 905958 922640 939668 956612 973063 989054 1005216 1022491 1041541 1062390
57183 1062390 1084576 1107518 1130648 1153274 1174528 1193642 1210436 1225512 1239855 1254137 1268422
$$ packed form
57273B12397J538K644L325L352K934K313J737J454J519J822K404L248L784L293
57259B47764K031J189J334J737J777K052L267M753N221M602M045M354N388O761
57245B96275Q147Q910Q521P455O824O983P323P503P945Q733R110Q566P772P698
57231D07765Q289Q681Q480Q158Q279Q838R413R655R560R425R566J0026J0536J0813
57217E37484J0745J0382R928R796J0326J1342J2257J2844J3601J5057J6896J8157
57205F88815J8324J7815J7318J6986J6578J6100J5926J6219J6615J6647J6318
57194H73661J6070J6227J6682J7028J6944J6451J5991J6162J7275J9050K0849
57183A062390K2186K2942K3130K2626K1254J9114J6794J5076J4343J4282J4285
$$ plain form
57172 1268422 1282558 1296610 1310811 1325276 1340008 1355108 1370760 1387101 1404299 1422547 1441688
57161 1441688 1461012 1479826 1498193 1516734 1535806 1555348 1575390 1596111 1617288 1638352 1659256
57150 1659256 1680718 1703329 1726869 1750794 1774922 1799313 1823921 1848746 1873892 1899124 1923795
57139 1923795 1947634 1971183 1995010 2018959 2042773 2067076 2092978 2120906 2150477 2181490 2214463
57128 2214463 2250163 2289125 2331623 2377644 2426782 2478530 2532777 2589833 2650073 2713890 2781963
57117 2781963 2855253 2934753 3021452 3116373 3220383 3334202 3459091 3597503 3752747 3928205
57107 3928205 4127406 4354991 4617287 4922018 5278072 5696024 6189120 6774254 7473027
57098 7473027 8312816 9327233 10555431 12040492 13827726 15963086 18490888 21449671
$$ packed form
57172A268422J4136J4052J4201J4465J4732J5100J5652J6341J7198J8248J9141
57161A441688J9324J8814J8367J8541J9072J9542K0042K0721K1177K1064K0904
57150A659256K1462K2611K3540K3925K4128K4391K4608K4825K5146K5232K4671
57139A923795K3839K3549K3827K3949K3814K4303K5902K7928K9571L1013L2973
57128B214463L5700L8962M2498M6021M9138N1748N4247N7056O0240O3817O8073
57117B781963P3290P9500Q6699R4921J04010J13819J24889J38412J55244J75458
57107C928205J99201K27585K62296L04731L56054M17952M93096N85134O98773
57098G473027Q39789J014417J228198J485061J787234K135360K527802K958783
$$ plain form
57090 21449671 24866230 28749127 33082746 37822514 42892747 48188619 53580136 58913349
57082 58913349 64009852 68674918 72721797 76002656 78425951 79951442 80573447 80306318
57074 80306318 79174998 77209265 74446373 70945553 66804511 62162225 57185007 52046955
57066 52046955 46913998 41931258 37212652 32836482 28848768 25269569 22097952 19316815
57058 19316815 16899094 14812790 13022709 11491461 10182311 9061924 8100612 7271757
57050 7271757 6552744 5926040 5378194 4898062 4476484 4106502 3782295 3497918 3247666
57041 3247666 3026944 2831742 2657724 2500926 2359001 2230898 2115658 2012475 1921487 1843427
57031 1843427 1778691 1727817 1692624 1675730 1679129 1704372 1753278 1825108 1910482 1988931 2035497
$$ packed form
57090B1449671L416559L882897M333619M739768N070233N295872N391517N333213
57082E8913349N096503M665066M046879L280859K423295J525491O22005k67129
57074H0306318j131320j965733k762892l500820m141042m642286m977218n138052
57066E2046955n132957m982740m718606m376170l987714l579199l171617k781137
57058A9316815k417721k086304j790081j531248j309150j120387r61312q28855
57050G271757p19013o26704n47846m80132m21578l69982l24207k84377k50252
57041C247666k20722j95202j74018j56798j41925j28103j15240j03183r0988p8060
57031A843427o4736n0874l5193j6894L399K5243M8906P1830Q5374P8449M6566
$$ plain form
57020 2035497 2032471 1976796 1878308 1752606 1615021 1478074 1350627 1237269 1138601 1053068
57010 1053068 978968 915037 859989 812431 771290 735774 704833 677146 651711 628081 606000
56999 606000 585306 566181 548942 533388 518832 504952 492208 481304 472646 466441 462770 461412
56987 461412 462047 464859 470638 480174 493730 510702 528901 544285 552564 551682 542300 525928 503690
56974 503690 477204 449346 423015 399642 379500 362801 349702 339860 332912 329115 328816 331765 337704
56961 337704 347260 361434 380491 404121 432290 464682 499001 530485 553554 563946 559886 542362
56949 542362 514809 481971 448279 416659 388316 363336 341686 323917 310818 302456 298046 297044
56937 297044 299907 307498 320215 338212 362039 392491 429811 473003 519151 562880 597216 616154
$$ packed form
57020B035497l026n5675r8488j25702j37585j36947j27447j13358r8668q5533
57010A053068p4100o3931n5048m7558m1141l5516l0941k7687k5435k3630k2081
56999F06000k0694j9125j7239j5554j4556j3880j2744j0904q658o205l671j358
56987D61412O35K812N779R536J3556J6972J8199J5384Q279q82r382j6372k2238
56974E03690k6486k7858k6331k3373k0142j6699j3099r842o948l797k99K949N939
56961C37704R556J4174J9057K3630K8169L2392L4319L1484K3069J0392m060j7524
56949E42362k7553l2838l3692l1620k8343k4980k1650j7769j3099q362m410j002
56937B97044K863P591J2717J7997K3827L0452L7320M3192M6148M3729L4336J8938
$$ plain form
56925 616154 616928 600153 568802 527640 482529 438596 398544 363044 332328 306623 285500 267988
56913 267988 253454 241624 231764 222802 214424 207262 201705 197212 193139 189567 186931 185261 184264 183890
56899 183890 184447 186295 189576 194098 199398 205082 211220 218259 226561 236203 247322 260522 276906 297505
56885 297505 322242 349099 374459 394555 406695 409395 402272 386562 365394 342625 321059 301907
56873 301907 285706 273184 265160 262102 263993 270424 280870 295224 314313 339777 373274 415746
56861 415746 467334 527835 596864 672682 749974 819022 868514 890724 884724 855290 809593 754858
56849 754858 697492 642588 593642 552895 521604 499807 486592 481471 485282 499311 524084 559768
56837 559768 607351 668622 745219 838197 947484 1069648 1195225 1308927 1393759 1436506 1431647
$$ packed form
56925F16154P74j6775l1351m1162m5111m3933m0052l5500l0716k5705k1123j7512
56913B67988j4534j1830r860q962q378p162n557m493m073l572k636j670r97l74
56899A83890N57J848L281M522N300N684O138P039Q302R642J1119J3200J6384K0599
56885B97505K4737K6857K5360K0096J2140K700p123j5710k1168k2769k1566j9152
56873C01907j6201j2522q024l058J891O431J0446J4354J9089K5464L3497M2472
56861D15746N1588O0501O9029P5818P7292O9048M9492K2210o000k9434m5697n4735
56849G54858n7366n4904m8946m0747l1291k1797j3215n121L811J4029K4773L5684
56837E59768M7583O1271P6597R2978J09287J22164J25577J13702Q4832M2747m859
$$ plain form
56826 1431647 1382520 1299571 1196371 1085592 977044 877544 791048 718837 660542 615447 582734
56815 582734 561123 549404 547590 556818 577997 611169 656403 714571 786422 870279 959902 1044113
56803 1044113 1109332 1144306 1143991 1110047 1048735 968858 880302 792114 710430 638063 575855 523941
56791 523941 481994 449298 425138 408871 399741 397108 400970 411900 430530 457353 492496 534662
56779 534662 580142 623229 657707 677958 679821 662041 627324 581280 529931 478084 428984 384053
56767 384053 342965 305126 271344 243290 221462 204676 191511 181124 172589 164756 157279 150770
56755 150770 145546 141083 136992 133536 130724 127906 124785 121968 119957 118383 116769 115266 114106 113090
56741 113090 112147 111631 111523 111089 109964 108821 108282 107852 106710 105015 103722 103524 104566 106654 109068 110622
$$ packed form
56826A431647m9127q2949j03200j10779j08548r9500q6496p2211n8295m5095l2713
56815E82734k1611j1719j814R228K1179L3172M5234N8168P1851Q3857Q9623Q4211
56803A044113O5219L4974l15l3944o1312p9877q8556q8188q1684p2367o2208n1914
56791E23941m1947l2696k4160j6267r130k633L862J0930J8630K6823L5143M2166
56779E34662M5480M3087L4478K0251J863j7780l4717m6044n1349n1847m9100m4931
56767C84053m1088l7839l3782k8054k1828j6786j3165j0387q535p833p477o509
56755A50770n224m463m091l456k812k818l121k817k011j574j614j503j160j016
56741A13090r43n16j08m34j125j143n39m30j142j695j293j98J042K088K414J554
$$ plain form
56725 110622 110668 109791 108965 108399 107764 107085 106749 106882 107363 108231 109560 111132 112757 114631 116987 119628 122192
56708 122192 124592 126782 128477 129574 130471 131441 131955 131280 129591 127961 127267 127488 128017 128284 128132 127849 127857
56691 127857 128227 128688 129160 129997 131469 133245 134649 135288 135310 135170 135228 135448 135573 135698 136307 137372 137884 137106
56673 137106 135968 136190 138041 140068 141177 141800 142619 143394 143710 143882 144277 144587 144660 145299 147235 149863 151949
56656 151949 153229 154479 156271 158467 160681 162567 163800 164392 164830 165463 166057 166388 166850 167929 169453 170891
56640 170891 171984 172574 172277 171012 169435 168191 167115 165752 164195 162693 160918 158498 155936 154100 152976
56625 152976 151787 150241 148841 147979 147455 146942 146242 145097 143312 141152 139187 137786 137121 137426 138672 140165
56609 140165 141032 141048 140537 139696 138578 137589 137258 137499 137678 137500 137337 137644 138447 139441 140306 140894 141322 141786 142152
$$ packed form
56725A10622M6q77q26n66o35o79l36J33M81Q68J329J572J625J874K356K641K564
56708A22192K400K190J695J097Q97R70N14o75j689j630o94K21N29K67j52k83Q
56691A27857L70M61M72Q37J472J776J404O39K2j40N8K20J25J25O09J065N12p78
56673A37106j138K22J851K027J109O23Q19P75L16J72L95L10P3O39J936K628K086
56656A51949J280J250J792K196K214J886J233N92M38O33N94L31M62J079J524J438
56640A70891J093N90k97j265j577j244j076j363j557j502j775k420k562j836j124
56625A52976j189j546j400q62n24n13p00j145j785k160j965j401o65L05J246J493
56609A40165Q67J6n11q41j118r89l31K41J79j78j63L07Q03R94Q65N88M28M64L66
$$ plain form
56590 142152 142001 141307 140675 140618 140976 141411 142014 142963 144031 144955 145875 146865 147459 147307 146893 146915 147298 147581 147971
56571 147971 149134 151077 153053 154591 155978 157702 159976 162784 165887 168853 171554 174567 178667 184081
56557 184081 190516 197471 204062 209079 212021 213736 215315 216679 217097 216759 216776 217658 218719 219131 218804 218137
56541 218137 217556 217367 217442 217012 215451 213280 211745 211350 211355 210760 209211 206933 204371 201942 199672 197109 194058
56524 194058 191262 189728 189517 189826 190153 190693 191627 192670 193388 193437 192542 190793 188805 187041 185162 182657
56508 182657 179892 177727 176290 174971 173518 172260 171275 170291 169473 169412 170165 171085 171777 172450 173170 173566 173514
56491 173514 173394 173430 173451 173528 174182 175651 177471 178976 179804 179900 179576 179541 180210 181040 181261 181127 181560 182527 182883
56472 182883 182106 181163 181164 182037 183051 183913 184724 185476 186202 187217 188635 189956 190543 190295 189578 188819 188361 188346
$$ packed form
56590A42152j51o94o32n7L58M35O03R49J068R24R20R90N94j52m14K2L83K83L90
56571A47971J163J943J976J538J387J724K274K808L103K966K701L013M100N414
56557A84081O435O955O591N017K942J715J579J364M18l38J7Q82J061M12l27o67
56541B18137n81j89P5m30j561k171j535l95Nn95j549k278k562k429k270k563l051
56524A94058k796j534k11L09L27N40R34J043P18M9q95j749j988j764j879k505
56508A82657k765k165j437j319j453j258r85r84q18o1P53R20O92O73P20L96n2
56491A73514j20L6K1P7O54J469J820J505Q28R6l24l5O69Q30K21j34M33R67L56
56472A82883p77r43JQ73J014Q62Q11P52P26J015J418J321N87k48p17p59m58j5
$$ plain form
56454 188346 188551 188634 188688 189129 189949 190559 190536 190069 189509 188904 188229 187696 187648 188340 189862 191911 193667 194352 194005
56435 194005 193368 193085 193355 194111 194956 195110 194208 193102 193056 194095 194943 194758 194131 194092 194901 196193 197687 199255
56417 199255 200686 201734 202229 202040 201264 200452 200237 200711 201565 202698 204207 205907 207423 208703 209831 210489
56401 210489 210336 209809 209771 210347 210846 210809 210384 209651 208434 206876 205426 204224 203211 202766 203357 204533 205285
56384 205285 205518 206165 207653 209209 210011 210143 210151 210459 211493 213512 216076 218495 220897 223932 227286 229659
56368 229659 230524 230789 231237 231462 230965 230305 230338 231101 232162 233450 235062 236819 238570 240437 242334 243730
56352 243730 244327 244472 244630 244919 245368 246052 246813 247459 248300 249774 251525 252759 253546 254729 256443 257923 258995
56335 258995 260449 262470 263968 264180 263825 263984 264803 265968 267520 269466 271441 273450 276101 279539 283003
$$ packed form
56454A88346K05Q3N4M41Q20O10k3m67n60o05o75n33m8O92J522K049J756O85l47
56435A94005o37k83K70P56Q45J54r02j106m6J039Q48j85o27l9Q09J292J494J568
56417A99255J431J048M95j89p76q12k15M74Q54J133J509J700J516J280J128O58
56401B10489j53n27l8N76M99l7m25p33j217j558j450j202j013m45N91J176P52
56384B05285K33O47J488J556Q02J32QL08J034K019K564K419K402L035L354K373
56368B29659Q65K65M48K25m97o60L3P63J061J288J612J757J751J867J897J396
56352B43730N97J45J58K89M49O84P61O46Q41J474J751J234P87J183J714J480J072
56335B58995J454K021J498K12l55J59Q19J165J552J946J975K009K651L438L464
$$ plain form
56320 283003 286065 289346 293265 296995 299472 300733 301534 302360 303438 304954 306641 307798 308284 308783 309719
56305 309719 310849 312301 314890 318808 323133 327326 332078 337864 343895 349443 355080 361424 367616 372338
56291 372338 375676 378878 382787 387497 393006 399257 405921 412847 420276 428162 435977 443637 451719 460303
56277 460303 468668 476800 485957 496907 508782 520603 532756 545885 559577 573409 588234 604990
56265 604990 623181 641948 661855 684261 709638 737847 769315 804560 843211 885021 931373
56254 931373 984485 1045523 1114658 1192390 1279470 1375968 1481733 1597402 1723771 1860473 2006155
56243 2006155 2159308 2317767 2478053 2636522 2790673 2938123 3074889 3196059 3297797
56234 3297797 3377471 3432441 3460337 3460477 3433871 3382048 3307049 3212248 3101927 2979983 2849760
$$ packed form
56320B83003L062L281L919L730K477J261Q01Q26J078J516J687J157M86M99R36
56305C09719J130J452K589L918M325M193M752N786O031N548N637O344O192M722
56291C72338L338L202L909M710N509O251O664O926P429P886P815P660Q082Q584
56277D60303Q365Q132R157J0950J1875J1821J2153J3129J3692J3832J4825J6756
56265F04990J8191J8767J9907K2406K5377K8209L1468L5245L8651M1810M6352
56254I31373N3112O1038O9135P7732Q7080R6498J05765J15669J26369J36702J45682
56243B006155J53153J58459J60286J58469J54151J47450J36766J21170J01738
56234C297797P9674N4970K7896J40k6606n1823p4999r4801j10321j21944j30223
$$ plain form
56223 2849760 2714541 2577093 2439024 2301576 2166710 2036544 1912237 1794317 1683529
56214 1683529 1580363 1484447 1395428 1313811 1239877 1172555 1110510 1053633 1002242 955665 912953
56203 912953 874256 840037 809625 781962 757126 735577 716545 698728 682114 667573 655090
56192 655090 643837 633511 624165 615249 606306 598154 591888 587183 582961 579108 576008 573076 569417 565457
56178 565457 562251 559740 557395 555958 556572 558576 560104 560653 561269 562423 563602 564919 567345 571224 575994
56163 575994 581285 587003 592660 598003 603881 611126 619160 627255 636254 647276 659490 671355 683398
56150 683398 697590 714487 733349 754727 780496 811358 846665 886812 933790 989341 1054633
56139 1054633 1131593 1222220 1326167 1440601 1562059 1686254 1806519 1915332 2008264 2085056
$$ packed form
56223B849760j35219j37448j38069j37448j34866j30166j24307j17920j10788
56214A683529j03166r5916q9019q1617p3934o7322o2045n6877n1391m6577m2712
56203I12953l8697l4219l0412k7663k4836k1549j9032j7817j6614j4541j2483
56192F55090j1253j0326r346q916q943q152o266m705m222l853l100k932l659l960
56178E65457l206k511k345j437O14K004J528N49O16J154J179J317K426L879M770
56163E75994N291N718N657N343N878P245Q034Q095Q999J1022J2214J1865J2043
56150F83398J4192J6897J8862K1378K5769L0862L5307M0147M6978N5551O5292
56139A054633P6960R0627J03947J14434J21458J24195J20265J08813R2932P6792
$$ plain form
56129 2085056 2147366 2197882 2241132 2281802 2320951 2355541 2381869 2397689 2401507 2392991 2374903 2352101
56117 2352101 2327480 2300275 2268226 2228921 2178752 2113432 2031136 1933933 1826009 1712306 1598863
56106 1598863 1491725 1394375 1307654 1232325 1169655 1119260 1078669 1045669 1019332 998602 982021
56095 982021 969160 960323 954610 950325 947299 946522 947455 948189 948432 949787 952783 956139 959367 963565 969253
56080 969253 975830 983419 992776 1003147 1012808 1021955 1032427 1044457 1056523 1068481 1081758 1096242
56068 1096242 1110255 1124097 1140226 1159210 1178698 1197128 1215266 1233346 1249963 1264756 1279106
56057 1279106 1293339 1306295 1318344 1331573 1346298 1360699 1374527 1389665 1406372 1422743 1438731
56046 1438731 1456746 1477277 1497884 1517721 1539053 1562915 1587322 1611247 1636382 1663386 1690412
$$ packed form
56129B085056O2310N0516M3250M0670L9149L4590K6328J5820L818q516j8088k2802
56117B352101k4621k7205l2049l9305n0169o5320q2296r7203j07924j13703j13443
56106A598863j07138r7350q6721p5329o2670n0395m0591l3000k6337k0730j6581
56095I82021j2861q837n713m285l026p77R33P34K43J355K996L356L228M198N688
56080I69253O577P589R357J0371R661R147J0472J2030J2066J1958J3277J4484
56068A096242J4013J3842J6129J8984J9488J8430J8138J8080J6617J4793J4350
56057A279106J4233J2956J2049J3229J4725J4401J3828J5138J6707J6371J5988
56046A438731J8015K0531K0607J9837K1332K3862K4407K3925K5135K7004K7026
$$ plain form
56035 1690412 1717046 1745748 1777698 1811124 1845315 1882172 1922114 1962658 2002861 2044964 2089864
56024 2089864 2135317 2180401 2227299 2276783 2326575 2376203 2428706 2485366 2543616 2602359 2664304
56013 2664304 2730665 2798743 2867398 2939707 3017478 3098401 3181352 3269097 3362915 3460189 3560281
56002 3560281 3667030 3782306 3903091 4028081 4160838 4303040 4451352 4604713 4767770
55993 4767770 4942928 5126134 5315037 5514142 5727194 5952027 6188098 6441437 6716543
55984 6716543 7011037 7324089 7662222 8030849 8428390 8855020 9318650 9825769 10375619
55975 10375619 10970597 11622925 12343740 13136006 14006421 14973724 16056942 17267465 18622574
55966 18622574 20155027 21900285 23889274 26166500 28802435 31878200 35476633 39703193
$$ packed form
56035A690412K6634K8702L1950L3426L4191L6857L9942M0544M0203M2103M4900
56024B089864M5453M5084M6898M9484M9792M9628N2503N6660N8250N8743O1945
56013B664304O6361O8078O8655P2309P7771Q0923Q2951Q7745R3818R7274J00092
56002C560281J06749J15276J20785J24990J32757J42202J48312J53361J63057
55993D767770J75158J83206J88903J99105K13052K24833K36071K53339K75106
55984F716543K94494L13052L38133L68627L97541M26630M63630N07119N49850
55975A0375619N94978O52328P20815P92266Q70415R67303J083218J210523J355109
55966A8622574J532453J745258J988989K277226K635935L075765L598433M226560
$$ plain form
55958 39703193 44698423 50618636 57634214 65977088 75981336 88076398 102788980 120782562
55950 120782562 142844518 169774782 202276599 240827295 285195814 333446776 381090147
55943 381090147 421506516 447970460 456152929 445506252 418914559 381253752 337845995
55936 337845995 293337035 251090274 213064908 180063770 152120104 128823924 109552618
55929 109552618 93644683 80506036 69631700 60591039 53029891 46675260 41313050
55922 41313050 36761513 32871136 29531520 26657044 24168745 21998145 20097029 18428960
55914 18428960 16956526 15645979 14476107 13431388 12492101 11639877 10866460 10167604 9533498
55905 9533498 8953115 8422263 7939130 7496667 7086826 6707771 6359837 6038725 5739163
$$ packed form
55958C9703193M995230N920213P015578Q342874J0004248J2095062J4712582J7993582
55950A20782562K2061956K6930264L2501817L8550696M4368519M8250962M7643371
55943C81090147M0416369K6463944Q182469j0646677k6591693l7660807m3407757
55936C37845995m4508960m2246761l8025366l3001138k7943666k3296180j9271306
55929A09552618j5907935j3138647j0874336r040661p561148o354631n362210
55922D1313050m551537l890377l339616k874476k488299k170600j901116j668069
55914A8428960j472434j310547j169872j044719r39287q52224p73417o98856o34106
55905I533498n80383n30852m83133m42463m09841l79055l47934l21112k99562
$$ plain form
55896 5739163 5460963 5205078 4967757 4744574 4536162 4344211 4165829 3997531 3840871
55887 3840871 3698461 3568068 3446068 3333250 3231987 3140933 3057441 2981628 2912867 2845603
55877 2845603 2774079 2698743 2623425 2548934 2473856 2398721 2324590 2249976 2173606 2097922 2025949
55866 2025949 1957218 1890582 1828099 1771945 1720185 1669846 1621650 1577509 1535915 1494220 1453246
55855 1453246 1415301 1379717 1344609 1311223 1282184 1256871 1232390 1207726 1183325 1158116 1130705
55844 1130705 1102233 1074664 1047581 1019852 992894 968963 947647 927253 908129 891422 876036
55833 876036 860135 844283 830048 816940 803784 791591 781887 773621 764878 756204 749062 742391 733996
55820 733996 724108 714394 704689 693957 683273 674536 667179 659252 650809 643203 636185 628942 622939 620373
$$ packed form
55896E739163k78200k55885k37321k23183k08412j91951j78382j68298j56660
55887C840871j42410j30393j22000j12818j01263r1054q3492p5813o8761o7264
55877B845603p1524p5336p5318p4491p5078p5135p4131p4614p6370p5684p1973
55866B025949o8731o6636o2483n6154n1760n0339m8196m4141m1594m1695m0974
55855A453246l7945l5584l5108l3386k9039k5313k4481k4664k4401k5209k7411
55844A130705k8472k7569k7083k7729k6958k3931k1316k0394j9124j6707j5386
55833H76036j5901j5852j4235j3108j3156j2193r704q266q743q674p142o671q395
55820G33996r888r714r705j0732j0684q737p357p927q443p606p018p243o003k566
$$ plain form
55806 620373 620572 621156 622041 625040 630232 636020 642354 650523 659878 667858 673268 676714 677869 675136 668172
55791 668172 658371 646790 633752 620218 607317 594928 582889 572891 566568 562175 555887 546186 534580
55778 534580 522499 510340 499462 492232 489610 490936 496293 506882 522701 541662 560814 576586
55766 576586 584462 581170 567666 548144 526102 503132 480846 461238 444876 431015 419761 412086
55754 412086 407575 404277 401043 398087 395095 390849 385094 378893 372781 366211 359085 352198 346016 340565
55740 340565 336511 334633 334234 333686 332522 331283 329465 325669 319924 314024 309270 305575 302835 301292 300187
55725 300187 297906 293909 289119 284203 279015 273850 269591 266324 263402 261128 260819 262887 266304 270244
55711 270244 274868 280303 286166 292168 297804 301511 301812 299456 296816 294927 292616 288685 283262 276774
$$ packed form
55806F20373J99N84Q85K999N192N788O334Q169R355P980N410L446J155k733o964
55791F68172r801j1581j3038j3534j2901j2389j2039r998o323m393o288r701j1606
55778E34580j2081j2159j0878p230k622J326N357J0589J5819J8961J9152J5772
55766E76586P876l292j3504j9522k2042k2970k2286j9608j6362j3861j1254p675
55754D12086m511l298l234k956k992m246n755o201o112o570p126o887o182n451
55740C40565m054j878l99n48j164j239j818l796n745n900m754l695k740j543j105
55725C00187k281l997m790m916n188n165m259l267k922k274l09K068L417L940
55711B70244M624N435N863O002N636L707L01k356k640j889k311l931n423o488
$$ plain form
55697 276774 269284 261351 253960 247097 239795 232145 225881 222364 221156 221069 221517 222295 223108 223856 224731 225840
55681 225840 227392 230073 234277 239145 243410 247004 250623 254023 256141 256742 256505 255552 253327 249993 246495
55666 246495 243219 239951 237172 235885 236033 236531 237007 238184 240445 243385 246849 251007 255347 258991 262043
55651 262043 265214 268195 269915 270338 270334 269795 267674 263989 259901 255568 249849 242570 235163 228449 221610
55636 221610 214032 206489 199715 193389 187336 182228 178287 174706 171141 168426 167041 166225 165424 165293 166362
55621 166362 167883 168848 169046 168420 166527 163503 160533 158477 156846 154767 152152 149354 146600 144223 142546
55606 142546 141133 139144 136722 134946 134078 133147 131665 130478 130388 131099 132017 132880 133153 132191 130540 129762 130360
55589 130360 131138 131137 130707 130075 128484 125745 123191 121985 121670 121358 121186 121531 121950 122023 122247 123076 123998 124584
$$ packed form
55697B76774p490p933p391o863p302p650o264l517j208q7M48P78Q13P48Q75J109
55681B25840J552K681M204M868M265L594L619L400K118O01k37r53k225l334l498
55666B46495l276l268k779j287J48M98M76J177K261K940L464M158M340L644L052
55651B62043L171K981J720M23mn39k121l685m088m333n719p279p407o714o839
55636B21610p578p543o774o326o053n108l941l581l565k715j385q16q01j31J069
55621A66362J521R65J98o26j893l024k970k056j631k079k615k798k754k377j677
55606A42546j413j989k422j776q68r31j482j187r0P11R18Q63K73r62j651p78N98
55589A30360P78jm30o32j591k739k554j206l15l12j72L45M19P3K24Q29R22N86
$$ plain form
55571 124584 125474 127359 129828 132173 134399 136513 137837 138130 138513 140111 142442 144205 145086 145799 146830
55556 146830 147965 148600 147924 145463 141987 139126 137497 136097 134077 132046 130941 130737 131159 132481 134569
55541 134569 136134 136202 135554 135585 136471 137538 138696 140295 142126 143666 144860 145762 145920 145042 143683 142446
55525 142446 141130 139528 138264 137772 137119 135029 131633 128179 125498 123685 122738 122417 121916 120718 119412
55510 119412 118745 118360 117492 116363 115791 115802 115790 115759 116251 117160 117766 117929 118283 119114 119886 119968 119191 117640 115439
55491 115439 112831 110110 107529 105455 104281 103904 103662 103081 102253 101314 100229 99325 99203 99644 99488 98176
55475 98176 96567 95634 95246 94921 94771 94874 94686 94111 94180 95563 97232 97786 97378 97090 97134 97061 97124 97917 98987
55456 98987 99250 98658 98236 98599 99573 101011 102824 104324 104742 104334 103955 103647 102707 101057 99449 98359 97615
$$ packed form
55571A24584Q90J885K469K345K226K114J324K93L83J598K331J763Q81P13J031
55556A46830J135O35o76k461l476k861j629j400k020k031j105k04M22J322K088
55541A34569J565O8o48L1Q86J067J158J599J831J540J194R02J58q78j359j237
55525A42446j316j602j264m92o53k090l396l454k681j813r47l21n01j198j306
55510A19412o67l85q68j129n72J1j2l1M92R09O06J63L54Q31P72Q2p77j551k201
55491A15439k608k721k581k074j174l77k42n81q28r39j085r04j22M41j56j312
55475I8176j609r33l88l25j50J03j88n75O9J383J669N54m08k88M4p3O3P93J070
55456I8987K63n92m22L63R74J438J813J500M18m08l79l08r40j650j608j090p44
$$ plain form
55439 97615 97057 96683 96255 95686 95626 96651 98102 98739 98364 97735 97174 96475 95968 96235 96726 96169 94608 93665
55421 93665 94310 95644 96474 96941 97762 98830 99481 99608 99666 99880 100041 99950 99662 99396 99365 99572 99703 99441 98849
55402 98849 98233 97745 97399 97333 97616 97945 97906 97411 96623 95737 95184 95567 96831 97888 97766 96808 96103 96121 96683
55383 96683 97818 99613 101375 101943 100941 99004 96814 94683 92898 91636 90589 89438 88595 88651 89232 89378
55367 89378 89041 89193 90330 91866 93139 94122 94942 95580 96390 98017 100431 102673 103904 104132 103741 103016 102370
55350 102370 102337 102943 103577 103803 103838 104059 104551 105292 106258 107171 107611 107528 107229 106812 106146 105392 104918 104612 103932 102811
55330 102811 101884 101624 101792 101915 101817 101511 101041 100589 100327 100095 99613 98997 98574 98285 97831 97359 97362 97887 98462 98788
55310 98788 98897 98715 98113 97389 96938 96548 95827 95261 95797 97240 98067 97245 95393 93781 92991 92986 93698 94947
$$ packed form
55439I7615n58l74m28n69o0J025J451O37l75o29n61o99n07K67M91n57j561r43
55421I3665O45J334Q30M67Q21J068O51J27N8K14J61r1k88k66l1K07J31k62n92
55402I8849o16m88l46o6K83L29l9m95p88q86n53L83J264J057j22r58p05J8N62
55383I6683J135J795J762N68j002j937k190k131j785j262j047j151q43N6N81J46
55367H9378l37J52J137J536J273R83Q20O38Q10J627K414K242J231K28l91p25o46
55350A02370l3O06O34K26L5K21M92P41R66R13M40q3k99m17o66p54m74l06o80j121
55330A02811r27k60J68J23r8l06m70m52k62k32m82o16m23k89m54m72LN25N75L26
55310I8788J09j82o02p24m51l90p21n66N36J443Q27q22j852j612p90nP12J249
$$ plain form
55292 94947 96283 97392 98258 98711 98429 97711 97578 98677 100535 102227 103265 103578 103210 102437 101618 100613 98914
55275 98914 96700 95111 94954 95677 96190 96179 96028 95890 95583 95239 95347 96071 96949 97449 97624 98150 99659 101956
55257 101956 104025 105016 105126 105204 105658 106204 106554 106748 106780 106501 105946 105233 104102 102238 100119 98801 98662 99094
55239 99094 99630 100513 101729 102355 101614 100020 98780 98467 98856 99638 100572 101189 101067 100398 99756 99294 98580 97284
55221 97284 95709 94542 94250 94742 95509 96065 96273 96283 96304 96533 97054 97584 97613 97199 97290 98632 100526 101443 100860
55202 100860 99752 99136 98945 98594 97909 97069 96201 95521 95436 96133 97366 98881 100563 101969 102316 101402 100084
55185 100084 99376 99374 99429 99053 98271 97348 96578 96216 96376 97067 98282 99712 100532 100120 99127 99091 100625 102596 103587
55166 103587 103595 103708 104508 105557 106317 106927 107848 109077 109959 109842 108835 107742 107090 106587 105850 105286 105569 106499
$$ packed form
55292I4947J336J109Q66M53k82p18j33J099J858J692J038L13l68p73q19j005j699
55275I8914k214j589j57P23N13j1j51j38l07l44J08P24Q78N00J75N26J509K297
55257A01956K069R91J10P8M54N46L50J94L2k79n55p13j131j864k119j318j39M32
55239I9094N36Q83J216O26p41j594j240l13L89P82R34O17j22o69o42m62p14j296
55221I7284j575j167k92M92P67N56K08J0K1K29N21N30K9m14R1J342J894R17n83
55202A00860j108o16j91l51o85q40q68o80q5O97J233J515J682J406L47r14j318
55185A00084p08kN5l76p82r23p70l62J60O91J215J430Q20m12r93l6J534J971R91
55166A03587QJ13Q00J049P60O10R21J229Q82j17j007j093o52n03p37n64K83R30
$$ plain form
55148 106499 107227 107533 107933 108426 108223 107092 105979 105684 105770 105492 105042 105069 105507 105796 105873 106115 106469 106378 105584
55129 105584 104448 103533 103215 103569 104316 105004 105513 106134 106919 107332 106963 106193 105723 105691 105697 105418 104826 104060 103496
55110 103496 103627 104456 105220 105192 104544 104042 104095 104512 104988 105413 105860 106621 108100 110346 112794 114760 115973 116486
55092 116486 116385 115952 115709 115885 116046 115658 114845 114209 114119 114509 115129 115622 115535 114729 113732 113369 113993 115231 116406
55073 116406 117114 117541 118260 119504 120651 120802 119905 118809 118108 117468 116335 114741 113096 111728 110936 110984 111616
55056 111616 112033 111764 111175 110821 110761 110817 110939 110898 110244 109048 108128 108034 108357 108556 108793 109325 109712 109424 108738 108216
55036 108216 107787 107157 106655 106763 107174 107325 107537 108603 110405 111966 112849 113515 114239 114669 114658 114664 115019 115508 115921
55017 115921 116400 116958 117224 116948 116339 115751 115414 115515 116038 116475 116233 115487 115110 115595 116487 117090 117289 117515 118212
$$ packed form
55148A06499P28L06M00M93k03j131j113k95Q6k78m50K7M38K89P7K42L54r1p94
55129A05584j136r15l18L54P47O88N09O21P85M13l69p70m70l2Ok79n92p66n64
55110A03496J31Q29P64k8o48n02N3M17M76M25M47P61J479K246K448J966J213N13
55092A16486j01m33k43J76J61l88q13o36r0L90O20M93q7q06r97l63O24J238J175
55073A16406P08M27P19J244J147J51q97j096p01o40j133j594j645j368p92M8O32
55056A11616M17k69n89l54o0N6J22m1o54j196r20r4L23J99K37N32L87k88o86n22
55036A08216m29o30n02J08M11J51K12J066J802J561Q83O66P24M30j1OL55M89M13
55017A15921M79N58K66k76o09n88l37J01N23M37k42p46l77M85Q92O03J99K26O97
$$ plain form
54998 118212 119568 121467 123491 125153 126196 126676 126826 126972 127316 127585 127164 125904 124444 123332 122241 120576
54982 120576 118536 116873 115932 115669 116347 118277 120918 123175 124681 125924 127045 127534 127389 127598 128824 130331
54966 130331 130860 130087 128712 127586 127239 127833 128898 129458 128987 128095 127766 128103 128368 128145 127838 127946 128397 128872
54948 128872 129384 130085 130658 130352 128836 126764 125234 124789 125110 125539 125529 124705 123041 121136 119867 119541 119829
54931 119829 120693 122732 126098 129737 132501 134691 137649 142055 147487 153593 160699 168970 177783 186306
54917 186306 194094 200720 205344 207204 206238 202954 197943 191773 185065 178343 171937 166155 161287 157294
54903 157294 153792 150550 147777 145719 144213 142818 141203 139273 137166 135311 134319 134521 135682 137287 139005
54888 139005 140752 142389 143585 144102 144252 144921 146879 150094 153989 158470 164190 171455 179357 186552 192603
$$ packed form
54998A18212J356J899K024J662J043M80J50J46L44K69m21j260j460j112j091j665
54982A20576k040j663r41k63O78J930K641K257J506J243J121M89j45K09J226J507
54966A30331N29p73j375j126l47N94J065N60m71q92l29L37K65k23l07J08M51M75
54948A28872N12P01N73l06j516k072j530m45L21M29j0q24j664j905j269l26K88
54931A19829Q64K039L366L639K764K190K958M406N432O106P106Q271Q813Q523
54917A86306P788O626M624J860r66l284n011o170o708o722o406n782m868l993
54903A57294l502l242k773k058j506j395j615j930k107j855r92K02J161J605J718
54888A39005J747J637J196N17J50O69J958L215L895M481N720P265P902P195O051
$$ plain form
54873 192603 197831 202013 204174 203813 201573 198320 194158 188880 182866 176951 171547 166388 161093 155662
54859 155662 150484 146137 143110 141421 140437 139248 137377 135109 133137 131876 131133 130405 129452 128441 127509
54844 127509 126437 124936 123101 121319 119846 118787 118393 118952 120263 121542 122121 122077 121953 121919 121595 120797 120213
54827 120213 120829 122650 124430 125046 124745 124563 124804 124886 124565 124358 124514 124449 123685 122638 121925 121534 121228 121130 121239
54808 121239 121025 120301 119942 120776 122282 123367 124002 124967 126247 126977 126933 126849 127126 127413 127693 128584 130090 131202
54790 131202 131339 131232 131711 132425 132536 132001 131376 130874 130468 130539 131624 133661 136070 138450 140703 142648 144106
54773 144106 145318 146828 148926 151540 154626 158348 162886 168241 174219 180432 186444 192033 197219 201839
54759 201839 205217 206457 205094 201395 196093 189833 182861 175271 167567 160710 155420 151628 148857 146866
$$ packed form
54873A92603N228M182K161l61k240l253m162n278o014n915n404n159n295n431
54859A55662n178m347l027j689r84j189j871k268j972j261p43p28r53j011r32
54844A27509j072j501j835j782j473j059l94N59J311J279N79m4j24l4l24p98n84
54827A20213O16J821J780O16l01j82K41Q2l21k07J56o5p64j047p13l91l06r8J09
54808A21239k14p24l59Q34J506J085O35R65J280P30m4q4K77K87K80Q91J506J112
54790A31202J37j07M79P14J11n35o25n02m06P1J085K037K409K380K253J945J458
54773A44106J212J510K098K614L086L722M538N355N978O213O012N589N186M620
54759B01839L378J240j363l699n302o260o972p590p704o857n290l792k771j991
$$ plain form
54745 146866 145546 144467 143222 142139 141975 142785 143679 143864 143374 142622 141833 141268 141475 142807 144939 147186
54729 147186 149151 150919 152889 155617 159566 164755 170806 177413 184483 191742 198470 203815 207162 208201
54715 208201 206916 203620 198805 192898 186331 179653 173199 166813 160352 154371 149763 146729 144599 142729
54701 142729 140992 139411 137933 136726 136166 136325 136912 137693 138448 138577 137533 135775 134452 133959 133614 133057
54685 133057 133049 134299 136183 137322 137051 135791 134346 133273 132620 131948 130856 129670 129130 129354 129735 130059 130846
54668 130846 132177 133025 132404 130602 128679 127276 126510 126432 126887 127360 127631 128173 129362 130728 131586 131904 131929
54651 131929 131515 130570 129694 129485 129564 129128 128161 127182 126081 124269 122000 120555 120845 122469 124397 125970 127038
54634 127038 127639 127864 127796 127454 126917 126370 125869 125280 124739 124820 125801 127078 127863 128184 128599 129167 129453 129433 129634
$$ packed form
54745A46866j320j079j245j083j64Q10Q94J85m90p52p89n65K07J332K132K247
54729A47186J965J768J970K728L949N189O051O607P070P259O728N345L347J039
54715B08201j285l296m815n907o567o678o454o386o461n981m608l034k130j870
54701A42729j737j581j478j207n60J59N87P81P55J29j044j758j323m93l45n57
54685A33057qJ250J884J139k71j260j445j073o53o72j092j186n40K24L81L24P87
54668A30846J331Q48o21j802j923j403p66p8M55M73K71N42J189J366Q58L18K5
54651A31929m14r45q76k09P9m36r67r79j101j812k269j445K90J624J928J573J068
54634A27038O01K25o8l42n37n47n01n89n41Q1R81J277P85L21M15N68K86k0K01
$$ plain form
54615 129634 130241 130748 130675 130159 129627 129313 129219 129256 129261 129140 129061 129280 129770 130286 130743 131246 131832 132437 133068 133724 134237
54594 134237 134420 134280 133897 133298 132654 132298 132233 131985 131361 131028 131780 133445 135069 135981 136142 135643 134574 133397
54576 133397 132717 132534 132213 131396 130541 130417 131301 132784 134120 134754 134713 134453 134242 133887 133268 132767 132858 133570 134672
54557 134672 136011 137230 137628 136953 136009 135810 136366 137034 137738 138941 140575 142015 143156 144568 146389 147925
54541 147925 148656 148887 149056 149118 148951 148737 148529 148045 147285 146778 146741 146521 145398 143545 141700 140238 139102 138330
54523 138330 137991 137682 136681 134756 132532 130976 130664 131542 133143 134937 136588 137957 138962 139504 139538 139185
54507 139185 138751 138627 139023 139714 140184 140143 139759 139283 138735 138175 137966 138391 139190 139879 140356 140814 141255 141575 142001
54488 142001 142910 144252 145583 146578 147035 146547 144820 142326 140030 138411 137349 136924 137524 139008 140584 141876
$$ packed form
54615A29634O07N07p3n16n32l14r4L7Nj21p9K19M90N16M57N03N86O05O31O56N13
54594A34237J83j40l83n99o44l56o5k48o24l33P52J665J624R12J61m99j069j177
54576A33397o80j83l21q17q55j24Q84J483J336O34m1k60k11l55o19n01R1P12J102
54557A34672J339J219L98o75r44j99N56O68P04J203J634J440J141J412J821J536
54541A47925P31K31J69O2j67k14k08m84p60n07l7k20j123j853j845j462j136p72
54523A38330l39l09j001j925k224j556l12Q78J601J794J651J369J005N42L4l53
54507A39185m34j24L96O91M70m1l84m76n48n60k09M25P99O89M77M58M41L20M26
54488A42001R09J342J331R95M57m88j727k494k296j619j062m25O00J484J576J292
$$ plain form
54472 141876 143388 145469 147561 149042 150224 151756 153469 154618 155040 155313 155826 156407 156937 157646 158492 158822
54456 158822 158101 156714 155585 155076 154599 153430 151603 149787 148427 147384 146434 145791 145830 146449 147058 147188 146949
54439 146949 146828 147189 147957 148650 148794 148422 148120 148438 149373 150584 151951 153548 155155 156217 156465 156314 156439
54422 156439 157046 157672 157662 156792 155382 153893 152552 151557 151372 152354 153969 154936 154461 153028 151696 150993 150807
54405 150807 150934 151227 151502 151813 152545 153832 155179 156188 157235 158744 160133 160373 159474 158545 158381 158876 159836
54388 159836 161340 162986 163722 163108 162075 161803 162317 162805 162959 163316 164328 165602 166246 165770 164593 163737 163980
54371 163980 165316 167216 169245 171288 173400 175771 178629 181855 184922 187645 190716 194816 199330 202720
54357 202720 204212 204435 204282 203834 202696 200701 197892 194324 190311 186546 183616 181558 180008 178554 176864
$$ packed form
54472A41876J512K081K092J481J182J532J713J149M22K73N13N81N30P09Q46L30
54456A58822p21j387j129n09m77j169j827j816j360j043r50o43L9O19O09J30k39
54439A46949j21L61P68O93J44l72l02L18R35J211J367J597J607J062K48j51J25
54422A56439O07O26j0q70j410j489j341r95j85R82J615R67m75j433j332p03j86
54405A50807J27K93K75L11P32J287J347J009J047J509J389K40q99r29j64M95R60
54388A59836J504J646P36o14j033k72N14M88J54L57J012J274O44m76j177q56K43
54371A63980J336J900K029K043K112K371K858L226L067K723L071M100M514L390
54357B02720J492K23j53m48j138j995k809l568m013l765k930k058j550j454j690
$$ plain form
54342 176864 174853 172790 170958 169225 167353 165611 164500 163885 163125 162112 161487 161628 162086 162230 161824 160767
54326 160767 159062 157339 156636 157182 158027 158353 158495 159167 160315 161347 162043 162558 162884 162852 162415 161513 159985
54309 159985 157979 156088 154697 153575 152469 151632 151325 151299 151239 151335 151901 152793 153635 154215 154296 153536 152169 151223
54291 151223 151434 152282 152682 152266 151400 150458 149765 149850 150943 152481 153841 155242 157149 159060 159845 159250 158149
54274 158149 157271 156516 155744 155372 155791 156715 157536 158027 158399 158874 159426 159862 160121 160520 161531 163160 164808 165947
54256 165947 166696 167422 168153 168826 169717 171011 172140 172242 171253 170012 169302 169256 169675 170332 170933 171220 171235 171189 171168
54237 171168 171275 171808 172829 173756 174023 174029 174735 176348 178030 178963 179096 178733 178095 177515 177433 177880 178354 178458 178279
54218 178279 177966 177383 176388 175058 173427 171486 169650 168740 169098 170081 170767 170924 170929 170982 170827 170141 168922 167504
$$ packed form
54342A76864k011k063j832j733j872j742j111o15p60j013o25J41M58J44m06j057
54326A60767j705j723p03N46Q45L26J42O72J148J032O96N15L26l2m37r02j528
54309A59985k006j891j391j122j106q37l07k6o0R6N66Q92Q42N80Q1p60j367r46
54291A51223K11Q48M00m16q66r42o93Q5J093J538J360J401J907J911P85n95j101
54274A58149q78p55p72l72M19R24Q21M91L72M75N52M36K59L99J011J629J648J139
54256A65947P49P26P31O73Q91J294J129J02r89j241p10m6M19O57O01K87J5m6k1
54237A71168J07N33J021R27K67OP06J613J682R33J33l63o38n80q2M47M74J04j79
54218A78279l13n83r95j330j631j941j836r10L58R83O86J57NN3j55o86j219j418
$$ plain form
54200 167504 166329 165602 165076 164342 163432 162936 163342 164441 165568 166210 166208 165592 164624 163888 163940 164695 165409 165454 164974
54181 164974 164594 164585 164600 164292 163882 163898 164515 165427 166252 166778 166826 166209 164974 163462 162084 161183 160987 161377 161735
54162 161735 161444 160579 159670 158815 157639 156275 155590 156033 156869 157142 156895 156859 157377 158254 159259 160109 160285 159628
54144 159628 158943 159270 160675 162362 163746 164731 165156 164888 164472 164806 165992 167203 167851 168188 168555 168777 168644
54127 168644 168451 168629 169220 169970 170616 170975 171122 171538 172582 173811 174363 174172 174137 174953 176441 178269 180567
54110 180567 183366 186143 188573 191201 194665 198558 201823 204211 206765 210865 217153 225330 234503 243534
54096 243534 251243 256459 258088 255544 249357 241187 232975 226069 220991 217642 215553 214323 214070 215171
54082 215171 217359 219426 220188 219469 217865 215882 213644 211162 208432 205393 202163 199154 196649 194441 192341
$$ packed form
54200A67504j175p27n26p34r10m96M06J099J127O42ko16r68p36N2P55P14M5m80
54181A64974l80rJ5l08m10J6O17R12Q25N26M8o17j235j512j378r01j96L90L58
54162A61735k91q65r09q55j176j364o85M43Q36K73k47l6N18Q77J005Q50J76o57
54144A59628o85L27J405J687J384R85M25k68m16L34J186J211O48L37L67K22j33
54127A68644j93J78N91P50O46L59J47M16J044J229N52j91l5Q16J488J828K298
54110A80567K799K777K430K628L464L893L265K388K554M100O288Q177R173R031
54096B43534P709N216J629k544o187q170q212o906n078l349k089j230k53J101
54082B15171K188K067P62p19j604j983k238k482k730l039l230l009k505k208k100
$$ plain form
54067 192341 190785 190455 191306 192499 193252 193356 192874 191938 190953 190523 190857 191608 192488 193639 195122 196461 197174
54050 197174 197530 198237 199493 200832 201953 203244 205299 208223 211611 214885 217556 219543 221558 224835 230032
54035 230032 236498 242997 248985 254791 260689 266438 271784 276841 281708 286100 289662 292356 294356 295905
54021 295905 297387 299113 300758 301488 300971 299912 299186 298772 297990 296417 294076 290959 286921 281963 276220
54006 276220 269828 263205 257169 252265 248171 244294 240716 237954 235967 234130 232158 230330 228754 227097
53992 227097 225195 223327 221697 220149 218513 216772 214842 212754 211043 210276 210116 209648 208799 208536 209279 210062
53976 210062 209876 209076 208656 208796 209054 209582 211107 213793 217020 220365 224097 228528 233547 239105 245736 254254
53960 254254 265079 277745 290642 301195 306944 307053 302711 295895 287901 279233 270468 262576 256253
$$ packed form
54067A92341j556l30Q51J193P53J04m82r36r85m30L34P51Q80J151J483J339P13
54050A97174L56P07J256J339J121J291K055K924L388L274K671J987K015L277N197
54035B30032O466O499N988N806N898N749N346N057M867M392L562K694K000J549
54021B95905J482J726J645P30n17j059p26m14p82j573k341l117m038m958n743
54006B76220o392o623o036m904m094l877l578k762j987j837j972j828j576j657
53992B27097j902j868j630j548j636j741j930k088j711p67j60m68q49k63P43P83
53976B10062j86q00m20J40K58N28J525K686L227L345L732M431N019N558O631Q518
53960B54254J0825J2666J2897J0553N749J09m342o816p994q668q765p892o323
$$ plain form
53947 256253 251447 247835 245500 244755 245457 246954 248725 250674 252767 254864 257105 259936 263461 267185 270810
53932 270810 274726 279171 283383 286413 288499 290734 293470 296049 298232 300895 304853 309798 314875 319660
53918 319660 324040 327803 331037 334577 339399 345768 353331 361690 370354 378499 385415 391084 395896 399932
53904 399932 402947 404795 405411 404557 402154 398841 395713 393419 391787 390248 388236 385308 381279 376298 370478
53889 370478 363562 355333 346300 337496 329465 321873 314260 306865 300408 295220 290876 286677 282338 278156
53875 278156 274543 271562 269006 266803 265052 263585 261804 259231 256039 252799 249780 246758 243438 239858
53861 239858 236284 232959 229971 227301 224919 222834 221070 219629 218510 217755 217389 217350 217509 217651 217380 216299
53845 216299 214573 213119 212796 213431 214034 213949 213395 212871 212597 212678 213245 214122 214783 214958 214958 215119 215307 215349 215562 216400
$$ packed form
53947B56253m806l612k335p45P02J497J771J949K093K097K241K831L525L724L625
53932B70810L916M445M212L030K086K235K736K579K183K663L958M945N077M785
53918C19660M380L763L234L540M822O369P563Q359Q664Q145O916N669M812M036
53904C99932L015J848O16q54k403l313l128k294j632j539k012k928m029m981n820
53889C70478o916q229r033q804q031p592p613p395o457n188m344m199m339m182
53875B78156l613k981k556k203j751j467j781k573l192l240l019l022l320l580
53861B39858l574l325k988k670k382k085j764j441j119p55l66l9J59J42k71j081
53845B16299j726j454l23O35O03q5n54n24k74Q1N67Q77O61J75%J61J88M2K13Q38
$$ plain form
53825 216400 217781 219141 220049 220519 220877 221525 222585 223632 224045 223874 223939 224800 226035 226900 227321 227780 228597
53808 228597 229852 231742 234471 237914 241863 246406 251592 256977 262026 266849 272009 277688 283591 289513
53794 289513 295399 300926 305640 309553 313044 316098 318266 319484 320342 321238 321782 321379 320061 318326 316459
53779 316459 314368 311941 309209 306094 302216 297109 290664 283384 276157 269751 264512 260483 257490 255037
53765 255037 252465 249543 246693 244340 242232 239792 236973 234326 232286 230753 229337 227679 225557 223056
53751 223056 220595 218447 216338 213966 211792 210725 210963 211771 212575 213653 215354 217211 218404 218807 218991
53736 218991 219302 219528 219509 219615 220284 221433 222615 223663 224810 226150 227339 228078 228642 229560 230838 231922
53720 231922 232509 232987 233884 235248 236848 238670 240836 243178 245212 246500 246931 246883 247276 249079 252449 256535
$$ packed form
53825B16400J381J360R08M70L58O48J060J047M13j71O5Q61J235Q65M21M59Q17
53808B28597J255J890K729L443L949M543N186N385N049M823N160N679N903N922
53794B89513N886N527M714L913L491L054K168J218Q58Q96N44m03j318j735j867
53779C16459k091k427k732l115l878n107o445p280p227o406n239m029k993k453
53765B55037k572k922k850k353k108k440k819k647k040j533j416j658k122k501
53751B23056k461k148k109k372k174j067K38Q08Q04J078J701J857J193M03J84
53736B18991L11K26j9J06O69J149J182J048J147J340J189P39N64R18J278J084
53720B31922N87M78Q97J364J600J822K166K342K034J288M31m8L93J803L370M086
$$ plain form
53704 256535 260419 263909 267089 269647 271332 272840 275426 279578 284646 289726 294329 298170 301050 303199
53690 303199 305199 307295 309144 310331 310699 310112 308533 306549 305202 304867 304739 303815 302069 300301 299164
53675 299164 298742 298764 298871 298807 298685 298875 299432 299916 300043 300105 300356 300381 299710 298777 298501 298954 299185 298534 297459 296705
53655 296705 296326 296051 296164 297210 298976 300504 301264 301712 302393 303054 303080 302416 301557 300873 300519 300855 302250 304460
53637 304460 306804 309079 311629 314318 316190 316656 316465 316891 318404 320778 324126 328914 335026 341565 347758
53622 347758 353541 359138 364501 369294 373120 375772 377586 379510 382305 385659 388543 390484 391989 393689
53608 393689 395630 397614 399706 402061 404657 407430 410370 413206 415383 416665 417521 418642 420303 422378
53594 422378 424677 426935 428737 429759 430033 429757 428980 427756 426453 425600 425356 425284 424746 423515 422001 420816
$$ packed form
53704B56535L884L490L180K558J685J508K586M152N068N080M603L841K880K149
53690C03199K000K096J849J187L68n87j579j984j347l35j28r24j746j768j137
53675B99164m22K2J07o4j22J90N57M84J27O2K51K5o71r33k76M53K31o51j075p54
53655B96705l79k75J13J046J766J528P60M48O81O61K6o64q59o84l54L36J395K210
53637C04460K344K275K550K689J872M66j91M26J513K374L348M788O112O539O193
53622C47758N783N597N363M793L826K652J814J924K795L354K884J941J505J700
53608C93689J941J984K092K355K596K773K940K836K177J282Q56J121J661K075
53594D22378K299K258J802J022K74k76p77j224j303q53k44p2n38j231j514j185
$$ plain form
53578 420816 420074 419247 417860 416083 414347 412579 410263 407274 404152 401467 399353 397795 396878 396517 396302
53563 396302 395917 395380 394675 393527 391886 390248 389071 388139 387012 385940 385716 386560 387620 387893 387370 386984
53547 386984 387469 388648 389995 391607 394131 397679 401339 404182 406367 408736 411573 414470 417353 420802
53533 420802 425144 429955 434899 440417 447032 454437 461959 469655 478276 488152 498686 509082 519220
53520 519220 529669 541086 553696 567264 581536 596674 613094 630831 649369 668335 688102
53509 688102 709387 732399 756695 781715 807091 832518 857746 882743 907600 932186 956127
53498 956127 979191 1001473 1023156 1044371 1065421 1086873 1109108 1131779 1153968 1174972 1194837
53487 1194837 1214054 1232942 1251593 1270273 1289426 1309089 1328718 1347912 1366965 1386248 1405341
$$ packed form
53578D20816p42q27j387j777j736j768k316k989l122k685k114j558r17l61k15
53563C96302l85n37p05j148j641j638j177r32j127j072k24Q44J060K73n23l86
53547C86984M85J179J347J612K524L548L660K843K185K369K837K897K883L449
53533D20802M342M811M944N518O615P405P522P696Q621R876J0534J0396J0138
53520E19220J0449J1417J2610J3568J4272J5138J6420J7737J8538J8966J9767
53509F88102K1285K3012K4296K5020K5376K5427K5228K4997K4857K4586K3941
53498I56127K3064K2282K1683K1215K1050K1452K2235K2671K2189K1004J9865
53487A194837J9217J8888J8651J8680J9153J9663J9629J9194J9053J9283J9093
$$ plain form
53476 1405341 1423448 1440599 1457616 1474701 1490711 1504282 1515117 1523698 1530164 1534096 1535174 1533409
53464 1533409 1528766 1521099 1510597 1497960 1484026 1469380 1454273 1438663 1422358 1405355 1388034 1370807
53452 1370807 1353538 1335512 1316028 1294922 1272589 1249724 1227063 1205118 1183927 1163102 1142305
53441 1142305 1121778 1102323 1084630 1068664 1053918 1040359 1028790 1020007 1013858 1009555 1006720 1005497
53429 1005497 1005689 1006500 1007458 1008989 1011653 1015321 1019641 1025004 1032357 1042083 1053611 1066183 1079638 1094283
53415 1094283 1110354 1127853 1146841 1167657 1190585 1215275 1240759 1266421 1292861 1321334 1352236
53404 1352236 1384684 1417750 1451582 1486965 1524313 1563697 1605442 1650012 1697371 1747014 1798610
53393 1798610 1852109 1907262 1963602 2020953 2079504 2139221 2199546 2259780 2319495 2378468 2436500
$$ packed form
53476A405341J8107J7151J7017J7085J6010J3571J0835Q581O466L932J078j765
53464A533409m643p667j0502j2637j3934j4646j5107j5610j6305j7003j7321j7227
53452A370807j7269j8026j9484k1106k2333k2865k2661k1945k1191k0825k0797
53441A142305k0527j9455j7693j5966j4746j3559j1569q783o149m303k835j223
53429A005497J92Q11R58J531K664L668M320N363P353R726J1528J2572J3455J4645
53415A094283J6071J7499J8988K0816K2928K4690K5484K5662K6440K8473L0902
53404A352236L2448L3066L3832L5383L7348L9384M1745M4570M7359M9643N1596
53393A798610N3499N5153N6340N7351N8551N9717O0325O0234N9715N8973N8032
$$ plain form
53382 2436500 2493319 2548417 2601032 2650679 2697663 2742547 2784998 2823690 2857655 2887310 2913631
53371 2913631 2936601 2955033 2967884 2975155 2977302 2974164 2964869 2948603 2925083 2894356 2856624 2812521
53359 2812521 2763278 2710272 2654509 2596757 2537976 2479209 2421021 2363503 2306862 2251629 2198125
53348 2198125 2146162 2095567 2046684 1999978 1955328 1912082 1869640 1827713 1786148 1744928 1704341
53337 1704341 1664870 1626863 1590515 1556138 1524175 1494891 1468254 1444200 1422908 1404670 1389464
53326 1389464 1376635 1365036 1353607 1341902 1329939 1317590 1304361 1289890 1274471 1258937 1244125
53315 1244125 1230567 1218451 1207695 1198152 1189909 1183294 1178496 1175272 1173204 1172100 1172032 1173095 1175279 1178544
53301 1178544 1182978 1188893 1196615 1206017 1216464 1227623 1240218 1255460 1273666 1294018 1315789 1339166
$$ packed form
53382B436500N6819N5098N2615M9647M6984M4884M2451L8692L3965K9655K6321
53371B913631K2970J8432J2851P271K147l138r295j6266k3520l0727l7732m4103
53359B812521m9243n3006n5763n7752n8781n8767n8188n7518n6641n5233n3504
53348B198125n1963n0595m8883m6706m4650m3246m2442m1927m1565m1220m0587
53337A704341l9471l8007l6348l4377l1963k9284k6637k4054k1292j8238j5206
53326A389464j2829j1599j1429j1705j1963j2349j3229j4471j5419j5534j4812
53315A244125j3558j2116j0756r543q243o615m798l224k068j104o8J063K184L265
53301A178544M434N915P722R402J0447J1159J2595J5242J8206K0352K1771K3377
$$ plain form
53289 1339166 1364570 1391793 1420282 1449680 1479476 1508512 1535553 1560281 1583220 1604829 1625046
53278 1625046 1643459 1659473 1672508 1682518 1690119 1695730 1698820 1698489 1694560 1687565 1677897 1665663 1651224
53265 1651224 1635099 1617189 1596743 1573286 1547158 1519052 1489515 1459005 1427962 1396568 1364801
53254 1364801 1332796 1300908 1269377 1238286 1207844 1178317 1149622 1121379 1093487 1066250 1039881
53243 1039881 1014211 989011 964268 939976 915933 891902 867850 844038 820976 799189 778824
53232 778824 759647 741627 725259 710989 698606 687617 677953 669708 662426 655280 647913 640464 632838
53219 632838 624615 615672 606242 596283 585392 573422 560578 546928 532519 518035 504581 492609
53207 492609 481761 471859 463223 455794 448855 442010 435616 429771 423732 416926 409760 402688 395193 386546
$$ packed form
53289A339166K5404K7223K8489K9398K9796K9036K7041K4728K2939K1609K0217
53278A625046J8413J6014J3035J0010P601N611L090l31l929o995r668j2234j4439
53265A651224j6125j7910k0446k3457k6128k8106k9537l0510l1043l1394l1767
53254A364801l2005l1888l1531l1091l0442k9527k8695k8243k7892k7237k6369
53243A039881k5670k5200k4743k4292k4043k4031k4052k3812k3062k1787k0365
53232G78824j9177j8020j6368j4270j2383j0989r664q245p282p146p367p449p626
53219F32838q223q943r430r959j0891j1970j2844j3650j4409j4484j3454j1972
53207D92609j0848r902q636p429o939o845o394n845o039o806p166p072p495q647
$$ plain form
53193 386546 377097 367936 359617 351987 344998 338872 333572 328787 324377 320297 316320 312387 309011 306662
53179 306662 304916 302876 300312 297697 295234 292596 289672 286811 284176 281499 278659 275904 273327 270723
53165 270723 268163 266134 264790 263668 262479 261673 261718 262274 262633 262617 262522 262366 261848 260983 260182 259641 259127 258459
53147 258459 257769 257093 256161 254891 253712 253071 252872 252807 253020 253916 255343 256445 256564 255946 255428 255595 256361 257171
53129 257171 257504 257373 257403 258234 259861 261845 264028 266501 268841 270151 270241 270138 270857 272226 273580 275014
53113 275014 277012 279183 280437 280414 279806 279221 278669 278264 278365 278595 277653 274762 270682 266763 263579 261021
53097 261021 259133 258115 257767 257530 256972 255940 254639 253837 254474 256454 258261 258324 256531 253963 251628 250036
53081 250036 249560 250222 251208 251345 250226 248454 246862 245991 246097 246998 247901 248073 247752 247804 248405 248722 248072 246815
$$ packed form
53193C86546r449r161q319p630o989o126n300m785m410m080l977l933l376k349
53179C06662j746k040k564k615k463k638k924k861k635k677k840k755k577k604
53165B70723k560k029j344j122j189q06M5N56L59j6r5j56n18q65q01n41n14o68
53147B58459o90o76r32j270j179o41j99o5K13Q96J427J102J19o18n18J67P66Q10
53129B57171L33j31L0Q31J627J984K183K473K340J310R0j03P19J369J354J434
53113B75014J998K171J254k3o08n85n52m05J01K30r42k891m080l919l184k558
53097B61021j888j018l48k37n58j032j301q02O37J980J807O3j793k568k335j592
53081B50036m76O62R86J37j119j772j592q71J06R01R03J72l21N2O01L17o50j257
$$ plain form
53063 246815 245780 245333 245370 245806 246559 247239 247337 246786 246080 245758 245840 245877 245529 244993 244723 244811 244959 245077 245451 246066
53043 246066 246212 245340 244006 243378 243843 244694 245174 245274 245399 245772 246369 247015 247355 247140 246702 246792 247689 248837
53025 248837 249556 249804 249977 250293 250689 251122 251592 251929 251858 251284 250408 249546 248836 248123 247174 246115 245513 245757 246479
53006 246479 246972 247134 247521 248426 249470 250278 250995 251687 251735 250454 248153 246061 245202 245737 247239 249162 250976
52989 250976 252311 253146 253673 253990 254108 254170 254329 254466 254394 254374 254993 256442 258271 260005 261559 262880 263647 263735
52971 263735 263589 263720 264040 264167 264168 264523 265446 266768 268353 270025 271114 270838 269373 267878 267059 266356 265009
52954 265009 263341 262246 261814 261279 260202 258933 257896 257154 256762 256881 257341 257659 257705 257836 258157 258170 257479 256350
52936 256350 255282 254449 253866 253646 253683 253506 252874 252117 251481 250609 249234 247945 247446 247324 246433 244567 242915
$$ packed form
53063B46815j035m47L7M36P53O80R8n51p06l22Q2L7l48n36k70Q8J48J18L74O15
53043B46066J46q72j334o28M65Q51M80J00J25L73N97O46L40k15m38R0Q97J148
53025B48837P19K48J73L16L96M33M70L37p1n74q76q62p10p13r49j059o02K44P22
53006B46479M93J62L87R05J044Q08P17O92M8j281k301k092q59N35J502J923J814
52989B50976J335Q35N27L17J18O2J59J37p2k0O19J449J829J734J554J321P67Q8
52971B63735j46J31L20J27JL55R23J322J585J672J089k76j465j495q19p03j347
52954B65009j668j095m32n35j077j269j037p42l92J19M60L18M6J31L21J3o91j129
52936B56350j068q33n83k20L7j77o32p57o36q72j375j289m99j22q91j866j652
$$ plain form
52919 242915 242633 243532 244528 244893 244642 244071 243367 242631 241974 241526 241448 241897 242903 244268 245605 246515 246888 247075
52901 247075 247591 248529 249467 250074 250574 251298 252040 252306 252066 251831 251931 252191 252371 252508 252670 252697 252401 251891 251487
52882 251487 251473 251936 252661 253183 253180 252884 252870 253361 253927 253956 253242 252152 251449 251971 254194 257913 262453 267123 271268
52863 271268 274058 274795 273643 271648 269739 268026 266285 264737 263778 263075 261497 258236 253790 249590 246656
52848 246656 244726 242710 239909 236618 233601 231301 229809 229294 229932 231356 232643 233047 232538 231551 230608 230327
52832 230327 231294 233405 235515 236315 235676 234831 235123 236761 238801 240137 240341 239751 238980 238449 238251 238234 238120
52815 238120 237737 237398 237990 240333 244272 248601 252108 254500 256137 257100 256949 255391 252807 249936 247224
52800 247224 244646 242056 239491 237167 235268 233816 232659 231596 230540 229615 229045 228920 229072 229204 229143 228947
$$ packed form
52919B42915k82Q99R96L65k51n71p04p36o57m48p8M49J006J365J337R10L73J87
52901B47075N16R38R38O07N00P24P42K66k40k35J00K60J80J37J62K7k96n10m04
52882B51487j4M63P25N22lk96j4M91N66K9p14j090p03N22K223L719M540M670M145
52863B71268K790P37j152j995j909j713j741j548r59p03j578l261m446m200k934
52848B46656j930k016k801l291l017k300j492n15O38J424J287M04n09r87r43k81
52832B30327R67K111K110Q00o39q45K92J638K040J336K04n90p71n31j98j7j14
52815B38120l83l39N92K343L939M329L507K392J637R63j51j558k584k871k712
52800B47224k578k590k565k324j899j452j157j063j056r25n70j25J52J32o1j96
$$ plain form
52784 228947 228794 228890 229469 230716 232533 234416 235739 236246 236237 236236 236526 236981 237228 236905 235860 234277 232685 231678
52766 231678 231360 231065 229884 227691 225465 224316 224335 224747 225098 225686 226707 227630 227917 227949 228586 229955 231351
52749 231351 232351 233416 235140 237407 239621 241473 243138 244891 246842 248936 250895 252187 252423 251917 251651
52734 251651 252447 254161 255854 256821 257297 258009 259200 260353 260899 260791 260245 259272 257882 256494 255649 255283 254704
52717 254704 253436 251787 250391 249449 248654 247749 246869 246262 245869 245368 244685 244261 244571 245421 246064 246083 245891 246184
52699 246184 247226 248860 250878 252971 254641 255621 256222 256816 257175 256856 256077 255566 255580 255676 255492 255138 254722 254176
52681 254176 253698 253698 254010 253852 252915 251832 251116 250309 248822 247019 245688 244859 244042 243373 243639 245099 247068
52664 247068 248818 250230 251388 252166 252516 252717 253027 253475 254277 256092 259486 264259 269482 274037 277082 278335
$$ packed form
52784B28947j53R6N79J247J817J883J323N07rjK90M55K47l23j045j583j592j007
52766B31678l18k95j181k193k226j149J9M12L51N88J021R23K87L2O37J369J396
52749B31351J000J065J724K267K214J852J665J753J951K094J959J292K36n06k66
52734B51651P96J714J693R67M76P12J191J153N46j08n46r73j390j388q45l66n79
52717B54704j268j649j396r42p95r05q80o07l93n01o83m24L10Q50O43J9j92K93
52699B46184J042J634K018K093J670R80O01N94L59l19p79n11J4R6j84l54m16n46
52681B54176m78%L12j58r37j083p16q07j487j803j331q29q17o69K66J460J969
52664B47068J750J412J158P78L50K01L10M48Q02J815L394M773N223M555L045J253
$$ plain form
52648 278335 278143 277070 275268 272464 268753 265029 262357 261050 260662 260630 260607 260311 259585 258713 258368 259056 260720
52631 260720 262930 265292 267671 270219 273274 276952 280718 283515 284523 283713 281599 278648 275169 271590
52617 271590 268432 265924 263875 262082 260693 259985 259928 260119 260187 260103 260112 260423 260987 261539 261833 261856 261790 261789 261790 261573 260961
52596 260961 260004 259052 258587 258848 259559 260136 260275 260292 260897 262613 265392 268599 271402 273335 274580 275605 276549
52579 276549 277091 276934 276177 275166 274183 273388 272820 272341 271800 271336 271292 271644 271846 271489 270854 270512 270583 270732 270739 270709
52559 270709 270786 270940 271042 270949 270593 270170 270076 270460 270984 271220 271089 270683 270016 269254 268820 268786 268508 267406 265861
52540 265861 264704 264060 263406 262645 262227 262233 262205 262074 262395 263365 264424 265272 266496 268583 270902 272392 272872 272988
52522 272988 273149 273198 273044 273039 273593 274741 276136 277292 277971 278482 279460 281210 283421 285645 287729 289627 291154
$$ packed form
52648B78335j92j073j802k804l711l724k672j307l88l2k3k96p26q72l45O88J664
52631B60720K210K362K379K548L055L678L766K797J008q10k114k951l479l579
52617B71590l158k508k049j793j389p08n7J91O8q4RL11N64N52K94K3o6jJk17o12
52596B60961r57r52m65K61P11N77J39J7O05J716K779L207K803J933J245J025R44
52579B76549N42j57p57j011r83p95n68m79n41m64m4L52K02l57o35l42P1J49Pl0
52559B70709P7J54J02r3l56m23r4L84N24K36j31m06o67p62m34l4k78j102j545
52540B65861j157o44o54p61m18Ok8j31L21R70J059Q48J224K087K319J490M80J16
52522B72988J61M9j54nN54J148J395J156O79N11R78J750K211K224K084J898J527
$$ plain form
52505 291154 292170 292680 292494 291170 288700 285909 283710 282152 280614 278756 276865 275287 273938 272424 270496
52490 270496 268419 266894 266400 266535 266388 265676 265063 265152 265683 266114 266471 267079 267882 268661 269577 270810 271898 272176
52472 272176 271811 271699 272349 273470 274730 276256 278238 280536 282918 285340 287830 290336 292793 295102 297057
52457 297057 298500 299472 299923 299453 297727 295044 292091 289211 286315 283403 280645 277986 275196 272385 270050
52442 270050 268542 267843 267723 267699 266993 265197 262989 261601 261482 262085 262935 264125 265601 266793 267376 267729 268182
52425 268182 268410 268088 267633 267670 268155 268653 269221 270472 272848 276215 279945 283059 284654 284820 284983 286756 290458
52408 290458 295264 300717 307485 316480 327702 340226 352861 364404 373446 378499 378681 374346 366942
52395 366942 358124 348973 339961 331436 323849 317517 312488 308728 306212 304724 303803 303072 302535 302429 302932
$$ packed form
52505B91154J016N10j86j324k470k791k199j558j538j858j891j578j349j514j928
52490B70496k077j525m94J35j47p12o13Q9N31M31L57O08Q03P79R16J233J088K78
52472B72176l65j12O50J121J260J526J982K298K382K422K490K506K457K309J955
52457B97057J443R72M51m70j726k683k953k880k896k912k758k659k790k811k335
52442B70050j508o99j20k4p06j796k208j388j19O03Q50J190J476J192N83L53M53
52425B68182K28l22m55L7M85M98N68J251K376L367L730L114J595J66J63J773L702
52408B90458M806N453O768Q995J1222J2524J2635J1543R042N053J82m335p404
52395C66942q818r151r012q525p587o332n029l760k516j488r21p31n37j06N03
$$ plain form
52380 302932 304067 305646 307232 308454 309471 310873 312959 315406 317831 320325 323188 326403 329670 332663
52366 332663 335026 336444 337130 337859 339092 340337 340832 340567 340059 339448 338556 337703 337604 338379 339404 340305 341324
52349 341324 342525 343435 343921 344665 346217 348169 349992 352144 355470 359765 363833 367001 369845 373297 377659
52334 377659 382681 388002 393304 398469 403878 410145 417395 425222 433606 443345 455152 468635 482704
52321 482704 496782 511141 526101 541424 556596 571355 585799 600191 614831 629996 645923
52310 645923 662798 680694 699429 718658 738197 758060 778008 797350 815622 833299 851378
52299 851378 870254 889401 908048 925555 941050 953444 962349 968574 973201 976443 977837 977261 975059
52286 975059 971311 965713 958408 950372 942647 935560 929046 923325 918749 915143 911820 908386 905181 902857
$$ packed form
52380C02932J135J579J586J222J017J402K086K447K425K494K863L215L267K993
52366C32663K363J418O86P29J233J245M95k65n08o11q92q53r9P75J025R01J019
52349C41324J201R10M86P44J552J952J823K152L326M295M068L168K844L452M362
52334C77659N022N321N302N165N409O267P250P827Q384R739J1807J3483J4069
52321D82704J4078J4359J4960J5323J5172J4759J4444J4392J4640J5165J5927
52310F45923J6875J7896J8735J9229J9539J9863J9948J9342J8272J7677J8079
52299H51378J8876J9147J8647J7507J5495J2394Q905O225M627L242J394n76k202
52286I75059l748n598p305q036p725p087o514n721m576l606l323l434l205k324
$$ plain form
52272 902857 901852 902420 904773 908811 913886 919238 924688 930552 936885 943317 949818 957236 966576 977932
52258 977932 990565 1003996 1018543 1034621 1051894 1069369 1086136 1101818 1116470 1130272 1143256
52247 1143256 1155152 1165397 1173354 1178585 1181077 1181339 1180135 1177945 1174635 1169842 1163587 1156296 1148317 1139761
52233 1139761 1130778 1121560 1111935 1101367 1089635 1077275 1065098 1053562 1042787 1032928 1024191 1016562
52221 1016562 1009765 1003481 997548 992116 987634 984492 982593 981506 981098 981648 983252 985498 987945 990518
52207 990518 993208 995762 998027 1000210 1002434 1004412 1006015 1007858 1010856 1015422 1021481 1028834 1036967 1044864
52193 1044864 1051834 1058338 1065209 1072081 1077428 1080284 1081204 1081260 1080746 1079226 1076352 1072187 1067045 1061345 1055385
52178 1055385 1049126 1042440 1035643 1029345 1023608 1017743 1011274 1004709 999009 994584 991209 988638 986821 985663
$$ packed form
52272I02857j005N68K353M038N075N352N450N864O333O432O501P418R340J1356
52258I77932J2633J3431J4547J6078J7273J7475J6767J5682J4652J3802J2984
52247A143256J1896J0245P957N231K492K62j204k190l310m793o255p291p979q556
52233A139761q983r218r625j0568j1732j2360j2177j1536j0775r859q737p629
52221A016562o797o284n933n432m482l142j899j087m08N50J604K246K447K573
52207I90518K690K554K265K183K224J978J603J843K998M566O059P353Q133P897
52193A044864O970O504O871O872N347K856R20N6n14j520k874m165n142n700n960
52178A055385o259o686o797o298n737n865o469o565n700m425l375k571j817j158
$$ plain form
52164 985663 985014 984961 985737 987258 988985 990449 991806 993670 996353 999337 1001621 1002628 1002672 1002512 1002659 1003223
52148 1003223 1004180 1005447 1006815 1008159 1009733 1011925 1014645 1017201 1018859 1019343 1018769 1017366 1015389 1013170 1011199
52133 1011199 1010137 1010541 1012382 1015081 1018410 1023177 1030534 1040631 1052490 1065317 1079416 1095624 1114243
52120 1114243 1134831 1156692 1179248 1202096 1224992 1247808 1270465 1292934 1315228 1337168 1358292
52109 1358292 1378312 1397609 1416925 1436539 1456021 1474723 1492174 1508092 1522498 1535795 1548208
52098 1548208 1559108 1567436 1572817 1575638 1575920 1572874 1565949 1555658 1542941 1528296 1512062 1495070 1478380
52085 1478380 1462558 1447642 1433518 1419960 1406662 1393775 1382125 1372438 1364527 1357713 1351743 1346797
52073 1346797 1342890 1339944 1338385 1338989 1341985 1346812 1352856 1360063 1368670 1378687 1389814 1401703 1414250
$$ packed form
52164I85663o49n3P76J521J727J464J357J864K683K984K284J007M4j60J47N64
52148A003223R57J267J368J344J574K192K720K556J658M84n74j403j977k219j971
52133A011199j062M04J841K699L329M767P357J0097J1859J2827J4099J6208J8619
52120A114243K0588K1861K2556K2848K2896K2816K2657K2469K2294K1940K1124
52109A358292K0020J9297J9316J9614J9482J8702J7451J5918J4406J3297J2413
52098A548208J0900Q328N381K821K82l046o925j0291j2717j4645j6234j6992j6690
52085A478380j5822j4916j4124j3558j3298j2887j1650r687p911o814n970m946
52073A346797l907k946j559O04K996M827O044P207Q607J0017J1127J1889J2547
$$ plain form
52060 1414250 1427735 1442617 1458972 1476154 1493194 1509452 1524730 1538864 1551471 1562033 1569985
$$ packed form
52060A414250J3485J4882J6355J7182J7040J6258J5278J4134J2607J0562P952
$$ [...]
##END NTUPLES=NMR SPECTRUM
##END=
