
##TITLE=UV1272_M13_1250-1169_20_7414597_TuzFxCuXQv
##JCAMPDX= 6.0         $$ Bruker NMR JCAMP-DX V2.0
##DATA TYPE= NMR SPECTRUM
##DATA CLASS= NTUPLES
##ORIGIN= BRUKER
##OWNER= Administrator
$$ 1.72 TOPSPIN		Version 2.1
$$ 2013-01-26 00:32:11.118 -0500  Administrator@X
$$ Compression mode = diff/dup
##.OBSERVE FREQUENCY= 400.02188249412
##.OBSERVE NUCLEUS= ^1H
##.ACQUISITION MODE= SIMULTANEOUS (DQD)
##.ACQUISITION SCHEME= undefined
##.AVERAGES= 64
##.DIGITISER RES= 22
##SPECTROMETER/DATA SYSTEM= spect
##.PULSE SEQUENCE= noesygpps1d.comp
##.SOLVENT NAME= COFFEE_meoh
##.SHIFT REFERENCE= INTERNAL, COFFEE_meoh, 1, 14.96105
##AUDIT TRAIL= $$ (NUMBER, WHEN, WHO, WHERE, PROCESS, VERSION, WHAT)
$$ ##TITLE= Audit trail, TOPSPIN		Version 2.1
$$ ##JCAMPDX= 5.01
$$ ##ORIGIN= Bruker BioSpin GmbH
$$ ##OWNER= Administrator
$$ $$ E:\/data/COFFEE/nmr/UV1272_M13_1250-1169_20_7414597_TuzFxCuXQv/12/pdata/1/auditp.txt
$$ ##AUDIT TRAIL=  $$ (NUMBER, WHEN, WHO, WHERE, PROCESS, VERSION, WHAT)
(   1,<2013-01-26 00:32:05.368 -0500>,<Administrator>,<X>,<go>,<TOPSPIN 2.1>,
      <created by zg
	started at 2013-01-26 00:20:34.446 -0500,
	POWCHK enabled, PULCHK disabled,
       configuration hash MD5:
       86 BA 57 50 F2 9D 5C 9B 26 00 A9 28 5F 66 2E 89
       data hash MD5: 64K
       77 E0 07 CE 26 4C 8D F6 63 69 46 1B 0F B2 9D 5F>)
(   2,<2013-01-26 00:32:08.399 -0500>,<Administrator>,<X>,<proc1d>,<TOPSPIN 2.1>,
      <Start of raw data processing
       efp LB = 0.3 FT_mod = 6 PKNL = 1 PHC0 = 0 PHC1 = 0 SI = 128K 
       data hash MD5: 128K
       35 47 2D FF 4A 5A CE EA C2 41 61 88 A1 C8 78 92>)
(   3,<2013-01-26 00:32:09.430 -0500>,<Administrator>,<X>,<proc1d>,<TOPSPIN 2.1>,
      <pk PHC0 = -83.58398 PHC1 = 0 
       data hash MD5: 128K
       25 EF BE 05 09 E0 35 DE BC 10 BA E9 CA DA 12 24>)
(   4,<2013-01-26 00:32:10.071 -0500>,<Administrator>,<X>,<proc1d>,<TOPSPIN 2.1>,
      <abs ABSG = 1 
       data hash MD5: 128K
       D4 A7 AD 44 E6 05 97 23 C4 76 32 7D 96 81 52 91>)
(   5,<2013-01-26 00:32:10.259 -0500>,<Administrator>,<X>,<proc1d>,<TOPSPIN 2.1>,
      <abs ABSG = 2 
       data hash MD5: 128K
       0F EE 92 E9 B9 08 4C E4 BF 00 79 36 E1 7C F8 8A>)
(   6,<2013-01-26 00:32:10.446 -0500>,<Administrator>,<X>,<proc1d>,<TOPSPIN 2.1>,
      <abs ABSG = 3 
       data hash MD5: 128K
       B0 46 E2 13 71 9C 22 D5 90 79 C8 50 3E 41 2F 10>)
(   7,<2013-01-26 00:32:10.634 -0500>,<Administrator>,<X>,<proc1d>,<TOPSPIN 2.1>,
      <abs ABSG = 4 
       data hash MD5: 128K
       F8 05 41 AF 41 94 FD 6C 9A E4 54 DF B6 44 D7 4C>)
(   8,<2013-01-26 00:32:10.790 -0500>,<Administrator>,<X>,<proc1d>,<TOPSPIN 2.1>,
      <abs ABSG = 5 
       data hash MD5: 128K
       E5 1D 12 24 7C 4E E1 2A 5F B8 44 AC 34 5C 2D 9D>)
$$ ##END=
$$ 
$$ $$ hash MD5
$$ $$ EF 45 48 8D 62 A0 54 9F BF 13 32 C2 FB A8 9D 0F
##$RELAX= 
##$RELAX= 
##$RELAX= 
##$RELAX= 
##$RELAX= 
##$RELAX= 
##$RELAX= 
##$RELAX= 
$$ Bruker specific parameters
$$ --------------------------
##$DU= <E:\>
##$EXPNO= 12
$$ [...]
##$TP07= 0
##$TPNAME0= <>
##$TPNAME1= <>
##$TPNAME2= <>
##$TPNAME3= <>
##$TPNAME4= <>
##$TPNAME5= <>
##$TPNAME6= <>
##$TPNAME7= <>
##$TPOAL= (0..7)
0.5 0.5 0.5 0.5 0.5 0.5 0.5 0.5
##$TPOFFS= (0..7)
0 0 0 0 0 0 0 0
##$TUNHIN= 0
##$TUNHOUT= 0
##$TUNXOUT= 0
##$USERA1= <user>
##$USERA2= <user>
##$USERA3= <user>
##$USERA4= <user>
##$USERA5= <user>
##$V9= 5
##$VALIST= <valist>
##$VCLIST= <CCCCCCCCCCCCCCC>
##$VD= 0
##$VDLIST= <DDDDDDDDDDDDDDD>
##$VPLIST= <PPPPPPPPPPPPPPP>
##$VTLIST= <TTTTTTTTTTTTTTT>
##$WBST= 2048
##$WBSW= 25
##$XGAIN= (0..3)
0 0 0 0
##$XL= 0
##$YL= 0
##$YMAX_a= 6389192
##$YMIN_a= -12054893
##$ZGOPTNS= <>
##$ZL1= 120
##$ZL2= 120
##$ZL3= 120
##$ZL4= 120
##$ABSF1= 14.96105
##$ABSF2= -5.597132
##$ABSG= 5
##$ABSL= 3
##$ALPHA= 0
##$AQORDER= 0
##$ASSFAC= 0
##$ASSFACI= 0
##$ASSFACX= 0
##$ASSWID= 0
##$AUNMP= <proc_prof1d_extract.lims>
##$AXLEFT= 0
##$AXNAME= <>
##$AXNUC= <1H>
##$AXRIGHT= 0
##$AXTYPE= 0
##$AXUNIT= <>
##$AZFE= 0.1
##$AZFW= 0.1
##$BCFW= 0
##$BC_mod= 0
##$BYTORDP= 0
##$COROFFS= 0
##$CY= 15
##$DATMOD= 1
##$DC= 0
##$DFILT= <>
##$DTYPP= 0
##$F1P= 0
##$F2P= 0
##$FCOR= 0.5
##$FTSIZE= 131072
##$FT_mod= 6
##$GAMMA= 0
##$GB= 0
##$INTBC= 1
##$INTSCL= 1
##$ISEN= 128
##$LB= 0.3
##$LEV0= 0
##$LPBIN= 0
##$MAXI= 10000
##$MC2= 0
##$MEAN= 0
##$ME_mod= 0
##$MI= 0
##$NCOEF= 0
##$NC_proc= -2
##$NLEV= 6
##$NOISF1= 0
##$NOISF2= 0
##$NSP= 0
##$NTH_PI= 0
##$NZP= 0
##$OFFSET= 14.96105
##$PC= 1
##$PHC0= -83.58398
##$PHC1= 0
##$PH_mod= 1
##$PKNL= yes
##$PPARMOD= 0
##$PPDIAG= 0
##$PPIPTYP= 0
##$PPMPNUM= 2147483647
##$PPRESOL= 1
##$PSCAL= 4
##$PSIGN= 0
##$PYNMP= <proc.py>
##$REVERSE= no
##$SF= 400.020009616637
##$SI= 131072
##$SIGF1= 0
##$SIGF2= 0
##$SINO= 400
##$SIOLD= 131072
##$SPECTYP= <>
##$SREGLST= <1H.CDCl3>
##$SSB= 0
##$STSI= 131072
##$STSR= 0
##$SW_p= 8223.68421052631
##$SYMM= 0
##$S_DEV= 0
##$TDeff= 65536
##$TDoff= 0
##$TI= <>
##$TILT= no
##$TM1= 0
##$TM2= 0
##$TOPLEV= 0
##$USERP1= <user>
##$USERP2= <user>
##$USERP3= <user>
##$USERP4= <user>
##$USERP5= <user>
##$WDW= 1
##$XDIM= 131072
##$YMAX_p= 476227223
##$YMIN_p= -14301
##$CURPLOT= <Network HP LaserJet P1505>
##$CURPRIN= <$Network HP LaserJet P1505>
##$DFORMAT= <normdp>
##$LAYOUT= <+/1D_H.xwp>
##$LFORMAT= <normlp>
##$PFORMAT= <normpl>
##$SURQMSG= 1
$$ End of Bruker specific parameters
$$ ---------------------------------
##NTUPLES= NMR SPECTRUM
##VAR_NAME=  FREQUENCY,     SPECTRUM/REAL,   SPECTRUM/IMAG
##SYMBOL=    X,             R,               I
##VAR_TYPE=  INDEPENDENT,   DEPENDENT,       DEPENDENT
##VAR_FORM=  AFFN,          ASDF,            ASDF
##VAR_DIM=   131072,        131072,          131072
##UNITS=     HZ,            ARBITRARY UNITS, ARBITRARY UNITS
##FACTOR=    0.0627417313425164, 1,          1
##FIRST=     8223.62146879497, 2345,         -60739
##LAST=      0,             4099,            -61243
##MIN=       0,             -14301,          0
##MAX=       8223.62146879497, 476227223,    0
$$ Real data points
##PAGE= N=1
##DATA TABLE= (X++(R..R)), XYDATA
$$ [...]
67912 93449 91151 88706 86958 86280 85969 85057 83504 82069 81224 80718 80205 79757 79621 79827 80164 80299 79825
67895 79825 78584 77014 75951 75913 76770 78094 79470 80400 80372 79388 78185 77575 77658 77917 77978 78010 78393 79178 79959
67876 79959 80150 79465 78170 76891 76139 76066 76584 77521 78609 79549 80200 80585 80664 80374 79939 79879 80493 81546 82591
67857 82591 83330 83428 82399 80196 77729 76277 76304 77172 77963 78164 77607 76315 74656 73262 72425 71815 71003
67840 71003 70038 69250 68725 68276 67828 67576 67808 68735 70300 71927 72690 72186 71244 71355 73203 76008 78440
67823 78440 79986 81242 82993 85270 87363 88661 89349 90131 91278 92152 91891 90434 88547 86885 85400
67808 85400 83694 81577 79058 76164 73098 70413 68670 67986 68083 68584 69037 68916 68018 66809 65972 65671 65602
67791 65602 65691 66146 66700 66459 64959 63036 62112 62690 63967 64813 64801 64266 63796 63868 64676 66077 67684 69180
67773 69180 70497 71676 72612 73067 72939 72411 71764 71179 70843 71171 72560 74786 76962 78497 79898 82109
67757 82109 85063 87502 88469 88438 88478 88719 88324 86851 84928 83414 82447 81649 80901 80499 80669 81254 81899 82302
67739 82302 82291 81789 80792 79288 77223 74643 71864 69446 67934 67564 68110 68948 69350 68940 67939 66922 66283
67722 66283 65968 65695 65233 64391 62951 60915 58756 57121 56236 55849 55779 56150 56948 57742 58200 58581 59324 60353
67704 60353 61274 62063 63025 64058 64575 64293 63642 63163 62918 62697 62470 62308 62119 61749 61206 60624 60155 59961 60100
67685 60100 60379 60550 60646 60812 60958 61022 61451 62736 64459 65644 66231 67249 69157 71044 72124 73007 74515
67668 74515 76083 76651 76578 77235 78840 80044 79788 78421 76743 75062 73597 72818 72839 73164 73484 74085 75088
67651 75088 75892 75809 74811 73352 71917 70966 70699 70638 70034 68938 68172 67948 67362 65789 64036 63375 64010 65232
67633 65232 66586 68054 69378 70107 70319 70643 71502 72751 74042 75143 75912 76279 76241 75786 74995 74332 74413 75275
67615 75275 76308 77185 78308 79908 81356 82018 82269 82867 83728 84184 84203 84359 84674 84447 83402 82169 81322
67598 81322 80635 79629 78287 76847 75323 73664 72090 70954 70367 70075 69605 68586 67182 66206 66403 67612
67582 67612 68858 69325 68958 68280 68010 68710 70239 71574 71737 70989 70555 71089 72047 72675 72841 72602 71679 69995
67564 69995 68220 67161 66888 66966 67260 67916 68808 69571 70159 70846 71687 72368 72564 72085 70772 68670 66347 64588
67546 64588 63726 63565 63944 64910 66179 66977 66754 65834 65055 64943 65449 66234 66832 66649 65261 62909 60493 58938
67528 58938 58537 58867 59194 59023 58468 58159 58592 59516 60160 60082 59595 59230 59035 58669 57965 57050 56089 55289 55114
67509 55114 56023 57784 59410 59995 59492 58544 57768 57382 57330 57524 57973 58737 59637 60057 59400 57886 56563 56262
67491 56262 56758 57267 57483 57719 58151 58449 58267 57829 57820 58771 60516 62177 62810 62227 61155 60494 60565 61145 61898
67472 61898 62495 62560 61943 60919 59864 58884 58055 57683 57837 57854 57035 55780 55345 56291 57828 58892 59300 59508
67454 59508 59804 60227 60886 61879 63053 64209 65328 66257 66445 65447 63561 61622 60184 59227 58544 58069 57842
67437 57842 57933 58425 59225 59976 60379 60573 60955 61664 62546 63532 64687 65838 66541 66631 66500 66621 66978 67221 67185
67418 67185 66947 66466 65555 64324 63329 63053 63367 63729 63796 63586 63101 62148 60721 59298 58532 58697 59601 60898
67400 60898 62262 63330 63794 63698 63488 63655 64334 65221 65826 65848 65444 65051 64883 64691 64165 63449 62953 62751 62507
67381 62507 62001 61372 60758 60133 59742 60287 62147 64562 66048 65751 64129 62280 60934 60201 59958 60139 60686
67364 60686 61499 62437 63274 63694 63571 63224 63136 63334 63345 62938 62583 62809 63335 63403 62909 62591 62923 63432 63481 63255
67344 63255 63443 64249 65209 65825 65919 65562 65168 65524 67111 69352 71041 71597 71503 71508 71965 72972 74525 76227
67326 76227 77315 77336 76498 75232 73810 72534 71799 71602 71434 70986 70582 70520 70466 70020 69583 69972 71256 72514
67308 72514 72836 72212 71370 71064 71506 72315 72980 73461 74234 75598 77231 78588 79509 80087 80249 79869 79111 78221
67290 78221 77117 75578 73738 71956 70392 69193 68891 69931 71768 73178 73680 74062 75194 76809 77852
67275 77852 77645 76355 74670 73437 73398 74808 77216 79806 81892 83101 83373 82995 82434 81891 81145 79953
67259 79953 78403 76784 75368 74539 74730 75860 77087 77535 77181 76700 76583 76827 77291 77871 78262 78016 77052
67242 77052 75808 74794 74212 74090 74478 75361 76557 77821 78926 79617 79726 79373 78866 78369 77880 77578 77806
67225 77806 78616 79644 80614 81669 82914 83921 84039 83116 81666 80402 79770 79832 80373 81091 81801 82431 82868
67208 82868 83040 83190 83707 84534 85115 85228 85454 86361 87556 88149 87962 87599 87367 86827 85634 84254 83544 83976
67190 83976 85430 87353 88890 89270 88439 87129 86138 85737 85839 86321 86961 87442 87782 88456 89743 91152 91878
67173 91878 91735 91373 91628 92852 94732 96556 97708 98063 97882 97458 97074 97210 98280 100066 101812 103021
67157 103021 103712 103828 103151 102075 101717 102626 103943 104521 104358 104284 104640 105134 105640 106232 106621 106461 106148 106445
67139 106445 107283 107812 107726 107701 108302 109248 110016 110465 110594 110385 110244 110857 112150 112970 112376 110791 109432 109007
67121 109007 109476 110729 112822 115580 118433 120806 122572 124151 126083 128330 130063 130476 129766 128913 128601
67106 128601 128876 129771 131410 133246 134056 133250 131655 130512 130178 130332 130869 131927 133334 134683 135854 136973
67090 136973 138019 138852 139488 139985 140293 140557 141274 142746 144581 146175 147445 148717 150137 151650 153346 155350
67074 155350 157498 159496 161279 162900 164298 165534 167009 168971 171034 172647 173901 175376 177273 179231
67060 179231 180881 182188 183233 184098 184938 185828 186576 186952 187041 187092 187200 187427 188032 189254 191048 193353 196306
67043 196306 199784 203070 205505 207269 209005 210931 212862 214857 217122 219445 221457 223404 225922 229010
67029 229010 231942 234262 236198 237961 239400 240578 242029 244117 246681 249590 253037 256882 260280 262526
67015 262526 263999 265842 268821 272780 276969 280639 283569 286288 289654 293989 298739 303125 307016 311030
67001 311030 315873 321598 327372 332071 335382 338202 341642 345782 349892 353786 358164 363413 368818 373491
66987 373491 377565 381866 386703 391638 396363 401227 406702 412650 418338 423160 427239 431294 435875 440806
66973 440806 445554 450093 455122 461352 468793 476840 484849 492502 499784 506783 513558 520261 527401 535692
66959 535692 545262 555243 564631 573534 582966 593387 604038 614020 623423 632943 642842 652871 663076
66946 663076 674046 686236 699394 712818 726055 739222 752664 766419 780103 793401 806538
66935 806538 820127 834648 850212 866676 883673 900652 917286 933868 950972 968737 986798
66924 986798 1004942 1023486 1042938 1063628 1085611 1108544 1131657 1154366 1176946 1200133 1224023
66913 1224023 1247984 1271692 1295598 1320111 1345042 1370258 1396165 1422972 1450028 1476579 1502843
66902 1502843 1529668 1557428 1585905 1615032 1644987 1675512 1705781 1735094 1763416 1791190 1818953
66891 1818953 1847074 1875483 1903644 1931119 1958155 1985424 2013158 2040811 2067595 2093095 2117336
66880 2117336 2140518 2162802 2184291 2205161 2225694 2245913 2265159 2282428 2297401 2310827 2323525
66869 2323525 2335281 2345135 2352512 2357631 2360913 2362545 2362606 2361114 2357796 2352237 2344463 2335145 2325001 2314160
66855 2314160 2302148 2288422 2272809 2255559 2236989 2217134 2195865 2173404 2150478 2127660 2104743
66844 2104743 2081059 2056309 2030797 2004854 1978396 1951115 1922864 1893782 1864196 1834395 1804375
66833 1804375 1773844 1742685 1711400 1680894 1651781 1623938 1596702 1569350 1541575 1513731 1486559
66822 1486559 1460475 1435139 1409855 1384316 1358722 1333297 1308000 1282758 1257711 1233088 1208970
66811 1208970 1185175 1161399 1137572 1114201 1092157 1071858 1052761 1033969 1015216 996928 979382
66800 979382 962239 945028 927707 910510 893468 876345 859004 841645 824721 808705 793895
66789 793895 780307 767665 755515 743440 731289 719202 707332 695552 683587 671439 659485
66778 659485 648085 637244 626737 616315 605687 594699 583736 573674 565012 557172 549063 540254
66766 540254 531286 522920 515413 508505 501734 494721 487423 480222 473538 467331 461150 454597 447572 440178
66752 440178 432737 425813 419835 414657 409812 405190 400999 397027 392514 387066 381236 375790 370760 365732
66738 365732 360819 356680 353462 350287 346086 340703 334874 329345 324337 319806 315805 312368 309233 305942
66724 305942 302222 298165 294067 290222 286813 283772 280673 276994 272718 268544 265296 263086 261224 258976
66710 258976 256301 253741 251674 249857 247717 245001 242011 239212 236753 234407 231893 229152 226371 223806
66696 223806 221510 219211 216638 214001 211941 210833 210373 209972 209299 208135 206070 202875 199094 195760 193480
66681 193480 192137 191359 190819 190188 189339 188578 188108 187380 185682 183385 181728 181144 180672 179376 177462 175499
66665 175499 173454 171213 169301 168172 167371 166261 165067 164260 163405 161758 159731 158547 158429 158246 157168
66650 157168 155629 154421 153767 153660 154151 154743 154277 152148 149215 146892 145679 145026 144294 143319 142278 141527
66634 141527 141469 142141 142952 143176 142663 141793 140780 139371 137338 135017 133149 132203 131998 132017 131940 131719 131221 130131
66616 130131 128342 126212 124270 122850 122148 122350 123404 124830 125984 126438 126034 124856 123344 122066 121078
66601 121078 119881 118323 117103 116849 117152 117139 116694 116383 116393 116316 115917 115366 114746 113996 113298 112839 112235 110959
66583 110959 109323 108243 107945 107745 107235 106751 106371 105384 103351 100965 99359 98999 99649 100820 101868 102253
66567 102253 102211 102646 103917 105227 105623 105071 104075 102850 101498 100513 100347 100779 101273 101710 102186 102401 101879 100673
66549 100673 99305 98135 97218 96568 96078 95327 93998 92418 91311 91031 91344 91783 91944 91663 91229 91158 91508
66532 91508 91748 91640 91766 92619 93657 93987 93726 93836 94638 95331 95144 94280 93426 92818 92176 91280 90359 89937 90318
66513 90318 91116 91433 90762 89594 88880 89023 89698 90439 90952 91003 90562 90081 90105 90533 90711 90399 90151 90426 90738
66494 90738 90101 88210 85926 84487 84384 84947 85029 84075 82505 81086 80159 79634 79474 79776 80411 80971 81195 81235
66476 81235 81398 81816 82441 83234 84128 84870 85079 84628 83952 83752 84225 84728 84494 83590 82807 82611 82656 82488 82237
66457 82237 82281 82558 82591 82040 80951 79664 78731 78656 79392 80219 80395 79788 78750 77671 76903 76731 76988 76973 76232
66438 76232 75254 74973 75634 76568 76995 76745 76248 76089 76496 77050 77086 76506 75863 75452 74869 73923 73467 74544 76963
66419 76963 79450 81043 81678 81566 80842 79886 79191 78647 77551 75587 73370 71786 71185 71293 71545 71401 70745
66402 70745 70048 69781 69707 69188 68185 67365 67150 67258 67400 67823 68876 70478 72286 73970 75086 75171 74346 73493
66384 73493 73463 74289 75429 76483 77390 78179 78862 79447 79805 79681 79016 78121 77326 76557 75477 74001 72533 71646
66366 71646 71553 71957 72525 73400 74895 76671 77733 77541 76677 75957 75418 74809 74573 75356 76765 77665 77702 77562
66348 77562 77570 77141 75964 74742 74194 74126 74059 74058 74328 74611 74604 74445 74233 73686 72819 72390 72988 74223 75451 76654
66328 76654 77856 78329 77452 75943 75118 75139 75058 74434 73758 73230 72327 70900 69665 69137 68943 68712 68844 69723
66310 69723 70789 71172 70871 70567 70497 70213 69437 68547 68090 68228 68814 69694 70735 71764 72647 73413 74115 74605
66292 74605 74568 73977 73505 74196 76414 79142 80662 80064 77937 75512 73466 71804 70574 70139 70635 71606 72481
66275 72481 73209 74084 75044 75598 75552 75393 75675 76276 76596 76291 75372 73792 71552 69330 68295 68901 70269 71199
66257 71199 71472 71691 72128 72387 72240 72177 72799 74004 75117 75658 75716 75607 75452 75189 74826 74462 74164 74026 74372
66238 74372 75553 77351 78871 79406 79263 79341 80006 80813 81269 81275 80765 79596 78049 76879 76436 76244 75866 75698
66220 75698 76351 77592 78530 78626 78024 77100 76268 76055 76753 77991 79046 79546 79499 78925 77976 77233 77206 77604 77733
66201 77733 77546 77635 78217 78818 79052 78992 78658 77874 76862 76286 76395 76740 76999 77404 77998 78207 77687 76961 76647
66182 76647 76601 76405 76240 76560 77311 78129 78951 79770 80134 79660 78770 78183 77906 77543 77342 77884 78790 78889 77901 76927
66162 76927 76824 77109 77118 77403 79056 82072 85243 87460 88492 88659 88411 88160 87973 87447 86350 85173 84505
66145 84505 84010 82763 80710 79036 78786 79664 80581 80899 80669 80033 79073 78193 78054 78901 80241 81352 81948
66128 81948 82200 82266 82063 81580 81246 81760 83404 85628 87508 88631 89312 89939 90354 90101 89112 87894 87084 87012
66110 87012 87641 88724 89971 91171 92153 92605 92141 90837 89597 89569 91028 93072 94605 95380 95919 96618 97350
66093 97350 97889 98324 98887 99575 100132 100344 100165 99638 98834 97940 97276 97122 97464 97898 97843 97028 95848 95110 95238
66074 95238 95773 95880 95289 94501 94043 93929 94000 94410 95335 96420 97041 97102 97144 97570 98176 98596 98841 99087 99160 98549
66054 98549 96936 94612 92452 91441 91935 93331 94666 95598 96484 97501 98232 98386 98422 99025 100327 102014
66038 102014 103880 105773 107334 108375 109294 110526 111756 112317 112195 111940 111668 110960 109907 109434 110256 112072
66022 112072 114079 115744 116872 117545 118326 119919 122187 124033 124683 124545 124375 124214 123844 123762 124793 126852
66006 126852 128932 130324 131230 132089 132982 133962 135501 138273 142619 148318 154690 160930 166499 171228 174998
65991 174998 177537 178789 179266 179638 179992 179756 178321 175553 171874 168084 164874 162176 159159 155240 150879
65976 150879 146955 143665 140644 137965 136233 135595 135429 135265 135359 135974 136635 136610 135825 134853 134187 133885 133782 133685
65958 133685 133449 133129 133003 133230 133573 133645 133465 133595 134625 136490 138360 139365 139597 140245 142533 146601 151605
65941 151605 156652 161267 165164 168183 170491 172352 173643 174160 174419 175382 177147 178641 179124 179369 180651
65926 180651 183073 185609 187559 189178 190984 193144 195515 197784 199607 201202 203651 207872 213223 217878
65912 217878 220839 222867 225092 227435 229024 229653 230052 230840 231886 232699 233004 232822 232378 231976 231689 231129 229798
65895 229798 227649 224993 221887 218048 213501 208901 204840 201114 196997 192098 186641 181019 175460 170163
65881 170163 165426 161472 158326 155903 154029 152355 150527 148611 147116 146333 145835 144900 143367 141856 141101
65866 141101 141315 142119 142881 143055 142443 141340 140347 139940 140255 141212 142644 144194 145275 145419 144705 143778 143375
65849 143375 143864 145179 147071 149275 151403 152860 153219 152816 152650 153334 154220 154068 152635 151103 150676 151225
65833 151225 151792 152121 152996 155066 158063 161427 165130 169400 173991 178366 182487 186815 191393 195491 198460
65818 198460 200529 202330 203884 204538 203888 202293 200375 198359 196096 193488 190623 187627 184607 181702 179088
65803 179088 176902 175138 173540 171688 169471 167451 166332 165972 165374 163973 162475 161900 162207 162579 162896 164028
65787 164028 166458 169444 171997 174183 176876 180593 185188 190502 196665 203647 210925 217799 223805 228790
65773 228790 232792 235890 237918 238288 236284 231709 225168 217711 210284 203453 197375 191945 187111 183188
65759 183188 180764 180199 181279 183440 186290 189931 194872 201654 210441 220905 232566 245237 259012
65746 259012 273761 288824 303328 316696 328650 338778 346407 351002 352527 351250 347251 340351 330573
65733 330573 318537 305248 291472 277437 263139 248788 234802 221428 208624 196451 185431
65722 185431 176293 169280 163839 159070 154421 149939 145956 142679 140067 137957 136185 134621 133165 131838
65708 131838 130874 130645 131345 132680 133983 134696 134731 134327 133674 132798 131727 130575 129451 128448 127700 127279 127054
65691 127054 126865 126914 127743 129666 132378 135234 137777 139897 141719 143634 146319 150397 155977 162669 170002
65676 170002 177732 185858 194610 204462 215895 229005 243408 258609 274370 290651 307262 323634
65664 323634 339037 353083 365865 377374 386811 392955 395511 395712 395146 394198 392254 389328 386801 386244
65650 386244 387986 391137 394624 397806 400372 402132 402939 402540 400472 396211 389308 379347 366090 349993
65636 349993 332376 314629 297177 279565 261665 244488 229509 217237 206667 196300 185701
65625 185701 175911 168280 163052 159272 155915 152676 149626 146625 143471 140340 137647 135582 134123 133316
65611 133316 133084 132856 131912 130244 128670 127910 127932 128358 129030 129798 130092 129322 127703 126264 125949 126948 128912
65594 128912 131387 133849 135668 136478 136579 136763 137720 139658 142347 145303 148048 150597 153777 158727 165841
65579 165841 174420 183603 193394 204445 216992 230549 244701 259696 275841 292580 308553 322562
65567 322562 334219 343648 350805 355105 355701 352115 344734 334569 322477 308782 293856 278709 264417
65554 264417 250970 237323 222952 208907 196812 187071 178661 170643 163231 157122 152297 148014 143749
65541 143749 139741 136580 134648 133967 134262 135081 136104 137462 139562 142403 145275 147312 148227 148310 147825 146717
65525 146717 144838 142192 138873 135025 130986 127327 124573 122925 122258 122263 122508 122567 122333 122194 122710 124060 125890
65508 125890 127653 128954 129581 129461 128786 128018 127524 127231 126831 126342 126207 126711 127549 128205 128625 129244 130437 132190
65490 132190 134317 136735 139423 142303 145246 148072 150542 152482 153912 154851 155102 154574 153843 153875 154925 156053
65474 156053 156070 154731 152709 150664 148736 146768 144564 141989 139206 136796 135341 134886 135073 135576 136061 135937
65458 135937 134824 133260 132263 131969 131342 129605 127424 126132 126120 126604 126864 127077 127824 129262 131088 133001
65442 133001 134830 136267 136939 136976 137273 138754 141305 143799 145365 146369 147825 150085 152512 154352 155396
65427 155396 155687 155052 153256 150471 147369 144769 143179 142571 142546 142743 143026 143276 143325 143319 143785 144907 146044 146478
65409 146478 146396 146432 146487 145894 144761 144091 144336 144853 145285 146475 149174 152665 155647 157921 160142 162325 163810
65392 163810 164583 165434 166569 167140 166563 165420 164515 163755 162608 161150 159894 158923 157912 156971 156758 157537 158665
65375 158665 159373 159754 160518 161898 163230 163768 163591 163489 164150 165688 167727 169625 170780 171247 172036 174357
65359 174357 178440 183559 189293 196160 204696 214469 224473 234123 243320 251766 258756 263575 265814 265511
65345 265511 263347 260464 257675 254906 251636 247562 242558 236448 229394 222100 215018 207732 199912 192503
65331 192503 186943 183202 179660 175183 170378 166511 164031 162684 162278 162584 162938 162634 161550 159954 157941
65316 157941 155509 152926 150598 148658 146946 145192 143040 140237 137169 134865 133983 133973 133736 133002 132586 133304
65300 133304 135065 137148 138972 140431 141744 143197 144949 146875 148565 149534 149559 148848 147877 146965 146084 145199
65284 145199 144670 145027 146276 147684 148429 148316 147837 147700 148358 149714 151159 152030 152146 151740 150963 149794 148487
65267 148487 147587 147203 146635 145179 143139 141653 141566 142735 144390 145908 147235 148712 150556 152467 153970
65252 153970 155107 156447 158117 159213 158618 156293 153282 150520 148081 145623 143091 140735 138777 137372
65238 137372 136698 136805 137409 138032 138360 138439 138558 138976 139651 140141 139841 138508 136546 134656 133234 132250 131719 131919
65220 131919 132836 133620 133126 131170 128870 127514 127444 128279 129786 131906 134177 135887 136906 137778 138775 139421
65204 139421 139255 138594 138093 137896 137640 137095 136383 135646 134899 134167 133578 133333 133686 134707 135941 136601 136455 136243
65186 136243 136874 138404 140190 141831 143459 145171 146678 147584 147663 146895 145603 144465 143889 143377 142080 140103
65170 140103 138651 138646 139738 141007 142119 143301 144603 145897 147346 149233 151315 152938 153902 154708 155812
65155 155812 157120 158376 159639 161075 162684 164586 167310 171380 176727 182808 189222 196012 203507 212169
65141 212169 222348 233792 245504 256478 266460 275635 283852 290848 297203 304160 312095 319739 325409
65128 325409 328600 329999 330427 330268 329524 327856 324843 320690 316416 312709 308881 303609 296565 288636 280660
65113 280660 272735 264764 256861 248964 240687 231879 222903 214255 206356 199711 194570 190269 185664 180454
65099 180454 175438 171197 167362 163622 160618 159125 158924 159226 159690 160274 160568 160167 159460 159141 159072 158478 157248
65082 157248 156157 155717 155586 155374 155268 155480 155690 155582 155558 156285 157651 158647 158457 157457 156898 157608 159173 160539
65064 160539 161252 161735 162361 162879 163055 163353 164391 165965 167225 167627 167210 166098 164475 162981 162363 162526 162566
65047 162566 162041 161540 161681 162097 161970 161121 159993 158804 157355 155603 153829 152116 150126 147663 145140 143203
65031 143203 141989 141056 139958 138658 137304 135951 134743 134164 134680 136113 137718 138995 140048 140970 141319
65016 141319 140655 139366 138466 138551 139317 140117 140707 141387 142658 144817 147719 150912 154066 157171 160193 162782
65000 162782 164614 165849 166903 167860 168437 168458 168038 167397 166835 166826 167703 169273 171078 172991 175197 177663 180085
64983 180085 182352 184558 186521 187791 188277 188376 188385 188242 187950 187694 187302 186142 183884 180977 178052 175268 172560
64966 172560 170073 167948 166048 164367 163400 163552 164346 164657 163797 162082 160442 159690 159963 160610 160707 159951 158930
64949 158930 158373 158400 158667 158840 158576 157435 155376 153148 151640 150940 150471 149913 149474 149313 149262 149179 149113 149038 148871
64930 148871 148763 148853 148685 147527 145533 144002 143973 144991 145752 145647 145119 144689 144322 143807 143254 142920 142913 143304 144265
64911 144265 145819 147586 149083 150226 151315 152521 153674 154672 155929 158203 162003 167222 173289 179540
64897 179540 185513 191107 196596 202414 208804 215569 222108 227757 232186 235606 238521 241292 243992 246703
64883 246703 249608 252522 254499 254305 251391 246258 239911 233314 227263 222315 218505 215343 212316 209297
64869 209297 206423 203909 202095 201321 201445 201751 201574 200803 199481 197338 194227 190783 188029 186259 184761
64854 184761 182711 179922 176656 173209 169908 167125 164986 163238 161577 159903 158150 156184 154125 152490
64840 152490 151737 151784 152205 152750 153424 154159 154652 154473 153323 151363 149455 148739 149644 151459 153236 154910 157071
64823 157071 159792 162341 164196 165765 167800 170498 173566 176811 180251 183820 187412 191160 195378 200253
64809 200253 205832 212060 218470 223982 227575 229231 229809 229915 229339 227675 224974 221504 217314 212462 207357
64794 207357 202459 197821 193337 189272 186144 184190 183303 183379 184218 185134 185251 184443 183612 183740 184861 186181
64778 186181 187016 187311 187360 187342 187336 187695 189118 192122 196462 201322 206207 211365 217147 223266 229145 234749 240520
64761 240520 246498 252092 256925 261384 266033 270859 275450 279651 283725 288011 292684 297654 302408 306102
64747 306102 308070 308159 306437 302888 297700 291541 285030 278035 269964 260814 251555 243335 236620 231220 226907
64732 226907 223808 222258 222315 223369 224357 224586 224290 224119 224170 223944 223325 223086 224088 226318 229108 232078 235427
64715 235427 239425 244052 249189 254686 260026 264299 266804 267482 266556 263968 259575 253720 247198 240613 234111
64700 234111 227769 221814 216348 211272 206748 203334 201274 199945 198525 197006 196045 195860 195885 195612 195220 195138
64684 195138 195416 195902 196682 197955 199636 201484 203587 206432 210459 215652 221532 227462 233052 238404 243826
64669 243826 249240 253957 257198 258632 258344 256481 253178 248736 243642 238441 233640 229558 226120 223033
64655 223033 220296 218308 217244 216642 215978 215369 215255 215593 215982 216509 217833 220230 223112 225810 228422 231579
64639 231579 235728 240962 247275 254541 262419 270676 279486 288935 298260 306009 311158 313800 314679 314281 312600
64624 312600 309514 305084 299524 293186 286528 279878 273149 266008 258518 251431 245641 241384 238253 235970
64610 235970 234825 235127 236489 237976 238955 239464 239714 239614 239110 238736 239332 241118 243365 245161 246269 246997
64594 246997 247506 247667 247597 247813 248543 249142 248625 246830 244811 243997 245086 247810 251556 255945 260809 265834
64578 265834 270550 274761 278776 282928 286911 289851 291139 290943 289810 288012 285498 282209 278144 273272
64564 273272 267728 261957 256309 250561 244215 237242 230184 223579 217662 212654 208847 206210 204320 202889
64550 202889 202044 201915 202276 202799 203388 204021 204610 205290 206545 208690 211437 214217 216704 218664 219577 218893 216695
64533 216695 213719 210735 208088 205765 203617 201549 199714 198437 197762 197215 196318 195213 194435 194135 193903 193415
64517 193415 192896 192834 193464 194658 196121 197563 198768 199577 199939 200061 200597 202374 205675 209957 214524 219354
64501 219354 224955 231535 238702 245922 252841 259042 263902 266903 267953 267301 265309 262367 258874 255191
64487 255191 251726 248965 247230 246444 246359 246926 248146 249659 250892 251635 252004 251759 250199 247053 243087 239403
64471 239403 236358 233510 230497 227529 225116 223656 223343 224238 226303 229422 233332 237449 240968 243463 245281
64456 245281 247011 248533 248959 247675 245098 242187 239553 237378 235937 235567 236161 237209 238496 240236 242313
64441 242313 243995 244967 246206 249145 254128 260345 267126 274559 282809 291715 301373 312344 324886 338631
64427 338631 353589 370834 391535 415814 443402 475108 512764 557842 610924 672513 743406
64416 743406 823745 911948 1004648 1097471 1186341 1268976 1345420 1416582 1481999 1539316 1585755
64405 1585755 1619405 1639106 1644181 1634970 1613103 1580543 1538396 1486710 1424950 1352502 1269480 1177877
64393 1177877 1081775 985955 894241 809117 732177 664231 605175 554339 510918 473873 441843
64382 441843 413806 389710 369869 353845 340405 328589 318314 309902 303448 298702 295140 292020
64370 292020 288689 284905 280579 275275 268493 260572 252844 246568 241958 238372 235110 231710 227897 223776
64356 223776 220062 217651 216824 217080 217856 219198 221612 225365 230116 235184 240035 244413 248066 250493 251098
64341 251098 249688 246762 243239 239762 236295 232463 228228 224110 220682 218089 216221 215188 215287 216463 218186
64326 218186 220061 222316 225406 229248 233131 236373 238834 240721 242148 243103 243719 244337 245198 246185 246930 247143
64310 247143 246692 245389 242883 238923 233728 227978 222402 217372 212824 208449 203985 199469 195349 192292
64296 192292 190715 190387 190538 190460 190058 189731 189763 190065 190581 191626 193448 195684 197795 199970 202977 206933 210890
64279 210890 214011 216661 219851 224054 229130 235021 241736 248816 255460 261154 265608 268272 268677 267243
64265 267243 265031 262629 260019 257609 256463 257133 258963 260948 262672 263989 264510 263952 262453 259962 255853
64250 255853 249805 242665 235711 229427 223619 218361 214028 210593 207697 205414 204162 203847 203789 203657 203806
64235 203806 204465 205195 205504 205582 206089 207407 209345 211407 213208 214793 216621 219031 221693 223772 224709 224647
64219 224647 224099 223453 222862 222379 222033 221866 221884 221916 221697 221296 221291 222112 223256 223621 222712 221198 220115 219799 219753
64200 219753 219369 218590 217978 218227 219542 221532 223743 226151 228983 232270 236004 240646 246968 255254 264972
64185 264972 275306 285626 295295 303425 309165 312048 311921 308769 302852 294836 285553 275727 266017 257058
64171 257058 249211 242349 236123 230352 225007 219950 214931 209902 205210 201403 198840 197480 196984 197015 197351
64156 197351 197716 197768 197436 197142 197418 198351 199723 201584 204289 207883 211854 215645 219086 222164 224719 226618
64140 226618 227928 228629 228472 227415 225953 224645 223500 222275 221180 220764 221087 221551 221690 221706 221962 222330 222411
64123 222411 222261 222523 223775 225980 228616 231281 234141 237878 243142 249962 257690 265617 273541 281553 289301
64108 289301 295771 300099 302511 304191 306173 308575 311049 313679 317082 321663 327148 333056 339303 345973
64094 345973 352578 358024 361484 363105 363626 363506 362724 361246 359222 356607 353001 348141 342304 335962 329246
64079 329246 322092 314779 307875 301656 295939 290537 285553 281089 277064 273467 270463 268075 266070 264405
64065 264405 263445 263385 263727 263759 263368 262994 262877 262852 262865 263227 264219 265792 267837 270415 273484 276701 279832 283283
64047 283283 287909 294194 301725 309603 317414 325724 335507 347092 359826 372808 385619 398065 409417
64034 409417 418459 424385 427336 427952 426678 423689 419247 413817 407921 402039 396600 391890 387970 384729
64020 384729 381950 379245 376083 372069 367195 361678 355550 348600 340824 332838 325660 320001 315755 312223
64006 312223 308832 305619 303076 301612 301160 301184 301040 300375 299266 298084 297311 297487 299062 301995 305582 308939
63990 308939 311772 314436 317284 320242 323147 326146 329502 333252 337311 341795 346999 353160 360379 368606
63976 368606 377508 386480 395002 402961 410618 418505 427420 438085 450496 463897 477721 492239 507929
63963 507929 524616 541840 559890 579789 602251 627263 654782 685310 719633 758509 802909
63952 802909 854228 914011 983661 1064623 1158606 1267431 1392651 1535201 1695239 1872301
63942 1872301 2065776 2274998 2498656 2734309 2978834 3228965 3480773 3728746 3966174
63933 3966174 4186617 4384602 4555247 4694374 4799457 4869689 4904494 4902496 4862411 4784481
63923 4784481 4670586 4523567 4347222 4146694 3928086 3697553 3460899 3223475 2989662
63914 2989662 2762418 2543845 2336208 2141955 1962822 1799432 1651859 1520092 1403821
63905 1403821 1302107 1213546 1136587 1069683 1011450 960906 917458 880492 848950 821349 796253
63894 796253 772866 751257 731805 714296 697661 680810 663648 647107 632224 619318 607974
63883 607974 597611 588070 579818 573595 569860 568607 569694 573117 578917 587057 597598 610735 626509
63870 626509 644634 664882 687415 712466 739787 768649 798317 828240 857880 886630 914027
63859 914027 939913 964368 987448 1008836 1027677 1042989 1054419 1062408 1067398 1069086 1066705 1059822
63847 1059822 1048559 1033212 1014080 991648 966524 939093 909441 877715 844413 810313 776186
63836 776186 742460 709021 675500 641997 609428 578933 551062 525681 502401 480739 460122
63825 460122 440328 421926 405755 391842 379265 367238 355891 345756 336903 328965 321741 315290
63813 315290 309474 303816 298041 292556 288181 285320 283470 281672 279472 277257 275521 273973 271734 268414
63799 268414 264690 261656 259824 258841 257932 256364 253673 249894 245670 241905 239146 237330 236119 235266 234515
63784 234515 233436 231767 229930 228767 228540 228488 227724 226312 225043 224312 223804 223308 223159 223572 224038 223943 223495
63767 223495 223453 224044 224630 224575 224010 223497 223155 222417 220737 218355 216215 215078 214919 215326 216197 217612 219193
63750 219193 220263 220780 221482 222721 223744 223669 222851 222643 223992 226772 230299 233932 237190 239854 242062 244007
63734 244007 245540 246406 246752 247058 247669 248785 250704 253574 257015 260538 264248 268567 273317 277765 281618
63719 281618 285282 289049 292647 295769 298336 299980 300063 298664 296922 295823 295097 293851 291835 289493 287133
63704 287133 284764 282582 280978 280078 279754 280078 281273 283220 285384 287349 289139 290993 293091 295550 298466
63689 298466 301830 305473 309007 311888 313777 314960 316098 317358 318162 318110 317718 317747 318073 317866 316820 315637
63673 315637 315224 315878 317286 318878 320128 320947 321887 323604 325997 328201 329451 329578 328716 327061 325017 322896
63657 322896 320245 316086 310318 304305 299453 295574 291370 286329 281421 277900 276074 275458 275533 276022 276779
63642 276779 277852 279475 281696 284028 285746 286629 287392 289250 292909 297878 302901 307276 311607 317007 323723
63627 323723 330959 338062 345320 353421 362642 373001 384757 398150 412794 427946 443439 459892
63615 459892 477892 497456 518500 541415 566825 595003 625812 659007 694178 730274 765355
63604 765355 796905 822524 840616 850813 853910 851430 845190 836980 828162 819350 810624 802120 794089
63591 794089 786163 776980 765009 749664 731224 709913 685718 659188 631805 605204 580310 557476
63579 557476 537009 519128 503636 490190 478898 470267 464524 461315 460193 461009 463600 467398 471735
63566 471735 476540 482406 489867 498733 508261 517845 527420 537213 547282 557483 567991 579714 593993
63553 593993 611729 632896 657078 684502 716365 754059 797976 846738 896983 943642 981031
63542 981031 1004838 1013917 1010415 998088 980431 960172 939826 921863 907898 897918 890667 884781
63530 884781 879260 872872 863743 850182 831859 809688 784483 756274 725179 692365 659558 627820
63518 627820 597304 568076 540689 515860 494001 475051 458445 443325 429228 416546 405877
63507 405877 396952 388754 380765 373474 367440 362444 357862 353395 349083 345042 341571 339013 337101 334914
63493 334914 332041 329419 328425 329368 331362 333359 334711 335057 334482 333827 334134 335639 337774 340137 342914 346360
63477 346360 350399 354884 359693 364397 368291 370960 372443 372742 371603 368979 365330 361216 356875 352326
63463 352326 347675 343127 338894 335133 331839 328877 326363 324807 324508 324978 325502 326127 327543 330086 333636
63448 333636 338453 345100 353256 361555 369274 377438 387593 400120 414494 430772 449912 472886 500223
63435 500223 532157 568115 605755 641154 670497 691659 704580 710811 712835 713208 713847 716097 721286
63422 721286 730780 745415 765283 790289 820627 856469 897199 940909 984424 1023897 1055867 1078289
63410 1078289 1090841 1094443 1090670 1081485 1069118 1055782 1043193 1032047 1021824 1011306 999561 986301
63398 986301 971072 952386 928302 898124 863251 826182 788925 752461 717332 684202 653760
63387 653760 626310 601674 579572 560081 543576 530112 519007 509357 501010 494728 491236 490344 491265
63374 491265 493591 497564 503471 511134 520218 530758 543128 557578 574043 592356 612388 633900
63362 633900 656569 680452 706385 735661 769127 806509 846542 887576 928047 966439 1000979
63351 1000979 1029575 1050311 1062206 1065562 1061672 1052299 1039408 1025013 1010837 997957 986754 977007
63339 977007 967737 957089 942908 923819 899791 871735 840774 807962 774336 740839 708178 676950
63327 676950 647945 622222 600836 584600 574095 569588 570479 574535 577929 576651 568460 553706 534431
63314 534431 512912 490908 469632 449791 431675 415499 401604 390116 380628 372619 366067 361194
63302 361194 357684 354606 351195 347327 343261 339386 336260 334321 333295 332273 330630 328552 326491 324567
63288 324567 322766 321351 320627 320494 320525 320331 319611 318111 315846 313310 311216 310027 309699 309697 309306 308248 307045
63271 307045 306431 306419 306438 306355 306692 307604 308433 308729 309027 309962 311267 312419 313801 316181 319277 321900 323623
63254 323623 325374 328066 331431 334712 337876 341564 346129 351283 356655 362283 368528 375718 383956 393140
63240 393140 403067 413516 424282 435276 446644 458814 472336 487665 504894 523554 542837 562333
63228 562333 582441 603694 625784 647749 669077 689907 710029 728565 745219 761103 777637
63217 777637 795201 813523 832758 853089 873628 892801 909754 924371 935947 942932 944271 940068
63205 940068 930688 916155 896876 874057 848786 821377 792262 762936 735267 710208 687784 668050
63193 668050 651342 637798 627258 619680 615210 613815 615236 619316 626063 635302 646556 659371 673658
63180 673658 689660 707545 726948 746865 766163 784274 801357 817840 834063 850370 867109
63169 867109 884311 901510 917973 932933 945558 955056 960960 963042 960825 953598 941169 924219
63157 924219 903618 879740 852882 823932 794013 763609 732696 701816 672429 645950 622714
63146 622714 602108 583499 566753 552008 539191 527894 517706 508565 500668 494059 488477 483696
63134 483696 479769 476690 474017 471160 468066 465332 463562 462830 462904 463731 465470 468089 471221 474476 477821
63119 477821 481519 485792 490648 496000 501703 507339 512179 515668 518049 520317 523428 527542 532007 535977
63105 535977 539088 541681 544405 547469 550267 551900 552081 551455 551033 551439 552629 554085 555251 555974 556603 557538
63089 557538 558656 559384 559326 558592 557543 556508 555832 555804 556403 557373 558698 560576 562736 564300 564842 565315 567281
63072 567281 571293 576509 581927 587413 593372 599958 607086 614944 623990 634467 646227 659162 673630
63059 673630 690345 709816 731922 756047 781768 809454 840116 874511 912455 953129 995994
63048 995994 1041145 1088732 1138273 1188778 1239414 1289771 1339530 1388236 1435565 1481601 1526594
63037 1526594 1570580 1613507 1655722 1698049 1741187 1785048 1828662 1870539 1909049 1942619 1969843
63026 1969843 1989454 2000135 2000431 1989136 1966031 1932184 1889358 1839088 1782470 1720778 1655906 1589988
63014 1589988 1524825 1461973 1403105 1349790 1302860 1262449 1228707 1202077 1182744 1170267 1164036
63003 1164036 1163755 1169165 1179631 1194432 1213234 1235865 1261747 1289961 1319829 1351047 1383245 1415757
62991 1415757 1447980 1479706 1511020 1541977 1572431 1602094 1630625 1657545 1681931 1702373 1717622
62980 1717622 1727249 1731192 1728586 1717660 1697226 1667728 1630436 1586164 1535564 1480204 1422357 1363716
62968 1363716 1305062 1247202 1191450 1138957 1090180 1045226 1004208 967001 933124 902036 873245
62957 873245 846085 819961 794949 771664 750328 730412 711379 693265 676233 660024 644222
62946 644222 628799 614068 600277 587382 575053 562901 550985 540050 530873 523387 516905 511062
62934 511062 505929 501232 496334 491229 486792 483656 481512 479834 478587 477737 476775 475371 473930 472873 471941
62919 471941 470843 470074 470238 470911 471003 470105 468709 467242 465591 463584 461264 458673 455866 453134 450721 448430
62903 448430 446044 444010 443048 443058 443120 442732 442462 443094 444637 446518 448367 450229 452160 453977 455388 456230
62887 456230 456544 456459 455964 454894 453204 451226 449505 448384 447816 447505 447209 446957 446991 447299 447298 446289 444276 441930
62869 441930 439664 437212 434358 431552 429411 427991 426965 426162 425505 424820 424183 424088 424720 425446 425702 425992 427186
62852 427186 429040 430354 430669 430862 431779 433007 433471 432716 431171 429482 427987 426677 425421 424327 423870 424451
62836 424451 425772 426913 427116 426327 425003 423660 422622 421894 421209 420459 420050 420569 422108 424117 425881 426931
62820 426931 427221 427326 428314 430900 434709 438769 442600 446357 450091 453604 457102 461175 465913 470721 475319
62805 475319 480326 486354 493107 499886 506602 513730 521510 529712 538019 546266 554466 563008 572714 584305
62791 584305 597849 613039 629923 649040 670948 695973 724389 756503 792502 832514 876929
62780 876929 926386 981314 1041648 1107085 1177367 1252124 1330548 1411423 1493337 1574615 1653119
62769 1653119 1726487 1792743 1850406 1897882 1933130 1954364 1960931 1953085 1931162 1895644 1848069 1791039
62757 1791039 1726887 1656900 1582268 1505184 1428224 1352908 1279580 1208535 1140602 1076595 1016862
62746 1016862 961560 910865 864744 822905 785107 751239 721002 693850 669293 647077 627074
62735 627074 609301 593951 581005 569811 559440 549541 540530 532940 526953 522523 519508 517558 516204
62722 516204 515181 514484 514227 514769 516808 520820 526427 532794 539629 547311 556140 566158 577771 591768
62708 591768 608469 627390 648081 670757 695858 723600 754308 788690 827295 869983 916318
62697 916318 966207 1019933 1077861 1140265 1206940 1276668 1347453 1417548 1485835 1550941 1610490
62686 1610490 1661679 1702220 1730458 1745201 1746101 1733828 1709311 1673055 1625713 1569012 1505456 1437269
62674 1437269 1366217 1294269 1223675 1156200 1092679 1033314 977975 926196 877458 831780 789723
62663 789723 751624 717080 685400 656413 630595 608388 589566 573331 558971 546222 534933
62652 534933 524622 514655 504772 495136 485942 477312 469478 462574 456244 450021 444240 439972 437706 436595
62638 436595 435374 433587 431528 429418 427206 424915 422729 420842 419508 418932 418791 418240 416866 415304 414365
62623 414365 413808 412665 410667 408735 408000 408808 410785 413402 416280 419215 422164 425170 428284 431515 434769
62608 434769 437875 440944 444709 450122 457521 466563 477025 489043 502446 516725 532231 550581 573012
62595 573012 598870 626612 655936 687855 722946 760561 799735 839788 879835 918548 954676
62584 954676 987139 1014460 1034904 1047494 1052296 1049562 1039237 1021593 997678 968803 936128 900961
62572 900961 864769 828501 792450 757065 723295 691778 662295 634520 608734 585332 564123
62561 564123 544707 527117 511530 497726 485392 474599 465368 457108 449161 441663 435235 430045 425856
62548 425856 422805 421307 421094 421118 420594 419585 418397 417039 415596 414508 414020 413735 413201 412657 412632 412941 412703
62531 412703 411544 410399 410829 413678 418609 424809 431823 439630 448263 457719 468228 480296 494321 510343
62517 510343 528344 548641 571777 598051 627315 659161 693184 729179 767252 807591 849769
62506 849769 892218 932745 969697 1002387 1030311 1052347 1067186 1074388 1074572 1068546 1056644 1039180
62494 1039180 1017296 993069 968795 946172 925968 908180 892598 879444 869550 863785 862379 865036
62482 865036 871688 882742 898257 916972 936362 953702 967149 976144 981160 983043 982172 977967 969193
62469 969193 954833 934690 909317 879661 846872 812149 776452 740490 705177 671886 641748
62458 641748 614590 589176 564918 542999 525193 511714 500904 491131 482259 474906 469035 464108
62446 464108 460302 458574 459378 462002 465447 469407 474085 479514 485557 492215 499449 506737 513190 518130
62432 518130 521384 523006 522853 520397 514976 506457 495794 484719 474616 465690 457219 448427 439164 430094
62418 430094 422405 416949 413401 410474 407108 403175 398971 394647 390544 387473 385902 385116 383932 382132
62404 382132 380505 379504 378672 377623 376902 377397 379275 381894 384518 386824 388898 391025 393453 396174 398996
62389 398996 401800 404608 407433 410381 413938 418772 425000 431888 438532 444752 451152 458400 466645 475566
62375 475566 484840 494447 504506 514892 525250 535521 546265 558156 571318 585547 601107 618877
62363 618877 639601 663436 690444 721131 756206 796072 840860 890732 945755 1005411 1068299
62352 1068299 1132196 1194302 1251735 1302126 1343850 1375851 1397676 1409856 1413864 1411158 1402288 1387203
62340 1387203 1366192 1340042 1309281 1273821 1233700 1189963 1144620 1099809 1057077 1017242 980613
62329 980613 947280 917275 890557 866910 845908 826946 809197 791625 773308 753916 733782
62318 733782 713383 692913 672440 652257 632744 613988 595890 578702 563080 549406 537322
62307 537322 526220 516023 507227 500274 495120 491330 488336 485655 483120 480924 479271 478046 476992 476096
62293 476096 475590 475691 476692 479071 483010 487843 492545 496804 501073 505474 509405 512584 515761 519805 524545
62278 524545 529129 533261 537446 542255 547891 554401 561783 570014 579480 591259 606348 624590 644843
62265 644843 666361 689613 715783 745858 780238 818773 861042 906965 957180 1012472 1072777
62254 1072777 1137069 1204119 1272697 1340748 1404942 1461600 1508073 1543175 1566663 1578793 1580392
62243 1580392 1572939 1558088 1536775 1508707 1472948 1429121 1378009 1321059 1259781 1195852 1131350
62232 1131350 1068302 1008184 952165 901436 856621 817073 781420 748861 719438 693266 670239
62221 670239 650460 634122 620769 609316 598970 589567 580891 572421 564020 556204 549370 543331 537877
62208 537877 533175 529281 525898 523012 521139 520454 520299 520122 520317 521497 523418 525423 527641 530955 535849
62193 535849 541884 548376 555145 562600 571351 581608 592740 603676 613998 624336 635411 647146
62181 647146 659041 670836 682211 692247 699981 705380 709300 712734 716678 722309 730533 741511 755329
62168 755329 772954 795754 824261 858141 897154 941096 988731 1037764 1086065 1132015 1173539
62157 1173539 1208014 1233872 1251593 1262448 1266970 1265245 1257934 1245987 1229601 1208311 1181999 1151242
62145 1151242 1116850 1079745 1041292 1003117 966522 932436 901791 875362 853163 834546 819053
62134 819053 806713 797422 790525 785278 781309 778296 775573 772476 768945 765436 762360 759876 758197 757756
62120 757756 759035 762429 768284 776782 787591 799598 811005 819743 824157 823788 819705 813929 808292 803710
62106 803710 800216 797233 793665 788129 779594 767969 754069 739108 724269 710545 698712 689377 683070
62093 683070 680119 680342 683039 687421 692909 698932 704843 710375 715953 722112 728774 735567 742783 751440
62079 751440 762299 775346 790323 807225 825967 846062 867062 889045 912288 936644 961590
62068 961590 986803 1012420 1038896 1066830 1096675 1128320 1161051 1194128 1227147 1259407 1289178
62057 1289178 1314145 1332748 1344790 1350798 1351240 1346563 1337525 1324932 1309011 1289265 1265039 1236122
62045 1236122 1202844 1165872 1126159 1085022 1043869 1003591 964312 925886 888444 852297 817575
62034 817575 784451 753607 725911 701462 679363 658690 639364 621888 606579 593328 581809
62023 581809 571553 561999 552752 543729 534908 526131 517270 508322 499148 489505 479613 470374 462678 456717
62009 456717 452279 449382 448158 448391 449696 452052 455693 460563 466368 473033 480548 488322 495285 500870
61995 500870 505449 509598 513245 515762 516630 515820 513728 510897 507574 503433 497915 490964 483217 475319 467305
61980 467305 458867 450090 441605 434040 427554 422004 417354 413721 411025 408849 406764 404697 402802 401130
61966 401130 399653 398498 397789 397256 396437 395434 395032 395808 397395 398896 399751 399976 399929 400277 401895 405265 410004
61949 410004 415334 420958 427141 434121 441909 450656 460784 472635 486214 501221 517184 533714 550923
61936 550923 569424 589501 610432 631050 650876 670237 689314 707562 724126 738402 750141
61925 750141 759442 766733 772329 775837 776320 773193 766764 757963 747936 737940 729259 722996 720008 720789
61911 720789 724969 731247 738568 747463 759551 775488 794000 813073 831319 847777 861232 870572
61899 870572 875508 876286 872899 865251 853949 840258 825129 808660 790599 771063 750716 730556
61887 730556 711545 694205 678394 663605 649477 635932 622970 610587 598848 587747 576921
61876 576921 565769 554029 542185 531234 521993 514642 508841 504320 501271 500110 500839 502817 505272
61863 505272 507933 511171 515658 522014 530547 541138 553422 567255 582961 601031 621705 645038
61851 645038 671180 700236 731804 765034 799303 834555 870630 906426 940130 970295 996333
61840 996333 1017855 1034000 1043873 1047376 1045139 1037806 1025994 1010998 994912 979659 966312 955560
61828 955560 948371 945691 947887 954904 966574 982114 999518 1016282 1030828 1042671 1051145 1054676 1051659
61815 1051659 1041604 1025099 1003008 976101 945287 911800 877100 842574 809230 777554 747717
61804 747717 719861 694148 670747 649975 632218 617322 604301 592215 581243 572201 565019 558463
61792 558463 551690 545344 540544 537307 534568 531441 527845 524064 520316 516796 513700 511071 508798 506768
61778 506768 504844 502836 500750 498930 497666 496698 495402 493435 490939 488198 485429 482990 481437 481095 481654
61763 481654 482395 482854 483203 483924 485199 486762 488335 489947 491663 493228 494342 495165 496013 496592 496113 494482
61747 494482 492819 492221 492294 491564 489363 486705 484999 484342 483500 481500 478789 476681 475920 476150 476681 477347 478385
61730 478385 479846 481600 483755 486590 489913 492892 494746 495418 495511 495784 496769 498559 500740 502719 504353
61715 504353 506106 508474 511392 514332 516788 518495 519268 518843 516952 513633 509511 505572 502368 499494 496211
61700 496211 492481 488934 485830 482638 478871 474781 470896 467275 463691 460134 456693 453178 449335 445268
61686 445268 441272 437405 433633 430192 427357 424943 422467 419714 416749 413496 409833 406117 403079 401005
61672 401005 399444 397894 396364 395090 394062 393206 392727 392894 393549 394197 394578 394916 395515 396308 396924 397147 397182
61655 397182 397437 398086 398880 399509 400060 401033 402799 405204 407843 410613 413746 417266 420820 424226 427891 432234
61639 432234 436856 440746 443279 444504 444396 442548 438973 434545 430097 425459 420052 414142 408777 404615
61625 404615 401519 399228 397667 396487 395073 393261 391542 390343 389642 389411 389794 390558 391007 390798 390265 389556
61609 389556 388080 385320 381658 377802 373797 369278 364370 359676 355529 351868 348670 345884 343009 339416
61595 339416 335236 331459 328977 327823 327384 326984 326161 324705 322696 320418 318155 316025 313974 311828 309494
61580 309494 307156 305182 303754 302743 301999 301544 301437 301667 302230 302977 303401 303014 302036 301164 300503 299361 297488
61563 297488 295781 295177 295464 295980 296967 299186 302369 305141 306661 307490 308592 310140 311630 312635 313076 313143
61547 313143 313271 313911 315071 316292 317175 317719 318075 318329 318668 319456 320916 322913 325190 327643 330251 332920
61531 332920 335497 337828 339689 340738 340586 339000 336202 333054 330615 329242 328325 327213 326172 325999 326818
61516 326818 327784 327999 327262 325873 324169 322482 321167 320378 319988 319863 320035 320481 320946 321153 321103 321048 321222 321663
61498 321663 322211 322672 322998 323280 323545 323639 323412 322888 322210 321572 321290 321664 322585 323569 324443 325651 327496 329318
61480 329318 330025 329414 328486 328339 329119 330170 330884 331127 331054 330801 330494 330434 331030 332297 333582 334168 334150 334255 334714
61461 334714 334880 334265 333383 333128 333732 334859 336222 337563 338393 338521 338544 339150 340156 340928 341498 342432 343720
61444 343720 344750 345413 346391 348105 350173 352197 354386 357025 359914 362717 365468 368380 371453 374517 377433
61429 377433 380165 382837 385635 388262 389765 389518 388335 387879 388933 390974 393455 396445 399687 402061 402787
61414 402787 402557 402675 403409 403856 403208 401600 399757 398211 396872 395198 392845 390133 387590 385077 381924
61399 381924 378040 374338 371803 370621 370481 371089 372006 372596 372679 372828 373485 374173 374158 373546 373164 373566 374684 376201
61381 376201 377745 378878 379454 379932 380914 382456 384219 386063 388010 389790 391004 391739 392576 393878 395459
61366 395459 396964 398212 399186 400056 401323 403549 406781 410457 414008 417391 420923 424804 429004 433587 438979
61351 438979 445795 454314 464207 474805 485507 495752 504808 512048 517490 521715 525167 527944 530403
61338 530403 533323 537038 540718 543031 543353 542035 539728 536883 533759 530389 526565 522194 517694 513687
61324 513687 510343 507361 504622 502505 501470 501561 502437 503648 504775 505525 505911 506356 507543 510074 514161 519617
61308 519617 526191 533966 543381 554798 568090 582641 597561 611854 624521 634700 641797 645561
61296 645561 646171 644229 640532 635781 630547 625294 620177 614846 608752 601733 594169 586618 579553 573335
61282 573335 568078 563516 559372 555861 553466 552198 551591 551486 552308 554327 557170 560301 563543 566777 569616
61267 569616 571846 573900 576437 579652 583387 587739 593149 599963 608188 617559 627593 637642 647067 655324
61253 655324 661894 666480 669439 671556 673121 673529 672165 669316 665759 661685 656592 650204 643039 636063
61239 636063 630066 625368 621741 618491 614845 610421 605417 600437 596178 593120 591362 590833 591583 593680 596870
61224 596870 600656 604759 609127 613476 617327 620707 624322 628722 633735 639045 644910 651743 659256 666427
61210 666427 672233 676154 678249 679175 679943 681260 683121 685218 687607 690768 695228 701304 709060 718441 729746
61195 729746 743948 761927 783088 805244 826225 845135 861784 875689 886369 894131 899795 903921
61183 903921 906856 909112 910870 911440 910020 906792 902491 897094 889901 880913 871156 861407 851444 840863
61169 840863 829865 818748 807210 794725 781239 767052 752286 736939 721337 706121 691742
61158 691742 678214 665420 653520 642948 634051 626855 621297 617583 616068 616730 618997 622112 625345
61145 625345 627701 627876 624956 619096 611322 602789 594259 586001 577987 570441 564244 560339 558612 557945 557730
61130 557730 558728 561997 567548 574683 583153 593196 604802 617761 632225 648504 666398 685405 705508
61117 705508 727078 750092 774055 798638 823745 849021 873979 898613 923174 947294 970004
61106 970004 990726 1009645 1026940 1042206 1054903 1064883 1072149 1076327 1076514 1071629 1061147 1045847 1027652
61093 1027652 1008240 987876 965965 942482 918291 894221 870538 847376 825071 803878 783815
61082 783815 764941 747508 731749 717748 705458 694676 685108 676732 669802 664310 659858 656351 654259
61069 654259 653740 654102 654752 656045 658443 661495 664619 668293 673344 679560 686256 693868 703508 715043 727085
61054 727085 739044 751832 766305 782341 799751 818810 839433 860984 883478 907909 934832
61043 934832 963564 993303 1024093 1056149 1089081 1122380 1156026 1190210 1225154 1261464 1299885
61032 1299885 1340482 1382905 1427550 1475421 1526657 1580250 1635332 1691402 1747220 1801324 1854433
61021 1854433 1909867 1970836 2038747 2114803 2201318 2299987 2410212 2530487 2660446 2800879
61011 2800879 2953857 3124710 3322497 3556851 3835720 4167705 4564738 5041068 5613452
61002 5613452 6307480 7163855 8237390 9594487 11312921 13461496 16032337 18852785
60994 18852785 21566455 23748107 25099438 25584838 25415305 24924621 24450223 24267719 24536703
60985 24536703 25224984 26067114 26642098 26561395 25645306 23969375 21776746 19348576 16917118
60976 16917118 14637932 12595347 10819250 9305270 8032363 6972749 6096031 5372441
60968 5372441 4775679 4283283 3875507 3535244 3248426 3003407 2790302 2601709 2433385
60959 2433385 2283031 2148555 2027920 1919785 1823240 1737241 1661073 1594792 1538173 1489341
60949 1489341 1445116 1402584 1359935 1316440 1272522 1229585 1188903 1150605 1114134 1079269 1046036
60938 1046036 1014078 982982 953059 924984 898721 873597 849357 826342 804600 783667 763515
60927 763515 744981 728815 714764 701966 689931 678824 669064 660899 654178 648378 643030 638201 634329
60914 634329 631516 629297 627312 625873 625608 626709 628803 631354 633979 636475 638814 640993 642683 643165 642028
60899 642028 639891 637992 636868 635791 633761 630666 627054 623056 618225 612493 606645 601471 596879 592254
60885 592254 587397 582575 577773 572446 566099 558720 550516 541604 532190 522782 513906 505681 497900 490490
60871 490490 483712 477871 472992 468872 465346 462334 459653 457077 454797 453640 454487 457389 461512 465923
60857 465923 470060 473436 475502 476255 476614 477657 479653 482247 485356 489226 493619 497643 500630 502807 504809
60842 504809 506807 508408 509187 509035 508024 506154 503340 499715 495814 492232 488960 485370 481159 477055 474141
60827 474141 472633 471828 471128 470439 469572 468073 466065 464547 464190 464192 463047 460263 456720 453390 450322 447015
60811 447015 443228 439129 435020 431205 427892 424925 421800 418220 414488 411049 407763 404070 399860 395733
60797 395733 392196 388996 385603 382064 379001 376928 376006 376312 377728 379521 380586 380433 379567 378685 377901 377035
60781 377035 376200 375698 375569 375716 376259 377362 378894 380651 382729 385240 387803 389816 391228 392620 394526
60766 394526 397027 399960 403045 405822 407968 409751 411751 414060 416203 417864 419180 420136 420230 419037 416700
60751 416700 413614 410080 406627 404207 403483 404107 405124 405977 406719 407437 407913 407771 406529 403563 398539 391990
60735 391990 385058 378506 372346 366566 361724 358371 356213 354336 352208 349937 347568 344761 341546 338891
60721 338891 337882 338422 339324 339742 340003 340751 341779 342223 341750 340981 340683 340977 341606 342670 344614 347461 350447
60704 350447 352764 354594 356999 360625 364799 368184 370140 371103 371859 372999 375021 378241 382229 385816 388193
60689 388193 389796 391728 394474 397508 400046 401774 402889 403785 404812 406155 407853 409892 412191 414526
60675 414526 416663 418561 420176 421102 420823 419423 417495 415191 411940 407460 402423 397602 392966 388327 384356
60660 384356 381999 381096 380498 379555 378637 378146 377808 377222 376449 375834 375740 376619 378819 382077 385597 388720 391088
60643 391088 392205 391555 389359 386579 383826 380795 377097 373161 369872 367655 366270 365230 364182 363165
60629 363165 362718 363401 364994 366556 367513 368285 369569 371437 373478 375460 377362 379003 380080 380509 380438 380068
60613 380068 379684 379638 380018 380469 380578 380298 379795 379115 378256 377430 377007 377180 377809 378486 378758 378531 378283 378669 379832
60594 379832 381397 383132 385158 387401 389359 390704 391728 392880 394166 395290 396033 396228 395797 395170 395255 396436
60578 396436 397882 398395 397845 397324 398045 400495 404551 409878 416197 423546 432403 443259 456099 470500
60564 470500 486105 502660 519610 536018 550914 563494 572997 578715 580285 577835 571903 563365 553354
60551 553354 543020 533328 525157 519348 516324 515739 516814 519036 522350 526811 532495 539823 549593 562444
60537 562444 578476 597539 619658 644808 672218 700113 726247 748680 766115 777815 783581 783856
60525 783856 779551 771526 760424 747157 733210 719958 707805 696445 685909 676788 669363 663148
60513 663148 657730 653579 651571 651917 653948 656809 660067 663855 668785 675666 685015 696928 711543 729520
60499 729520 751934 779891 814332 855799 904035 958071 1016976 1080170 1146578 1213758 1278416
60488 1278416 1337671 1389407 1431630 1462208 1479382 1482114 1469875 1442709 1401818 1349729 1289483
60477 1289483 1223701 1154499 1083951 1014256 947472 885256 828811 778827 735342 697705 664878
60466 664878 635924 610324 587876 568429 551811 537846 526160 515955 506320 496907 488090 480308
60454 480308 473478 467198 461282 455838 451019 446899 443408 440155 436589 432629 429001 426613 425663 425593 425772
60439 425772 425931 426049 426145 426174 425927 425102 423717 422297 421366 420826 420137 419044 417817 416830 416194 415792 415354 414481
60421 414481 412870 410622 408187 406075 404767 404680 405854 407755 409722 411611 413689 415964 418096 419946 421783
60406 421783 423734 425382 426138 425819 424752 423535 422796 422883 423607 424440 425044 425489 425985 426723 428017 430193 433150
60389 433150 436362 439478 442637 445904 448840 451020 452749 454733 457134 459420 461170 462638 464377 466695
60375 466695 469612 473027 476663 480022 482679 484603 486092 487499 489058 490769 492341 493445 494155 494975 496260
60360 496260 497889 499792 502424 506204 510690 515014 519224 524510 531819 540844 550725 561189 572364 583808
60346 583808 594333 602695 608025 609799 607961 603076 595961 587232 577498 567694 558694 550730 543690 537779
60332 537779 533245 529643 526220 523003 520607 518857 516571 513134 509343 506187 503512 500613 497509 494864
60318 494864 493040 491946 491551 491904 492935 494906 498861 505854 515774 527565 540598 555118 571260 588328
60304 588328 605544 623070 641786 661966 682450 701197 716586 728009 735221 737481 733731 723557
60292 723557 707580 687012 663426 638994 616127 596261 579344 564887 553024 543998 537062 530714
60280 530714 524052 517451 511865 507784 504797 501934 498500 494711 491290 488402 485461 482226 479375 477463
60266 477463 475873 473593 470717 468315 466900 465834 464344 462535 461226 461158 462425 464385 466192 467589 468992
60251 468992 470630 472090 473074 474023 475340 476505 476857 476861 477607 479170 480448 480585 479643 477886 475486 473127
60235 473127 471855 471862 472245 472373 472772 474168 476365 478656 480830 483189 485890 488741 491415 493643 495463 497440
60219 497440 500231 503788 507414 510701 513875 517066 519972 522609 525765 530199 535854 542220 548946 555623
60205 555623 561585 566595 571364 576710 582449 587678 591957 595579 598825 601552 603563 604922 605780 606166 605958
60190 605958 604852 602544 599214 595682 592699 590169 587396 584008 580251 576465 572750 569225 566184 563738
60176 563738 561546 559194 556742 554692 553379 552594 551889 551185 550867 551244 552093 552869 553217 553095 552559 551704 550771
60159 550771 549994 549356 548786 548518 548913 549850 550693 551009 551073 551485 552513 553930 555313 556412 557413 558839 561014
60142 561014 563665 566319 569002 572147 575850 579787 584023 589348 596412 604866 613675 622001 629447 635714
60128 635714 640471 643586 645228 645721 645395 644517 643289 641944 640796 640019 639520 639330 640001 642153 645541 649079
60112 649079 651938 654148 655864 656605 655724 653367 650475 647892 645745 643533 640562 636407 631226 625650 620260
60097 620260 615249 610602 606362 602667 599835 598504 599297 602093 605902 609706 613179 616448 619576 622636
60083 622636 625932 629577 633003 635351 636359 636547 636490 636181 635160 633041 629772 625488 620259 614066 607025
60068 607025 599448 591528 583125 574227 565514 557970 551857 546471 541138 535995 531518 527643 523795 519656
60054 519656 515531 511967 509208 507127 505591 504851 505328 506929 508859 510576 512697 516282 521194 525892 529113
60039 529113 531151 533091 535382 537672 539590 541092 542193 542883 543195 542989 541818 539314 535646 531353 526847
60024 526847 522265 517567 512576 507141 501464 496006 490862 485565 479770 473767 467985 462349 456579 450903
60010 450903 445923 441894 438553 435648 433310 431816 431183 431000 430632 429732 428577 427722 427339 427215 427358 428079
59994 428079 429372 430841 432474 434836 438128 441633 444690 447634 451125 454947 458205 460487 462114 463361
59980 463361 464003 463606 461883 458899 455296 452057 449625 447574 445587 444285 444390 445485 446468 447009 447651 448567
59964 448567 449240 449628 450748 453628 458181 463437 468412 472452 475230 476836 477639 477828 477254 475828 473820
59949 473820 471648 469625 467988 466890 466226 465678 465000 464112 462942 461426 459665 457794 455709 453210 450422
59934 450422 447856 445968 444819 444149 443685 443510 444205 446327 449616 453183 456837 461652 468511 476525 483831
59919 483831 489712 494891 499718 503244 504542 503986 502596 500918 499302 498672 499998 503097 506766 510194 513650
59904 513650 517617 521825 525552 528577 531338 534141 536629 538322 539438 540714 542382 543888 544911 546206
59890 546206 548818 552725 556944 560934 565191 570222 575600 580546 585065 589958 595795 602286 608698 614528
59876 614528 619621 623891 627193 629500 630963 631606 631071 628942 625377 621080 616560 611699 606352 601070 596805
59861 596805 593993 592260 591026 590098 589611 589654 590004 590247 590242 590533 592032 595208 599894 606067 614274 624777
59845 624777 636578 647793 656859 662978 665853 665859 664440 663554 664428 667094 670921 674958 677805 677996 674885
59830 674885 668799 660390 650456 640368 631693 624855 618776 612331 605700 599781 594800 590166 585381 580440
59816 580440 575312 569676 563353 556740 550627 545653 541893 538838 535805 532476 529068 525996 523494 521552
59802 521552 520055 518889 518012 517421 516996 516447 515635 514860 514531 514575 514482 513959 513210 512511 511844 511135 510565 510371 510482
59783 510482 510550 510227 509358 508059 506662 505488 504547 503595 502473 501338 500582 500651 501796 503714 505568 506712
59767 506712 507438 508624 510588 512673 514160 515224 516729 519220 522452 525872 529370 533402 538374 544007
59753 544007 549558 554673 559805 565627 572314 579569 587050 594423 601308 607663 614010 620795 627621 633612
59739 633612 638455 642598 646522 650316 653860 656825 658551 658569 657312 655710 654021 651719 648597 645191 641905
59724 641905 638482 634805 631518 629245 627641 625732 622906 619206 615016 610879 607347 604539 602028 599407
59710 599407 596731 594206 591871 589901 588700 588206 587514 585834 583626 582194 582191 582997 583526 583267 582529 582081 582559
59693 582559 583921 585370 586019 585642 584696 583758 583146 582887 582744 582314 581403 580296 579474 579024 578531 577471 575502
59676 575502 572487 568515 564015 559598 555646 552044 548430 544673 541077 538041 535587 533320 530880 528293
59662 528293 525812 523649 522062 521384 521614 522096 522096 521719 521894 523382 526182 529929 534407 539352 544068 547579
59646 547579 549195 548868 547089 544421 541023 536704 531576 526367 521782 517834 514318 511645 510459 510471 510551
59631 510551 510186 510041 510669 511389 511010 509226 506747 504423 502677 501491 500372 498589 495890 492854 490177
59616 490177 487845 485384 482726 480325 478531 477256 476280 475582 475354 475798 476886 478228 479389 480435 481920
59601 481920 484170 486849 489403 491682 493836 495874 497675 499273 500858 502532 504207 505655 506568 506774 506460
59586 506460 505959 505245 503983 502222 500665 499994 500185 500653 500784 500159 498634 496489 494277 492430 491231 491124
59570 491124 492398 494396 495699 495505 494342 493070 491843 490581 489771 489944 490646 490835 490182 489297 488688 488191
59554 488191 487567 487078 487256 488375 490233 492265 493983 495545 497729 501041 505049 509007 512928 517630 523969
59539 523969 532774 545523 564109 589010 617488 643888 662243 669361 666210 656648 644772 633190
59527 633190 623186 615584 610879 608924 609180 611235 614698 618705 622021 623776 623811 622319 619408 615087 609400
59512 609400 602490 594633 586210 577549 568850 560357 552448 545442 539398 534183 529526 524983 520175 515245
59498 515245 510780 507060 503722 500374 497199 494654 492928 492047 492082 492743 493125 492545 491519 491263 492190 493495
59482 493495 494325 494855 496009 498491 502362 507254 512688 518266 523815 529397 535106 540784 545977 550196 553338
59467 553338 555730 557729 559424 560902 562518 564505 566530 568180 569867 572642 577029 582657 589128 596472
59453 596472 604489 612487 620197 628241 637003 645585 652609 657645 661129 663273 663744 662151 658121 651251
59439 651251 641821 631421 622075 614678 608833 603998 600025 596749 593906 591611 590169 589354 588605 588097 588874
59424 588874 591689 596408 602849 611491 622834 636642 652421 670224 690359 712623 736747 763635
59412 763635 795111 831333 868303 898616 915383 916008 902847 881050 856029 832059 811985 797741
59400 797741 791323 794810 808268 827310 843846 850534 844875 829232 807780 783975 759999 737130
59388 737130 716168 697851 682936 671595 663005 655991 649991 645107 641461 638910 637188 636002 635128
59375 635128 634671 634917 635706 636370 636579 636710 637008 637053 636643 636533 637504 639248 641086 643309 646733 651183 655593
59358 655593 659665 664397 670793 678887 688256 698702 710118 722285 735191 749125 764271 780443
59346 780443 797238 814049 830009 844412 857275 869174 880534 891270 900819 908103 911835 911493
59334 911493 907820 901862 893698 882703 868789 852770 835722 818596 802139 786444 770848 755018
59322 755018 739922 726896 715975 705987 696125 686478 677218 668316 660100 653033 646783 640429 633800
59309 633800 627734 622868 619027 616033 614270 614247 616327 621060 629087 640612 655578 674056 695250 715948
59295 715948 731210 737309 733590 721673 704048 683702 663663 645827 630622 618025 608152 600689
59283 600689 594833 590349 587791 587228 587785 589044 591846 596932 603700 611255 619924 630685 643609 657794
59269 657794 672472 687299 701844 715623 728490 740362 750663 758577 763685 765934 765279 761869 756340
59256 756340 749443 741536 732842 723950 715600 708132 701465 695423 689823 684522 679784 676347 674799 675025
59242 675025 676465 678699 681563 685010 689165 694308 700551 707620 715006 722159 728518 733691 737633 740393
59228 740393 741773 741550 739833 736658 731463 723634 713496 702007 689654 676583 663754 652718 643915
59215 643915 636300 629087 622758 617720 613027 607418 600906 594465 588662 583484 579112 575953 573992 572727
59201 572727 571729 570913 570424 570487 571194 572303 573563 575215 577598 580240 582149 583236 584678 587493 591459 595762
59185 595762 599916 603668 606860 609965 614025 619437 625429 631197 636758 642186 646919 650593 653823 657310
59171 657310 660818 663824 666639 670085 674511 679816 685810 691804 696433 698800 699432 699388 698881 697450 694862
59156 694862 690927 684948 676433 666117 655406 644960 634538 623982 613569 603558 594137 585706
59144 585706 578652 572964 568389 564621 561005 556670 551589 546922 543634 541335 539155 537108 535734 534919
59130 534919 534084 533183 532611 532416 532421 532851 534116 536305 539581 544559 551491 559557 567842 576527 586216 596667
59114 596667 607237 618068 629627 641477 652763 663634 674917 686534 697435 706986 715198 721759
59102 721759 726186 728946 731109 732728 732784 730865 727625 723397 717784 711144 705169 701227 699093 697957 697729
59087 697729 698524 699555 699501 697668 694269 689900 685172 680523 675853 670567 664245 657106 649704 642455 635572
59072 635572 629189 623424 618497 614644 611606 608418 604231 599232 594261 589751 585679 582324 580170 578986
59058 578986 577778 575915 573693 571661 569964 568438 566855 564986 563029 561862 562200 563489 564450 564722 565141
59043 565141 566255 567510 568250 568590 568789 568546 567576 566352 565564 565173 564607 563748 563238 563862 565909 569118 573083
59026 573083 577827 584003 592373 603132 615954 630596 646967 664454 681522 696259 707302 714327
59014 714327 717894 718781 717282 713261 707003 699705 692710 686503 680859 675775 671740 669270 668768 670693 675240
58999 675240 681739 688887 695709 701943 707484 712023 715391 717894 720082 722226 723983 724500 723077 719892
58985 719892 715836 711479 706636 701145 695586 690852 687548 686180 687207 690264 694005 697599 701902 708314
58971 708314 716966 726891 737547 749066 761368 774095 787239 800812 814149 826611 838715 851386
58959 851386 864111 875085 883190 888592 891293 890427 885478 877053 865934 852253 836106 818277 799822
58946 799822 781470 763735 747086 731802 718097 706316 696436 687551 678748 670455 663997 659810 657046
58933 657046 654933 653482 652660 652048 651664 652121 653471 654733 654987 654173 652538 650176 647539 645518 644499 643936
58917 643936 643220 642267 641049 639378 637576 636583 636944 638291 640164 642679 646098 650425 655765 662428 670445
58902 670445 679637 690333 703161 717872 733135 747785 761555 774504 786750 799017 812408 827227
58890 827227 842938 859560 877985 898454 919972 941792 964219 986994 1008006 1024772 1036575
58879 1036575 1044223 1048364 1049032 1046221 1039841 1029434 1014872 997172 978003 958634 939935 922888
58867 922888 908318 896284 886381 878385 872037 866506 860723 854198 847086 839574 831542 822700 812790 801776
58853 801776 790045 778268 766973 756467 747091 739069 732062 725370 718662 712001 705212 697870 689982
58840 689982 681937 673679 664704 655064 645579 636802 628496 620360 612564 605370 598985 593967 590926 589575
58826 589575 588875 588352 588362 588954 589585 590343 592296 596046 600947 606278 612145 618557 624652 629687 633954 637901
58810 637901 641116 642979 643667 643783 643562 643040 642333 641152 638799 635245 631527 628422 625414 621615 616988
58795 616988 612026 606862 601404 595785 590170 584710 580026 576895 574991 572958 570296 568176 567744 568682 570255
58780 570255 572692 576493 581305 586527 592255 598598 604721 609516 612576 613733 612493 608891 604042 598804
58766 598804 592696 585212 577324 570400 564427 558681 553549 550204 548839 548604 549068 550516 552963 556048 559788
58751 559788 564334 569050 572847 575432 577440 579426 581496 583743 586315 589196 592547 596905 602438 608435
58737 608435 614230 620127 626650 633483 640065 646726 654200 662409 670673 678800 687031 695235 703027 710387
58723 710387 717301 723194 727609 731137 734823 739050 743828 749688 757227 766081 775279 784316 793069 800986
58709 800986 807310 811747 814081 813579 809642 802631 793162 781133 766392 749757 732228 713689 693602
58696 693602 672534 651812 632074 613417 596533 582242 570108 559004 548975 541154 535775 531630
58684 531630 527665 523814 520020 515699 510676 505711 501657 498756 496981 496314 496430 496861 497724 499721 503236
58669 503236 507958 513508 519962 527620 536657 547060 558750 571752 586153 601333 615174 624958 629590
58656 629590 630213 628228 623760 616798 608576 600542 592724 584425 575919 568174 561352 554905 548816 543548
58642 543548 539035 534830 531035 528085 525994 524761 525049 527345 530894 534561 538283 542582 547133 551012
58628 551012 553895 555898 556815 556808 557206 559129 561828 563838 565264 567325 570093 572584 574935 578680 584592
58613 584592 591770 598933 605241 609817 611994 612328 612119 611791 610809 609069 607053 604729 601695 598404 595859
58598 595859 594062 592111 589859 588075 586924 585704 584244 583249 583115 583717 585485 589360 595478 603080 611811
58583 611811 621886 632882 643661 653666 663184 672260 680482 687824 694571 700491 705255 709487 714173
58570 714173 719307 724523 730853 740245 753407 769633 788662 811032 836481 863622 891346 919104
58558 919104 945718 969501 989724 1006481 1019122 1026444 1028649 1027484 1024220 1018955 1012021 1004468 996896
58545 996896 989243 981804 974875 967289 957026 943530 927898 910821 892090 872233 852633 833688
58533 833688 814713 796054 779488 766073 755376 747204 742200 740126 739305 738470 737716 737216 736667 736348
58519 736348 736991 738099 738089 736477 734273 731917 728795 725124 722177 720010 717035 712676 708442 705562 703463
58504 703463 701430 699868 698907 697632 695755 694398 694115 693712 692008 689367 686716 684512 683293 683572 684538
58489 684538 684534 683565 683568 685606 688601 691595 695257 700401 707023 715638 727473 742251 757762 772650 787603
58474 787603 802717 815876 825116 830597 832847 831068 824833 815800 806175 796814 787989 780328 773740 767089
58460 767089 760263 755075 752990 753583 756262 761640 769972 780125 791321 803922 817182 828306 835342
58447 835342 839058 840454 838596 832826 825149 818239 812508 807084 802199 798692 796402 794894 794631 795890
58433 795890 797718 799342 801350 804203 807233 810458 815536 823301 832037 839927 847516 855985 864648 872079
58419 872079 878113 882798 884801 882928 878036 871756 864495 856267 848102 840912 834203 827348 820759 814494
58405 814494 807447 799426 792245 787209 783378 779946 778271 779601 782779 786299 790706 796767 803105 807985
58391 807985 811808 815587 818568 819668 819694 819846 819586 818299 817495 818915 821815 824469 827043 830710 835321
58376 835321 840253 846281 854379 863829 873526 883779 894896 905574 914780 923666 933607 943954 953706
58363 953706 963514 974069 984509 994579 1006067 1019703 1032970 1043560 1052653 1061943 1069959 1074708
58351 1074708 1077688 1081665 1086279 1089365 1091002 1092750 1094522 1095740 1098138 1103831 1111852 1119978 1128645 1139677
58337 1139677 1152610 1165840 1180136 1197366 1216788 1235957 1254223 1272093 1288446 1301824 1313275
58326 1313275 1324522 1334594 1341615 1346523 1351514 1356263 1359285 1361614 1365380 1370137 1374393 1379315 1386981
58313 1386981 1396305 1404764 1412950 1423324 1435644 1447727 1459633 1472991 1487238 1500724 1514582 1531325
58301 1531325 1550495 1569581 1588177 1607299 1625936 1642559 1658852 1677587 1697940 1717178 1735723
58290 1735723 1756169 1778531 1800955 1823851 1848787 1874605 1899177 1923667 1950478 1978599 2005688
58279 2005688 2032963 2062956 2094336 2124460 2155202 2190487 2229589 2268775 2308005 2349980 2394110
58268 2394110 2437830 2482559 2531963 2585474 2639878 2695922 2756699 2820957 2885034 2950052 3019826
58257 3019826 3092719 3163146 3230339 3298163 3367135 3434460 3501350 3572398 3648152 3725943 3807275
58246 3807275 3896438 3992668 4091932 4195522 4308338 4429705 4554977 4685233 4825867 4976435
58236 4976435 5131920 5293435 5467409 5654558 5850237 6055459 6276752 6515354 6767519
58227 6767519 7035262 7325368 7638201 7969400 8322181 8705653 9121757 9567046 10046357
58218 10046357 10570566 11141795 11756078 12420005 13148948 13950147 14825060 15787542 16861009
58209 16861009 18058598 19386526 20866617 22534432 24417154 26538364 28944714 31703393
58201 31703393 34877577 38537548 42797759 47812535 53741206 60762162 69128567 79181410
58193 79181410 91337341 106152909 124432984 147239804 175805105 211409133 254954341
58186 254954341 305824988 360430364 411883617 451903852 474083156 476227223 460309316
58179 460309316 430690406 392277208 349522961 306062013 264554048 226664388 193217451
58172 193217451 164419093 140046255 119624058 102600358 88449481 76686833 66871138
58165 66871138 58634581 51693398 45817287 40808157 36511808 32819471 29639944 26883467
58157 26883467 24476309 22368762 20517965 18877672 17410816 16095707 14912741 13838762
58149 13838762 12859377 11972188 11171904 10444677 9781007 9180770 8640721 8149571 7700038
58140 7700038 7293496 6927697 6591055 6273843 5974667 5691904 5419509 5155894 4906970
58131 4906970 4675697 4457556 4250028 4057142 3880519 3714884 3556794 3409404 3274487
58122 3274487 3147851 3026700 2913713 2809820 2710560 2613648 2522956 2440949 2363999 2289096
58112 2289096 2218558 2154146 2092835 2032326 1974842 1921792 1870322 1818607 1769048 1722996 1677792
58101 1677792 1632154 1589001 1549764 1511262 1471449 1432952 1397715 1363387 1328458 1295995 1268624
58090 1268624 1244264 1220113 1196760 1175345 1154848 1135060 1118063 1103957 1089112 1071298 1052519
58079 1052519 1034422 1015271 994101 973412 954794 936008 915303 894671 875938 857614 838646
58068 838646 821385 807634 795313 782270 770038 760676 752944 744755 736611 729679 723023 715394 707277
58055 707277 698920 688972 677233 665999 656612 647462 637341 627753 619842 612204 603968 596881 592010
58042 592010 587402 581408 575344 570409 564967 557487 549409 542566 536390 530096 524913 521573 518098 512571
58028 512571 505728 498584 490175 480034 470203 462215 454591 445839 437379 430858 425107 418568 412429 408406
58014 408406 405563 402171 398860 397080 396201 394825 393400 392990 392974 392302 391537 391440 391155 389918 388819 388788 388643
57997 388643 387318 386140 386624 387904 388713 390041 393262 397275 400009 401341 402182 402234 401017 399650 399260 398906
57981 398906 397211 394605 391854 388046 382292 375889 370434 365305 359277 353078 348012 343659 339393 336576
57967 336576 336521 337698 337722 336883 337022 338102 338731 339114 340638 343235 345750 348139 350746 352189 350735 347239
57951 347239 344070 341577 338164 333528 329199 325940 323037 320281 318562 318349 319379 321831 326088 331489
57937 331489 336994 342962 350678 360339 371001 382217 394178 406458 417976 427938 435644 439914 440026
57924 440026 436707 431079 423373 413797 403556 393525 382981 371278 359738 350140 342298 334973 328306
57911 328306 323379 320121 317614 315895 315707 317014 319405 323164 328161 332573 334646 335068 335729 336929 337778
57896 337778 338546 340332 342945 345295 347514 350604 354316 357440 359903 362602 365408 367267 368041 368365 368027
57881 368027 366368 363944 361827 359591 355951 351008 345785 339920 332178 323177 315289 309606 305015 300513
57867 300513 296436 293173 290484 288452 287527 287497 287892 289267 292457 296823 301104 305726 312245 320595 329074
57852 329074 337011 345227 353681 360978 366625 371604 376183 379284 380602 381318 381993 381682 379906 377595 375224
57837 375224 371806 366710 360923 355583 350679 346024 342013 338599 334904 330712 326999 324200 321324 317701
57823 317701 314228 311934 310539 309457 309085 309990 311731 313507 315230 317034 318364 318359 316563 312693 306404
57808 306404 297904 288229 278362 268672 259567 251894 246122 241714 237796 233978 230299 227001 224637 223716
57794 223716 223957 224449 224690 224840 224947 224758 224451 224704 225800 227339 229001 230952 233488 236977 241954 248435
57778 248435 255289 261383 267239 274428 283310 292580 301146 309160 316921 323977 329743 334018 336564 337139
57764 337139 336150 334365 331797 327864 322749 317490 312565 307570 302487 298021 294324 290557 286117 281264
57750 281264 276235 270910 265784 262088 260365 259838 259501 258912 257679 255480 253101 252342 254211 257980 262310
57735 262310 266341 269455 271237 272233 273706 276092 278616 280710 282662 284507 285561 285658 285707 286382 287371 288502
57719 288502 290376 293118 295595 296733 296700 296063 294803 292917 291009 289318 287009 283321 278762 274374 270437
57704 270437 266552 262362 257567 251897 245675 239795 234665 229895 225358 221633 218930 216609 214364 212766
57690 212766 211919 210681 208137 204918 202131 199918 198073 197205 198069 200321 203073 206298 210790 217105 225393
57675 225393 235892 248791 264051 282187 304965 334697 373247 422269 483619 557988 642266
57664 642266 728087 802921 853586 871169 854784 811189 750530 682087 612881 547856 489741
57653 489741 439175 395936 359861 330386 306144 285910 269303 256001 244989 235408 227421 221433
57641 221433 217008 213379 210436 208397 207056 206095 205583 205373 204628 202819 200734 199581 199510 199759 199852 199767 199338
57624 199338 198344 196848 194802 191755 187740 183935 181560 180486 179783 179166 178945 178953 178664 178203 178155 178303 177531
57607 177531 175220 172042 169205 167413 166626 166297 165788 164921 164149 163871 163735 162998 161402 159289 156951 154292
57591 154292 151034 147012 142406 137899 134350 132037 130440 128955 127529 126424 125755 125464 125397 125189 124469 123334
57575 123334 122238 121342 120453 119551 118778 117957 116947 116357 116832 117571 116839 114294 111477 109547 107939 105954
57559 105954 104198 103324 102688 101569 100719 101274 102894 104274 104883 105006 104730 104167 104112 105208 106931 108450 109874
57542 109874 111577 113069 113995 115487 118804 123071 126144 127496 128507 129857 130493 129535 127589 125610 123818
57527 123818 122390 122029 123041 124578 125458 125204 123966 122095 120158 118739 117852 116913 115531 113898 112388
57512 112388 111220 110580 110531 110762 110811 110536 109945 108796 106902 104672 102800 101567 100872 100562 100172 98861 96435
57495 96435 93980 92556 91672 90157 88210 87214 87495 87625 86317 83941 81735 80403 79941 80114 80596 81065
57479 81065 81468 81857 81936 81248 79787 77964 76100 74503 73762 74177 75017 75199 74744 74753 75955 77990 80127 81866
57461 81866 82831 82970 82955 83551 84469 84632 83704 82518 81834 81526 81218 80835 80220 79011 77345 76063 75798 76302
57443 76302 76988 77649 78461 79662 81368 83319 84771 85121 84677 84310 84450 84897 85451 85987 86043 85181 83842 83056
57425 83056 83169 83502 83354 82683 81808 81110 81034 81636 82176 81891 81094 80640 80483 79789 78513 77691 77922 78677 79431
57406 79431 80371 81448 81812 80876 79240 77924 77233 76863 76523 76017 75209 74295 73626 73101 72318 71469 71321 72127
57388 72127 73339 74648 76383 78523 80203 80823 80895 81263 82070 82976 83710 84003 83616 82948 82869 83436 83499 82231
57370 82231 80326 78978 78295 77568 76691 76368 77030 78247 79282 79791 80041 80660 82066 83952 85560 86534 87190
57353 87190 87915 88769 89712 90655 91213 91085 90814 91348 92519 92830 91280 88724 86892 86670 87853 89869 91989
57336 91989 93309 93417 92893 92588 92610 92531 92219 91900 91575 91007 90269 89819 89912 90227 90184 89596 88921 88785 89141 89159
57316 89159 88264 86983 86259 86175 86037 85542 85098 84991 85097 85465 86309 87257 87532 87168 87157 88041 89214 89979 90456
57297 90456 90978 91457 91917 92905 94728 96848 98573 99877 101130 102554 104290 106410 108568 110319 112007
57282 112007 114578 118217 122008 125259 128246 131284 134127 136828 140067 143948 147443 149775 151382 152827
57268 152827 153848 154351 155176 156816 158381 158974 159100 159464 159397 157982 155950 154827 154671 154320 153519 153175 153604
57251 153604 154094 154291 154608 155101 155211 154849 154588 154533 154071 152988 151893 151272 151030 151137 151875 153199 154695 156361
57233 156361 158640 161500 164232 166359 167966 169058 169467 169669 170838 173541 176983 179898 181811 183215 184996
57218 184996 187853 191784 195911 199213 201566 203743 206432 209678 213208 216716 219841 222418 224825 227581
57204 227581 230622 233552 236521 240171 244615 249177 253289 257076 260912 264999 269512 274561 279791 284593
57190 284593 288915 293403 298566 304299 310436 317224 324884 333118 341332 349119 356368 363252 370303 378207
57176 378207 387249 397079 407179 417423 428161 439879 452717 466329 480398 495387 512414 532113
57164 532113 554089 577934 604269 633999 666832 701313 736198 771060 805598 839317 872157
57153 872157 904724 937504 970241 1002296 1033281 1063301 1092997 1123382 1155182 1188230 1221880
57142 1221880 1255894 1290303 1324539 1357569 1389245 1420783 1453415 1487030 1520571 1553454 1586105
57131 1586105 1619337 1653662 1689212 1726010 1764195 1803953 1845211 1887388 1929598 1971271 2012670
57120 2012670 2054861 2099162 2146472 2197118 2251471 2310600 2376005 2448757 2529317 2618317 2716957
57109 2716957 2826476 2947779 3082020 3231195 3397932 3585228 3797062 4039191 4319354
57100 4319354 4647452 5036327 5502318 6064886 6745889 7569253 8560601 9746535 11153825
57091 11153825 12807991 14730013 16931845 19412618 22155123 25120695 28244228 31433087
57083 31433087 34568219 37502600 40062563 42068883 43382262 43948202 43806553 43058974
57075 43058974 41822281 40198964 38271756 36110112 33777411 31335494 28845767 26366740
57067 26366740 23950181 21638692 19464916 17451347 15610686 13947038 12457334 11132918
57059 11132918 9961901 8931514 8028655 7239209 6548697 5944367 5415821 4953473 4547743
57050 4547743 4190319 3874971 3596337 3348903 3127847 2929824 2752005 2591127 2444282
57041 2444282 2309801 2186513 2072858 1967461 1869903 1780110 1697617 1622109 1554046 1494052
57031 1494052 1442384 1399718 1367954 1349810 1348281 1366271 1404157 1455207 1504046 1532304 1527651 1488459
57019 1488459 1421605 1337404 1245688 1153717 1065679 983747 909507 844155 787763 739244 697228
57008 697228 660691 628992 601848 579148 560306 543976 528845 514444 500817 487720 474744
56997 474744 461865 449325 437182 425552 415060 406502 400150 395819 393358 392690 393747 396952 403419
56984 403419 414032 428278 444297 459734 472168 479227 479219 471938 458733 441938 424156 407285 391706
56971 391706 376779 362445 349788 339717 331955 326036 322427 321757 323602 327197 332938 342053 355102
56958 355102 371915 392649 417327 443956 468158 485279 492493 489182 476540 457267 434762 411701
56946 411701 389507 369097 351422 336974 325454 316457 310126 306726 306018 307621 311861 319785 332340
56933 332340 349901 372752 401569 436596 475728 513482 542582 557378 556204 541020 515518 483703
56921 483703 449252 414973 382472 352527 325806 303044 284639 270280 258895 248979 239339 229817
56909 229817 221092 213651 207237 201393 196049 191297 187030 183185 180024 177828 176532 175833 175344 174594 173479
56894 173479 172915 174361 178423 184669 193158 205169 221858 243103 268458 298081 331296 364707 393173
56881 393173 412738 422031 421581 413301 400517 386849 374315 363072 353031 344909 339592 337381 338140
56868 338140 341595 347462 356061 368897 387929 414224 448111 490684 543844 607880 679049 749599
56856 749599 809875 851077 867902 860259 832789 792336 745408 697098 651025 609530 574129 545998
56844 545998 525823 513326 507619 508364 516309 532727 558913 596399 647114 712982 795418 894506
56832 894506 1006864 1123020 1227484 1303339 1338809 1331259 1286541 1215328 1129211 1038166 949500
56821 949500 867799 795394 733086 680907 638621 605963 582744 568844 564007 567912 580923 604789
56809 604789 642050 694356 761302 840052 924352 1003349 1063160 1092262 1086735 1050757 992875 922211
56797 922211 846684 772245 702573 639777 585412 540311 503818 474389 451287 434941 425586 422590
56785 422590 425470 434774 451486 476163 508946 549285 594397 638118 672228 689794 687892 667978
56773 667978 634329 592102 546097 500216 457054 417635 381990 350378 323646 302095 284492
56762 284492 268892 254276 240861 229101 219074 210719 203944 198396 193669 189688 186451 183536 180448
56749 180448 177307 174614 172372 170071 167458 164720 162011 159430 157392 156292 155821 155287 154590 154205 154257 154320
56733 154320 154173 154001 153843 153523 153179 153120 153159 152857 152414 152424 152711 152431 151517 151052 151832 153471 155299 157231 159245
56714 159245 160834 161688 162283 163172 164178 164828 165130 165438 165946 166802 168335 170664 173307 175547 176976 177528
56698 177528 177306 176640 175991 175548 175207 174970 174919 174731 173799 172067 170250 169004 168326 167951 167769 167560 166903 165784
56680 165784 164813 164505 164670 164908 165350 166452 168296 170437 172406 174137 175896 177852 179732 181098 182045 183226
56664 183226 184838 186097 186316 186119 186781 188583 190670 192422 194034 195722 197234 198277 198739 198481 197666 197185
56648 197185 197801 198879 198978 197761 196224 194903 193162 190636 188174 186629 185729 184811 183819 182984 182275 181835
56632 181835 182177 183345 184530 185082 185172 185017 184251 182740 181189 180157 179166 177519 175468 173830 172964 172787
56616 172787 173266 174168 174748 174355 173138 171707 170503 169792 169742 170006 169817 168949 168151 168207 169104 170400 171769 172779
56598 172779 172929 172417 172200 172797 173717 174472 175305 176356 177000 176727 175900 174971 173834 172686 172553 173923 175622
56581 175622 176157 175595 175091 175128 175342 175618 176256 177301 178663 180617 183280 185907 187665 188804 190209 192040
56565 192040 193766 195343 197366 200195 203765 208214 213879 220635 227859 234947 241374 246483 249894 251970
56551 251970 253352 254309 255056 256182 257954 259536 259735 258388 256304 254140 252095 250484 249686 249534 249468 249237
56535 249237 248876 248136 246658 244648 242755 241268 239879 238170 235927 233139 230124 227423 225238 223290 221561
56520 221561 220575 220387 219881 217948 215039 212773 212174 212887 213876 214270 213796 212942 212496 212463 211888 210223 208306
56503 208306 207313 207283 207446 207528 207827 208375 208926 209564 210537 211656 212544 213228 213868 214181 213772 212720 211284 209475
56485 209475 207517 206167 205813 205782 205325 204765 204860 205623 206605 207729 208845 209184 208412 207641 208086 209228 209701 209616
56467 209616 210442 212661 215068 216580 217424 218212 218960 219406 219450 219040 218299 217830 218196 219128 219923 220398 220703 220534
56449 220534 219537 218252 217612 217686 217950 218561 220143 222381 224046 224554 224446 224336 224395 224903 226142 227560 228105
56432 228105 227618 227011 226955 227271 227650 228059 228342 228307 228231 228406 228355 227496 226442 226391 227295 227915 227856 228188 229698 231771
56412 231771 233448 234520 235064 234882 234028 233088 232411 231605 230197 228297 226448 225252 225070 225502 225349 223908
56396 223908 222152 221811 223478 226502 230408 235180 240284 244831 248929 253616 259197 264706 269250 272780
56382 272780 275319 276629 276974 277210 277707 278134 278503 279400 280851 282007 282286 281975 281460 280814 280367 280640 281420
56365 281420 281841 281678 281598 281946 282278 282352 282593 283284 284239 285491 287344 289510 291191 292229 293221 294339 295051
56348 295051 295136 294919 294420 293429 292543 292835 294291 295753 296602 297229 297714 297582 297215 297991 300362 303101 304979
56331 304979 305923 306101 305337 304192 304205 306140 309051 311812 314450 317323 320174 322881 326080 330152 334438
56316 334438 338149 341208 343603 344915 345164 345182 345543 345947 346189 346757 347979 349593 351633 354646 358507 362190
56300 362190 365342 368934 373667 378872 383702 388310 392998 397203 400229 402289 404154 406431 409580 413822
56286 413822 418715 423744 429450 436799 445318 453390 460699 468621 477671 486446 494073 501957 511793 523299
56272 523299 535279 547641 560895 574621 587846 600425 613076 626680 642196 660418 681128
56261 681128 703386 727239 754071 784728 818672 855742 897344 944979 998892 1059204 1127085
56250 1127085 1203772 1289533 1384514 1489258 1603324 1724724 1851837 1984648 2122838 2263870
56240 2263870 2404099 2540483 2669885 2787930 2890145 2973545 3036099 3075737 3091218 3083042
56230 3083042 3052408 3000248 2928415 2840665 2741206 2633041 2518638 2400907 2282280 2163907
56220 2163907 2046884 1933199 1824415 1720755 1622644 1531625 1448323 1370967 1297656 1228921
56210 1228921 1166330 1109689 1057414 1008779 964123 923564 887084 855082 827399 802514 779079
56199 779079 757435 738364 721363 705584 691419 679611 669672 660630 652485 645538 639220 633019 627599
56186 627599 623603 620350 617054 614214 612356 610666 608499 606992 607306 608381 608325 607158 606346 606474 607142 608321
56170 608321 610072 611684 612778 614458 617798 622106 626181 630217 634845 639516 643678 648468 655256 663565
56156 663565 672317 682018 693633 706287 718326 729855 742245 755990 771158 789111 811602 838761
56144 838761 869957 906087 949284 1001224 1063506 1138597 1228143 1330821 1443304 1561996 1681886
56133 1681886 1795376 1895328 1979150 2048375 2105654 2154363 2199324 2244160 2287679 2324979 2351738
56122 2351738 2365832 2366491 2355130 2336620 2316737 2297797 2277962 2253622 2220313 2172728 2107113 2024035
56110 2024035 1927466 1822217 1713896 1609311 1513654 1427947 1351452 1285196 1230536 1185913 1148371
56099 1148371 1117222 1093128 1074699 1059435 1047103 1038837 1033682 1029405 1025974 1024815 1025307 1025456 1025476 1027306
56085 1027306 1031055 1035268 1040092 1046734 1054352 1061073 1067601 1076283 1087008 1097598 1107797 1119229 1131808
56072 1131808 1143955 1156059 1170064 1185759 1201099 1215895 1231642 1248138 1263998 1279994 1298008
56061 1298008 1317107 1334648 1350808 1367917 1385786 1402000 1416495 1431446 1446880 1460933 1474260
56050 1474260 1489560 1506703 1522959 1538119 1554802 1573648 1592950 1613041 1636069 1661228 1685271
56039 1685271 1708222 1733634 1762654 1792732 1822643 1853891 1886695 1919537 1953106 1989747 2028733
56028 2028733 2067203 2105852 2148240 2194265 2240053 2284672 2331053 2379881 2428684 2477632 2529998
56017 2529998 2586099 2642998 2700925 2763565 2831200 2900179 2970015 3044216 3123219 3203619 3285418
56006 3285418 3372704 3465984 3561420 3659021 3763771 3877076 3994949 4116379 4245411 4383267
55996 4383267 4526696 4675938 4835733 5006639 5184320 5369432 5568999 5785889 6016517
55987 6016517 6260980 6525165 6810534 7112596 7432257 7777664 8152161 8552132 8979682
55978 8979682 9444888 9952246 10498082 11085119 11726074 12429413 13196557 14037360 14972440
55969 14972440 16015697 17171663 18455345 19896965 21522996 23354258 25430245 27814879
55961 27814879 30573839 33773350 37510531 41918725 47137711 53316145 60660913 69459531
55953 69459531 80065488 92939012 108749868 128413416 153024265 183771687 221675037
55946 221675037 266704738 316362308 364871985 404318792 427594457 431270534 416491778
55939 416491778 387686014 350416768 309721626 269351631 231671215 197902888 168488456
55932 168488456 143390267 122273583 104638612 89950240 77721540 67524518 58982501
55925 58982501 51785061 45694080 40518023 36090869 32279871 28990066 26144197 23668104
55917 23668104 21501254 19603888 17941865 16475607 15171267 14009650 12975201 12047005
55909 12047005 11207850 10450865 9769130 9148265 8576168 8050726 7571083 7129971 6720916
55900 6720916 6344419 6000528 5682922 5386234 5111823 4860571 4627067 4406461 4200491
55891 4200491 4011363 3835941 3671059 3518586 3380280 3253291 3135476 3029849 2939192 2861019
55881 2861019 2791586 2729708 2672944 2615473 2553993 2491100 2429172 2365594 2297402 2225734 2152162
55870 2152162 2075418 1995462 1916321 1841257 1769214 1699187 1633693 1574595 1519751 1467113 1418054
55859 1418054 1373438 1330579 1287455 1246113 1208709 1173950 1140533 1110201 1084158 1060060 1035627
55848 1035627 1011716 988989 965348 939818 915274 893974 873744 851827 829247 808242 788596
55837 788596 769657 752793 738592 724571 708820 693112 679463 666606 652982 640208 630265 621960
55825 621960 613480 605878 600654 596222 590119 582623 575056 566593 555968 544464 534063 524276 513788
55812 513788 503640 495896 490475 485995 482465 480759 480619 481460 483901 488527 494383 500507 507518 516058
55798 516058 525299 534434 543645 551943 556330 555145 550251 543989 536080 525608 513903 503098 493658
55785 493658 485456 479298 474994 469745 460873 448763 435256 421053 406901 395400 389057 387887 391048
55772 391048 399296 413582 432497 452868 471334 483803 485857 476434 459717 441090 422612 404141
55760 404141 386556 371032 356830 342743 329648 319256 311505 305400 301043 298436 295688 290902 284749
55747 284749 278876 273058 266306 259514 254471 251251 248973 248026 249091 250925 251514 250567 248647 245043 239067
55732 239067 232461 227877 225596 224125 223143 223251 223497 221926 218313 213976 209251 203517 197410 192602 189429
55717 189429 186828 184516 183318 183643 185485 189641 196824 205733 213815 219777 223780 225680 225103 222961 220968
55702 220968 219650 218281 216398 213856 209911 203978 196944 190212 184042 178289 173820 171292 169428 166686
55688 166686 163956 163324 164726 166206 167143 168781 171640 174855 178241 182689 188124 193106 196921 200194 203040
55673 203040 204406 203764 201920 199659 196925 193696 190386 187144 183900 181166 179565 178642 177452 176273 176357
55658 176357 178034 180442 183088 186243 189732 192816 195453 198387 201828 205135 207835 209838 210727 210033 208116
55643 208116 205699 202650 198374 193095 187504 181424 174155 165980 157980 150573 143515 137125 132128 128479
55629 128479 125626 123733 123254 123594 123645 123415 123657 124096 123599 121984 120151 118512 116776 115124 114021 112970
55613 112970 111063 108698 107105 106220 104769 102529 100737 99970 99296 97899 96040 94072 91926 89965 88914
55598 88914 88615 88114 87215 86623 86386 85660 84239 82875 81838 80625 79391 79109 79882 80549 80488 80362 80612 80713
55580 80713 80545 81084 82913 85214 87008 88327 89398 89728 88871 87406 86400 86392 87313 88844 90513 91976
55564 91976 93359 94851 96079 96597 96761 97250 97948 98295 98469 98955 99203 98141 96024 94284 93446 92707 91703
55547 91703 91060 90819 89973 88322 87379 88576 91567 94881 97284 98085 97251 95883 95585 96794 98506 99863
55531 99863 100959 101828 101989 101476 101149 101350 101311 100431 99106 97766 96189 94303 92629 91336 89829 87824
55515 87824 85821 84024 81861 79187 76869 75469 74350 72826 71266 70289 69754 69315 69191 69602 70133 70355
55499 70355 70450 70640 70692 70588 71063 72834 75800 79400 83116 86200 87685 87299 85860 84359 83157 82348 82130
55482 82130 82397 82582 82248 81303 79590 77116 74847 74234 75461 77090 77850 77959 78287 79130 80279 81453 82128
55465 82128 81733 80456 79171 78271 77427 76707 76825 77821 78602 78357 77492 76669 75956 75519 76065 77732 79440 80118
55447 80118 79909 79524 79222 78940 78613 77815 76005 73732 72547 73021 73850 73744 73190 73372 74329 75287 76002 76638
55429 76638 76907 76516 76055 76403 77483 78437 78765 78634 78388 78377 78843 79412 79137 77629 75690 74314 73689 73731
55411 73731 74737 76660 78332 78483 77251 75913 75373 75558 75981 76232 76082 75621 75126 74544 73561 72415 71935
55394 71935 72365 72855 72668 72241 72433 73361 74543 75545 75878 75021 73282 72020 72246 73503 74777 75828 76925
55377 76925 77922 78514 78887 79317 79618 79749 80371 81916 83589 84271 84009 83635 83238 81971 79348 75876 72459
55360 72459 69771 68137 67441 67223 67239 67716 68780 70021 71003 71666 71861 71116 69482 68047 67886 68909 70294
55343 70294 71550 72583 73206 73337 73294 73371 73488 73670 74202 74850 74694 73417 71971 71218 70723 69811 68977 69049 69592
55324 69592 69469 68619 68047 68195 68511 68570 68634 69058 69909 71185 72707 73945 74558 74898 75375 75694 75401 74730 74124
55305 74124 73380 72231 71367 71739 73005 73749 73221 71945 70673 69683 69177 69429 70320 71332 72087 72499 72561 72564
55287 72564 73216 74832 76641 77595 77650 77542 77685 78115 79184 81210 83566 85120 85569 85473 85066 84102 82879
55270 82879 82332 82856 83881 84799 85452 85523 84415 82159 79736 78026 77043 76536 76784 78258 80791 83458 85254
55253 85254 85849 85828 86119 86983 87727 87610 86665 85310 83638 81716 80142 79494 79434 79217 78917 79284 80375 81231
55235 81231 81115 80355 79741 79683 80130 80799 81195 80845 79699 78056 76159 74190 72575 71847 72169 73285 74800
55218 74800 76241 77072 77142 76942 77039 77436 77809 78020 77964 77350 76212 75258 75060 75315 75549 76126 77693 79957 81913
55199 81913 83080 83642 83617 82907 82108 82233 83451 84877 85774 86254 86698 87136 87344 87073 86142 84748 83523 82873
55181 82873 82551 82356 82737 83945 85180 85571 85546 86090 87004 87252 86839 86924 87954 89058 89515 89527 89249 88345 87015
55162 87015 86267 86523 86948 86737 86113 85506 84766 83937 83886 85174 86911 87656 87112 86200 85721 85684 85810 86081 86679
55143 86679 87638 88632 89146 89013 88668 88594 88668 88504 88253 88475 89206 89837 89956 89732 89409 89019 88691 88628 88728 88733 88758
55122 88758 89075 89488 89612 89697 90325 91329 91900 91837 91742 91867 91779 91414 91436 92100 92620 92192 90928 89405 87972
55103 87972 86870 86329 86202 86123 86309 87491 89793 92425 94732 96732 98402 99363 99668 99977 100532 100874 100966
55086 100966 101544 102787 103666 103359 102329 101308 100151 98645 97491 97415 97976 98347 98690 99714 101327 102790
55070 102790 103796 104397 104267 103197 102100 102291 103726 104929 104784 103547 102032 100684 99691 99244 99258 99321 99257
55053 99257 99396 99980 100576 100358 98942 96858 95208 94727 95166 95696 95943 96252 96885 97469 97532 97227 97051 97136 97217
55034 97217 97135 96994 96914 96905 96922 96862 96691 96606 96832 97184 97236 97052 97273 98202 99230 99517 98887 97769 96642 95870 95747
55013 95747 96341 97454 98893 100468 101714 102160 102072 102326 103286 104342 104842 104784 104294 103214 101790 101012 101495
54996 101495 102526 102914 102323 101101 99399 97389 95918 95851 96873 97849 98432 99458 101611 104389 106679 107895
54980 107895 108361 108826 109682 110488 110422 109387 108391 108449 109437 110455 110972 111047 110729 110029 109389 109463 110290 111270 112087
54961 112087 113163 115033 117626 120269 122097 122477 121423 119732 118390 117722 117259 116426 115135 113706 112450
54946 112450 111395 110333 109187 108319 108241 108889 109472 109310 108580 108015 108110 108926 110313 111898 113099 113640 113982
54929 113982 114865 116549 118880 121898 125871 130679 135706 140562 145614 151569 158567 165802 172159 177248
54915 177248 181663 185875 189001 189277 185920 180040 173396 166799 160221 153895 148477 144187 140481 136702
54901 136702 132676 128656 125088 122482 121136 120826 120953 121064 121103 121210 121472 121889 122447 123173 124104 125162 126133
54884 126133 126998 128209 130357 133522 137281 141404 146158 151829 158293 165202 172161 178535 183471 186397
54870 186397 187297 186397 183942 180323 175915 170647 164227 156972 149915 143852 138784 134471 130922 128077 125637
54855 125637 123584 122311 121833 121443 120496 119032 117311 115420 113697 112765 112639 112437 111545 110311 109103 107575
54839 107575 105575 103913 103307 103286 103155 103303 104459 106224 107619 108656 110059 111671 112464 112118 111422 111010
54823 111010 110708 110252 109707 109046 108146 107296 106941 106896 106589 106083 106004 106469 106905 106954 106782 106518 106256 106551 107932
54804 107932 109827 111026 111353 111881 113264 114852 115852 116411 117031 117757 118440 119156 119825 119988 119447 118676 118225
54787 118225 118178 118459 119124 120014 120662 120875 120956 121121 121202 121216 121617 122633 123858 124903 126016 127679 129964 132685
54769 132685 135912 140020 145408 152303 160506 169192 177283 184138 189611 193515 195523 195639 194178 191174
54755 191174 186372 179968 172811 165688 158912 152734 147497 143165 139310 135884 133454 132323 131916 131378 130336
54740 130336 128850 127148 125718 125143 125427 125937 126293 126877 128186 130209 132783 135954 139528 142789 145294
54725 145294 147641 150916 155609 161400 167665 173725 178941 183113 186612 189624 191358 190518 186580 180350
54711 180350 173234 166204 159462 152942 146941 142111 138748 136329 134080 131814 129826 128136 126433 124733
54697 124733 123414 122481 121440 120106 118925 118234 117835 117577 117742 118422 119114 119385 119432 119509 119282 118349 117013 115932
54679 115932 115242 114574 113794 113247 113279 113825 114404 114437 113806 113200 113551 114999 116835 118578 120416 122304 123408
54662 123408 123099 121900 120740 119746 118547 117371 116892 117118 117334 117159 116876 116623 116076 115258 114959 115868 117624
54645 117624 119188 119946 120126 120280 120661 121124 121415 121452 121373 121366 121515 121758 121903 121638 120700 119175 117606 116691 116781
54626 116781 117590 118373 118526 118137 117852 118072 118421 118269 117557 116790 116334 116192 116363 116887 117513 117876 118076 118559 119291
54607 119291 119673 119528 119550 120373 121648 122501 122539 122048 121556 121593 122535 124216 125896 126911 127158 126744 125627 123943
54589 123943 122292 121206 120613 120269 120379 121220 122391 123045 122858 122278 121829 121551 121159 120439 119438 118490 117986
54572 117986 117925 117815 117259 116493 116131 116510 117516 118892 120371 121589 122183 122007 121114 119643 117909 116483 115966
54555 115966 116644 118368 120621 122734 124296 125468 126644 127826 128677 129232 130050 131388 132698 133331 133405 133580
54539 133580 134236 135238 136398 137759 139444 141304 142683 142677 140998 138544 136611 135501 134475 133095 131803
54524 131803 130939 130129 129166 128655 128993 129395 128850 127585 126629 126302 126101 125896 126212 127198 128164 128385 127820 126919
54506 126919 126174 125909 126093 126275 126083 125683 125429 125282 125053 124979 125396 126044 126334 126288 126535 127365 128417 129393 130439
54487 130439 131687 132971 134166 135295 136152 136331 135849 135310 135219 135471 135644 135501 135153 135049 135795 137546 139533
54470 139533 140631 140547 140053 139988 140453 141114 141764 142328 142706 142915 143151 143477 143648 143468 143147 143156 143794 144924 145970
54451 145970 146203 145272 143527 141684 140239 139315 138871 138684 138350 137708 137196 137318 137814 137884 137248 136479 136203 136509
54433 136509 137267 138472 139956 141270 142238 143276 144763 146296 147014 146588 145592 144902 144946 145569 146407 147201 147715
54416 147715 147561 146490 144935 143875 143774 143905 143219 141751 140656 140816 141915 143032 143655 143825 143697 143412
54400 143412 143301 143840 145240 147175 148993 150273 151116 151821 152338 152320 151735 151014 150364 149404 147924 146595 146334
54383 146334 147193 148511 149951 151628 153222 153911 153506 153022 153581 155095 156463 156885 156679 156881 158146 160023
54367 160023 161388 161785 162109 163611 166420 169612 172602 175726 179309 182985 186260 189097 191456 192786 192545
54352 192545 190921 188533 185704 182459 178995 175660 172585 169741 167222 165097 163116 161002 158964 157466
54338 157466 156411 155000 152621 149674 147293 146323 146627 147303 147455 146800 145665 144558 143777 143384 143378 143809 144715
54321 144715 145988 147354 148514 149340 149850 150020 149774 149171 148445 147749 147051 146333 145687 145111 144497 143932 143644 143444
54303 143444 142675 141125 139637 139304 140279 141832 143282 144324 144724 144463 144091 144174 144363 143707 142013 140245 139396
54286 139396 139612 140498 141606 142391 142420 141987 141917 142422 142774 142513 142296 142967 144310 145388 145750 145618 145177 144409
54268 144409 143601 143366 143995 145182 146481 147769 149157 150658 152040 152979 153415 153742 154481 155739 157175 158459
54252 158459 159460 159976 159773 159069 158523 158420 158260 157437 155980 154286 152485 150537 148679 147335 146693 146705 147303
54235 147303 148246 148971 149059 148759 148674 149005 149469 149879 150378 151084 151900 152789 153943 155551 157491 159329 160511 160673
54217 160673 159951 158946 158202 157707 157057 156007 154707 153379 152028 150584 149274 148676 149259 150786 152344 153170
54201 153170 153409 153835 154843 155972 156478 156086 155153 154308 153990 154110 154180 153981 154005 154799 155948 156364 155688 154769
54183 154769 154438 154445 154080 153311 152689 152474 152507 152792 153568 154840 156220 157238 157526 156899 155675 154736 154807 155680 156500
54164 156500 156708 156342 155602 154671 153940 153838 154198 154258 153562 152570 152100 152336 152665 152453 151710 150956 150624 150880 151943
54145 151943 154138 157288 160375 162367 163354 164284 165458 165980 165043 163226 161958 162031 163099 164302 164826 164151
54129 164151 162430 160604 159571 159216 158690 157611 156494 156002 156288 157202 158634 160364 161858 162560 162370 161800
54113 161800 161694 162705 164802 167274 169292 170430 170651 170113 169200 168484 168296 168520 169059 170170 171987 174085
54097 174085 176093 178470 181969 186503 191381 196685 203430 211935 220789 228038 232927 235882 237125 236103
54083 236103 232277 225989 218400 210834 204208 198800 194377 190580 187251 184359 181777 179352 177224 175905
54069 175905 175856 176983 178642 180194 181530 182994 184864 187052 189304 191520 193794 196291 199153 202367 205634
54054 205634 208547 210989 213124 214876 215748 215361 213914 211863 209484 207095 205394 204955 205548 206574 208122
54039 208122 210973 215411 220582 225358 229450 233383 237720 242666 248206 254231 260424 266209 270874 273901
54025 273901 275364 275900 276142 276235 276154 276280 277140 278543 279525 279412 278475 277255 275620 272931 268961 264273 259728
54008 259728 255841 252449 248798 244143 238554 233022 228483 224916 221673 218516 215816 213761 211921 209858
53994 209858 207782 206222 205225 204226 202734 200906 199371 198551 198209 197636 196359 194667 193334 192772 192626 192375
53978 192375 192094 192252 192807 192968 192057 190297 188492 187235 186723 187014 187980 189106 189842 190282 191059 192491 194253
53961 194253 196007 197866 199970 202062 203951 206163 209630 214731 221042 228083 236101 245978 258439 273136
53947 273136 288279 301161 309422 312112 309817 304020 296382 288370 281113 275392 271653 269919 269681 270125
53933 270125 270647 271167 271890 272941 274271 275748 277242 278758 280531 282851 285734 288953 292377 296036 299888
53918 299888 303894 308329 313563 319406 325232 330921 337124 344200 351440 357872 363365 368335 372716 375908
53904 375908 377607 378072 377676 376646 375109 372932 369775 365817 362185 359873 358360 355978 351726 346101 340133
53889 340133 334266 328351 322090 315264 307956 300749 294271 288513 283015 277738 273167 269456 266109 262740
53875 262740 259549 256701 253749 250110 245810 241411 237394 233839 230484 226976 223315 220065 217815 216387
53861 216387 215048 213533 212322 211779 211582 211209 210424 208991 206579 203401 200452 198601 197789 197526 197661 198160
53845 198160 198575 198493 198279 198641 199480 199854 199200 198070 197418 197488 197664 197266 196357 195758 196257 197765 199380 200355
53827 200355 200837 201524 202818 204527 206272 207873 209368 210804 212078 212972 213435 213748 214160 214390 213838 212449
53811 212449 211009 210435 211040 212654 215016 217717 220171 222168 224346 227642 232302 237664 242826 247289 251039
53796 251039 254436 258031 262266 267264 272873 278666 283826 287460 289439 290699 292245 293968 294876 294413 293019
53781 293019 291316 289238 286280 282316 277835 273447 269379 265484 261556 257491 253240 248862 244716 241329
53767 241329 238753 236191 232753 228623 225039 222896 221774 220573 218755 216619 214648 212973 211322 209244
53753 209244 206500 203479 200983 199412 198440 197761 197740 198871 200874 202848 204201 204953 205305 205441 205637 206034
53737 206034 206330 206150 205729 205728 206443 207663 209295 211459 213848 215672 216559 217022 217670 218381 218680 218617 218855 219966
53719 219966 221956 224328 226409 227752 228492 229182 230152 231148 231789 232146 232704 233892 235855 238462 241324 243997
53703 243997 246429 249056 252129 255161 257440 259058 260958 263873 267513 270954 273558 275339 276696 278044
53689 278044 279624 281449 283332 284998 286156 286580 286304 285746 285376 285172 284684 283754 282892 282655 282900 283050 282937
53672 282937 282934 283243 283505 283279 282516 281375 279888 278112 276387 275169 274685 274869 275432 275871 275723 275005 274182 273527
53654 273527 272852 272147 271949 272623 273648 274245 274432 274769 275301 275603 275771 276429 277558 278294 278295 278505 279892 282059
53636 282059 283815 284739 285469 286708 288569 290776 292933 294647 295832 296917 298377 300190 302068 304047 306429
53621 306429 309243 312291 315745 320242 326223 333333 340541 346771 351556 355335 358940 362550 365388 366783
53607 366783 367259 368049 369681 371646 373473 375428 377901 380657 383105 385007 386543 387854 388895 389682 390417
53592 390417 391258 392060 392452 392207 391542 391010 391025 391580 392447 393358 393846 393212 391104 388086 385231 383118 381481
53575 381481 379855 378163 376550 375014 373446 371917 370685 369957 369682 369508 368950 367699 365832 363693 361648
53560 361648 360041 359188 359121 359448 359739 360056 360828 362256 364105 366085 368138 370215 372012 373036 372876 371620
53544 371620 370183 369989 371750 374574 376836 378085 379543 382447 386511 390535 394118 398050 403127 409298
53530 409298 416089 423295 430915 438788 446735 454957 463947 473945 484725 495998 507884 520756 534699
53517 534699 549258 563795 578010 592169 607007 623457 642170 663014 685133 707774 731040
53506 731040 755553 781333 807321 832217 855611 878096 900426 922810 944928 966310 986608
53495 986608 1005759 1024106 1042261 1060697 1079503 1098621 1118184 1138305 1158570 1178103 1196390
53484 1196390 1213865 1231441 1249601 1268075 1286276 1303709 1320094 1335486 1350355 1365253 1380252
53473 1380252 1394742 1407693 1417985 1424790 1428109 1428893 1428168 1426004 1421733 1415081 1406413 1395830 1382900
53460 1382900 1367707 1351481 1335595 1320301 1304967 1289009 1272043 1253640 1233792 1213429 1193708
53449 1193708 1174783 1155842 1136252 1116073 1095564 1074894 1054440 1034763 1016152 998643 982545
53438 982545 968530 957102 948345 942112 938007 935277 933239 931785 930979 930359 929385 928531 929135 931972 936712
53423 936712 942935 950781 960216 970503 981119 992723 1006488 1022736 1040765 1059835 1079860 1101208
53411 1101208 1124213 1148854 1174780 1201633 1229329 1257816 1286781 1316144 1346787 1380081 1416469
53400 1416469 1455161 1495511 1537953 1583178 1631034 1680837 1732134 1784587 1837678 1891233 1945746
53389 1945746 2001405 2057247 2112125 2166195 2220441 2274920 2328501 2380313 2430386 2478613 2524061
53378 2524061 2565843 2604052 2639265 2671537 2700259 2724646 2744101 2758457 2768187 2774044 2776198 2773932
53366 2773932 2766314 2752737 2732592 2704991 2669445 2626688 2578460 2526594 2472557 2417536 2362333
53355 2362333 2307094 2251535 2195613 2139896 2085350 2032945 1983335 1936610 1892286 1849698 1808369
53344 1808369 1767791 1727093 1685422 1642829 1600455 1559604 1520894 1484460 1450595 1419718 1391753
53333 1391753 1365951 1341494 1318213 1296772 1278313 1263721 1252815 1244097 1235561 1225934 1215051 1203187
53321 1203187 1190530 1177439 1164640 1152630 1141069 1129312 1117479 1106511 1097163 1089428 1083145 1078731
53309 1078731 1076883 1077693 1080378 1083946 1087950 1092541 1097930 1104025 1110745 1118545 1128265 1140282 1154096 1168987
53295 1168987 1184820 1201879 1220226 1239839 1261264 1285379 1312227 1340564 1368866 1396422 1423173
53284 1423173 1448899 1473075 1495329 1515629 1534042 1550642 1565574 1578892 1590199 1598657 1603520 1604673
53272 1604673 1602611 1597916 1590787 1581136 1569070 1554975 1538974 1520630 1499523 1475934 1450550 1423734
53260 1423734 1395597 1366624 1337487 1308172 1278055 1247102 1216245 1186162 1156382 1126209 1095982
53249 1095982 1066768 1039183 1013171 988565 965038 941723 917708 892982 868249 843834 819525
53238 819525 795577 773061 752726 734034 715851 697816 680601 665005 651241 639111 628463
53227 628463 619282 611494 604902 599269 594255 589208 583291 576121 568125 559798 550645 539442 525832 511177
53213 511177 497369 485162 474129 463862 454453 445870 437584 429113 420515 412238 404785 398584 393669
53200 393669 389207 383753 376422 367845 359716 353327 348528 344069 338917 333177 327652 322632 317496 311702
53186 311702 305727 300617 296816 293829 290921 287687 284017 280085 276427 273612 271651 270037 268398 266800
53172 266800 265357 263917 262260 260325 258161 255939 254055 252856 252175 251445 250384 249283 248581 248518 249233 250670
53156 250670 252196 252812 252107 250720 249588 248974 248487 247721 246555 245058 243470 242083 240844 239284 237179
53141 237179 235099 233946 234016 234805 235617 236080 236219 236432 237294 238991 240930 242250 242753 242987 243375 243747 243880
53124 243880 244065 244749 245901 247157 248468 250141 252203 254143 255494 256388 257267 258205 258809 258738 258026 256875
53108 256875 255377 253563 251537 249481 247586 246068 245097 244608 244296 243813 242925 241524 239769 238202 237343 237043
53092 237043 236600 235729 235001 234962 235273 235291 235209 235848 237340 238765 239320 239212 239098 239117 238912 238304 237543 237055 237188
53073 237188 238014 239081 239542 238793 236951 234541 231939 229341 227081 225549 224768 224324 223839 223348 223136 223277
53057 223277 223462 223302 222807 222501 222937 224098 225365 226145 226451 226772 227487 228461 229231 229493 229316 228845 227975 226607
53039 226607 225206 224632 225119 225824 225825 225290 225073 225360 225438 224833 223916 223150 222456 221732 221420 221959 223065 224081 224840
53020 224840 225659 226654 227545 228081 228312 228488 228958 229965 231263 232161 232327 232311 232803 233606 233922 233541 233066 232890
53002 232890 232661 232047 231416 231319 231681 231985 232048 232138 232389 232477 231987 230904 229734 229255 230060 232110 234679 236894
52984 236894 238425 239598 240842 242133 243059 243347 243157 242810 242365 241687 240917 240634 241295 242628 243870 244664 245463
52967 245463 246860 248715 250252 251015 251430 252254 253643 255013 255708 255553 254729 253461 252035 250859 250106 249395
52951 249395 248147 246283 244216 242099 239578 236522 233674 232092 232004 232594 232896 232620 232060 231564 231307 231378 231812
52934 231812 232481 233081 233329 233189 232880 232622 232410 232034 231367 230501 229644 228991 228743 229040 229678 230073 229772 229025 228594
52915 228594 228942 229814 230669 231268 231642 231737 231456 231028 230960 231404 231875 231897 231717 231978 232726 233255 233088 232670 232773 233580
52895 233580 234767 236160 237699 238914 239118 238294 237168 236218 235100 233424 231566 230281 229776 229635 229452 229116
52879 229116 228660 228272 228347 229115 230260 231263 232088 233155 234683 236455 238260 240154 242172 244147 245999 247946
52863 247946 250197 252532 254302 254817 253849 251964 250235 249323 248821 247787 245876 243551 241191 238548 235360
52848 235360 232001 229107 226823 224838 222956 221223 219610 218062 216812 216273 216532 217267 218218 219313 220241
52833 220241 220367 219486 218352 218019 218661 219487 219861 220058 220652 221511 221937 221684 221329 221459 221941 222321 222636 223315
52815 223315 224459 225760 227250 229540 233025 237163 240905 243616 245167 245361 243801 240445 235930 231180
52801 231180 226885 223372 220708 218750 217328 216464 216292 216721 217432 218240 219106 219649 219130 217296 214918 213041
52785 213041 211972 211484 211712 212999 214889 216122 216030 215303 214937 215003 215023 215000 215278 215597 215206 214014 212943 212817
52767 212817 213383 213757 213509 212979 212722 212917 213254 213273 212904 212657 213082 214075 215031 215708 216532 217816 219085 219595
52749 219595 219306 218975 219330 220486 222127 223960 225866 227832 229802 231551 232623 232545 231237 229294 227878
52734 227878 228085 230129 233041 235481 237000 238340 240285 242452 243597 243085 241647 240514 240105 239814 238975
52719 238975 237673 236496 235803 235451 235132 234685 234045 233163 232092 230893 229415 227468 225400 224109 224125 224960
52703 224960 225790 226494 227444 228487 228943 228657 228318 228445 228734 228779 228820 229241 229830 230174 230425 231062 232015 232708 232920
52684 232920 233077 233546 234109 234303 234025 233560 233140 232600 231589 230165 229060 229008 229818 230529 230635 230662 231255 232214
52666 232214 232926 233337 233832 234462 234969 235465 236366 237596 238537 238959 239503 241015 243709 247120 250541 253356 255243
52649 255243 256206 256288 255348 253371 250895 248698 247047 245627 244190 242895 241961 241392 241154 241272 241680 242254 243051
52632 243051 244213 245677 247261 249013 251096 253429 255760 257920 259542 259757 257928 254672 251438 249057
52618 249057 247416 246483 246505 246909 246210 243817 241073 239610 239419 239441 239477 240234 241699 242693 242344 241106 240031
52601 240031 239619 239723 240043 240405 240844 241681 243277 245555 247934 249787 250817 251062 250819 250527 250408 250264 249911
52584 249911 249769 250560 252331 254164 255015 254624 253546 252593 252312 252675 253110 253005 252371 251806 251735 251948 251952 251556 250902
52565 250902 250125 249203 248060 246694 245263 244049 243241 242647 241817 240555 239228 238452 238502 239083 239638 239893 240168
52548 240168 241102 242906 244893 246007 245897 245265 245041 245415 245862 245930 245689 245452 245351 245311 245302 245439 245842 246535 247434
52529 247434 248391 249196 249664 249800 249868 250167 250720 251206 251229 250619 249552 248506 248087 248660 250036 251636 253074 254527
52511 254527 256410 258898 261873 265193 268730 272147 274896 276531 276963 276406 275191 273587 271648 269237 266325
52496 266325 263261 260603 258644 257206 255974 254860 254024 253626 253660 253913 254008 253608 252725 251851 251639 252412 253998
52479 253998 256012 258098 259846 260777 260808 260721 261637 263699 265647 266128 265257 264370 264361 264901 265411 266068 267414 269468
52461 269468 271772 274002 275996 277383 277801 277415 276763 276091 275235 274093 272721 271020 268832 266459 264507
52446 264507 263042 261393 259107 256665 254905 254036 253635 253359 253167 252953 252435 251563 250725 250404 250720 251348 251813
52429 251813 251831 251445 250860 250236 249678 249362 249442 249772 249995 250099 250664 252273 254788 257443 259682 261647 263817
52412 263817 266385 269136 271877 274853 278750 284254 291578 300383 310151 320478 330871 340273 347047 349673
52398 349673 347684 341975 334196 325765 317392 309411 302294 296608 292529 289674 287465 285461 283341 280945
52384 280945 278585 277064 276987 278059 279344 280165 280535 280814 281364 282569 284733 287677 290776 293732 297045 301282
52368 301282 306000 309950 312478 314239 316210 318360 319775 319933 319318 318703 318359 318219 318392 319025 319820 320199
52352 320199 320039 319828 319992 320388 320692 320957 321464 322249 323147 324225 325718 327558 329358 331051 333106 335877
52336 335877 339059 342188 345495 349840 355806 363195 371419 380028 388788 397657 406909 417048 428379 440788
52322 440788 454091 468329 483482 499085 514405 528915 542410 554889 566702 578690 591683
52311 591683 605735 620155 634387 648646 663580 679512 696136 712798 729035 744950 761017
52300 761017 777280 792893 806822 818992 830238 840995 850545 857809 862471 864993 865944 865783 864890
52287 864890 863235 860233 855575 850120 845341 841767 838548 834751 830583 826991 824480 822783 821518 820706
52273 820706 820615 821437 823259 826196 830304 835388 841011 846855 852976 859616 866753 874104 881619 889771 899138
52258 899138 909901 921918 935039 949057 963492 977786 991680 1005084 1017653 1028876 1038642 1047307
52246 1047307 1055073 1061500 1065806 1067467 1066526 1063612 1059748 1055814 1051900 1047265 1041061 1033061 1023750 1013962
52232 1013962 1004490 995744 987572 979514 971340 963264 955599 948388 941449 934648 928085 922100 917087 913126
52218 913126 909861 906991 904814 903953 904519 905944 907754 910112 913325 917159 920949 924207 926805 928818 930479
52203 930479 932209 934345 936784 939051 940799 942273 944352 948065 953814 960994 968538 975813 982775 989354
52189 989354 995121 999678 1002888 1004579 1004450 1002534 999326 995153 989880 983535 976742 970052 963286 956125
52175 956125 948940 942352 936200 929763 922941 916490 911110 907011 904470 903949 905277 907294 908801 909586 910219
52160 910219 911231 912809 914966 917492 919828 921330 921840 921899 922404 923923 926161 928177 929352 930155 931636
52145 931636 934243 937472 940668 943600 946027 947247 946616 944348 941400 938647 936394 934579 933159 932341 932702
52130 932702 935069 940033 947474 956615 966605 977162 988827 1002618 1019241 1038478 1059367 1080966
52118 1080966 1102851 1124940 1147154 1169309 1191182 1212526 1233165 1253050 1272066 1289831 1306010
52107 1306010 1320871 1335189 1349477 1363596 1377179 1390032 1401931 1412491 1421597 1429613 1436768 1442507
52095 1442507 1445814 1445987 1442815 1436288 1426596 1414328 1400265 1384994 1368994 1352994 1337889 1324289
52083 1324289 1312389 1302078 1292854 1283825 1274370 1264889 1256482 1249803 1244533 1240076 1236339 1233685 1232468
52070 1232468 1232926 1235261 1239490 1245245 1251985 1259479 1268020 1278026 1289393 1301376 1313324 1325466 1338583
52057 1338583 1352728 1366717 1379277 1390295 1400354 1409336 1416317 1420876 1423641 1425166 1424932 1422014 1416308
52044 1416308 1408572 1399489 1389258 1377989 1366031 1353844 1341832 1330248 1319021 1307711 1295929 1283734
52032 1283734 1271415 1258985 1246244 1233277 1220475 1207926 1195126 1181542 1167293 1153061 1139396
52021 1139396 1126294 1113434 1100635 1088053 1076054 1064998 1055106 1046400 1038733 1031955 1026046 1020929
52009 1020929 1016036 1010199 1002217 991604 978700 964059 947963 930543 912184 893595 875544 858588
51997 858588 842990 828812 816107 804957 795212 786192 776818 766164 753874 740228 726012 712279
51985 712279 699756 688252 676799 664514 651207 637110 622415 607299 592128 577264 562902
51974 562902 549403 537630 528545 522458 518984 517691 518450 521164 525482 530929 537116 543782 550756 557835
51960 557835 564459 569606 572384 572761 571387 568607 564038 557344 549147 540869 533841 528742 525687 524447
51946 524447 524621 525869 528187 531936 537650 545803 556615 569877 584969 601127 617703 634153 649961
51933 649961 664753 678450 691212 703282 715042 727155 740340 754789 769660 783027 792263 794717
51921 794717 788585 773558 750847 722611 691304 659317 628725 600945 576473 555058 536274 520051
51909 520051 506767 496808 489998 485495 482459 480854 481389 484417 489048 493599 496799 498254 497786 494874
51895 494874 489053 480608 470522 459886 449536 440016 431492 423798 416960 411650 408747 408402 409883 412354
51881 412354 415526 419515 424565 431040 439228 448844 459024 469062 478872 488427 497076 503686 507278 507271
51867 507271 503598 497094 489497 482403 476191 470360 464760 459948 456412 454103 452911 453050 454621 457113
51853 457113 459592 461241 461565 460360 457639 453503 448151 442176 436654 432351 428772 424525 418873 412520
51839 412520 406652 401719 397533 394124 391908 391127 391612 393063 395209 397707 400185 402437 404425 406039 406967
51824 406967 406765 405086 402058 398516 395533 393549 392218 391321 391439 393287 396621 400351 403622 406305 408439
51809 408439 409712 409724 408397 405923 402557 398687 394978 392200 390810 390665 391108 391466 391632 392068 393044 393964
51793 393964 393736 391809 388656 385276 382537 380965 380693 381352 382235 382831 383173 383579 384231 385088 385992 386642 386728
51776 386728 386433 386701 388608 392387 397370 403000 409552 417614 427092 437091 446672 455272 462395 467426 470050
51761 470050 470463 468778 464545 457413 448202 438684 430186 422781 415887 409122 402327 395352 388303 381746
51747 381746 376280 372066 369077 367484 367343 368171 369379 371041 373754 377746 382575 387724 393045 398521 404031
51732 404031 409413 414362 418131 419795 419185 417335 415870 416032 418295 422326 426958 430475 431549 430088 427111
51717 427111 423850 421067 419021 417718 417057 416822 416645 416055 414728 412833 411147 410723 412332 415983 420771
51702 420771 425212 427950 428414 426853 423951 420534 417560 415954 416233 418335 421854 426158 430232 432777 432897
51687 432897 430723 427138 422917 418309 413405 408608 404557 401669 399920 399058 398915 399475 400660 402090 403109
51672 403109 403140 402169 400923 400482 401633 404619 409492 416406 425276 435278 445024 453260 459146 461958 461130
51657 461130 456899 450589 443916 438241 434607 433973 436822 442652 450290 458567 466286 471745 473065 469283
51643 469283 460986 449896 438054 427081 417585 409135 401196 394103 388763 385511 383823 383209 383712 385298
51629 385298 387361 389257 391021 393120 395650 397996 399145 398260 395298 391209 387243 383901 380775 377428
51615 377428 374044 371127 368939 367358 365904 363842 360783 357307 354490 352579 350773 348570 346691 346254
51601 346254 347627 350585 354993 360717 367399 375019 384307 395815 408811 421599 432549 440230 443196
51588 443196 440846 434466 426484 418625 411446 405461 401621 400502 401927 405743 412239 421535 433201 446697
51574 446697 461466 476391 490169 502826 516103 531485 548212 563801 576203 585016 591267 596977
51562 596977 604728 616771 634330 658090 688930 727171 770814 815342 855922 889822 916718 937170
51550 937170 951281 958499 958114 949684 933254 909449 879481 844942 807463 768460 729158 690755
51538 690755 654423 621124 591582 566453 546302 531165 520099 511461 503850 496951 491484 488239
51526 488239 487071 486803 486110 484396 481700 478005 473033 466841 460233 454244 449259 444841 440365 435612 430726
51511 430726 425867 421099 416526 412287 408260 403898 398623 392461 386178 380726 376679 374171 373022 372676
51497 372676 372302 371395 370197 369175 368206 366706 364547 362334 360748 360113 360793 363209 366940 370354 371940
51482 371940 371919 371858 372687 373734 373892 373109 372314 372171 372405 372208 370965 368570 365351 361804 358336 355203 352719
51465 352719 351280 350948 351064 350693 349554 348266 347449 346928 346123 344971 343937 343173 342286 341126 340332 340760 342748
51448 342748 346307 351617 358865 367859 378379 390700 405008 420245 434214 445126 452671 457497 460358
51435 460358 462064 463584 465374 466757 466469 463781 458779 451915 443830 435462 427631 420360 413127 405969
51421 405969 399859 395710 393363 391875 390572 389382 388288 386929 384955 382512 380153 378318 377056 376219
51407 376219 375746 375718 376238 377332 378898 380680 382427 384251 386705 390203 394334 398036 400631 402489 404539
51392 404539 407374 411081 415738 421600 428764 437056 446446 457415 470747 487146 507203 531524 560590
51379 560590 594504 633119 676474 724789 777748 833707 889738 942527 989348 1028402 1058551
51368 1058551 1078965 1089024 1088432 1077373 1056554 1027140 990600 948520 902420 853684 803701 754058
51356 754058 706463 662263 622053 585870 553735 525808 502038 481975 465070 450925 439083
51345 439083 428830 419536 411040 403384 396315 389418 382701 376633 371544 367359 363992 361602 360262 359668
51331 359668 359475 359710 360621 362267 364491 367157 370128 373064 375503 377200 378329 379326 380527 381783 382373
51316 382373 381508 379141 376157 373596 371820 370567 369571 368713 367629 365701 362696 359189 356062 353758 352215
51301 352215 351405 351448 352081 352380 351444 349254 346569 343998 341588 339392 337888 337448 337694 337937 338171 339105 341178
51284 341178 344017 347119 350652 355277 361297 368209 374979 380579 384415 386428 386891 386158 384679 383088 381960
51269 381960 381441 381370 381771 382955 385134 388236 392062 396177 399571 401076 400511 398956 397469 395797 392914
51254 392914 388562 383676 379313 375691 372370 368941 365315 361679 358468 356274 355524 356062 357086 357579 357037
51239 357037 355781 354421 353120 351644 350109 349165 349199 349837 350563 351458 352791 354187 354886 354834 354950 356161 358505
51222 358505 361312 363940 366159 368089 369944 371702 372965 373274 372619 371581 370929 371131 372112 373368 374438
51207 374438 375359 376605 378449 380649 382862 385101 387498 389915 392096 393937 395224 395402 394196 392322 391019
51192 391019 390805 391173 391463 391584 391857 392565 393739 395014 395787 395882 395952 396672 397708 398155 397902 397726 397937 397896 397207
51173 397207 396465 396257 396149 395398 394126 393101 392801 393369 395048 397799 400769 402986 404509 406136 407972 409076
51157 409076 408616 406712 403941 400660 397145 393848 391076 388649 386177 383511 380733 377945 375260 372820
51143 372820 370641 368611 366725 365140 363890 362745 361537 360483 360027 360472 361771 363539 365223 366538 367789
51128 367789 369588 372126 375037 378043 381301 384780 387688 389138 389304 389420 390564 392855 395870 399266 402667
51113 402667 405460 407224 408186 408774 408890 408141 406828 406086 406747 408427 410058 411079 411764 412591 413658 414763
51097 414763 415661 416189 416289 416042 415585 414962 414177 413364 412796 412688 413030 413569 413961 414083 414258 414976 416225 417360
51079 417360 417876 418089 418714 419909 421214 422352 423614 425370 427670 430511 434001 438010 441983 445502 448876
51064 448876 452886 458102 464667 472652 482410 494522 509321 526245 543596 559328 572386 583242
51052 583242 593159 603304 614542 627346 641196 654365 664988 672459 677389 680235 680460 677103 669708
51039 669708 658597 644753 629885 616291 605997 599648 596169 593484 589622 583495 575142 565550 556088
51026 556088 547752 540667 534355 528501 523364 519405 516805 515594 516014 518258 521916 526233 531083 537157
51012 537157 544872 553558 562215 570764 580026 590614 602357 614749 627403 640014 652347 664451
51000 664451 676506 688200 698563 706690 712461 716324 718527 718863 717205 714027 710211 706360 702471 698369
50986 698369 694379 691421 690504 692347 697381 705704 716690 728928 740948 752096 762550 772707 782950
50973 782950 794013 807184 823870 845000 870838 901192 935741 974266 1016700 1062948 1112721
50962 1112721 1165580 1221074 1278766 1338111 1398314 1458227 1516375 1571293 1621968 1667858 1708536
50951 1708536 1743575 1772854 1796591 1814923 1827803 1835642 1839805 1842189 1844541 1848277 1854247 1861880 1868843
50938 1868843 1872411 1871418 1866476 1858496 1847709 1834142 1818198 1800337 1780618 1758832 1734641 1707388
50926 1707388 1676233 1640793 1601331 1558131 1511196 1460889 1408447 1355431 1302941 1251716 1202668
50915 1202668 1156796 1114665 1076344 1041729 1010585 982350 956345 932328 910675 891836 875577
50904 875577 860741 845930 830684 815920 802929 791948 782097 772673 763898 756252 749672 743905 739164
50891 739164 735885 734150 733785 734719 736690 738873 740469 741618 743159 745506 748321 751365 755108 760218 766752
50876 766752 774079 781548 789176 797797 808367 820941 834563 848415 862815 878602 895874 914034
50864 914034 933055 953833 977131 1002929 1031200 1062562 1097604 1136158 1178031 1224173 1276297
50853 1276297 1335395 1401325 1473908 1553700 1641426 1737223 1840826 1952003 2070293 2194609
50843 2194609 2323650 2456519 2592301 2728901 2862774 2989955 3107002 3210909 3298906 3369018
50833 3369018 3420604 3453914 3469459 3468450 3453584 3428522 3396417 3359611 3320938 3284377 3253795
50822 3253795 3231398 3217746 3212597 3215010 3222923 3233368 3242953 3247745 3243264 3225763 3193758 3147663
50810 3147663 3087903 3014133 2926476 2826723 2717711 2601991 2481542 2358467 2235427 2115505
50800 2115505 2001841 1897112 1802857 1719204 1645350 1580338 1523480 1474471 1433348 1400128 1374337
50789 1374337 1355066 1341516 1333133 1329070 1327907 1328260 1329348 1330685 1331585 1331388 1329891 1327048 1322492 1315949
50775 1315949 1308004 1299702 1291199 1281409 1269351 1255346 1240400 1224737 1207542 1188120 1166715 1143948
50763 1143948 1119978 1094757 1069076 1044835 1023937 1006988 993186 981331 970802 961716 954528 949592
50751 949592 946960 946438 947900 951602 958156 968133 981659 998382 1017885 1040249 1066218 1096612 1131525
50738 1131525 1170340 1212661 1258858 1309394 1363956 1421781 1482574 1546421 1612802 1680412 1748204
50727 1748204 1815994 1883773 1950976 2016816 2080841 2142568 2200836 2253870 2299739 2336367 2361506
50716 2361506 2373398 2371578 2356788 2330407 2294465 2252103 2207342 2164072 2125224 2092650 2067342
50705 2067342 2049692 2039804 2037556 2042189 2051954 2064429 2077151 2087792 2093961 2093222 2083339 2062464 2029539
50692 2029539 1985075 1931411 1871750 1808849 1744762 1681351 1620422 1563432 1511547 1465829 1426816
50681 1426816 1394058 1366714 1344622 1328296 1318089 1314199 1317372 1328535 1347399 1372283 1401736 1435438
50669 1435438 1472964 1512459 1551380 1588117 1622173 1653167 1680478 1703751 1723149 1739164 1752678
50658 1752678 1764980 1777161 1789474 1801655 1813659 1825558 1836921 1846901 1855110 1862125 1869261 1878168
50646 1878168 1890409 1906935 1927976 1953690 1984551 2020583 2060590 2102989 2147304 2193943 2242344
50635 2242344 2290258 2335326 2376719 2414814 2449940 2482213 2512469 2542701 2575352 2611800 2650512
50624 2650512 2685724 2708363 2709799 2686240 2640404 2579512 2511788 2444122 2381578 2327661 2284399
50613 2284399 2252282 2230586 2218181 2214162 2217733 2227602 2241693 2257402 2271928 2282359 2285821 2279887
50601 2279887 2262953 2234346 2194332 2144157 2085828 2021591 1953514 1883470 1813193 1744091 1677073
50590 1677073 1612744 1551689 1494416 1441069 1391365 1344838 1301163 1260364 1222814 1188975 1158973
50579 1158973 1132552 1109564 1090387 1075600 1065228 1058612 1055132 1054833 1058015 1064315 1072648 1082211 1093151
50566 1093151 1105868 1119915 1134225 1148486 1163666 1180825 1200011 1220929 1244239 1271274 1302355
50555 1302355 1336153 1371051 1406611 1443322 1481290 1519548 1556491 1590774 1622061 1651173 1679331
50544 1679331 1707136 1734610 1762316 1791797 1824468 1860600 1900071 1943686 1992818 2047827 2107753
50533 2107753 2171836 2240659 2315401 2396589 2484132 2578237 2679654 2788960 2905874 3029235
50523 3029235 3157412 3288712 3421445 3553535 3682021 3803168 3913244 4009185 4088631 4149634
50513 4149634 4190542 4209928 4206544 4179622 4129462 4057563 3966109 3857724 3735980 3605735 3472422
50502 3472422 3341148 3216669 3103678 3006174 2926474 2865460 2823878 2802750 2802373 2821637 2858646
50491 2858646 2911282 2976420 3048830 3121420 3186412 3236092 3263235 3262234 3230568 3169128 3081262
50480 3081262 2971849 2846867 2712599 2574344 2435858 2300056 2169769 2047477 1934699
50471 1934699 1832104 1740054 1658652 1587358 1524907 1469623 1419729 1373648 1330474 1290172 1253130
50460 1253130 1219574 1189658 1163902 1142987 1126991 1115143 1106556 1100946 1098452 1098978 1101946 1106598 1112326
50447 1112326 1118807 1126169 1135115 1146660 1161420 1179054 1198455 1218407 1237967 1256280 1272475 1286109
50435 1286109 1297592 1307770 1317014 1325006 1331425 1336514 1340806 1344667 1348346 1352135 1356175 1360362 1364872
50422 1364872 1370564 1378533 1389360 1403154 1420165 1440931 1466036 1496212 1532570 1576038 1626465 1682775
50410 1682775 1744123 1810381 1881282 1955618 2031541 2107217 2180883 2250813 2315790 2375360 2429180
50399 2429180 2476231 2514903 2543545 2560468 2563728 2551607 2523500 2480106 2422892 2353845 2275745
50388 2275745 2192131 2106543 2021841 1940301 1864110 1795553 1736670 1688787 1652383 1627378 1613546
50377 1613546 1610583 1617834 1634121 1657806 1686744 1718060 1748247 1773790 1791651 1799211 1794257 1775619
50365 1775619 1743826 1700854 1649240 1591591 1530667 1469275 1409771 1353649 1301565 1253520 1209097
50354 1209097 1167874 1129826 1095352 1065039 1039514 1019389 1005057 996482 993094 993458 994770 993178
50342 993178 985514 971054 951424 928935 905454 882679 862486 846301 834327 825710 819363 814513
50330 814513 810845 808424 807408 807714 809084 811487 815114 819881 825365 831391 838278 846145 854348 861986
50316 861986 868677 874461 879254 882927 885785 888445 891259 894219 897293 900480 903624 906646 909842 913434
50302 913434 916891 919359 920877 922531 925181 928671 932557 936911 941834 946726 950753 953791 956258 958385
50288 958385 960382 963136 967660 973524 978618 980961 980315 977722 974138 970141 966512 964241 963913 965562 969041
50273 969041 974080 980003 985944 991492 996800 1001960 1006618 1010354 1013115 1015237 1017355 1020394 1025250 1032229
50259 1032229 1041080 1051763 1064831 1080750 1099122 1118962 1139578 1160859 1182729 1204611 1225471
50248 1225471 1244309 1260772 1275495 1289765 1304677 1320607 1337414 1354669 1371330 1385528 1395128
50237 1395128 1398494 1394595 1382892 1363873 1339601 1313017 1286398 1260874 1237382 1217335 1201913 1191036
50225 1191036 1183329 1176618 1168070 1154483 1133541 1105243 1071815 1036103 1000226 965575 933333 904363
50213 904363 878735 855885 835353 817093 800992 786536 773302 761492 751481 742895 734728 726548
50201 726548 719064 713105 708461 704249 700096 696354 693247 690510 687924 685587 683401 680826 677491 673733
50187 673733 670229 667327 664966 662908 660815 658420 655939 654055 653171 652923 652716 652481 652568 653162 654235 655832
50171 655832 657910 660047 661907 663972 667197 671756 676667 680939 684635 688424 692447 696196 699437 702789
50157 702789 707241 713328 720968 729914 740163 751880 765021 779080 793161 806316 817999 828445
50145 828445 838682 850000 863249 878739 896889 918799 945931 979270 1018950 1064495 1114944
50134 1114944 1168551 1222788 1275148 1324186 1369852 1413075 1455225 1497666 1541165 1585180 1627598
50123 1627598 1665278 1694995 1714096 1720722 1713964 1694105 1662652 1621870 1574108 1521394 1465471 1407989
50111 1407989 1350600 1294973 1242683 1194923 1152200 1114383 1081077 1051819 1025814 1001738 978132
50100 978132 954181 930061 906566 884497 864354 846358 830569 816972 805528 796189 788853 783307
50088 783307 779252 776476 775052 775245 777015 779594 781856 783315 784603 786753 790106 794205 798622 803441
50074 803441 808842 814608 820257 825444 830027 833977 837406 840498 843149 844901 845483 845197 844449 843148 841043
50059 841043 838466 836095 833933 831231 827637 823764 820163 816328 811423 805721 800671 797586 796799 798011
50045 798011 800846 804988 810263 816791 824682 833541 842689 852014 862221 874079 887774 903065 919548
50032 919548 936544 953152 968824 983639 997835 1011338 1023941 1035578 1046231 1056072 1065974 1077345
50020 1077345 1091016 1106686 1123858 1142729 1163515 1185385 1206916 1227362 1246645 1264333 1279621
50009 1279621 1292468 1303902 1314944 1325932 1337067 1348736 1360607 1370839 1376774 1376309 1368471 1353069
49997 1353069 1330286 1300557 1264702 1224277 1181710 1139626 1099810 1062925 1029057 998020 969107
49986 969107 941242 913810 886999 861170 836405 812961 791600 772892 756497 741558 727679
49975 727679 715114 704157 694685 686243 678403 671130 664820 659773 655684 652050 649012 647131 646265 645455
49961 645455 644310 643723 644684 647127 650664 655733 662975 671976 681766 692370 704570 718001 730625 740644
49947 740644 748111 754092 758951 762205 763651 763725 762613 759592 753677 744841 734333 723581 712827 701034
49933 701034 687206 671586 655439 640034 626122 614067 603901 595206 587432 580519 575015 571510
49921 571510 570127 570550 572360 575257 579019 583238 587207 590363 592883 595489 598518 601697 605097 609724
49907 609724 616596 625605 635858 646762 658137 669660 681088 692802 705200 717525 728150 736175
49895 736175 742032 746385 749230 750218 749047 745207 738101 727914 715789 702783 689208 675330 661944
49882 661944 649654 638099 626549 614993 604110 594454 586126 578956 572575 566556 560971 556516 553670
49869 553670 551946 550490 549191 548718 549567 551568 554326 557799 562390 568744 577346 588126 600567 614309
49855 614309 629341 645315 661050 675170 687055 696806 704576 710445 714757 717902 719692 719389 716390
49842 716390 710558 702024 691246 679303 667534 656547 646002 635616 625965 617960 611816 606972 602929
49829 602929 599692 597393 595937 595346 596225 599336 604611 610931 617286 623986 632343 643127 655691 668639
49815 668639 680856 691722 700879 708407 715067 721785 728786 735411 740734 744045 744849 742831 738008 730816
49801 730816 722022 712641 703719 695814 688615 681387 673809 666149 658627 650988 642910 634590 626746 620144
49787 620144 615211 611911 609776 608194 606855 605854 605264 604765 603946 602952 602495 603132 604769 607173 610759 616387
49771 616387 624254 633362 642347 650559 657968 664298 668887 671460 672575 673136 673743 674587 675470 675672 674159
49756 674159 670283 664112 655916 645778 634040 621737 610024 599361 589673 581135 574158 568671 564032
49743 564032 559849 556389 553955 552271 550818 549520 548721 548604 548875 549063 548990 548956 549537 551157 553812 557219
49727 557219 561234 566101 572283 580094 589464 599947 610927 621873 632463 642524 651911 660469 667964
49714 667964 674037 678334 680743 681371 680197 676946 671475 664175 655771 646820 637629 628631 620575 614159
49700 614159 609558 606367 604068 602552 602107 602849 604315 605907 607678 610308 614259 619346 625221 631809 638967
49685 638967 646176 652994 659526 666073 672675 679469 687150 696466 707458 719870 734003 750243 767612
49672 767612 783593 795782 803234 806107 804814 800170 793822 787793 783450 781065 780158 779985 779920 779592 778545
49657 778545 775720 769670 759618 746156 730740 714793 699394 685300 672749 661492 651426 643035
49645 643035 636867 632781 630157 628669 628384 629241 630862 632890 635027 636743 637416 636875 635431 633271 630178
49630 630178 625954 620800 615105 609221 603618 598859 595127 591985 588891 585756 582810 580182 577906 576164
49616 576164 575120 574586 574178 573818 573808 574432 575759 577770 580354 583091 585404 587071 588339 589438 590330 591125
49600 591125 592344 594307 596434 597732 598023 598236 599317 601174 602936 603986 604428 604680 605006 605515 606328 607541
49584 607541 608992 610245 610915 611060 611171 611640 612298 612631 612445 612090 611984 612311 613381 615934 620577 626960 634026
49567 634026 641202 649015 658287 669045 680538 692084 703470 714535 724710 733152 739150 742301 742548
49554 742548 740247 736109 730878 725050 719018 713375 708815 705668 703698 702466 701728 701352 700959 699920 697836
49539 697836 694969 692099 689907 688514 687658 687292 687806 689547 692347 695916 700677 707759 717984 731237
49525 731237 747010 765108 785336 806776 827929 847430 864115 876601 883643 885271 883116 879364
49513 879364 875645 873009 872323 874176 878497 884467 890621 895032 895977 892861 886309 877176 865798 852496
49499 852496 838273 824446 811777 800331 789999 780716 772361 764948 758800 754136 750582 747521 744795
49486 744795 742616 740995 739884 739815 741669 745485 749982 753589 755633 756418 756554 756576 756871 757599 758715 760256
49470 760256 762485 765577 769253 772938 776201 778928 781089 782561 783293 783586 783960 784571 784880 784229 782687 780865
49454 780865 778784 775529 770525 764657 759445 755372 751680 747665 743430 739371 735781 733122 731929 732069
49440 732069 732747 733617 735299 738419 742755 747904 754244 762478 772442 783029 793247 802846 812082 821338
49426 821338 830919 840739 850340 859789 870370 883500 898504 911957 919771 919909 913176 902002 889015
49413 889015 876401 865700 857642 852216 849061 847859 848522 851278 856608 864837 875585 887780 900481
49400 900481 913627 927752 942964 958558 973739 988438 1003100 1017829 1032066 1045124 1056661
49389 1056661 1066489 1074164 1079094 1081058 1080416 1077723 1073203 1066716 1058203 1047973 1036478 1024108 1011509
49376 1011509 999901 990546 983744 978813 975164 972971 972480 973234 974535 976311 978897 982133 985319 987949
49362 987949 989880 990849 990520 989079 987068 984438 980400 974521 967437 960183 953357 947238 942187 938425 935811
49347 935811 934306 934289 935909 938377 940468 941588 941960 941923 941482 940497 938847 936391 933103 929245 925207 921217
49331 921217 917523 914822 914184 916419 921527 928639 936395 943614 949921 955740 961689 968247 976220 987036
49317 987036 1001853 1020179 1039634 1057113 1070059 1076985 1077578 1072737 1064194 1053594 1041801 1029168
49305 1029168 1016317 1004367 994229 985747 977821 969505 960846 952511 944826 937573 930648 924385 919059
49292 919059 914523 910621 907567 905523 904008 902083 898989 894411 888443 881683 875188 869850 865885 863189
49278 863189 861959 862445 864272 866671 869527 873698 880004 888144 896782 904522 910745 915735 920105 923974
49264 923974 926763 927944 927796 927029 925852 924176 922923 924348 930341 940648 953403 967295 982463 999027
49250 999027 1015269 1027937 1034345 1033902 1027684 1017025 1002878 986269 968800 952348 938262 926828
49238 926828 917372 908920 900994 893998 888748 885591 884081 883575 883988 885793 889429 894814 901361 908389 915615
49223 915615 923340 931980 941328 950448 958455 965259 971404 977328 982951 987811 991414 993641 995009 996471
49209 996471 998782 1002259 1007230 1014339 1023961 1035579 1048263 1061743 1076502 1092777 1109938 1127076
49197 1127076 1143822 1160338 1176759 1192915 1208450 1222949 1236022 1247522 1257793 1267583 1277528 1287529
49185 1287529 1296682 1304038 1309615 1314594 1320384 1327645 1336365 1346659 1359107 1374403 1393195 1416508 1445967
49172 1445967 1483014 1527547 1577082 1627009 1671710 1706015 1726644 1733303 1728939 1718649 1707482 1698426
49160 1698426 1692017 1687508 1684162 1681493 1678872 1675517 1671039 1665873 1661173 1658281 1658063 1660472 1664733 1670092
49146 1670092 1676400 1684008 1693227 1703937 1715589 1727523 1739456 1751655 1764452 1777654 1790829 1804175
49134 1804175 1818525 1834235 1850588 1866691 1882441 1898176 1913798 1928915 1943499 1957782 1971766
49123 1971766 1985537 1999808 2015333 2031798 2048125 2063976 2080216 2097807 2116980 2137830 2161071
49112 2161071 2187849 2219472 2257861 2305880 2366316 2439753 2522709 2607624 2686251 2755651 2821726
49101 2821726 2894693 2978122 3061472 3124492 3150603 3137653 3097618 3046944 2996004 2945044 2888059
49090 2888059 2820216 2742541 2660877 2581794 2509830 2447396 2395389 2353222 2319189 2291673 2269939
49079 2269939 2253534 2241367 2231872 2223751 2216079 2207902 2198504 2188199 2178314 2169977 2163140 2156984 2150988
49066 2150988 2145278 2140111 2135462 2131114 2126813 2122252 2117203 2111833 2106664 2102089 2098137 2094866 2092696 2092095
49052 2092095 2093054 2095160 2098056 2101546 2105401 2109516 2114421 2121358 2131553 2145237 2161149 2176803 2189456
49039 2189456 2197353 2200359 2199479 2195936 2190873 2185663 2181830 2180295 2180889 2182843 2185637 2189183 2193360 2197720
49025 2197720 2201739 2205179 2208035 2210175 2211321 2211522 2211465 2211990 2213289 2214956 2216874 2219653 2223985 2229972 2237462
49010 2237462 2246649 2257720 2270105 2282745 2295207 2308029 2321865 2336688 2351963 2367143 2381712
48999 2381712 2395099 2406857 2416839 2425057 2431556 2436497 2440170 2442750 2444179 2444363 2443336 2441174 2437967 2434026
48985 2434026 2429967 2426419 2423579 2421033 2418007 2413964 2409030 2403625 2397658 2390496 2381986 2373036 2364564 2356243
48971 2356243 2347030 2336779 2326525 2317120 2308459 2300327 2293155 2287427 2282887 2278955 2275595 2273405 2273098 2275165
48957 2275165 2279675 2286055 2293465 2301776 2311786 2324035 2337790 2351775 2365637 2380028 2395378 2411302
48945 2411302 2427342 2443720 2461045 2479637 2499501 2520814 2544066 2569588 2597174 2626476 2657770
48934 2657770 2691997 2729743 2770434 2812947 2856841 2902427 2949762 2998382 3048268 3100264 3154959
48923 3154959 3211698 3269417 3328072 3388514 3451007 3514521 3577523 3638993 3698622 3756582 3813296
48912 3813296 3869141 3924079 3977640 4029283 4078675 4125727 4170603 4213677 4255305 4295555 4334294
48901 4334294 4371527 4407527 4442668 4477153 4510824 4543013 4572681 4598840 4620893 4638617 4651994
48890 4651994 4661294 4667146 4670347 4671499 4670848 4668356 4663814 4656910 4647273 4634528 4618453 4599241 4577435
48877 4577435 4553379 4526785 4497060 4463838 4426833 4385443 4339222 4288780 4235565 4180546 4123746
48866 4123746 4065322 4006375 3948235 3891435 3835911 3781787 3729465 3679269 3631452 3586178 3543078
48855 3543078 3501306 3460611 3421904 3386144 3353087 3322010 3293358 3268695 3248910 3233322 3220781
48844 3220781 3210931 3204045 3200089 3198418 3198306 3199623 3203044 3209501 3219190 3231249 3244595 3258911 3274525
48831 3274525 3291673 3310261 3330084 3350686 3371274 3391380 3411458 3432195 3453374 3474172 3494568
48820 3494568 3515538 3537645 3560227 3582347 3603931 3625469 3647099 3668405 3688895 3708360 3727030
48809 3727030 3745595 3764761 3784641 3804882 3825442 3846814 3869371 3893054 3917907 3944335 3972441
48798 3972441 4001623 4031187 4060767 4089714 4116690 4140650 4161963 4181880 4201124 4219703 4237786
48787 4237786 4255840 4273732 4290533 4305436 4318179 4328201 4334026 4334181 4328468 4317849 4303235 4284915
48775 4284915 4263086 4238338 4211330 4182246 4150829 4116764 4079879 4040132 3997687 3953016 3906745
48764 3906745 3859313 3810847 3761389 3711171 3660714 3610729 3561923 3514733 3469189 3425109 3382452
48753 3382452 3341398 3302101 3264454 3228091 3192581 3157695 3123729 3091506 3061787 3034667 3009833
48742 3009833 2987496 2968617 2953945 2943016 2934393 2926697 2919230 2911891 2904908 2898520 2892613 2886723 2880691
48729 2880691 2875172 2871197 2869325 2869487 2871431 2874836 2879102 2883588 2888212 2893369 2899086 2904647 2909245 2912630
48715 2912630 2914941 2916244 2916625 2916521 2916552 2917028 2917887 2919127 2921130 2924429 2929180 2934889 2940665 2945847 2950396
48700 2950396 2954675 2958917 2963042 2966995 2971034 2975540 2980616 2986012 2991444 2996830 3002126 3006963 3010716 3013133
48686 3013133 3014841 3016918 3019955 3023786 3028231 3033654 3040431 3048100 3055502 3061724 3066503 3069769 3071256 3070780
48672 3070780 3068586 3065153 3060743 3055335 3048939 3041785 3034073 3025533 3015355 3002740 2987574 2970376 2951486
$$ [...]
##END NTUPLES=NMR SPECTRUM
##END=
