
##TITLE=UV1273_M13_1250-1169_30_7414509_qytKd1g0xr
##JCAMPDX= 6.0         $$ Bruker NMR JCAMP-DX V2.0
##DATA TYPE= NMR SPECTRUM
##DATA CLASS= NTUPLES
##ORIGIN= BRUKER
##OWNER= Administrator
$$ 1.72 TOPSPIN		Version 2.1
$$ 2013-01-26 00:55:22.635 -0500  Administrator@X
$$ Compression mode = diff/dup
##.OBSERVE FREQUENCY= 400.02188249412
##.OBSERVE NUCLEUS= ^1H
##.ACQUISITION MODE= SIMULTANEOUS (DQD)
##.ACQUISITION SCHEME= undefined
##.AVERAGES= 8
##.DIGITISER RES= 22
##SPECTROMETER/DATA SYSTEM= spect
##.PULSE SEQUENCE= zg30
##.SOLVENT NAME= COFFEE_meoh
##.SHIFT REFERENCE= INTERNAL, COFFEE_meoh, 1, 14.98509
##AUDIT TRAIL= $$ (NUMBER, WHEN, WHO, WHERE, PROCESS, VERSION, WHAT)
$$ ##TITLE= Audit trail, TOPSPIN		Version 2.1
$$ ##JCAMPDX= 5.01
$$ ##ORIGIN= Bruker BioSpin GmbH
$$ ##OWNER= Administrator
$$ $$ E:\/data/COFFEE/nmr/UV1273_M13_1250-1169_30_7414509_qytKd1g0xr/10/pdata/1/auditp.txt
$$ ##AUDIT TRAIL=  $$ (NUMBER, WHEN, WHO, WHERE, PROCESS, VERSION, WHAT)
(   1,<2013-01-26 00:55:14.495 -0500>,<Administrator>,<X>,<go>,<TOPSPIN 2.1>,
      <created by zg
	started at 2013-01-26 00:54:08.557 -0500,
	POWCHK enabled, PULCHK disabled,
       configuration hash MD5:
       86 BA 57 50 F2 9D 5C 9B 26 00 A9 28 5F 66 2E 89
       data hash MD5: 64K
       4A 96 9A F6 8F 05 3B 39 4F 0B 5C 60 A7 E6 44 A8>)
(   2,<2013-01-26 00:55:17.542 -0500>,<Administrator>,<X>,<proc1d>,<TOPSPIN 2.1>,
      <Start of raw data processing
       efp LB = 0 FT_mod = 6 PKNL = 1 PHC0 = 0 PHC1 = 0 SI = 32K 
       data hash MD5: 32K
       3A F2 A5 37 DE 5A 10 D6 87 4C A0 55 41 50 47 38>)
(   3,<2013-01-26 00:55:17.995 -0500>,<Administrator>,<X>,<proc1d>,<TOPSPIN 2.1>,
      <pk PHC0 = 96.93237 PHC1 = 0 
       data hash MD5: 32K
       AB 2D 95 3A B2 DF E8 2B 5F C7 61 E3 60 00 5E 50>)
(   4,<2013-01-26 00:55:18.229 -0500>,<Administrator>,<X>,<proc1d>,<TOPSPIN 2.1>,
      <abs ABSG = 1 
       data hash MD5: 32K
       0E CB 16 DD C5 1B 19 B7 94 56 D6 1B 50 53 80 39>)
(   5,<2013-01-26 00:55:18.370 -0500>,<Administrator>,<X>,<proc1d>,<TOPSPIN 2.1>,
      <abs ABSG = 2 
       data hash MD5: 32K
       CB C4 16 3D BB 18 B6 8A 33 82 25 E5 52 EE E1 B8>)
(   6,<2013-01-26 00:55:18.510 -0500>,<Administrator>,<X>,<proc1d>,<TOPSPIN 2.1>,
      <abs ABSG = 3 
       data hash MD5: 32K
       DF 90 67 84 FE C2 54 6B 9C 8B F4 9B C1 7A 1C 1C>)
(   7,<2013-01-26 00:55:18.651 -0500>,<Administrator>,<X>,<proc1d>,<TOPSPIN 2.1>,
      <abs ABSG = 4 
       data hash MD5: 32K
       2D 56 35 CB 4D 5E A8 7C BA 56 85 91 FF A1 28 AF>)
(   8,<2013-01-26 00:55:18.807 -0500>,<Administrator>,<X>,<proc1d>,<TOPSPIN 2.1>,
      <abs ABSG = 5 
       data hash MD5: 32K
       C3 D8 08 9D C6 90 FD 88 BD 66 7E E6 FE AD 2F 4E>)
$$ ##END=
$$ 
$$ $$ hash MD5
$$ $$ 0F 9C CD 05 76 02 52 AE E2 EE FE 7D 99 19 03 7C
##$RELAX= 
##$RELAX= 
##$RELAX= 
##$RELAX= 
##$RELAX= 
##$RELAX= 
##$RELAX= 
$$ Bruker specific parameters
$$ --------------------------
##$DU= <E:\>
##$EXPNO= 10
$$ [...]
150 150 150 150 150 150 150 150
##$TP07= 0
##$TPNAME0= <>
##$TPNAME1= <>
##$TPNAME2= <>
##$TPNAME3= <>
##$TPNAME4= <>
##$TPNAME5= <>
##$TPNAME6= <>
##$TPNAME7= <>
##$TPOAL= (0..7)
0.5 0.5 0.5 0.5 0.5 0.5 0.5 0.5
##$TPOFFS= (0..7)
0 0 0 0 0 0 0 0
##$TUNHIN= 0
##$TUNHOUT= 0
##$TUNXOUT= 0
##$USERA1= <user>
##$USERA2= <user>
##$USERA3= <user>
##$USERA4= <user>
##$USERA5= <user>
##$V9= 5
##$VALIST= <valist>
##$VCLIST= <CCCCCCCCCCCCCCC>
##$VD= 0
##$VDLIST= <DDDDDDDDDDDDDDD>
##$VPLIST= <PPPPPPPPPPPPPPP>
##$VTLIST= <TTTTTTTTTTTTTTT>
##$WBST= 2048
##$WBSW= 25
##$XGAIN= (0..3)
0 0 0 0
##$XL= 0
##$YL= 0
##$YMAX_a= 671469
##$YMIN_a= -570256
##$ZGOPTNS= <>
##$ZL1= 120
##$ZL2= 120
##$ZL3= 120
##$ZL4= 120
##$ABSF1= 14.98509
##$ABSF2= -5.573092
##$ABSG= 5
##$ABSL= 3
##$ALPHA= 0
##$AQORDER= 0
##$ASSFAC= 0
##$ASSFACI= 0
##$ASSFACX= 0
##$ASSWID= 0
##$AUNMP= <proc_prof1d_extract_pilot.lims>
##$AXLEFT= 0
##$AXNAME= <>
##$AXNUC= <1H>
##$AXRIGHT= 0
##$AXTYPE= 0
##$AXUNIT= <>
##$AZFE= 0.1
##$AZFW= 0.1
##$BCFW= 0
##$BC_mod= 0
##$BYTORDP= 0
##$COROFFS= 0
##$CY= 15
##$DATMOD= 1
##$DC= 0
##$DFILT= <>
##$DTYPP= 0
##$F1P= 0
##$F2P= 0
##$FCOR= 0.5
##$FTSIZE= 32768
##$FT_mod= 6
##$GAMMA= 0
##$GB= 0
##$INTBC= 1
##$INTSCL= 1
##$ISEN= 128
##$LB= 0
##$LEV0= 0
##$LPBIN= 0
##$MAXI= 10000
##$MC2= 0
##$MEAN= 0
##$ME_mod= 0
##$MI= 0
##$NCOEF= 0
##$NC_proc= -8
##$NLEV= 6
##$NOISF1= 0
##$NOISF2= 0
##$NSP= 0
##$NTH_PI= 0
##$NZP= 0
##$OFFSET= 14.98509
##$PC= 1
##$PHC0= 96.93237
##$PHC1= 0
##$PH_mod= 1
##$PKNL= yes
##$PPARMOD= 0
##$PPDIAG= 0
##$PPIPTYP= 0
##$PPMPNUM= 2147483647
##$PPRESOL= 1
##$PSCAL= 4
##$PSIGN= 0
##$PYNMP= <proc.py>
##$REVERSE= no
##$SF= 400.02
##$SI= 32768
##$SIGF1= 0
##$SIGF2= 0
##$SINO= 400
##$SIOLD= 32768
##$SPECTYP= <>
##$SREGLST= <1H.CDCl3>
##$SSB= 0
##$STSI= 32768
##$STSR= 0
##$SW_p= 8223.68421052631
##$SYMM= 0
##$S_DEV= 0
##$TDeff= 65536
##$TDoff= 0
##$TI= <>
##$TILT= no
##$TM1= 0
##$TM2= 0
##$TOPLEV= 0
##$USERP1= <user>
##$USERP2= <user>
##$USERP3= <user>
##$USERP4= <user>
##$USERP5= <user>
##$WDW= 1
##$XDIM= 32768
##$YMAX_p= 471100996
##$YMIN_p= -671463
##$CURPLOT= <Network HP LaserJet P1505>
##$CURPRIN= <$Network HP LaserJet P1505>
##$DFORMAT= <normdp>
##$LAYOUT= <+/1D_H.xwp>
##$LFORMAT= <normlp>
##$PFORMAT= <normpl>
##$SURQMSG= 1
$$ End of Bruker specific parameters
$$ ---------------------------------
##NTUPLES= NMR SPECTRUM
##VAR_NAME=  FREQUENCY,     SPECTRUM/REAL,   SPECTRUM/IMAG
##SYMBOL=    X,             R,               I
##VAR_TYPE=  INDEPENDENT,   DEPENDENT,       DEPENDENT
##VAR_FORM=  AFFN,          ASDF,            ASDF
##VAR_DIM=   32768,         32768,           32768
##UNITS=     HZ,            ARBITRARY UNITS, ARBITRARY UNITS
##FACTOR=    0.250966925370066, 1,           1
##FIRST=     8223.43324360094, -103041,      -47898
##LAST=      0,             -89214,          -29268
##MIN=       0,             -671463,         0
##MAX=       8223.43324360094, 471100996,    0
$$ Real data points
##PAGE= N=1
##DATA TABLE= (X++(R..R)), XYDATA
$$ [...]
19540a7868j58051A27251C1122L3551e7954A31544e0991A95035a27440K7590j98189
19529b98039E118a04544A5748J14375K32831d4775n0609j65756C53b39234A14989
19517g9585p4055c6986O300G3671k8814F468M1221a34994D9615K31990g2710J6520
19505e6190j4045k5000C58351H337b93948a1410j52058j33824E3489a50254g2718
19493A6013K70470J8934I8572a18525B61401a21545A46276e6784k52253B52318
19482i0523k1288l4202M9156k45198Q8463a24270O0752q8121b8453j68844m1705
19471b39002A54690h0066J5984r1586N25B55632a15374j08353N7039A20245c5054
19459H1304g322o8171E829a63010G0262J90845F4448A1431M5817a19494l7317
$$ plain form
19540 -17868 -175919 127251 31122 64673 -57954 131544 -50991 195035 -127440 -99850 -298039
19529 -298039 5118 -104544 15748 130123 362954 -44775 -95384 -261140 353 -239234 114989
19517 -79585 -153640 -36986 -30686 73671 44857 6468 47689 -134994 49615 281605 -72710 -56190
19505 -56190 -70235 -95235 358351 8337 -293948 -11410 -163468 -297292 53489 -150254 -72718
19493 16013 286483 305417 98572 -118525 261401 -121545 146276 -56784 -309037 252318
19482 -90523 -111811 -146013 -96857 -342055 -253592 -124270 -63518 -151639 -28453 -197297 -239002
19471 -239002 154690 -80066 -64082 -155668 -155143 255632 -115374 -223727 -166688 120245 -35054
19459 81304 -7322 -75493 5829 -163010 70262 261107 64448 11431 57248 -119494 -156811
19448a56811j10665H5622b93735h5123b2278k09040k8738D7978a03104K8536j9303
19437i3871E34859a11188K0031J2237k860r8498A2561O1501f9521H8830J03336
19426A92166d3725l24479i0040j98564J20519l4912G878N1648R472i9193j67574
19415b66767A68425a38688d2035j6213J7448n8243p1322B89682j11352N9246b04810
19403D1654a64417A63576n037a60940b2858I037h1965M575l78945J92524C08940
19391b88842a18193j00443j00829a4637B09519I884L4769g6109A54143d4935q882
19380e3817D4669b7479j5912C1131N4649L705a25831a0148q9765K9989F2087a74755
19367B7050L1126c77487b01A1728b8280E0843j4320C375g9085Q392m1894A42252
$$ plain form
19448 -156811 -267476 85622 -293735 -85123 -22278 -231318 -260056 47978 -103104 -74568 -93871
19437 -93871 534859 -111188 -91157 -78920 -81780 -180278 12561 74062 -69521 88830 192166
19426 192166 -43725 -368204 -90040 -288604 -168085 -202997 7878 59526 68998 -99193 -266767
19415 -266767 168425 -138688 -42035 -58248 -40800 -99043 -170365 289682 178330 237576 -204810
19403 41654 -164417 163576 158539 -160940 -22858 9037 -81965 -77390 -456335 -263811 308940
19391 -288842 -118193 -218636 -319465 -14637 209519 9884 44653 -76109 154143 -44935 -53817
19380 -53817 44669 -27479 -43391 31131 85780 89485 -125831 -10148 -99913 -69924 62087 -174755
19367 27050 58176 -377487 -201 11728 -28280 50843 36523 3375 -79085 -70693 -112587 142252
19354d55006C1355a18528A18123a84448j00564B89959b63415e285n7108l33937
19344c96330e3202j65935C13275G2050h4566A8495R1676c44706D7724a47625r472
19333a57097k30892A53252a32483o4582D85048G5476a62914l394A89644a43035
19322a17719B6242J14623a98025i8454b6998j09115C13318b35867A06894b06673
19311b99822o9325b1243k80708J11287E9325R508a28220B04194a27491r316G1441
19299a55811g760p5356b6655j75526A41128b23010K0650P9605k08233a41742B79809
19287c050k76783M848e6479j8892G8199a60912l9003g0620p9622O2897j5431J2986
19275h9790j70249a4206k40947a15069i303o7469a1776j0891k74098r276a32013
$$ plain form
19354 -455006 31355 -118528 118123 -184448 -285012 289959 -263415 -5285 -62393 -396330
19344 -396330 -53202 -219137 313275 72050 -84566 18495 110171 -344706 47724 -147625 -157097
19333 -157097 -387989 153252 -132483 -197065 485048 75476 -162914 -166308 189644 -143035
19322 -117719 26242 140865 -198025 -98454 -26998 -136113 313318 -235867 106894 -206673
19311 -299822 -369147 -21243 -301951 -190664 59325 68833 -128220 204194 -127491 -136807 71441
19299 -155811 -7760 -83116 -26655 -202181 141128 -223010 -202360 -122755 -330988 -141742 279809
19287 -3050 -279833 -274985 -56479 -75371 78199 -160912 -199915 -70620 -150242 -87345 -102776 -89790
19275 -89790 -260039 -14206 -255153 -115069 -9303 -76772 -11776 -22667 -296765 -306041 -132013
19263g9053r9890b0666q4673j45793d4098F7619k5739e3086k32788A86107b63664
19251h0933E61580a6181q687A91907a19686G4743b75035o7292A39583i3451l327
19240i6778j28441b8131j45879r5008d5552A96446B7421a99678D2690a26777c9091
19228A9572J54701e1546k48199B58390a97030c3072B3124b90756J11912h9261
19217A46322K32409i0306j2763A23233B4186J9134j078a42345f970j10846A0521
19205C5326b11810P4246j0380D39593f2015F3084J30686f8123J0061p8519k81415
19194d17996g1935G5747b68112M9683L4090h6117C00913d36238J82431K9795a04739
19182B6811J4741L07940h4430j37010O7022d5018A03061f5013B37325a68466O2742
$$ plain form
19263 -79053 -178943 -20666 -105339 -251132 -44098 67619 41880 -53086 -285874 186107 -263664
19251 -80933 561580 -16181 -24868 191907 -119686 74743 -275035 -342327 139583 -93451 -96778
19240 -96778 -225219 -28131 -174010 -269018 -45552 196446 27421 -199678 42690 -126777 -39091
19228 19572 174273 -51546 -299745 258390 -197030 -33072 23124 -290756 -178844 -89261
19217 146322 378731 -90306 -103069 123233 24186 43320 42242 -142345 -6970 -117816 10521
19205 35326 -211810 -137564 -147944 439593 -62015 63084 193770 -68123 -58062 -136581 -417996
19194 -417996 -71935 75747 -268112 -218429 -184339 -86117 300913 -436238 -253807 -224012 -104739
19182 26811 41552 349492 -84430 -221440 -154418 -45018 103061 -65013 237325 -168466 -105724
19171a05724k09264f0771k29420q4007J45051J00389B08546d514j91105g0596
19160c8261o5879C6568c42815h3751b8229j61859O0747J5533K394E6556a74294
19148c10192n5594A41319f5814I6880m1842K6295j6223e5212I8457a57849A15601
19136E0975J96485b04627g065n4819A52569c14272H5314a81903e6774j45753A4689
19124b45591J04238n5808e5497a8313A3381b75288d494j44907j52318I990J4444
19113B4434b32334f2796A3899a03555k78591J62750g1742j81625A44121f7279
19102A57392h7457j15613A47696J12654A13577f7A98776d17655A75868a6663I4248
19090d025j42513E118a87854k1214B0705a33276b1528l99897F4221h2225B15447
$$ plain form
19171 -105724 -314988 -60771 -290191 -374198 -229147 -128758 208546 -4514 -195619 -70596
19160 -38261 -104140 36568 -342815 -83751 -28229 -190088 -129341 -113808 -111414 56556 -174294
19148 -310192 -365786 141319 -65814 96880 55038 81333 65110 -55212 98457 -157849 115601
19136 50975 247460 -204627 -7065 -61884 152569 -314272 85314 -181903 -56774 -202527 14689
19124 -245591 -141353 -197161 -55497 -18313 13381 -275288 -4494 -149401 -301719 9990 24434
19113 24434 -232334 -62796 13899 -103555 -382146 -219396 -71742 -253367 144121 -67279
19102 157392 -87457 -203070 147696 260350 113577 -67 198776 -417655 175868 -16663 94248
19090 -4025 -146538 5118 -187854 -209068 20705 -133276 -21528 -421425 64221 -82225 215447
19078E7793c4575p5233n6897N888A33583Q738R7365g5312d080m1985B37370r330
19066B28040a69020A0950b11k43804H8261h7648j1013A97273h3587J8476F5172
19054e2266r975j6765G8234K27020j18537C7379f918q1560B2323h1238j47996
19043b29234r1513O5259g1513A6740a06934E2661R2150B8413e4886l616C64061
19031c1367l76032a39909D3014J05880f0582E8183K35056f1831a6991I7999J67217
19020B65216c58567C6184N0137B5588a82235j70860J13439A34946b20821I0316
19009B02003e7230k92173c5053j09050I0346a3564G3721a30058B19831I8635L6617
18998A35252D7305g6086e733A52757A2053K06337b23472N0380n8351a10326b2068
$$ plain form
19078 57793 -34575 -109808 -166705 -160817 133583 142321 239686 -75312 -4080 -46065 237370 228040
19066 228040 -169020 10950 -211 -244015 88261 -87648 -98661 197273 -83587 -65111 65172
19054 -52266 -62241 -79006 78234 305254 186717 37379 -6918 -88478 22323 -81238 -229234
19043 -229234 -320747 -255488 -71513 16740 -106934 52661 144811 28413 -54886 -58502 364061
19031 -31367 -407399 -139909 43014 148894 -60582 58183 293239 -61831 -16991 97999 265216
19020 265216 -358567 36184 86321 25588 -182235 -353095 -239656 134946 -220821 90316
19009 202003 -57230 -349403 -35053 -144103 90346 -13564 73721 -130058 219831 98635 135252
18998 135252 47305 -76086 -5733 152757 12053 218390 -223472 -173092 -231443 -110326 -22068
18986a04425M7217E7723J18710b64864A54319a48715m0058M6545j91980B22849
18975a80487m3684P2606f792q1385k76875C26580b77749B1925K58922G1639Q3809
18964A55448a83561B24035a51963d1320l22130f7647N181k98963f6662j73779
18954b40441A25293a09126A05652g1958B31890b76719A93108d12821a73107B15333
18943A84292o2777n7285b34326A86848e1846l0529d0603k5118j99145E7057c29281
18931b09415L286k50615a2172f55B5939a90753Q7442G410b81494O4008g7719a3343
18918a13356d0343A15036a60642P8953C2152g0417A43005m771a6622f983m36392
18907d43375R1775G2195i4914j6595C0604K2420f2502G683R7258a69225P7846
$$ plain form
18986 -104425 -57208 57723 176433 -264864 154319 -148715 -188773 -142228 -334208 222849
18975 -180487 -224171 -151565 -6792 -88177 -365052 326580 -277749 21925 280847 71639 155448
18964 155448 -183561 224035 -151963 -41320 -363450 -67647 -62466 -361429 -66662 -240441
18954 -240441 125293 -109126 105652 -71958 231890 -276719 193108 -412821 -173107 215333
18943 184292 121515 64230 -234326 186848 -51846 -82375 -40603 -65721 -264866 57057 -329281
18931 -209415 -206129 -456744 -12172 -655 25939 -190753 -103311 7410 -281494 -217486 -77719 -13343
18918 -113356 -40343 115036 -160642 -81689 32152 -70417 143005 138234 -16622 -6983 -443375
18907 -443375 -351600 72195 -94914 -111509 30604 53024 -62502 7683 104941 -169225 -91379
18896i1379J1887j15510j49773B61440i7911d1434q3199n19663I5109b26595A07962
18884d8286A7295O8165J3891a8935l55196F7556R5101b65349k01240E0065J34233
18873A84298a9024k97536c8685j52828C36037i4842n8246B46813a16416e339D080
18861a31664a8638N716C86970b3782k57659h5199K9104C32586A1537J01955k3457
18850I0035P6326p3650f2550G8228a9652D480b00024h6011b75B26097b38293k4815
18838b63108k5278D8073b18420f4177H6490m1882j2014b81359a165r7361m9056
18827a47582q5841n6950B93466b60522g8660Q522m2704C7454c07912e7587G402
18815E14364A14264J8227D9272L1871d1099H4733a51902B88772J02236c48B29448
$$ plain form
18896 -91379 -79492 -195002 -344775 261440 -97911 -41434 -124633 -644296 95109 -226595 107962
18884 -48286 17295 85460 99351 -18935 -374131 67556 162657 -265349 -466589 50065 184298
18873 184298 -19024 -316560 -38685 -191513 336037 -94842 -153088 246813 -116416 -5339 4080
18861 -131664 -18638 -12922 386970 -23782 -281441 -85199 -56095 332586 11537 113492 90035
18850 90035 166361 92711 -62550 78228 -19652 4480 -200024 -86011 -275 226097 -238293 -263108
18838 -263108 -288386 48073 -218420 -64177 86490 44608 32594 -281359 -1165 -98526 -147582
18827 -147582 -233423 -290373 293466 -260522 -78660 -70138 -112842 37454 -307912 -57587 7402
18815 514364 114264 132491 49272 81143 -41099 84733 -151902 288772 391008 -348 229448
18803b8656j29969d8966j53266k8665C30084F7149b88378C0651i3163G2561k399
18792G0162j6922O4598L6696i792C1297F73h5839j0339l2977A27738b1205B45846
18779A49089e8773j90352n3710a50387O1431d1615q7854l1122A07026d7465C1566
18767h2832k6774A02092c17036R7832L9218A01316b19775A01454a64570G5682
18756B00823m5301c45550a10328m0018f159B2282O9413b35479l16596b43764M6669
18745a97095E9408d7681B56570h5832h972j27574M6384H0075j4163f1942m7595
18734a09537j06217M4112B4745J97046f2524k34142O5670h3765j56834A38593
18723F1050f1700C4904a87935A39026D5591a78942p9966B30364a24495C93233
$$ plain form
18803 -28656 -158625 -48966 -202232 -230897 330084 67149 -288378 30651 -93163 72561 70162
18792 70162 53240 117838 154534 -9792 31297 673 -85839 -96178 -129155 127738 -21205 245846
18779 149089 -58773 -249125 -302835 -150387 -88956 -41615 -129469 -160591 107026 -47465 31566
18767 -82832 -109606 102092 -317036 -219204 -179986 101316 -219775 101454 -164570 75682
18756 200823 155522 -345550 -110328 -150346 -6159 22282 91695 -235479 -552075 -243764 -197095
18745 -197095 59408 -47681 256570 -85832 -8972 -136546 -90162 80075 65912 -61942 -109537
18734 -109537 -215754 -171642 24745 221791 -62524 -296666 -230996 -83765 -240599 138593
18723 61050 -61700 34904 -187935 139026 45591 -178942 -258908 230364 -124495 393233
18712a83905d0002P709m6675A13067a49096e5008E9734d1880J1270k26506d0109
18700B65912b79852B2083b02580A20880a68392q9617r2859i7256O068B4755K33583
18689B58338a76226A58308c93994g5771K2687B45609B8038a33280c722G2180a47394
18677C729J35518b63689F0900a19008A6400a87871a6874G3618L6790b09005I2206
18665A02177N9902a31914j02951N579k60295B66159c28219E6234b49736J12976
18655a36760k7971C7032q092a63254G4725F892J08944J612c60649e2176c3j10654
18643a10687j1807k19496R1242a24503F1350L5024b10055e0198K0222q345G2365
18631A4154b61295a4604j01858q4458B16715c37997D8274c81744i6120k16979
$$ plain form
18712 -183905 -40002 -32293 -78968 113067 -149096 -55008 59734 -41880 -30610 -257116 -40109
18700 265912 -279852 22083 -202580 120880 -168392 -258009 -350868 -97256 -91188 24755 258338
18689 258338 -176226 158308 -393994 -75771 -53084 245609 28038 -133280 -3722 72180 -147394
18677 3729 139247 -263689 60900 -119008 16400 -187871 -16874 73618 110408 -209005 92206
18665 102177 162079 -131914 -234865 -229286 -489581 266159 -328219 56234 -249736 -136760
18655 -136760 -164731 37032 28940 -163254 74725 6892 115836 117448 -360649 -52176 -33 -110687
18643 -110687 -122494 -341990 -250748 -124503 61350 96374 -210055 -50198 -29976 -38321 72365
18631 14154 -261295 -14604 -116462 -200920 216715 -337997 48274 -381744 -96120 -313099
18621c13099B44419I6794l6774k7576a10206G0128b6224l5101r9325L0077E1478
18609a92278F267g6264C09666j27439a61122k05661C2272b21430A97751N6063
18599B53814F8220j5362N7100a22804l6578E4344M7788a31104B63067H660J26751
18588A35411N9351c100l5271A61217a53349n8133j4474G3533A4463P3125K82107
18577C69695h0741A2905e1314k60175J44148A59643c45790J53360G8679b3663
18566A20981a02787G6704a08889n434D9248J42182A7847a81970K6317O9661o7007
18555a52999A6614P1937A0603a26784k53910A51029l2109f64232b88727d2447
18544A02191M0115J53759H3193J04841f7332G1438e2647I0383l6854M3184a89747
$$ plain form
18621 -313099 244419 96794 60020 32444 -110206 70128 -26224 -61325 -160650 -130573 51478
18609 -192278 6267 -76264 309666 182227 -161122 -366783 32272 -221430 197751 253814
18599 253814 68220 52858 109958 -122804 -159382 54344 102132 -131104 263067 8660 135411
18588 135411 194762 -3100 -38371 161217 -153349 -211482 -225956 73533 14463 87588 369695
18577 369695 -80741 12905 -51314 -311489 -167341 159643 -345790 -192430 78679 -23663
18566 120981 -102787 76704 -108889 -114323 49248 191430 17847 -181970 -155653 -85992 -152999
18555 -152999 16614 88551 10603 -126784 -380694 151029 118920 -664232 -288727 -42447
18544 102191 142306 296065 83193 188034 -67332 71438 -52647 90383 53529 96713 -189747
18532b9906B34326a62554k36968A92035a03188E8197j8751f0376A35245l4625
18522A00620J13751a35215A4311a558B59037q9010M5861b81309b3196n337A41441
18510H9222a44882A34498h0989p384j8853d7836l9743J7061b1357F0432a73300
18498a09145J350J7101F0903h9743B26181A06858m3513a353q0186A02937i3185
18486B5673A2720a45685f5084j80401A33854i8079B36746E1076c20311J58628
18476a61683c1518j84847J00291B5064e9815R96j55935P174K9315P9631F5404
18464d80877d6567G1712P0363d8204k3042b0659p9500j12172i4732B0206a39388
18452a12503q6155g7169m6599A80758o8181L7254C8482b4901A64M3531N5912e9574
$$ plain form
18532 -29906 234326 -162554 -399522 192035 -103188 58197 39446 -60376 135245 100620
18522 100620 214371 -135215 14311 -1558 259037 170027 215888 -281309 -23196 -28533 141441
18510 89222 -144882 134498 -80989 -88373 -107226 -47836 -87579 -70518 -21357 60432 -173300
18498 -109145 -107795 -90694 60903 -89743 226181 106858 63345 -1353 -81539 102937 -93185
18486 25673 12720 -145685 -65084 -245485 133854 -98079 236746 51076 -320311 -161683
18476 -161683 -31518 -216365 -116074 25064 -59815 -58819 -214754 -207580 -178265 -98634 65404
18464 -480877 -46567 71712 142075 -48204 -71246 -20659 -100159 -212331 -94732 20206 -139388
18452 -112503 -198658 -77169 -123768 180758 112577 149831 38482 -24901 164 43695 99607 -59574
18439a75380A74740b48770A99140R6618K79718D1933a77554I8470J66327j2707
18429B52090I1935J4615f6830D4033i3210c6629k79158G6064A5878e13941c0290
18417b36612A92925h4925m4081A61587J48833j12210g124r700E5258f0035I86
18405A83778G5279J89428J21206b32156B18999b00199A0760M23187j07461H5361
18394I9853b4959B13224B0905b48044B00911b15607M4631K6601m1495O9169K8947
18383h7754A50510a39317O7600B1323L4556b99430a46573B44033a40163A94935
18372a31065A4890a97940M6484A03431N3290p1671B0477b85221O6369f6980l8336
18361a05316C388K49033J1883b435j29232b7332A42632n7315K95367A23815b70787
$$ plain form
18439 -175380 174740 -248770 199140 295758 575476 41933 -177554 98470 264797 252090
18429 252090 91935 106550 -66830 44033 -93210 -36629 -315787 76064 15878 -513941 -30290
18417 -236612 192925 -84925 -129006 161587 310420 198210 -7124 -16824 55258 -60035 986
18405 183778 75279 264707 385913 -232156 218999 -200199 10760 433947 326486 85361
18394 99853 -24959 213224 20905 -248044 200911 -215607 -170976 -144375 -185870 -116701 -87754
18383 -87754 150510 -139317 -71717 21323 55879 -299430 -146573 244033 -140163 194935
18372 -131065 14890 -197940 -151456 103431 156721 85050 20477 -285221 -218852 -66980 -105316
18361 -105316 3388 252421 264304 -2435 -131667 -27332 142632 85317 380684 123815 -270787
18349C1571d87286a71012j64186Q6302i819A87902a34257C06332H4182e7127n6142
18338a13269A14244j0762p070b67732B40306b57798i9532C40785A1171Q3909c1005
18326b6514j39744j80640H4757a80337H8266g732j80019c1333B1060J26200G3287
18314I0673b04227M0981B44983a88731M022B89049a20038C1760a89618j17050
18304c06668b6445j25384P5465j34757D1341a88543A0875c70178f9548B03753
18293e8283j7372j40523A72039f0114D927d96599a76448N0633b2174l56436B64947
18281A12444a54261C5614b68064B10776a87480A54302Q205b0794m3546H1549b11072
18269g0192A74317a18565N2811F4622a25876K0937I1250c6653q0097o1142l41483
$$ plain form
18349 31571 -487286 -171012 -335198 -248896 -9819 187902 -134257 306332 84182 -57127 -113269
18338 -113269 114244 103482 96412 -267732 240306 -257798 -99532 340785 11171 95080 -31005
18326 -26514 -166258 -346898 84757 -180337 88266 -7732 -187751 -31333 21060 147260 73287
18314 90673 -204227 -163246 244983 -188731 -184709 289049 -120038 31760 -189618 -306668
18304 -306668 -26445 -151829 -76364 -211121 41341 -188543 10875 -370178 -69548 203753
18293 -58283 -75655 -216178 172039 -60114 4927 -496599 -176448 -125815 -22174 -378610 264947
18281 112444 -154261 35614 -268064 210776 -187480 154302 162507 -20794 -64340 81549 -211072
18269 -70192 174317 -118565 -65754 64622 -125876 -104939 91250 -36653 -116750 -177892 -519375
18258e19375d3415j57665A5301a25605A67550d4085n7709A21880K4498D9330b9121
18246F048d0440B35519b09475B13908c11000h225k37688P9939A04009R4916D3821
18234a67039A55014B7228d7135B70357b73098p123J37768F8977J5058K5645J00568
18223B10248a37665A16758e7777j66259O5243k25949a49482j01899b7508A30409
18212c02393a45835k8613g1139A39561C2410b53329o1165L337J24870C5632K78983
18201C14615j29757i7000q892c2933A73737a60489d4784j13460j72347f908A01498
18189a50834O4529M2406H1084N3938n7317P7047c5053k6357j65165b7866N358
18178b2508o0085l8193L3726B33337E2592K28895l5694j18122O788b28755B33143
$$ plain form
18258 -519375 -43415 -201080 15301 -125605 167550 -44085 -101794 121880 146378 49330 -29121
18246 6048 -40440 235519 -209475 213908 -311000 -8225 -245913 -165974 104009 198925 43821
18234 -167039 155014 27228 -47135 270357 -273098 -280221 -142453 68977 84035 109680 210248
18223 210248 -137665 116758 -57777 -224036 -158793 -384742 -149482 -251381 -27508 130409
18212 -302393 -145835 -174448 -71139 139561 32410 -253329 -314494 -311157 -186287 35632 314615
18201 314615 184858 -97000 -105892 -32933 173737 -160489 -44784 -158244 -330591 -6908 101498
18189 -150834 -86305 -43899 81084 135022 77705 154752 -35053 -61410 -226575 -27866 -22508
18178 -22508 -82593 -120786 -87060 233337 52592 281487 245793 127671 134459 -228755 233143
18166H5001a24069C4798b95349h7797j45041c7702A31091a64465g6541k14860
18156b91401Q3299R4205h177j29404o5196B94557D5610b18925e8704k19536R4617
18145a83623B50535b474L20l90856a68101b6755D3810a13453j35066l3564i5579
18133A09588b14767k822Q3235B056h5157A25263C6055d2821k48884i4045L008
18122i1037o9157g4921A03132a01407D2686c4137A27491b16669A07060l0215K01333
18111B78178A36202b19759F9359a96629A5269J37520N9321c39244O7397d1093
18100a41590f3928A1755K37155A14269j8514J85092f6168B02636r3504a35620
18089b30631C29769i4080j74537B55256r1586j4285k2172i3248C34044A56404
$$ plain form
18166 85001 -124069 34798 -295349 -87797 -232838 -37702 131091 -164465 -76541 -291401
18156 -291401 -208102 -113897 -8177 -137581 -202777 294557 45610 -218925 -58704 -278240 -183623
18145 -183623 250535 -2474 -2154 -393010 -168101 -26755 43810 -113453 -248519 -282083 -95579
18133 109588 -214767 -217589 -134354 2056 -85157 125263 36055 -42821 -291705 -94045 -91037
18122 -91037 -160194 -74921 103132 -101407 42686 -34137 127491 -216669 107060 76845 278178
18111 278178 136202 -219759 69359 -196629 15269 152789 212110 -339244 -271847 -41093
18100 -141590 -63928 11755 248910 114269 95755 280847 -66168 202636 109132 -135620
18089 -230631 329769 -94080 -268617 255256 163670 149385 127213 -93248 334044 156404
18078b12224A9547a15122J3082C8923G250L6772J45436C8976O6215J05658b24173
18066f4913B34548I1891B1069L45996j83072a14452A35147b833j9479k63103F3160
18054b48930M3089L7562I0684h750o5345n8476D92070b11378E3124g0383D6148
18042a77241C7812K965K06360a59297j3679k137a7724A0512K9003g5236H7688
18030a04042k72867F1528g7389b8715k02790f1055C85576h7240j96262J29004
18020a54498g3603D6097J75172J7692j10193n4583c22484C6510a12795I5990b11121
18008B93881a04418M2808A37423O2849k4594b10427p9741H5374b49163A19369
17997c21620A83046a67780p0890g7771B51173G336L19063C8972c17770a3526B1120
$$ plain form
18078 -212224 19547 -115122 -102040 38923 7250 44022 189458 38976 105191 210849 -224173
18066 -64913 234548 91891 21069 367065 183993 -114452 135147 -2833 -22312 -285415 63160
18054 -248930 -205841 -168279 90684 -8750 -74095 -132571 492070 -211378 53124 -70383 46148
18042 -177241 37812 40777 247137 -159297 -172976 -175113 -17724 10512 39515 -75236 87688
18030 -104042 -376909 61528 -77389 -28715 -231505 -61055 385576 -87240 -283502 -154498
18020 -154498 -73603 46097 221269 238961 128768 74185 -322484 36510 -112795 95990 -211121
18008 293881 -104418 -61610 137423 200272 175678 -210427 -290168 85374 -249163 119369
17997 -321620 183046 -167780 -238670 -77771 251173 7336 326399 38972 -317770 -13526 21120
17985f0183k0211D8717a66403g0899A80492g2367J4638k43945A93439a27098A95643
17973c10245A57783g2983m4818I1968O6547b2143C0152a88011B3267f8190P286
17962f0904B37751a98266h7855q8678N0642M9647B7064J21992J03754I8592c55178
17950b1361j40072A69510E5294e5369E20110B3866J16890b3072B50382a55143
17939a5350H4207C4742K46505B7022K4880b4757A62599H1197a64992A31890P7176
17928B09066b373l8009D7161h6722A77391b34456h7538C2710b88362J28920C25550
17916c3233j33798B093J34508a10801j2223M3070m3186j09340g0193A34165c24231
17904c6315j05318B6224a96704e3481j5282o9364L2706j50354d1653B9243j2877
$$ plain form
17985 -60183 -80394 48717 -166403 -70899 180492 -72367 -57729 -301674 193439 -127098 195643
17973 -310245 157783 -72983 -117801 91968 158515 -22143 30152 -188011 23267 -68190 -60904
17962 -60904 237751 -198266 -87855 -176533 -125891 -76244 27064 149056 252810 98592 -355178
17950 -21361 -161433 169510 55294 -55369 520110 23866 140756 -23072 250382 -155143
17939 -15350 84207 34742 281247 27022 51902 -24757 162599 81197 -164992 131890 209066
17928 209066 -2373 -40382 47161 -86722 177391 -234456 -87538 32710 -288362 -159442 325550
17916 -33233 -167031 2093 136601 -110801 -123024 -79954 -123140 -232480 -70193 134165 -324231
17904 -36315 -141633 26224 -196704 -53481 -68763 -138127 -105421 -255775 -41653 29243 16366
17893A6366i1515d3005j71684Q1504j53939I1481c4273I7766c33709O1491J03143
17882a69075B51907b4376A62700h4592a5797C84210F1797A9527f4633A87357D4696
17870D4841a6455B27918c4080H2381a10338k40154I8835c10342Q9107p727I9406
17858A00886a70827M4076r9380A83713H1773l3567h0195D2382K20640C5904a23259
17846b8080E3395i0910g072m7468B07229b06937r6932B1413J4675c4246D650a78909
17833A7719b43428h94E3747c0790m1053n4726F2082L44244a3822B26716C0306
17821A47058Q2666a16087k27790C1295g8760L4198r5405A1740g3456m4720j49080
17810b67256N5823a3632l2810D25535a21242c6062l1355l8762A8799a12949L5363
$$ plain form
17893 16366 -91515 -43005 -214689 -133185 -287124 91481 -34273 97766 -333709 -272218 -169075
17882 -169075 251907 -24376 162700 -84592 -15797 384210 61797 19527 -64633 187357 44696
17870 44841 -16455 227918 -34080 82381 -110338 -350492 98835 -310342 -221235 -228962 99406
17858 100886 -170827 -126751 -226131 183713 81773 48206 -80195 42382 263022 35904 -123259
17846 -28080 53395 -90910 -7072 -54540 207229 -206937 -303869 21413 36088 -34246 4650 -178909
17833 17719 -243428 -894 53747 -30790 -71843 -126569 62082 406326 -13822 226716 30306
17821 147058 229724 -116087 -343877 31295 -78760 -44562 -139967 11740 -73456 -118176 -267256
17810 -267256 -211433 -13632 -46442 425535 -121242 -36062 -67417 -106179 18799 -112949 -77586
17799g7586k7289d0107A21539n536C010e467j10092A93663f6965A28832c8705
17787a43530B23539R6752I9098l921a07087A00315b84206a41967N1928I0398L10162
17776D00560D7042L36078A17850i8232A69355g8580B08718i0628B23831m0120
17766A83711o7872a9684j954A87325P3599A21915a86022c8511p8760H9084a10269
17754b05333B2774b77428c2489D0031J95032a68387j88842N0239A81812D3747
17743h3620b8328p1308A18046J41373A10495J80348a4702B65523e00529C20032
17732A9170O8873B1538J4644a96649c1202j8677j60496E0227K19795D1444a05159
17720B13388C9623c9119a1398A92442a85106n9258H1553M8995d5785J432A78216
$$ plain form
17799 -77586 -104875 -40107 121539 116003 3010 -5467 -115559 193663 -66965 128832 -38705
17787 -143530 223539 320291 99098 95177 -107087 100315 -284206 -141967 -90039 90398 400560
17776 400560 47042 383120 117850 -98232 169355 -78580 208718 -90628 223831 183711
17766 183711 115839 -19684 -21638 187325 260924 121915 -186022 -38511 -117271 89084 -110269
17754 -205333 22774 -277428 -32489 40031 235063 -168387 -357229 -306990 181812 43747
17743 -83620 -28328 -99636 118046 259419 110495 290843 -14702 265523 -500529 320032
17732 19170 88043 21538 36182 -196649 -31202 -49879 -210375 50227 270022 41444 -105159
17720 213388 39623 -39119 -11398 192442 -185106 -244364 81553 130548 -45785 -44353 178216
17708F8519b38604A08745C6253f9079j04017B89686a5364C7417d09923A31462
17697a41366A84806q4549L18931G8581a84795I4513e2919A48194D9294J77466
17687B26760B0074a13901B37173a11109C06986a2098B63430K46555A25285M0179
17677A65464b88763A50607h6133B9996K71811A14076O7060a81609c5366E4052
17666D1244L069a64541E0659i0524A47000d1021F4869J16763F2133a29818m8344
17655a78162C16463d55296D5241A602J15594Q1011L558L17774g604E6157M5490
17644A01647d6415F6523g7175a1747H3645b84543l00448E8086a66963F4178p222
17633E6956R3218J29714F6155J29923B1413b00635B34177a25249N6987B29149
$$ plain form
17708 68519 -238604 108745 36253 -69079 -173096 289686 -15364 37417 -409923 131462
17697 -141366 184806 100257 419188 78581 -184795 94513 -52919 148194 49294 226760
17687 226760 20074 -113901 237173 -111109 306986 -12098 263430 509985 125285 165464
17677 165464 -288763 150607 -86133 29996 301807 114076 181136 -181609 -35366 54052
17666 41244 44313 -164541 50659 -90524 147000 -41021 64869 181632 62133 -129818 -178162
17655 -178162 316463 -455296 45241 1602 117196 198207 201765 519539 -7604 56157 101647
17644 101647 -46415 66523 -77175 -11747 83645 -284543 -584991 58086 -166963 64178 56956
17633 56956 150174 279888 66155 196078 21413 -200635 234177 -125249 -68262 229149
17622B08988A3340J0295J28100J24048g9353k5395A65837a94310A45620b45991
17611a0441F2329a67409P4699D6047F845P6176Q4241F132f2813A58931b65139
17599A36581R1214D2397c4856b400D26380A47723J15076K0967A11291m2757a38924
17587H1039J08359m4768c4337o7812m5467a7718A19229B5311d8925A25940d5235
17575A74099L2554K09086G8193M7090K30859A17849m0387i0651A5583f2766Q050
17564e4716B30879G1424J59622B1514J37618D8241q249P1736m5970k608O1084
17553A24234J30343b8026j06193k2379B75119P0380J5594B1344K18245q8580A2569
17541h5589C6835J26244Q3715g9299E6422L27365j83645M27377f1617k2444n2837
$$ plain form
17622 208988 13340 23635 151735 275783 -79353 -104748 165837 -194310 145620 -245991
17611 -10441 62329 -167409 -92710 46047 6845 83021 167262 6132 -62813 158931 -265139
17599 136581 227795 42397 -34856 -2400 426380 147723 262799 283766 111291 68534 -138924
17587 81039 189398 144630 -34337 -102149 -147616 -17718 119229 25311 -48925 125940 -45235
17575 174099 206653 415739 78193 125283 356142 117849 77462 -90651 15583 -62766 -54716
17564 -54716 230879 71424 231046 21514 159132 48241 39992 111728 65758 63150 124234
17553 124234 254577 -28026 -134219 -156598 275119 345499 361093 21344 239589 151009 12569
17541 -85589 36835 163079 246794 -79299 56422 383787 200142 627519 -61617 -84061 -136898
17530a36898B20518a85389C05201b9154A99984K6238a7242B2242a83168B75694
17519D46471A78317a17314m3395H7086R3835J34979A36385d1964A2448J82434
17509A94882a6206B45285A18667a30186D03926b6649p1760p4769A49584n9299
17499I0285g636D55401a54218a7276B53573o3454f4373B03870L0303G3863K28476
17488C02339J9931a7105A60475o1652k5811F460O92756A18491J34560a12900L1275
17477h1625B90410r8574E8894j1554Q1806g2072B76993c883C26334m1367m0189
17466B44778J09690A42345J11160k5085b4482D13055a9070B59907G5299c1829
17455C6488M324h2689D0208O5499L5300D0109K66607R9311j67218j257K6823b6566
$$ plain form
17530 -136898 220518 -185389 305201 -29154 199984 226222 -17242 22242 -183168 275694
17519 446471 178317 -117314 -160709 87086 180921 315900 136385 -41964 12448 194882
17509 194882 -16206 245285 118667 -130186 403926 -26649 -98409 -173178 149584 90285
17499 90285 -7636 455401 -154218 -17276 253573 190119 -64373 203870 234173 73863 302339
17488 302339 322270 -17105 160475 98823 73012 6460 699216 118491 253051 -112900 -81625
17477 -81625 290410 191836 58894 47340 129146 -72072 276993 -3883 326334 284967 244778
17466 244778 354468 142345 253505 228420 -24482 413055 -19070 259907 75299 -31829
17455 36488 40812 -82689 40208 105707 141007 40109 306716 406027 238809 237552 264375 -26566
17442E6735J00106J35643Q2234O5319J66928k50564j1839K602k6808j40326B7079
17430C16295j43055q3873M9424f8268A8911M6033c7257C27095f750C02269o9768
17419B32501a0589D01710j5524j75651K29587J12767C2317K07727l219J7592D2234
17407C08089c0034A08175J15125M6210J52916j5634A07559O9613E8742a3807C27037
17395A3637e2014D42532A12775j5842D5651f6630B10953k807J05731C6963J2074
17384D9037a52419A60665o3724R2945K12550d3177C57550E7J5544J98089k135
17373B11555B1112K70081A29807L4829l2761E6373L58818I5882O4459c669B53734
17361B46624L088L956b19352H7771K47424j38420O8602j24802L3015J28963M2863
$$ plain form
17442 56735 156841 292484 374718 440037 606965 356401 344562 347164 320356 180030 27079
17430 316295 173240 89367 138791 -68268 18911 64944 -37257 327095 -6750 302269 232501
17419 232501 -10589 401710 386186 210535 440122 552889 32317 240044 236825 254417 42234
17407 308089 -30034 108175 223300 269510 422426 406792 107559 177172 58742 -13807 327037
17395 13637 -52014 442532 112775 96933 45651 -66630 210953 208146 313877 36963 49037
17384 49037 -152419 160665 96941 189886 402436 -43177 357550 57 15601 213690 211555
17373 211555 21112 291193 129807 164636 131875 56373 415191 95882 160341 -3669 253734
17361 246624 249712 253668 -219352 87771 335195 196775 265377 140575 173590 302553 345416
17350C45416g8380J037A36407a23862B42313A20197f5845C95150B9434K02717
17340B32151h7830B10081D8752J06712K07117j17604n2780o0654J04729a45973
17329A62863k9474K38331P9186f591D01764B7844I363J47420J10416J35451j2672
17318C89978E5486Q6466J72468j32315L50631k41420H8050J02551o5728a45867
17307C1346M8394K31574J39057j94218J78129q1020k3133i6921A81567J35301
17297C16868P1029A23979K12528M2290j31854K96694B69920P2128n5553J31674
17287D18169j69528K29510j93542D9634K02960M4016l5872O1265j25758F2443
17276F7068K25956J16043A24434R7019J89806O3666a14228I2859D0164j9565J56895
$$ plain form
17350 345416 -78380 -77343 136407 -123862 242313 120197 -65845 395150 29434 232151
17340 232151 -87830 210081 48752 155464 362581 244977 192197 131543 236272 -145973
17329 162863 133389 371720 450906 -6591 401764 27844 9363 156783 267199 402650 389978
17318 389978 55486 141952 314420 182105 532736 291316 88050 190601 124873 -145867
17307 31346 79740 311314 450371 256153 434282 353262 330129 -96921 181567 316868
17297 316868 387897 123979 336507 378797 246943 543637 269920 342048 286495 418169
17287 418169 248641 478151 284609 49634 252594 296610 260738 322003 196245 62443
17276 67068 293024 409067 124434 221453 411259 474925 -114228 92859 40164 20599 177494
17265A77494M49332B04785l6410o9652K97615j88986a38272C83770r0795j41501
17255A51474J06213K66421B15644J63002K13200A01993B9811K74087A40567J72123
17245C12690l9869J63073A00015A9554K88410n8875L7012D4172P3803K29549k441
17234C45083j32090b2719A31502L31121j84490A13218J07772a20942C65092A65196
17223B98762m1643E3690K18793K45942l5130B15669e3529C99624J32819j35422
17213C97021j37374J16478N6043A61777L57109B58274p4011N5851L08195A1625
17202C09921j5468I313J73139J41643K8348A03143L8351C4768J09062K13681L060
17191C60571D7799j5623L77364A49062J22387A26239J32170K57293J4353A15289
$$ plain form
17265 177494 626826 204785 168375 98723 396338 207352 -138272 383770 292975 151474
17255 151474 257687 524108 215644 378646 591846 101993 29811 303898 140567 312690
17245 312690 272821 435894 100015 19554 307964 249089 286101 44172 117975 347524 345083
17234 345083 212993 -22719 131502 462623 278133 113218 220990 -120942 365092 165196
17223 298762 257119 53690 272483 518425 483295 215669 -53529 399624 532443 397021
17213 397021 259647 376125 432168 161777 518886 258274 184263 240114 548309 11625
17202 309921 294453 9313 182452 324095 352443 103143 141494 34768 143830 357511 360571
17191 360571 47799 32176 409540 149062 271449 126239 258409 515702 530055 115289
17180C70688A05029P2267K21310K678m8344o8673o2195J36435B9265K38459J04138
17169C71862A48897L2313R6978m2761J30954j08772k4199K38116k02799J14610
17159C83337r6109j18082J78873m8897p2467J36514m8353K11630F5202L29701
17149C94903k4322q5341q6026Q892I1860K32329o1684J84605o1077R1986h324
17137C19753o1997r9714M11618N7989k65929j41506N8473K46986j1293j04780
17127D09600j12123k8449J34519j0942K82649k68589q3111K63594A02436N05968
17117F08404k83165j19492L77693B89778J25924J0777l0338K97725l27799j10359
17107B55708K95723j04644H7470M26635j30884k4428L31435k06782L69288A97015
$$ plain form
17180 370688 105029 177296 398606 401284 352940 284267 222072 358507 29265 267724 371862
17169 371862 148897 181210 278188 235427 366381 257609 233410 471526 268727 383337
17159 383337 287228 169146 348019 299122 226655 363169 314816 526446 65202 394903
17149 394903 370581 285240 199214 208106 91860 324189 262505 447110 386033 478019 -8324
17137 319753 257756 158042 569660 627649 361720 220214 278687 525673 514380 409600
17127 409600 297477 269028 403547 392605 675254 406665 323554 587148 102436 608404
17117 608404 325239 205747 583440 289778 415702 426479 396141 693866 366067 255708
17107 255708 551431 446787 87470 514105 383221 358793 690228 483446 852734 197015
17096D56534j12184J01644L08236j88043B47729J17248K63145j03681L0121M8709
17086F03271B18099J27045J82580k31900J04968K22565k56940J60414k26169J76229
17076D76891A82759Q7041M34507B67593O02586B55880K60443n4424M52j16564
17066C45787J81878L6136j95021K73443K020R4140N6129l79056K32640P2435k85477
17055D35054j16898O3429J88150K111N6109P3411j54431j41473M27032B32706
17044C60201M20415k38169L97967k81035j68379K12493j46448K84834l49860J34364
17034F26383j64292M93858k90736J02189p6247o0471J53504l82251J93199K3488
17024F18624k13493J82640k61365J93796J40148L05279l78234p137k7040M23255
$$ plain form
17096 456534 344350 445994 754230 566187 247729 364977 628122 524441 554562 603271
17086 603271 218099 345144 527724 295824 400792 623357 366417 526831 300662 476891
17076 476891 182759 269800 704307 267593 870179 255880 516323 461899 462351 345787
17066 345787 527665 563801 368780 642223 644243 738383 794512 415456 648096 720531 435054
17055 435054 318156 381585 569735 571846 627955 701366 546935 405462 832494 232706
17044 360201 780616 542447 940414 659379 491000 703493 557045 841879 492019 626383
17034 626383 462091 955949 665213 767402 691155 630684 784188 401937 595136 618624
17024 618624 405131 587771 326406 520202 660350 965629 587395 580258 553218 976473
17014I76473j2994j74027j82904J29134K20142k2878j6193J94364l63971J72469
17004I19615l47534R8248J63261M22372m04243r7400P8110j20910J60526K57712
16994A129757l71332m0062J37530M1155R2989n5907j12189J89405k98695K1684
16984G34335K56806j93334M8283n2881L03600Q8274k60619P1583j56271L92767
16974A232543F10979K99514L7456J39432p4097k23863J64245L56844l73236N70329
16964A507603n51883J57641j58161O1138j0817m0484M39227j61858J5906N458
16954A263770q1113l2635k03667M36206k90691j61974L09171K96775j21060j94252
16944A220530L0524M6013k15694J47858L23764j33881J02675q1629l25729K10210
$$ plain form
17014 976473 963479 789452 606548 735682 955824 932946 916753 1111117 747146 919615
17004 919615 572081 670329 833590 1255962 851719 754319 832429 711519 872045 1129757
16994 1129757 758425 718363 855893 897048 990037 934130 821941 1011346 712651 734335
16984 734335 991141 797807 846090 793209 1096809 1185083 924464 996047 839776 1232543
16974 1232543 610979 910493 947949 1087381 1013284 789421 953666 1310510 937274 1507603
16964 1507603 955720 1113361 955200 1016338 1005521 965037 1404264 1242406 1258312 1263770
16954 1263770 1182657 1150022 946355 1382561 1091870 929896 1239067 1535842 1414782 1220530
16944 1220530 1251054 1297067 1081373 1229231 1552995 1419114 1521789 1440160 1114431 1324641
16934A324641J63100m1260j85029J17631p0465J89308R2062j87605K89959m320
16924A688022k09353j3017K8183M05511l75183o3975K2971M56040l34636K49910
16914A854473j87998l15866K85041j02813K02536L3587J397M9560R6652k96295
16904A620274M10622N4368j6534j52889j32623J33304J92352j62009L45086l14350
16894A977601K25245P2562k76849J51302k26437L61324J59930m2801k30970M14293
16884B585200J64489k19504l9953K4892L2363k63583J06701J60865J54923n16826
16874B189567M83807J25075k69657O0431K98999J66317k29957k65520M15859l35135
16864B639786N01896L9668P5214m21119K18268J18432J46487J0681l3879l62628
$$ plain form
16934 1324641 1487741 1446481 1261452 1379083 1308618 1497926 1589988 1402383 1692342 1688022
16924 1688022 1478669 1465652 1493835 1899346 1524163 1460188 1483159 1939199 1604563 1854473
16914 1854473 1666475 1350609 1635650 1532837 1735373 1768960 1770357 1819917 1916569 1620274
16904 1620274 2030896 2085264 2068730 1915841 1783218 1916522 2108874 1946865 2291951 1977601
16894 1977601 2202846 2275408 1998559 2149861 1923424 2284748 2444678 2401877 2170907 2585200
16884 2585200 2749689 2530185 2490232 2515124 2547487 2283904 2390605 2551470 2706393 2189567
16874 2189567 2673374 2798449 2528792 2589223 2888222 3054539 2824582 2559062 2974921 2639786
16864 2639786 3141682 3181350 3256564 2835445 3053713 3172145 3318632 3329313 3295434 2932806
16854B932806O82884j61023K51492k2855l02058L37911M01511k77661k57343M14349
16844D000013j87226J86257J9782L50005l66894J65338R0017J20218N29011j5855
16834D890666k14974J5224L48093j44481J16319L99473p6687P1772n2860M51208
16824E803753l90565J57920L82864k54150M33730j41474K1448K84256J45430L01905
16814F745117j59995M57892j36671L80145J31381m11450P85221m652K02666P7022
16804H066676K85507M07119n7324N9081L20506Q6946L57932L22023N2954J96377
16794A0097797K21236M10124K47258L77408J70161M89296K74944J48901J01891
16785A2539016L21477O01011O80708K23161N90167l51531J078028j2091P03603
$$ plain form
16854 2932806 3615690 3454667 3706159 3683304 3381246 3719157 4120668 3843007 3585664 4000013
16844 4000013 3812787 3999044 4018826 4368831 4001937 4167275 4257292 4377510 4906521 4890666
16834 4890666 4675692 4690916 5039009 4894528 5010847 5410320 5333633 5405405 5352545 5803753
16824 5803753 5413188 5571108 5953972 5699822 6133552 5992078 6013526 6297782 6443212 6745117
16814 6745117 6585122 7043014 6906343 7286488 7417869 7006419 7791640 7786988 7989654 8066676
16804 8066676 8352183 8759302 8701978 8761059 9081565 9168511 9526443 9848466 9901420 10097797
16794 10097797 10319033 10729157 10976415 11353823 11523984 12013280 12288224 12437125 12539016
16785 12539016 12860493 13461504 14142212 14365373 14955540 14604009 15682037 15669946 16373549
16776A6373549N02795P22864K20883O57447M67363R18774L79164R26633O33881
16767B1803353J049260O10705R89531O37611O00806J405093J029014R71847R69983
16758C0067203J524728J190887J404964J295745J360446K193687J244233J828134
16750D2110027K249150J989841J868511K705746K401107K725208K719529L013050
16742F1782169L160484L374339L383846L905739M162856M606567M282859M939657
16734I3598516N017942N162757N969054N781966N746882O329922N806220O687219
16726A40100478O134378O178208O040154N561344M622037M709396L663562L100195
16718A80109752K070336J268089k04917j069275j792279l095856l674117m501144
$$ plain form
16776 16373549 16876344 17599208 17820091 18477538 18944901 19863675 20242839 21169472 21803353
16767 21803353 22852613 23463318 24452849 25090460 25691266 27096359 28125373 29097220 30067203
16758 30067203 31591931 32782818 34187782 35483527 36843973 39037660 40281893 42110027
16750 42110027 44359177 46349018 48217529 50923275 53324382 56049590 58769119 61782169
16742 61782169 64942653 68316992 71700838 75606577 79769433 84376000 88658859 93598516
16734 93598516 98616458 103779215 109748269 115530235 121277117 127607039 133413259 140100478
16726 140100478 146234856 152413064 158453218 164014562 168636599 173345995 177009557 180109752
16718 180109752 182180088 183448177 183243260 182173985 180381706 177285850 173611733 169110589
16710A69110589m918120n841657n818624o040727o895601o256244o195899o217833
16702A20925884o297118o155962n333775n516974n217576n018962m511592m681723
16694G8192202l849602l727579l956804l315960l302148k913359k909685k375358
16686E1841707k699941k385413j876035k140356k082080j699700j622487j565717
16678C5769978k014608j199486j208626j179306j339131j065904j148781j145096
16670B5469040r03503o72897j100170q41303q09216j127346m41829m51007q61987
16661A8259782o84762o78727j72382o48955l82744l79185p24110k14796p20740
16652A3653381j62081l74549k99992n18605m70758k75651l66805j90242l95288
$$ plain form
16710 169110589 164192469 158350812 152532188 146491461 139595860 133339616 127143717 120925884
16702 120925884 114628766 108472804 103139029 97622055 92404479 87385517 82873925 78192202
16694 78192202 74342600 70615021 66658217 63342257 60040109 57126750 54217065 51841707
16686 51841707 49141766 46756353 44880318 42739962 40657882 38958182 37335695 35769978
16678 35769978 33755370 32555884 31347258 30167952 28828821 27762917 26614136 25469040
16670 25469040 24565537 23892640 22792470 21951167 21141951 20014605 19572776 19121769 18259782
16661 18259782 17575020 16896293 16723911 16074956 15692212 15313027 14588917 14374121 13653381
16652 13653381 13491300 13116751 12816759 12298154 11827396 11551745 11184940 10994698 10599410
16643A0599410M7774n36791k43483o02117K94306l00621n34132P2113l82157m6957
16633H367345j75234k65891k96895k11499k91759L00245l29157N1172l15989l20887
16623F511451j46547R1416l78242M98787n69798j90102q5348j11685K16968n42478
16613E294422Q2154R1487m60696k31673L08198j50066j22007j30125l6806j40864
16603D504024l54589J05306J62486m44041K70239m18763p4434j49081K12786L40173
16593D154106p45216M72323k87210q6532K46375l14376o8157J6797K43518n32381
16583C099247R6896P3178j83304m33576J89781L52261k14829l56970M88874k87324
16573B824234J92802k43545l31711j83536K19773J52966j70915K8292p9735j15174
$$ plain form
16643 10599410 10647184 10110393 9866910 9264793 9559099 9258478 8724346 8796459 8414302 8367345
16633 8367345 8192111 7926220 7629325 7417826 7126067 7426312 7097155 7148327 6832338 6511451
16623 6511451 6364904 6456320 6078078 6576865 6007067 5816965 5731617 5619932 5836900 5294422
16613 5294422 5376576 5468063 5007367 4775694 5083892 4933826 4811819 4681694 4644888 4504024
16603 4504024 4149435 4254741 4417227 3973186 4243425 3824662 3750228 3601147 3813933 4154106
16593 4154106 3408890 3881213 3594003 3507471 3753846 3439470 3371313 3388110 3631628 3099247
16583 3099247 3196143 3269321 3086017 2652441 2842222 3194483 2979654 2622684 3111558 2824234
16573 2824234 3017036 2773491 2441780 2258244 2478017 2630983 2460068 2488360 2408625 2293451
16563B293451j16830K61066L708j88016N0880l17917k1987k50520L81164K5683
16553B120682L6200l43500J32526k5355J02028k67312J74530k32988J61975q7853
16543A770933K65700m36026J61719j23880p0790J47353J3115m06177L56907O2398
16533A741252j70333P3076k13067K32401J00099m57293P9018J4821j71774K63917
16523A492117m2721O0658j45639J30425k04305j23868R1853l40566k3827p19J88301
16512A081709L26956J8359M3013l30908K6233k43770K00573q0680J91067k03993
16502A028559N02555m24158k02950m8879J97053K38415k27995J3918l4973r5783
16492I45762J86440m23465P83346m69573K86818l72589K04754j78953j77726K55895
$$ plain form
16563 2293451 2176621 2437687 2441395 2253379 2304259 1986342 1964355 1713835 2094999 2120682
16553 2120682 2156882 1813382 1945908 1920553 2022581 1755269 1929799 1696811 1858786 1770933
16543 1770933 2036633 1600607 1762326 1638446 1567656 1715009 1728124 1321947 1678854 1741252
16533 1741252 1570919 1643995 1430928 1663329 1763428 1306135 1385153 1399974 1228200 1492117
16523 1492117 1449396 1510054 1364415 1494840 1290535 1166667 1258520 917954 894127 893408 1081709
16512 1081709 1408665 1427024 1470037 1139129 1165362 921592 1122165 1041485 1232552 1028559
16502 1028559 1531114 1106956 904006 855127 1052180 1290595 1062600 1076518 1041545 945762
16492 945762 1132202 708737 1492083 1022510 1309328 936739 1141493 962540 784814 1040709
16482A040709m1100J87951n14769O61856m40356J07475l13699M17247k86672l27136
16472D91506J47756L49392j16349K06681j72848o5182j0102j53326J62831J17286
16462I57645m01734K42868J52542k93440J63705K7595p0322o5770Q1128j35212
16452F59005j15963O4740j2167k80929K76024K8739m9150p2217K45009L2177j63340
16441F11928P6278C02136O17207l61272m6189p6291K83260K6425k23606k1416
16431E00254o0267K15964j34317R6881J56462k37889Q6657n9046l8840j85445
16421C40414j7243j5221L97134j2224k36350P2652B54786P5630N7055m197K56144
16410F39418k47538J465J701P6542J11195B77080L28394q219j08992j53994k9557
$$ plain form
16482 1040709 999609 1187560 672791 1334647 894291 1001766 688067 1105314 818642 491506
16472 491506 639262 988654 872305 1078986 906138 840956 830854 677528 840359 957645
16462 957645 555911 798779 951321 657881 821586 849181 778859 713089 794217 659005
16452 659005 543042 607782 595615 314686 590710 619449 570299 498082 743091 775268 611928
16441 611928 688206 302136 919343 558071 511882 435591 718851 745276 521670 500254
16431 500254 439987 655951 521634 618515 774977 537088 623745 564699 525859 340414
16421 340414 323171 307950 705084 692860 456510 529162 254786 330416 387471 383274 639418
16410 639418 391880 393345 395046 471588 582783 277080 605474 597255 488263 334269 304712
16399C04712k2967R8728L25725j43682A29070L41636B04066J54441j59829J66226
16389C64904K00044j07646L90037k49085k07213G0292M50916j73623j67437K10155
16379C90303K44135A66064P1121K11555j30842l8285J53136o5563A79302J90286
16369C69588J7971A65258M12775B82121R8531j4253k4924N2162r4033L6706n0931
16358B85379J54007k09204N2262R9110j74459K13003j28598G8743N17522q0492
16348E15773C6950K90560P1724R5232j9287A41741R7099l0978M6664J28105l4416
16337C48215J50536k1779Q8481A46159p1505L36803q0792J16386j26009m334d8316
16325A43323k0324J14622L2081l6128e1052C03957R5302I8781L07293b87586C18209
$$ plain form
16399 304712 281745 380473 706198 562516 129070 470706 204066 358507 198678 364904
16389 364904 564948 457302 847339 598254 391041 70292 521208 347585 180148 390303
16379 390303 634438 166064 237185 448740 317898 279613 432749 367186 179302 369588
16369 369588 387559 165258 578033 282121 380652 366399 341475 393637 299604 336310 285379
16358 285379 439386 230182 282444 381554 207095 420098 291500 78743 596265 515773
16348 515773 36950 327510 399234 494466 475179 141741 238840 207862 254526 382631 348215
16337 348215 498751 476972 565453 146159 74654 411457 330665 447051 321042 316708 -48316
16325 143323 122999 237621 269702 233574 -51052 303957 399259 98781 406074 -287586 318209
16313D72910L3652k43740M6354A34621l9849K851L3153J54991p708a65587C70870
16301C58358p9809a60564C71892I4120J64520J47310J0416B6285L2712J30490
16291A89487J11153m8484A16057O6212b0031A90649K7435D7036L37501j83875
16281B00662L0407A7782L05373p4722k5160J38113A52068J24229b8850E27258
16270B70940r8032m8440m9706d1608A07241J26626O8693A17514R9570g5556I9065
16258f855B40030J1386C1269c4553C07637I2339J92626e8683C45849j15801A13812
16246H0375d3089m26L275C80170F3253R364i3279E116J15940R6186p084p2635
16234A37523J90741j57389n754M4978i6389D80071A68521E5991J74386K6022E174
$$ plain form
16313 472910 506562 262822 309176 134621 94772 97623 130776 285767 278059 -165587 370870
16301 358358 278549 -160564 371892 94120 258640 405950 416366 26285 58997 189487
16291 189487 300640 252156 116057 182269 -20031 190649 218084 47036 384537 200662
16281 200662 231069 17782 323155 248433 223273 361386 152068 276297 -28850 527258
16270 270940 172908 124468 74762 -41608 107241 233867 302560 117514 217084 -75556 99065
16258 -6855 240030 251416 31269 -34553 307637 92339 284965 -58683 345849 230048 113812
16246 80375 -43089 -43515 -40240 380170 63253 72617 -93279 5116 121056 217242 210158 137523
16234 137523 328264 170875 165121 210099 -96389 480071 168521 55991 230377 256399 5174
16222D32275A33422N4958D703h9919F80J28575C0038K62229h1954G0550L16318
16211C86868F9176j4855J78704K69796j45677h8687A7718J4051J37914a2731E1759
16199a40055A66275h691j05800c2659C5691b39963A51080a74802B39809g9043
16188E3509g1369D7943K42641j11347b59756B04167f5502j55281F4841M0845d1439
16176B52055m5162j7271b34978P9799C85764c3223C12420p5983i3659A56989n5374
16165A01615B9633a66864A81525p3458B4437g3667A06787N8824a19417m0313E518
16153B07146a67889b6729I5588Q4566P2248b54972B1337J98846P2162a44122B68670
16141g6113A1910d6459k69699B79879a68839C7836A6444b293b65B78421I3055
$$ plain form
16222 432275 133422 188380 4703 -89919 680 129255 30038 292267 -81954 70550 386868
16211 386868 69176 54321 233025 502821 357144 -88687 17718 31769 169683 -12731 51759
16199 -140055 166275 -8691 -114491 -32659 35691 -239963 151080 -174802 239809 -79043
16188 53509 -71369 47943 290584 179237 -259756 204167 -65502 -220783 64841 105686 -41439
16176 252055 206893 189622 -234978 -155179 385764 -33223 312420 236437 -93659 156989 101615
16165 101615 29633 -166864 181525 108067 24437 -73667 106787 165611 -119417 -159730 5518
16153 207146 -167889 -26729 95588 180154 252402 -254972 21337 220183 292345 -144122 268670
16141 -76113 11910 -46459 -316158 279879 -168839 37836 16444 -2293 -265 278421 93055
16129A17538d8706j20016d4668j28349A65386a72044A24422j3787c40577g0219
16118a61263I8914M9860J3413b6625B59423e4290C3427J52222k3376J12373M3501
16107C18147c2526j18866B61143k8857F600K4390L7987L10393j43619b23706b6279
16095b06701a3102C41933E6125b10293C73680A29224B5867a24478F7833J05704
16085A73537D9592A3121f4216l9029d2516A72024A5534a05032F3109a16404j38583
16074b54987D42314f0657C21678d819B75977H1399b55848H2374C8428a28779C11224
16062e4143A25451E6282g8429K858A73542e0922A38285C1308a46999L6509l3546
16051a44036A5244i0366k8769D9811K83692j11965b04603E8576A6922a8121e897
$$ plain form
16129 117538 -48706 -168722 -44668 -173017 165386 -172044 124422 110635 -340577 -70219
16118 -161263 98914 148774 162187 -26625 259423 -54290 33427 185649 162273 274646 318147
16107 318147 -32526 -151392 261143 232286 6600 30990 68977 379370 235751 -223706 -26279
16095 -206701 -13102 341933 56125 -210293 373680 129224 25867 -124478 67833 173537
16085 173537 49592 13121 -64216 -103245 -42516 172024 15534 -105032 63109 -116404 -254987
16074 -254987 442314 -60657 321678 -4819 275977 81399 -255848 82374 38428 -128779 311224
16062 -54143 125451 56282 -78429 -75571 173542 -50922 138285 31308 -146999 -110490 -144036
16051 -144036 15244 -90366 -119135 49811 333503 221538 -204603 58576 16922 -18121 -5897
16039a92971e358C15423A26345R3021f9178a6857G3872c84779a67131c0652D60348
16027e4374F8212a38791r6445j89057f8949B67713j22428a24949b1660C44372
16016F2979b6024k44524A69471N7016f0823K8486A58492A7690N8895r042K82199
16005C49742d9180j0898E0921M5902g300k02509A81477o3704n2647B4122A28b38726
15992A71831b0737B3004a52985B2407c53450A71872F7135a6677B7337K54139Q2909
15981C64385j59442P0367q3441A9128K06551N690d0141r2116d5953j0349B84668
15969i290B33209e8061C12942c551B60529G2967a6868C6858K36543a90211A62855
15957b9298k72399J26128G1565b41899N1349b7304N576B59963a9221k89954b1509
$$ plain form
16039 -192971 -5358 315423 126345 219366 -69178 -16857 73872 -384779 -167131 -30652 460348
16027 -54374 68212 -138791 -235236 -424293 -68949 267713 145285 -124949 -21660 344372
16016 62979 -26024 -270548 169471 226487 -60823 -32337 158492 17690 76585 67543 349742
16005 349742 -49180 -60078 50921 96823 -7300 -209809 181477 117773 65126 24122 128 -238726
15992 171831 -20737 23004 -152985 22407 -353450 171872 67135 -16677 27337 281476 364385
15981 364385 204943 275310 191869 19128 225679 231369 -40141 -132257 -45953 -56302 284668
15969 -9290 233209 -58061 312942 -3551 260529 72967 -16868 36858 273401 -190211 162855
15957 -29298 -301697 -175569 71565 -241899 -190550 -27304 -21728 259963 -19221 -309175 -21509
15945B18840m0684F2560P5363L053k7826f4093j04614j28607c4872D17018a6585
15933H8654d36776J38164L2117B16134a048k4454B04758m8657c85047a35555A22701
15921a44160q7801E8320K18293a93529h8269j70310k34681D7996M01100b03661
15910a50942j9783D7085J6564c4296j93474c1503B06469A2196b61689a13239D20943
15898C22441b0453j1603k74686J52976D8521h3198D76648b23044Q220B0606K959
15887B3565K27075a22106C5831P9087D4643R789g35A48699b96456A5062f0207
15875a60793b5159A20203D9332c27290A43044a7498m199o5944j53135J15913j76209
15864c01072a0613C0941c38979A02475B6589K7594c24703f7907a9233H2350g6585
$$ plain form
15945 218840 178156 62560 137923 140976 113150 -64093 -168707 -297314 -34872 417018 -16585
15933 88654 -436776 -298612 -266495 216134 -1048 -25502 204758 156101 -385047 -135555 122701
15921 -144160 -231961 58320 276613 -193529 -88269 -258579 -493260 47996 449096 -203661
15910 -150942 -170725 47085 63649 -34296 -227770 -31503 206469 12196 -261689 -113239 420943
15898 322441 -20453 -32056 -306742 -153766 48521 -83198 476648 -223044 -214824 20606 23565
15887 23565 250640 -122106 35831 114918 44643 54432 -735 148699 -296456 15062 -60207
15875 -160793 -25159 120203 49332 -327290 143044 -17498 -21697 -87641 -240776 -124863 -301072
15864 -301072 -10613 30941 -338979 102475 26589 54183 -324703 -67907 -19233 82350 -76585
15852D5769j4522J12586J4884j1463a59909e1414J8177B0196b72855G1207h3880
15840a63310A56012a05041l680C2387N2474A2406N2087J19947c3069j12661l9116
15829a84846D37282A01929c00670K2494A94760E2240h811k50343B85852a7797
15818A16972a22951M7843A4879c20119f6574j0767A0279a65451I9814b4751B91374
15806b13998p4750J08620A22969a67746C81503a93950p5193i8757D633Q1326f5705
15794b03105B16419c44216c2855A32481i2217A87162m889a10793D6616e4401A9744
15782B75646f3550m0721B38732E7713A6774b43035d2183E029J87926p7778g6180
15770D312b32962L4386e0329k4934j47055P6758K9673B57851a29397j24650A70285
$$ plain form
15852 45769 31247 143833 158717 147254 -159909 -51414 -33237 20196 -272855 71207 -83880
15840 -163310 156012 -105041 -108721 32387 84861 12406 64493 184440 -33069 -145730 -184846
15829 -184846 437282 101929 -300670 -278176 194760 52240 -8811 -259154 285852 -17797
15818 116972 -122951 -75108 14879 -320119 -66574 -77341 10279 -165451 99814 -24751 291374
15806 -213998 -288748 -180128 122969 -167746 381503 -193950 -269143 -98757 4633 85959 -65705
15794 -203105 216419 -344216 -32855 132481 -92217 187162 182273 -110793 46616 -54401 19744
15782 275646 -63550 -104271 238732 57713 16774 -243035 -42183 5029 192955 115177 -76180
15770 4312 -232962 -198576 -50329 -75263 -222318 -145560 -115887 257851 -129397 -254047 170285
15758c35871B83556F0084a79104O0211B33994p4253G0355A9926b09140f070k4299
15747c0369A81986l1386a79405h4037B14624a02242F5421k8702e0197a1668B87779
15735e5337M240k0482K684C4773b05688B64757c16441B06277e1302r3905j67967
15724c13174J53070o3259p9551E531L18990F7975J12262c7880l4729a3630A22636
15712a09244l75237a05593B71560i8124M6362B81829j39464a22925j02700d6632
15701E0770A1975M493a92936D1719a87584A83872a11349F003K27537i7168C54642
15689B67196h1849J1959D0408J41055c7792B29483a92863h3446A47170b03105
15678C611Q2022a56820B22620a33806j17930M4621A99417c30356c1667F9535O0115
$$ plain form
15758 -335871 283556 60084 -179104 -118893 233994 159741 70355 19926 -209140 -6070 -30369
15747 -30369 181986 150600 -179405 -84037 214624 -102242 65421 36719 -50197 -11668 287779
15735 -55337 -51097 -71579 -68895 34773 -205688 264757 -316441 206277 -51302 -145207 -313174
15724 -313174 -160104 -223363 -302914 5531 324521 67975 180237 -37880 -72609 -13630 122636
15712 -109244 -484481 -105593 271560 -98124 -51762 281829 142365 -122925 -225625 -46632
15701 50770 11975 16468 -192936 41719 -187584 183872 -111349 6003 233540 -97168 354642
15689 267196 -81849 -69890 40408 181463 -37792 229483 -192863 -83446 147170 -203105
15678 3611 85633 -156820 222620 -133806 -251736 -207115 199417 -330356 -31667 69535 129650
15667A29650d7231H8404d5970k9015R246l36363f6434r308C21291c32036c6385
15655A16818f2802a9323B60602a57698C7457P3086b75626F6589a54347A45267
15644b32661A89793b96620R1419K325f3283j24009d1284J7215j39588f2014q7787
15633a49801H528a52992f460D0999O3070a61528K9537f0058n08301E0593K13318
15622B63911b44875A79833k6407D670M15370A72197a08182b9535j80993D19330
15611b1291C72745a11918j32577a06561A99214g33j78776j45037a01470M969b2993
15599A82473m9188b3978A61060Q9964k2930D7209b14893Q0095B96273A40232c3383
15587g4066A45960h7848l7870H0789f6278B97783o3302a00984B28402c00127a4572
$$ plain form
15667 129650 -47231 88404 -45970 -74985 -65739 -402102 -66434 -75742 321291 -332036 -36385
15655 116818 -62802 -19323 260602 -157698 37457 110543 -275626 66589 -154347 145267
15644 -232661 189793 -296620 -205201 -202876 -63283 -187292 -41284 -24069 -163657 -62014 -149801
15633 -149801 8528 -152992 -6460 40999 104069 -161528 -131991 -60058 -568359 50593 263911
15622 263911 -244875 179833 153426 4670 420040 172197 -108182 -29535 -210528 419330
15611 -21291 372745 -111918 -244495 -106561 199214 -733 -179509 -324546 -101470 -96501 -22993
15599 182473 133285 -23978 161060 251024 228094 47209 -214893 -134798 296273 140232 -33383
15587 -74066 145960 -87848 -125718 80789 -66278 297783 234481 -100984 228402 -300127 -14572
15575a12568H7069b10873H4476b95332B4808N8264c89214A24115a57394d4386
15564A19199J25866b72406A65487H108g2347C33106e3288H0119a70587n4209E3392
15552C37751a41350N9388A88711k5515a27681B3317c28482C36670j41254m7329
15542A48087D902a46253A33244e5385i185B87846A9494J14153J46962B9029K58808
15531B87837j19534a86925G8807J05742H5496R5664e5644C31062l4972c4937o228
15520d1165p4019j74864A49151J17950i5028B5804m906L09649j13002J8121c30357
15508a1066p1913F1694h7921o224l9297A1052b85456G1928R233g2724B85317b95291
15495C27902d86875a44758D4541d01636a23725n6849B98717B9681g48E714d83
$$ plain form
15575 -112568 87069 -210873 84476 -295332 24808 83072 -389214 124115 -157394 -44386
15564 119199 245065 -272406 165487 8108 -72347 333106 -53288 80119 -170587 -224796 53392
15552 337751 -141350 -81962 188711 163196 -127681 23317 -328482 336670 195416 148087
15542 148087 4902 -146253 133244 -55385 -9185 287846 19494 133647 280609 29029 287837
15531 287837 168303 -186925 78807 184549 85496 181160 -55644 331062 296090 -34937 -41165
15520 -41165 -115184 -290048 149151 267101 -95028 25804 20898 330547 217545 235666 -330357
15508 -11066 -82979 61694 -87921 -94145 -133442 11052 -285456 71928 81161 -72724 285317 -295291
15495 327902 -486875 -144758 44541 -401636 -123725 -180574 298717 29681 -748 5714 -483
15483a20548K6427K7009j0042B69484G8722K44525e4928B54631j8525P1330f5791
15471A30962a58296B63267h1790D9145c4944q6971B01429a44931b6114j11492
15461a37606A79046a57496l67639A48535a47309M3517A50692G1380O3328N9461
15451A94169J75915b3190C1170J13261B1425L886J38034a62219A83990K7663a4561
15439A99329a2992k24817a7191j32640a1032B68672b39191N1336d8681A52845
15428c4870j46181B78480d3490A01089O5046i9068k663r3581A72007F8100P0786
15417A38886c1344r8896R99B31283f2452A18925L988h6869j01673N0025k0976
15406a59493A24549E4581B7167O0369d18113J29917B45517A2906E78L607a0910
$$ plain form
15483 -120548 -94121 -67112 -77154 269484 78722 323247 -54928 254631 236106 307436 -65791
15471 130962 -158296 263267 -81790 49145 -34944 -121915 201429 -144931 -26114 -137606
15461 -137606 179046 -157496 -525135 148535 -147309 -103792 150692 71380 134708 194169
15451 194169 370084 -23190 31170 144431 21425 25311 163345 -162219 183990 211653 -14561
15439 199329 -12992 -237809 -17191 -149831 -11032 268672 -239191 -187855 -48681 152845
15428 -34870 -181051 278480 -43490 101089 166135 -99068 -101731 -195312 172007 68100 138886
15417 138886 -31344 -130240 -129241 231283 -62452 118925 122913 -86869 -188542 -138517 -159493
15406 -159493 124549 54581 27167 87536 -418113 -288196 245517 12906 578 4185 -10910
15394E0805O8114B0653c10180A8845P7995C8422K88784a32785M3154j54545n7779
15383c01955J8095a7416k43A1805a68850K8732F1983b08029h1974b2470p3808
15372i6278R8Q706M0958I7119d825B8491J2585A1831b82612D31187a4106b878
15359B02078N3865d29604i534A63093K7036l3191I650J06973a65795B20296m5192
15348A75104H019J71107N4092d187B66139a1830A13950c5974A75369G230O1739
15337F8969n110d6317p6043A21817L29312a12762b6275r6978M1459F9579B9780
15325D9856g3646E9289h6263A75141N5272g5703J0763l7887d7191q6773M5881
15314h8083H4343K52070p1008H7948P3342a28720D48244A54298E875Q9777H984
$$ plain form
15394 50805 118919 20653 -310180 18845 96840 38422 327206 -132785 -89631 -244176 -301955
15383 -301955 -283860 -17416 -17659 11805 -168850 -140118 61983 -208029 -81974 -22470 -96278
15372 -96278 -96180 -87474 -46516 97119 -4825 28491 41076 11831 -282612 431187 -14106 -2878
15359 202078 255943 -429604 -9534 163093 190129 156938 9650 116623 -165795 220296 175104
15348 175104 8019 179126 233218 -4187 266139 -11830 113950 -35974 175369 7230 68969
15337 68969 63859 -46317 -122360 121817 451129 -112762 -26275 -123253 -81794 69579 29780
15325 49856 -73646 59289 -86263 175141 230413 -75703 -64940 -102827 -47191 -133964 -88083
15314 -88083 84343 336413 265405 87948 161290 -128720 448244 154298 5875 95652 8984
15302D14793b37437I9638A4062g9722r4985A9001K1262L38173b02463C261d5420
15290C01612i2185D11539b5897k9776m4156A04865R5124J2628G5532d0149F5870
15278b16933b9350k2478A32897a80220B54794d7951B66563j22697F9611K9620
15268I9231a27269d3808A06159b25115D7071J0511J30507F4883g0317D29514b3812
15256A15927d3293A68118P7558J665i9778B84726L5875L43868M18366O08466m32449
15245A258852K16584N16328E88946a02491E15816A27468g3228D4294K73269a26334
15234a85409D03871d1317i43j84731a6884k13873A70310p6584h6307C5298K98947
15223C34245a11278A87794m3941A0475d7256A87126p6810a23393A27909e5497
$$ plain form
15302 414793 -237437 99638 14062 -79722 -174707 19001 40263 378436 -202463 3261 -45420
15290 301612 -92185 411539 -25897 -55673 -99829 104865 199989 212617 75532 -40149 65870
15278 -216933 -29350 -51828 132897 -180220 254794 -47951 266563 143866 69611 99231
15268 99231 -127269 -43808 106159 -225115 47071 57582 188089 64883 -70317 429514 -23812
15256 115927 -43293 168118 245676 247341 -99778 284726 320601 664469 1082835 1691301 1258852
15245 1258852 1475436 1991764 588946 -102491 515816 127468 -73228 44294 317563 -126334
15234 -185409 403871 -41317 -943 -185674 -16884 -230757 170310 93726 -86307 35298 334245
15223 334245 -111278 187794 143853 10475 -47256 187126 110316 -123393 127909 -55497
15212b241B58520j03141J8722k3903C5532a13863d6535l9331A97781J36223j56607
15201A77397E4202N5241m9494P6956l9049C2738a8845A91245O3083J31130f9737
15189h7237B20180J13128d8391C00088A29002k9870M1313m9689K50094b2394I6537
15177g4717A16529J59247G2256M9884H493L10124e5628D8213J22023K33667A06323
15165a093C15420f8964C4347Q5194o242j1678J61539h2256A94762l516H3493K4587
15153A08080a4046B30246j03323b73606C51191F4769p460a14821c0655A9913J20253
15142A40166a39323e8141k754A14669J52267b09066e6277j37836R0271C11624
15131C44825A06026J53270a65093d8689A15585C0165L48481M4106N1707j61590
$$ plain form
15212 -2241 258520 155379 174101 150198 35532 -113863 -46535 -85866 197781 334004 177397
15201 177397 54202 109443 59949 136905 97856 32738 -18845 191245 254328 385458 -69737
15189 -87237 220180 333308 -48391 300088 129002 99132 140445 90756 340850 -22394 96537
15177 -74717 116529 275776 72256 122140 8493 318617 -55628 48213 170236 403903 106323
15165 -1093 315420 -68964 34347 119541 113299 101621 263160 -82256 194762 191246 83493 108080
15153 108080 -14046 230246 126923 -273606 351191 64769 57309 -114821 -30655 19913 140166
15142 140166 -139323 -58141 -60895 114669 266936 -209066 -56277 -194113 -103842 311624
15131 344825 106026 259296 -165093 -48689 115585 30165 378646 422752 474459 312869
15121C12869q7747m3268c6832m7351C80359b7404B33135d103C82434E6250q480
15110D7770a17361N1517A21590B4110J88788a04075A44487D5944M69555H4816
15099A44451M7690j8486J16771j05054h5001A42316J26628J11180o334A51682
15088g870A36022J89637a0154n8147C97605p6471p2538I5484L84403H8098R1367
15077A79465E628J10720K4937B7383K08294J83975A55489A2493K47304r5343K3034
15066A87488J52809n6361f9419I4930J71738n856R7811M8818A55337N3258J28019
15055C36614A40886d2174D0670J82173D0466J67780Q6461C1336K20401j5902D7750
15043d1598B33946k1698Q8915j24881R7889L6841J86482A41843l6518P8542F220
$$ plain form
15121 312869 225122 181854 -36832 -84183 380359 -27404 233135 -4103 382434 56250 47770
15110 47770 -117361 -65844 121590 24110 212898 -104075 144487 45944 515499 84816
15099 144451 192141 173655 290426 185372 -85001 142316 268944 380124 373790 151682
15088 -7870 136022 325659 -10154 -68301 397605 321134 248596 95484 479887 88098 179465
15077 179465 5628 116348 141285 27383 235677 419652 155489 12493 259797 164454 187488
15066 187488 340297 283936 -69419 94930 266668 260812 358623 407441 155337 208595 336614
15055 336614 140886 -42174 40670 222843 40466 208246 294707 31336 251737 235835 47750
15043 -41598 233946 212248 301163 176282 274171 311012 497494 141843 105325 183867 6220
15031B49786E101K07935l1262a78898C13428Q4970j45436m1031C900P7800N0447
15020A32147J2253J73583C7142b12092J01487C86729A50814J20054A12342k5812
15010H6530P6411b4094C02953A23756K24715H8127K38495j7416J09307j77460
15000B41053K35588A85043M5811L59831A63274J52661p6510j18323n0177L2391
14990A03316J48432J23008k3787F8388K52675L41506g9074K6331F60096j38023
14980E22073B17460n4067c8664C79105q6861j26922O6285J37120j54756J91042
14970D05013A53173Q6235J35077n2876F6906J24571o1618K22J09199K5458K50184
14959E14922o1123L6570F4368L77711A93447n7948J54259J3936j49910L26121
$$ plain form
15031 249786 5101 213036 181774 -178898 313428 398398 252962 211931 3900 81700 132147
15020 132147 144400 317983 37142 -212092 -110605 386729 150814 270868 112342 86530
15010 86530 162941 -24094 302953 123756 348471 88127 326622 309206 418513 241053
15000 241053 476641 185043 230854 590685 163274 315935 239425 121102 70925 103316
14990 103316 251748 374756 350969 68388 321063 662569 -79074 -52743 660096 522073
14980 522073 217460 163393 -38664 379105 292244 165322 231607 368727 213971 405013
14970 405013 153173 239408 374485 321609 66906 191477 129859 130081 239280 264738 514922
14959 514922 453799 490369 64368 442079 193447 135499 289758 303694 153784 479905
14949D79905j54922J01411J44488j99105j7082j28742J27564A46951K52707q6152
14939C13506A35611k6765J60102J96984J35377A71701M1216H4773M90911A26152
14928B19035k5758I1531M04529l3516M3552j93749n3713O0977K16548K3283j8740
14917E40702r1351k09791J11567M965j61520G7840J04615J88245j37655J18124
14907C51169J56579J21495C13982n1750L71600B172J36513K63298Q8514A81276
14896B68399A13067l0817K71236o1799A38045L45107n7104q6245j56424N82845
14886G66224l43680O5998l2816k01943m8906O4240J60816P5416L21793A62928
14875C86346j08941J24153J06550k25363M88873l25867o2275P5865A68432K72411
$$ plain form
14949 479905 324983 426394 570882 371777 354695 225953 353517 146951 399658 313506
14939 313506 135611 108846 268948 465932 601309 171701 212917 84773 575684 126152
14928 219035 193277 91531 496060 462544 506096 312347 258634 319611 536159 559442 540702
14917 540702 449351 239560 351127 356092 194572 77840 182455 370700 233045 351169
14907 351169 507748 629243 313982 262232 633832 2172 138685 401983 490497 181276
14896 268399 113067 82250 353486 291687 138045 483152 426048 339803 183379 766224
14886 766224 422544 488542 455726 253783 204877 269117 429933 505349 827142 162928
14875 386346 277405 401558 508108 282745 771618 445751 383476 459341 168432 440843
14865D40843N0384J00124A13911L43498j90197m3963J59888j11287K53417k2986
14855E02281A19596J00247Q8640L09786j79432k16096L4795P7506J87741J62413
14845F85196j44259j25889j18286J02727M66376D14359j53543K34305A23397K65399
14835C88796J31655J48743k82045M0600J51715k32591K27057A95293K38685J11944
14825E45922M09p117j19235J20416J697j12443m2241p2124M780L36564k13550
14814D43078j10855K30043m9408J59030k23268j7987J75831B84650J11879j7771
14804C78758L48669j563R0045D06143J86248J31212j2936l1498j47600k09816
14794C21753J67432J82801j24342J71677k39537L8350J56374p6968J86114C56092
$$ plain form
14865 440843 491227 591351 113911 457409 267212 223249 383137 271850 525267 502281
14855 502281 119596 219843 308483 618269 438837 222741 257536 335042 522783 685196
14845 685196 540937 415048 296762 399489 865865 414359 260816 495121 123397 388796
14835 388796 520451 669194 387149 427749 579464 346873 573930 195293 433978 545922
14825 545922 546331 539214 419979 540395 542092 429649 387408 315284 320064 656628 443078
14814 443078 332223 562266 512858 671888 448620 430633 606464 284650 396529 378758
14804 378758 727427 725864 815909 406143 592391 723603 710667 679169 531569 321753
14794 321753 489185 671986 547644 719321 479784 518134 674508 597540 783654 356092
14783F59017j69032K13664j38655j07729L07739K09744k70750j69895l9146M08915
14773I03872k64411j54252m3631L88245O9390q5727m7613C78445N21194B95884
14762D95926M1204J83029l39602L33977r6809L6808J25647n0567O0808k079k70289
14751E18053j02990Q07036m89554j65080L13082k90167N65901D14396L07808Q4940
14741H07144k47921K33081j8464J01755m7028n6381J5943P8208l48239J97979
14731G16077K73970l51996J46729M78985l00417J29521m30696j29794K38410m5782
14721G25007Q1890k29147M65806m4868N732K2552r6057P5621j74111j56196L81988
14710A058217n27620j5839O05801k77303R3292j00444K14854l19226N53469n3092
$$ plain form
14783 659017 489985 703649 564994 457265 765004 974748 703998 534103 494957 903872
14773 903872 639461 485209 441578 829823 899213 813486 765873 378445 899639 295884
14762 495926 537130 720159 380557 714534 617725 654533 780180 729613 790421 788342 518053
14751 518053 415063 1222099 732545 567465 880547 590380 1156281 414396 722204 807144
14741 807144 559223 792304 773840 875595 828567 772186 788129 866337 518098 716077
14731 716077 990047 638051 784780 1263765 963348 1092869 662173 532379 770789 725007
14721 725007 806897 577750 1043556 998688 1004420 1026972 930915 1006536 832425 676229 1058217
14710 1058217 530597 514758 1120559 843256 936548 836104 1050958 731732 1285201 1232109
14700A232109n27302L91504k45377L8422K13891r5056N44049o88649J30366j69486
14690H24471J14239p6440K47005j71746M2068m6548L14807m45587j00041O46516
14680A348744J9998j80344N8555l54029k7239M29210J1026m32307L45361l9957
14670A179018P9096J2290m05146M65323p8654N035j10872j77905K4314L31500
14660A323999k02444j06461K89908k5804j63574R7423k21676K48288r5177L89216
14650A533698k04420l13834N28657l12310J26656j94916L95478m23653L66862
14641A502218j55562O6182k48897L72696n8369j23200L0436M1025r9087J49592
14631A477034k1368n50439N84952m9817j94185J33062J10830k40287K20511J09526
$$ plain form
14700 1232109 704807 1096311 850934 889356 1103247 1008191 1552240 863591 993957 824471
14690 824471 938710 862270 1109275 937529 979597 933049 1247856 802269 702228 1348744
14680 1348744 1368742 1188398 1246953 892924 865685 1294895 1305921 873614 1218975 1179018
14670 1179018 1258114 1270404 865258 1330581 1251927 1256962 1146090 968185 992499 1323999
14660 1323999 1121555 1015094 1305002 1279198 1115624 1213047 991371 1239659 1144482 1533698
14650 1533698 1329278 1015444 1544101 1231791 1358447 1163531 1559009 1135356 1502218
14641 1502218 1346656 1412838 1163941 1536637 1478268 1355068 1385504 1426529 1327442 1477034
14631 1477034 1455666 905227 1490179 1440362 1246177 1379239 1490069 1249782 1470293 1579819
14621A579819J83207l45340J95499n4030M73390o62760p7005j43991L76551K05131
14611A730471J21329m67949M22631l37978J18475J14688n5619k4401P1954K23218
14601A916819j84954j75934M38637l30930j77148m140J11497M17160p3559Q1817
14591B019265l47264M44050j13575p7684L00280j99533j13086n9043j7750K57235
14581B092895R4141j02655m8518n6128o2816L00247K5940j72913J73204M55273
14571B698670o86513L17548R8792J28385j25443j39872K59811P0934k09443L47645
14561B760514m4778k0248L08795r8117J00892L34663m6373M33820M64392K75243
14551D468803M51588J208289J983854L669675Q393407K0626494J0107797B3440031
$$ plain form
14621 1579819 1763026 1417686 1613185 1559155 2032545 1369785 1292780 1148789 1525340 1730471
14611 1730471 1851800 1383851 1806482 1468504 1586979 1701667 1646048 1621647 1693601 1916819
14601 1916819 1731865 1555931 1994568 1663638 1486490 1482350 1593847 2011007 1937448 2019265
14591 2019265 1672001 2116051 2002476 1924792 2225072 2025539 1912453 1853410 1835660 2092895
14581 2092895 2187036 2084381 2035863 1979735 1916919 2217166 2243106 2070193 2243397 2698670
14571 2698670 2012157 2329705 2428497 2556882 2431439 2291567 2551378 2622312 2412869 2760514
14561 2760514 2715736 2695488 3004283 2906166 3007058 3341721 3295348 3729168 4193560 4468803
14551 4468803 4920391 6128680 8112534 11782209 20175616 40802110 50909907 23440031
14542A1455743E413220j934281j187078o1815j97718l12064P74776k14737l15019
14533A965284q456K50288k0192j83277N0100M17203p9475N1995l4699J52137K65898
14522B826806k93798K11641j87672L81615n26974N47507m01024K24311l443k04662
14512B574307J65181J06138L11198n22224N50336j90220K5640L34511m7479l88960
14502B918428N49415k78390o4702M05404o7905o6242K43887k84690J46365K33533
14492C735103j57389q546l4529K84879j21992N9194j02015K65204j92726J14569
14482C841752j90103N22834N318j53012K37371P5043n7860K61353k8227o7148
14472D447321J47751l80231K68461K87547K85290o0380j35727k6959j71622R3627
$$ plain form
14542 11455743 5413220 3478939 2291861 2230046 2032328 1720264 2495040 2280303 1965284
14533 1965284 1956828 2207116 2186924 2003647 2053747 2470950 2391475 2443470 2408771 2560908 2826806
14522 2826806 2533008 2744649 2556977 2938592 2411618 2959125 2558101 2782412 2778969 2574307
14512 2574307 2739488 2845626 3156824 2634600 3184936 2994716 3020356 3354867 3307388 2918428
14502 2918428 3467843 3189453 3124751 3530155 3462250 3396008 3639895 3355205 3501570 3735103
14492 3735103 3577714 3569168 3534639 3819518 3697526 3756720 3654705 3919909 3727183 3841752
14482 3841752 3651649 4174483 4179801 4026789 4264160 4339203 4281343 4542696 4514469 4447321
14472 4447321 4595072 4214841 4483302 4770849 5056139 4995759 4860032 4833073 4661451 4755078
14462D755078l347L64218l45355J04111L54946J47357n0476j63995N53166l44381
14452E371322j1294R9701K56310K95270J9209q2469q1368K42405R9348j26547
14442F081887K54654J83991R2194p7653M2056J50520j22630j44643L58182J19295
14432F937853K44002q669K12895K99957m09507L78186j88551N23059Q331J26051
14422H123607j03116K25840L85681j82999K28437M8119K04764q2846L41060k23311
14412H965236J47159L49215L18520n0312L18577q3828K49146k9577P01722k43649
14402A0642209j61991N39416j38892Q55946k12554j04138N57918M46794k72329
14393A2152379Q3436O06208L99594k8983K85076K23428O3829J55764N57024J97022
$$ plain form
14462 4755078 4751731 5115949 4770594 4874705 5229651 5377008 5326532 5162537 5715703 5371322
14452 5371322 5360028 5459729 5716039 6011309 6030518 5948049 5866681 6109086 6208434 6081887
14442 6081887 6336541 6520532 6612726 6535073 6577129 6727649 6605019 6460376 6818558 6937853
14432 6937853 7181855 7173186 7386081 7686038 7276531 7654717 7466166 7989225 7997556 8123607
14422 8123607 8020491 8246331 8632012 8449013 8677450 8725569 8930333 8847487 9188547 8965236
14412 8965236 9112395 9461610 9780130 9729818 10048395 9964567 10213713 10184136 10885858 10642209
14402 10642209 10480218 11019634 10880742 11736688 11524134 11419996 11977914 12424708 12152379
14393 12152379 12235815 12842023 13241617 13212634 13497710 13721138 13784967 13940731 14497755 14694777
14383A4694777p330M91846r3192P60607R8522O01493o6765M62219M90414k31902
14373A7200689O33125O01487Q2669N02972M39448K32980M96610O20947L65449
14364B1176376J80241O74498L62294N25877N61810M66715L90603O48210M20837
14355B5407461Q69802K95827O02679P48504O69418O94111M37525J131283M21883
14346C1278493R90057P33458P95745P39596J127168J205060N72460J092593J154850
14337C9689480J352858J016095J244460J313029J465791J020808J454452J295760
14329D9852733J775740J873696J272653J887057J871359K095998J849494K140712
14321F4619442K528194K122954K256264K773744K811028K970785L201451K818884
$$ plain form
14383 14694777 14687447 15179293 15086101 15846708 15945230 16546723 16479958 16942177 17432591 17200689
14373 17200689 17833814 18435301 18517970 19020942 19460390 19693370 20189980 20810927 21176376
14364 21176376 21356617 22031115 22393409 22919286 23481096 23947811 24338414 24986624 25407461
14355 25407461 26277263 26573090 27175769 27924273 28593691 29287802 29725327 30856610 31278493
14346 31278493 32268550 33002008 33797753 34537349 35664517 36869577 37442037 38534630 39689480
14337 39689480 41042338 42058433 43302893 44615922 46081713 47102521 48556973 49852733
14329 49852733 51628473 53502169 54774822 56661879 58533238 60629236 62478730 64619442
14321 64619442 67147636 69270590 71526854 74300598 77111626 80082411 83283862 86102746
14313H6102746L658135L579595L424266M114102L867372M779194M487660M955867
14305A18968937N459203N337371N775075O641865O635368O874175P788524P884989
14297A71365507Q384922Q595653R218286J0037576J0550576J0843509J1268715
14290B40264744J2095019J2781529J3315363J3653090J4058733J4861457J5011193
14283C36041128J5174983J5034423J5036720J4913265J4356711J3402314J2798157
14276D36757701J1509915R464549P598646L569933J748949M51303j251079m77736
14268D69372181k876150m686566p488980r545642j1101764j2548621j3544307
14261D07580151j4747207j5456207j5646631j5669033j5494279j5541520j5167844
$$ plain form
14313 86102746 89760881 93340476 96764742 100878844 104746216 109525410 114013070 118968937
14305 118968937 124428140 129765511 135540586 142182451 148817819 155691994 163480518 171365507
14297 171365507 179750429 188346082 197564368 207601944 218152520 228996029 240264744
14290 240264744 252359763 265141292 278456655 292109745 306168478 321029935 336041128
14283 336041128 351216111 366250534 381287254 396200519 410557230 423959544 436757701
14276 436757701 448267616 457732165 465330811 468900744 470649693 471100996 469849917 469372181
14268 469372181 466496031 461809465 454320485 444774843 433673079 421124458 407580151
14261 407580151 392832944 377376737 361730106 346061073 330566794 315025274 299857430
14254B99857430j3714438j3073921j3083839j3192295j2048031j1535474j0760024
14247B12449408j0260652r910114r122146q241821q190789p908568p538866o716648
14239A44559804o123320o269040n303575n629041n131368n142177m497074l992286
14231A02471923l577085m286464l745498l426318l561369k898773l180202l276957
14223G4519257k214069k940572k152570k306143j800379k380113k092771j710662
14215E6921978k136513j149326j606370j616853j420705j933844j034533j342002
14207D4681832o83623j305525j675864j095848j302927r73356n78790p02815j117812
14198C5245272j220086j025448n61532j072485m62909n22401j196837p19407n56953
$$ plain form
14254 299857430 286142992 273069071 259985232 246792937 234744906 223209432 212449408
14247 212449408 202188756 192278642 183156496 174914675 166723886 158815318 151276452 144559804
14239 144559804 138436484 132167444 126863869 121234828 116103460 110961283 106464209 102471923
14231 102471923 98894838 94608374 90862876 87436558 83875189 80976416 77796214 74519257
14223 74519257 72305188 69364616 67212046 64905903 63105524 60725411 58632640 56921978
14215 56921978 54785465 53636139 52029769 50412916 48992211 47058367 46023834 44681832
14207 44681832 43998209 42692684 41016820 39920972 38618045 37644689 37065899 36363084 35245272
14198 35245272 34025186 32999738 32438206 31365721 30902812 30380411 29183574 28464167 27907214
14189B7907214p84291m41368p53766o46656k87996q33608l68039o32548o71716
14180B2487226j83283l40525m20644q09382m75878J50050o53675m07298o85544
14171A8661047k85795k08073m18543l93934j35966m20802p14853O7409m50996
14162A5699494k79644o080m76973L1988l1156q52288j72497J31424n94862J78327
14152A3627733m46749n06124J68025m06848k67312p5687j76310p5820j83923j90873
14142A1466112j45938j93919k07373M0146j35334l96493k65321l4905r6840j1447
14132A0018688j95677k01118l67176Q2471m59626K32993m84490J56826m74007
14123H308884R9419J89200l57723j02849l01934J43905K5000J1267m40053O3461
$$ plain form
14189 27907214 27122923 26681555 25927789 25281133 24993137 24159529 23791490 23158942 22487226
14180 22487226 22303943 21963418 21542774 20733392 20257514 20407564 19753889 19346591 18661047
14171 18661047 18375252 18167179 17748636 17354702 17218736 16797934 16083081 16150490 15699494
14162 15699494 15419850 15413770 14936797 14968785 14937629 14085341 13912844 14044268 13449406 13627733
14152 13627733 13180984 12674860 12842885 12436037 12168725 12093038 11916728 11840908 11656985 11466112
14142 11466112 11320174 11126255 10918882 10959028 10823694 10427201 10161880 10126975 10030135 10018688
14132 10018688 9823011 9621893 9254717 9337188 8877562 9110555 8626065 8782891 8308884
14123 8308884 8408303 8597503 8239780 8136931 7834997 7978902 8003902 8015169 7575116 7638577
14113G638577j81988r4780K962k85474J49280j15197j63245K26335k68764J82291
14103G089997n63656l30280M59425m33362n1886J06855J44467m36561M0403k0903
14093F004499r0893J98546l92702J42427j18529p89810L59874L81696n99321L43117
14083E438904k60864J85424o3476n28857J71526p634r4470L4266l2775k24041
14073D618003K04013J27952k97044r453N804k99836N2460M7982J17627l54272
14063D213236M004K6538j64425J69030J61932J89300q8257k67846p9810l60856
14053C802846K1268J54663P1516k04316j40832L09305n09912O5185l0957o2124
14043C476642K13173l87629J87026j90903J14411J4293j04292k48701J49471l25462
$$ plain form
14113 7638577 7456589 7361809 7364771 7079297 7228577 7113380 6950135 7176470 6907706 7089997
14103 7089997 6526341 6196061 6655486 6222124 6170238 6277093 6421560 5984999 6025402 6004499
14093 6004499 5913606 6112152 5719450 5861877 5743348 4953538 5313412 5695108 5095787 5438904
14083 5438904 5178040 5363464 5299988 4771131 4942657 4935023 4840553 4874819 4842044 4618003
14073 4618003 4822016 4949968 4652924 4643471 4649275 4349439 4401899 4449881 4567508 4213236
14063 4213236 4217240 4243778 4079353 4248383 4410315 4599615 4511358 4243512 4163702 3802846
14053 3802846 3824114 3978777 4050293 3845977 3705145 4014450 3504538 3569723 3538766 3476642
14043 3476642 3689815 3302186 3489212 3298309 3412720 3427013 3322721 3074020 3223491 2898029
14033B898029J64682J07599R3003J43709k11098k8705j7414k48011q5715K02136
14023C018215k745k59497j7943K09473m6210j34920k4873J98223l95350j35498
14013B408875R0098J81999j95348L26250m72804J67256m42441M80425j45081Q6184
14003B485413L3725j78418k57319M11432n47002M3523R1269j07852N5713l6640
13993A993844L02705m2288K0814M51358R70889K883623N842154J9240230J9730411
13984E1393740k1306866A3617804n063880k361249j364199l47171p75954j93815
13976C511536k33868k43624J90960l11391M1472k36788m56040L59900J65682m00536
13966B387303K68510k34126q0194n6379K3834j84043k7271Q4398J5679l35016
$$ plain form
14033 2898029 3062711 3170310 3263313 3407022 3195924 3167219 3149805 2901794 2816079 3018215
14023 3018215 3015470 2755973 2738030 2947503 2901293 2766373 2741500 2939723 2544373 2408875
14013 2408875 2498973 2680972 2485624 2811874 2339070 2506326 2063885 2544310 2399229 2485413
14003 2485413 2519138 2340720 2083401 2494833 1947831 1991354 2082623 1974771 2030484 1993844
13993 1993844 2296549 2254261 2275075 2726433 3697322 6580945 12423099 31663329 51393740
13984 51393740 30086874 13617804 8553924 6192675 4828476 4481305 3705351 3511536
13976 3511536 3277668 3034044 3225004 2913613 2955085 2718297 2262257 2622157 2787839 2387303
13966 2387303 2655813 2421687 2341493 2285114 2308948 2124905 2097634 2182032 2197711 1862695
13956A862695L74199J88176n74678K16944K11972k46388O0683j49813l2626J9946
13946A931110Q1969J52764m0965l8070P4288k41766J6689P4468j70216Q3039O6429
13935A989739r6708j18984M894l39801J94768K89339l70553K86700o23859M65816
13925A681351J14258j72399Q4755K93037k31956j14698M7377j5073k81539J21867
13915A526980n017J8084k77609M68520l47339K51729k47709K72410Q4192m49290
13905A294951K76659l46197K65412j50445k27868J20047J82577l1199j14011J13844
13895A383770K05880l75595O6685J25310l78390M5620O5786k022K08971l44385
13885A001630M77812q7838L5858j6698l27058M63164m67698L95682j57940J67911
$$ plain form
13956 1862695 2236894 2425070 1850392 2067336 2279308 2032920 2093603 1943790 1911164 1931110
13946 1931110 2013079 2165843 2124878 2086808 2161096 1919330 1936019 2010487 1840271 1923310 1989739
13935 1989739 1893031 1774047 1778941 1439140 1633908 1923247 1552694 1839394 1215535 1681351
13925 1681351 1795609 1623210 1707965 2001002 1769046 1654348 1701725 1686652 1405113 1526980
13915 1526980 1521963 1540047 1262438 1730958 1383619 1635348 1387639 1660049 1744241 1294951
13905 1294951 1571610 1225413 1490825 1340380 1112512 1232559 1415136 1383937 1269926 1383770
13895 1383770 1589650 1214055 1280740 1406050 1027660 1073280 1139066 1137044 1346015 1001630
13885 1001630 1479442 1391604 1427462 1410764 1083706 1546870 1079172 1474854 1316914 1484825
13875A484825n20510K43551K90680m22552l37834K98528k35513L52618k22160
13866I31633k7162K75837J13230j84493J58799q1059j08843j52534J58452N2055
13856A135915K88369l20958m4410Q7739J16819j87951J45099l72430N51239l24593
13846A074838l47155K11170J27056k45171K34210k79820K03632k02436J89300
13837I65624j52215M45810n39723J40074k1456M11831j47087k19695L89599l52146
13827I20616L55848m71390k90524K09364N5235J11188K34244m13880L01606l20296
13817F92011K72615k37213K97076J88526k16662o2104k48277R4311n0734J20670
13807H50219l7068l971P9897l37275M96022D90526L91222n6827j87136K22798
$$ plain form
13875 1484825 964315 1207866 1498546 1075994 738160 1036688 801175 1153793 931633
13866 931633 904471 1180308 1293538 1109045 1267844 1186785 1077942 925408 1083860 1135915
13856 1135915 1424284 1103326 1058916 1146655 1263474 1075523 1220622 848192 1399431 1074838
13846 1074838 727683 938853 1065909 820738 1054948 775128 978760 776324 965624
13837 965624 813409 1259219 719496 859570 838114 1249945 1102858 883163 1272762 920616
13827 920616 1276464 805074 514550 723914 779149 890337 1124581 710701 1012307 692011
13817 692011 964626 727413 1024489 1213015 996353 934249 685972 780283 729549 850219
13807 850219 813151 809180 889077 551802 1047824 490526 881748 824921 637785 860583
13797H60583M1925j90208L26346j64068m9552l6663J66113l09493J17266L26386
13787A088635m15685N5667k51155L83787k5899l22604K03904Q4868J41111J05047
13777A047676m76982K79884m23066J08538L32501B50291L23379L93341N6706m10600
13767F13117O7666J59316C31269N02278j19992j37513M03780j97664O8064D08986
13756G02650J06820J41026k12195Q6904l59404L98134k53155L09338k37097j89724
13746D93297J37689K03248P531J9739j59530l28437J50674J87664p0789J63927
13736H05013j02108j00138K08007q5152K23348j65746j52938J2401p0528L20569
13726H92728l74171Q3660O199K17105k22249O509k67178A48522K25385L08285
$$ plain form
13797 860583 902508 712300 1038646 874578 825026 788363 954476 644983 762249 1088635
13787 1088635 672950 728617 477462 861249 835350 512746 716650 801518 942629 1047676
13777 1047676 570694 850578 427512 536050 868551 250291 573670 967011 1023717 613117
13767 613117 680783 840099 331269 833547 713555 576042 979822 782158 850222 408986
13756 702650 809470 950496 738301 825205 465801 863935 610780 920118 683021 493297
13746 493297 630986 834234 841765 861504 701974 373537 524211 711875 641086 805013
13736 805013 702905 602767 810774 725622 948970 783224 630286 642687 572159 892728
13726 892728 518557 602217 608416 825521 603272 609781 342603 148522 373907 682192
13716F82192m344A14489N81355p0339l11008M17432j17214B94500L7702L03431
13706F35633K37926j39032J37590C95493L7976J96776J02063m988l30909Q3893
13696D80304J58092j47455K37313l19618J93647J84337k11476A54485N05963k27999
13686D32449J8945j1760A68797J65764R9289k09936J64136K42190B86470M0835
13676C27305L42875j46271J27375k63854N2609A45864M69475B75785M11330k23427
13666D63688K58512k1677C30224L1024j29629M60180B76802J64677q570j68457
13656B64452J55458K4890J36372j15591j36443O5089m5029J04581P9408p9777
13646D53410O4610B34674h3242B66858L99322j54076m3148B28535Q3233R4306
$$ plain form
13716 682192 677848 114489 695844 625505 314497 731929 614715 294500 332202 635633
13706 635633 873559 734527 872117 395493 433469 630245 732308 727320 396411 480304
13696 480304 638396 490941 728254 408636 602283 786620 575144 154485 660448 432449
13686 432449 451394 439634 168797 334561 433850 223914 388050 630240 286470 327305
13676 327305 670180 523909 651284 387430 440039 145864 615339 275785 687115 463688
13666 463688 722200 700523 330224 361248 231619 691799 276802 441479 432909 264452
13656 264452 419910 444800 581172 465581 329138 394227 349198 453779 533187 453410
13646 453410 518020 234674 -83242 266858 666180 512104 468956 228535 311768 406074
13636D06074O3714j5010m0256K15372k27575J02143A69904L24892J08658j90176
13626D13278N4822j67859l9629J31392j51556J53312j06953K22745B52158M3296
13616B95454q216j3948b44926C25028N1173G7600N34420K4965B26284K91066r2177
13605D25173j01402J99368k35052Q2138K76376l15443j19293J82910B1369M73487
13595D94856J6481q2013j16269n2605K92016G3760J6778K49061n4950Q6055J07351
13584D78055r2417A16296L1601L56040A19518K30448r472K21594k73436K8280
13574C16932K39146k51455l8648O1434c2600A51185M10274E8820L96012j86949
13564B67883J04240n6359K5336R6204M4898B1865K27666L6136P7014J0558J08839
$$ plain form
13636 406074 469788 454778 414522 629894 402319 504462 169904 494796 603454 413278
13626 413278 468100 300241 260612 392004 240448 393760 286807 509552 252158 295454
13616 295454 287238 273290 -244926 325028 376201 77600 612020 636985 226284 517350 425173
13605 425173 323771 523139 288087 370225 646601 331158 211865 394775 21369 494856
13595 494856 511337 429324 313055 260450 552466 73760 90538 339599 284649 370704 478055
13584 478055 385638 116296 147897 503937 119518 349966 340494 562088 288652 316932
13574 316932 556078 304623 265975 327409 -32600 151185 561459 58820 454832 267883
13564 267883 372123 315764 341100 437304 482202 21865 249531 285667 362681 373239 482078
13553D82078p3612K8052J70336I7937K45802L33834A22932L49036a17280D5928
13542C79846A01283J79319I1240B6695J01671K14570A60965J43999j44733A9809
13531D45668r9345R4344L72252D06275j36712j30772a2184C98244n7958A47855
13520d542B50017A20554O2274R8656J6188J11575r641j65872E7893K22385J11274
13509C91552k0194j33629K44712j62547j52883K51004A99084k0352n8143K68491
13499C89080H6339l7510L45956J80671k03490j33653p3319J21382m5204p0775
13489A70397J11530A09570C7750K61686a42378B15543J18293j20896J48265j12750
13479B48455A05786B7143L55990j78315L1941K40199a22556B11992L8770o87J2994
$$ plain form
13553 482078 408466 436518 606854 97937 343739 677573 122932 471968 -117280 45928
13542 379846 101283 280602 91240 26695 128366 342936 160965 304964 160231 19809
13531 445668 346323 440667 812919 406275 269563 138791 -12184 398244 340286 147855
13520 -4542 250017 120554 182828 281484 297672 409247 399606 233734 57893 280278 391552
13509 391552 371358 237729 482441 319894 167011 418015 199084 178732 120589 389080
13499 389080 86339 48829 394785 575456 371966 238313 164994 286376 241172 170397
13489 170397 281927 109570 37750 299436 -142378 215543 333836 212940 361205 248455
13479 248455 105786 27143 383133 204818 236759 476958 -122556 211992 250762 250075 263069
13468B63069P9217J38366A85383M1605c2186E18953j02800q9996j6970r3381J93185
13457D08991a9255A74219n9780J32061J02232A07626J62564I2692J61589K73715
13447E27996k07977E8815b10608C62610A69958C9129L55948j10274F4936a22856
13436A33928K39605A50289p25K50069J1197a4407B21748m6825K11210A92011R9884
13425B91895J92073B41931j08127A5038L03748I3899L22601M0375A8298K65567
13415B83865A5231K33106a62531A50457G0813Q4522l0936D5001M8983c845A64337
13403B06162J47099I7257L31611o4033A82089K23734j04380F6879J41357o8412
13393A39824R9064J49668j34945B9851J03310J71056A09360m6593K02329j14460
$$ plain form
13468 263069 342286 480652 185383 226988 -32186 518953 416153 326157 309187 215806 408991
13457 408991 -19255 174219 114439 246500 348732 107626 270190 92692 254281 527996
13447 527996 320019 58815 -210608 362610 169958 39129 395077 284803 64936 -122856
13436 133928 373533 150289 149564 399633 410830 -14407 221748 174923 386133 192011 291895
13425 291895 483968 241931 133804 15038 318786 93899 416500 456875 18298 283865
13415 283865 15231 248337 -162531 150457 70813 155335 124399 45001 93984 -3845 164337
13403 206162 353261 97257 428868 364835 182089 405823 301443 66879 208236 139824
13393 139824 238888 388556 253611 29851 133161 304217 109360 62767 265096 150636
13383A50636J6217E830L46892A30581K20375o4844B8600N1459J28277J21047j58339
13372A71044K15053A17013L45949o4573k2591l0881j1772K42450A82412K14380
13362C96792A14564O398l1511a2378l573C15358d8530M616a337C47135p5075O1390
13350C33450f0137B48793J18486h0776C60738j90r3366n8406J04205J85954j82836
13339C16099j23964J1566K26278j09065A51077K32120E8677N61514B00784F8115
13328A61643K32685A94708D1923M87689e6462B00856L4363o7946R75L46033j20748
13317C93533j4413c41329D84697A69577K01765A46557N1088p1352b50107a1625
13306A53366D5101K0835J53966E9941M6723l2675Q7234R3613b72323G5050a29584
$$ plain form
13383 150636 166853 5830 352722 130581 350956 286112 28600 80059 208336 329383 171044
13372 171044 386097 117013 462962 398389 375798 344917 333145 575595 182412 396792
13362 396792 114564 120962 89451 -12378 -15951 315358 -48530 -43914 -1337 347135 272060 333450
13350 333450 -60137 248793 367279 -80776 360738 360548 267182 208776 312981 498935 316099
13339 316099 192135 203701 429979 320914 151077 383197 58677 620191 200784 68115
13328 161643 394328 194708 41923 529612 -56462 200856 235219 167273 168248 514281 393533
13317 393533 379120 -341329 484697 169577 371342 146557 197645 126293 -250107 -11625
13306 153366 45101 65936 219902 59941 106664 73989 161223 254836 -272323 75050 -129584
13294g0141j8875j55135B00969a11446k7605B53311b19846B21396H6671a4164
13283C08923g3561B16823p5038N1529d9701B05301a09707B04433n3425J69483
13273C20491g4789B5891N0872J63432c2868B59204p8434a33301B1872L11270G5545
13261B08699l058K00290d571j85125B17627A04937g6156K6494j54006G3972a55813
13249C27932b0313H6434A4535J66503C3639M44409D126J88429a42707A51616Q9513
13238B41129l7295a49019E3874K05694j23207a64146c5709D05630A61099h8052
13227C06439a97868I2807P3229F4051K00944l6285e7563B84469B9772q29K00336
13216B29279r4353n9588J28565J45866R6795A7244b23748A81636K08953a93992
$$ plain form
13294 -70141 -89016 -244151 200969 -111446 -139051 253311 -219846 221396 86671 -14164
13283 308923 -73561 216823 141785 193314 -49701 205301 -109707 204433 151008 320491
13273 320491 -74789 25891 76763 240195 -32868 259204 180770 -133301 21872 333142 75545
13261 208699 205641 405931 -4571 -189696 217627 104937 -76156 -49662 -203668 73972 -155813
13249 327932 -20313 86434 14535 181038 33639 478048 4126 192555 -142707 151616 241129
13238 241129 203834 -149019 53874 259568 136361 -164146 -35709 405630 161099 -88052
13227 306439 -197868 92807 166036 64051 264995 228710 -57563 284469 29772 28943 229279
13216 229279 134926 75338 203903 349769 446564 17244 -223748 181636 390589 -193992
13205b22220D5953A7652J62591K4490j1313F2362a23007L6474A31236k0364K45393
13194C56265E4217M35099b70807A37014L8413c0707B27934K6880F3285a08905
13183H9174J42959E6146e5657j02912G4086f1838p232O398A19851a858A24481
13171C45591i373r0306B03379J16335A04976b17265G8842R5268A6633a7186B1170
13159E5880b20016c4185A94915n1496e4168A99049b88609A47530e5750C7979f5745
13147a12129M8662G1057J66412n8391c0278B70146C1921a91706G2024L35824B7150
13135B63096A25261L18080B15678C4744g1583A33229a16538j41195B22865D2661
13124h4496C93902j94526b2853j24650D69746c01334A22798n6745d8674J3399
$$ plain form
13205 -222220 45953 17652 180243 204733 193420 62362 -123007 -86533 131236 110872 356265
13194 356265 54217 489316 -270807 137014 175427 -30707 227934 254814 63285 -108905
13183 89174 232133 56146 -55657 -158569 74086 -61838 -69070 -62672 119851 -1858 124481
13171 345591 -9373 -99679 203379 319714 104976 -217265 78842 174110 16633 -17186 21170
13159 55880 -220016 -34185 194915 143419 -54168 199049 -288609 147530 -55750 37979 -65745
13147 -112129 -63467 71057 237469 179078 -30278 270146 31921 -191706 72024 407848 27150
13135 263096 125261 443341 215678 34744 -71583 133229 -116538 -257733 222865 42661
13124 -84496 393902 199376 -22853 -147503 469746 -301334 122798 66053 -48674 -35275
13114c5275A30764c0020l11023b4546j49100A28034a63695A88616q2762d6898
13103A26766E4092g360A41504L36764d990F5009h9582j96001k991A66927l1815
13092A35112B9421P6695g3220A76484a76579G2814J76624n1983A6468L34311q1957
13081B68822a19180a7538A81065a53536C30149E5170a72131C849O4868c4490A17005
13069d5080a0440E2601L13726c2828A81151E6252J28514H4461O8372j7405d3456
13057A86374b2880C25272j55207J25053C6519f3564B44494G6139i7363c9062A23046
13045F6407q493B7081b27325B30197J53270j79443a43723A50225a7986B61911
13034E2346N872k7777N1969a22762C12356J33215A49871b01726D71935B23125
$$ plain form
13114 -35275 130764 -30020 -341043 -24546 -173646 128034 -163695 188616 105854 -46898
13103 126766 54092 -7360 141504 478268 -4990 65009 -89582 -285583 -288574 166927 135112
13092 135112 29421 106116 -73220 176484 -176579 72814 249438 197455 16468 350779 268822
13081 268822 -119180 -17538 181065 -153536 330149 55170 -172131 3849 68717 -34490 117005
13069 -45080 -10440 52601 366327 -32828 181151 56252 184766 84461 152833 135428 -43456
13057 186374 -22880 325272 170065 295118 36519 -63564 244494 76139 -97363 -39062 123046
13045 66407 57914 27081 -227325 230197 383467 204024 -143723 150225 -17986 261911
13034 52346 58218 30441 82410 -122762 312356 445571 149871 -201726 471935 223125
13023d6455j20378H4489C7829g768A13844J8275Q7901L2080b18971F5358a6564
13011A72186c9178J8345G5556Q4981J74971d5279n936q140o9931A53209E5567
12999B8477J64146J46362A19136n0257i7145m4108N8202B93338o060a22896I6811
12987A08509a21463A73967K24876D1067a60528O5149p5837A06878J10413J79182
12977C96473A07091j2613B5163a4639l14553J46471A8534O6975K90629D1402B197
12965b02014b3782B57401q8390E6654c72B11320e0894l41471A25016K55522b43235
12953F9489J58048H6987c3464k18535C0725a25628A87634O260i657A52120O9210
12942B21330o5012c1989H921J70013a83673f8560B76438d8320A37554a04244D49718
$$ plain form
13023 -46455 -166833 84489 37829 -7768 113844 132119 220020 252100 -218971 65358 -16564
13011 172186 -39178 -20833 75556 160537 335508 -45279 -51215 -59355 -129286 153209 55567
12999 28477 192623 338985 119136 68879 -97145 -141253 -83051 293338 287278 -122896 96811
12987 108509 -121463 173967 398843 41067 -160528 -95379 -171216 106878 217291 396473
12977 396473 107091 94478 25163 -14639 -329192 -182721 18534 85509 376138 41402 2197
12965 -202014 -23782 257401 169011 56654 -372 211320 -50894 -392365 125016 380538 -243235
12953 69489 227537 86987 -33464 -251999 30725 -125628 187634 193894 -9657 152120 221330
12942 221330 156318 -31989 8921 178934 -183673 -68560 276438 -48320 137554 -104244 449718
12930b5893C54842A59293K00347d0777A21988a14801m53675C45799F1207J45816
12920B07023a81280D25918C6819Q3054R2066G0453A4246R9412d5718r4118A23541
12908B1402c61659J21126B23097c1318A433N6369e897j40215A98902E1019G575
12896B56901i4330l48004a38169j00570A07687B3236e5655k03769B86682d9220
12885B92144h6101J4730j38440B6387a33608L1438H0838k9520O8082b766A79420
12873I9930c05001G8609J75453A2473J74619E5542J6851J10722b95349A3087a60012
12861a0957A07747c21175a59473N5932b4695l63112B05751o7272J82363o2099
12851B58743G1985d91849a8521A03230J18998i5561M1527F939e6387j19963B67265
$$ plain form
12930 -25893 354842 159293 359640 -40777 121988 -114801 -568476 345799 61207 207023
12920 207023 -181280 425918 36819 119873 211939 70453 14246 113658 -45718 -139836 123541
12908 21402 -361659 -240533 223097 -31318 1433 57802 -5897 -146112 198902 51019 7575
12896 256901 -94330 -442334 -138169 -238739 107687 23236 -55655 -259424 286682 -49220
12885 292144 -86101 -71371 -209811 26387 -133608 -102170 80838 51318 119400 -2766 179420
12873 99930 -305001 78609 254062 12473 187092 55542 72393 183115 -295349 13087 -160012
12861 -10957 107747 -321175 -159473 -103541 -24695 -387807 205751 138479 320842 258743
12851 258743 71985 -491849 -18521 103230 222228 -95561 -54034 6939 -56387 -176350 267265
12839f6407j34596d4792j8395a8811j43610B24969a87496A07083J17016h3273
12828B44894r449f097j62204i278j30825J7435d4057I9655i1717C33776j19553
12817B14223G2129A4836J37894K0304a73248B86726a70929N9296A04232a44328
12806C25914a15936E3060L5000h33H8019a68145M6830G936f9381F7772c9751n2665
12794i2416A4790a942C6700R1118a58593N8335J3221J666a0862r497C00638j40225
12782A60413B4075a10914I9376K21526G9316a7768F7187j0701f4468j14460c048
12770I7005R9688a1396C1464J82533m8143j995b30903A7005b77032A41048J20214
12759B61262f8149o1395A18453c01846J50389J4665d3419j37008a8481b324A47843
$$ plain form
12839 -66407 -201003 -44792 -63187 -18811 -162421 224969 -187496 107083 224099 -83273
12828 244894 235445 -6097 -168301 -9278 -140103 -122668 -44057 99655 -91717 333776 214223
12817 214223 72129 14836 152730 173034 -173248 286726 -170929 -111633 104232 -144328
12806 325914 -115936 53060 88060 -833 88019 -168145 -121315 7936 -69381 67772 -39751 -92416
12794 -92416 14790 -1942 36700 127818 -158593 -100258 -87037 -85371 -10862 -20359 300638 160413
12782 160413 24075 -110914 99376 320902 79316 -17768 67187 56486 -64468 -178928 -3048
12770 97005 196693 -11396 31464 213997 165854 163859 -230903 17005 -277032 141048 261262
12759 261262 -68149 -129544 118453 -301846 -151457 -136792 -43419 -180427 -18481 -2324 147843
12747C67232b94733r9606C37528a00197A3973a45242N6084j69148A3469a48246
12736A34842d9743r6498H800J68478m6455a71044G1765M0873O7416a69972m3163
12725b13135i1979C65623A00304d1235k07472C5620K95313C8111O3533b11386
12714C00772g1907n0542e5230A73349h2380A17528Q9673K5822p9734N8644K3169
12703B35102Q3596J12796a18525G0293P4767N2139K05238R5638A20425g8084G4818
12691a61210E1885c35961L1112i6351H8445N4766N0128H0448a23954d5628B82942
12679A44168Q7682G7881b06375i6135B77524a27315N4611r3279D02305a61575
12668B437g9580q247j07706A81399E9329a70517e1074D16296a55325A92454M9864
$$ plain form
12747 367232 -294733 -394339 337528 -100197 13973 -145242 -89158 -258306 13469 -148246
12736 134842 -49743 -146241 8800 177278 130823 -171044 71765 112638 180054 -169972 -213135
12725 -213135 -91979 365623 100304 -41235 -248707 35620 330933 38111 101644 -211386
12714 300772 -71907 -122449 -55230 173349 -82380 117528 207201 233023 153289 211933 235102
12703 235102 318698 431494 -118525 70293 145060 197199 402437 498075 120425 -78084 74818
12691 -161210 51885 -335961 -304849 -96351 88445 143211 193339 80448 -123954 -45628 282942
12679 144168 231850 77881 -206375 -96135 277524 -127315 -72704 -165983 402305 -161575
12668 2437 -79580 -87827 -195533 181399 59329 -170517 -51074 416296 -155325 192454 242318
12657B42318p5390n3701b1706j34518B02446P7141A4847L96666j68078b15114
12646A50090E1178d0711j41757b1082A39603J00086f1418B5049J33481a74906
12635A80854m5598P4198g3724B99759q7406l1061p8379B0779K84605q7191J30862
12624C49055b54599P516C83261B1584K75454c3898C09017c22072E7400K54862
12614C12262F5140i3824B04117H4757a6687B90378a37989h017J241j4224C8829
12602B277L27743a96950C5456J00392J86717p5439a7341A53703J40162D5032a25286
12590D387K2615c1983k1615B18485j9380a36193B4656J67288h8916O542n7966
12579a40340H5337c17691P9794B65265b41366D6787Q894b5693I663J03541k4385
$$ plain form
12657 242318 166928 113227 -21706 -156224 202446 279587 14847 411513 243435 -215114
12646 150090 51178 -40711 -182468 -21082 139603 239689 -61418 25049 158530 -174906
12635 180854 135256 209454 -73724 299759 212353 181292 102913 20779 305384 218193 349055
12624 349055 -254599 -247083 383261 21584 297038 -33898 309017 -322072 57400 312262
12614 312262 65140 -93824 204117 84757 -16687 290378 -137989 -8017 -6776 -21000 38829
12602 2277 330020 -196950 35456 135848 322565 247126 -17341 153703 293865 45032 -125286
12590 4387 27002 -31983 -53598 218485 199105 -136193 24656 191944 -88916 -82374 -140340
12579 -140340 85337 -317691 -237897 265265 -241366 46787 55681 -25693 9663 113204 88819
12568H8819g8747a4380A74902b43796A22979f462B47725c8671I2608m3887c01833
12556c81068A60382g3510G0992a48293O0362p4558A89968r3737R0005a35633F6535
12544D20416A92179E4313b26271B0865Q0126K16595l0224r0014G3161a70901F189
12532H7781b0192B90010j2534H7297B7387b44568B54077a43039L3957G0159R9119
12521A69278f4125A67274m3829E2920a33131A71139a02994k16550A15617m7624
12511F7993a92344h3496c7519a6130j3285m14599K21930A09877k8134K07577f2307
12499b08567A38497a37964A7193J74050c36517d9899b0147A75045E6926N10A293
12487a51514e6573J3205F5128d64626g195A00259d1253k12393a0121E5323M9009
$$ plain form
12568 88819 -78747 -14380 174902 -243796 122979 -6462 247725 -38671 92608 48721 -301833
12556 -381068 160382 -73510 70992 -148293 -87931 -162489 189968 96231 186236 -135633 66535
12544 420416 192179 54313 -226271 20865 100991 317586 287362 197348 73161 -170901 6189
12532 87781 -20192 290010 277476 87297 27387 -244568 254077 -143039 -109082 70159 169278
12521 169278 -64125 167274 123445 52920 -133131 171139 -102994 -319544 115617 67993
12511 67993 -192344 -83496 -37519 -16130 -29415 -444014 -222084 109877 81743 289320 -62307
12499 -208567 138497 -137964 17193 191243 -336517 -49899 -20147 175045 56926 57436 1293
12487 -151514 -56573 -43368 65128 -464626 -7195 100259 -41253 -253646 -10121 55323 104332
12476A04332b74846i8288B78228c25842A96376c43762A05831h2952b8933k04159
12466b33092J02514f3613l18278e3316A28273D8383e6484A94500a12508D3504
12455i755j86977P2105D958J02393b28307K5598C9069b43752e7088A06275c4899
12443B80803j07250C6791i238m7377n5380A22109K61929G4747B9266a61369L5209
12432a26160C9257c80323i1128E6620J87673a55383C6332h5621D1994J45376d1931
12420a01134o6606B54536d4105k46718B6303J83837J6880b56279j9049j07651
12410c82979B27486b95668f8871C03465j30702P7407a22005A95159j3088E1437
12399C9643j9420K75254g9538G6718L7047h3563G1675l1062e6474B75450F8813
$$ plain form
12476 104332 -274846 -98288 278228 -325842 196376 -343762 105831 -82952 -28933 -233092
12466 -233092 -130578 -63613 -381891 -53316 128273 48383 -56484 194500 -112508 43504
12455 -9755 -196732 -124627 4958 107351 -228307 -202709 39069 -243752 -57088 106275 -34899
12443 280803 173553 36791 -9238 -56615 -111995 122109 384038 74747 29266 -161369 -126160
12432 -126160 39257 -380323 -91128 56620 244293 -155383 36332 -85621 41994 187370 -41931
12420 -101134 -167740 254536 -44105 -290823 26303 210140 227020 -256279 -275328 -382979
12410 -382979 227486 -295668 -68871 303465 172763 250170 -122005 195159 182071 51437
12399 39643 20223 295477 -79538 76718 113765 -83563 71675 40613 -56474 275450 68813
12387F6510a81841c9662E8690R6054K8012a70506C55620H1439f5933c2612g923
12375G5780A3867a39532h855k47283C5500c9538A24799c98268a80147B73690g3020
12363a64990A19977b33878h4664r1950B14429h4580A77218q0400e6697k92314
12353c49011O1646a43519m7789L6033K8969B70235K12474G6676K22332A8508b5503
12341a07076h467G2547b91442G3778e6072a0506j69020M7813D4621J25271b69424
12329A70532J23264A3109b8574Q655k76265h2028B806K00918D8435J29085H7043
12317a12089C2723a83578g1878j1998b7699n7934o1519A16807L7318q981D6303
12305B84M47691e2065l29612J16516I1024l8212B2155L1585J74434a7587n54302
$$ plain form
12387 66510 -181841 -39662 58690 154744 182756 -170506 355620 81439 -65933 -32612 -7923
12375 75780 13867 -139532 -8855 -256138 35500 -39538 124799 -398268 -180147 273690 -73020
12363 -164990 119977 -233878 -84664 -176614 214429 -84580 177218 96818 -56697 -349011
12353 -349011 -287365 -143519 -191308 -155275 -126306 270235 482709 76676 299008 18508 -25503
12341 -107076 -8467 72547 -291442 73778 -56072 -10506 -179526 -131713 44621 169892 -269424
12329 170532 293796 13109 -28574 -19919 -296184 -82028 2806 203724 48435 177520 87043
12317 -112089 32723 -183578 -71878 -83876 -27699 -85633 -147152 116807 154125 145144 46303
12305 284 447975 -52065 -381677 -265161 91024 52812 22155 53740 228174 -17587 -571889
12294e71889e2059A89253c0956B5229a70896f4569b9368o5584B43766h4945B17618
12282F0811c9648B4768P37g9257A29626Q8199l1940a47879C2132a38102f5886
12270a33217D8241a08859B18237M4285o9318P5993c4290a3811J670H7497J55033
12259B42530b63638h3632A55493m0493b526k86408e5600n7945e4566A89173g2227
12247B66474a66799D53534J4404b18327M0203A37005M1534a91695A10717J38256
12237B48973I6464J19371a02349H8207B2673j0249A398L15622j54318P0347B666
12225A03512L06271A90553Q3160J59570L2908J21945k41560F2154K93272a19878
12214E180K99414d7923j66713A9126f4089p5933B89031A40657B9950i032C3040
$$ plain form
12294 -571889 -52059 189253 -30956 25229 -170896 -64569 -29368 -94952 243766 -84945 217618
12282 60811 -39648 24768 25505 -79257 129626 217825 185885 -147879 32132 -138102 -65886
12270 -133217 48241 -108859 218237 262522 193204 269197 -34290 -13811 -12141 87497 242530
12259 242530 -263638 -83632 155493 115000 -2526 -288934 -55600 -113545 -54566 189173 -72227
12247 266474 -166799 453534 467938 -218327 -178124 137005 178539 -191695 110717 248973
12237 248973 96464 215835 -102349 88207 22673 12424 1398 317020 162702 233049 2666
12225 103512 409783 190553 273713 433283 466191 588136 346576 62154 355426 -119878
12214 5180 304594 -47923 -214636 19126 -64089 -140022 289031 140657 29950 -9032 33040
12202A19327b42439a19071B9430a29898D44640N0386H4707R928O6060p4525j7626
12191F8544J18494l9058B2091a12915B28516B7477K11880j17619a8918k936G6260
12179B30837c178j26157B11104F4726K46538N7376a14783B12761b01733b7719
12168A28068b26267F8191J85174j04175a1568C80070a42025F9852J60583f2294
12157i7882E12808E6380J82171b75269C26178F4982e6488A48318k0130c44132
12146D12044b115B29052a85045e7512l4496d792q5507G2964C2088a9407B7911
12134e3956a4158j89858A67517a8591E9842M48046a71950A77683b27470B80366
12123a8866A75634F4282O8625f5869B18231g7458a1788q2370F3753a98720A288
$$ plain form
12202 119327 -242439 -119071 29430 -129898 444640 495026 84707 94635 160695 86170 68544
12191 68544 187038 147980 22091 -112915 228516 27477 239357 121738 -18918 -21854 76260
12179 230837 -3178 -129335 211104 64726 311264 368640 -114783 212761 -201733 -27719
12168 128068 -226267 68191 253365 149190 -11568 380070 -142025 69852 230435 -62294
12157 -97882 512808 56380 238551 -275269 326178 64982 -56488 148318 128188 -344132
12146 412044 -2115 229052 -185045 -57512 -92008 -4792 -90299 72964 32088 -19407 27911
12134 -53956 -14158 -204016 167517 -18591 59842 507888 -171950 177683 -227470 280366
12123 -18866 175634 64282 132907 -65869 218231 -77458 -11788 -94158 63753 -198720 1288
12111G9593g9032A55045J70932a95869A80669e550A47199b53786d3690B43854
12100A31967K3093a68098B31162a52260d9937B41765a7506B3223O6403b52569
12089b08204D3199b19507E9041K49778a84575A42512D3793a5381G2400K4914f3423
12077i1136R744j17827H776N50859J398349p07147A68932L19632F978i91k78286
12066b79277L7804A28481g7776N506D8262K5597a4702B49561b99472H5937a350
12054A46759c82907A0234g6079k14265H5217m700a34863A59148K02539b48236
12043b06573G6702a11233j79251a29634A978K9611a03712G8573l3631g3473p5539
12032a49012O2559A61411d1761E6312i8056a9308l18818E3437B2253K11240a40260
$$ plain form
12111 79593 -79032 155045 325977 -195869 180669 -5550 147199 -253786 -43690 243854
12100 131967 155060 -168098 231162 -152260 -49937 241765 -17506 23223 89626 -252569
12089 -208204 43199 -219507 59041 308819 -184575 142512 43793 -15381 72400 97314 -63423
12077 -91136 -81392 -199219 8776 559635 1957984 1250837 168932 488564 6978 -991 -279277
12066 -279277 -241473 128481 -77776 -72270 48262 73859 -14702 249561 -299472 85937 -1350
12054 146759 -382907 10234 -76079 -290344 85217 80517 -134863 159148 361687 -248236
12043 -206573 76702 -111233 -290484 -129634 1978 31589 -103712 78573 44942 -73473 -149012
12032 -149012 -86453 161411 -41761 56312 -98056 -19308 -338126 53437 22253 233493 -140260
12020F0424O1663b86756I1022l8081c80523B46459g8297b2117e37l46479A89239
12008c1605m81450F7611Q1343a88412B60555m9887e6825D5756a06265o2144C3530
11996B3326M6738a70166A52574a62260A41134C5329K4803j1569h620k07827f067
11984a1945A10638b86691d7386A63209k8319b39936l1141h1106j25859D1496a23494
11972b77886d1244A7803a00398k16809e7361l0142A76628b8661H6896c7748I394
11960A9449i4706B56988e3289J9486j68798g6642A24611a62013A38878R3705A9362
11948a03435g184E7008f3078j34993F3874g4755b1789A03787k1895F185a29568
11936B58650b52360o4318a29673j03876q5863B5917J73613M1567d9261k4120b6456
$$ plain form
12020 60424 122087 -286756 91022 52941 -380523 246459 -78297 -22117 -537 -347016 189239
12008 -31605 -513055 67611 148954 -188412 260555 210668 -56825 45756 -106265 -168409 33530
11996 23326 70064 -170166 152574 -162260 141134 35329 60132 48563 -8620 -216447 -6067
11984 -11945 110638 -286691 -47386 163209 134890 -239936 -271077 -81106 -206965 41496 -123494
11972 -277886 -41244 17803 -100398 -317207 -57361 -87503 176628 -28661 86896 -37748 9394
11960 19449 -94706 256988 -53289 -33803 -202601 -76642 124611 -162013 138878 232583 19362
11948 -103435 -7184 57008 -63078 -198071 63874 -74755 -21789 103787 81892 6185 -129568
11936 258650 -252360 -316678 -129673 -233549 -319412 25917 199530 241097 -49261 -73381 -26456
11924D2076j1815Q4004a46273k050q4261C47350A13197b33324F7250R8267Q1974
11913B47491A0736c65596a34465A15426n0408h5886o3681c2480j50784B43220
11902A19020j7413e5234I0929a3739l39961J50354E9868b31732a07180A06854
11891a73483d9778A25227K6559b36644A08147C2124d6760K0490j04365J5804a0843
11879c67936B2772b02640c6028k16659c6879A66376d21414A32905d09406J46098
11869b63308I9292f0700J7728j83771L8521B2058a61347A62541a8974G8177b68125
11857g6476J7551j3338j99679g317E1410a70208N2552j07099O6943A84935m5594
11846A39341b28293f8411j97553B02587b22212N1535P4441I604f7450K4492G6180
$$ plain form
11924 42076 30261 114265 -146273 -148323 -232584 347350 113197 -233324 67250 165517 247491
11913 247491 10736 -365596 -134465 115426 65018 -85886 -149567 -32480 -183264 243220
11902 119020 101607 -55234 90929 -13739 -353700 -203346 59868 -231732 -107180 106854
11891 -173483 -49778 125227 151786 -236644 108147 32124 -46760 -26270 -130635 -114831 -10843
11879 -367936 22772 -202640 -36028 -252687 -36879 166376 -421414 132905 -409406 -263308
11869 -263308 99292 -60700 -42972 -226743 -188222 22058 -161347 162541 -18974 78177 -268125
11857 -76476 -58925 -72263 -271942 -7317 51410 -170208 -117656 -224755 -157812 184935 139341
11846 139341 -228293 -68411 -265964 202587 -222212 -170677 -96236 9604 -67450 -42958 76180
11834b30082A91731h0060j64492m6961r228d2526A78534c28093e513k65389O8672
11823b02230b0931k50906k55750C16812A24930N507b5030k66042C0428a47319
11812I596a42102b6958A89442B1482h6602L9269o4839P953q4819g2963B63762
11800I8379c1837j39179O7646r7655R5731A10920E1258j3099M8356a37568B5943
11788D5991a36487A26456a33369B2345J48094a59855g9819C00433j05761c94450
11777c4661l3996o9358D2603K6817A0710i7773J6804A53238a12297j03137A20104
11765A64647J1758o2881b05342Q0163j15195a08353A39424J72822E4448Q489a15005
11753a39592B09020A0181L07801k0210F7674a45032B74151b32392p116A15127
$$ plain form
11834 -230082 191731 -80060 -244552 -291513 -300741 -42526 178534 -328093 -5513 -270902 -202230
11823 -202230 -20931 -271837 -527587 316812 124930 130437 -25030 -291072 30428 -147319
11812 9596 -142102 -26958 189442 21482 -86602 -47333 -112172 -104219 -189038 -72963 263762
11800 98379 -31837 -171016 -103370 -201025 -105294 110920 51258 38159 86515 -137568 25943
11788 45991 -136487 126456 -133369 22345 170439 -159855 -79819 300433 194672 -394450
11777 -34661 -68657 -138015 42603 69420 10710 -97773 -80969 153238 -112297 -215434 120104
11765 164647 176405 113524 -205342 -125179 -240374 -108353 139424 312246 54448 62937 -115005
11753 -139592 209020 10181 317982 297772 67674 -145032 274151 -232392 -239508 115127
11742D4491e8626A39225e472k11482E3952J16670l3179k6370i371m58046c0736
11730a8B11913F9877J22850c8708A75013a83971A75421b55122J11197C69961a88232
11718A30201e6747C1640K4977J48316b0791I6315i9335B77209j37866c34067B15241
11706b10700e7986A79751q9493h7026o453A8659b4895o3864c3573j02665a0337
11694b578j15331Q569B0065c6648A68554k8801B0835J5955K27642A27750f1604
11682c76146J40530m4862m5668a7698A07152k8332b43654A78492a72135K8146
11672a43989q1647E4972j9512h0174j15946J9419I3014Q2388c980B37096r7823
11661A39273f4275K0685e830p403B00884c894k5199p5366B45371b6027D1303b96475
$$ plain form
11742 44491 -58626 139225 -5472 -216954 53952 170622 137443 111073 -9371 -467417 -30736
11730 -18 211913 69877 192727 -38708 175013 -183971 175421 -255122 -143925 369961 -188232
11718 130201 -56747 31640 56617 204933 -20791 96315 -99335 277209 139343 -334067 215241
11706 -210700 -57986 179751 90258 -87026 -93479 18659 -24895 -88759 -33573 -136238 -10337
11694 -2578 -117909 -109340 20065 -36648 168554 139753 20835 36790 264432 127750 -61604
11682 -376146 -235616 -280478 -326146 -17698 107152 78820 -243654 178492 -172135 -143989
11672 -143989 -225636 54972 35460 -80174 -196120 -176701 93014 175402 -3980 237096 139273
11661 139273 -64275 -43590 -5830 -13233 200884 -3894 -29093 -104459 245371 -26027 41303 -296475
11648a02334d4361k47141a43626A58483l9404c46716C6771b61900b246A36397
11637b468j00088M9789d466o1978C19370a52662F1103k4563b5103j75770A57793
11625G9593L81752A82884a18521a1341D01112b0854I3849O313D5955a04640C67271
11613c51922A2795J05461a71179q30j93944B58574J0317e0185H6521a55491p8068
11602b33559J10914A4511a37574B21545c6777j47288J9473A69509i7982B16051
11591a3314A24299R1128A1916b01201l4871a6215C06789A40927J23490A06140
11580I3967b98925C53496D0196f0106E6638a1864C527L47832b88494A05550m968
11569A00582P7699M8588J28205L0281A10707c3184Q424p6432A92773l7528N9735
$$ plain form
11648 -102334 -44361 -291502 -143626 158483 119079 -346716 36771 -261900 -2246 136397
11637 -2468 -102556 -52767 -4466 -66444 319370 -152662 61103 36540 -25103 -200873 157793
11625 79593 461345 182884 -118521 -11341 401112 -20854 93849 100162 45955 -104640 367271
11613 -351922 12795 118256 -171179 -172009 -365953 258574 268891 -50185 86521 -155491 -233559
11602 -233559 -122645 14511 -137574 221545 -36777 -184065 -164592 169509 -97982 216051
11591 -13314 124299 215427 11916 -201201 -236072 -16215 306789 140927 264417 106140
11580 93967 -298925 353496 40196 -60106 56638 -11864 3527 351359 -288494 105550 100582
11569 100582 178281 226869 355074 385355 110707 -33184 -24760 -101192 192773 155245 214980
11558B14980K01266B03241h0120B13090d4610o6489B12818o5686I056N4688L79854
11547D43598C6550L7475l6202d0528F6252J70988a74954a4240j91856J6095D34235
11535D4273A8862b12041A46743m1110c36137A90432q1742a37990e6929A48713
11524h3595D45142A49791E1302a7668A12919i429A16974b19152B12209P752J229
11513B21190J27739A22678K5312R6135j5509A74J4724L65056a54007k4983k61232
11502d40222C30602d36716A17274h3688A07796f3616C96084a74637K459C12359
11491H7813C0123M19361B08510I1735N274l4520j3237c4055B71698c7518J7722
11480a9796B83504b2225m3288p5043N1688B75183H4782A934b615A69856p9381
$$ plain form
11558 214980 416246 203241 -80120 213090 -44610 -111099 212818 147132 9056 63744 443598
11547 443598 36550 74025 37823 -40528 66252 237240 -174954 -14240 -206096 -190001 434235
11535 44273 18862 -212041 146743 105633 -336137 190432 108690 -137990 -56929 148713
11524 -83595 445142 149791 51302 -17668 112919 -9429 116974 -219152 212209 219961 221190
11513 221190 348929 122678 147990 244125 228616 174 14898 379954 -154007 -178990 -440222
11502 -440222 330602 -436716 117274 -83688 107796 -63616 396084 -174637 -172178 312359
11491 87813 30123 449484 208510 91735 97009 62489 49252 -34055 271698 -37518 -19796
11480 -19796 283504 -22225 -65513 -140556 -88868 275183 84782 1934 -2615 169856 90475
11469I0475J05956N1668k3652K90584D4811L06909a58277E6910J9920a56102A45851
11457B5490J3364J33814h5399E4902J30415j5390a32268q5012B8699Q8156h2460
11445H1287c1090n3636j64103A62500b25l8813e707l6190F834P6729i7711p064
11433a04775k49945P3620J13242F9640J0533Q1303B3100j548L49161o3578F2303
11421B57472I1742i8829A00688J29733h6851B61513I4324J35231a07568G660d5836
11409D04724c95638C9070g0843j46302g0125F4173P6746a34070M330E5341d5498
11397A52079A1434K21804M1593K8857A5034K41867i4031A56445P2473c77289a4839
11385A45900a42457E12279E252R0301g6352B28234A4383b3086j77095B25912o5377
$$ plain form
11469 90475 196431 248099 224447 515031 44811 351720 -158277 56910 76830 -156102 145851
11457 25490 38854 172668 -85399 54902 185317 169927 -132268 -217280 28699 116855 -82460
11445 81287 -31090 -84726 -248829 162500 -225 -39038 -5707 -41897 6834 83563 -97711 -104775
11433 -104775 -354720 -281100 -167858 69640 80173 161476 23100 21552 370713 307135 62303
11421 257472 91742 -98829 100688 230421 -86851 261513 94324 229555 -107568 7660 -45836
11409 404724 -395638 39070 -70843 -217145 -70125 64173 140919 -134070 -129740 55341 -45498
11397 152079 11434 233238 274831 303688 15034 256901 -94031 156445 228918 -377289 -14839
11385 145900 -142457 512279 5252 95553 -76352 228234 14383 -23086 -200181 225912 160535
11374A60535o5569O5548b0632l32004e6727A00125a44029A83039A0742b87903
11363a18237E9944Q3095d44633a47020B11311N467a70116d1943j9513o2773B21349
11351a41188I9166C3789b24632D6848b70311B00890F2409L8429K10065b7941j1012
11340c8953J0762B50377F9435f1143A88470H6025a15055j14292A66215b4388B61449
11328A54671a01116d9915A2377C653J11517b11527c0331B14807q595Q4184j35031
11317A55365J68050f4349B83711d30795C00358a29053a5822M057G3481b84389
11306d0100j66527g958F8104a6499A0000M0543j5368b37779b4450C5691K03771
11295B39462a31923a141A11724B7645b36716k6566J14942o3352J1099j29127B3206
$$ plain form
11374 160535 94966 160514 -20632 -352636 -56727 100125 -144029 183039 10742 -287903
11363 -118237 59944 143039 -444633 -147020 211311 216778 -170116 -41943 -61456 -124229 221349
11351 -141188 99166 33789 -224632 46848 -270311 200890 62409 100838 310903 -27941 -38953
11340 -38953 -28191 250377 69435 -61143 188470 86025 -115055 -229347 166215 -24388 261449
11328 154671 -101116 -49915 12377 3653 115170 -211527 -30331 214807 206212 290396 155365
11317 155365 323415 -64349 283711 -430795 300358 -129053 -15822 -11765 73481 -284389
11306 -40100 -206627 -7958 68104 -16499 10000 50543 35175 -237779 -24450 35691 239462
11295 239462 -131923 -1141 111724 27645 -236716 -263282 -148340 -211692 -200593 -329720 23206
11283c9627j8243J3329o8168D7908j0193g3743p1662D6567K0543b36841J1633
11272b25208f1197C26083b28192f2624j78344q7866A75330b74780C1096b19887
11261A25822J35018p7749o0442e0255F6998f6416b1869q7984j1185I0122J3640
11250A03762B5969a10132j32987P6453M0677j20793C245a130k06398e8596n8727
11239a17323a5429F498c31907F280a68776A3228i543j46451D8679b1405l2081
11228e3486A71372c9779m11448A505M6821d7868o5527o7476n8756J0711F6527
11216D2721L5850a5430k65205I2945a90500C4795a16088A59061c73431g9649k45739
11205c25388a00774b8712A24334J28366a61638g6827K7077l2858c3744D2177R6395
$$ plain form
11283 -39627 -57870 -44541 -112709 47908 37715 -73743 -145405 46567 67110 -236841 -225208
11272 -225208 -61197 326083 -228192 -62624 -240968 -328834 175330 -274780 31096 -219887
11261 125822 260840 183091 122649 -50255 66998 -66416 -21869 -109853 -121038 90122 103762
11250 103762 25969 -110132 -243119 -166666 -125989 -246782 3245 -1130 -207528 -58596 -117323
11239 -117323 -15429 6498 -331907 6280 -168776 13228 -9543 -155994 48679 -21405 -53486
11228 -53486 171372 -39779 -451227 1505 48326 -47868 -113395 -180871 -239627 -228916 66527
11216 42721 78571 -15430 -280635 92945 -190500 34795 -116088 159061 -373431 -79649 -325388
11205 -325388 -100774 -28712 124334 252700 -161638 -76827 -49750 -82608 -33744 42177 138572
11194A38572l0100a93697Q3976a3778j17882n7324j2328a9396m3025A3130b14571
11182g5175G5736a19216p2108R0744D9257J66670C6013J8970b26918F1659a91767
11170i2303b6971j0983K991c893E462e8547m5128d3164A23519g2536H5473f3179
11157A70868J9746a39333j43349a34757d986B63737b36139B36824n2698a10791
11146e1761A541K87203A13849K5141M1063a8814j80812A3564a5879q5480j32898
11135b34257E7039J98372H5403J52612a25232j9098B20350c07412A12929o496
11125A06433L13283h9581l50634a47997C53671h8790m3293B893L1546c4794H0858
11113B67372j32818i0806j87370R8743C8004K46565N794n4214B0162K89140H9123
$$ plain form
11194 138572 108472 -193697 -109721 -13778 -131660 -188984 -201312 -19396 -62421 13130 -214571
11182 -75175 75736 -119216 -191324 -100580 49257 215927 36013 54983 -226918 61659 -191767
11170 -92303 -26971 -37954 -34963 -3893 5462 -58547 -103675 -43164 123519 -72536 85473 -63179
11157 170868 190614 -139333 -282682 -134757 -4986 263737 -236139 236824 184126 -110791
11146 -51761 1541 288744 113849 138990 180053 -18814 -199626 13564 -15879 -101359 -234257
11135 -234257 57039 255411 85403 238015 -125232 -144330 220350 -307412 112929 106433
11125 106433 419716 -89581 -440215 -147997 353671 -88790 -132083 2893 34439 -34794 80858
11113 267372 134554 -90806 -278176 -179433 38004 284569 290363 236149 20162 309302 89123
11101b1463C00468L7580F147a229p3034A45864J17288q2775J57623h4860D992
11089E13023A80991q3765J94551j2577e2265A66939K52414D5853j7549K33350
11079B61654j28111L4740L14436B26237K0362A02363Q3448n5272n0076K57732
11069C38195j46834n0368J3842L37222A68725q18J46514O7547R3558j64340p3261
11058B37925J69584K88519B85613J38899M75676k59370J33897Q8172j49988O5367
11048G78266l38651L1963J54512J15811J50093B45105L65060n4732m9499K32248
11038G38182N3019M0612j44259N2016j10108J76940k89121k4423j8589M1772K00307
11027G16348o9354J26230P290j21325l13585J78038j69179M43627j54558B56622
$$ plain form
11101 -21463 300468 338048 6147 -1229 -74263 145864 263152 180377 338000 -84860 4992
11089 513023 180991 97226 291777 279200 -52265 166939 419353 45853 28304 261654
11079 261654 133543 168283 482719 226237 246599 102363 185811 130539 80463 338195
11069 338195 191361 140993 154835 492057 168725 167907 314421 381968 475526 311186 237925
11058 237925 407509 696028 285613 424512 900188 640818 774715 862887 712899 778266
11048 778266 439615 471578 626090 741901 891994 245105 610165 555433 505934 738182
11038 738182 791201 831813 687554 739570 629462 806402 517281 492858 474269 516041 716348
11027 716348 646994 773224 780514 659189 345604 523642 354463 798090 643532 256622
11016I85794l34877j16198J88756j62823n8368N5818j04802j24146J77806j18137
11006C88823L93052k02801k4162r3671R9960j63938M60558M2692j22334l54887
10996D23292L62661j44033R2082j51929j71031L27680p0247j00713j52307K80824
10986F96279Q7931j4284L04293k05068J34381K65861j69120O4965k9695L47037
10976A482580J16848p6857M28143J28545O75823k63160L44201j49078j31486j07464
10966B448095j56869n49687j43150j02473L72615m85174J27478Q7927j31000M57381
10956A925143p25339K73967m5805j49661j96l53652q4588r9724j31759l3422k62529
10945C12435l7345n1508A08810L39243j92183P6716A54692a16454A32007M1202
$$ plain form
11016 985794 650917 534719 723475 560652 502284 558102 453300 329154 506960 388823
11006 388823 781875 579074 554912 461241 561201 397263 857821 900513 778179 423292
10996 423292 785953 641920 734002 582073 411042 738722 668475 567762 415455 696279
10986 696279 784210 769926 1074219 869151 1003532 1269393 1100273 1165238 1135543 1482580
10976 1482580 1599428 1522571 1950714 2079259 2755082 2491922 2836123 2687045 2555559 2448095
10966 2448095 2291226 1741539 1598389 1495916 1868531 1383357 1510835 1598762 1467762 1925143
10956 1925143 1199804 1473771 1427966 1278305 1278109 924457 839869 740145 608386 574964 312435
10945 312435 275090 223582 108810 448053 255870 332586 154692 -116454 132007 173209
10935A73209e9241B35288M7579O1159A57450B1231J77502G3340N9664L13834E0918
10923c2893k10569i6460L207a4735A43339d6369m88684F798a77378A9511d4093
10911b97751f8150m9230k33788A39349C613a12244j68684c0515j50706c4246m4241
10900g8487n5792a3671j19837A93564A8970e4492I1661L9092a43492b7243e389
10888h0973j46197O3128P2989B52478D5933J94031K743q5766D257J39092k5542
10877A17807A384m34K24296K2820E7787a62816G3200M7622b98255K7590a16258
10865a40530L6003a7221n7168p9504F1725a4438C34823c16907a3485A78211F4196
10853a84053m2044B23951g9377E7400g2209B32694a61555c3117n3345F531J45513
$$ plain form
10935 173209 -59241 235288 282867 344026 157450 21231 198733 73340 133004 446838 50918
10923 -32893 -243462 -96460 -93253 -14735 143339 -46369 -535053 6798 -177378 19511 -44093
10911 -297751 -68150 -117380 -351168 139349 3613 -112244 -280928 -30515 -181221 -34246 -78487
10900 -78487 -134279 -13671 -133508 193564 18970 -54492 91661 130753 -143492 -27243 -5389
10888 -80973 -227170 -164042 -91053 252478 45933 239964 242707 156941 4257 143349 117807
10877 117807 1384 950 225246 248066 57787 -162816 73200 120822 -298255 -270665 -116258
10865 -140530 -104527 -17221 -74389 -153893 61725 -14438 334823 -316907 -13485 178211 64196
10853 -184053 -226097 223951 -79377 57400 -72209 232694 -161555 -33117 -86462 6531 152044
10842A52044q798F0883f1554m9649N1306j40481a9191q7475A7017K25672h0387
10830f2050B95964g8355A17778f8878I9212b6349B98813a20533A43681K0101a00023
10818A80819b56820A8969c33587B59805b49077H7504D0299a1963j00880A48977
10807a02658j36988q3728A8985D961a9785B7492A0872J55218H2367h7014C62781
10795A42994i9420D142P9334a46847E6424g0282C51028b15726D8713P9417d5757
10783c22283c7847l76730G2791c23289H89a4497j15937l53651a00583j20497n71
10772b21651B07914a1233k05490B00413c24592J11218c9234k80448J36208j27154
10762c10628a9478n3325k04107e1884l8040j55636h1779j30907e0135j19069f8096
$$ plain form
10842 152044 143246 60883 -61554 -111203 -59897 -200378 -19191 -106666 17017 242689 -80387
10830 -62050 295964 -78355 117778 -68878 99212 -26349 298813 -120533 143681 163782 -100023
10818 180819 -256820 18969 -333587 259805 -249077 87504 40299 -11963 -112843 148977
10807 -102658 -239646 -323374 18985 4961 -19785 27492 10872 166090 82367 -87014 362781
10795 142994 -99420 4142 83476 -146847 56424 -70282 351028 -215726 48713 128130 -45757
10783 -322283 -37847 -414577 72791 -323289 889 -14497 -130434 -484085 -100583 -221080 -221651
10772 -221651 207914 -11233 -216723 200413 -324592 -213374 -39234 -319682 -183474 -310628
10762 -310628 -19478 -72803 -276910 -51884 -89924 -245560 -81779 -212686 -50135 -169204 -68096
10750b00678C2850J51833c39024a5903j9431G12Q7531M12754f7747A4000c60026
10738a15989B17661j628a87397C0759a2086j59843B16567c35310J31949M0153
10728a63208D1634K68150a25452A5307L08763d6155j3552o3635L2122b2265j9506
10717d1771k65337J12013D3202g8961n3917n1581C1108b33404N5335n1022B09710
10705a27622j71537g2786j11292F1573k938b81716O3784k34423a74823E1711b51938
10693A32477a23289C42889K1953a81856B8483P7096f0152j21108A56860i8475
10682d20717b868A31820j7096N0076b1901m19304A80349b77410B6947e5276j00324
10671a55600a0669l29017J01632A9636f2994C12034a18402A72108p0697c507k195
$$ plain form
10750 -200678 32850 184683 -339024 -15903 -35334 712 88243 500997 -67747 14000 -360026
10738 -115989 217661 216033 -187397 30759 -12086 -171929 216567 -335310 -203361 -163208
10728 -163208 41634 309784 -125452 15307 324070 -46155 -59707 -123342 -91220 -22265 -41771
10717 -41771 -307108 -195095 43202 -78961 -132878 -184459 31108 -233404 -178069 -229091 209710
10705 -127622 -299159 -72786 -184078 61573 58635 -281716 -217932 -452355 -174823 51711 -251938
10693 132477 -123289 342889 364842 -181856 28483 105579 -60152 -181260 156860 -98475
10682 -420717 -2868 131820 114724 164800 -21901 -441205 180349 -277410 26947 -55276 -155600
10671 -155600 -10669 -339686 -238054 19636 -62994 312034 -118402 172108 101411 -3507 -5702
10660e702j46771e5022K19c639k1140C3972b96343g4771C0771a7069j04555N3968
10648f7656A21168A4858J86136a80476k11754a08334c5365j06436A17071i8299
10637h7310A39986c12342a30462A90542J98459H9043b75524a804k89394a28659
10626i8992H0047a21917m3974j8898j4061b7279j9255B90769i5371c2884A13892
10614a80100p8317e700l53328A49288o5694e665D9533p742b78633C5671J36246
10603A71917b25338A5653c0959l3559A53173c7256n6792p2300j81675a67709B65364
10591C02941a50214o853B89677a90198A05237k8975i7100H3144c59838A66076
10580A12458c33630e107A56370h4030H0932a38468m2326N570h654A30659n2668
$$ plain form
10660 -5702 -152473 -55022 -54803 -3639 -24779 33972 -296343 -74771 30771 -17069 -121624 -67656
10648 -67656 121168 14858 200994 -180476 -392230 -108334 -35365 -141801 117071 -98299
10637 -87310 139986 -312342 -130462 190542 389001 89043 -275524 -1804 -291198 -128659
10626 -98992 80047 -121917 -165891 -184789 -198850 -27279 -46534 290769 -95371 -32884 113892
10614 -180100 -258417 -5700 -359028 149288 83594 -5665 49533 41791 -278633 35671 171917
10603 171917 -225338 15653 -30959 -64518 153173 -37256 -94048 -166348 -348023 -167709 265364
10591 302941 -150214 -157067 289677 -190198 105237 76262 -97100 83144 -359838 166076
10580 112458 -333630 -5107 156370 -84030 80932 -138468 -180794 -175224 -8654 130659 77991
10569G7991a64140M388o4627b1082j82140d9038K2887n2711J8233j91442a21601
10557a06695M8058l7979o9425I8893j6842a972A9914c07531e2491j12880D4847
10545C65947g806j44770B29143p1938L7784B5481f5650o4897L4336D1057a70935
10533A96801a31585j89485H9344D0229J36089a83839D4867P249e36742A78839
10522b89695j67905B0166K1104a90717C3391J13121g6572j09565b5793k35190
10512b60983A99833n5957a61235e3695A81803a06438P088C5088a54819j51824
10502c06643A05861a64354b1904A4596J90366a63966A39141g9713q8029A41529
10491b8211m3924j09235a7295j45874A94087b32269B36009i1337C06012K661j08332
$$ plain form
10569 77991 -164140 -159752 -224379 -21082 -203222 -49038 -26151 -78862 -60629 -252071 -121601
10557 -106695 -58637 -96616 -166041 98893 82051 -1972 19914 -307531 -52491 -165371 44847
10545 365947 -7806 -152576 229143 157205 194989 25481 -65650 -130547 -96211 41057 -170935
10533 196801 -131585 -321070 89344 40229 176318 -183839 44867 52116 -536742 178839
10522 -289695 -457600 20166 41270 -190717 33391 146512 -76572 -186137 -25793 -260983
10512 -260983 199833 143876 -161235 -53695 181803 -106438 -99350 35088 -154819 -306643
10502 -306643 105861 -164354 -21904 14596 204962 -163966 139141 -79713 -167742 141529
10491 -28211 -72135 -181370 -17295 -163169 194087 -232269 236009 -91337 306012 308673 200341
10480B00341J06270O6720A82876O4679J6324J33309I3591A8564O3807Q6347c01751
10468b94303j19771a10723j26176A50920f57936A84353l5948a03168B97982D4397
10457c66521A02621b80873J14452k42187B69236e9199H1761a18068L5749j98770
10447b81089b5032F7171B0977a27737o7285j97118b1566B16829o5340O6750D3519
10435h3295k07602G2696a56713A90818c9294j1317b3474A03742k6979J15784I409
10423h7543B11866P1679b00353B5991k720g5600j35139j29924J30700a00044I9894
10411b37992Q5990C34045d13230L8148A09255b47237h3175l2142A14056i5126
10400d23359b2718l92052D4284A3857a83111A66308D8828O3409l9754A559K8606
$$ plain form
10480 200341 306611 373331 182876 247555 263879 397188 93591 18564 82371 168718 -301751
10468 -294303 -414074 -110723 -236899 150920 -657936 184353 148405 -103168 297982 44397
10457 -366521 102621 -280873 -166421 -408608 269236 -59199 81761 -118068 -82319 -281089
10447 -281089 -25032 67171 20977 -127737 -195022 -392140 -21566 216829 151489 218239 43519
10435 -83295 -290897 72696 -156713 190818 -39294 -50611 -23474 103742 76763 192547 9409
10423 -87543 211866 283545 -200353 25991 23271 -75600 -210739 -340663 -209963 -100044 99894
10411 -237992 -152002 334045 -413230 -375082 109255 -247237 -83175 -115317 114056 -95126
10400 -423359 -22718 -414770 44284 13857 -183111 166308 48828 112237 72483 1559 30165
10389C0165B854R4416L24496A92955E0362c7302A89695a45312B69690g7388D15294
10377C19503a221D0098a93193D04829j17517l4300K0184e8258m0537D08616j27510
10366B81106J99313j53685K5149j01922J7369P8380O1751j42021K9278e6543J7057
10355c9486A15078K76394L0945G4438P20861l22371K30376j45865B74908a7545
10344A52329K66606K7012m1154H5037J45998H6555f6174F9046K81964A65497G7362
10332d1044B34798K2852I8241K45618m3135f2870a6782F2243q968J50836a06861
10320a84398g16C37631Q5530a70718c1727A69217p9486J2280f7306C42770c69042
10308A44459c16270A8624b28871L0294G2285R8619i3067F3685J14163b92952j40981
$$ plain form
10389 30165 2854 97270 421766 192955 50362 -37302 189695 -145312 269690 -77388 415294
10377 319503 -1221 40098 -193193 404829 287312 253012 273196 -58258 -98795 408616 281106
10366 281106 480419 326734 351883 249961 267330 345710 407461 265440 294718 -56543 -39486
10355 -39486 115078 391472 422417 74438 795299 472928 703304 557439 274908 -17545
10344 152329 418935 445947 404793 85037 231035 86555 -66174 69046 351010 165497 77362
10332 -41044 234798 257650 98241 343859 300724 -62870 -16782 62243 53275 204111 -106861
10320 -184398 -716 337631 423161 -170718 -31727 169217 89731 102011 -67306 342770 -369042
10308 144459 -316270 18624 -228871 -198577 72285 170904 -93067 63685 177848 -292952 -433933
10297d33933k6472B68828C1839K63441b15247a03522c3377E8831L552b5516A11490
10285e7413A27573h6719g702j33571F6418b64822A4437J01861i0711j82650A48590
10273A82530b77806K0624E4946C468J10757C5356M3165P131L312J80569c07409
10261b99283b501A33083q341a09969A63227G7488M40270I2603P8179G4684O9601
10250A44285c4059k43863a08360A08685R741b93794i0312C09047a48922e0882
10239A19079A9099K8917c33857B53595b27244J13476q129H2357c3652n9585k74578
10228c67815J74147l67866C14887g8640A9866L7288b51447D4354K50814g511A5759
10216E776a17727n009e4265k15018b8946n6951k23074E2994d0100k5672A28840
$$ plain form
10297 -433933 -460405 268828 31839 295280 -215247 -103522 -33377 58831 62383 -25516 111490
10285 -57413 127573 -86719 -7702 -141273 66418 -264822 14437 116298 -90711 -273361 148590
10273 182530 -277806 -257182 54946 3468 114225 35356 78521 85652 88964 269533 -307409
10261 -299283 -2501 133083 124742 -109969 163227 77488 517758 92603 170782 74684 144285
10250 144285 -34059 -277922 -108360 108685 118426 -293794 -90312 309047 -148922 -50882
10239 119079 19099 48016 -333857 253595 -227244 -113768 -121897 82357 -33652 -93237 -367815
10228 -367815 -193668 -561534 314887 -78640 19866 57154 -251447 44354 295168 -7511 15759
10216 5776 -117727 -122736 -54265 -269283 -28946 -85897 -308971 52994 -40100 -65772 128840
10204a6695k71862a37275e0842G4977g3911D0471c54166K7024B4454a28049G151
10192d038B11917c0014j06952n5413J5950b0441r441j71809j33077A79448g7028
10180g2892b3216j63422m394j12965A91430b54969A25850M0454a79453p1813r575
10169b60841j30290a58745A43885D3524K574g2205a9013j08294A65768e2416j85124
10158b37540O4853k12793Q9635N4980l1756D4d31293M6335a46009j1139L8351
10147a18797l20178A97457c47309g2613C27224e5959l17848h7247b0027j43109
10137a63136B91013a08934j57279c2845r6644A54178M3387K7957m2659o7587E5775
10125a65715l5360b5524C16098c957l571I3844b4400m29506B12260I2229b02170
$$ plain form
10204 -16695 -288557 -137275 -50842 74977 -73911 40471 -354166 -327142 24454 -128049 7151
10192 -4038 211917 -30014 -136966 -192379 -176429 -20441 -29882 -201691 -334768 179448 -77028
10180 -72892 -23216 -186638 -191032 -303997 191430 -254969 125850 166304 -179453 -251266 -260841
10169 -260841 -391131 -158745 143885 43524 46098 -72205 -19013 -127307 165768 -52416 -237540
10158 -237540 -172687 -385480 -295845 -240865 -272621 44 -431293 -384958 -146009 -157148 -118797
10147 -118797 -438975 197457 -347309 -72613 327224 -55959 -373807 -87247 -20027 -163136
10137 -163136 291013 -108934 -266213 -32845 -129489 154178 197565 225522 182863 115276 55775
10125 -165715 -201075 -25524 316098 -3957 -7528 93844 -24400 -453906 212260 92229 -202170
10113f9253H3846f4463G6156J40601c59735b4543D5392J4443a15181k00494g0066
10101a23710G7037Q0988D7035a29153k49928a82289C45250f2139a6220k3575A64052
10089a0607k7549k2616I506b30145P6614A68237p2443a89167n1137C03662a03795
10077C48516j61740h0552c2284j6463k8556k3514k79790g7822k7894b6125a2272
10065a25995d808j02800j41666J0087A75692K95645c7448l83303d6826B70143
10054c5657k7638a2238D5275i0144j4835m53469a59815H6847J91333E7329J80389
10043B37718b7128q896j51628m5054g7088m2520r7238m0598q3637a14241j33551
10032b47792A14636l3340a45063D2394N889Q4077O1329O7594a89806F0758c3024
$$ plain form
10113 -69253 83846 -64463 76156 216757 -359735 -24543 45392 59835 -115181 -315675 -70066
10101 -123710 77037 158025 47035 -129153 -379081 -182289 345250 -62139 -16220 -39795 164052
10089 -10607 -38156 -60772 9506 -230145 -153531 168237 95794 -189167 -240304 303662 -103795
10077 348516 186776 -80552 -32284 -48747 -77303 -100817 -380607 -77822 -105716 -26125 -12272
10065 -125995 -4808 -107608 -249274 -239187 175692 471337 -37448 -420751 -46826 270143
10054 -35657 -63295 -12238 45275 -90144 -104979 -558448 -159815 86847 278180 57329 237718
10043 237718 -27128 -36024 -187652 -232706 -77088 -119608 -216846 -257444 -341081 -114241 -247792
10032 -247792 114636 81296 -145063 42394 48283 132360 193689 261283 -189806 60758 -33024
10020b10068A34367j1559i5650B41304r7750c57195M5266J46659d8868m8030k82287
10009c79185C3572I925h3391j58582a18550a4261q093k2340G0992c4483A04454
9997A83512d58780D8142b6577M436k96600M1974B37240a38401q5258j81388B24843
9985c04608E0988a25243A06862d1599H6807a79220A09406a7606A12080e7251A52425
9973F8110h8734B16101b4575l01416F9908a74435C60921b37760a6327B9225b45783
9961a60377f2719q9223o0467E8199B411M7868b64867n2872a40364d8001j0440
9950e8441C9254j6595J20065B1810Q0802B9957c74045Q3709A53327a8569A0891
9938e4563D2921a07137j07460l5714P2337c1936A36799o6152e9235A44769c01705
$$ plain form
10020 -210068 134367 122808 -95650 241304 143554 -357195 -311929 -165270 -48868 -96898 -379185
10009 -379185 33572 9925 -83391 -241973 -118550 -14261 -22354 -44694 70992 -34483 104454
9997 183512 -458780 48142 -26577 -22141 -318741 -276767 237240 -138401 -223659 -405047 224843
9985 -304608 50988 -125243 106862 -41599 86807 -179220 109406 -17606 112080 -57251 152425
9973 68110 -88734 216101 -24575 -325991 69908 -174435 360921 -237760 -16327 29225 -245783
9961 -160377 -62719 -151942 -212409 58199 2411 50279 -264867 -317739 -140364 -48001 -58441
9950 -58441 39254 22659 142724 21810 102612 29957 -374045 -290336 153327 -18569 10891
9938 -54563 42921 -107137 -214597 -250311 -177974 -31936 136799 70647 -59235 144769 -301705
9926a66899j2556Q482E3019c70715j6035N9364J0632a41680A7914g309A87344
9914a02274m74206K37784A67456F3856O3827d02156R0745E3837a8321A78549a25565
9902a28765c4451A82037b98140e5376j0639B3387j1066M4593B368J28744b431
9890c2592B4560a70898d0655C68426j64633f5644j41071A0495a41810G4348d28842
9878b71852E33K99639C5496b53761P1578a340j29743A9087a52393L0522C2b59682
9865a61681k10250J23626H9621j2883e6522a7389k49999O0616o7407J05263N8020
9854a10896K4961E0294e3697B0759a67277j6207d9238j35165k01111A94705a1560
9842A79806h0581l98747E1430a34613A4324a66965A24340b33572H6807J08766
$$ plain form
9926 -166899 -179455 -170973 53019 -370715 -386750 -327386 -316754 -141680 17914 -7309 187344
9914 -102274 -576480 -338696 167456 63856 127683 -402156 -311411 53837 -18321 178549 -125565
9902 -128765 -34451 182037 -298140 -55376 -66015 23387 12321 56914 2368 131112 -2431
9890 -32592 24560 -170898 -40655 368426 203793 -65644 -206715 10495 -141810 74348 -428842
9878 -271852 533 300172 35496 -253761 -182183 -1340 -131083 19087 -152393 -121871 32 -259682
9865 -161681 -371931 -248305 89621 76738 -56522 -17389 -267388 -206772 -274179 -168916 -110896
9854 -110896 -85935 50294 -53697 20759 -167277 -183484 -49238 -184403 -385514 194705 -11560
9842 179806 -80581 -479328 51430 -134613 14324 -166965 124340 -233572 86807 195573
9832A95573a71655P4185E7258c16906k11973a72929k4378O3270A14223a22153
9821a31096D1746a49469j1169m3533R5874d2595I7084k6683j3958K635c19699
9809A55141J85459a45421D5899b22369n8426d866j59007j65227c7408n0558j42466
9798b30432h8691A67104a34094I9156a50289k08296H0138d3044j86468j8373d7234
9786G7805c9505A66061a05692j31454C6095c30509A7591b16969b232o3847A27144
9774i9548B33181A05944d80628E1814a37704K6728m5322L1485A54592K4485H0563
9762a6860j83556A25863C5626R7832a78026o1536c2705B72792O8102F989Q2637
9751H9626b1723D7249M5013Q0186a14544B13775a54722A14642j2616b27504g9433
$$ plain form
9832 195573 -171655 -97470 57258 -316906 -528879 -172929 -197307 -134037 114223 -122153
9821 -131096 41746 -149469 -160638 -204171 -108297 -42595 97084 70401 56443 59078 -319699
9809 155141 340600 -145421 45899 -222369 -280795 -4866 -163873 -329100 -37408 -87966 -230432
9798 -230432 -88691 167104 -134094 99156 -150289 -358585 80138 -43044 -229512 -247885 -47234
9786 77805 -39505 166061 -105692 -237146 36095 -330509 17591 -216969 -2232 -66079 127144
9774 -99548 233181 105944 -480628 51814 -137704 -110976 -156298 -124813 154592 179077 80563
9762 -16860 -200416 125863 35626 133458 -178026 -239562 -32705 272792 340894 6989 89626
9751 89626 -21723 47249 92262 172448 -114544 213775 -154722 114642 102026 -227504 -79433
9739d9741j83094A8402g8042K9601k0239q2939a4452n3186C395Q3188a08756b0651
9726a72595d6046l0953c7549j20097i748l49009A1594h0530n7236M5815K9300
9715f2651J626k8666k641A03513J96072j30367c30752H6637b21412H9138b01595
9703B2615d5797l37464i5147B9312L0038c26158h6099a3794l41802C19959b51236
9691b28392g1707L3817E2984c76994A2487a70597e2790m868q8019F0888c2354
9679I2602b11669h334k48597R1849H8938h2892C1793b83415d7253j33593G6821
9667b6645k7655A6875a92747A17412a56669i100A01013f3918K1143A24790c22147
9655c77043B95075a54267P4992j60479C7552b32573m4576k3572F9264b25266i7830
$$ plain form
9739 -49741 -232835 18402 -78042 -48441 -68680 -151619 -14452 -67638 3395 86583 -108756 -20651
9726 -172595 -46046 -76999 -37549 -157646 -9748 -358757 11594 -80530 -137766 -91951 -62651
9715 -62651 -61025 -89691 -92332 103513 299585 169218 -330752 86637 -221412 89138 -201595
9703 22615 -45797 -383261 -95147 29312 59350 -326158 -86099 -13794 -355596 319959 -251236
9691 -228392 -71707 -37890 52984 -376994 12487 -170597 -52790 -57658 -145677 60888 -32354
9679 92602 -211669 -8334 -256931 -165082 88938 -82892 31793 -283415 -47253 -180846 76821
9667 -26645 -54300 16875 -192747 117412 -156669 -9100 101013 -63918 -42775 124790 -322147
9655 -377043 295075 -154267 -79275 -239754 37552 -232573 -277149 -300721 69264 -225266 -97830
9643g3598j88343A48374f1922m3736j92890c0144j08961B0923c3288C5875g3844
9631a07338l12941F3100O8677a40330G439J4596F125J79658D8090b61599a12076
9619a10383D3477a96156A2814c25993B11957d4788d568C6892a12126A72384A8746
9607a26778k61632A82595e7811k8391j78061a29885K1685k7244J0366m2428M9548
9596a17958L742q5042O1782k90555K01485A87580a65372O8069l1343b6090m59533
9585d85623G5762Q2030b10548B07325b8490C9811a32122f0774d861A72308F780
9573B37823j18159c75869R2888j98409f7388q2480F9774N4926m0310J39812a96545
9561c37133a23299M657j3917c5358j91589Q5078A22923c2687p9511l20035a11397
$$ plain form
9643 -73598 -261941 148374 -61922 -105658 -298548 -30144 -139105 20923 -33288 35875 -73844
9631 -107338 -420279 63100 131777 -140330 7439 22035 6125 185783 48090 -261599 -112076
9619 -110383 43477 -196156 12814 -325993 211957 -44788 -4568 36892 -112126 172384 18746
9607 -126778 -388410 182595 -57811 -86202 -264263 -129885 -108200 -135444 -125078 -167506 -117958
9596 -117958 -114216 -199258 -137476 -428031 -226546 187580 -165372 -97303 -128646 -26090 -485623
9585 -485623 75762 157792 -210548 207325 -28490 39811 -132122 -60774 -4861 172308 6780
9573 237823 119664 -375869 -282981 -481390 -67388 -149868 69774 124700 84390 224202 -196545
9561 -337133 -123299 -118642 -132559 -35358 -226947 -141869 122923 -32687 -112198 -432233 -111397
9549H5822b62435g6967l9792b4106e808F9820f9387l83646g1977j70250F1285
9537e9721o4383j2348j12438P9990q1009d0533A17224Q3559a7631j09852A25166
9525A42090d03913a9510A77049l0984d8058A07626P7666C8947b13790B48658i5448
9513I8190R9438J1951b08517E7223b24526P9708j69516B97152b27013A26c8707
9501c38357J04840A44788a44011B4114b3498j07465f1749C86016b2851j24257
9491a47108C4756Q0375a2310a554D5929b3745m63572a70013n6794J12572H4361
9479a96969B24095b22780g0904B12098a24994n4883d5659j11158A4125a53826
9468c0449A41944A9105b23884G5065h4292N903j1459c3291m2579A3803L56534
$$ plain form
9549 85822 -262435 -76967 -116759 -24106 -5808 69820 -69387 -453033 -71977 -242227 61285
9537 -59721 -124104 -136452 -248890 -168900 -249909 -40533 117224 200783 -17631 -127483 125166
9525 142090 -403913 -19510 177049 146065 -48058 107626 185292 38947 -213790 248658 -95448
9513 98190 197628 209579 -208517 57223 -224526 -144818 -314334 297152 -227013 126 -38707
9501 -338357 -233517 144788 -144011 24114 -23498 -130963 -61749 386016 -22851 -147108
9491 -147108 34756 115131 -12310 -1554 45929 -23745 -487317 -170013 -226807 -114235 84361
9479 -196969 224095 -222780 -70904 212098 -124994 -179877 -45659 -156817 14125 -153826
9468 -30449 141944 19105 -223884 75065 -84292 -78389 -89848 -33291 -75870 13803 370337
9457C70337a4483d000j44940d6044o6986o5552A39692a87557k29123a55307M4159
9446a11148A76375b99542a23639L1485D457a84249J5656F8134J13723c0511A25674
9434c53292h9150q7319G9176a11294C1244a67821P7260F1795g2616j8543k4354
9423a15513r1536e1702g61k51617c4630C96356a31643k7129B5429J71820p1002
9412A26247h6039B07296J14756a24177c185C2213c65292c4333I4373a10525l06629
9401d17154B5985a72432b2436k07280p0071B41313j16992g25k37006a05920A01342
9389C9466J2068a23375N3195A50871m1596a44866A36157P7373L7856j0807A08366
9377A46771A2093a97355A23121i8593F9812c36111A50611a56380m02389B181c26440
$$ plain form
9457 370337 -14483 -4000 -148940 -46044 -113030 -178582 139692 -187557 -416680 -155307 -111148
9446 -111148 176375 -299542 -123639 -92154 4457 -184249 -168593 68134 181857 -30511 125674
9434 -353292 -89150 -176469 79176 -111294 31244 -167821 -90561 61795 -72616 -91159 -115513
9423 -115513 -207049 -51702 -761 -252378 -34630 396356 -131643 -158772 25429 197249 126247
9412 126247 -86039 207296 322052 -124177 -3185 32213 -365292 -34333 94373 -110525 -417154
9401 -417154 25985 -172432 -22436 -229716 -299787 241313 124321 -725 -237731 -105920 101342
9389 39466 51534 -123375 -70180 150871 109275 -144866 136157 213530 251386 240579 108366
9377 146771 12093 -197355 123121 -98593 69812 -336111 150611 -156380 -558769 2181 -326440
9365a35819a1856o771j81205n2246h5254L7646A0921a42602b1477m5427p3477
9354a40381l53291R6424J21091i8211j52447a4659F7921a15428p2018A0349L3972
9343D4321b4868j91348A27924E2608M3713a65958H4018J39447b08844h5520l8701
9332a24221l57990a39220j04525O9329C15117j31307a06508A54569c51423G2536
9321E5932J10342e13992F5055a84741E3441e4370j06171a751k27720g268r2928
9310a00196o3068b263j94151J034F0098G982c9069k19898A68210p3911b89523
9298A79132a40040j05969N144G3384a29362Q540k8060C4152J19963D0329i794
9286a22140o2584f2832F9588Q8892b82915E5075H982a31170D1874c1284k20062
$$ plain form
9365 -135819 -11856 -18627 -199832 -252078 -85254 -47608 10921 -142602 -21477 -66904 -140381
9354 -140381 -493672 -397248 -276157 -98211 -250658 -14659 67921 -115428 -187446 10349 44321
9343 44321 -24868 -216216 127924 52608 96321 -165958 84018 223465 -208844 -85520 -124221
9332 -124221 -482211 -139220 -243745 -174416 315117 183810 -106508 154569 -351423 72536
9321 55932 166274 -513992 65055 -184741 53441 -54370 -160541 -1751 -229471 -7268 -100196
9310 -100196 -163264 -2263 -196414 -195380 60098 7982 -39069 -258967 168210 94299 -289523
9298 179132 -140040 -246009 -240865 73384 -129362 -120822 -148882 34152 154115 40329 -9794
9286 -122140 -184724 -62832 69588 158480 -282915 55075 8982 -131170 41874 -31284 -251346
9275b51346C06100e1066A951a5226j32867j65639A8557P2881R0512a96896F0944
9263b45216J19259k9759j26629C3208b03609A05878e2043D4102b35619F9058P0447
9252A39505e4147r3257M4531B7876b59043q3802A89914a5389j89511A43307a0295
9240A55914f0669j739j02425C8981d70720a23485l81315L1669B01505c09368N2657
9229b56711h0741G3970a20368C20657c55834Q8660F9056a38573k5665j31272a02599
9217d31775D9189a93284A32440b28249k3114A42955b12029L5446j7475k8068D4728
9205a70435b4075B61788a12727o7622A3083c1240G9687h1890E886d8826B0935
9193c04299B42176e9870j67068N519j1987Q7740e9302a9418k36022L8648a04227
$$ plain form
9275 -251346 306100 -51066 1951 -15226 -148093 -313732 18557 91438 181950 -196896 60944
9263 -245216 -125957 -155716 -282345 33208 -203609 105878 -52043 44102 -235619 69058 139505
9252 139505 -54147 -147404 -102873 27876 -259043 -342845 189914 -15389 -204900 143307 -10295
9240 155914 -60669 -62408 -164833 38981 -470720 -123485 -504800 -473131 201505 -309368 -256711
9229 -256711 -80741 73970 -120368 320657 -355834 -267174 69056 -138573 -164238 -295510 -102599
9217 -431775 49189 -193284 132440 -228249 -251363 142955 -212029 -176583 -194058 -222126 44728
9205 -170435 -24075 261788 -112727 -180349 13083 -31240 79687 -81890 5886 -48826 20935
9193 -304299 242176 -59870 -226938 -221419 -233406 -145666 -59302 -19418 -255440 -216792 -104227
9181F8972d0466q8121e4449C1419c731A84086A9915j912d73390b05782k1985i2359
9168b05155r9673A87116A6995e7174A32912a36018A35222D0360a48898p280j5623
9157a71801D44898A44739c0417j01512b8370F8996a12010k72288E9570h8315m1825
9146a30140j0930A58765b90742d7258A92736d6628q9313d8757C2531a082j14605
9135a15687j1411d8672j24762C0600L918i389k19699Q2014j45552D0953f0146
9123B4553a05980E3071c21298c1250k9499M290p885j29512h1191r0326f9225n26263
9111e95488f6472n3857k24468J70804p5497k7396J24486E1052H165K6542i7768
9099f4108j28776b0295j60412E7390f7791A5585J80800k4835Q8075B6052a41834
$$ plain form
9181 68972 -40466 -128587 -54449 31419 -3731 184086 19915 18003 -473390 -205782 -227767 -92359
9168 -205155 -304828 187116 16995 -57174 132912 -136018 135222 40360 -148898 -156178 -171801
9157 -171801 444898 144739 -30417 -131929 -28370 68996 -112010 -384298 59570 -88315 -130140
9146 -130140 -141070 158765 -290742 -47258 192736 -46628 -135941 -48757 32531 -1082 -115687
9135 -115687 -127098 -48672 -173434 30600 34518 -9389 -229088 -147074 -292626 40953 -60146
9123 24553 -105980 53071 -321298 -31250 -60749 -56459 -64344 -193856 -81191 -171517 -69225 -595488
9111 -595488 -66472 -120329 -344797 -173993 -249490 -276886 -152400 51052 8165 34707 -97768
9099 -64108 -192884 -20295 -180707 57390 -67791 15585 196385 171550 259625 26052 -141834
9087e70415a02667a9195j71484A91738f1875r803B41386d4472j815k9728A21705
9075b75300a30190o4129k4580G9049a10602d0455B6550p299a61305E1263f4612
9063b30461A75192i5789k85822A03429a02987A23340B4939d7138B16523p047m0822
9052A68654a07437A38075f7676K4992j33345o6010j7750B92569a47707A64874
9041a43752b1199h113A82552a92062C6947K6809a55218J4240d979o7198R51r759
9029h0985k41113d3819Q557r1753D9175a28961A50867a32729A67802b21853C18029
9017A36307a56804A54855G0439e9948o5967A45738e26674B56975b37336a08557
9006a9953A61571a68981J8042b8850j71528j03781a10278k86592m81J70730R7414
$$ plain form
9087 -570415 -102667 -19195 -190679 191738 -61875 -71678 241386 -44472 -46287 -76015 121705
9075 -275300 -130190 -194319 -218899 79049 -110602 -40455 26550 19251 -161305 51263 -64612
9063 -230461 175192 -95789 -381611 103429 -102987 123340 24939 -47138 216523 209476 168654
9052 168654 -107437 138075 -67676 -42684 -176029 -242039 -259789 292569 -147707 164874
9041 -143752 -21199 -8113 182552 -192062 36947 63756 -155218 -140978 -4979 -72177 -71226 -80985
9029 -80985 -322098 -43819 -35262 -127015 49175 -128961 150867 -132729 167802 -221853 318029
9017 136307 -156804 154855 70439 -59948 -125915 145738 -526674 256975 -237336 -108557
9006 -19953 161571 -168981 -150939 -28850 -200378 -304159 -110278 -396870 -397351 -226621 -129207
8995a29207a9171Q391I1593a10177j18726j2365A54103b44663l6004B3717K62252
8984B85969a39713F8915h4686F0907b45241l9433B13005c97777a62708A40106
8973f698j1741p1362c4827j03277l14807D0370J15681b5952A13626K6874O3925
8962B04425c78113a35179A2369j908e5143o03477K99756J27876A6642a43051j15113
8951b58164I5066P1439g7770m234j3870j06653A15117a57723J3752A15052A266
8939D1834J58606b19308H4133D0597L39344P0542A34219b31396j317B58517j13731
8928A44786J8670Q8441i1968D71692O45724P31399M897074J1239238G083379A279096
8917F62482k99099a5398I1737C4617b24779f5321A77228a49245r6040C00296A4891
$$ plain form
8995 -129207 -19171 -10780 91593 -110177 -228903 -241268 154103 -244663 -280667 23717 285969
8984 285969 -139713 68915 -84686 60907 -245241 -284674 213005 -397777 -162708 140106
8973 -6698 -18439 -89801 -34827 -138104 -452911 40370 156051 -25952 113626 140500 204425
8962 204425 -378113 -135179 12369 10461 -55143 -658620 -358864 -230988 16642 -143051 -258164
8951 -258164 95066 166505 -77770 -82004 -95874 -202527 115117 -157723 -143971 115052 1266
8939 41834 200440 -219308 84133 40597 379941 450483 134219 -231396 -232713 258517 144786
8928 144786 163456 251897 -91968 471692 1117416 1848815 6745889 17985127 7083379 1279096
8917 662482 363383 -15398 91737 34617 -224779 -65321 177228 -149245 -245285 300296 14891
8905a25443o5022D6971b463j55531O9752j46644o4209i5569n0964e7081k54318
8894c11399A29602a70214N9602A84184a24970j84564B3625K41628A13207c78064
8883a54473b8784j74657G9538a62765j20694q129A21650c30922A65926j876b75735
8871d57901a11299L6003n7108d8658q3954K8281j04507g7139D6751k1340J13284
8860A38695a26049b196m28139C72848C0410a84011B09095E8423L4382d4647m4044
$$ plain form
8905 -125443 -190465 46971 -2463 -157994 -88242 -234886 -299095 -95569 -146533 -57081 -311399
8894 -311399 129602 -170214 -110612 184184 -124970 -309534 23625 265253 113207 -378064
8883 -154473 -28784 -203441 79538 -162765 -283459 -291588 121650 -330922 165926 164050 -275735
8871 -457901 -111299 -75296 -132404 -48658 -132612 -104331 -208838 -77139 46751 25411 138695
8860 138695 -126049 -2196 -430335 372848 30410 -184011 209095 58423 92805 -44647 -88691
$$ [...]
##END NTUPLES=NMR SPECTRUM
##END=
