
##TITLE=UV1273_M13_1250-1169_30_7414509_qytKd1g0xr
##JCAMPDX= 6.0         $$ Bruker NMR JCAMP-DX V2.0
##DATA TYPE= NMR SPECTRUM
##DATA CLASS= NTUPLES
##ORIGIN= BRUKER
##OWNER= Administrator
$$ 1.72 TOPSPIN		Version 2.1
$$ 2013-01-26 01:08:26.231 -0500  Administrator@X
$$ Compression mode = diff/dup
##.OBSERVE FREQUENCY= 400.02188249412
##.OBSERVE NUCLEUS= ^1H
##.ACQUISITION MODE= SIMULTANEOUS (DQD)
##.ACQUISITION SCHEME= undefined
##.AVERAGES= 64
##.DIGITISER RES= 22
##SPECTROMETER/DATA SYSTEM= spect
##.PULSE SEQUENCE= noesygpps1d.comp
##.SOLVENT NAME= COFFEE_meoh
##.SHIFT REFERENCE= INTERNAL, COFFEE_meoh, 1, 14.96127
##AUDIT TRAIL= $$ (NUMBER, WHEN, WHO, WHERE, PROCESS, VERSION, WHAT)
$$ ##TITLE= Audit trail, TOPSPIN		Version 2.1
$$ ##JCAMPDX= 5.01
$$ ##ORIGIN= Bruker BioSpin GmbH
$$ ##OWNER= Administrator
$$ $$ E:\/data/COFFEE/nmr/UV1273_M13_1250-1169_30_7414509_qytKd1g0xr/12/pdata/1/auditp.txt
$$ ##AUDIT TRAIL=  $$ (NUMBER, WHEN, WHO, WHERE, PROCESS, VERSION, WHAT)
(   1,<2013-01-26 01:08:20.387 -0500>,<Administrator>,<X>,<go>,<TOPSPIN 2.1>,
      <created by zg
	started at 2013-01-26 00:56:50.026 -0500,
	POWCHK enabled, PULCHK disabled,
       configuration hash MD5:
       86 BA 57 50 F2 9D 5C 9B 26 00 A9 28 5F 66 2E 89
       data hash MD5: 64K
       9F 20 B1 5C C3 A3 FC 35 B8 C9 9E E2 63 B4 E7 22>)
(   2,<2013-01-26 01:08:23.465 -0500>,<Administrator>,<X>,<proc1d>,<TOPSPIN 2.1>,
      <Start of raw data processing
       efp LB = 0.3 FT_mod = 6 PKNL = 1 PHC0 = 0 PHC1 = 0 SI = 128K 
       data hash MD5: 128K
       57 81 F3 75 B0 3F BA 0C 2F 74 6B D9 24 DA D5 CF>)
(   3,<2013-01-26 01:08:24.512 -0500>,<Administrator>,<X>,<proc1d>,<TOPSPIN 2.1>,
      <pk PHC0 = -80.61768 PHC1 = 0 
       data hash MD5: 128K
       A2 98 35 D7 E5 AE 1B 9A 08 13 69 6D 4B B8 EB 3E>)
(   4,<2013-01-26 01:08:25.153 -0500>,<Administrator>,<X>,<proc1d>,<TOPSPIN 2.1>,
      <abs ABSG = 1 
       data hash MD5: 128K
       3E EE 20 CE B3 83 46 47 2B 31 B8 81 3A 23 C6 A4>)
(   5,<2013-01-26 01:08:25.324 -0500>,<Administrator>,<X>,<proc1d>,<TOPSPIN 2.1>,
      <abs ABSG = 2 
       data hash MD5: 128K
       6D 9E E6 41 4E E8 0A 7A 81 2E 5A AA E2 67 04 AC>)
(   6,<2013-01-26 01:08:25.512 -0500>,<Administrator>,<X>,<proc1d>,<TOPSPIN 2.1>,
      <abs ABSG = 3 
       data hash MD5: 128K
       2C 25 E8 21 D6 25 22 E1 BB 30 8C 3C E6 CA 99 98>)
(   7,<2013-01-26 01:08:25.715 -0500>,<Administrator>,<X>,<proc1d>,<TOPSPIN 2.1>,
      <abs ABSG = 4 
       data hash MD5: 128K
       AC CC 29 1E 2C 0D D0 B2 FF C2 25 27 2F CA 67 D7>)
(   8,<2013-01-26 01:08:25.887 -0500>,<Administrator>,<X>,<proc1d>,<TOPSPIN 2.1>,
      <abs ABSG = 5 
       data hash MD5: 128K
       27 CD 9D 95 BA 86 A8 AC B0 3A 39 6C EF 42 2F EB>)
$$ ##END=
$$ 
$$ $$ hash MD5
$$ $$ 3F EE 10 0E 05 04 0A 3C DF BC 3D 81 F0 2A C9 61
##$RELAX= 
##$RELAX= 
##$RELAX= 
##$RELAX= 
##$RELAX= 
##$RELAX= 
##$RELAX= 
##$RELAX= 
$$ Bruker specific parameters
$$ --------------------------
##$DU= <E:\>
##$EXPNO= 12
$$ [...]
##$TP07= 0
##$TPNAME0= <>
##$TPNAME1= <>
##$TPNAME2= <>
##$TPNAME3= <>
##$TPNAME4= <>
##$TPNAME5= <>
##$TPNAME6= <>
##$TPNAME7= <>
##$TPOAL= (0..7)
0.5 0.5 0.5 0.5 0.5 0.5 0.5 0.5
##$TPOFFS= (0..7)
0 0 0 0 0 0 0 0
##$TUNHIN= 0
##$TUNHOUT= 0
##$TUNXOUT= 0
##$USERA1= <user>
##$USERA2= <user>
##$USERA3= <user>
##$USERA4= <user>
##$USERA5= <user>
##$V9= 5
##$VALIST= <valist>
##$VCLIST= <CCCCCCCCCCCCCCC>
##$VD= 0
##$VDLIST= <DDDDDDDDDDDDDDD>
##$VPLIST= <PPPPPPPPPPPPPPP>
##$VTLIST= <TTTTTTTTTTTTTTT>
##$WBST= 2048
##$WBSW= 25
##$XGAIN= (0..3)
0 0 0 0
##$XL= 0
##$YL= 0
##$YMAX_a= 6358774
##$YMIN_a= -12709723
##$ZGOPTNS= <>
##$ZL1= 120
##$ZL2= 120
##$ZL3= 120
##$ZL4= 120
##$ABSF1= 14.96127
##$ABSF2= -5.596911
##$ABSG= 5
##$ABSL= 3
##$ALPHA= 0
##$AQORDER= 0
##$ASSFAC= 0
##$ASSFACI= 0
##$ASSFACX= 0
##$ASSWID= 0
##$AUNMP= <proc_prof1d_extract.lims>
##$AXLEFT= 0
##$AXNAME= <>
##$AXNUC= <1H>
##$AXRIGHT= 0
##$AXTYPE= 0
##$AXUNIT= <>
##$AZFE= 0.1
##$AZFW= 0.1
##$BCFW= 0
##$BC_mod= 0
##$BYTORDP= 0
##$COROFFS= 0
##$CY= 15
##$DATMOD= 1
##$DC= 0
##$DFILT= <>
##$DTYPP= 0
##$F1P= 0
##$F2P= 0
##$FCOR= 0.5
##$FTSIZE= 131072
##$FT_mod= 6
##$GAMMA= 0
##$GB= 0
##$INTBC= 1
##$INTSCL= 1
##$ISEN= 128
##$LB= 0.3
##$LEV0= 0
##$LPBIN= 0
##$MAXI= 10000
##$MC2= 0
##$MEAN= 0
##$ME_mod= 0
##$MI= 0
##$NCOEF= 0
##$NC_proc= -2
##$NLEV= 6
##$NOISF1= 0
##$NOISF2= 0
##$NSP= 0
##$NTH_PI= 0
##$NZP= 0
##$OFFSET= 14.96127
##$PC= 1
##$PHC0= -80.61768
##$PHC1= 0
##$PH_mod= 1
##$PKNL= yes
##$PPARMOD= 0
##$PPDIAG= 0
##$PPIPTYP= 0
##$PPMPNUM= 2147483647
##$PPRESOL= 1
##$PSCAL= 4
##$PSIGN= 0
##$PYNMP= <proc.py>
##$REVERSE= no
##$SF= 400.020009528897
##$SI= 131072
##$SIGF1= 0
##$SIGF2= 0
##$SINO= 400
##$SIOLD= 131072
##$SPECTYP= <>
##$SREGLST= <1H.CDCl3>
##$SSB= 0
##$STSI= 131072
##$STSR= 0
##$SW_p= 8223.68421052631
##$SYMM= 0
##$S_DEV= 0
##$TDeff= 65536
##$TDoff= 0
##$TI= <>
##$TILT= no
##$TM1= 0
##$TM2= 0
##$TOPLEV= 0
##$USERP1= <user>
##$USERP2= <user>
##$USERP3= <user>
##$USERP4= <user>
##$USERP5= <user>
##$WDW= 1
##$XDIM= 131072
##$YMAX_p= 439745611
##$YMIN_p= -16328
##$CURPLOT= <Network HP LaserJet P1505>
##$CURPRIN= <$Network HP LaserJet P1505>
##$DFORMAT= <normdp>
##$LAYOUT= <+/1D_H.xwp>
##$LFORMAT= <normlp>
##$PFORMAT= <normpl>
##$SURQMSG= 1
$$ End of Bruker specific parameters
$$ ---------------------------------
##NTUPLES= NMR SPECTRUM
##VAR_NAME=  FREQUENCY,     SPECTRUM/REAL,   SPECTRUM/IMAG
##SYMBOL=    X,             R,               I
##VAR_TYPE=  INDEPENDENT,   DEPENDENT,       DEPENDENT
##VAR_FORM=  AFFN,          ASDF,            ASDF
##VAR_DIM=   131072,        131072,          131072
##UNITS=     HZ,            ARBITRARY UNITS, ARBITRARY UNITS
##FACTOR=    0.0627417313425164, 1,          1
##FIRST=     8223.62146879497, 2362,         -62042
##LAST=      0,             3669,            -62519
##MIN=       0,             -16328,          0
##MAX=       8223.62146879497, 439745611,    0
$$ Real data points
##PAGE= N=1
##DATA TABLE= (X++(R..R)), XYDATA
$$ [...]
$$ plain form
61676 448741 444593 440825 437847 435300 432956 430964 429298 427611 425829 424378 423689 423747 424228 424807 425226 425252
61660 425252 424728 423715 422598 421937 421966 422253 422164 421789 422092 423907 427068 430673 433911 436420 438240 439930
61644 439930 442477 446596 451992 457553 462272 465837 468439 470273 471263 471193 470097 468436 466680 464711 461990
61629 461990 458370 454373 450482 446638 442765 439337 436907 435245 433506 431270 429011 427500 427043 427287 427485
61614 427485 426915 425267 422752 419748 416385 412575 408340 403926 399565 395259 390828 386114 381135 375988
61600 375988 370589 364674 358273 352069 346940 343128 340141 337462 334969 332627 330266 327897 325791 323998
61586 323998 322198 320312 318811 317991 317326 316067 314266 312649 311676 311234 311187 311582 312247 312718 312815 312928 313453
61569 313453 314234 314794 314934 314796 314438 313720 312710 312001 312323 313823 315871 317647 318824 319682 320704 322200
$$ packed form
61676D48741m148l768k978k547k344j992j666j687j782j451o89N8M81N79M19K6
61660D25252n24j013j117o61K9K87q9l75L03J815L161L605L238K509J820J690
61644D39930K547M119N396N561M719L565K602J834R90p0j096j661j756j969k721
61629D61990l620l997l891l844l873l428k430j662j739k236k259j511m57K44J98
61614D27485n70j648k515l004l363l810m235m414m361m306m431m714m979n147
61600C75988n399n915o401o204n129l812k987k679k493k342k361k369k106j793
61586C23998j800j886j501q20o65j259j801j617r73m42m7L95O65M71R7J13N25
61569C13453P81N60J40j38l58p18j010p09L22J500K048J776J177Q58J022J496
$$ plain form
61553 322200 324083 325858 326949 327277 327394 327861 328664 329472 330233 331122 332053 332717 333031 333215 333466 334027 335416
61536 335416 338056 341639 345352 348796 352155 355436 358160 359946 360807 360776 359809 358303 357028 356262 355439 353985
61520 353985 351934 349505 346665 343493 340479 338059 336286 335197 334964 335343 335629 335536 335493 335686 335551 334850 334433
61503 334433 335083 336155 336330 335344 334005 332779 331362 329655 328268 327785 328152 328938 329841 330857 332288 334454
61487 334454 337129 339484 340972 341946 342959 343806 343904 343360 342924 343056 343694 344841 346626 348764 350632 351949
61471 351949 352873 353435 353447 352979 352349 351606 350607 349633 349252 349451 349519 349042 348476 348444 348925 349476 349938 350616 351884
61452 351884 353788 355910 357599 358540 359084 359884 361238 362991 364923 366892 368756 370465 372206 374187 376391
61437 376391 378813 381718 385311 389381 393655 398224 403120 407803 411734 415254 419105 423103 426095 427383
$$ packed form
61553C22200J883J775J091L28J17M67Q03Q08P61Q89R31O64L14J84K51N61J389
61536C35416K640L583L713L444L359L281K724J786Q61l1r67j506j275p66q23j454
61520C53985k051k429k840l172l014k420j773j089k33L79K86r3m3J93j35p01m17
61503C34433O50J072J75r86j339j226j417j707j387m83L67P86R03J016J431K166
61487C34454K675K355J488R74J013Q47R8n44m36J32O38J147J785K138J868J317
61471C51949R24N62J2m68o30p43r99r74l81J99O8m77n66l2M81N51M62O78J268
61452C51884J904K122J689R41N44Q00J354J753J932J969J864J709J741J981K204
61437C76391K422K905L593M070M274M569M896M683L931L520L851L998K992J288
$$ plain form
61423 427383 427508 427424 427571 428079 429257 431323 433934 436342 437926 438460 438082 437157 435971 434501 432632 430519
61407 430519 428476 426554 424567 422413 420057 417327 414169 411011 408360 406105 403707 401013 398330 395790
61393 395790 393335 391391 390736 391436 392554 393238 393573 393989 394343 394081 393034 391673 390732 390773 391837 393329 394497
61376 394497 395216 396071 397579 399651 401941 404365 407017 409856 412727 415540 418253 420839 423350 425924 428730
61361 428730 431967 435728 439645 443011 445672 448533 452619 457908 463793 470408 478511 488066 498050 507910
61347 507910 518103 528659 538330 546006 552186 558078 563837 568739 572681 576412 580291 583814 586525 588573
61333 588573 590122 590864 590463 589055 586940 584106 580348 575687 570435 564989 559714 554956 551007 548024 545956
61318 545956 544559 543587 543096 543445 544816 546844 549005 551404 554843 559913 566274 573180 580624 589552 600733
$$ packed form
61423D27383J25q4J47N08J178K066K611K408J584N34l78r25j186j470j869k113
61407D30519k043j922j987k154k356k730l158l158k651k255k398k694k683k540
61393C95790k455j944o55P00J118O84L35M16L54k62j047j361r41M1J064J492J168
61376C94497P19Q55J508K072K290K424K652K839K871K813K713K586K511K574K806
61361D28730L237L761L917L366K661K861M086N289N885O615Q103R555R984R860
61347E07910J0193J0556R671P676O180N892N759M902L942L731L879L523K711K048
61333E88573J549P42m01j408k115k834l758m661n252n446n275m758l949k983k068
61318E45956j397r72m91L49J371K028K161K399L439N070O361O906P444Q928J1181
$$ plain form
61303 600733 613681 627035 639842 651984 663363 673217 680591 685123 686944 686060 682372 676296 668898
61290 668898 661225 653686 646173 638569 631061 624019 617610 611595 605694 600202 595839 592821 590486 588268
61276 588268 586641 586519 587957 590160 592683 595879 600021 604738 609641 614942 620922 627132 632614 636921
61262 636921 640729 645442 652255 661457 672536 684888 698214 712088 725442 736934 745715 751552 754396
61249 754396 754428 752437 749524 746201 742156 736946 730535 723099 714872 706346 698163 690536 683098 675527 668084
61234 668084 661411 656075 652343 650111 648921 648267 647961 648057 648622 649928 652604 657039 662689 668519 674118
61219 674118 679812 685771 691693 697406 703044 708516 713498 718112 722855 727618 731511 734044 735794 737535
61205 737535 739370 741212 743466 746644 750757 755608 761290 767979 775757 785165 797395 813245 832090
$$ packed form
61303F00733J2948J3354J2807J2142J1379R854P374M532J821q84l688o076p398
61290F68898p673p539p513p604p508p042o409o015n901n492m363l018k335k218
61276E88268j627j22J438K203K523L196M142M717M903N301N980O210N482M307
61262F36921L808M713O813R202J1079J2352J3326J3874J3354J1492Q781N837K844
61249G54396L2j991k913l323m045n210o411p436q227q526q183p627p438p571p443
61234F68084o673n336l732k232j190o54l06R6N65J306K676M435N650N830N599
61219F74118N694N959N922N713N638N472M982M614M743M763L893K533J750J741
61205G37535J835J842K254L178M113M851N682O689P778R408J2230J5850J8845
$$ plain form
61192 832090 852424 873100 893505 912918 930453 945553 957934 967062 972321 973857 972933 971248 969937
61179 969937 969051 967753 965054 960572 954573 947328 938746 928766 917773 906274 894381 881819 868392
61166 868392 854284 840027 826211 812914 799424 784895 769430 754130 739927 726785 714261
61155 714261 702380 691636 682533 675517 671054 669296 669799 671806 674648 677696 680188 681356 680577 677367
61141 677367 671605 663892 655330 646745 638409 630588 623838 618568 614784 612503 611973 613276 616224 620895
61127 620895 627696 636564 646725 657643 669659 683284 698485 715224 734077 755532 779041 803531
61115 803531 828607 854592 881571 909092 936679 964014 990607 1015814 1039238 1060793 1080439
61104 1080439 1098150 1113919 1127431 1137892 1144551 1147200 1145876 1140388 1130613 1116991 1100176 1080388
$$ packed form
61192H32090K0334K0676K0405J9413J7535J5100J2381R128N259J536r24j685j311
61179I69937q86j298k699m482n999p245q582r980j0993j1499j1893j2562j3427
61166H68392j4108j4257j3816j3297j3490j4529j5465j5300j4203j3142j2524
61155G14261j1881j0744r103p016m463j758N03K007K842L048K492J168p79l210
61141F77367n762p713q562q585q336p821o750n270l784k281n30J303K948M671
61127F20895O801Q868J0161J0918J2016J3625J5201J6739J8853K1455K3509K4490
61115H03531K5076K5985K6979K7521K7587K7335K6593K5207K3424K1555J9646
61104A080439J7711J5769J3512J0461O659K649j324n488r775j3622j6815j9788
$$ plain form
61092 1080388 1057667 1032667 1006587 980272 953815 927186 900815 875368 851169 828082 805910
61081 805910 784844 765458 748226 733123 719869 708449 699101 691846 686361 682238 678952 675723 672136
61068 672136 668994 667811 669063 671543 673800 675662 677953 681322 685922 691829 699139 707771 717511 728065
61054 728065 738931 749670 760547 772507 786309 802070 819739 839362 860680 883209 907056
61043 907056 932909 960856 990006 1019719 1050366 1082285 1114872 1147452 1180260 1213720 1247477
61032 1247477 1281154 1315505 1351798 1390359 1430578 1472029 1514796 1558969 1604656 1652288 1702222
61021 1702222 1754197 1807696 1862647 1919508 1979303 2044190 2117480 2202416 2301169 2415237 2546157
61010 2546157 2695528 2865251 3058332 3278851 3531316 3821634 4159279 4557144 5029188
$$ packed form
61092A080388k2721k5000k6080k6315k6457k6629k6371k5447k4199k3087k2172
61081H05910k1066j9386j7232j5103j3254j1420r348p255n485m123l286l229l587
61068F72136l142j183J252K480K257J862K291L369M600N907P310Q632R740J0554
61054G28065J0866J0739J0877J1960J3802J5761J7669J9623K1318K2529K3847
61043I07056K5853K7947K9150K9713L0647L1919L2587L2580L2808L3460L3757
61032A247477L3677L4351L6293L8561M0219M1451M2767M4173M5687M7632M9934
61021A702222N1975N3499N4951N6861N9795O4887P3290Q4936R8753J14068J30920
61010B546157J49371J69723J93081K20519K52465K90318L37645L97865M72044
$$ plain form
61001 5029188 5590807 6263024 7075491 8067099 9288465 10801001 12656121 14855600 17326968
60992 17326968 19941586 22549602 24981069 27020459 28431463 29073603 29027925 28595067 28138636
60983 28138636 27902919 27947126 28196983 28502275 28639638 28323241 27300454 25493123 23058799
60974 23058799 20309798 17562203 15032384 12823596 10960496 9422354 8165137 7139923
60966 7139923 6304780 5625302 5070837 4615042 4238218 3925390 3662537 3436577 3237806
60957 3237806 3060040 2898819 2751060 2615635 2492339 2380243 2277910 2184606 2100054 2023359
60947 2023359 1953136 1888255 1827523 1768968 1710308 1650108 1588156 1525256 1463005 1403053 1345927
60936 1345927 1291062 1238281 1188498 1142568 1100303 1061162 1025014 991644 960368 930839 903459
$$ packed form
61001E029188N61619O72217Q12467R91608J221366J512536J855120K199479K471368
60992A7326968K614618K608016K431467K039390J411004O42140m5678m32858m56431
60983B8138636k35717M4207K49857L05292J37363l16397j022787j807331k434324
60974B3058799k749001k747595k529819k208788j863100j538142j257217j025214
60966G139923q35143o79478n54465m55795l76824l12828k62853k25960j98771
60957C237806j77766j61221j47759j35425j23296j12096j02333r3304q4552p6695
60947B023359p0223o4881o0732n8555n8660o0200o1952o2900o2251n9952n7126
60936A345927n4865n2781m9783m5930m2265l9141l6148l3370l1276k9529k7380
$$ plain form
60925 903459 878438 855267 833664 814068 796550 780239 764623 750451 738428 727929 718009 708813
60913 708813 701011 694605 689402 685894 684495 684528 685107 686469 689232 692792 695684 697290 698084 698418 698144 697291
60897 697291 696110 694492 692103 688977 685327 681021 675949 670585 665458 660412 655117 649885 645112 640348
60883 640348 634876 628949 623406 618229 612463 605496 597593 589202 580507 571676 562865 554080 545560 537999
60869 537999 531737 526116 520411 514980 510601 507073 503545 500022 497463 496413 496560 497577 499333 501257
60855 501257 502574 503340 504269 505394 505910 505585 505330 505951 507215 508581 510084 511935 513838 515265 516022 516148
60839 516148 515585 514245 512100 509068 505148 500808 496806 493462 490503 487712 485349 483791 483156 483412 484412
60824 484412 485722 486761 487290 487469 487446 487233 486959 486767 486402 485345 483444 481057 478573 476218 474284 472947
$$ packed form
60925I03459k5021k3171k1603j9596j7518j6311j5616j4172j2023j0499r920r196
60913G08813p802o406n203l508j399L3N79J362K763L560K892J606P94L34k74q53
60897F97291j181j618k389l126l650m306n072n364n127n046n295n232m773m764
60883F40348n472n927n543n177n766o967p903q391q695q831q811q785q520p561
60869E37999o262n621n705n431m379l528l528l523k559j050J47J017J756J924
60855E01257J317P66R29J125N16l25k55O21J264J366J503J851J903J427P57J26
60839E16148n63j340k145l032l920m340m002l344k959k791k363j558o35K56J000
60824D84412J310J039N29J79k3k13k74j92l65j057j901k387k484k355j934j337
$$ plain form
60808 472947 471742 469826 466997 463991 461526 459497 457433 455302 453403 451613 449202 445532 440753 435764
60794 435764 431433 427898 424679 421403 418104 414756 410927 406354 401583 397571 394677 392428 390261 388134
60780 388134 386421 385427 385036 384680 383757 382210 380544 379218 378376 378247 379265 381386 383865 386183 388747 392116
60764 392116 396071 400183 404773 410369 416567 422426 427790 433095 437990 441392 443138 444391 445978 447375
60750 447375 447889 447891 448004 447878 446736 444732 442824 441426 440020 438088 435725 433072 429676 424785 418138 410288
60734 410288 402244 394916 388785 383901 380016 376737 373703 370794 368181 366085 364477 362997 361188 358888
60720 358888 356503 354695 353594 352489 350761 348969 348275 348735 348984 348059 346707 346262 346882 347782 348636 349724
60704 349724 351005 352146 353397 355413 358077 360450 362079 363555 365545 368065 370999 374466 378256 381644
$$ packed form
60808D72947j205j916k829l006k465k029k064k131j899j790k411l670m779m989
60794D35764m331l535l219l276l299l348l829m573m771m012k894k249k167k127
60780C88134j713r94l91l56r23j547j666j326q42j29J018K121K479K318K564L369
60764C92116L955M112M590N596O198N859N364N305M895L402J746J253J587J397
60750D47375N14KJ13j26j142k004j908j398j406j932k363k653l396m891o647p850
60734D10288q044p328o131m884l885l279l034k909k613k096j608j480j809k300
60720C58888k385j808j101j105j728j792o94M60K49r25j352m45O20R00Q54J088
60704C49724J281J141J251K016K664K373J629J476J990K520K934L467L790L388
$$ plain form
60690 381644 384368 387165 390766 394826 398501 401734 405255 409453 413951 418294 422527 426823 430937 434421
60676 434421 437298 440176 443519 446997 449827 451705 453006 453974 454163 452975 450401 446824 442347 436845 430536
60661 430536 424042 417886 412295 407421 403364 400039 397338 395339 394097 393441 393326 394104 395922 398088 399685
60646 399685 400705 401931 403683 405313 406017 405551 404040 401598 398413 394866 391423 388540 386520 385194 384023
60631 384023 382965 382896 384513 387039 388840 389247 388992 388946 389322 390181 391706 393557 394752 394659 393642 392448 391509
60614 391509 391064 391344 392273 393470 394737 396070 397123 397355 396949 396812 397332 397859 397784 397406 397256 397264 397191 397249 397649
60595 397649 398050 398152 398388 399369 400937 402408 403513 404535 405762 407323 409374 411897 414516 416932 419329
60580 419329 421898 424197 425606 426305 427256 429246 432335 436188 440475 444915 449361 454068 459655 466784 475964
$$ packed form
60690C81644K724K797L601M060L675L233L521M198M498M343M233M296M114L484
60676D34421K877K878L343L478K830J878J301R68J89j188k574l577m477n502o309
60661D30536o494o156n591m874m057l325k701j999j242o56j15P78J818K166J597
60646C99685J020J226J752J630P04m66j511k442l185l547l443k883k020j326j171
60631C84023j058o9J617K526J801M07k55m6L76Q59J525J851J195r3j017j194r39
60614C91509m45K80R29J197J267J333J053K32m06j37N20N27p5l78j50Qp3N8M00
60595C97649M01J02K36R81J568J471J105J022J227J561K051K523K619K416K397
60580D19329K569K299J409O99R51J990L089L853M287M440M446M707N587P129R180
$$ plain form
60565 475964 487552 501616 517789 535450 554071 573172 591929 609040 623148 633408 639607 641785
60553 641785 639890 634022 625012 614392 603545 593133 583636 576006 571147 568882 568213 568725 571134 576281
60539 576281 584225 594585 607272 622546 640752 662284 687349 715370 744917 774376 802341 827233
60527 827233 847182 860859 868168 869819 866488 858651 846918 832243 815979 799797 785081 772171
60515 772171 760540 749877 740509 732725 726390 721616 719117 719310 721580 724992 729335 734987 742239 751453
60501 751453 763529 779537 800042 825273 855687 891811 933823 981829 1036289 1097457 1164485
60490 1164485 1235576 1308803 1382192 1453157 1518574 1575479 1621306 1653656 1670577 1671162 1655468 1624000
60478 1624000 1577858 1519339 1451623 1377636 1299626 1219841 1140884 1065109 994035 928576 869368
$$ packed form
60565D75964J1588J4064J6173J7661J8621J9101J8757J7111J4108J0260O199K178
60553F41785j895n868r010j0620j0847j0412r497p630m859k265o69N12K409N147
60539E76281P944J0360J2687J5274J8206K1532K5065K8021K9547K9459K7965K4892
60527H27233J9949J3677P309J651l331p837j1733j4675j6264j6182j4716j2910
60515G72171j1631j0663r368p784o335m774k499J93K270L412M343N652P252R214
60501G51453J2076J6008K0505K5231L0414L6124M2012M8006N4460O1168O7028
60490A164485P1091P3227P3389P0965O5417N6905M5827L2350J6921N85j5694l1468
60478A624000m6142n8519o7716p3987p8010p9785p8957p5775p1074o5459n9208
$$ plain form
60467 869368 816653 770270 730042 695776 666654 641137 617999 597324 580008 566338 555329
60456 555329 545382 535350 525025 514968 505947 498295 491673 485533 479804 474905 471037 467768 464558
60443 464558 461442 458824 456719 454641 452332 450168 448601 447578 446799 446218 445952 445964 446213 446837 447728 448203
60427 448203 447706 446668 446043 446040 445920 445097 443779 442431 441257 440373 439877 439530 438909 438163 438013 438770 439902 440816
60409 440816 441521 442223 442946 443894 445528 447804 449909 451292 452384 453731 454974 455401 455102 454846 455073 455701
60393 455701 456645 457877 459123 460143 461223 462870 465171 467892 470948 474176 476986 478946 480576 482753
60379 482753 485402 487517 488558 489129 490097 491689 493683 495931 498323 500647 502799 504904 506959 508586 509361
60364 509361 509361 509314 510185 512466 515669 518660 520783 522550 524998 528497 532512 536446 540348 544832 550615 558097
$$ packed form
60467H69368n2715m6383m0228l4266k9122k5517k3138k0675j7316j3670j1009
60456E55329r947j0032j0325j0057r021p652o622o140n729m899l868l269l210
60443D64558l116k618k105k078k309k164j567j023p79n81k66J2K49O24Q91M75
60427D48203m97j038o25lj20q23j318j348j174q84m96l47o21p46j50P57J132R14
60409D40816P05P02P23R48J634K276K105J383J092J347J243M27k99k56K27O28
60393D55701R44J232J246J020J080J647K301K721L056L228K810J960J630K177
60379D82753K649K115J041N71R68J592J994K248K392K324K152K105K055J627P75
60364E09361%m7Q71K281L203K991K123J767K448L499M015L934L902M484N783P482
$$ plain form
60348 558097 567048 576691 586303 595670 604733 612901 619082 622406 622705 620386 616138 610612 604047 596248
60334 596248 587251 577886 569359 562315 556680 552262 549046 546880 545305 543802 541953 539376 535943 532128
60320 532128 528762 526300 524567 523240 522230 521533 521083 521066 522089 524798 529403 535781 543919 554099 566650
60305 566650 581731 599436 619956 643360 669054 695682 721901 747162 771273 792997 809575
60294 809575 818082 817198 807549 790672 768109 741374 712236 682663 654449 628913 606918 589111
60282 589111 575826 566537 559683 553637 547895 542831 538362 533632 528268 523093 519010 515770 512536 509165
60268 509165 506211 504012 502540 501916 502220 502872 502946 502205 501251 500588 500090 499521 499050 499067 499771 501029 502391 503226
60250 503226 503166 502431 501575 501032 501105 502037 503614 504895 504878 503456 501401 499504 498108 497283 496945 496786 496523 496245
$$ packed form
60348E58097Q951R643R612R367R063Q168O181L324K99k319m248n526o565p799
60334E96248q997r365q527p044n635m418l216k166j575j503j849k577l433l815
60320E32128l366k462j733j327j010o97m50j7J023K709M605O378Q138J0180J2551
60305E66650J5081J7705K0520K3404K5694K6628K6219K5261K4111K1724J6578
60294H09575Q507q84r649j6877k2563k6735k9138k9573k8214k5536k1995j7807
60282E89111j3285r289o854o046n742n064m469m730n364n175m083l240l234l371
60268E09165k954k199j472o24L04O52P4p41r54o63m98n69m71J7P04J258J362Q35
60250E03226o0p35q56n43P3R32J577J281j7j422k055j897j396q25l38j59k63k78
$$ plain form
60232 496245 496270 496812 498063 500320 503556 507087 510183 512869 515660 518656 521457 523843 525971 527986 529995
60217 529995 532392 535586 539369 543102 546579 550229 554489 559467 565191 571586 578156 584251 589791 595260
60203 595260 600895 606337 611203 615543 619585 623384 626823 629650 631504 632203 631977 631093 629456 626967 624078
60188 624078 621453 619181 616802 613956 610443 605958 600543 595165 591022 588218 585908 583633 581622 579750
60174 579750 577362 574513 572326 571539 571486 571191 570782 571081 572249 573547 574222 574064 573281 572295 571553 571278 571469
60157 571469 572203 573571 575224 576435 576899 577116 577764 579026 580753 582851 585281 587953 590855 594019 597307
60142 597307 600648 604479 609353 614982 620338 624990 629663 635117 641165 647327 653794 660975 668473 675239
60128 675239 680644 684844 688209 690775 692238 692200 690648 688384 686698 686281 686712 687178 687341 687247 686966 686788 687295
$$ packed form
60232D96245K5N42J251K257L236L531L096K686K791K996K801K386K128K015K009
60217E29995K397L194L783L733L477L650M260M978N724O395O570O095N540N469
60203E95260N635N442M866M340M042L799L439K827J854O99k26q84j637k489k889
60188F24078k625k272k379k846l513m485n415n378m143k804k310k275k011j872
60174E79750k388k849k187p87n3k95m09K99J168J298O75j58p83r86p42k75J91
60157E71469P34J368J653J211M64K17O48J262J727K098K430K672K902L164L288
60142E97307L341L831M874N629N356M652M673N454O048O162O467P181P498O766
60128F75239N405M200L365K566J463l8j552k264j686m17M31M66J63r4k81j78N07
$$ plain form
60111 687295 688609 689915 690322 689908 689298 688483 686876 684364 681449 678205 673963 668436 662507 657313 652877
60096 652877 648283 643094 638026 634077 631444 629707 628789 629209 631242 634364 637845 641568 645794 650415 654987
60081 654987 659480 664308 669428 673912 676710 677474 676460 674010 670356 665532 659224 651083 641502 631683
60067 631683 622557 613966 605345 596876 589366 583114 577489 571769 565927 560399 555416 550868 546693 543068
60053 543068 540147 537800 535840 534424 533952 534500 535657 537153 539304 542471 546321 550134 553732 557495 561444
60038 561444 564860 567024 567917 567978 567559 566823 565817 564386 562238 559303 555855 552198 548421 544476 540236
60023 540236 535487 530200 524701 519239 513511 507177 500765 495384 491408 488065 484456 480328 475655 470338
60009 470338 464800 460193 457343 455898 455015 454489 454620 455343 456115 456540 456612 456485 456466 457085 458719 461123 463538
$$ packed form
60111F87295J314J306M07m14o10q15j607k512k915l244m242n527n929n194m436
60096F52877m594n189n068l949k633j737r18M20K033L122L481L723M226M621M572
60081F54987M493M828N120M484K798P64j014k450l654m824o308q141r581r819
60067F31683r126q591q621q469p510o252n625n720n842n528m983m548m175l625
60053E43068k921k347j960j416m72N48J157J496K151L167L850L813L598L763L949
60038E61444L416K164Q93O1m19p36j006j431k148k935l448l657l777l945m240
60023E40236m749n287n499n462n728o334o412n381l976l343l609m128m673n317
60009D70338n538m607k850j445q83n26J31P23P72M25P2j27j9O19J634K404K415
$$ plain form
59992 463538 465336 466455 467395 468817 470968 473419 475631 477674 479932 482189 483669 484148 484306 484659 484832
59977 484832 484340 483438 482621 481808 480631 479133 477596 476050 474548 473566 473515 474109 474770 475430 476419 477805 479395
59960 479395 481189 483355 485872 488597 491481 494393 497045 499396 501617 503210 502809 499670 494951 490681
59946 490681 487736 485595 483776 482481 481852 481579 481413 481369 481226 480514 479169 477635 476225 474885 473715 473103
59930 473103 473199 473826 475032 477206 480449 484387 488763 493740 499393 505407 511520 517808 524273 530581 536511
59915 536511 542292 548178 553963 559211 563709 567504 570716 573588 576435 579349 582117 584595 586956 589376
59901 589376 591699 593592 594857 595387 595066 593974 592544 591225 590051 588841 587792 587567 588609 590572 592657
59886 592657 594538 596670 599569 603011 606298 609272 612646 617186 622882 629133 635437 641570 647283 652235
$$ packed form
59992D63538J798J119R40J422K151K451K212K043K258K257J480M79J58L53J73
59977D84832m92r02q17q13j177j498j537j546j502r82n1N94O61O60R89J386J590
59960D79395J794K166K517K725K884K912K652K351K221J593m01l139m719m270
59946D90681k945k141j819j295o29k73j66m4j43p12j345j534j410j340j170o12
59930D73103R6O27J206K174L243L938M376M977N653O014O113O288O465O308N930
59915E36511N781N886N785N248M498L795L212K872K847K914K768K478K361K420
59901E89376K323J893J265N30l21j092j430j319j174j210j049k25J042J963K085
59886E92657J881K132K899L442L287K974L374M540N696O251O304O133N713M952
$$ plain form
59872 652235 656155 658814 659890 659172 656868 653498 649550 645405 641473 638053 635113 632472 630165 628376
59858 628376 627043 625873 624751 623849 623275 622890 622574 622501 623088 624806 628019 632795 638895 646144 654732 664774
59842 664774 675503 685325 692940 698145 701284 702280 700790 697314 693537 691186 690737 691459 692375 692731 691701
59827 691701 688400 682518 674581 665302 654987 643958 633173 623880 616690 611335 607211 603786 600617
59814 600617 597463 594395 591460 588355 584811 581160 577949 575145 572341 569687 567877 567094 566708 566216 565744
59799 565744 565317 564370 562498 560166 558166 556757 555721 554786 553526 551276 547712 543372 539230 535947 533663
59784 533663 532139 530766 528846 526206 523292 520476 517722 515149 513360 512789 513156 513906 514754 515509 515972 516451
59768 516451 517793 520323 523229 525540 527361 529607 532951 537508 543043 548947 554430 559317 564272 569755
$$ packed form
59872F52235L920K659J076p18k304l370l948m145l932l420k940k641k307j789
59858F28376j333j170j122r02n74l85l16p3N87J718L213M776O100P249Q588J0042
59842F64774J0729R822P615N205L139R96j490l476l777k351m49P22R16L56j030
59827F91701l301n882p937r279j0315j1029j0785r293p190n355m124l425l169
59814F00617l154l068k935l105l544l651l211k804k804k654j810p83l86m92m72
59799E65744m27r47j872k332k000j409j036r35j260k250l564m340m142l283k284
59784E33663j524j373j920k640k914k816k754k573j789n71L67P50Q48P55M63M79
59768E16451J342K530K906K311J821K246L344M557N535N904N483M887M955N483
$$ plain form
59754 569755 575361 580774 586674 593759 601373 608070 613347 617991 622937 628575 634866 641246 646537 649837
59740 649837 651491 652534 653389 653821 653924 654167 654517 654363 653355 651592 649023 645505 641478 637790 634724 631884
59724 631884 629097 626700 624793 622933 620784 618511 616373 614388 612458 610330 607545 603959 600299 597517
59710 597517 595627 593815 591644 589444 587554 586022 585163 585588 587334 589670 592015 594458 597088 599425 600952
59695 600952 601781 602411 603123 603855 604436 604790 605058 605469 605895 605742 604710 603440 602833 602879 602748 601905 600476 598574
59677 598574 596050 593033 589999 587052 583714 579597 574780 569367 563284 556814 550869 546362 543422 541356
59663 541356 539278 536911 534961 534415 535195 535937 535574 534738 534948 536877 540196 544631 550012 555455 559674 562307
59647 562307 564014 565211 565583 564956 563651 561760 558958 555269 551221 547088 542856 539055 536655 535827 535703
$$ packed form
59754E69755N606N413N900P085P614O697N277M644M946N638O291O380N291L300
59740F49837J654J043Q55M32J03K43L50j54j008j763k569l518m027l688l066k840
59724F31884k787k397j907j860k149k273k138j985j930k128k785l586l660k782
59710E97517j890j812k171k200j890j532q59M25J746K336K345K443K630K337J527
59695F00952Q29O30P12P32N81L54K68M11M26j53j032j270o07M6j31q43j429j902
59677E98574k524l017l034k947l338m117m817n413o083o470n945m507k940k066
59663E41356k078k367j950n46P80P42l63q36K10J929L319M435N381N443M219K633
59647E62307J707J197L72o27j305j891k802l689m048m133m232l801k400q28j24
$$ plain form
59632 535703 535624 535679 535769 535226 533845 532277 530865 529006 526319 523472 521153 519020 516576 514358 513243 512964
59616 512964 512190 509957 506426 502479 499156 497242 496886 497572 498731 500210 502057 504202 506545 508994 511274
59601 511274 513068 514494 515975 517509 518568 518859 518677 518431 518386 518921 520287 521977 523124 523711 524529 525667
59585 525667 526056 525030 523407 522418 522322 522659 523095 523235 522319 519976 516895 514061 511683 509387 506996 504539
59569 504539 501970 499496 497724 496935 496600 496155 495823 496178 497376 499277 501681 503887 504743 503948 502785 502722
59553 502722 503759 504966 506058 507420 508907 509893 510528 511912 514769 518791 523539 529278 536535 545377 555605
59538 555605 567382 581267 597616 616106 635749 655138 672401 684977 690091 686407 675547 661596
59526 661596 648776 639529 634407 632918 634141 637136 641271 645953 650066 652274 652121 650221 647074 642276
$$ packed form
59632E35703p9N5R0n43j381j568j412j859k687k847k319k133k444k218j115k79
59616E12964p74k233l531l947l323j914l56O86J159J479J847K145K343K449K280
59601E11274J794J426J481J534J059K91j82k46m5N35J366J690J147N87Q18J138
59585E25667L89j026j623r89r6L37M36J40r16k343l081k834k378k296k391k457
59569E04539k569k474j772p89l35m45l32L55J198J901K404K206Q56p95j163o3
59553E02722J037J207J092J362J487R86O35J384K857M022M748N739P257Q842J0228
59538E55605J1777J3885J6349J8490J9643J9389J7263J2576N114l684j0860j3951
59526F61596j2820r247n122j489J223K995M135M682M113K208j53j900l147m798
$$ plain form
59512 642276 635266 626253 615966 605011 593941 583444 573969 565484 557929 551469 545999 540980 536135
59499 536135 531757 527937 524117 519896 515778 512621 510816 510401 511341 513132 514671 515172 514831 514205 513491 512925
59483 512925 513214 514898 517696 521078 524940 529228 533495 537505 541679 546277 550759 554745 559010 564525
59469 564525 570901 576706 581104 584346 586849 588674 589885 590802 591904 593855 597304 602215 607772 613439
59455 613439 619677 627092 635423 644082 653126 662866 672944 682644 691778 700393 707919 713435 716536 717139
59441 717139 714780 708968 700084 689136 676903 664158 652325 642784 635564 629702 624827 621423 619508
59428 619508 618233 617118 616884 618623 622756 629074 637245 646933 657880 670198 684352 700619 718768
59415 718768 738421 759609 782804 808265 835155 861427 884899 904189 917977 923692 918421 901968
$$ packed form
59512F42276p010r013j0287j0955j1070j0497r475q485p555o460n470n019m845
59499E36135m378l820l820m221m118l157j805m15R40J791J539N01l41o26p14n66
59483E12925K89J684K798L382L862M288M267M010M174M598M482L986M265N515
59469E64525O376N805M398L242K503J825J211R17J102J951L449M911N557N667
59455F13439O238P415Q331Q659R044R740J0078R700R134Q615P526N516L101O03
59441G17139k359n812q884j0948j2233j2745j1833r541p220n862m875l404j915
59428F19508j275j115k34J739M133O318Q171R688J0947J2318J4154J6267J8149
59415G18768J9653K1188K3195K5461K6890K6272K3472J9290J3788N715n271j6453
$$ plain form
59403 901968 878329 853535 832541 818259 811892 812736 818371 826294 834898 841953 843225 834563 815528
59390 815528 789839 762359 736606 714656 697519 684930 675691 668759 663626 659807 656824 654765 654111
59377 654111 654910 656676 658896 661060 662559 663341 664337 666332 668788 670742 672434 674851 677932 680612 682599
59362 682599 684840 688067 692067 696581 701786 707621 713684 720095 727561 736373 746253 757252 769761 783403
59348 783403 796960 809785 822488 835952 850482 866070 882536 899068 914387 927614 938307
59337 938307 945733 949140 948836 945940 940793 932679 921359 907850 893213 877574 860816 843403 826036
59324 826036 809241 793613 779684 767183 755215 743484 732541 722621 713209 704100 695916 689067
59312 689067 683098 677489 672199 666973 661137 654704 648805 644388 641302 639271 638825 640431 643528 647443
$$ packed form
59403I01968k3639k4794k0994j4282o367Q44N635P923Q604P055J272q662j9035
59390H15528k5689k7480k5753k1950j7137j2589r239o932n133l819k983k059o54
59377F54111P99J766K220K164J499P82R96J995K456J954J692K417L081K680J987
59362F82599K241L227M000M514N205N835O063O411P466Q812R880J0999J2509J3642
59348G83403J3557J2825J2703J3464J4530J5588J6466J6532J5319J3227J0693
59337I38307P426L407l04k896n147q114j1320j3509j4637j5639j6758j7413j7367
59324H26036j6795j5628j3929j2501j1968j1731j0943r920r412r109q184o849
59312F89067n969n609n290n226n836o433n899m417l086k031m46J606L097L915
$$ plain form
59298 647443 652772 660908 672493 687015 703548 721082 738224 753113 763602 767456 763044 750534
59286 750534 732218 711298 690454 671574 656029 644500 636777 632233 630425 631136 634196 639469 646738
59273 646738 655500 665331 676452 689368 703846 718862 733633 747924 761207 772463 781264 788167
59261 788167 793475 796362 795922 792433 786907 779918 771670 762764 754053 745839 737872 730132 723077 717096
59247 717096 712071 707578 703420 699998 698142 698370 700347 703312 706985 711682 717630 724632 732347 740362
59233 740362 747994 754534 759753 763781 766607 768256 769185 769727 769200 766458 761284 754436 746376 737018 726767
59218 726767 716628 706933 697021 686627 676632 667871 660066 652455 644763 637140 629881 623628 619081 616069
59204 616069 613608 611173 609098 607473 605724 603751 602455 602500 603430 604577 605929 607449 608542 608991 609629
$$ packed form
59298F47443N329Q136J1585J4522J6533J7534J7142J4889J0489L854m412j2510
59286G50534j8316k0920k0844j8880j5545j1529p723m544j808P11L060N273P269
59273F46738Q762R831J1121J2916J4478J5016J4771J4291J3283J1256Q801O903
59261G88167N308K887m40l489n526o989q248q906q711q214p967p740p055n981
59247G17096n025m493m158l422j856K28J977K965L673M697N948P002P715Q015
59233G40362P632O540N219M028K826J649R29N42n27k742n174o848q060r358j0251
59218G26767j0139r695r912j0394r995q761p805p611p692p623p259o253m547l012
59204F16069k461k435k075j625j749j973j296M5R30J147J352J520J093M49O38
$$ plain form
59189 609629 611276 613756 616614 619967 623886 627721 630937 633932 637247 640680 643988 647681 652203 657035
59175 657035 661569 666233 671753 677901 683969 689993 696514 703591 710995 718885 727286 735291 741815 746846
59161 746846 751026 754308 755962 755591 753212 748665 741931 733766 725006 715396 704103 691309 678316 666170
59147 666170 655087 645177 636708 629489 622848 616458 610499 604902 599097 592764 586310 580459 575747 572427
59133 572427 570321 568707 566796 564473 562336 561071 561077 562463 565011 568226 571820 576044 581291 587569 594695
59118 594695 602739 611870 622012 633039 645073 658135 671726 685157 698177 710911 723345 735107
59106 735107 745561 753982 760050 764405 768240 772043 775134 776632 776298 774173 770241 765019 759681 754860
59092 754860 749952 744380 738973 735163 733257 732433 732103 732274 732656 732325 730357 726241 719786 711287 701756
$$ packed form
59189F09629J647K480K858L353L919L835L216K995L315L433L308L693M522M832
59175F57035M534M664N520O148O068O024O521P077P404P890Q401Q005O524N031
59161G46846M180L282J654l71k379m547o734q165q760r610j1293j2794j2993j2146
59147F66170j1083r910q469p219o641o390n959n597n805o333o454n851m712l320
59133E72427k106j614j911k323k137j265OJ386K548L215L594M224N247O278P126
59118E94695Q044R131J0142J1027J2034J3062J3591J3431J3020J2734J2434J1762
59106G35107J0454Q421O068M355L835L803L091J498l34k125l932n222n338m821
59092G54860m908n572n407l810j906q24l30J71L82l31j968m116o455q499r531
$$ plain form
59077 701756 692376 683692 675660 668220 661305 654541 647576 640643 634312 628870 624265 620383 616892 613153
59063 613153 608894 604764 601694 599832 598570 597398 596243 595144 594069 592944 591612 589971 588326 587199
59049 587199 586560 585765 584579 583627 583404 583507 583399 583263 583475 583835 584047 584382 585111 585749 585673 585091 584720 584974 586132
59030 586132 588741 592997 598208 603728 610019 617952 627494 638012 649488 662400 676578 691150 705492
59017 705492 719382 732243 742946 750390 753900 753371 749608 744144 738146 731830 725372 719661 715456 712542
59003 712542 710606 710267 712195 715826 720112 725052 731299 738659 746211 753563 760680 766722 770434 771750
58989 771750 771823 771444 770458 768626 765894 761778 755767 748541 741733 736231 731698 727873 725334 724678 725863
58974 725863 728731 733422 739983 748187 757923 769188 781590 794444 807429 820699 834384 848442
$$ packed form
59077G01756r380q684q032p440o915o764o965o933o331n442m605l882l491l739
59063F13153m259m130l070j862j262j172j155j099j075j125j332j641j645j127
59049E87199o39p95j186r52k23J03j08j36K12L60K12L35P29O38p6n82l71K54J158
59030E86132K609M256N211N520O291P933R542J0518J1476J2912J4178J4572J4342
59017G05492J3890J2861J0703P444L510n29l763n464n998o316o458n711m205k914
59003G12542j936l39J928L631M286M940O247P360P552P352P117O042L712J316
58989G71750P3l79r86j832k732m116o011p226o808n502m533l825k539o56J185
58974G25863K868M691O561Q204R736J1265J2402J2854J2985J3270J3685J4058
$$ plain form
58962 848442 862745 876747 889362 899864 908575 915976 921571 924380 924068 920611 913395 901921 887080
58949 887080 870459 852563 832993 812251 791967 773239 756023 740313 726694 715482 706434 699504
58937 699504 694851 691940 689748 687998 687083 686626 685383 682939 680289 678285 676614 674751 672844 671026 668849
58922 668849 666100 663475 661794 661043 660613 660017 659035 657733 656584 656093 656152 656280 656535 657605 659947 663468
58906 663468 668029 673604 680078 687638 697194 709476 723801 738692 753671 769400 786137 803276
58894 803276 820512 838201 856266 873973 891260 909244 928931 950302 973016 997015 1021848
58883 1021848 1046147 1068252 1086864 1101014 1110209 1114800 1115426 1111967 1103887 1091593 1076411 1059081
58871 1059081 1039501 1018245 997071 977413 959421 943005 928744 917032 907225 898335 889933 881823
$$ packed form
58962H48442J4303J4002J2615J0502Q711P401N595K809l12l457p216j1474j4841
58949H87080j6621j7896j9570k0742k0284j8728j7216j5710j3619j1212r048o930
58937F99504m653k911k192j750r15m57j243k444k650k004j671j863j907j818k177
58922F68849k749k625j681p51m30n96r82j302j149m91N9J28K55J070K342L521
58906F63468M561N575O474P560R556J2282J4325J4891J4979J5729J6737J7139
58894H03276J7236J7689J8065J7707J7287J7984J9687K1371K2714K3999K4833
58883A021848K4299K2105J8612J4150R195M591O26l459q080j2294j5182j7330
58871A059081j9580k1256k1174j9658j7992j6416j4261j1712r807q890q402q110
$$ plain form
58859 881823 873477 864335 854168 842876 830504 817654 805197 793439 782280 772141 763674 756469
58847 756469 749258 741712 734774 728733 722221 713927 704306 694776 685993 677665 669412 661096 652809 645045
58833 645045 638417 632850 627649 622594 618243 614917 612190 609757 607952 607046 606834 607287 608822 611508 614775
58818 614775 618249 622135 626500 631071 635970 641624 647559 652332 655233 657136 659094 660990 662087 662083 661001
58803 661001 658851 655987 653085 650348 647366 644023 640683 637213 632865 627531 622036 616701 610732 603712
58789 603712 596703 591093 587184 584613 583330 583462 584873 587484 591402 596313 601423 606342 611244 615949
58775 615949 619827 622859 625646 627971 628634 627189 624554 621257 616510 609852 602400 595413 588790 582109
58761 582109 576100 571825 569214 567553 566767 567178 568577 570565 573284 576967 581195 585293 588954 591995 594249
$$ packed form
58859H81823q346r142j0167j1292j2372j2850j2457j1758j1159j0139q467p205
58847G56469p211p546o938o041o512q294r621r530q783q328q253q316q287p764
58833F45045o628n567n201n055m351l326k727k433j805r06k12M53J535K686L267
58818F14775L474L886M365M571M899N654N935M773K901J903J958J896J097mj082
58803F61001k150k864k902k737k982l343l340l470m348n334n495n335n969p020
58789F03712p009n610l909k571j283J32J411K611L918M911N110M919M902M705
58775F15949L878L032K787K325O63j445k635l297m747o658p452o987o623o681
58761E82109o009m275k611j661p86M11J399J988K719L683M228M098L661L041K254
$$ plain form
58746 594249 596196 598854 602451 606144 609580 613639 618957 624948 631208 638616 647820 657691 666601 674450
58732 674450 682222 690350 698752 707761 717668 727761 736951 744942 751905 757657 762244 766689 771991 777853
58718 777853 783535 789468 796862 805969 815861 825670 835083 843746 851046 856431 859415 859582 857033 852344
58704 852344 845480 835420 821521 804644 786209 766712 745920 723977 701514 679124 657441 637256
58692 637256 618985 602533 588120 576499 567776 560821 554463 548472 542804 536932 530768 525286 521229
58679 521229 517971 514590 511300 508934 507732 507488 508221 509913 512397 516166 522333 530921 540270 549111 558283
58664 558283 569341 582436 596601 611085 625135 637331 646441 652309 654939 653667 648377 640614 632180
58651 632180 623430 614099 604863 596681 589400 582408 575985 570733 566430 562715 560083 558849 557964 556348
$$ packed form
58746E94249J947K658L597L693L436M059N318N991O260P408R204R871Q910P849
58732F74450P772Q128Q402R009R907J0093R190P991O963N752M587M445N302N862
58718G77853N682N933P394R107R892R809R413Q663P300N385K984J67k549m689
58704H52344o864j0060j3899j6877j8435j9497k0792k1943k2463k2390k1683k0185
58692F37256j8271j6452j4413j1621q723o955o358n991n668n872o164n482m057
58679E21229l258l381l290k366j202k44P33J692K484L769O167Q588R349Q841R172
58664E58283J1058J3095J4165J4484J4050J2196R110N868K630j272n290p763q434
58651F32180q750r331r236q182p281o992o423n252m303l715k632j234q85j616
$$ plain form
58637 556348 554673 554334 555363 556853 558749 561577 564925 567738 569767 571355 572258 572038 571136 570291 569516 568842
58621 568842 569266 571520 574675 577542 580649 585197 590838 596344 601822 608295 615479 621868 626747 630343
58607 630343 632324 632067 630240 628300 626503 624113 621384 619477 618396 616772 613861 610214 606342 602316
58593 602316 598746 596557 595626 595056 594944 596549 600686 607185 615782 626119 637025 647301 657282 668225
58579 668225 680261 692261 703514 713970 723068 730030 735388 740572 745955 750888 755779 762422 771988
58566 771988 784214 798868 816493 837240 860373 885334 912128 940160 967770 993254 1015520
58555 1015520 1033641 1046758 1054573 1057134 1054332 1046552 1035618 1023936 1012791 1002369 992925 984662
58543 984662 976733 967717 956980 944531 930052 913380 895459 877393 858964 839634 820512 803546
$$ packed form
58637E56348j675l39J029J490J896K828L348K813K029J588R03k20r02q45p75o74
58621E68842M24K254L155K867L107M548N641N506N478O473P184O389M879L596
58607F30343J981k57j827j940j797k390k729j907j081j624k911l647l872m026
58593F02316l570k189r31n70j12J605M137O499Q597J0337J0906J0276R981J0943
58579F68225J2036J2000J1253J0456R098O962N358N184N383M933M891O643R566
58566G71988J2226J4654J7625K0747K3133K4961K6794K8032K7610K5484K2266
58555A015520J8121J3117P815K561k802p780j0934j1682j1145j0422r444q263
58543I84662p929r016j0737j2449j4479j6672j7921j8066j8429j9330j9122j6966
$$ plain form
58531 803546 789099 776086 764356 755031 748536 744091 741360 740832 742326 744675 747171 749913 752544 754106
58517 754106 754393 754132 753571 752168 749781 747012 744202 741134 737703 733920 729512 724498 719784 716109 712954
58502 712954 709637 706713 704944 703704 702031 700396 699599 698708 696187 692546 689713 688174 686890 685700 685647
58487 685647 687056 689352 692635 697488 703501 709975 717746 728248 741136 754892 769272 784769 800147
58474 800147 813228 823863 833398 841223 844709 842833 837219 829347 819339 807849 796486 785904 775893
58461 775893 767641 763270 762724 763817 765756 769865 776261 782878 788816 795870 805426 816163 826017 834199
58447 834199 840161 842692 841334 837031 830593 822295 813463 806313 801464 797568 794036 792087 792524 794567
58433 794567 797479 801289 805472 809125 812920 818599 826108 833638 840890 849645 860473 871517 881313 890214
$$ packed form
58531H03546j4447j3013j1730r325o495m445k731n28J494K349K496K742K631J562
58517G54106K87k61n61j403k387k769k810l068l431l783m408n014m714l675l155
58502G12954l317k924j769j240j673j635p97q91k521l641k833j539j284j190n3
58487F85647J409K296L283M853O013O474P771J0502J2888J3756J4380J5497J5378
58474H00147J3081J0635R535P825L486j876n614p872j0008j1490j1363j0582j0011
58461G75893q252m371n46J093J939M109O396O617N938P054R556J0737R854Q182
58447H34199N962K531j358m303o438q298q832p150m849l896l532j949M37K043
58433G94567K912L810M183L653L795N679P509P530P252Q755J0828J1044R796Q901
$$ plain form
58419 890214 898207 903945 906847 907723 906517 901992 894409 885881 877249 867349 856212 846053 837964 830462
58405 830462 822504 815222 809473 804494 800266 798444 799454 801322 802782 804981 808794 813108 817198 822160
58391 822160 828463 834555 839359 843672 847810 850410 850956 850971 851479 851881 852459 854984 859483 863434 865682 868204
58375 868204 872413 876867 880437 884603 890577 897044 902878 909382 917742 926850 935622 944887 955157 965210
58361 965210 974743 985658 998752 1011920 1023569 1034984 1047274 1058760 1067543 1074044 1079059 1082031
58349 1082031 1083147 1084355 1086381 1087621 1087780 1089450 1094175 1100263 1106569 1114947 1126580 1139362 1151600
58336 1151600 1165016 1181358 1199172 1216652 1234500 1253225 1270757 1285620 1299364 1313013 1324203
58325 1324203 1330781 1334286 1337059 1338924 1339536 1340788 1343928 1347290 1349661 1352799 1357980 1363529 1368539 1375414
$$ packed form
58419H90214P993N738K902Q76j206m525p583q528q632r900j1137j0159q089p502
58405H30462p958p282n749m979m228j822J010J868J460K199L813M314M090M962
58391H22160O303O092M804M313M138K600N46J5N08M02N78K525M499L951K248K522
58375H68204M209M454L570M166N974O467N834O504Q360R108Q772R265J0270J0053
58361I65210R533J0915J3094J3168J1649J1415J2290J1486Q783O501N015K972
58349A082031J116J208K026J240J59J670M725O088O306Q378J1633J2782J2238
58336A151600J3416J6342J7814J7480J7848J8725J7532J4863J3744J3649J1190
58325A324203O578L505K773J865O12J252L140L362K371L138N181N549N010O875
$$ plain form
58311 1375414 1385694 1397066 1407662 1419494 1434303 1449901 1464216 1479130 1496533 1514381 1530535
58300 1530535 1546797 1565148 1583723 1600495 1617183 1635395 1652794 1667512 1682513 1701020 1721293
58289 1721293 1740490 1759978 1782036 1804980 1826520 1848477 1873326 1899487 1924833 1951304 1981198
58278 1981198 2012591 2043305 2075601 2111843 2149478 2185670 2222948 2264663 2308779 2351938 2395830
58267 2395830 2443650 2494052 2544623 2597520 2655520 2716218 2776272 2837593 2903124 2970443 3035964
58256 3035964 3101492 3170062 3239329 3305883 3372126 3442045 3514317 3586561 3662133 3745430 3834641
58245 3834641 3926363 4023025 4128340 4240127 4355330 4477369 4610550 4752143 4898133 5051643
58235 5051643 5217265 5392551 5574025 5765970 5974077 6196215 6429041 6677521 6947839
$$ packed form
58311A375414J0280J1372J0596J1832J4809J5598J4315J4914J7403J7848J6154
58300A530535J6262J8351J8575J6772J6688J8212J7399J4718J5001J8507K0273
58289A721293J9197J9488K2058K2944K1540K1957K4849K6161K5346K6471K9894
58278A981198L1393L0714L2296L6242L7635L6192L7278M1715M4116M3159M3892
58267B395830M7820N0402N0571N2897N8000O0698O0054O1321O5531O7319O5521
58256C035964O5528O8570O9267O6554O6243O9919P2272P2244P5572Q3297Q9211
58245C834641R1722R6662J05315J11787J15203J22039J33181J41593J45990J53510
58235E051643J65622J75286J81474J91945K08107K22138K32826K48480K70318
$$ plain form
58226 6947839 7237295 7541920 7867480 8221916 8603947 9010808 9449975 9930770 10452076
58217 10452076 11011636 11619755 12290145 13025634 13827799 14712278 15699284 16798636 18021274
58208 18021274 19396622 20961841 22745406 24781478 27130652 29866827 33054497 36758234
58200 36758234 41060030 46045932 51795756 58419202 66096877 75074730 85657078 98255430
58192 98255430 113445829 131971311 154701729 182496298 215800382 254049945 295390373
58185 295390373 337055499 375943273 408658027 431245654 439745611 431932721 408933265
58178 408933265 375083195 336035030 296668028 260068497 227540256 199044499 173813318
58171 173813318 151059320 130453337 112080946 96082051 82421056 70915327 61320514
$$ packed form
58226F947839K89456L04625L25560L54436L82031M06861M39167M80795N21306
58217A0452076N59560O08119O70390P35489Q02165Q84479R87006J099352J222638
58208A8021274J375348J565219J783565K036072K349174K736175L187670L703737
58200C6758234M301796M985902N749824O623446P677675Q977853J0582348J2598352
58192I8255430J5190399J8525482K2730418K7794569L3304084L8249563M1340428
58185B95390373M1665126L8887774L2714754K2587627Q499957p812890k2999456
58178D08933265l3850070l9048165l9367002l6599531l2528241k8495757k5231181
58171A73813318k2753998k0605983j8372391j5998895j3660995j1505729r594813
$$ plain form
58164 61320514 53352592 46715470 41160109 36499396 32570385 29222759 26346095 23870020
58156 23870020 21730078 19859815 18214586 16771786 15503098 14369971 13346837 12424883
58148 12424883 11591251 10825543 10117569 9468577 8873938 8322512 7812882 7352370 6939414
58139 6939414 6562953 6218699 5910037 5633140 5376794 5137049 4917287 4713724 4515285
58130 4515285 4318462 4129091 3949134 3774626 3606745 3451955 3310241 3175067 3045554
58121 3045554 2927164 2819867 2717140 2617590 2526488 2444717 2366747 2290833 2221137 2158325 2097575
58110 2097575 2037294 1980877 1928567 1876181 1823006 1772726 1725678 1678299 1630930 1587962 1549445
58099 1549445 1510554 1470231 1432435 1397982 1363119 1327371 1295052 1267506 1241081 1214312 1190098
$$ packed form
58164F1320514p967922o637122n555361m660713l929011l347626k876664k476075
58156B3870020k139942j870263j645229j442800j268688j133127j023134r21954
58148A2424883q33632p65708p07974o48992n94639n51426n09630m60512m12956
58139F939414l76461l44254l08662k76897k56346k39745k19762k03563j98439
58130D515285j96823j89371j79957j74508j67881j54790j41714j35174j29513
58121C045554j18390j07297j02727r9550r1102q1771p7970p5914o9696o2812o0750
58110B097575o0281n6417n2310n2386n3175n0280m7048m7379m7369m2968l8517
58099A549445l8891m0323l7796l4453l4863l5748l2319k7546k6425k6769k4214
$$ plain form
58088 1190098 1169221 1148415 1126542 1106476 1089347 1072747 1055846 1040509 1026289 1009953 990900
58077 990900 971656 952418 930742 907098 885037 865237 845060 824444 806393 791064 775322
58066 775322 758860 744862 733800 722515 710461 700967 695048 689637 683259 677882 673755 667952 659541
58053 659541 650962 642848 632797 620840 610855 604640 599471 593303 587579 583165 578273 572322 567318 563508
58039 563508 558064 549968 541926 535612 529198 521463 514235 508774 503527 497318 491096 484916 476892 466786
58025 466786 456988 448485 439502 429594 421218 415584 410664 404960 399631 395289 390462 384981 381198 379947
58011 379947 378786 376118 373594 372545 371492 369293 367586 367886 369107 369891 370715 371866 372082 370954 370160
57996 370160 370753 371714 372430 373874 376096 377459 377611 378259 379692 379647 377076 373936 371718 369339 366062 363292
$$ packed form
58088A190098k0877k0806k1873k0066j7129j6600j6901j5337j4220j6336j9053
58077I90900j9244j9238k1676k3644k2061j9800k0177k0616j8051j5329j5742
58066G75322j6462j3998j1062j1285j2054r494n919n411o378n377m127n803q411
58053F59541q579q114j0051j1957r985o215n169o168n724m414m892n951n004l810
58039E63508n444q096q042o314o414p735p228n461n247o209o222o180q024j0106
58025D66786r798q503q983r908q376n634m920n704n329m342m827n481l783j251
58011C79947j161k668k524j049j053k199j707L00J221P84Q24J151K16j128p94
57996C70160N93R61P16J444K222J363J52O48J433m5k571l140k218k379l277k770
$$ plain form
57980 363292 361555 358769 353573 347649 342781 338278 333241 328731 325694 323195 320598 319114 319378 319913 319700
57965 319700 319795 320676 320553 318275 315479 313978 313357 313001 313971 316732 319337 320040 319703 319592 318859 316344 312898
57948 312898 309811 306671 302770 299040 296719 295600 295224 296224 298951 302423 306141 311258 318622 327393
57934 327393 336881 347761 360094 372160 382739 392530 401912 409473 414309 417572 420047 420337 417242
57921 417242 411857 405500 397710 388277 379177 372236 366600 360573 354323 348848 344032 339732 337148 337058 338165
57906 338165 339035 340227 342724 345903 348814 351740 354599 355646 353851 350928 348874 347056 343951 340225
57892 340225 337672 336362 335079 333552 332102 330170 327292 324605 323426 323233 322781 322098 321640 320678 318441
57877 318441 315693 313284 310270 305500 300013 295861 293391 291503 289667 287832 285352 281940 278880 277532
$$ packed form
57980C63292j737k786n196n924m868m503n037m510l037k499k597j484K64N35k13
57965C19700R5Q81j23k278k796j501o21l56R70K761K605P03l37j11p33k515l446
57948C12898l087l140l901l730k321j119l76J000K727L472L718N117P364Q771
57934C27393R488J0880J2333J2066J0579R791R382P561M836L263K475K90l095
57921D17242n385o357p790r433r100o941n636o027o250n475m816m300k584r0J107
57906C38165Q70J192K497L179K911K926K859J047j795k923k054j818l105l726
57892C40225k553j310j283j527j450j932k878k687j179j93m52o83m58r62k237
57877C18441k748k409l014m770n487m152k470j888j836j835k480l412l060j348
$$ plain form
57863 277532 277472 277780 279108 282656 288036 294072 300808 308872 317663 326038 334090 342523 351000 358694 365643
57848 365643 371903 376324 377916 377587 376775 375238 371916 367116 362030 356826 350941 344493 337821 330441 322142
57833 322142 314228 308021 303040 298250 294009 291036 288554 285488 282545 281109 280919 280823 280968 282165 283865
57818 283865 284823 285103 285460 285526 284621 283618 283863 284912 285388 285294 285253 284139 279934 272603 263947 254978 245642
57801 245642 236701 229556 224307 220065 216976 215863 216173 216411 216440 217280 218828 219965 220704 222087 224104 225903
57785 225903 228012 232054 238214 245083 252038 259627 267580 274804 281551 289296 298107 306248 312812 318613
57771 318613 324064 328324 331078 333117 334511 334156 331790 328565 324957 320008 313376 306267 299460 292148
57757 292148 283751 275302 268063 262093 257124 253518 251350 249656 247509 245043 242816 241057 240027 240167
$$ packed form
57863B77532o0L08J328L548N380O036O736Q064Q791Q375Q052Q433Q477P694O949
57848C65643O260M421J592l29q12j537l322m800n086n204n885o448o672p380q299
57833C22142p914o207m981m790m241k973k482l066k943j436j90r6J45J197J700
57818B83865R58K80L57O6r05j003K45J049M76r4m1j114m205p331q656q969r336
57801B45642q941p145n249m242l089j113L10K38K9Q40J548J137P39J383K017J799
57785B25903K109M042O160O869O955P589P953P224O747P745Q811Q141O564N801
57771C18613N451M260K754K039J394l55k366l225l608m949o632p109o807p312
57757B92148q397q449p239n970m969l606k168j694k147k466k227j759j030J40
$$ plain form
57743 240167 241426 243235 245389 248035 250763 252859 254582 256992 260351 263878 267112 270208 272871 274477
57729 274477 275387 276579 277880 278193 277716 278075 279757 281169 280924 279420 277418 274721 271239 267840 265029
57714 265029 261941 257690 252687 247730 242763 237442 232052 227051 222398 217887 213415 208557 202817 196734
57700 196734 191761 188557 186385 184466 182803 181277 179253 176725 174664 173572 172790 171795 171070 170987 171088 171191
57684 171191 172090 174301 177147 179969 183285 187929 193969 201350 210732 222749 237168 253649 272801
57671 272801 295887 324227 359582 404291 459969 526102 599931 676818 750249 812350 855334
57660 855334 872699 860178 817800 751956 673887 594472 520308 454319 398031 351914 314795
57649 314795 284790 260702 241775 226806 214523 204404 196296 189731 184321 180255 177601 175641 173674
$$ packed form
57743B40167J259J809K154K646K728K096J723K410L359L527L234L096K663J606
57729B74477R10J192J301L13m77L59J682J412k45j504k002k697l482l399k811
57714B65029l088m251n003m957m967n321n390n001m653m511m472m858n740o083
57700A96734m973l204k172j919j663j526k024k528k061j092p82r95p25q3J01J03
57684A71191Q99K211K846K822L316M644O040P381R382J2017J4419J6481J9152
57671B72801K3086K8340L5355M4709N5678O6133P3829P6887P3431O2101M2984
57660H55334J7365j2521m2378o5844p8069p9415p4164o5989n6288m6117l7119
57649C14795l0005k4088j8927j4969j2283j0119q108o565n410m066k654j960j967
$$ plain form
57636 173674 171979 171253 171528 172289 173144 173746 173565 172466 171069 169961 168985 167735 166157 164116 161116 157177
57620 157177 153403 150830 149195 147473 145248 142847 140619 138770 137560 137012 136669 136154 135589 135104 134430 133481
57604 133481 132815 132930 133522 133922 133843 133250 132004 130136 128001 125753 123169 120375 118104 116737 115699 114341
57588 114341 112784 111369 109921 108180 106379 104761 103063 101114 99379 98252 97275 95694 93425 90930
57574 90930 88586 86649 85321 84367 83182 81652 80372 79570 78576 76893 74967 73308 71663 69884 68771
57559 68771 69070 70240 71136 71397 71270 70704 69650 68803 68960 69887 70787 71547 72593 73803 74601 74954 75355 75916
57541 75916 76387 76910 77867 78994 79575 79549 79633 80288 81285 82344 83483 84567 85178 85149 84795 84514 84556 85145 86362
57522 86362 87825 88906 89346 89434 89678 90525 92211 94523 96822 98593 99866 100879 101672 102311 103133 104291
$$ packed form
57636A73674j695p26K75P61Q55O02j81j099j397j108r76j250j578k041l000l939
57620A57177l774k573j635j722k225k401k228j849j210n48l43n15n65m85o74r49
57604A33481o66J15N92M00p9n93j246j868k135k248k584k794k271j367j038j358
57588A14341j557j415j448j741j801j618j698j949j735j127r77j581k269k495
57574I0930k344j937j328r54j185j530j280q02r94j683j926j659j645j779j113
57559F8771K99J170Q96K61j27n66j054q47J57R27R00P60J046J210P98L53M01N61
57541G5916M71N23R57J127N81k6Q4O55R97J059J139J084O11k9l54k81M2N89J217
57522H6362J463J081M40Q8K44Q47J686K312K299J771J273J013P93O39Q22J158
$$ plain form
57506 104291 105311 105593 105188 104690 104520 104633 104705 104271 102936 100755 98220 95620 92751 89468 86119 83095
57490 83095 80432 78148 76430 75071 73305 70788 68224 66348 64751 62462 59384 56409 54253 52859
57476 52859 51902 51373 51571 52734 54587 56194 56697 56316 56082 56367 56343 55282 53599 52104 51018 50379 50628
57459 50628 51845 52976 52799 51307 49377 47496 45639 43939 42546 41132 39414 37863 37070 36777 36388
57444 36388 36057 36233 36498 36015 35010 34585 35018 35380 35053 34571 34588 34878 34801 34151 33175 32246 31791 32138 33187
57425 33187 34458 35482 35943 35710 35131 35047 35990 37536 38930 40054 41186 42151 42543 42539 42694 42992 42896 42306
57407 42306 41668 41148 40477 39631 38942 38439 37849 37313 37368 38015 38501 38255 37539 37002 37045 37720 38801 39830 40450
57388 40450 40656 40458 39620 38211 37028 36738 36872 36518 35800 35723 36610 37671 38212 38300 38082 37352 36162 35039
$$ packed form
57506A04291J020K82m05m98j70J13P2m34j335k181k535k600k869l283l349l024
57490H3095k663k284j718j359j766k517k564j876j597k289l078k975k156j394
57476E2859r57n29J98J163J853J607N03l81k34K85k4j061j683j495j086o39K49
57459E0628J217J131j77j492j930j881j857j700j393j414j718j551p93k93l89
57444C6388l31J76K65m83j005m25M33L62l27m82J7K90p7o50r76r29m55L47J049
57425C3187J271J024M61k33n79q4R43J546J394J124J132R65L92mJ55K98r6n90
57407D2306o38n20o71q46o89n03n90n36N5O47M86k46p16n37M3O75J081J029O20
57388D0450K06j98q38j409j183k90J34l54p18p7Q87J061N41Q8k18p30j190j123
$$ plain form
57370 35039 34293 33731 33296 33265 33607 33841 33843 34054 34608 35020 35113 35519 36715 38189 39177 39767 40636 41998 43348
57351 43348 44132 44259 44041 43935 44248 44917 45641 46251 46796 47262 47457 47207 46474 45258 43676 42064 40782 39933
57333 39933 39474 39365 39371 38963 37827 36233 34552 32746 30767 29005 27675 26195 24063 22016 21307 21979
57317 21979 22816 22991 22729 22342 21733 21095 20980 21275 21032 19831 18486 17881 17879 17920 17973 18309 18897 19630 20692
57298 20692 22148 23589 24627 25388 26149 26852 27358 27783 28286 28888 29761 31297 33610 36322 39046 41687
57282 41687 44196 46601 49399 53230 57935 62601 66803 71041 75623 79992 83680 87097 90657 93894
57268 93894 96342 98722 102250 106978 111667 115138 117034 117447 116649 115282 114131 113463 112922 112135 111082 109969
57252 109969 109105 108876 109444 110450 111308 111795 112104 112386 112555 112539 112451 112456 112708 113483 115127 117780 121157 124684
$$ packed form
57370C5039p46n62m35l1L42K34KK11N54M12R3M06J196J474R88N90Q69J362J350
57351D3348P84J27k18j06L13O69P24O10N45M66J95k50p33j216j582j612j282q49
57333C9933m59j09Om08j136j594j681j806j979j762j330j480k132k047p09O72
57317B1979Q37J75k62l87o09o38j15K95k43j201j345o05kM1N3L36N88P33J062
57298B0692J456J441J038P61P61P03N06M25N03O02Q73J536K313K712K724K641
57282D1687K509K405K798L831M705M666M202M238M582M369L688L417L560L237
57268I3894K448K380L528M728M689L471J896M13p98j367j151o68n41p87j053j113
57252A09969q64k29N68J006Q58M87L09K82J69j6q8NK52P75J644K653L377L527
$$ plain form
57234 124684 127877 130676 133421 136436 139619 142504 144704 146293 147817 149994 153235 157340 161819 166524
57220 166524 171628 176931 181791 186131 190908 196895 203488 209515 214860 220331 226130 231658 236913 242969
57206 242969 250709 259911 269933 280520 291540 302661 313738 324954 336299 347488 358602 370180
57194 370180 382548 395815 410574 427550 446230 465002 483228 502191 523299 546366 570505
57183 570505 595762 622746 651303 680660 710433 740518 770329 799097 826661 853220 878708
57172 878708 903269 927944 953854 980887 1008155 1035553 1063944 1093809 1124645 1155723 1186647
57161 1186647 1217069 1246692 1275751 1304919 1334564 1364581 1394966 1425955 1457419 1488605 1518621
57150 1518621 1546970 1573663 1599202 1624353 1649553 1674659 1699581 1724841 1750969 1777605 1803885
$$ packed form
57234A24684L193K799K745L015L183K885K200J589J524K177L241M105M479M705
57220A66524N104N303M860M340M777N987O593O027N345N471N799N528N255O056
57206B42969P740R202J0022J0587J1020J1121J1077J1216J1345J1189J1114J1578
57194C70180J2368J3267J4759J6976J8680J8772J8226J8963K1108K3067K4139
57183E70505K5257K6984K8557K9357K9773L0085K9811K8768K7564K6559K5488
57172H78708K4561K4675K5910K7033K7268K7398K8391K9865L0836L1078L0924
57161A186647L0422K9623K9059K9168K9645L0017L0385L0989L1464L1186L0016
57150A518621K8349K6693K5539K5151K5200K5106K4922K5260K6128K6636K6280
$$ plain form
57139 1803885 1829660 1855695 1882637 1910365 1938418 1966622 1995380 2025762 2059164 2096317 2136691
57128 2136691 2179300 2223870 2270657 2319445 2369573 2420796 2473172 2526079 2578418 2630171 2683034
57117 2683034 2739107 2799614 2865201 2936649 3014616 3099046 3189373 3285255 3387160 3496941 3618187
57106 3618187 3755633 3913887 4097218 4310658 4560726 4855072 5202730 5615678 6109435
57097 6109435 6700957 7406052 8239150 9214583 10346753 11649147 13133660 14809275 16678275
57088 16678275 18731677 20947380 23291009 25717901 28179008 30633934 33063870 35469942
57080 35469942 37855095 40206962 42495841 44677121 46678689 48379273 49609169 50190779
57072 50190779 49996687 48987134 47211841 44789132 41878806 38654939 35281991 31900006
$$ packed form
57139A803885K5775K6035K6942K7728K8053K8204K8758L0382L3402L7153M0374
57128B136691M2609M4570M6787M8788N0128N1223N2376N2907N2339N1753N2863
57117B683034N6073O0507O5587P1448P7967Q4430R0327R5882J01905J09781J21246
57106C618187J37446J58254J83331K13440K50068K94346L47658M12948M93757
57097F109435N91522P05095Q33098R75433J132170J302394J484513J675615J869000
57088A6678275K053402K215703K343629K426892K461107K454926K429936K406072
57080C5469942K385153K351867K288879K181280K001568J700584J229896N81610
57072E0190779j94092j009553j775293k422709k910326l223867l372948l381985
$$ plain form
57064 31900006 28620156 25524940 22668795 20080808 17770539 15733466 13954045 12409030
57056 12409030 11072529 9919467 8925500 8066669 7321505 6672771 6106111 5608168 5167458
57047 5167458 4775949 4427916 4117533 3838829 3587268 3359785 3153439 2965292 2793442
57038 2793442 2636843 2494158 2363763 2244776 2137020 2039959 1952583 1874353 1805486 1746333
57028 1746333 1697213 1658824 1632210 1618435 1618803 1634958 1667878 1716614 1777894 1845546 1908869 1952560
57016 1952560 1961234 1926476 1850709 1745242 1624981 1503418 1389579 1287585 1198445 1122026
57006 1122026 1057440 1002771 955923 915735 881571 852221 826304 803462 783967 767248 752038
56995 752038 737970 725753 715514 706136 696692 687538 679545 673085 668177 664976 663694 664583 668023 673886
$$ packed form
57064C1900006l279850l095216k856145k587987k310269k037073j779421j545015
57056A2409030j336501j153062r93967q58831p45164o48734n66660m97943m40710
57047E167458l91509l48033l10383k78704k51561k27483k06346j88147j71850
57038B793442j56599j42685j30395j18987j07756r7061q7376p8230o8867n9153
57028A746333m9120l8389k6614j3775L68J6155L2920M8736O1280O7652O3323M3691
57016A952560Q674l4758p5767j05467j20261j21563j13839j01994q9140p6419
57006A122026o4586n4669m6848m0188l4164k9350k5917k2842j9495j6719j5210
56995G52038j4068j2217j0239r378r444r154p993o460m908l201j282Q89L440N863
$$ plain form
56981 673886 680574 685447 686475 682934 674555 661030 642778 621413 599031 577424 557910 541097
56969 541097 526606 513897 503515 496740 493827 493613 495207 499102 506179 516589 530163 546968 566613
56956 566613 587678 608453 627567 643109 651904 650888 639367 619442 594387 567043 539440 513197
56944 513197 489870 470835 456692 446845 440135 436031 434875 437018 442354 450969 463622 481144 503641
56931 503641 530400 560112 590839 620001 644466 660409 663718 651920 626416 592177 554704 517513
56919 517513 482287 450118 421718 397143 376213 358943 345097 333750 323895 315123 307312 300174
56907 300174 293684 288481 285130 283220 281769 280296 278983 278019 277347 277001 277276 278611 281499 286343 293144
56892 293144 301590 311672 323953 339002 356931 377764 401779 428945 458085 486773 511851 530094
$$ packed form
56981F73886O688M873J028l541q379j3525j8252k1365k2382k1607j9514j6813
56969E41097j4491j2709j0382o775k913k14J594L895P077J0410J3574J6805J9645
56956E66613K1065K0775J9114J5542Q795j016j1521j9925k5055k7344k7603k6243
56944E13197k3327j9035j4143r847o710m104j156K143N336Q615J2653J7522K2497
56931E03641K6759K9712L0727K9162K4465J5943L309j1798k5504l4239l7473l7191
56919E17513l5226l2169k8400k4575k0930j7270j3846j1347r855q772p811p138
56907C00174o490n203l351j910j451j473j313r64o72l46K75J335K888M844O801
56892B93144Q446J0082J2281J5049J7929K0833K4015K7166K9140K8688K5078J8243
$$ plain form
56880 530094 539148 538615 530230 516700 500457 483431 467341 453534 442679 434907 430222 428678 430474
56867 430474 436045 445871 460239 479641 505459 539590 583048 635145 693886 756236 817637 871943
56855 871943 912636 934289 933580 910428 869073 817227 762975 712080 667789 631885 605014 586714
56843 586714 576216 573237 577717 589535 609237 638601 679736 733916 801652 882922 975909 1075547
56831 1075547 1174096 1262847 1332564 1373354 1376895 1340841 1271260 1180390 1081653 985645 898676
56820 898676 823299 759855 708086 667879 639011 620700 611764 611328 619511 637515 666853 708224
56808 708224 760872 822707 890537 959915 1024889 1078062 1111241 1117190 1092598 1040500 969577 890298
56796 890298 811136 737418 672116 616584 570942 534689 507243 487848 475400 468900 467927 472524
$$ packed form
56880E30094R054n33q385j3530j6243j7026j6090j3807j0855p772m685j544J796
56867D30474N571R826J4368J9402K5818L4131M3458N2097N8741O2350O1401N4306
56855H71943M0693K1653p09k3152m1355n1846n4252n0895m4291l5904k6871j8300
56843E86714j0498k979M480J1818J9702K9364M1135N4180O7736Q1270R2987R9638
56831A075547R8549Q8751O9717M0790L541l6054o9581r0870r8737r6008q6969
56820H98676p5377o3444n1769m0207k8868j8311q936m36Q183J8004K9338M1371
56808G08224N2648O1835O7830O9378O4974N3173L3179N949k4592n2098p0923p9279
56796H90298p9162p3718o5302n5532m5642l6253k7446j9395j2448o500r73M597
$$ plain form
56784 472524 482993 499999 524199 555084 590396 626944 661493 690398 709074 713096 700301 671824
56772 671824 631459 584323 535477 488693 445998 408266 375922 348868 326301 307187 290859
56761 290859 276913 264959 254866 246856 240903 236265 231999 227685 223337 219062 215121 211856 209135
56748 209135 206400 203680 201880 201450 201368 200256 198063 195841 194306 193487 193401 194043 194773 194647 193491 191983
56732 191983 190648 189405 188098 186849 185759 184719 183656 182690 182079 182153 183024 184204 184963 185361 186318 188207
56716 188207 190004 190502 189848 189115 188855 188868 189024 189382 189777 190079 190612 191601 192557 192975 193213 193776 194185 193639 192451
56697 192451 191666 191403 190773 189400 187864 186587 185443 184636 184797 185854 186782 186851 186292 185463 184250 182650 181162
56680 181162 180183 179645 179534 180051 180976 181577 181551 181497 182137 183604 185684 188121 190426 192022 192951 193964 195586
$$ packed form
56784D72524J0469J7006K4200L0885L5312L6548L4549K8905J8676M022j2795k8477
56772F71824m0365m7136m8846m6784m2695l7732l2344k7054k2567j9114j6328
56761B90859j3946j1954j0093q010n953m638m266m314m348m275l941l265k721
56748B09135k735k720j800m30q2j112k193k222j535q19q6O42P30j26j156j508
56732A91983j335j243j307j249j090j040j063r66o11P4Q71J180P59L98R57J889
56716A88207J797M98o54p33k60J3J56L58L95L02N33R89R56M18K38N63M09n46j188
56697A92451p85k63o30j373j536j277j144q07J61J057R28O9n59q29j213j600j488
56680A81162r79n38j11N17R25O01k6n4O40J467K080K437K305J596R29J013J622
$$ plain form
56663 195586 197534 199307 200857 202453 204244 206221 208239 209958 211103 211873 212704 213666 214592 215715 217502
56648 217502 219736 221477 222197 222413 222865 223551 223931 223772 223406 223225 223175 222806 221876 220792 220160 219890 219322 218341
56630 218341 217633 217382 216553 214206 210866 207680 204906 202268 200194 199365 199380 199123 198302 197374 196208 194266
56614 194266 192131 191281 192014 192931 192926 192474 192475 192945 193429 193803 194140 194602 195708 197836 200151 201063 200155 198733
56596 198733 198078 198178 198554 199226 200209 201005 201363 201817 202861 204246 205540 206699 207629 207967 207769 207712 208177 208834
56578 208834 209462 210347 211484 212289 212632 213331 215024 217283 219270 220550 220927 220390 219663 219907 221378 223313
56562 223313 225580 229293 235064 241790 248058 253849 259899 266198 272070 277056 280858 283099 284001 284659 285859
56547 285859 287253 288376 289569 290990 291629 290520 288293 286294 284701 282671 280017 277510 275664 274198
$$ packed form
56663A95586J948J773J550J596J791J977K018J719J145P70Q31R62R26J123J787
56648B17502K234J741P20K16M52O86L80j59l66j81n0l69r30j084o32k70n68r81
56630B18341p08k51q29k347l340l186k774k638k074q29J5k57q21r28j166j942
56614A94266k135q50P33R17nm52JM70M84L74L37M62J106K128K315R12r08j422
56596A98733o55J00L76O72R83P96L58M54J044J385J294J159R30L38j98n7M65O57
56578B08834O28Q85J137Q05L43O99J693K259J987J280L77n37p27K44J471J935
56562B23313K267L713N771O726O268N791O050O299N872M986L802K241R02O58J200
56547B85859J394J123J193J421O39j109k227j999j593k030k654k507j846j466
$$ plain form
56533 274198 272648 270692 268054 264833 261767 259471 257652 255675 253534 251583 249701 247517 245150 242973
56519 242973 240961 239021 237584 237017 236713 235597 233441 231012 229080 227899 227387 227195 226800 226111 225695 225857
56503 225857 225935 225177 223794 222421 221012 219240 217592 216964 217353 217961 218561 219701 221429 222850 223307 223288 223682
56486 223682 224535 224981 224232 222488 220919 220715 222035 223946 225381 225890 225596 225008 225024 226328 228440 230024
56470 230024 230595 231213 232881 235011 236251 236244 235659 234959 234088 233144 232454 232039 231679 231427 231540 232030 232787 233912
56452 233912 235450 236973 237906 238044 237456 236266 234932 234249 234572 235413 236167 236746 237163 237166 236852 236884 237476 237869
56434 237869 237532 237121 237462 238334 239244 240631 243126 246084 248128 248934 249405 250259 251405 252487 253111 252760 251464
56417 251464 250401 250894 252886 255185 256958 258126 258650 258520 258326 258792 259658 259936 259341 258580 258157 257742 256903
$$ packed form
56533B74198j550j956k638l221l066k296j819j977k141j951j882k184k367k177
56519B42973k012j940j437n67l04j116k156k429j932j181n12j92l95o89m16J62
56503B25857P8p58j383j373j409j772j648o28L89O08O00J140J728J421M57j9L94
56486B23682Q53M46p49j744j569k04J320J911J435N09k94n88J6J304K112J584
56470B30024N71O18J668K130J240pn85p00q71r44o90m15l60k52J13M90P57J125
56452B33912J538J523R33J38n88j190j334o83L23Q41P54N79M17Ll14L2N92L93
56434B37869l37m11L41Q72R10J387K495K958K044Q06M71Q54J146J082O24l51j296
56417B51464j063M93J992K299J773J168N24j30j94M66Q66K78n95p61m23m15q39
$$ plain form
56400 256903 255792 254859 254361 254274 254307 254101 253709 253715 254537 255957 257689 259927 262786 265674 267900 269497 270908
56383 270908 272258 273535 274959 276557 277864 278677 279555 280938 282392 283412 284215 284987 285173 284403 283309 282404
56367 282404 281102 279049 277445 277536 278555 278897 278758 279753 282177 284551 285921 286828 287712 287997 287322 286403 286092
56350 286092 286529 287498 288729 289666 289893 290034 291318 294067 297373 300361 302925 305141 306792 307703 307968 307800
56334 307800 307591 307856 308618 309269 309566 310135 311262 312077 311982 312101 313923 317151 320331 323065 326037 329248 331877
56317 331877 333732 335311 336573 337154 337659 339177 341549 343603 345007 346404 347860 348840 349778 352016 355949
56302 355949 360653 365422 370225 374684 378252 381535 385806 390994 395700 399363 402805 406498 410038 413617
56288 413617 418251 424023 429714 434645 439394 444253 448564 452129 455842 460458 466071 473079 482042 492221
$$ packed form
56400B56903j111r33m98q7L3k06l92OQ22J420J732K238K859K888K226J597J411
56383B70908J350J277J424J598J307Q13Q78J383J454J020Q03P72J86p70j094r05
56367B82404j302k053j604R1J019L42j39R95K424K374J370R07Q84K85o75r19l11
56350B86092M37R69J231R37K27J41J284K749L306K988K564K216J651R11K65j68
56334C07800k09K65P62O51K97N69J127Q15r5J19J822L228L180K734K972L211K629
56317C31877J855J579J262N81N05J518K372K054J404J397J456R80R38K238L933
56302C55949M704M769M803M459L568L283M271N188M706L663L442L693L540L579
56288D13617M634N772N691M931M749M859M311L565L713M616N613P008Q963J0179
$$ plain form
56274 492221 501974 511146 521375 533466 546206 558523 571104 584973 600039 616080 633721 653408
56262 653408 674569 696821 720979 748075 778391 812134 850003 892468 939548 991805 1050448
56251 1050448 1115994 1188134 1267353 1355258 1452620 1558444 1671632 1792099 1919373 2051352
56241 2051352 2185383 2319432 2451342 2577898 2695388 2800256 2888896 2958081 3006183 3032945
56231 3032945 3037723 3019380 2978412 2917780 2841007 2750694 2649289 2539699 2424328 2304915 2183988
56220 2183988 2065034 1950440 1840531 1735327 1635824 1542880 1456228 1375439 1300643 1231671
56210 1231671 1167830 1109033 1055761 1007444 962526 920711 883398 851164 822571 796252 772371
56199 772371 751134 731694 713645 697827 684550 672658 661471 651944 644741 638814 633144 628202
$$ packed form
56274D92221R753R172J0229J2091J2740J2317J2581J3869J5066J6041J7641J9687
56262F53408K1161K2252K4158K7096L0316L3743L7869M2465M7080N2257N8643
56251A050448O5546P2140P9219Q7905R7362J05824J13188J20467J27274J31979
56241B051352J34031J34049J31910J26556J17490J04868Q8640O9185M8102K6762
56231C032945M778j8343m0968o0632p6773r0313j01405j09590j15371j19413j20927
56220B183988j18954j14594j09909j05204r9503r2944q6652q0789p4796o8972
56210A231671o3841n8797n3272m8317m4918m1815l7313l2234k8593k6319k3881
56199G72371k1237j9440j8049j5818j3277j1892j1187r527p203n927n670m942
$$ plain form
56187 628202 624350 620438 615515 610520 606805 604233 602088 600550 599917 599511 598727 598107 598283 598882 599445 600215
56171 600215 601167 601596 601544 602227 604185 606522 608799 611970 616561 621754 627301 634364 643262 652358 660559
56156 660559 668976 678695 688900 698865 709884 723436 739100 756032 774901 796635 820840 847247
56144 847247 877293 912640 953617 1000677 1055822 1120941 1196258 1281875 1378927 1487228 1603237
56133 1603237 1722021 1839652 1952098 2053876 2140436 2211191 2268790 2316702 2358504 2397173
56123 2397173 2432743 2461925 2481551 2490943 2489979 2477617 2454532 2424781 2392171 2356368 2314440 2264093
56111 2264093 2203180 2128509 2038481 1935915 1826130 1713670 1602796 1498914 1406411 1326147
56101 1326147 1257172 1199465 1152910 1115543 1085276 1061813 1044780 1031889 1021298 1013780 1010139 1008576
$$ packed form
56187F28202l852l912m923m995l715k572k145j538o33m06p84o20J76N99N63P70
56171F00215R52M29n2O83J958K337K277L171M591N193N547P063Q898R096Q201
56156F60559Q417R719J0205R965J1019J3552J5664J6932J8869K1734K4205K6407
56144H47247L0046L5347M0977M7060N5145O5119P5317Q5617R7052J08301J16009
56133A603237J18784J17631J12446J01778Q6560P0755N7599M7912M1802L8669
56123B397173L5570K9182J9626R392r64j2362k3085k9751l2610l5803m1928n0347
56111B264093o0913p4671r0028j02566j09785j12460j10874j03882r2503q0264
56101A326147o8975n7707m6555l7367l0267k3463j7033j2891j0591p518l641j563
$$ plain form
56089 1008576 1007187 1006881 1008987 1012104 1014326 1016613 1020893 1026672 1032589 1039449 1048507 1058547 1067735 1076632
56075 1076632 1086342 1095642 1103209 1110767 1120630 1131957 1142777 1153833 1166933 1181354 1195461 1210087
56063 1210087 1226698 1243985 1259932 1275425 1292229 1309259 1324583 1339131 1354566 1369549 1382207
56052 1382207 1394239 1408266 1423132 1436328 1449154 1464712 1482518 1499863 1517046 1536431 1557717
56041 1557717 1578920 1600797 1625586 1652558 1679364 1706428 1735566 1765837 1795448 1826123 1860704
56030 1860704 1898042 1935138 1972602 2012928 2055260 2097209 2140051 2186632 2235825 2284579 2333567
56019 2333567 2385179 2437998 2489393 2541641 2599169 2661566 2725680 2792601 2865724 2943723 3022587
56008 3022587 3103047 3188967 3279989 3373013 3469274 3572523 3681777 3793475 3909171 4033412
$$ packed form
56089A008576j389l06K106L117K222K287M280N779N917O860R058J0040R188Q897
56075A076632R710R300P567P558R863J1327J0820J1056J3100J4421J4107J4626
56063A210087J6611J7287J5947J5493J6804J7030J5324J4548J5435J4983J2658
56052A382207J2032J4027J4866J3196J2826J5558J7806J7345J7183J9385K1286
56041A557717K1203K1877K4789K6972K6806K7064K9138L0271K9611L0675L4581
56030A860704L7338L7096L7464M0326M2332M1949M2842M6581M9193M8754M8988
56019B333567N1612N2819N1395N2248N7528O2397O4114O6921P3123P7999P8864
56008C022587Q0460Q5920R1022R3024R6261J03249J09254J11698J15696J24241
$$ plain form
55998 4033412 4165842 4303358 4447973 4604049 4769837 4940795 5119340 5312016 5519010
55989 5519010 5736170 5965400 6212777 6478307 6758211 7055609 7378003 7726091 8096560
55980 8096560 8494025 8928162 9401069 9910237 10462177 11069890 11739020 12470715 13276306
55971 13276306 14174666 15177617 16294018 17546528 18968663 20589137 22438125 24567227
55963 24567227 27045094 29936568 33304986 37229013 41795297 47083822 53192385 60279024
55955 60279024 68566508 78330435 89933634 103886639 120870685 141725513 167370629
55948 167370629 198483090 234889649 275098705 316482651 355910043 390027506 414994229
55941 414994229 426625258 421796270 400366095 365819213 323859197 280101207 238547054
$$ packed form
55998D033412J32430J37516J44615J56076J65788J70958J78545J92676K06994
55989E519010K17160K29230K47377K65530K79904K97398L22394L48088L70469
55980H096560L97465M34137M72907N09168N51940O07713O69130P31695Q05591
55971A3276306Q98360J002951J116401J252510J422135J620474J848988K129102
55963B4567227K477867K891474L368418L924027M566284N288525O108563P086639
55955F0279024Q287484R763927J1603199J3953005J6984046K0854828K5645116
55948A67370629L1112461L6406559M0209056M1383946L9427392L4117463K4966723
55941D14994229J1631029m828988k1430175l4546882m1960016m3757990m1554153
$$ plain form
55934 238547054 201371418 169390965 142560577 120359497 102107342 87147124 74880903
55927 74880903 64774322 56393387 49412915 43571175 38640446 34443296 30856849 27780537
55919 27780537 25118416 22796480 20768493 18992786 17422353 16023072 14779752 13676056
55911 13676056 12686030 11790715 10984916 10261198 9603196 8999997 8451562 7954503 7496878
55902 7496878 7071915 6683015 6330179 6004349 5699754 5419361 5163486 4924820 4699303
55893 4699303 4490697 4299970 4120818 3950022 3792047 3649062 3516193 3390790 3276978
55884 3276978 3176743 3085482 3000734 2926939 2867317 2818847 2779037 2749743 2729990 2712065 2688743
55873 2688743 2658100 2618239 2564407 2495144 2415200 2329035 2237228 2141823 2048702 1961436 1878480
$$ packed form
55934B38547054l7175636l1980453k6830388k2201080j8252155j4960218j2266221
55927G4880903j0106581q380935o980472n841740m930729m197150l586447l076312
55919B7780537k662121k321936k027987j775707j570433j399281j243320j103696
55911A3676056r90026q95315q05799p23718o58002o03199n48435m97059m57625
55902G496878m24963l88900l52836l25830l04595k80393k55875k38666k25517
55893D699303k08606j90727j79152j70796j57975j42985j32869j25403j13812
55884C276978j00235r1261q4748p3795n9622m8470l9810k9294j9753j7925k3322
55873B688743l0643l9861n3832o9263p9944q6165r1807r5405r3121q7266q2956
$$ plain form
55862 1878480 1799252 1727067 1663335 1604757 1549149 1498396 1452935 1409173 1365430 1324970 1290078
55851 1290078 1258339 1227708 1199983 1176059 1152702 1127306 1101429 1076697 1051636 1025435 1000546
55840 1000546 978578 957548 935808 914857 895877 877397 858701 841650 826867 812094 796508
55829 796508 782690 772072 762395 751928 742210 734266 726104 716425 706985 698797 689753 678565 667468
55816 667468 658356 649628 639453 628953 619723 611287 603315 597326 593991 591764 590154 591189 595693 601450
55802 601450 607037 614099 623670 633705 642461 650900 659360 665255 666721 665252 662116 655439 643733 629322
55788 629322 615307 601857 588325 576281 567322 560203 552992 545993 539873 533078 523872 513132 502801
55775 502801 493552 486179 483050 485644 492518 501891 514160 529594 545601 558615 566739 568499 561512
$$ packed form
55862A878480p9228p2185o3732n8578n5608n0753m5461m3762m3743m0460l4892
55851A290078l1739l0631k7725k3924k3357k5396k5877k4732k5061k6201k4889
55840A000546k1968k1030k1740k0951j8980j8480j8696j7051j4783j4773j5586
55829G96508j3818j0618r677j0467r718p944q162r679r440q188r044j1188j1097
55816F67468r112q728j0175j0500r230q436p972n989l335k227j610J035M504N757
55802F01450N587P062R571J0035Q756Q439Q460N895J466j469l136o677j1706j4411
55788F29322j4015j3450j3532j2044q959p119p211o999o120o795r206j0740j0331
55775E02801r249p373l129K594O874R373J2269J5434J6007J3014Q124J760o987
$$ plain form
55762 561512 545249 523304 500320 478120 456874 437923 422666 410241 398940 388695 380010 371969
55750 371969 363528 355402 348472 341743 333974 325974 319251 313737 308783 304920 302690 301148 299491 298691
55736 298691 299615 301006 301219 300484 299602 298120 295765 293923 293441 292570 289405 284863 280876 277103 272014 266074
55720 266074 261221 258019 255674 254147 253997 254695 255194 255715 257267 260054 263899 269317 276452 283787 289539
55705 289539 293492 295958 296127 293262 288520 283695 278893 273118 266245 258790 250636 241768 233449 227064
55691 227064 222462 218816 216146 214587 213307 211797 211122 212245 214167 215434 216426 218445 221514 224855 228514
55676 228514 232739 236650 239327 241360 243608 245299 245125 243412 241510 239822 238023 236355 235107 233691
55662 233691 231797 230481 230596 231302 231786 233120 236490 240829 244413 247702 252323 258060 263149 266883 269726
$$ packed form
55762E61512j6263k1945k2984k2200k1246j8951j5257j2425j1301j0245q685q041
55750C71969q441q126o930o729p769q000o723n514m954l863k230j542j657q00
55736B98691R24J391K13p35q82j482k355j842m82q71l165m542l987l773n089n940
55720B66074m853l202k345j527j50O98M99N21J552K787L845N418P135P335N752
55705B89539L953K466J69k865m742m825m802n775o873p455q154q868q319o385
55691B27064m602l646k670j559j280j510o75J123J922J267R92K019L069L341L659
55676B28514M225L911K677K033K248J691j74j713j902j688j799j668j248j416
55662B33691j894j316J15P06M84J334L370M339L584L289M621N737N089L734K843
$$ plain form
55647 269726 271468 271461 270192 268528 265892 261223 255173 249238 243273 236021 227687 219698 212295 204650 197184
55632 197184 191444 187588 184160 180550 177672 176009 174874 173907 173530 173593 173134 171795 170099 168217 165807
55617 165807 163101 160791 158825 156599 154243 152383 150825 148863 146732 145365 144882 144700 144848 145694 146662
55602 146662 146763 146249 146241 146923 147573 148065 148688 148739 147104 144221 141744 140276 139173 138490 139085 140511 140767 138893
55584 138893 136301 134863 134901 135661 136527 137085 136944 136181 135404 135076 135203 135609 135971 135859 135429 135630 136968 138631
55566 138631 139780 140960 142993 145215 146323 146463 146825 147547 147668 146916 145921 144846 143421 142241 142292 143175
55550 143175 143462 142922 142779 143591 144457 144623 144396 144148 143752 143309 143221 143368 143334 143488 144546 146114 147013 147064 147082
55531 147082 147095 146166 144181 142281 141187 140510 139975 139859 139871 139056 137238 135338 133893 132568 131393 131149 132103
$$ packed form
55647B69726J742pj269j664k636m669o050n935n965p252q334p989p403p645p466
55632A97184n740l856l428l610k878j663j135r67l77O3m59j339j696j882k410
55617A65807k706k310j966k226k356j860j558j962k131j367m83j82J48Q46R68
55602A46662J01n14qO82O50M92O23N1j635k883k477j468j103o83N95J426K56j874
55584A38893k592j438L8P60Q66N58j41p63p77l28J27M06L62j12m30K01J338J663
55566A38631J149J180K033K222J108J40L62P22J21p52r95j075j425j180N1Q83
55550A43175K87n40j43Q12Q66J66k27k48l96m43q8J47l4J54J058J568Q99N1J8
55531A47082J3r29j985j900j094o77n35j16J2q15j818j900j445j325j175k44R54
$$ plain form
55514 132103 133563 135019 136442 137191 136008 132649 128343 124265 120684 117871 116466 116421 116797 117129 117975 119714
55498 119714 121927 124305 127002 129634 131149 131175 130516 129856 129039 127963 127113 126738 126474 126116 125791 125178 123684
55481 123684 121688 120406 120196 120159 119722 119361 119375 119266 118846 118701 118952 118777 117814 116931 116894 117250 117194 116667 116033
55462 116033 115554 115621 116543 117595 117350 115546 113694 113241 114002 114934 115537 115866 115924 115725 115323 114472 112935 111358
55444 111358 110900 111712 112728 113231 113625 114291 114848 114987 115020 115081 114808 114284 114263 114925 115412 115155 114672 114473 114208
55425 114208 113567 113067 113223 113714 114014 114089 114023 113726 113502 114040 115408 116838 117858 118665 119105 118440 116697 115107
55407 115107 114578 114691 114775 114863 114964 114547 113467 112394 111606 110492 109004 108421 109659 111826 113480 114434 115258
55390 115258 115859 115736 115039 114285 113495 112474 111518 111027 110902 111002 111606 112658 113182 112332 110610 109336 109252 110200
$$ packed form
55514A32103J460J456J423P49j183l359m306m078l581k813j405m5L76L32Q46J739
55498A19714K213K378K697K632J515K6o59o60q17j076q50l75k64l58l25o13j494
55481A23684j996j282k10l7m37l61J4j09m20j45K51j75r63q83l7L56n6n27o34
55462A16033m79O7R22J052k45j804j852m53P61R32O03L29N8j99m02q51j537j577
55444A11358m58Q12J016N03L94O66N57J39L3O1k73n24k1O62M87k57m83j99k65
55425A14208o41n00J56M91L00P5o6k97k24N38J368J430J020Q07M40o65j743j590
55407A15107n29J13Q4Q8J01m17j080j073p88j114j488n83J238K167J654R54Q24
55390A15258O01j23o97p54p90j021r56m91j25J00O04J052N24q50j722j274q4R48
$$ plain form
55372 110200 111664 113058 113974 114652 115698 116976 117504 116922 116175 116178 116612 116729 116491 116112 115283 113754 112077
55355 112077 110974 110445 110170 110155 110336 110209 109597 109142 109386 109989 110470 110925 111319 110975 109612 108095 107196 106430
55337 106430 105099 103771 103553 104445 105540 106401 107211 107988 108671 109618 111032 112244 112548 112396 112731 113461 113673
55320 113673 113225 113050 113789 115001 115846 115894 115226 114269 113539 113176 112848 112404 112240 112607 113059 113120 113007 113031 112794
55301 112794 111745 110189 108937 108235 107766 107517 107892 108949 110101 110522 109677 107705 105594 104565 104952 106080
55285 106080 107448 109344 111883 114279 115769 116597 117342 117861 117709 117077 116495 115961 115172 114259 113579 113140 112888
55268 112888 113199 114345 115812 116782 116991 116549 115416 113737 112270 111684 111744 111782 111637 111562 111651 111964 112757 114009
55250 114009 115212 116164 117336 118795 119540 118792 117302 116394 116213 115919 115122 114111 113086 112205 112027 112869 113988
$$ packed form
55372A10200J464J394R16O78J046J278N28n82p47LM34J17k38l79q29j529j677
55355A12077j103n29k75j5J81j27o12m55K44O03M81M55L94l44j363j517q99p66
55337A06430j331j328k18Q92J095Q61Q10P77O83R47J414J212L04j52L35P30K12
55320A13673m48j75P39J212Q45M8o68r57p30l63l28m44j64L67M52O1j13K4k37
55301A12794j049j556j252p02m69k49L75J057J152M21q45j972k111j029L87J128
55285A06080J368J896K539K396J490Q28P45N19j52o32n82n34p89r13o80m39k52
55268A12888L11J146J467R70K09m42j133j679j467n86O0L8j45p5Q9L13P93J252
55250A14009J203R52J172J459P45p48j490r08j81k94p97j011j025q81j78Q42J119
$$ plain form
55233 113988 114399 114239 114335 114721 114649 113929 113194 112865 112739 112577 112281 111580 110333 109063 108416 108207 107797 107266 107379
55214 107379 108509 110344 112520 114746 116422 117034 116971 117229 118223 119401 119931 119273 117376 114962 113320 113150
55198 113150 113817 114359 114781 115600 116584 116982 116696 116282 115951 115557 115429 116204 117785 119311 120128 120095 119168 117563
55180 117563 116146 115687 115780 115401 114460 113861 114060 114578 114997 115489 116143 116624 116773 116919 117408 118342 119732 121318
55162 121318 122345 122221 121411 120990 121313 121702 121412 120338 118908 117828 117715 118449 119169 119470 120070 121552 123112
55145 123112 123609 123284 123136 123064 122184 120833 120519 121569 122405 121750 120307 119538 119828 120573 121278 121819 122096 122017
55127 122017 121542 120503 118836 117076 116116 116280 117083 117964 118712 119209 119350 119247 119017 118493 117709 117387 118162 119570
55109 119570 120641 121296 122168 123183 123525 123078 122775 123286 124378 125720 127339 129018 130261 131172 132424 134039
$$ packed form
55233A13988M11j60R6L86p2p20p35l29j26j62k96p01j247j270o47k09m10n31J13
55214A07379J130J835K176K226J676O12o3K58R94J178N30o58j897k414j642j70
55198A13150O67N42M22Q19R84L98k86m14l31l94j28P75J581J526Q17l3r27j605
55180A17563j417m59R3l79r41n99J99N18M19M92O54M81J49J46M89R34J390J586
55162A21318J027j24q10m21L23L89k90j074j430j080j13P34P20L01O00J482J560
55145A23112M97l25j48p2q80j351l14J050Q36o55j443p69K90P45P05N41K77p9
55127A22017m75j039j667j760r60J64Q03Q81P48M97J41j03k30n24p84l22P75J408
55109A19570J071O55Q72J015L42m47l03N11J092J342J619J679J243R11J252J615
$$ plain form
55093 134039 135156 135349 135280 135624 136179 136442 136258 135487 133842 131598 129799 129240 129664 130280 130615 130665 130694 131005
55075 131005 131492 131538 130873 130300 130722 131709 132065 131639 131393 131631 131550 130796 130194 130471 131362 132398 133467 134143 133649
55056 133649 132121 130863 130749 131289 131812 132441 133206 133302 132112 130155 128206 126322 124493 123413 123621 124540
55040 124540 125238 125607 126020 126416 126531 126565 126830 127125 127195 127394 128209 129411 130268 130342 129674 128571 127580 127220 127366
55021 127366 127402 127211 127368 128036 128477 128119 127308 126493 125536 124532 124397 125732 127743 129141 129624 129726 129809 130071
55003 130071 130931 132422 133560 133256 131682 130024 129146 129155 129924 131234 132581 133441 133705 133489 132916 132384 132431 132814
54985 132814 132401 130730 129031 128840 130148 131797 133182 134453 135421 135576 135208 135474 137048 139438 141737 143415
54969 143415 144316 144528 144392 144145 143510 142106 140258 138901 138661 139395 140613 141891 142933 143661 144336 145295 146553
$$ packed form
55093A34039J117J93o9L44N55K63j84p71j645k244j799n59M24O16L35N0K9L11
55075A31005M87M6o65n73M22R87L56m26k46K38q1p54o02K77Q91J036J069O76m94
55056A33649j528j258j14N40N23O29P65R6j190j957j949j884j829j080K08R19
55040A24540O98L69M13L96J15L4K65K95P0J99Q15J202Q57P4o68j103r91l60J46
55021A27366L6j91J57O68M41l58q11q15r57j004j35J335K011J398M83J02Q3K62
55003A30071Q60J491J138l04j574j658q78RP69J310J347Q60K64k16n73n32M7L83
54985A32814m13j671j699j91J308J649J385J271R68J55l68K66J574K390K299J678
54969A43415R01K12j36k47o35j404j848j357k40P34J218J278J042P28O75R59J258
$$ plain form
54952 146553 147747 148302 147634 145606 143048 141324 141000 141352 141559 141795 142600 143680 144141 143655 142653 141547
54936 141547 140452 139601 139449 140276 142060 144582 147347 149642 151195 152612 154763 157916 161818 166343 171690
54921 171690 178171 186098 195399 205014 213242 219283 223891 227873 230509 230305 226901 221283 214440 206804
54907 206804 198899 191506 185011 179263 174125 169525 165078 160415 155896 152267 149606 147376 145566 144907
54893 144907 145753 147478 149263 150837 152192 153265 154281 155852 158311 161324 164486 167858 171578 175356
54879 175356 178905 182665 187590 194153 201801 209409 216020 221079 224179 224952 223362 219887 215155 209437
54865 209437 202836 195854 189286 183428 177859 172241 166873 162220 158340 155170 152846 151262 149740 147729
54851 147729 145532 143796 142621 141767 141405 141838 142556 142403 140854 138621 136819 135947 135771 135793 135652 135329 135039
$$ packed form
54952A46553J194N55o68k028k558j724l24L52K07K36Q05J080M61m86j002j106
54936A41547j095q51j52Q27J784K522K765K295J553J417K151L153L902M525N347
54921A71690O481P927R301R615Q228O041M608L982K636k04l404n618o843p636
54907B06804p905p393o495n748n138m600m447m663m519l629k661k230j810o59
54893A44907Q46J725J785J574J355J073J016J571K459L013L162L372L720L778
54879A75356L549L760M925O563P648P608O611N059L100P73j590l475m732n718
54865B09437o601o982o568n858n569n618n368m653l880l170k324j584j522k011
54851A47729k197j736j175q54l62M33P18j53j549k233j802q72j76K2j41l23k90
$$ plain form
54834 135039 134854 134499 133724 132720 131931 131572 131550 131686 131765 131577 131171 130935 131192 131930 133045 134428 135617 135899
54816 135899 135233 134575 134788 135589 136088 135957 135467 134826 134213 134160 135113 136720 138227 139410 140472 141239 141238 140488
54798 140488 139557 138880 138631 139087 140337 141688 142187 141841 141645 142245 143176 143562 143015 141756 140389 139642 139838
54781 139838 140558 141278 142238 144102 146832 149645 152088 154455 157028 159732 162773 166856 172327 178657 185196
54766 185196 191952 199216 206768 213867 219807 224215 227018 228298 227992 225699 221163 215041 208719 203122
54752 203122 198027 192726 187061 181558 176826 173149 170501 168635 167162 165672 163918 161987 160335 159478
54738 159478 159458 159740 159808 159677 159658 159947 160727 162352 164978 168191 171450 174748 178434 182590 187083 192048 197722
54721 197722 203872 209930 215664 221181 226239 230042 231796 231071 227724 221974 214700 207178 200365 194472
$$ packed form
54834A35039j85l55p75j004p89l59k2J36P9j88m06k36K57P38J115J383J189K82
54816A35899o66o58K13Q01M99j31m90o41o13n3R53J607J507J183J062P67jp50
54798A40488r31o77k49M56J250J351M99l46j96O00R31L86n47j259j367p47J96
54781A39838P20P20R60J864K730K813K443K367K573K704L041M083N471O330O539
54766A85196O756P264P552P099N940M408K803J280l06k293m536o122o322n597
54752B03122n095n301n665n503m732l677k648j866j473j490j754j931j652q57
54738A59478k0K82O8j31j9K89P80J625K626L213L259L298L686M156M493M965N674
54721A97722O150O058N734N517N058L803J754p25l347n750p274p522o813n893
$$ plain form
54707 194472 189123 183696 177848 172087 167557 164768 162919 160988 159082 157954 157602 157310 156914 156934 157408 157594
54691 157594 157049 156102 155016 153612 152052 151121 151214 151691 151771 151486 151242 150988 150351 149275 148061 146990 146208
54674 146208 145748 145463 145168 144956 145081 145452 145627 145398 144962 144463 143816 143077 142479 142029 141512 140972 140646 140416 139949
54655 139949 139492 139797 141038 142453 143350 143817 144162 144357 144463 144958 146045 147092 147290 146597 145683 145281 145898
54638 145898 147686 150151 152272 153310 153306 152608 151361 149743 148259 147305 146668 145828 144585 143200 142139 141843
54622 141843 142415 143339 143857 143794 143721 144184 145202 146592 148256 149835 150604 150124 148745 147250 146294 146242 147034 148022
54604 148022 148461 148396 148539 149124 149551 149462 149390 149838 150399 150474 150277 150378 150652 150456 149660 148764 148107 147550 146953 146456
54584 146456 146240 146368 146839 147541 148202 148592 148676 148432 147807 147068 146854 147523 148630 149351 149330 148902 148728 149362 150879
$$ packed form
54707A94472n349n427n848n761m530k789j849j931j906j128l52k92l96K0M74J86
54691A57594n45r47j086j404j560r31R3M77Q0k85k44k54o37j076j214j071p82
54674A46208m60k85k95k12J25L71J75k29m36m99o47p39n98m50n17n40l26k30m67
54655A39949m57L05J241J415Q97M67L45J95J06M95J087J047J98o93r14m02O17
54638A45898J788K465K121J038mo98j247j618j484r54o37q40j243j385j061k96
54622A41843N72R24N18o3p3M63J018J390J664J579P69m80j379j495r56n2P92R88
54604A48022M39o5J43N85M27q9p2M48N61P5j97J01K74j96p96q96o57n57n97m97
54584A46456k16J28M71P02O61L90Q4k44o25p39k14O69J107P21k1m28j74O34J517
$$ plain form
54565 150879 152701 153961 154254 153874 153283 152735 152437 152527 152730 152583 152245 152462 153349 153865 153130 151738 151087 151716
54547 151716 152910 153777 154077 154159 154602 155859 157862 159992 161728 163140 164483 165588 166062 165881 165408 164983
54531 164983 164835 165111 165657 165931 165507 164498 163243 161852 160374 159042 157944 156815 155627 155056 155801 157599
54515 157599 159487 160906 161993 162884 163332 163123 162434 161602 160858 160332 160061 159854 159367 158424 157247 156313 155971
54498 155971 156131 156403 156597 156874 157174 156804 155229 153070 151614 151328 151660 152333 153791 155974 157752 158369 158626
54481 158626 159692 161398 162649 163079 163238 163426 163374 163049 162882 163084 163455 163980 165029 166791 168940 170900 172192
54464 172192 172646 172658 173001 173966 174881 174946 174245 173426 172672 171688 170577 169982 170318 171389 172714 173793 174114 173438
54446 173438 172109 170697 169448 168448 167997 168266 168744 168651 167849 166860 166153 165922 166303 167208 168083 168456 168558 168829
$$ packed form
54565A50879J822J260K93l80n91n48k98R0K03j47l38K17Q87N16p35j392o51O29
54547A51716J194Q67L00Q2M43J257K003K130J736J412J343J105M74j81m73m25
54531A64983j48K76N46K74m24j009j255j391j478j332j098j129j188n71P45J798
54515A57599J888J419J087Q91M48k09o89q32p44n26k71k07m87r43j177r34l42
54498A55971J60K72J94K77L00l70j575k159j456k86L32O73J458K183J778O17K57
54481A58626J066J706J251M30J59J88n2l25j67K02L71N25J049J762K149J960J292
54464A72192M54J2L43R65R15O5p01q19p54r84j111n95L36J071J325J079L21o76
54446A73438j329j412j249j000m51K69M78r3q02r89p07k31L81R05Q75L73J02K71
$$ plain form
54428 168829 169037 168652 167841 167300 167232 167343 167722 168753 170130 170942 170928 170733 170736 170549 169970 169488 169355 169029 168094
54409 168094 167067 166680 166942 167495 168412 169998 172101 174133 175598 176340 176521 176607 176988 177402 177224 176510 176173
54392 176173 176734 177584 178011 178337 179208 180176 180032 178506 176780 176097 176513 177326 178131 178934 179594 179766 179486 179373
54374 179373 180000 181227 182393 183062 183318 183335 183030 182367 181793 182040 183514 185950 188587 190653 191963 193178
54358 193178 195212 198190 201306 203931 206370 209178 212197 214844 216881 218181 218097 215995 212326 208326 204671
54343 204671 201249 198196 196043 194598 192748 189932 187004 185000 183788 182588 181265 180302 179855 179583 179266
54328 179266 178995 178810 178598 178337 178105 177925 177786 177671 177387 176666 175622 174755 174270 173743 172827 171832 171175 170631
54310 170631 169726 168637 168047 168188 168590 168830 169030 169451 169950 170057 169455 168344 167428 167418 168306 169257 169442 168944
$$ packed form
54428A68829K08l85q11n41o8J11L79J031J377Q12j4j95Lj87n79m82j33l26r35
54409A68094j027l87K62N53R17J586K103K032J465P42J81Q6L81M14j78p14l37
54392A76173N61Q50M27L26Q71R68j44j526j726o83M16Q13Q05Q03O60J72k80j13
54374A79373O27J227J166O69K56J7l05o63n74K47J474K436K637K066J310J215
54358A93178K034K978L116K625K439K808L019K647K037J300q4k102l669m000l655
54343B04671l422l053k153j445j850k816k928k004j212j200j323r63m47k72l17
54328A79266k71j85k12k61k32j80j39j15k84p21j044q67m85n27r16r95o57n44
54310A70631r05j089n90J41M02K40K00M21M99J07o02j111r16j0Q88R51J85m98
$$ plain form
54292 168944 168557 168789 169391 169911 170368 171100 172077 172611 171976 170329 168850 168658 169607 170480 170473 170122 170499 171852
54274 171852 173409 174339 174406 173793 172761 171683 171076 171348 172559 174453 176554 178302 179349 179899 180575 181801
54258 181801 183330 184452 184633 183935 182936 182288 182284 182799 183620 184695 185926 186827 186747 185638 184390 184057 184752 185582
54240 185582 185649 184874 183699 182405 181031 179783 179070 179098 179690 180501 181139 181191 180566 179843 179814 180542 181274 181428 181214
54221 181214 181045 180881 180537 180182 180031 179946 179837 180106 181008 181837 181512 179963 178267 177358 177119 176829 176021 174750
54203 174750 173448 172603 172262 171878 170984 169874 169154 168790 168293 167727 167785 168716 169966 171075 172216 173482 174337
54186 174337 174308 173697 173149 172901 172906 173259 173981 174683 174892 174569 173992 173375 172914 172870 173229 173521 173402 173201 173506 174335
54166 174335 175103 175303 174952 174462 174328 174791 175571 176041 175840 175234 174748 174722 175254 176215 177034 176899 175598 173890
$$ packed form
54292A68944l87K32O02N20M57P32R77N34o35j647j479j92R49Q73pl51L77J353
54274A71852J557R30O7o13j032j078o07K72J211J894K101J748J047N50O76J226
54258A81801J529J122J81o98r99o48mN15Q21J075J231R01q0j109j248l33O95Q30
54240A85582O7p75j175j294j374j248p13K8N92Q11O38N2o25p23k9P28P32J54k14
54221A81214j69j64l44l55j51q5j09K69R02Q29l25j549j696r09k39k90q08j271
54203A74750j302q45l41l84q94j110p20l64m97n66N8R31J250J109J141J266Q55
54186A74337k9o11n48k48NL53P22P02K09l23n77o17m61m4L59K92j19k01L05Q29
54166A74335P68K00l51m90j34M63P80M70k01o06m86k6N32R61Q19j35j301j708
$$ plain form
54148 173890 172717 172248 172046 171878 171903 172223 172710 173226 173639 173700 173279 172675 172351 172451 172876 173764 175424 177722
54130 177722 179870 181048 181093 180548 180174 180390 181009 181390 180975 179808 178565 178106 178891 180639 182492 183711 184297
54113 184297 184809 185570 186367 186966 187558 188420 189445 190311 190969 191639 192362 192840 192748 192067 191163 190560 190571 191095 191851
54094 191851 192699 193541 194080 194144 194291 195581 198534 202667 207208 211834 216572 221583 227426 235005 244645 255488
54078 255488 266151 275622 283109 287587 288241 285251 279528 271871 262907 253660 245369 238634 233176 228471
54064 228471 224193 220170 216448 213439 211477 210217 208960 207598 206730 206819 207726 209140 210888 212665 214023
54049 214023 214902 215784 217088 218747 220490 222102 223282 223854 224452 226439 230580 236119 241679 246842 252352
54034 252352 258912 266366 274068 281614 288989 296280 303410 310013 315542 319638 322410 324206 325105 324877 323541
$$ packed form
54148A73890j173m69k02j68K5L20M87N16M13O1m21o04l24J00M25Q88J660K298
54130A77722K148J178M5n45l74K16O19L81m15j167j243m59P85J748J853J219N86
54113A84297N12P61P97N99N92Q62J025Q66O58O70P23M78r2o81r04o03J1N24P56
54094A91851Q48Q42N39O4J47J290K953M133M541M626M738N011N843P579R640J0843
54078B55488J0663R471P487M478O54k990n723p657q964r247q291o735n458m705
54064B28471m278m023l722l009j962j260j257j362q68Q9R07J414J748J777J358
54049B14023Q79Q82J304J659J743J612J180N72N98J987M141N539N560N163N510
54034B52352O560P454P702P546P375P291P130O603N529M096K772J796Q99k28j336
$$ plain form
54019 323541 321650 319865 318393 317070 315835 314791 313809 312412 310225 307292 303728 299328 293858 287625
54005 287625 281449 275979 271307 267201 263434 259792 256107 252428 248944 245634 242318 239181 236868 235779
53991 235779 235537 235404 234963 234071 232469 230005 227149 224745 223171 222142 221373 221018 221221 221615 221599 221037 220379
53974 220379 220073 220017 219710 218861 217724 216758 216078 215446 214760 214280 214294 214785 215557 216458 217304 217898 218371 219291 221138
53955 221138 223785 226708 229487 231866 233657 235037 236717 239293 242502 245675 248794 252471 256820 261144
53941 261144 265134 269790 276602 286108 297756 310892 325238 340403 355441 369077 380082 387343
53929 387343 389973 387721 381296 372241 362473 353747 347104 342556 339455 337362 336410 336766 338078 339907 342508
53914 342508 346591 352201 358376 364209 369826 375950 382886 390388 398184 405938 412808 417736 420346 421113
$$ packed form
54019C23541j891j785j472j323j235j044r82j397k187k933l564m400n470o233
54005B87625o176n470m672m106l767l642l685l679l484l310l316l137k313j089
53991B35779k42j33m41q92j602k464k856k404j574j029p69l55K03L94j6n62o58
53974B20379l06n6l07q49j137r66o80o32o86m80J4M91P72R01Q46N94M73R20J847
53955B21138K647K923K779K379J791J380J680K576L209L173L119L677M349M324
53941B61144L990M656O812R506J1648J3136J4346J5165J5038J3636J1005P261
53929C87343K630k252o425r055r768q726o643m548l101k093r52L56J312J829K601
53914C42508M083N610O175N833N617O124O936P502P796P754O870M928K610P67
$$ plain form
53900 421113 420539 418641 415467 411585 407735 404211 400787 397029 392543 387208 381345 375422 369537 363478
53886 363478 357263 351099 344791 337822 330340 323413 317841 313218 308650 303929 299408 295123 290793 286552
53872 286552 282973 280270 277931 275235 271857 268038 264395 261470 259249 257227 255063 252850 250575 247837
53858 247837 244521 241206 238387 235717 232721 229863 228075 227457 227225 226829 226333 225775 225007 224203 223764 223659
53842 223659 223600 223873 225092 226943 228175 228141 227513 226989 226224 224676 222767 221367 220634 220167 219903 220018 220177
53825 220177 219802 219153 219360 221110 223796 226221 227761 228568 228967 229089 229055 229210 229951 231370 233195 235108 237038
53808 237038 239074 241267 243699 246608 250143 254009 257625 260766 263785 267152 270957 274948 278890 282741
53794 282741 286660 290884 295495 300236 304691 308634 312055 314900 317069 318670 319977 321023 321475 321009 319660
$$ packed form
53900D21113n74j898l174l882l850l524l424l758m486n335n863n923n885o059
53886C63478o215o164o308o969p482o927n572m623m568m721m521m285m330m241
53872B86552l579k703k339k696l378l819l643k925k221k022k164k213k275k738
53858B47837l316l315k819k670k996k858j788o18k32l96m96n58p68q04m39j05
53842B23659n9K73J219J851J232l4o28n24p65j548j909j400p33m67k64J15J59
53825B20177l75o49K07J750K686K425J540Q07L99J22l4J55P41J419J825J913J930
53808B37038K036K193K432K909L535L866L616L141L019L367L805L991L942L851
53794B82741L919M224M611M741M455L943L421K845K169J601J307J046M52m66j349
$$ plain form
53779 319660 317647 315071 311880 308108 304058 300195 296730 293249 289040 283968 278786 274293 270518 267088
53765 267088 264065 261768 259960 257948 255518 253060 250646 247785 244378 241270 239396 238805 238879 239027 238803
53750 238803 237791 235926 233696 231670 230028 228813 228253 228389 228704 228634 228260 228109 228453 229165 230085 231078 231895
53733 231895 232379 232773 233421 234210 234631 234418 233888 233670 234267 235733 237561 239048 240002 240946 242350 243908 244929
53716 244929 245285 245525 246167 247302 248939 251204 254038 257030 259763 262055 263756 264573 264429 263880 263963 265502
53700 265502 268560 272459 276301 279551 282314 285148 288656 293117 298284 303392 307489 309971 310934 311013 310877
53685 310877 310837 310803 310534 309936 309155 308420 307855 307502 307433 307707 308282 309063 309952 310695 310805 309917 308223 306283 304464
53666 304464 302814 301444 300636 300487 300753 301142 301466 301491 301034 300383 300200 300702 301248 301024 299887 298269 296574
$$ packed form
53779C19660k013k576l191l772m050l863l465l481m209n072n182m493l775l430
53765B67088l023k297j808k012k430k458k414k861l407l108j874n91P4J48k24
53750B38803j012j865k230k026j642j215n60J36L15p0l74j51L44P12R20R93Q17
53733B31895M84L94O48P89M21k13n30k18N97J466J828J487R54R44J404J558J021
53716B44929L56K40O42J135J637K265K834K992K733K292J701Q17j44n49Q3J539
53700B65502L058L899L842L250K763K834L508M461N167N108M097K482R63P9j36
53685C10877m0l4k69n98p81p35n65l53o9K74N75P81Q89P43J10q88j694j940j819
53666C04464j650j370q08j49K66L89L24K5m57o51j83N02N46k24j137j618j695
$$ plain form
53649 296574 295096 294282 294562 295802 297225 298015 297952 297538 297580 298545 300171 301794 303052 304098 305107 305980 306752
53632 306752 307857 309612 311626 313177 313993 314291 314207 313753 313381 313960 315891 318575 321158 323580 326550 330539
53616 330539 335236 340102 345102 350531 356353 362182 367933 373992 380542 387164 393405 399338 405142 410524
53602 410524 415155 419359 423609 427447 429745 430122 429334 428079 426258 423772 421260 419427 418153 416829 415183
53587 415183 413306 411346 409699 409078 409647 410429 410218 408944 407484 406310 405053 403403 401745 400597 399825
53572 399825 398761 396957 394715 392899 392183 392396 392643 392068 390410 388000 385642 384423 384938 386490 387638
53557 387638 387776 387571 387617 387575 387262 387572 389298 391700 393455 394580 396146 398328 400142 401212 402423 404383
53541 404383 406416 407750 408842 410731 413662 417000 420172 423206 426551 430715 435847 441532 447276 453287
$$ packed form
53649B96574j478q14K80J240J423P90o3m14M2R65J626J623J258J046J009Q73P72
53632C06752J105J755K014J551Q16K98q4m54l72N79J931K684K583K422K970L989
53616C30539M697M866N000N429N822N829N751O059O550O622O241N933N804N382
53602D10524M631M204M250L838K298L77p88j255j821k486k512j833j274j324j646
53587D15183j877j960j647o21N69P82k11j274j460j174j257j650j658j148p72
53572C99825j064j804k242j816p16K13K47n75j658k410k358j219N15J552J148
53557C87638J38k05M6m2l13L10J726K402J755J125J566K182J814J070J211J960
53541D04383K033J334J092J889K931L338L172L034L345M164N132N685N744O011
$$ plain form
53527 453287 460304 468542 477350 486213 495589 506417 519118 533304 548099 562616 576587 590743
53515 590743 606172 623142 641019 659373 678438 698317 718615 739363 761485 785653 811241
53504 811241 837073 862670 888010 912645 936025 958459 980789 1003166 1024953 1045795 1066031
53493 1066031 1086049 1105979 1126061 1146524 1167000 1186768 1205841 1225087 1244938 1264671 1283384
53482 1283384 1301093 1318364 1335399 1352153 1368932 1386103 1403249 1419329 1433807 1447042 1459379
53471 1459379 1470346 1479113 1485498 1490038 1493096 1494205 1492426 1487187 1478639 1467340 1453823 1438459 1421545
53458 1421545 1403390 1384422 1365290 1346739 1329106 1311918 1294220 1275381 1255491 1234964 1213992
53447 1213992 1192563 1170831 1149210 1128051 1107451 1087423 1068150 1050004 1033343 1018298 1004741
$$ packed form
53527D53287P017Q238Q808Q863R376J0828J2701J4186J4795J4517J3971J4156
53515E90743J5429J6970J7877J8354J9065J9879K0298K0748K2122K4168K5588
53504H11241K5832K5597K5340K4635K3380K2434K2330K2377K1787K0842K0236
53493A066031K0018J9930K0082K0463K0476J9768J9073J9246J9851J9733J8713
53482A283384J7709J7271J7035J6754J6779J7171J7146J6080J4478J3235J2337
53471A459379J0967Q767O385M540L058J109j779n239q548j1299j3517j5364j6914
53458A421545j8155j8968j9132j8551j7633j7188j7698j8839j9890k0527k0972
53447A213992k1429k1732k1621k1159k0600k0028j9273j8146j6661j5045j3557
$$ plain form
53436 1004741 992521 981837 973216 966908 962347 958599 955397 953367 953051 954148 956129 959203 964036 970656
53422 970656 978364 986831 996633 1008381 1021903 1036696 1052760 1070505 1090110 1111406 1134170 1158143
53410 1158143 1183043 1208955 1236439 1265690 1295863 1325934 1356196 1388214 1423230 1461203 1501447
53399 1501447 1543479 1586994 1631735 1677917 1726303 1777345 1830564 1885209 1941165 1998683 2057429
53388 2057429 2116383 2174654 2231979 2288440 2344098 2398935 2452802 2505278 2555802 2603965 2649547
53377 2649547 2692282 2731768 2767559 2799183 2826171 2848333 2865973 2879540 2889075 2894163 2894330 2889117
53365 2889117 2877782 2859430 2833694 2801032 2762142 2717374 2667027 2611991 2553701 2493517 2432514
53354 2432514 2371843 2312709 2255650 2200102 2145145 2090676 2037574 1986692 1938012 1890915 1844960
$$ packed form
53436A004741j2220j0684q621o308m561l748l202k030l16J097J981L074M833O620
53422I70656P708Q467R802J1748J3522J4793J6064J7745J9605K1296K2764K3973
53410A158143K4900K5912K7484K9251L0173L0071L0262L2018L5016L7973M0244
53399A501447M2032M3515M4741M6182M8386N1042N3219N4645N5956N7518N8746
53388B057429N8954N8271N7325N6461N5658N4837N3867N2476N0524M8163M5582
53377B649547M2735L9486L5791L1624K6988K2162J7640J3567R535N088J67n213
53365B889117j1335j8352k5736l2662l8890m4768n0347n5036n8290o0184o1003
53354B432514o0671n9134n7059n5548n4957n4469n3102n0882m8680m7097m5955
$$ plain form
53343 1844960 1800073 1756068 1712434 1668793 1625452 1583290 1543131 1505365 1470129 1437580 1407830
53332 1407830 1380679 1355723 1332785 1312032 1293518 1276867 1261717 1248251 1236785 1226790 1216870 1206034
53320 1206034 1194611 1183525 1173025 1162655 1152300 1142561 1134016 1126656 1120351 1115401 1112161 1110361 1109275
53307 1109275 1108626 1108966 1111051 1115034 1120521 1127279 1135569 1145665 1157309 1169969 1183577 1198632 1215520
53294 1215520 1234164 1254512 1276959 1301877 1328951 1357419 1386723 1416446 1445823 1474006 1500873
53283 1500873 1526936 1552269 1576105 1597721 1617142 1634545 1649463 1661173 1669630 1675474 1679212 1680761
53271 1680761 1679724 1675655 1668164 1657209 1643348 1627407 1609745 1590100 1568183 1544167 1518491 1491421
53259 1491421 1462987 1433237 1402407 1370796 1338557 1305672 1272217 1238631 1205527 1173170 1141383
$$ packed form
53343A844960m4887m4005m3634m3641m3341m2162m0159l7766l5236l2549k9750
53332A407830k7151k4956k2938k0753j8514j6651j5150j3466j1466r995r920j0836
53320A206034j1423j1086j0500j0370j0355r739q545p360o305m950l240j800j086
53307A109275o49L40K085L983N487O758Q290J0096J1644J2660J3608J5055J6888
53294A215520J8644K0348K2447K4918K7074K8468K9304K9723K9377K8183K6867
53283A500873K6063K5333K3836K1616J9421J7403J4918J1710Q457N844L738J549
53271A680761j037m069p491j0955j3861j5941j7662j9645k1917k4016k5676k7070
53259A491421k8434k9750l0830l1611l2239l2885l3455l3586l3104l2357l1787
$$ plain form
53248 1141383 1110158 1080153 1052175 1026197 1001201 976126 950755 925618 901243 877651 854436
53237 854436 831198 807997 785497 764524 745339 727430 710144 693437 677854 663859 651428
53226 651428 640340 630556 622102 614676 607679 600639 593460 586137 578370 569622 559544 548236 536101
53213 536101 523542 510894 498564 487068 476743 467396 458427 449467 440770 432841 425807 419444 413683
53200 413683 408580 403679 397999 391114 383900 377634 372524 367650 362299 356784 351804 347511 343474 339262
53186 339262 334816 330445 326638 323613 320963 317964 314399 310794 307677 304915 302050 299013 296164 293733
53172 293733 291558 289362 287076 284880 283003 281434 279818 277777 275394 273203 271613 270558 269765 269024 268092
53157 268092 266757 265328 264617 264973 265587 265329 264131 262989 262653 262914 263284 263715 264382 265177 265809 266124 266012
$$ packed form
53248A141383l1225l0005k7978k5978k4996k5075k5371k5137k4375k3592k3215
53237H54436k3238k3201k2500k0973j9185j7909j7286j6707j5583j3995j2431
53226F51428j1088r784q454p426o997p040p179p323p767q748j0078j1308j2135
53213E36101j2559j2648j2330j1496j0325r347q969q960q697p929p034o363n761
53200D13683n103m901n680o885p214o266n110m874n351n515m980m293m037m212
53186C39262m446m371l807l025k650k999l565l605l117k762k865l037k849k431
53172B93733k175k196k286k196j877j569j616k041k383k191j590j055p93p41r32
53157B68092j335j429p11L56O14k58j198j142l36K61L70M31O67P95O32L15j12
$$ plain form
53140 266012 265244 263775 262044 260655 259866 259657 260121 261395 263189 264786 265722 266229 266850 267807 268929 270039
53124 270039 271181 272458 273805 275022 275942 276600 277220 277992 278806 279331 279455 279521 279936 280616 281076 280971 280249 278861
53106 278861 276805 274583 273021 272267 271434 269812 268052 267379 267790 267927 266857 265146 263757 262701 261454
53091 261454 260188 259685 260118 260702 260653 260018 259364 259082 259183 259437 259484 259008 258042 257073 256729 257320 258520 259440 259248
53072 259248 258039 256953 256962 257639 257648 256523 255331 255234 255994 256450 256092 255444 255010 254613 253935 253083 252293 251469 250420
53053 250420 249279 248372 247851 247734 248049 248642 249099 249216 249338 249763 250035 249477 248393 248021 249020 250543 251131 250099
53035 250099 247792 245042 242840 242046 242643 243450 243195 241912 240831 240961 242264 244084 245801 246983 247474 247586
53019 247586 247867 248526 249400 250421 251648 252791 253294 253141 252975 253068 252703 251125 248806 247169 247152 248514 250482
$$ packed form
53140B66012p68j469j731j389p89k09M64J274J794J597R36N07O21R57J122J110
53124B70039J142J277J347J217R20O58O20P72Q14N25J24O6M15O80M60j05p22j388
53106B78861k056k222j562p54q33j622j760o73M11J37j070j711j389j056j247
53091B61454j266n03M33N84m9o35o54k82J01K54M7m76r66r69l44N91J200R20j92
53072B59248j209j086RO77Rj125j192r7P60M56l58o48m34l97o78q52p90q24j049
53053B50420j141r07n21j17L15N93M57J17J22M25K72n58j084l72R99J523N88j032
53035B50099k307k750k202p94N97Q07k55j283j081J30J303J820J717J182M91J12
53019B47586K81O59Q74J021J227J143N03j53j66R3l65j578k319j637j7J362J968
$$ plain form
53002 250482 252567 254584 256238 257121 257124 256679 256343 256186 255759 254798 253685 252986 252803 252970 253617 254910 256313
52985 256313 256883 256435 255787 255578 255564 255404 255392 255832 256358 256584 256948 258081 259660 260750 261138 261565 262610 264054
52967 264054 265339 266048 265953 265272 264949 265904 267809 269197 269041 267687 266014 264388 262792 261357 260139 258730
52951 258730 256711 254373 252542 251724 251732 252030 252166 251994 251742 251802 252248 252731 252999 253309 254005 254879 255335 255076 254318
52932 254318 253385 252487 251841 251616 251625 251437 250908 250308 249824 249291 248623 248177 248303 248734 248839 248402 247773 247213 246545
52913 246545 245619 244765 244421 244477 244347 243704 242955 242911 244041 246015 247883 248815 248770 248374 248127 247969 247775 247929 248893
52894 248893 250369 251473 251888 252349 253646 255530 256970 257360 257050 256728 256594 256306 255606 254771 254312 254260 254035
52877 254035 253181 251994 251058 250419 249735 249167 249434 250800 252656 254500 256753 260088 264291 268369 271560 273762
$$ packed form
53002B50482K085K017J654Q83Lm45l36j57m27r61j113o99j83J67O47J293J403
52985B56313N70m48o48k09j4j60j2M40N26K26L64J133J579J090L88M27J045J444
52967B64054J285P09r5o81l23R55J905J388j56j354j673j626j596j435j218j409
52951B58730k019k338j831q18QK98J36j72k52O0M46M83K68L10O96Q74M56k59p58
52932B54318r33q98o46k25Rj88n29o00m84n33o68m46J26M31J05m37o29n60o68
52913B46545r26q54l44N6j30o43p49m4J130J974J868R32m5l96k47j58j94J54R64
52894B48893J476J104M15M61J297J884J440L90l10l22j34k88p00q35m59n2k25
52877B54035q54j187r36o39o84n68K67J366J856J844K253L335M203M078L191K202
$$ plain form
52861 273762 275201 276182 277061 277924 278301 277609 275859 273558 271000 268072 264688 261023 257313 253813 250917
52846 250917 248856 247216 245194 242490 239665 237517 236344 235880 235624 235177 234510 233956 233766 233740 233597 233563 234120
52829 234120 235221 236328 237306 238637 240439 241830 241785 240351 238543 237219 236414 235750 235134 234956 235731 237565
52813 237565 239964 242270 244296 246387 248892 251833 255047 258220 260580 261067 259263 256010 252675 249912
52799 249912 247451 244984 242726 240971 239528 237928 236104 234552 233745 233508 233074 231834 230042 228739 228906
52784 228906 230642 233148 235408 236829 237347 237227 236917 236938 237608 238795 240053 241038 241632 241708 241150 240294 239968
52767 239968 240670 241839 242382 241840 240608 239167 237757 236823 236975 238118 239249 239613 239561 239775 240195 240449 240860
52750 240860 242124 244072 245596 245905 245260 244425 243980 244200 245035 246044 246812 247475 248398 249420 250032 250243 250578
$$ packed form
52861B73762J439R81Q79Q63L77o92j750k301k558k928l384l665l710l500k896
52846B50917k061j640k022k704k825k148j173m64k56m47o67n54j90k6j43l4N57
52829B34120J101J107R78J331J802J391m5j434j808j324q05o64o16j78P75J834
52813B37565K399K306K026K091K505K941L214L173K360M87j804l253l335k763
52799B49912k461k467k258j755j443j600j824j552q07k37m34j240j792j303J67
52784B28906J736K506K260J421N18j20l10K1O70J187J258R85N94P6n58q56l26
52767B39968P02J169N43n42j232j441j410r34J52J143J131L64n2K14M20K54M11
52750B40860J264J948J524L09o45q35m45K20Q35J009P68O63R23J022O12K11L35
$$ plain form
52733 250578 251171 251714 252431 254145 256896 259376 260466 260644 261138 262165 262900 262867 262345 261445 259705 256939 253863
52716 253863 251424 249849 248660 247456 246347 245664 245503 245672 245994 246478 247078 247441 247171 246318 245377 244766 244577
52699 244577 244791 245338 245815 245674 245004 244800 245956 248191 250320 251491 251786 251724 251648 251653 251735 251793 251630 251196 250760
52680 250760 250763 251422 252476 253390 253845 253910 253655 252852 251413 249984 249550 250303 251378 251942 252139 252572 253196 253260 252255
52661 252255 250565 249153 248837 249807 251615 253663 255784 258217 261010 263805 266413 269197 272444 275604 277575
52646 277575 277692 276106 273432 270487 268177 267014 266605 266071 265065 264022 263345 262938 262711 263027 264144 265621
52630 265621 266810 267794 269301 271694 274530 277180 279380 280851 280880 278885 275342 271620 268759 266790 265376
52615 265376 264592 264585 264800 264234 262584 260651 259395 258935 258734 258445 258153 257935 257615 257102 256701 256863 257689 258910
$$ packed form
52733B50578N93N43P17J714K751K480J090J78M94J027P35l3n22r00j740k766l076
52716B53863k439j575j189j204j109o83j61J69L22M84O00L63k70q53r41o11j89
52699B44577K14N47M77j41o70k04J156K235K129J171K95o2p6NQ2N8j63m34m36
52680B50760LO59J054R14M55O5k55q03j439j429m34P53J075N64J97M33O24O4j005
52661B52255j690j412l16R70J808K048K121K433K793K795K608K784L247L160J971
52646B77575J17j586k674k945k310j163m09n34j006j043o77m07k27L16J117J477
52630B65621J189R84J507K393K836K650K200J471K9j995l543l722k861j969j414
52615B65376p84pK15n66j650j933j256m60k01k89k92k18l20n13m01J62Q26J221
$$ plain form
52597 258910 260307 261902 263597 264958 265714 266306 267336 268498 268756 267852 266918 267021 267754 268083 268038 268466 269326
52580 269326 269603 269074 268910 269944 271361 271922 271640 271370 271356 271206 270963 271143 271732 272011 271545 270707 270048 269666
52562 269666 269365 269049 268754 268529 268397 268262 267885 267139 266243 265517 265029 264739 264822 265446 266271 266532 265723 264007 261959
52543 261959 260108 258728 257815 257201 256765 256523 256516 256781 257557 259262 261965 265039 267567 269059 269625 269633 269438 269324
52525 269324 269483 270044 271059 272292 273081 272940 272390 272584 273812 274969 275057 274651 275200 277206 279858 282248 284198
52508 284198 285994 288034 290694 293866 296597 297838 297656 297062 296564 295534 293178 289516 285248 281216 278232
52493 278232 276804 276627 276766 276653 276506 276593 276613 276232 275789 275964 276979 278513 280208 281829 283048 283446 282816
52476 282816 281383 279792 278910 279329 280860 282704 284269 285654 287201 288926 290626 292285 294016 295779 297462
$$ packed form
52597B58910J397J595J695J361P56N92J030J162K58r04r34J03P33L29m5M28Q60
52580B69326K77n29j64J034J417N61k82k70j4j50k43J80N89K79m66q38o59l82
52562B69666l01l16k95k25j32j35l77p46q96p26m88k90Q3O24Q25K61q09j716k048
52543B61959j851j380r13o14m36k42pK65P76J705K703L074K528J492N66Qj95j14
52525B69324J59N61J015J233P89j41n50J94J228J157Q8m06N49K006K652K390J950
52508B84198J796K040K660L172K731J241j82n94m98j030k356l662m268m032k984
52493B78232j428j77J39j13j47Q7K0l81m43J75J015J534J695J621J219L98o30
52476B82816j433j591q82M19J531J844J565J385J547J725J700J659J731J763J683
$$ plain form
52461 297462 299156 301015 302899 304418 305330 305635 305300 304140 302096 299407 296385 293135 289671 286199 283106
52446 283106 280632 278687 277012 275466 274106 273158 272948 273658 274907 275766 275530 274422 273197 272173 271120
52431 271120 270048 269388 269178 268736 267677 266655 266480 266905 267026 266607 266289 266615 267576 269015 270708 272038 272370
52414 272370 271995 272088 273461 275853 278608 281496 284663 288422 293474 300773 310594 321896 332953 342530
52400 342530 350339 356675 361749 365069 365335 361381 353545 343750 333997 325133 317345 311155 307174 305066
52386 305066 303596 301957 300621 300542 301767 303146 303469 302708 301943 302124 303209 304616 306170 308129 310539 313146
52370 313146 315943 319207 322800 326004 328361 330236 332151 333922 334911 334915 334383 333848 333512 333390 333567 334199 335324
52353 335324 336744 338129 339327 340498 341815 343160 344356 345557 347080 348889 350630 352174 353688 355168
$$ packed form
52461B97462J694J859J884J519R12L05l35j160k044k689l022l250l464l472l093
52446B83106k474j945j675j546j360r48k10P10J249Q59k36j108j225j024j053
52431B71120j072o60k10m42j059j022j75M25J21m19l18L26R61J439J693J330L32
52414B72370l75R3J373K392K755K888L167L759N052P299R821J1302J1057R577
52400C42530P809O336N074L320K66l954p836r795r753q864p788o190l981k108
52386C05066j470j639j336p9J225J379L23p61p65J81J085J407J554J959K410K607
52370C13146K797L264L593L204K357J875J915J771R89Mn32n35l36j22J77O32J125
52353C35324J420J385J198J171J317J345J196J201J523J809J741J544J514J480
$$ plain form
52339 355168 356445 357678 359301 361345 363408 365493 368228 371936 376159 380579 385802 392555 400561 408909
52325 408909 417269 426059 435630 445958 456996 468613 480236 491206 501636 512356 523814 535572
52313 535572 547086 558544 570515 583108 595929 608855 622445 637311 653201 669006 683846
52302 683846 697983 712400 727639 743438 759400 775453 791383 806421 819693 830807 839761 846616
52290 846616 851644 855396 858148 859492 858954 856922 854468 852300 850268 847858 844816 841312 837858 835091
52276 835091 833370 832530 832144 831957 831966 832283 833088 834491 836250 837982 839901 842896 847477 852946 858173 862921
52260 862921 867853 873548 880171 887950 897209 907903 919742 932769 947123 962207 976821 990355
52248 990355 1003156 1015486 1026796 1036450 1044575 1051605 1057378 1061230 1062849 1062625 1061295 1059459 1057250 1054259
$$ packed form
52339C55168J277J233J623K044K063K085K735L708M223M420N223O753Q006Q348
52325D08909Q360Q790R571J0328J1038J1617J1623J0970J0430J0720J1458J1758
52313E35572J1514J1458J1971J2593J2821J2926J3590J4866J5890J5805J4840
52302F83846J4137J4417J5239J5799J5962J6053J5930J5038J3272J1114Q954O855
52290H46616N028L752K752J344n38k032k454k168k032k410l042l504l454k767
52276H35091j721q40l86j87RL17Q05J403J759J732J919K995M581N469N227M748
52260H62921M932N695O623P779R259J0694J1839J3027J4354J5084J4614J3534
52248I90355J2801J2330J1310R654Q125P030N773L852J619k24j330j836k209k991
$$ plain form
52234 1054259 1050057 1045041 1040449 1037085 1034257 1030396 1024700 1017781 1010708 1003859 996855 989375 981772 974882
52220 974882 969265 964669 960280 955525 950528 945782 941572 937960 935209 933946 934737 937492 941342 945198
52206 945198 948516 951568 954943 958865 963044 967066 970720 974058 977395 981311 986303 992299 998669 1004865
52192 1004865 1010847 1016750 1022360 1027169 1030840 1033343 1034690 1034740 1033355 1030589 1026722 1022147 1017186 1011888
52178 1011888 1005968 999105 991375 983397 975992 969678 964409 959743 955292 951064 947342 944258 941617 939284
52164 939284 937538 936737 936633 936477 936077 936361 938373 941790 945026 946936 947888 948813 949770 950024 949311 948332 948029
52147 948029 948906 951040 954181 957676 960837 963602 966390 969126 970962 971268 970340 968759 966626 964001 961583
52132 961583 960163 959693 959691 960477 963166 968355 975551 984135 994263 1006471 1020895 1037188 1054796 1072932
$$ packed form
52234A054259m202n016m592l364k828l861n696o919p073o849p004p480p603o890
52220I74882n617m596m389m755m997m746m210l612k751j263P91K755L850L856
52206I45198L318L052L375L922M179M022L654L338L337L916M992N996O370O196
52192A004865N982N903N610M809L671K503J347N0j385k766l867m575m961n298
52178A011888n920o863p730p978p405o314n269m666m451m228l722l084k641k333
52164I39284j746q01j04j56m00K84K012L417L236J910R52R25R57K54p13r79l03
52147I48029Q77K134L141L495L161K765K788K736J836L06r28j581k133k625k418
52132I61583j420m70kP86K689N189P196Q584J0128J2208J4424J6293J7608J8136
$$ plain form
52118 1072932 1090647 1107362 1123232 1138768 1154251 1169742 1185383 1201309 1217347 1233065 1248122
52107 1248122 1262432 1276094 1289349 1302557 1316036 1329891 1344066 1358463 1372931 1387178 1400764
52096 1400764 1413175 1423910 1432579 1438917 1442549 1442769 1438876 1430966 1420263 1408447 1396655 1385176 1373894
52083 1373894 1362655 1351261 1339533 1327763 1316986 1308366 1302059 1296785 1290821 1283488 1275635 1268707 1263638
52070 1263638 1260620 1259516 1260059 1261793 1264286 1267558 1272003 1277780 1284437 1291330 1298325 1305955 1314918 1325418
52056 1325418 1336958 1348726 1360219 1371450 1382489 1392864 1401619 1408024 1412132 1414539 1415662 1415354 1413211
52043 1413211 1409124 1403417 1396499 1388581 1379916 1371106 1362838 1355295 1348134 1341080 1334221 1327570 1320687 1313034
52029 1313034 1304442 1294930 1284289 1272251 1258971 1245053 1231108 1217515 1204457 1191911 1179683 1167734
$$ packed form
52118A072932J7715J6715J5870J5536J5483J5491J5641J5926J6038J5718J5057
52107A248122J4310J3662J3255J3208J3479J3855J4175J4397J4468J4247J3586
52096A400764J2411J0735Q669O338L632K20l893p910j0703j1816j1792j1479j1282
52083A373894j1239j1394j1728j1770j0777q620o307n274n964p333p853o928n069
52070A263638l018j104N43J734K493L272M445N777O657O893O995P630Q963J0500
52056A325418J1540J1768J1493J1231J1039J0375Q755O405M108K407J123l08k143
52043A413211m087n707o918p918q665q810q268p543p161p054o859o651o883p653
52029A313034q592r512j0641j2038j3280j3918j3945j3593j3058j2546j2228j1949
$$ plain form
52017 1167734 1156366 1145814 1135887 1126371 1117648 1110395 1104650 1099535 1094009 1087524 1079968 1071331 1061496
52004 1061496 1050096 1036586 1020808 1003439 985469 967295 948834 930483 913238 897556 882756
51993 882756 868031 853557 840026 827372 814586 800798 786096 771279 757193 744252 732244
51982 732244 720388 707769 693928 679065 663677 648098 632455 617010 602431 589580 578967
51971 578967 570552 564194 560105 558588 559441 562033 566023 571663 579205 588204 597569 606118 613002 617816
51957 617816 620504 621126 619708 616382 611582 605807 599234 591875 584189 577248 572126 569290 568582 569554 571846
51942 571846 575601 581617 590712 602756 616639 631240 646089 660974 675388 688663 700284 709771
51930 709771 716589 720554 722055 721592 719293 715156 709529 703072 696531 690925 687650 687932 692173 699935 710238
$$ packed form
52017A167734j1368j0552r927r516q723p253n745n115n526o485p556q637r835
52004A061496j1400j3510j5778j7369j7970j8174j8461j8351j7245j5682j4800
51993H82756j4725j4474j3531j2654j2786j3788j4702j4817j4086j2941j2008
51982G32244j1856j2619j3841j4863j5388j5579j5643j5445j4579j2851j0613
51971E78967q415o358m089j517Q53K592L990N640P542Q999R365Q549O884M814
51957F17816K688O22j418l326m800n775o573p359p686o941n122k836p08R72K292
51942E71846L755O016R095J2044J3883J4601J4849J4885J4414J3275J1621R487
51930G09771O818L965J501m63k299m137n627o457o541n606l275K82M241P762J0303
$$ plain form
51915 710238 721457 731254 737194 737554 731434 718512 699389 676158 652082 630299 612665 599432
51903 599432 589634 581941 575632 570806 567448 564564 560615 554696 546779 537041 525606 513014 500276
51890 500276 488195 477037 467024 458695 452473 448248 445706 444817 445763 448599 453225 459490 467117 475766
51876 475766 485373 496210 508269 520713 532187 541679 548840 553563 555519 554266 549762 542694 534264
51863 534264 525616 517477 510305 504455 499971 496358 493049 490160 488416 488217 489068 490086 490687 490526 489115
51848 489115 486004 481206 475179 468489 461736 455591 450427 445928 441472 436974 433016 430066 427906 426003
51834 426003 424218 422958 422787 424012 426517 429832 433434 436988 440230 442720 443989 444007 443192 441917 440311
51819 440311 438689 437715 437775 438475 439150 439684 440414 441409 442388 443269 444254 445261 445741 445257 443858 441716 438830
$$ packed form
51915G10238J1219R797N940L60o120j2922j9123k3231k4076k1783j7634j3233
51903E99432r798p693o309m826l358k884l949n919p917r738j1435j2592j2738
51890E00276j2081j1158j0013q329o222m225k542q89R46K836M626O265P627Q649
51876D75766R607J0837J2059J2444J1474R492P161M723J956j253m504p068q430
51863E34264q648q139p172n850m484l613l309k889j744j99Q51J018O01j61j411
51848D89115l111m798o027o690o753o145n164m499m456m498l958k950k160j903
51834D26003j785j260j71J225K505L315L602L554L242K490J269J8q15j275j606
51819D40311j622r74O0P00O75N34P30R95R79Q81R85J007M80m84j399k142k886
$$ plain form
51802 438830 435324 431721 428594 426159 424441 423546 423438 423650 423566 422925 421906 420857 420086 419690 419337 418505 417198
51785 417198 416233 416458 417798 419332 420080 419486 417478 414609 412011 410731 411010 412437 414570 417154 420112
51770 420112 423928 429817 438727 450113 462263 473846 484562 494257 502237 507753 510541 510568 507804 502579
51756 502579 495669 487648 478658 469155 460306 453043 447067 441331 435275 429164 423483 418555 414611 411765
51742 411765 410000 409497 410804 414264 419398 425251 431234 437241 443128 448637 453819 458972 463948 467883
51728 467883 469886 469888 468747 467717 467829 469491 472422 475931 479254 481620 482179 480257 475867 469952 463963
51713 463963 459094 455796 453974 453472 454159 455476 456353 456069 455143 454873 455982 458159 460946 464258 467643 469724
51697 469724 469180 466184 462366 459452 458283 458887 460930 463954 467439 470682 472604 472078 468798 463584 457521
$$ packed form
51802D38830l506l603l127k435j718q95j08K12q4o41j019j049p71l96l53q32j307
51785D17198r65K25J340J534P48n94k008k869k598j280K79J427K133K584K958
51770D20112L816N889Q910J1386J2150J1583J0716R695P980N516K788K7k764n225
51756E02579o910q021q990r503q849p263n976n736o056o111n681m928l944k846
51742D11765j765n03J307L460N134N853N983O007N887N509N182N153M976L935
51728D67883K003Kj141j030J12J662K931L509L323K366N59j922m390n915n989
51713D63963m869l298j822n02O87J317Q77k84r26k70J109K177K787L312L385K081
51697D69724n44k996l818k914j169O04K043L024L485L243J922n26l280n214o063
$$ plain form
51682 457521 451106 444656 439056 435346 433634 433150 433378 434485 436504 438751 440389 441181 441419 441520 442001 443601
51666 443601 447003 452404 459476 467685 476503 485282 492938 498010 499459 497631 494172 490707 487810 485508
51652 485508 484318 485203 488641 494270 501334 508925 515811 520680 522674 521271 515778 505725 491980 476818
51638 476818 462468 449924 439324 430795 424406 419706 415942 412660 409839 407627 406266 405993 406684 407718
51624 407718 408546 409266 410359 411965 413677 414915 415259 414529 412857 410663 408350 406037 403695 401423 399380
51609 399380 397566 395923 394554 393536 392578 391198 389378 387803 387247 387927 389601 392160 395833 400859 407250
51594 407250 414960 423959 433916 444021 453436 461703 468359 472342 472543 469177 464005 458799 454077 449779
51580 449779 446617 445909 448278 453384 461028 471736 485909 502917 521371 539915 557574 573872 589126
$$ packed form
51682D57521o415o450n600l710j712m84K28J107K019K247J638P92K38J01M81J600
51666D43601L402N401P072Q209Q818Q779P656N072J449j828l459l465k897k302
51652D85508j190Q85L438N629P064P591O886M869J994j403n493j0053j3745j5162
51638D76818j4350j2544j0600q529o389m700l764l282k821k212j361k73O91J034
51624D07718Q28P20J093J606J712J238L44p30j672k194k313k313k342k272k043
51609C99380j814j643j369j018r58j380j820j575n56O80J674K559L673N026O391
51594D07250P710Q999R957J0105R415Q267O656L983K01l366n172n206m722m298
51580D49779l162p08K369N106P644J0708J4173J7008J8454J8544J7659J6298J5254
$$ plain form
51567 589126 604388 620571 637462 653803 668411 681394 694579 710874 732909 761869 797308
51556 797308 837752 881223 925333 967373 1004636 1034728 1055829 1067093 1068784 1061646 1046085 1022324
51544 1022324 991316 954858 914598 871437 826297 780990 737717 697861 661734 629394 601224
51533 601224 577563 558137 542143 528837 517863 508980 501702 495510 490478 487316 486483 487447 489127
51520 489127 490849 492438 493661 494220 494206 493834 492663 489843 485367 480311 475451 470380 464525 458348 452794
51505 452794 448059 443709 439673 436236 433204 429977 426487 423341 420834 418466 415718 412773 410142 407924
51491 407924 405820 403663 401721 400511 400409 401273 402355 402765 402121 400680 398850 396768 394388 391796 389306
51476 389306 387332 386190 385899 386139 386477 386622 386468 385974 385164 384178 383196 382362 381785 381452 381066 380266 379245 378868
$$ packed form
51567E89126J5262J6183J6891J6341J4608J2983J3185J6295K2035K8960L5439
51556G97308M0444M3471M4110M2040L7263L0092K1101J1264J691p138j5561k3761
51544A022324l1008l6458m0260m3161m5140m5307m3273l9856l6127l2340k8170
51533F01224k3661j9426j5994j3306j0974q883p278o192n032l162q33R64J680
51520D89127J722J589J223N59j4l72j171k820m476n056m860n071n855o177n554
51505D52794m735m350m036l437l032l227l490l146k507k368k748k945k631k218
51491D07924k104k157j942j210j02Q64J082M10o44j441j830k082k380k592k490
51476C89306j974j142k91K40L38J45j54m94q10r86r82q34n77l33l86q00j021l77
$$ plain form
51458 378868 379763 381440 382753 383172 383191 383484 384196 385242 386807 389173 392277 395820 399709 404178 409599 416415
51442 416415 425125 435937 448320 461024 472633 482055 488679 492482 494189 495064 496115 497383 498080 497334
51428 497334 494583 489385 481384 470828 458941 447402 437478 429771 424517 421663 420673 420744 421412 422654
51414 422654 424299 425705 426258 425947 425225 424501 424012 423956 424482 425554 426987 428508 429724 430281 430246 430202 430795 432292
51396 432292 434649 437749 441367 445170 449015 453150 457978 463836 471138 480398 491803 505074 520111
51383 520111 537577 558442 583145 611645 644123 681151 723226 770537 823053 880193 940195
51372 940195 1000243 1057278 1108390 1150601 1181183 1198783 1203902 1197796 1181080 1153715 1116114 1069812
51360 1069812 1017208 960998 903719 847336 793026 741620 694340 652781 617905 589178 564982
$$ packed form
51458C78868Q95J677J313M19J9K93P12J046J565K366L104L543L889M469N421O816
51442D16415Q710J0812J2383J2704J1609R422O624L803J707Q75J051J268O97p46
51428D97334k751n198q001j0556j1887j1539r924p707n254k854r90P1O68J242
51414D22654J645J406N53l11p22p24m89n6N26J072J433J521J216N57l5m4N93J497
51396D32292K357L100L618L803L845M135M828N858P302R260J1405J3271J5037
51383E20111J7466K0865K4703K8500L2478L7028M2075M7311N2516N7140O0002
51372I40195O0048N7035N1112M2211L0582J7600N119o106j6716k7365l7601m6302
51360A069812n2604n6210n7279n6383n4310n1406m7280m1559l4876k8727k4196
$$ plain form
51349 564982 543877 525298 509082 494725 481378 468468 456053 444587 434528 426096 419165 413298
51337 413298 408063 403351 399243 395638 392335 389507 387630 386701 385920 384515 382660 381169 380417 379946 379097
51322 379097 377672 376071 375136 375772 378351 382378 387063 392129 397670 403292 408054 411506 414222 416867 419113
51307 419113 419980 419051 416800 413788 410117 405844 401476 397636 394374 391152 387539 383728 380319 377730 375827
51292 375827 374082 372035 369714 367617 366322 366092 366814 368141 369609 370870 372140 374282 378026 383073 388431
51277 388431 393675 399216 405002 409704 411990 412202 411889 411900 411905 411730 412024 413195 414624 415537 415999 416447 416832
51260 416832 416933 417022 417497 418110 418219 417651 416733 415642 414251 412529 410565 408337 405889 403566 401613 399712
51244 399712 397418 394859 392461 390197 387703 385030 382681 380935 379712 379035 378990 379224 379163 378773 378496 378406 378095
$$ packed form
51349E64982k1105j8579j6216j4357j3347j2910j2415j1466j0059q432o931n867
51337D13298n235m712m108l605l303k828j877r29p81j405j855j491p52m71q49
51322C79097j425j601r35O36K579M027M685N066N541N622M762L452K716K645K246
51307D19113Q67r29k251l012l671m273m368l840l262l222l613l811l409k589j903
51292C75827j745k047k321k097j295k30P22J327J468J261J270K142L744N047N358
51277C88431N244N541N786M702K286K12l13J1Nj75K94J171J429R13M62M48L85
51260D16832J01Q9M75O13J09n68r18j091j391j722j964k228k448k323j953j901
51244C99712k294k559k398k264k494k673k349j746j223o77m5K34o1l90k77r0l11
$$ plain form
51227 378095 377540 377369 377990 379043 380039 381045 382424 384293 386519 388891 391134 393100 395108 397657 400692
51212 400692 403643 406326 409185 412423 415506 417917 419826 421594 423189 424611 426402 429047 432136 434764
51198 434764 436571 437783 438360 437734 435539 432185 428532 425196 422263 419540 417052 415287 414761 415301 416014
51183 416014 416196 416060 416372 417616 419721 422332 425003 427233 428657 429237 429210 428971 428986 429452 429871 429236 426934
51166 426934 423332 419417 416172 414363 414358 415745 417519 419173 421290 424625 428848 432740 435476 437173 438168
51151 438168 438291 437007 434026 429674 424808 420303 416466 412984 409472 405884 402304 398786 395623 393358
51137 393358 392119 391286 390342 389692 390106 391553 393190 394370 395062 395376 395385 395476 396282 398065 400618 403856 408058
51120 408058 413388 419583 426215 432857 438911 443739 447157 449504 451139 452237 453119 454286 455889 457525
$$ packed form
51227C78095n55j71O21J053R96J006J379J869K226K372K243J966K008K549L035
51212D00692K951K683K859L238L083K411J909J768J595J422J791K645L089K628
51198D34764J807J212N77o26k195l354l653l336k933k723k488j765n26N40P13
51183D16014J82j36L12J244K105K611K671K230J424N80k7k39J5M66M19o35k302
51166D26934l602l915l245j809nJ387J774J654K117L335M223L892K736J697R95
51151D38168J23j284k981m352m866m505l837l482l512l588l580l518l163k265
51137C93358j239q33r44o50M14J447J637J180O92L14RR1Q06J783K553L238M202
51120D08058N330O195O632O642O054M828L418K347J635J098Q82J167J603J636
$$ plain form
51106 457525 458749 459476 459783 459621 458907 457624 455784 453646 451939 451369 451745 452111 451897 451400 450936 450156 448716
51089 448716 447064 445974 445576 445420 445234 445106 445113 445268 445709 446429 446953 446768 445992 445183 444588 444135 444063 444942 446935
51070 446935 449648 452869 456875 461650 466354 470095 473049 476405 481354 488417 497515 508239 520072 532762
51056 532762 546472 561151 575735 588473 598487 606848 615821 627076 640778 656164 672449 688908
51044 688908 704385 717212 725862 729746 729357 725584 718861 709074 696399 682059 667899 655145 643864
51031 643864 633647 624282 615417 606106 595595 584585 575052 568500 564775 562773 561739 561495 561885 562745
51017 562745 564334 567157 571178 575620 579774 583762 588283 593775 600083 606973 614737 624086 635378 648123
51003 648123 661397 674637 687814 700938 713840 726544 739211 751292 761287 768044 772143 775205
$$ packed form
51106D57525J224P27L07j62p14j283j840k138j707n70L76L66k14m97m64p80j440
51089D48716j652j090l98j56j86j28PJ55M41P20N24j85p76q09n95m53p2Q79J993
51070D46935K713L221M006M775M704L741K954L356M949P063R098J0724J1833J2690
51056E32762J3710J4679J4584J2738J0014Q361Q973J1255J3702J5386J6285J6459
51044F88908J5477J2827Q650L884l89l773o723r787j2675j4340j4160j2754j1281
51031F43864j0217r365q865r311j0511j1010r533o552l725k002j034k44L90Q60
51017E62745J589K823M021M442M154L988M521N492O308O890P764R349J1292J2745
51003F48123J3274J3240J3177J3124J2902J2704J2667J2081R995O757M099L062
$$ plain form
50991 775205 777837 778992 777608 774079 769629 764879 759792 754725 750710 748633 748768 751259 756482 764621
50977 764621 775206 787386 800465 813922 827214 840035 852965 867629 885948 909059 936844
50966 936844 968461 1003364 1041746 1083954 1129636 1177759 1227526 1278944 1332222 1386763 1441066
50955 1441066 1493613 1543542 1590382 1633427 1671693 1704493 1731839 1754230 1772200 1786243 1797090
50944 1797090 1805810 1813475 1820787 1828122 1835844 1844261 1853042 1860728 1865093 1864296 1857883 1846782 1832363 1815524
50930 1815524 1796537 1775459 1752370 1727186 1699483 1668750 1634746 1597512 1557153 1513758 1467501
50919 1467501 1418636 1367565 1315243 1263549 1214774 1170357 1130184 1093293 1059139 1027981 1000202
50908 1000202 975636 953627 933462 914609 896719 879681 863717 849185 836164 824268 813039
$$ packed form
50991G75205K632J155j384l529m450m750n087n067m015k077J35K491N223Q139
50977G64621J0585J2180J3079J3457J3292J2821J2930J4664J8319K3111K7785
50966I36844L1617L4903L8382M2208M5682M8123M9767N1418N3278N4541N4303
50955A441066N2547M9929M6840M3045L8266L2800K7346K2391J7970J4043J0847
50944A797090Q720P665P312P335P722Q417Q781P686M365p97o413j1101j4419j6839
50930A815524j8987k1078k3089k5184k7703l0733l4004l7234m0359m3395m6257
50919A467501m8865n1071n2322n1694m8775m4417m0173l6891l4154l1158k7779
50908A000202k4566k2009k0165j8853j7890j7038j5964j4532j3021j1896j1229
$$ plain form
50897 813039 802602 793742 787089 782290 778239 774228 770596 768066 766693 765834 765082 764770 765398 766830 768404
50882 768404 769771 771346 773869 777694 782690 788664 795599 803437 811934 820902 830381 840355 850622 861320
50868 861320 873379 887783 904282 921485 938573 956424 976679 1000143 1026588 1055730 1087712
50857 1087712 1122831 1161524 1204624 1252965 1306622 1365094 1428374 1497253 1572392 1653738 1741213
50846 1741213 1835363 1936707 2044756 2158201 2275828 2396648 2519244 2641543 2761279 2876155
50836 2876155 2983396 3079634 3161650 3227297 3275842 3307813 3324709 3328553 3321384 3305165 3282231
50825 3282231 3255527 3228078 3202242 3179746 3162282 3151646 3148973 3153904 3164515 3177693 3189409 3195137
50813 3195137 3190878 3174240 3144409 3101105 3043953 2973005 2889319 2794547 2690184 2577817 2460056
$$ packed form
50897H13039j0437q860o653m799m051m011l632k530j373q59p52l12O28J432J574
50882G68404J367J575K523L825M996N974O935P838Q497Q968R479R974J0267J0698
50868H61320J2059J4404J6499J7203J7088J7851K0255K3464K6445K9142L1982
50857A087712L5119L8693M3100M8341N3657N8472O3280O8879P5139Q1346Q7475
50846A741213R4150J01344J08049J13445J17627J20820J22596J22299J19736J14876
50836B876155J07241R6238Q2016O5647M8545L1971J6896L844p169j6219k2934
50825C282231k6704k7449k5836k2496j7464j0636k673M931J0611J3178J1716N728
50813C195137m259j6638k9831m3304n7152p0948q3686r4772j04363j12367j17761
$$ plain form
50802 2460056 2340660 2223381 2110838 2004578 1905891 1816182 1736512 1666935 1606508 1554117
50792 1554117 1509332 1472389 1443350 1421529 1405850 1395482 1389818 1388058 1389204 1392344 1396625 1400983
50780 1400983 1404265 1405671 1404914 1402061 1397465 1391601 1384539 1375742 1364838 1352401 1339391 1325880 1310928
50767 1310928 1293709 1274130 1252424 1228954 1204567 1180287 1156296 1131993 1107410 1083785 1062331
50756 1062331 1043275 1026709 1013446 1003997 997380 992080 987878 985756 986310 989438 995450 1005188 1018740
50743 1018740 1035126 1053762 1075430 1101286 1131566 1165849 1204035 1246433 1293139 1343847 1398146
50732 1398146 1455600 1515600 1577447 1640594 1704690 1769422 1834367 1898925 1962369 2023985 2082992
50721 2082992 2138213 2188156 2231828 2269123 2299717 2321786 2332728 2331377 2318811 2296869 2266910
$$ packed form
50802B460056j19396j17279j12543j06260r8687q9709p9670o9577o0427n2391
50792A554117m4785l6943k9039k1821j5679j0368n664j760J146L140M281M358
50780A400983L282J406p57k853m596n864p062q797j0904j2437j3010j3511j4952
50767A310928j7219j9579k1706k3470k4387k4280k3991k4303k4583k3625k1454
50756A062331j9056j6566j3263r449o617n300m202k122N54L128O012R738J3552
50743A018740J6386J8636K1668K5856L0280L4283L8186M2398M6706N0708N4299
50732A398146N7454O0000O1847O3147O4096O4732O4945O4558O3444O1616N9007
50721B082992N5221M9943M3672L7295L0594K2069J0942j351j2566k1942k9959
$$ plain form
50710 2266910 2230655 2191385 2153184 2119144 2090927 2069620 2055997 2049826 2049856 2054780 2063728 2075562
50698 2075562 2088253 2099333 2106546 2107669 2100188 2081975 2052567 2013450 1966918 1914846 1858656 1800163
50686 1800163 1741909 1686462 1635532 1589892 1549927 1515913 1487764 1464966 1447111 1434481 1427940
50675 1427940 1428292 1435805 1450161 1470633 1496322 1526467 1560601 1598251 1638401 1679357 1719266 1756755
50663 1756755 1791058 1821747 1848551 1871479 1890969 1907780 1922748 1936607 1949905 1962864 1975248
50652 1975248 1986469 1995997 2003837 2010721 2017871 2026505 2037398 2050817 2066885 2086026 2109100 2137140
50640 2137140 2170918 2210577 2255414 2303974 2354464 2405197 2454771 2502091 2546447 2587498 2625005
50629 2625005 2658768 2689206 2717804 2746258 2774749 2801300 2822953 2836931 2840189 2828679 2798586
$$ packed form
50710B266910l6255l9270l8201l4040k8217k1307j3623o171L0M924Q948J1834
50698B075562J2691J1080P213J123p481j8213k9408l9117m6532n2072n6190n8493
50686A800163n8254n5447n0930m5640l9965l4014k8149k2798j7855j2630o541
50675A427940L52P513J4356K0472K5689L0145L4134L7650M0150M0956L9909L7489
50663A756755L4303L0689K6804K2928J9490J6811J4968J3859J3298J2959J2384
50652A975248J1221R528P840O884P150Q634J0893J3419J6068J9141K3074K8040
50640B137140L3778L9659M4837M8560N0490N0733M9574M7320M4356M1051L7507
50629B625005L3763L0438K8598K8454K8491K6551K1653J3978L258j1510l0093
$$ plain form
50618 2798586 2749272 2684976 2613488 2543079 2480065 2428033 2388224 2360368 2343432 2335984 2336295 2342518
50606 2342518 2352864 2365400 2377575 2386191 2388096 2380907 2363113 2333817 2292800 2240920 2180225 2113415
50594 2113415 2043000 1970845 1898279 1826424 1756409 1689423 1626658 1569023 1516712 1469147 1425551
50583 1425551 1385499 1348765 1314869 1283293 1254143 1228126 1205762 1187025 1171858 1160449 1152715
50572 1152715 1148083 1146211 1147522 1152496 1160745 1171287 1183433 1196891 1211258 1226077 1241382 1257728
50560 1257728 1275755 1296055 1319204 1345468 1374646 1406654 1441916 1480548 1521455 1563026 1604603
50549 1604603 1646419 1688109 1728184 1765231 1798993 1830130 1859615 1888602 1918259 1949470 1983083
50538 1983083 2020382 2062561 2109757 2161493 2218191 2281197 2350989 2426471 2506755 2592685 2685848
$$ packed form
50618B798586m9314o4296p1488p0409o3014n2032l9809k7856j6936p448L11O223
50606B342518J0346J2536J2175Q616J905p189j7794k9296m1017n1880o0695o6810
50594B113415p0415p2155p2566p1855p0015o6986o2765n7635n2311m7565m3596
50583A425551m0052l6734l3896l1576k9150k6017k2364j8737j5167j1409p734
50572A152715m632j872J311M974Q249J0542J2146J3458J4367J4819J5305J6346
50560A257728J8027K0300K3149K6264K9178L2008L5262L8632M0907M1571M1577
50549A604603M1816M1690M0075L7047L3762L1137K9485K8987K9657L1211L3613
50538A983083L7299M2179M7196N1736N6698O3006O9792P5482Q0284Q5930R3163
$$ plain form
50527 2685848 2786897 2895729 3012488 3137133 3268260 3403338 3540032 3676470 3810372
50518 3810372 3938824 4058925 4167994 4263188 4341679 4401285 4440333 4456931 4449192 4416514 4360185
50507 4360185 4282571 4186246 4074179 3950292 3819244 3685716 3554010 3428199 3312335 3210325
50497 3210325 3125445 3059922 3014923 2990838 2987336 3003204 3036458 3084580 3144118 3209906 3275214
50486 3275214 3333112 3377390 3402188 3401879 3372536 3313522 3227168 3117291 2988738 2847743 2701173
50475 2701173 2554611 2411484 2273989 2144127 2023572 1913202 1813300 1723930 1644883 1575518
50465 1575518 1514910 1462053 1415956 1375896 1341613 1312874 1288777 1267870 1249078 1232215 1217500
50454 1217500 1204920 1194200 1185082 1177555 1172097 1169676 1171047 1175846 1182693 1190411 1198946 1209018 1221191
$$ packed form
50527B685848J01049J08832J16759J24645J31127J35078J36694J36438J33902
50518C810372J28452J20101J09069R5194P8491N9606L9048J6598p739l2678n6329
50507D360185p7614r6325j12067j23887j31048j33528j31706j25811j15864j02010
50497C210325q4880o5523m4999k4085l502J5868L3254M8122N9538O5788O5308
50486C275214N7898M4278K4798l09k9343n9014q6354j09877j28553j40995j46570
50475B701173j46562j43127j37495j29862j20555j10370r9902q9370p9047o9365
50465A575518o0608n2857m6097m0060l4283k8739k4097k0907j8792j6863j4715
50454A217500j2580j0720r118p527n458k421J371M799O847P718Q535J0072J2173
$$ plain form
50441 1221191 1235408 1251133 1267704 1284618 1301513 1317810 1332597 1345241 1356024 1365739 1374715 1382774
50429 1382774 1390212 1398211 1407906 1419418 1432005 1444887 1457717 1470620 1484074 1498616 1514551 1532155
50417 1532155 1552160 1575636 1603408 1636013 1674220 1718924 1770220 1827193 1888975 1955438 2026313
50406 2026313 2100116 2174657 2248379 2320679 2391021 2458290 2520882 2576944 2624573 2662248 2689021
50395 2689021 2703965 2705603 2692421 2663915 2620684 2563655 2493955 2413775 2326791 2237182 2148430
50384 2148430 2063156 1983714 1912453 1851409 1801978 1764751 1739481 1725342 1721498 1727414 1742373 1764709
50372 1764709 1791688 1820199 1847350 1870419 1886572 1893097 1888035 1870504 1840454 1798509 1746243 1686421
50360 1686421 1622407 1557005 1491853 1427925 1366362 1308583 1255642 1207644 1163936 1123809 1087058
$$ packed form
50441A221191J4217J5725J6571J6914J6895J6297J4787J2644J0783R715Q976Q059
50429A382774P438P999R695J1512J2587J2882J2830J2903J3454J4542J5935J7604
50417A532155K0005K3476K7772L2605L8207M4704N1296N6973O1782O6463P0875
50406B026313P3803P4541P3722P2300P0342O7269O2592N6062M7629L7675K6773
50395B689021J4944J638j3182k8506m3231n7029o9700q0180q6984q9609q8752
50384B148430q5274p9442p1261o1044m9431l7227k5270j4139l844N916J4959K2336
50372A764709K6979K8511K7151K3069J6153O525n062j7531l0050m1945n2266n9822
50360A686421o4014o5402o5152o3928o1563n7779n2941m7998m3708m0127l6751
$$ plain form
50349 1087058 1053969 1024936 1000214 980014 964668 954499 949521 949323 953215 960249 969048 977750 984368
50336 984368 987304 985567 978686 966728 950661 932584 915183 900521 889206 880720 874403 869935 867071
50323 867071 865533 865415 867299 871576 877825 885178 893053 901148 908910 915585 920884 925168 928896 932219
50309 932219 935214 938118 941163 944435 948090 952408 957437 962759 967806 972287 976216 979772 983222 986807
50295 986807 990508 994069 997365 1000560 1003815 1006939 1009440 1010804 1010860 1010142 1009847 1010838 1012422 1012506 1009365 1003178
50279 1003178 995665 988631 983221 980182 980039 982772 987713 994014 1001128 1008817 1016906 1025112 1033051 1040347
50265 1040347 1046799 1052379 1056993 1060404 1062637 1064423 1066919 1070822 1075899 1081549 1087740 1095218 1104774 1116543
50251 1116543 1130176 1145516 1162804 1182168 1203256 1225489 1248333 1271081 1292769 1312846 1331793
$$ packed form
50349A087058l3089k9033k4722k0200j5346j0169m978j98L892P034Q799Q702O618
50336I84368K936j737o881j1958j6067j8077j7401j4662j1315q486o317m468k864
50323H67071j538j18J884M277O249P353P875Q095P762O675N299M284L728L323
50309I32219K995K904L045L272L655M318N029N322N047M481L929L556L450L585
50295I86807L701L561L296L195L255L124K501J364N6p18k95R91J584Q4l141o187
50279A003178p513p034n410l039j43K733M941O301P114P689Q089Q206P939P296
50265A040347O452N580M614L411K233J786K496L903N077N650O191P478R556J1769
50251A116543J3633J5340J7288J9364K1088K2233K2844K2748K1688K0077J8947
$$ plain form
50240 1331793 1350527 1369245 1387310 1404294 1420453 1435970 1450228 1462069 1470275 1473434 1469894 1458493
50228 1458493 1439374 1413957 1384381 1353109 1322489 1294136 1268824 1247066 1229305 1215130 1202809
50217 1202809 1190175 1175617 1157736 1134781 1105651 1071504 1035392 1000103 966948 936631 910101
50206 910101 887784 868686 851192 834673 819822 807489 797603 789209 781235 773162 765198 757859 751390
50193 751390 745640 740456 735908 731925 727978 723489 718520 713791 709935 706916 704309 702016 700473 700077
50179 700077 700555 701130 701288 701192 701312 701936 703135 704893 706969 708933 710665 712611 715156 717926 720242 722178
50163 722178 724631 728303 733106 738600 744433 750210 755539 760587 766130 772673 779934 787521 795641 804588
50149 804588 813966 823073 831823 840523 848834 855803 861257 866519 873294 882177 892719 904806 919553
$$ packed form
50240A331793J8734J8718J8065J6984J6159J5517J4258J1841Q206L159l540j1401
50228A458493j9119k5417k9576l1272l0620k8353k5312k1758j7761j4175j2321
50217A202809j2634j4558j7881k2955k9130l4147l6112l5289l3155l0317k6530
50206I10101k2317j9098j7494j6519j4851j2333r886q394p974q073p964p339o469
50193G51390n750n184m548l983l947m489m969m729l856l019k607k293j543l96
50179G00077M78N75J58r6J20O24J199J758K076J964J732J946K545K770K316J936
50163G22178K453L672M803N494N833N777N329N048N543O543P261P587Q120Q947
50149H04588R378R107Q750Q700Q311O969N454N262O775Q883J0542J2087J4747
$$ plain form
50136 919553 938831 964107 995775 1033381 1076330 1124330 1177110 1233709 1292151 1349945 1404987
50125 1404987 1456169 1503411 1547407 1589343 1630443 1671289 1711230 1748448 1780718 1806120 1823046
50114 1823046 1829809 1824679 1806568 1775653 1733389 1682156 1624914 1564701 1503912 1443918 1385470 1329441
50102 1329441 1276998 1229155 1186361 1148496 1115056 1085354 1058667 1034194 1010936 987939 964998
50091 964998 942973 923063 905761 890816 878059 867700 859710 853462 848297 844124 841188 839521 838968
50078 838968 839450 840816 842593 844343 846211 848716 852054 855952 860179 864732 869409 873653 877126 880198
50064 880198 883491 887032 890091 891878 892241 891660 890682 889455 887810 885686 883268 880712 877970 875057 872225
50049 872225 869577 866676 863044 859045 855780 854005 853580 854177 856086 859929 865890 873616 882660 892701
$$ packed form
50136I19553J9278K5276L1668L7606M2949M8000N2780N6599N8442N7794N5042
50125A404987N1182M7242M3996M1936M1100M0846L9941L7218L2270K5402J6926
50114A823046O763n130j8111l0915m2264n1233n7242o0213o0789n9994n8448n6029
50102A329441n2443m7843m2794l7865l3440k9702k6687k4473k3258k2997k2941
50091I64998k2025j9910j7302j4945j2757j0359p990o248n165m173k936j667n53
50078H38968M82J366J777J750J868K505L338L898M227M553M677M244L473L072
50064H80198L293L541L059J787L63n81r78j227j645k124k418k556k742k913k832
50049H72225k648k901l632l999l265j775m25N97J909L843N961P726R044J0041
$$ plain form
50035 892701 903503 915052 927644 941511 956440 971957 987754 1003597 1019012 1033463 1046730
50024 1046730 1058752 1069269 1078118 1085842 1093443 1101449 1109703 1118141 1127213 1137355 1148611 1161179 1175875
50011 1175875 1193572 1214364 1237554 1262172 1287144 1311232 1333345 1352978 1370223 1385575 1400094
50000 1400094 1415414 1432851 1452211 1471643 1488558 1500360 1504437 1498298 1480458 1451263 1412646 1367142
49988 1367142 1317192 1265032 1212622 1161366 1111996 1064885 1020410 978990 941003 906896 877216
49977 877216 852115 830787 811844 794571 779495 767380 757940 750054 743017 736917 731803 727239 722983
49964 722983 719484 717252 716177 715864 716254 717386 718921 720615 723182 728052 736096 746901 759295 772199
49950 772199 784926 797092 808429 818530 826693 832207 834814 834845 832978 829978 826412 822233 816736 809187
$$ packed form
50035H92701J0802J1549J2592J3867J4929J5517J5797J5843J5415J4451J3267
50024A046730J2022J0517Q849P724P601Q006Q254Q438R072J0142J1256J2568J4696
50011A175875J7697K0792K3190K4618K4972K4088K2113J9633J7245J5352J4519
50000A400094J5320J7437J9360J9432J6915J1802M077o139j7840k9195l8617m5504
49988A367142m9950n2160n2410n1256m9370m7111m4475m1420l7987l4107k9680
49977H77216k5101k1328j8943j7273j5076j2115r440p886p037o100n114m564m256
49964G22983l499k232j075l13L90J132J535J694K567M870Q044J0805J2394J2904
49950G72199J2727J2166J1337J0101Q163N514K607L1j867l000l566m179n497p549
$$ plain form
49936 809187 799443 787697 773975 758428 741921 725630 709980 694628 679663 666110 654918 646019
49924 646019 638790 632973 628648 625709 623911 623222 623640 624915 626868 629805 634027 639101 644141 648796 653457
49909 653457 658549 664200 670671 678509 687945 698556 709838 721803 734729 748563 762853 777029
49897 777029 790391 802019 811082 817251 820562 820977 818411 813114 805628 796178 784411 770038 753734
49884 753734 737208 722270 709696 698900 688714 678525 668600 659347 650531 641550 632357 623720 616433
49871 616433 610670 606255 603193 601519 600879 600702 600826 601659 603713 607268 612479 619450 628061 638006 649193
49856 649193 661913 676380 692180 708293 723620 737403 749216 758712 765514 769429 770806 770552 769529
$$ packed form
49936H09187r744j1746j3722j5547j6507j6291j5650j5352j4965j3553j1192q899
49924F46019p229n817m325k939j798o89M18J275J953K937M222N074N040M655M661
49909F53457N092N651O471P838R436J0611J1282J1965J2926J3834J4290J4176
49897G77029J3362J1628R063O169L311M15k566n297p486r450j1767j4373j6304
49884G53734j6526j4938j2574j0796j0186j0189r925r253q816q981r193q637p287
49871F16433n763m415l062j674o40j77J24Q33K054L555N211O971Q611R945J1187
49856F49193J2720J4467J5800J6113J5327J3783J1813R496O802L915J377k54j023
$$ [...]
##END NTUPLES=NMR SPECTRUM
##END=
