
##TITLE=UV1274_M13_1250-1169_50_7414553_5RR6XNuXHQ
##JCAMPDX= 6.0         $$ Bruker NMR JCAMP-DX V2.0
##DATA TYPE= NMR SPECTRUM
##DATA CLASS= NTUPLES
##ORIGIN= BRUKER
##OWNER= Administrator
$$ 1.72 TOPSPIN		Version 2.1
$$ 2013-01-25 23:06:22.866 -0500  Administrator@X
$$ Compression mode = diff/dup
##.OBSERVE FREQUENCY= 400.02188249412
##.OBSERVE NUCLEUS= ^1H
##.ACQUISITION MODE= SIMULTANEOUS (DQD)
##.ACQUISITION SCHEME= undefined
##.AVERAGES= 8
##.DIGITISER RES= 22
##SPECTROMETER/DATA SYSTEM= spect
##.PULSE SEQUENCE= zg30
##.SOLVENT NAME= COFFEE_meoh
##.SHIFT REFERENCE= INTERNAL, COFFEE_meoh, 1, 14.98509
##AUDIT TRAIL= $$ (NUMBER, WHEN, WHO, WHERE, PROCESS, VERSION, WHAT)
$$ ##TITLE= Audit trail, TOPSPIN		Version 2.1
$$ ##JCAMPDX= 5.01
$$ ##ORIGIN= Bruker BioSpin GmbH
$$ ##OWNER= Administrator
$$ $$ E:\/data/COFFEE/nmr/UV1274_M13_1250-1169_50_7414553_5RR6XNuXHQ/10/pdata/1/auditp.txt
$$ ##AUDIT TRAIL=  $$ (NUMBER, WHEN, WHO, WHERE, PROCESS, VERSION, WHAT)
(   1,<2013-01-25 23:06:14.944 -0500>,<Administrator>,<X>,<go>,<TOPSPIN 2.1>,
      <created by zg
	started at 2013-01-25 23:05:08.522 -0500,
	POWCHK enabled, PULCHK disabled,
       configuration hash MD5:
       86 BA 57 50 F2 9D 5C 9B 26 00 A9 28 5F 66 2E 89
       data hash MD5: 64K
       4C BA 26 47 75 A7 C4 3D 3C 9D 44 F7 E1 53 08 EA>)
(   2,<2013-01-25 23:06:17.913 -0500>,<Administrator>,<X>,<proc1d>,<TOPSPIN 2.1>,
      <Start of raw data processing
       efp LB = 0 FT_mod = 6 PKNL = 1 PHC0 = 0 PHC1 = 0 SI = 32K 
       data hash MD5: 32K
       3C 2F D3 29 47 D9 79 8C 68 F1 93 9B 7A 8F EA E8>)
(   3,<2013-01-25 23:06:18.366 -0500>,<Administrator>,<X>,<proc1d>,<TOPSPIN 2.1>,
      <pk PHC0 = 96.37207 PHC1 = 0 
       data hash MD5: 32K
       04 72 77 3C 26 C0 A6 32 D8 56 AC 37 D5 8C 55 F6>)
(   4,<2013-01-25 23:06:18.585 -0500>,<Administrator>,<X>,<proc1d>,<TOPSPIN 2.1>,
      <abs ABSG = 1 
       data hash MD5: 32K
       62 D2 DD AD E5 B3 E9 E4 55 A4 D0 6F EC F1 42 B4>)
(   5,<2013-01-25 23:06:18.741 -0500>,<Administrator>,<X>,<proc1d>,<TOPSPIN 2.1>,
      <abs ABSG = 2 
       data hash MD5: 32K
       0B 98 1F 1D 9A 95 26 34 BD C7 29 8A AE 30 EE BF>)
(   6,<2013-01-25 23:06:18.882 -0500>,<Administrator>,<X>,<proc1d>,<TOPSPIN 2.1>,
      <abs ABSG = 3 
       data hash MD5: 32K
       8B C8 80 9C 70 7A 01 5E DC C9 0A 0E E4 79 05 8E>)
(   7,<2013-01-25 23:06:19.022 -0500>,<Administrator>,<X>,<proc1d>,<TOPSPIN 2.1>,
      <abs ABSG = 4 
       data hash MD5: 32K
       DA DC BB 1E E6 B7 AA 2C 07 81 8A E1 32 F1 AC 82>)
(   8,<2013-01-25 23:06:19.179 -0500>,<Administrator>,<X>,<proc1d>,<TOPSPIN 2.1>,
      <abs ABSG = 5 
       data hash MD5: 32K
       CE DA 82 DE 59 5A 39 1C 67 EA 16 BD 60 41 45 90>)
$$ ##END=
$$ 
$$ $$ hash MD5
$$ $$ BB 72 FA 18 AF 68 09 DE 7C 97 34 0A F9 FB D0 00
##$RELAX= 
##$RELAX= 
##$RELAX= 
##$RELAX= 
##$RELAX= 
##$RELAX= 
##$RELAX= 
$$ Bruker specific parameters
$$ --------------------------
##$DU= <E:\>
##$EXPNO= 10
$$ [...]
150 150 150 150 150 150 150 150
##$TP07= 0
##$TPNAME0= <>
##$TPNAME1= <>
##$TPNAME2= <>
##$TPNAME3= <>
##$TPNAME4= <>
##$TPNAME5= <>
##$TPNAME6= <>
##$TPNAME7= <>
##$TPOAL= (0..7)
0.5 0.5 0.5 0.5 0.5 0.5 0.5 0.5
##$TPOFFS= (0..7)
0 0 0 0 0 0 0 0
##$TUNHIN= 0
##$TUNHOUT= 0
##$TUNXOUT= 0
##$USERA1= <user>
##$USERA2= <user>
##$USERA3= <user>
##$USERA4= <user>
##$USERA5= <user>
##$V9= 5
##$VALIST= <valist>
##$VCLIST= <CCCCCCCCCCCCCCC>
##$VD= 0
##$VDLIST= <DDDDDDDDDDDDDDD>
##$VPLIST= <PPPPPPPPPPPPPPP>
##$VTLIST= <TTTTTTTTTTTTTTT>
##$WBST= 2048
##$WBSW= 25
##$XGAIN= (0..3)
0 0 0 0
##$XL= 0
##$YL= 0
##$YMAX_a= 620073
##$YMIN_a= -527214
##$ZGOPTNS= <>
##$ZL1= 120
##$ZL2= 120
##$ZL3= 120
##$ZL4= 120
##$ABSF1= 14.98509
##$ABSF2= -5.573092
##$ABSG= 5
##$ABSL= 3
##$ALPHA= 0
##$AQORDER= 0
##$ASSFAC= 0
##$ASSFACI= 0
##$ASSFACX= 0
##$ASSWID= 0
##$AUNMP= <proc_prof1d_extract_pilot.lims>
##$AXLEFT= 0
##$AXNAME= <>
##$AXNUC= <1H>
##$AXRIGHT= 0
##$AXTYPE= 0
##$AXUNIT= <>
##$AZFE= 0.1
##$AZFW= 0.1
##$BCFW= 0
##$BC_mod= 0
##$BYTORDP= 0
##$COROFFS= 0
##$CY= 15
##$DATMOD= 1
##$DC= 0
##$DFILT= <>
##$DTYPP= 0
##$F1P= 0
##$F2P= 0
##$FCOR= 0.5
##$FTSIZE= 32768
##$FT_mod= 6
##$GAMMA= 0
##$GB= 0
##$INTBC= 1
##$INTSCL= 1
##$ISEN= 128
##$LB= 0
##$LEV0= 0
##$LPBIN= 0
##$MAXI= 10000
##$MC2= 0
##$MEAN= 0
##$ME_mod= 0
##$MI= 0
##$NCOEF= 0
##$NC_proc= -8
##$NLEV= 6
##$NOISF1= 0
##$NOISF2= 0
##$NSP= 0
##$NTH_PI= 0
##$NZP= 0
##$OFFSET= 14.98509
##$PC= 1
##$PHC0= 96.37207
##$PHC1= 0
##$PH_mod= 1
##$PKNL= yes
##$PPARMOD= 0
##$PPDIAG= 0
##$PPIPTYP= 0
##$PPMPNUM= 2147483647
##$PPRESOL= 1
##$PSCAL= 4
##$PSIGN= 0
##$PYNMP= <proc.py>
##$REVERSE= no
##$SF= 400.02
##$SI= 32768
##$SIGF1= 0
##$SIGF2= 0
##$SINO= 400
##$SIOLD= 32768
##$SPECTYP= <>
##$SREGLST= <1H.CDCl3>
##$SSB= 0
##$STSI= 32768
##$STSR= 0
##$SW_p= 8223.68421052631
##$SYMM= 0
##$S_DEV= 0
##$TDeff= 65536
##$TDoff= 0
##$TI= <>
##$TILT= no
##$TM1= 0
##$TM2= 0
##$TOPLEV= 0
##$USERP1= <user>
##$USERP2= <user>
##$USERP3= <user>
##$USERP4= <user>
##$USERP5= <user>
##$WDW= 1
##$XDIM= 32768
##$YMAX_p= 437462055
##$YMIN_p= -781510
##$CURPLOT= <Network HP LaserJet P1505>
##$CURPRIN= <$Network HP LaserJet P1505>
##$DFORMAT= <normdp>
##$LAYOUT= <+/1D_H.xwp>
##$LFORMAT= <normlp>
##$PFORMAT= <normpl>
##$SURQMSG= 1
$$ End of Bruker specific parameters
$$ ---------------------------------
##NTUPLES= NMR SPECTRUM
##VAR_NAME=  FREQUENCY,     SPECTRUM/REAL,   SPECTRUM/IMAG
##SYMBOL=    X,             R,               I
##VAR_TYPE=  INDEPENDENT,   DEPENDENT,       DEPENDENT
##VAR_FORM=  AFFN,          ASDF,            ASDF
##VAR_DIM=   32768,         32768,           32768
##UNITS=     HZ,            ARBITRARY UNITS, ARBITRARY UNITS
##FACTOR=    0.250966925370066, 1,           1
##FIRST=     8223.43324360094, -4617,        101136
##LAST=      0,             39073,           -52468
##MIN=       0,             -781510,         0
##MAX=       8223.43324360094, 437462055,    0
$$ Real data points
##PAGE= N=1
##DATA TABLE= (X++(R..R)), XYDATA
$$ [...]
19555C46477j44399D5922c84959J82830j08251N0157H2634a21383j1329j32583
$$ 346477 202078 45922 -384959 -202129 -310380 -260223 82634 -121383 -132712 -265295
19545b65295B39536h3818k7522A04913a56165n0678d5640B20J10207b0248j49983
$$ -265295 239536 -83818 -111340 104913 -156165 -206843 -45640 220 110427 -20248 -170231
19534a70231l8370f4663c2110m10896D2144b20455P6085C43774c71821A91275
$$ -170231 -208601 -64663 -32110 -443006 42144 -220455 -144370 343774 -371821 191275
19523a33140M485o8180m5643a02030c1809l2965D10056a83109c0357m54474B62724
$$ -133140 -128655 -196835 -242478 -102030 -31809 -64774 410056 -183109 -30357 -484831 262724
19511C1747a43037A42921b88469B22454C3220f1649A57675J36627A2286a67084
$$ 31747 -143037 142921 -288469 222454 33220 -61649 157675 294302 12286 -167084
19500a37199K2525R99j54356E6697d3026k2681A11062a28167d2057A30334a57807
$$ -137199 -114674 -113675 -268031 56697 -43026 -65707 111062 -128167 -42057 130334 -157807
19488c5759l8211B31042a9049j51126E3129K30k4875i1110c7233e592j42758m8463
$$ -35759 -73970 231042 -19049 -170175 53129 53359 28484 -91110 -37233 -5592 -148350 -196813
19476a96813B34773A10746a41034k48635A25395B634g2575I4469a30363A13413
$$ -196813 234773 110746 -141034 -389669 125395 2634 -72575 94469 -130363 113413
19465A72659a30553N5912a5426F6337b8979G8413O1175c05806A68344C7155A7272
$$ 172659 -130553 -74641 -15426 66337 -28979 78413 139588 -305806 168344 37155 17272
19453d10665b6405k25149g9922j1937A59402o5848c34621a52545H2739k9328b00734
$$ -410665 -26405 -251554 -79922 -91859 159402 93554 -334621 -152545 82739 53411 -200734
19441b82774E4520K1352J41007A1790R5228j8981d31945J53426f0707a0249k19928
$$ -282774 54520 75872 216879 11790 107018 88037 -431945 -278519 -60707 -10249 -230177
19430b30177j24842D4847a3735A08162C3247a29024A32301b12514A51179b10617
$$ -230177 -355019 44847 -13735 108162 33247 -129024 132301 -212514 151179 -210617
19419a34204A5786e2974k39164a29875j36080C3560I778a95905C4273b17229g6569
$$ -134204 15786 -52974 -292138 -129875 -265955 33560 9778 -195905 34273 -217229 -76569
19407e040A40538g6381j05148I453a13954A58413B2594J1406f3394n7867b2215
$$ -5040 140538 -76381 -181529 9453 -113954 158413 22594 34000 -63394 -121261 -22215
19395e7928p2206j4937A31649c31410a41078b2677j83433M5735K0403c9156C15405
$$ -57928 -130134 -145071 131649 -331410 -141078 -22677 -206110 -160375 -139972 -39156 315405
19383B62596A14583D3003d8672A39206i0463j33108m2765e6029J6541p762j32676
$$ 262596 114583 43003 -48672 139206 -90463 -223571 -266336 -56029 -39488 -47250 -179926
19372a79926O3638r9073N6876D755g2636l05874A50927F3075d8416p8039C1931
$$ -179926 -116288 -215361 -158485 4755 -72636 -378510 150927 63075 -48416 -126455 31931
19360a67582A67462c51840L0342K59E6342a76128B69627D906i4766B51078J14063
$$ -167582 167462 -351840 -321498 -321239 56342 -176128 269627 4906 -94766 251078 365141
19349C65141j43008c04013d8255r0641A02526J26822b23935A06892b88621j876
$$ 365141 222133 -304013 -48255 -138896 102526 229348 -223935 106892 -288621 -290497
19339b90497Q6971m4003G8318C5579J11788b80195M6779A769h8321j99771F5621
$$ -290497 -203526 -247529 78318 35579 147367 -280195 -233416 1769 -88321 -288092 65621
19327b94057a27710j49650A42509b12490A28631b56676A37811a20745K556A11976
$$ -294057 -127710 -277360 142509 -212490 128631 -256676 137811 -120745 -118189 111976
19316b03997A77166A7179a8284A94555a45611l5048N5453A04142h7985j66390
$$ -203997 177166 17179 -18284 194555 -145611 -180659 -125206 104142 -87985 -254375
19306b54375A83863a80244A20061a77732L5842D191M2382N5296a7954I2924d5580
$$ -254375 183863 -180244 120061 -177732 -141890 4191 46573 101869 -17954 92924 -45580
19294H4286c23218B17776A01515B4386a59480j9458O986M4791O533d2955n7702
$$ 84286 -323218 217776 101515 24386 -159480 -178938 -171952 -127161 -120628 -42955 -100657
19283a00657j68244A99666q4814a35126F0973i8324l7961k49017n2592A99341
$$ -100657 -268901 199666 114852 -135126 60973 -98324 -136285 -385302 -437894 199341
19272A21138j6437b07765C046K09714D7635K1281A3531a0406j41877P2940l40445
$$ 121138 104701 -207765 3046 212760 47635 68916 13531 -10406 -152283 -79343 -419788
19261d19788F3991F000N1142c07516B90168a11907A28147b08389B89338b5347
$$ -419788 63991 6000 57142 -307516 290168 -111907 128147 -208389 289338 -25347
19250a07790p0110e4334A17058e9082B05860d4474D6036J69766c08655C04154
$$ -107790 -177900 -54334 117058 -59082 205860 -44474 46036 215802 -308655 304154
19239G9290E682J99347J38779b07470Q96d6019A46833l7795h9910K6843A68202
$$ 79290 5682 205029 343808 -207470 -206574 -46019 146833 109038 -89910 -63067 168202
19227b6356j51893j57137C90605a63710k29250A79133H1915a30275j86199h6192
$$ -26356 -178249 -335386 390605 -163710 -392960 179133 81915 -130275 -316474 -86192
19216D7009e3173D7306b61796c3783A02883A9738C752J40693b9808k31506a11198
$$ 47009 -53173 47306 -261796 -33783 102883 19738 3752 144445 -29808 -261314 -111198
19204B10234G5354a07889r5367l4062A31674a07612B9602L4476a10795L9323A01135
$$ 210234 75354 -107889 -203256 -237318 131674 -107612 29602 64078 -110795 -71472 101135
19192G733J46889j5130a43686C705a52797k7857E0901i884A75009b13607j05247
$$ 7733 154622 139492 -143686 3705 -152797 -180654 50901 -9884 175009 -213607 -318854
19181c18854a06002r2354c4634G531a7916j0088B0420a85429O6733e97p7280n2327
$$ -318854 -106002 -198356 -34634 7531 -17916 -28004 20420 -185429 -118696 -597 -77877 -130204
19169a30204A1629L6675a00962n9244A03851a19903k55303o449a56199F1851J46222
$$ -130204 11629 48304 -100962 -160206 103851 -119903 -375206 -381655 -156199 61851 208073
19158B08073Q3374E1657a87009O2602e0166A33468b58288B30269c43849a06672
$$ 208073 291447 51657 -187009 -124407 -50166 133468 -258288 230269 -343849 -106672
19147e7478k8698k70567C7722K66718a21622D3916a79141j57677A34582f9859
$$ -57478 -86176 -356743 37722 304440 -121622 43916 -179141 -336818 134582 -69859
19136a63664A00480P165Q238J44307g5450k1905A53886h0160A0670J40383a3383
$$ -163664 100480 107645 115883 260190 -75450 -97355 153886 -80160 10670 151053 -13383
19124D6821b94661a21061b9075P516k15836m1435b2504F8544q341R9681b17976
$$ 46821 -294661 -121061 -29075 -21559 -237395 -278830 -22504 68544 60203 159884 -217976
19112A99710f9538G6064c361j00154l9816l468i363m0846F4954b71282e7766k08526
$$ 199710 -69538 76064 -3361 -103515 -143331 -146799 -9363 -50209 64954 -271282 -57766 -266292
19100b66292A22033b64276I8983j4677I35L668a87906Q8992A45068b10864D936
$$ -266292 122033 -264276 98983 84306 935 4603 -187906 -98914 145068 -210864 4936
19088b43147A34889b13111A76741M132a60273A16258g6916F7833a75138D74809
$$ -243147 134889 -213111 176741 180873 -160273 116258 -76916 67833 -175138 474809
19077d13646h7280B5944r981J75916b80055f4497k9062a6556j53384b0213k11735
$$ -413646 -87280 25944 15963 191879 -280055 -64497 -93559 -16556 -169940 -20213 -231948
19066b31948A65652a94864P6573A32915b15062C7673j8444b88413g7171k78875
$$ -231948 165652 -194864 -118291 132915 -215062 37673 19229 -288413 -77171 -356046
19056c56046c3217l84134a26115n5083o2033h1173k93863J78472j79397I3714
$$ -356046 -33217 -417351 -126115 -181198 -243231 -81173 -375036 -196564 -375961 93714
19045a97425F024L52318c01066a950k79821A42104m9953c6002l50298f8659D6993
$$ -197425 6024 358342 -301066 -1950 -281771 142104 92151 -36002 -386300 -68659 46993
19033B05464a59955D9287a76387E605P711J73314M1733K27296a3205C01355g5875
$$ 205464 -159955 49287 -176387 5605 13316 186630 228363 455659 -13205 301355 -75875
19021A59379A7785K1149A4584L1840b56605A50889b11274G0073k113j0364h3451
$$ 159379 17785 38934 14584 46424 -256605 150889 -211274 70073 67960 57596 -83451
19009E83334A90091i6602a3290H6337J01342e12467a25765e8739A64909a52133
$$ 583334 190091 -96602 -13290 86337 187679 -512467 -125765 -58739 164909 -152133
18998a62590A36104m1370c5275A32158F140O9616K3098c22308E4962b43363L6243
$$ -162590 136104 94734 -35275 132158 6140 75756 98854 -322308 54962 -243363 -207120
18987b07120K5082c1940r1019k62463D8387a34316k32571A44815e0723A14752
$$ -207120 -182038 -31940 -122959 -385422 48387 -134316 -366887 144815 -50723 114752
18976a20353l2187M6744j7564A55860c2448q705H3136J73699I5878b4034E0479
$$ -120353 -152540 -105796 -123360 155860 -32448 -41153 83136 256835 95878 -24034 50479
18964C5760a80294e76j50807F1242K0656a74564d9370C94524a0618m1122j81488
$$ 35760 -180294 -576 -151383 61242 81898 -174564 -49370 394524 -10618 -51740 -233228
18953b33228A80751a45987j39228B768J30119p388A6070c7859A10219k4204a39967
$$ -233228 180751 -145987 -285215 2768 132887 125499 16070 -37859 110219 86015 -139967
18941a20251L2902A73742a08734b4341m9356A6159e0526A32962B6089R3721d0356
$$ -120251 -87349 173742 -108734 -24341 -73697 16159 -50526 132962 26089 119810 -40356
18929b33583k5124f5002o9187L4855k15422a31430F3480a83248j3802G085O0620
$$ -233583 -258707 -65002 -134189 -99334 -314756 -131430 63480 -183248 -197050 7085 67705
18918F7705O1958D0938J97674A08341b26251i8137l4591p9909n0248J02768A33489
$$ 67705 129663 40938 238612 108341 -226251 -98137 -132728 -212637 -262885 -160117 133489
18906A71588d3517e667D6824I03K11088p3478g2258k8378c2653r5502f0688A44567
$$ 171588 -43517 -5667 46824 903 211991 138513 -72258 -100636 -32653 -128155 -60688 144567
18893E3353b2793N797B04731a06012j64779J2428J09724A60460C5451b4404j09883
$$ 53353 -22793 -16996 204731 -106012 -270791 -258363 -148639 160460 35451 -24404 -134287
18882a34287j818l9430I4158c44728D9561b70316L8675a2858q6992m637l16484
$$ -134287 -136105 -175535 94158 -344728 49561 -270316 -231641 -12858 -99850 -104487 -420971
18871d20971a04815e522m40449g2449k01838k4446g7039j21581H0926c7792j97381
$$ -420971 -104815 -5522 -445971 -72449 -274287 -298733 -77039 -198620 80926 -37792 -235173
18860b35173D48189a12079D7239J38982a21311E6748a02740i790l6869m30616
$$ -235173 448189 -112079 47239 186221 -121311 56748 -102740 -9790 -46659 -477275
18850d77275h6677l266G0063e9913j49994C72774b7551j86647B02087e3869j17644
$$ -477275 -86677 -89943 70063 -59913 -209907 372774 -27551 -214198 202087 -53869 -171513
18839a71513A93415b98273d123A39757o1264a92164P1883j2430Q042A73581h284
$$ -171513 193415 -298273 -4123 139757 78493 -192164 -120281 -132711 -124669 173581 -8284
18827D5845L3674c29845J41829b3834l5000E5758k2099b2070j18946I2931a53274
$$ 45845 79519 -329845 -188016 -23834 -58834 55758 33659 -22070 -141016 92931 -153274
18815a03787d8087I516J52002B95L32662g0684A43803o4364K01812j19856f2007
$$ -103787 -48087 9516 161518 295 332957 -70684 143803 79439 281251 161395 -62007
18803H9962B2400c42369C5903a94353N31A28182K4813J21065d6468k50909E823
$$ 89962 22400 -342369 35903 -194353 -193822 128182 152995 274060 -46468 -297377 5823
18791b76857H9294Q7110B3100d7362j3399b7425g403j06172k30195f8288n8457
$$ -276857 89294 176404 23100 -47362 -60761 -27425 -7403 -113575 -343770 -68288 -126745
18780a26745k08842J43830A19393a61677p9132d870A64646b33244j4640J03964
$$ -126745 -335587 -191757 119393 -161677 -240809 -4870 164646 -233244 -247884 -143920
18770a43920N2957k41276a41991B09392h7725c7785k70863a16800k7863A28148
$$ -143920 -90963 -332239 -141991 209392 -87725 -37785 -308648 -116800 -144663 128148
18759e0110k59417E1211a90794j35884C08016a20155M999F4597b62077J15190
$$ -50110 -309527 51211 -190794 -326678 308016 -120155 -115156 64597 -262077 -146887
18749a46887R028d9750A6837J64630b10614J3722B58995b23574n1925d7880A8583
$$ -146887 -137859 -49750 16837 181467 -210614 -196892 258995 -223574 -275499 -47880 18583
18737a2409B99205a2580B8236f2587j75071H2867A3004b60088d0561j50406k40241
$$ -12409 299205 -12580 28236 -62587 -237658 82867 13004 -260088 -40561 -190967 -431208
18726d31208a43349L8876j07039q1470a27422A15826a51680B78436h3548K7945
$$ -431208 -143349 -104473 -211512 -292982 -127422 115826 -151680 278436 -83548 -55603
18716e5603A6155K26378j03185b08340G8134a08516B5154i0876B83841b18816
$$ -55603 16155 242533 139348 -208340 78134 -108516 25154 -90876 283841 -218816
18705a48678q5282a02268M2734A7870d04709F3671e8931E2554a1492j65866P0481
$$ -148678 -233960 -102268 -59534 17870 -404709 63671 -58931 52554 -11492 -177358 -106877
18694a06877o9714I9660k7357a37883A50490g6155b6215l7126B16465a86349A59191
$$ -106877 -176591 99660 72303 -137883 150490 -76155 -26215 -63341 216465 -186349 159191
18682C05323a67611L6159K5635A06755B5439b30809A04692h6630c9770j41023
$$ 305323 -167611 -131452 -105817 106755 25439 -230809 104692 -86630 -39770 -180793
18672a80793f752j72119L6576J003k50914a22523o7704l1456A52610a08291d1563
$$ -180793 -6752 -178871 -142295 -141292 -392206 -122523 -190227 -221683 152610 -108291 -41563
18660c73412a16123A90292D090b65069a13835A12952a03521j41520f9549j08173
$$ -373412 -116123 190292 4090 -265069 -113835 112952 -103521 -245041 -69549 -177722
18650a77722a940k19595h6263C9709F40c74212C6510c24331E1226J24441b27261
$$ -177722 -1940 -221535 -86263 39709 640 -374212 36510 -324331 51226 175667 -227261
18638b297k61644B66709o8512a34186A30030D1827Q4332a84970N8873J9483L9743
$$ -2297 -263941 266709 198197 -134186 130030 41827 126159 -184970 -126097 -106614 -66871
18627f6871k573l1326b1431j14346B49299G6552a54667A92680a27303l249A03961
$$ -66871 -69444 -100770 -21431 -135777 249299 76552 -154667 192680 -127303 -130552 103961
18615a3183H09Q56J15415a37561B52808o3209a75352g494k17086j16677J35373
$$ -13183 809 1665 117080 -137561 252808 189599 -175352 -7494 -224580 -341257 -205884
18604b05884B34064A0738L3352J46703a97210c3788H1150c63413J07494R1489
$$ -205884 234064 10738 44090 190793 -197210 -33788 81150 -363413 -255919 -164430
18594a64430k53779A294O4950a68767l06931C31752A40183a9992A77224E3483
$$ -164430 -418209 1294 66244 -168767 -475698 331752 140183 -19992 177224 53483
18583a33449j83496k5924A18773g1453B03074c3975m7632L0250I7597d51228h3002
$$ -133449 -316945 -342869 118773 -71453 203074 -33975 -81607 -51357 97597 -451228 -83002
18571A45801b41962R4049a3298E8071b42048B27763e2795r1096C43292R595i2304
$$ 145801 -241962 -147913 -13298 58071 -242048 227763 -52795 -143891 343292 352887 -92304
18559E7442M96804h8932c4615B58830B6658J6246J29924L16150E5382b21509j73175
$$ 57442 554246 -88932 -34615 258830 26658 42904 172828 488978 55382 -221509 -394684
18548c94684d8950o9456C2579b28758i2214k41207k5283d5842j94494b8124k45013
$$ -394684 -48950 -118406 32579 -228758 -92214 -333421 -358704 -45842 -240336 -28124 -273137
18537b73137J22934q7496J08161H9814B5793c77464A18484a67304D8768b29203
$$ -273137 -150203 -237699 -129538 89814 25793 -377464 118484 -167304 48768 -229203
18526c57990f4152j34128d7766N918A67625a1931A05701a0776l12148h7683B2906
$$ -357990 -64152 -198280 -47766 -41848 167625 -11931 105701 -10776 -322924 -87683 22906
18514c83031c1510F3607a76149K7822d220D0760b08836H116h8490H9348g3431
$$ -383031 -31510 63607 -176149 -148327 -4220 40760 -208836 8116 -88490 89348 -73431
18502a39707d3828B52310a47151c873j17326R469d3807A59936J78030A5881M9356
$$ -139707 -43828 252310 -147151 -3873 -121199 -111730 -43807 159936 337966 15881 65237
18491F5237b1896C9251K9624d2405k7044k0442k36040f1937a1271j53198G4119
$$ 65237 -21896 39251 68875 -42405 -69449 -89891 -325931 -61937 -11271 -164469 74119
18479b51320E423O430K0174a2652b747k72531g6616o8371I5603l196h0350j38368
$$ -251320 5423 11853 32027 -12652 -2747 -275278 -76616 -144987 95603 92407 -80350 -218718
18467b18718C1286b1522l3870A99216b83807q39Q4504F2621b01114a4804A18045
$$ -218718 31286 -21522 -55392 199216 -283807 -284646 -200142 62621 -201114 -14804 118045
18455E0059L8537M3016E8050O0081N2024e3575l33562J00393L5225j82728a24167
$$ 50059 88596 131612 58050 118131 170155 -53575 -387137 -286744 -251519 -434247 -124167
18443a72011A6095J75372e8664a1462j19565j03337a4373G532Q4281b25742M6881
$$ -172011 16095 191467 -58664 -11462 -131027 -234364 -14373 7532 91813 -225742 -178861
18432a78861A05611j0806h8702j14744L0109A02848n782a97754B4206J09809f9614
$$ -178861 105611 94805 -88702 -203446 -173337 102848 97066 -197754 24206 134015 -69614
18420b8792k28528G423a59557B07998e4075A87656d59025a45399B14873e2734
$$ -28792 -257320 7423 -159557 207998 -54075 187656 -459025 -145399 214873 -52734
18409b86640b7225A07892L84850a69514c9687B83752I6004a98736N2214c3578
$$ -286640 -27225 107892 492742 -169514 -39687 283752 96004 -198736 -146522 -33578
18398g3011B53396F7315K9124B1982a08094j03864B1298p573M1514a16945e6779
$$ -73011 253396 67315 96439 21982 -108094 -211958 21298 13725 55239 -116945 -56779
18386c5061B3487f4041k75455i876r6295A39895c8994C14948q1522d0178k86686
$$ -35061 23487 -64041 -339496 -9876 -106171 139895 -38994 314948 233426 -40178 -326864
18375c26864F8923N1190J0813a34302A696d7083j49771b4718C07792k5510p813
$$ -326864 68923 120113 130926 -134302 1696 -47083 -196854 -24718 307792 282282 274469
18364B74469r4563b74822B10892c11988Q5504h1556r5715m8218M0905F1154h3119
$$ 274469 179906 -274822 210892 -311988 -226484 -81556 -177271 -225489 -184584 61154 -83119
18352a26611l18459a03443D80209a69629r2879I3495G051i6098B56454b05282
$$ -126611 -445070 -103443 480209 -169629 -262508 93495 7051 -96098 256454 -205282
18341C26419a23785A13917b3036k30180J13015B8324J40283L40239b2265C8977
$$ 326419 -123785 113917 -23036 -253216 -140201 28324 168607 508846 -22265 38977
18330a0138l36618A91681J23299n6643P4766b48577j78777H5759a36584G8103
$$ -10138 -346756 191681 314980 258337 333103 -248577 -427354 85759 -136584 78103
18319C0980a84747L0279A03826a34767G4773b41887j91195a61008J5678A09684
$$ 30980 -184747 -154468 103826 -134767 74773 -241887 -433082 -161008 -145330 109684
18308a52258c0380D0379a45561i763M046B9970L00339b2678l05829A59496g497
$$ -152258 -30380 40379 -145561 -9763 -5717 29970 330309 -22678 -328507 159496 -7497
18296B27110b66537B83855h5887p0478B83644a07808d2225j20216G302c704n1223
$$ 227110 -266537 283855 -85887 -156365 283644 -107808 -42225 -162441 7302 -3704 -54927
18285e4927B2285J54679J57913a13169j05800c5805n14A40304b79768j76810e597
$$ -54927 22285 176964 334877 -113169 -218969 -35805 -36319 140304 -279768 -456578 -5597
18273E5345a9695A31030a48854B142J4265K47328b32518B26071f2999C7152b21
$$ 55345 -19695 131030 -148854 2142 16407 263735 -232518 226071 -62999 37152 -221
18261g6713l2567E9641a82771A05988q389a62914P6116n7717m4475A38175o3688
$$ -76713 -109280 59641 -182771 105988 97599 -162914 -86798 -144515 -188990 138175 74487
18250G4487a9247D72386A76436b53027D4781a73120q0138n3589h1989k2232j92100
$$ 74487 -19247 472386 176436 -253027 44781 -173120 -253258 -306847 -81989 -104221 -296321
18239b96321A09480C1330J56019a31715L8231n7113C9890a08646M3932E5443c61873
$$ -296321 109480 31330 187349 -131715 -93484 -150597 39890 -108646 -64714 55443 -361873
18227c77024J62460h7097A39363e7857j97793Q7686k5077f1245q2578A33889d6414
$$ -377024 -214564 -87097 139363 -57857 -255650 -167964 -193041 -61245 -143823 133889 -46414
18215A46248E9120L4516i5849B05004A9826P8034a71978F7811b30290D884J70824
$$ 146248 59120 93636 -95849 205004 19826 97860 -171978 67811 -230290 4884 175708
18204A75708q404l540D9871J08019a22429m1007B9822a27981D8591g3854l9027
$$ 175708 167304 163764 49871 157890 -122429 -163436 29822 -127981 48591 -73854 -112881
18193a12881G3380Q0543q94b40292A91702F9302M4009J22643n0777A3523L7602
$$ -112881 73380 153923 153029 -240292 191702 69302 113311 235954 185177 13523 51125
18182E1125a21869j06419i3759B237a03830A01476N4272b0114A01452i1591n6991
$$ 51125 -121869 -228288 -93759 2237 -103830 101476 155748 -20114 101452 -91591 -148582
18171a48582a1648A86767a72449A28272h7994j97572a40733j05418g0734A35832
$$ -148582 -11648 186767 -172449 128272 -87994 -285566 -140733 -246151 -70734 135832
18160c72173a58944D2993c89377E373K66173g7664L0781j23076f1685j54226m6881
$$ -372173 -158944 42993 -389377 5373 271546 -77664 -46883 -169959 -61685 -215911 -262792
18149b62792b0384B86572a79641m2717m1087f2846B6097h7756c8232A40781a43185
$$ -262792 -20384 286572 -179641 -222358 -263445 -62846 26097 -87756 -38232 140781 -143185
18137A53019G3916h6082l4312A86089a21745A48609a10420q1912A13732c48456
$$ 153019 73916 -86082 -120394 186089 -121745 148609 -110420 -192332 113732 -348456
18126a59952D82436A96861k7905j0574p3736c709k74588C83503a26411L1289j58361
$$ -159952 482436 196861 168956 158382 84646 -3709 -278297 383503 -126411 -95122 -253483
18115b53483d8495B56409b67634D09486I0209a97749c8137D1817a05670E5520
$$ -253483 -48495 256409 -267634 409486 90209 -197749 -38137 41817 -105670 55520
18104a15381q873N41e6142B12902b74144C7228a25311C35758a14252d7772A77914
$$ -115381 -124254 -123713 -56142 212902 -274144 37228 -125311 335758 -114252 -47772 177914
18092A08796C7841c8104B77960a80273l9518A29978F0080e5528a8121j51823o5337
$$ 108796 37841 -38104 277960 -180273 -219791 129978 60080 -55528 -18121 -169944 -235281
18081b35281A41977a73896N4637B5319a31743H8561l8377b24167b212A34670b68524
$$ -235281 141977 -173896 -119259 25319 -131743 88561 50184 -224167 -2212 134670 -268524
18069b16979b7919E3269a35979k14457A56600a43671A96564c605k67261O05J25031
$$ -216979 -27919 53269 -135979 -350436 156600 -143671 196564 -3605 -270866 -270261 -145230
18058a45230C9231c23180H5939a97634A60776G7993j3206M9356k1383e8222j12105
$$ -145230 39231 -323180 85939 -197634 160776 77993 64787 114143 92760 -58222 -170327
18047a70327c8790A02697J42616o564d15158F0928c51572a11405A77243G9809
$$ -170327 -38790 102697 245313 238749 -415158 60928 -351572 -111405 177243 79809
18036C19846B615i6208b4824H884J87191a41085A41388b65966A58207a25843o7144
$$ 319846 2615 -96208 -24824 8884 196075 -141085 141388 -265966 158207 -125843 -192987
18025a92987E4805o46e1236I0050j4098P698a08093A239h1746B29713j05078a5983
$$ -192987 54805 54159 -51236 90050 75952 83650 -108093 1239 -81746 229713 124635 -15983
18012i8027A55563a59381L3661k8446b3584j67901E1609a42722A4385R7729a54146
$$ -98027 155563 -159381 -125720 -154166 -23584 -191485 51609 -142722 14385 112114 -154146
18000b84291Q2091B29013a85627e3362j8710p8622j84343E01049b80428C597c01196
$$ -284291 -202200 229013 -185627 -53362 -72072 -150694 -335037 501049 -280428 3597 -301196
17988a01024D932O0227a73532c1602j36207H1921b1936n5544M625m0915D8032
$$ -101024 4932 65159 -173532 -31602 -167809 81921 -21936 -77480 -72855 -113770 48032
17976A93179b41342O9463E8300J51188E8213l768a80589e8729l15184a07208a7508
$$ 193179 -241342 -171879 58300 209488 58213 54445 -180589 -58729 -373913 -107208 -17508
17964I3773b8663J1163o4078C9239J50626A8845J38195F7515a8588B1638M9041
$$ 93773 -28663 -17500 -81578 39239 189865 18845 157040 67515 -18588 21638 70679
17953G0679b06741J0337e287G2604M5371b12420b5646p5163C9924h4481a9088
$$ 70679 -206741 -196404 -5287 72604 117975 -212420 -25646 -100809 39924 -84481 -19088
17941a67470B73719O1863d7832H3204b10916C35538a11137j18765B06865c09245
$$ -167470 273719 335582 -47832 83204 -210916 335538 -111137 -229902 206865 -309245
17930f1475B1702K80961a47321B37928B1926Q4494b99227b6971l49747A12025
$$ -61475 21702 302663 -147321 237928 21926 106420 -299227 -26971 -376718 112025
17919d2508q9127B027a06053j76828A36335c5293B25060a326k15166q1266L1985
$$ -42508 -131635 2027 -106053 -282881 136335 -35293 225060 -1326 -216492 -297758 -265773
17908b65773a05500A15626l2760K2740b52429B69114j4456A25239a68393P6691
$$ -265773 -105500 115626 82866 105606 -252429 269114 254658 125239 -168393 -91702
17898i1702A16789a3765A33893a66752B80118D1168J39567F9255K14632a66541
$$ -91702 116789 -13765 133893 -166752 280118 41168 180735 69255 283887 -166541
17887a44883A74144E8077a19885j30699i2649I017c35072J65647a5561O928b406
$$ -144883 174144 58077 -119885 -250584 -92649 9017 -335072 -169425 -15561 -8633 -2406
17875h4929B48414b64524g5771k48901I3994c3382m4637B79176h8599A17653E3533
$$ -84929 248414 -264524 -75771 -324672 93994 -33382 -78019 279176 -88599 117653 53533
17863E8482D540b5040l19684B94565G9904a72842l1321O6576d0527h320A52010
$$ 58482 4540 -25040 -344724 294565 79904 -172842 -204163 -137587 -40527 -8320 152010
17851a83527C12394a13861b1066G3615J33531B3871J7114b18174J868A58201h2771
$$ -183527 312394 -113861 -21066 73615 207146 23871 40985 -218174 -216306 158201 -82771
17839a47194l44976Q5816A63542J29241j21048c07475A46777c39154B6466c9902
$$ -147194 -492170 -406354 163542 292783 171735 -307475 146777 -339154 26466 -39902
17828h6644B82363b43582B19605I5414C6892J20391B8658j1775d6010k08911J07415
$$ -86644 282363 -243582 219605 95414 36892 157283 28658 16883 -46010 -254921 -147506
17817a47506H1580c02800a24488j14703G6494K1462d4679b127A18567j8839g0237
$$ -147506 81580 -302800 -124488 -239191 76494 97956 -44679 -2127 118567 99728 -70237
17805d1698D28348a27965D5600F215P41g1607k42580h5203B2629N19060e7039
$$ -41698 428348 -127965 45600 6215 6956 -71607 -314187 -85203 22629 541689 -57039
17793A36083n6320J13420a63583m3379k02496e6336D6023K0400K0038c4887j1715
$$ 136083 79763 193183 -163583 -206962 -409458 -56336 46023 66423 86461 -34887 -46602
17782d6602a2911l50939A28405J61936H8142b08283k15949J12913J00048B13419
$$ -46602 -12911 -363850 128405 290341 88142 -208283 -424232 -311319 -211271 213419
17771D5820g5939p2079a9601r5044A83403K02291A67241q2192c8521C06480I5986
$$ 45820 -75939 -148018 -19601 -114645 183403 385694 167241 85049 -38521 306480 95986
17759a14727E2847b81115B06441a36803a8493n7625D7436P9771c00245C31160
$$ -114727 52847 -281115 206441 -136803 -18493 -76118 47436 127207 -300245 331160
17748B5015J2289J06069h4422r0953b1908A50310m0185O7184J60328j26206E4513
$$ 25015 37304 143373 -84422 -175375 -21908 150310 110125 177309 337637 211431 54513
17736A68059a41692A93871J10558d53A19472h8495C2547b42902G0315b53100a09373
$$ 168059 -141692 193871 304429 -453 119472 -88495 32547 -242902 70315 -253100 -109373
17724h070j44269A71737K00401j31493b74295f117B17514c4186q7474A63887b83353
$$ -8070 -152339 171737 372138 240645 -274295 -6117 217514 -34186 -121660 163887 -283353
17712a67308n7885f4764G822K4648c33659A64946B9939L61856F8009f8824o113
$$ -167308 -225193 -64764 7822 32470 -333659 164946 29939 391795 68009 -68824 -74937
17701g4937E6949B1429J06787J6898J34619G7878K43245a70638a6054A22305J43639
$$ -74937 56949 21429 128216 145114 279733 77878 321123 -170638 -16054 122305 265944
17690B65944a6895q5670G9051K05591b33719A44821d3592G7009c2970A19528a40247
$$ 265944 -16895 -102565 79051 284642 -233719 144821 -43592 77009 -32970 119528 -140247
17678E4690J07559d1991j02726D11030a91B47988j6904f2254l0001L8805a5392
$$ 54690 162249 -41991 -144717 411030 -191 247988 231084 -62254 -92255 -53450 -15392
17666a82287B88273a47886e1738C4540d7853A45062n3280c4262A32119m959i1355
$$ -182287 288273 -147886 -51738 34540 -47853 145062 91782 -34262 132119 127160 -91355
17654E0793h4157D8954J70912g6261C16230j13075j00411K5784E3108a08986d9987
$$ 50793 -84157 48954 219866 -76261 316230 203155 102744 128528 53108 -108986 -49987
17642a65541A18295h8413P573G3346J17786f7860E8508B4209b10377B15064l4221
$$ -165541 118295 -88413 -80840 73346 191132 -67860 58508 24209 -210377 215064 180843
17631A80843m7164K4360p7897b0091A946J26668f8429j6872m72151B08045e8434
$$ 180843 133679 158039 80142 -20091 1946 128614 -68429 -85301 -557452 208045 -58434
17619I102c2184a5844D8319L9505P4263K43637b7164G7506c13875A51084b0281
$$ 9102 -32184 -15844 48319 87824 162087 405724 -27164 77506 -313875 151084 -20281
17607b61587J12802A06574c1842m4484A40150j4691i0209B3985g4559C31543r8120
$$ -261587 -148785 106574 -31842 -76326 140150 125459 -90209 23985 -74559 331543 233423
17596B33423k9528a84202R0121A59699A1446i3189D07629A15025c46697A95165
$$ 233423 203895 -184202 -94081 159699 11446 -93189 407629 115025 -346697 195165
17585b02473h0105A79719a94507H0554f5672o1904A39491Q7941a51540b1494A90369
$$ -202473 -80105 179719 -194507 80554 -65672 -127576 139491 227432 -151540 -21494 190369
17573f5384p175A95692p4814B1126a18149D5440R2145d6326C83464e8975D5431
$$ -65384 -72559 195692 120878 21126 -118149 45440 137585 -46326 383464 -58975 45431
17561b54779e612j30925L4807j6559g899B03515Q7064i6712a2835B66116d38707
$$ -254779 -5612 -136537 -101730 -118289 -7899 203515 290579 -96712 -12835 266116 -438707
17549b82864D01077A65394D9307L21992d7631r0363D16123A88798b76580F9043
$$ -282864 401077 165394 49307 371299 -47631 -137994 416123 188798 -276580 69043
17538A60675o1536B8647i715H0861J20865E191e2047A24379B8108a08125D7901
$$ 160675 99139 28647 -9715 80861 201726 5191 -52047 124379 28108 -108125 47901
17526h6189B51074k4987a04846p1560f7459A11027b7438j92989A33365J27571
$$ -86189 251074 226087 -104846 -176406 -67459 111027 -27438 -220427 133365 260936
17516B60936i9648b3435j13378A19029b21597D83501h5270B28721a18304B77099
$$ 260936 -99648 -23435 -136813 119029 -221597 483501 -85270 228721 -118304 277099
17505d4749a083G6503l6522N3375C0741c95453A15779f7440B40130g6386B62803
$$ -44749 -1083 76503 39981 93356 30741 -395453 115779 -67440 240130 -76386 262803
17493D12856j56192J28048j55343G5705J00516f590A34023F3203A6165L9640K7301
$$ 412856 256664 384712 229369 75705 176221 -6590 134023 63203 16165 55805 83106
17482H3106J00648L6443Q595c60316A4781L14270b99874A80179L43922A12512
$$ 83106 183754 220197 228792 -360316 14781 329051 -299874 180179 524101 112512
17471G265b48113c7942A94547L83533C9024K55379D0319c13316a12611a2281C77313
$$ 7265 -248113 -37942 194547 578080 39024 294403 40319 -313316 -112611 -12281 377313
17459B55268h6062H1010b40879d0054D62239a78111C35287j5041r8110P7207A07818
$$ 255268 -86062 81010 -240879 -40054 462239 -178111 335287 320246 222136 299343 107818
17447E9504N20785A09706J06476I9421K22019A43906h2915A49122K6685J86079
$$ 59504 580289 109706 216182 99421 321440 143906 -82915 149122 175807 361886
17437C61886G456K32765R257l8599H6497K60095E894M10631g5356B82755E3388
$$ 361886 7456 240221 249478 210879 86497 346592 5894 416525 -75356 282755 53388
17425D17598n9417j4416n5986a5506D13990j24149O1611i4009j24632c4396j9472
$$ 417598 358181 343765 287779 -15506 413990 289841 351452 -94009 -218641 -34396 -53868
17414e3868C34009H8288e2232J411r49A40209Q1253f8793B51062E9367c9901p6458
$$ -53868 334009 88288 -52232 -50821 -51770 140209 221462 -68793 251062 59367 -39901 -116359
17402a16359B78253g4341B94087H0160J34104n2772J74944j13629L19284j43094
$$ -116359 278253 -74341 294087 80160 214264 161492 336436 222807 542091 398997
17392C98997i5312A00526M0798J35503g466A30645a31625B95200A27757L3734
$$ 398997 -95312 100526 141324 276827 -7466 130645 -131625 295200 127757 161491
17382A61491D1070J20199E7858k6924J28813a2046B2279a87139F5663K56835f0209
$$ 161491 41070 161269 57858 30934 159747 -12046 22279 -187139 65663 322498 -60209
17370f0482C05210A43351K28951o5837R8873A30751f9383o1749D13324j5067I9273
$$ -60482 305210 143351 372302 306465 405338 130751 -69383 -131132 413324 398257 99273
17358B9945K12642P6750r2875q3276m7626J55120D0183j0039L88283a63091c4443
$$ 29945 242587 319337 226462 143186 95560 250680 40183 30144 418427 -163091 -34443
17346D49820A00883J64032j15786F4132J22271K82288A13400Q1657M5862C485
$$ 449820 100883 264915 149129 64132 186403 468691 113400 195057 240919 3485
17335e1520B53336J199A20807K12845A49132b8570o3454E1574J44818m0547l7955
$$ -51520 253336 254535 120807 333652 149132 -28570 -92024 51574 196392 155845 117890
17324A17890a1904A68625B6001b24138J09144b1734b140j58353A65139j633a76031
$$ 117890 -11904 168625 26001 -224138 -114994 -21734 -2140 -160493 165139 163506 -176031
17312A95696a95628g4008C18202k5092b019A83467a86480B45960L15534A30400
$$ 195696 -195628 -74008 318202 293110 -2019 183467 -186480 245960 561494 130400
17301G4765O3142G684L28088H1927L81431B19430n7184l6115f5279A15256b25392
$$ 74765 137907 7684 335772 81927 463358 219430 162246 126131 -65279 115256 -225392
17289b3440D4150J59845J49453j25359L55323a4707A68001k114k3264a83139B5114
$$ -23440 44150 203995 353448 228089 583412 -14707 168001 165887 142623 -183139 25114
17277A12139K91676a884H1958J22993q780J20004A44642N4803O8484E2321K45488
$$ 112139 403815 -1884 81958 204951 196171 316175 144642 199445 267929 52321 297809
17266B97809J45119E5261K52589j15851n3239K23587j10552D74K54959J54992
$$ 297809 442928 55261 307850 191999 138760 362347 251795 474 255433 410425
17256D10425j88869J28594p3742B8039E916J59788J09469m4337l5658j6803J93371
$$ 410425 221556 350150 276408 28039 5916 165704 275173 230836 195178 178375 371746
17245C71746A44742K03344A31681R7014g3895H057J55964n0475R1825N1557g1308
$$ 371746 144742 348086 131681 228695 -73895 8057 164021 113546 205371 256928 -71308
17233A68924G2490O0511O9898a86138A47356B3047K53503j5862a2990B37603o9703
$$ 168924 72490 133001 202899 -186138 147356 23047 276550 260688 -12990 237603 167900
17222A67900e3567A11015K22459A10930l6299L70051A91305M0666j8084j7285
$$ 167900 -53567 111015 333474 110930 74631 444682 191305 231971 213887 196602
17212A96602r4105R4125J42351A11582L19755B01590Q4288j42072o7717P2326
$$ 196602 102497 196622 338973 111582 431337 201590 285878 143806 76089 148415
17202A48415f8136l9755A28241J55348j18765J54863A35746J16167B9802g3089
$$ 148415 -68136 -107891 128241 283589 164824 319687 135746 251913 29802 -73089
17191a50238A95136J66340a15663C69009J69519B11602O3926n3825N207a2009
$$ -150238 195136 361476 -115663 369009 538528 211602 275528 221703 226910 -12009
17180B82258Q3665A55637m2250O9173m9143m7122N9835L80515k6621A87259L46531
$$ 282258 365923 155637 113387 182560 133417 86295 146130 526645 500024 187259 533790
17169E33790g6661I0119A9230M22684p8211H9959B5765o284K85737M23781l13885
$$ 533790 -76661 90119 19230 441914 363703 89959 25765 19481 305218 728999 415114
17158D15114j14595R9893B3498M23759A54958J71348R3927a31839D35404A59429
$$ 415114 300519 400412 23498 447257 154958 326306 420233 -131839 435404 159429
17147B43933k5739J66842A17736M55725F6537J26508h9532B87095J41941P6379
$$ 243933 218194 385036 117736 573461 66537 193045 -89532 287095 429036 505415
17137E05415k50808O5607D6020J48496L63726B16348a13328D63997A54700J96886
$$ 505415 254607 320214 46020 194516 558242 216348 -113328 463997 154700 351586
17127C51586O9064o7290L232j34923D6696M01774j60844K04278j56142K71309
$$ 351586 420650 353360 356592 221669 46696 448470 287626 491904 335762 607071
17117F07071k18427A88869k414J99005Q8478k26428O520P9109J17910j0090A49232
$$ 607071 388644 188869 186455 385460 473938 247510 254030 333139 451049 440959 149232
17105E05076I3316K03844J0100J90617p6404k3102k8606K14230B46793J13278
$$ 505076 93316 297160 307260 497877 421473 398371 369765 583995 246793 360071
17095C60071m8899j2576K22566O9584j15314j92373J57421Q3953J16352j32998
$$ 360071 311172 298596 521162 590746 475432 283059 440480 524433 640785 507787
17085E07787k6316j11493p6510R3709N10334B04127O6893A33616P53954D09803
$$ 507787 481471 369978 293468 387177 897511 204127 271020 133616 887570 409803
17074F92257k98788k0198K8037M8967J17194k7693j45089M2745L9110L54305C47206
$$ 692257 393469 373271 401308 450275 567469 539776 394687 437432 476542 830847 347206
17062C75737P2865j89874K55976B01701L69927j34293j854L17934N381l56010
$$ 375737 448602 258728 514704 201701 571628 437335 435481 753415 758796 402786
17052D02786N0159n2392K06297B12971p2496N86052l57094k3282J86419j34795
$$ 402786 452945 400553 606850 212971 140475 726527 369433 346151 532570 397775
17042C97775J65194O1840q7704J29918j45022n7941K37723n3112J33880C66567
$$ 397775 562969 624809 537105 667023 522001 464060 701783 648671 782551 366567
17031F15901j92113K21064j5621L26552k02199l0376k05548K77240j33433m6189
$$ 615901 423788 644852 629231 955783 753584 723208 517660 794900 661467 615278
17021F15278B07873J01278R5500J98089K77057j04061o0151l27477L74008k94430
$$ 615278 207873 309151 404651 602740 879797 775736 715585 388108 762116 467686
17011D67686J73935J05896k33418J13274L48598m32411J89036J38563m28468J6857
$$ 467686 641621 747517 514099 627373 975971 543560 732596 871159 442691 459548
17001D59548N64125l28039j4675K52138p1609k34948L13754k6260j54668j9349
$$ 459548 1023673 695634 680959 933097 861488 626540 940294 914034 759366 740017
16991G40017k4344K36531K34830E51710M83688l81020k5963J81442j85373Q8660
$$ 740017 715673 952204 1187034 551710 1035398 654378 628415 809857 624484 713144
16981G13144k33060N06005m21825K05371K12844Q6491l56797L76989l72999j70780
$$ 713144 480084 986089 564264 769635 982479 1068970 712173 1089162 716163 545383
16971E45383N61400j74414r8118L79351j46145j73955K31999k70376J12931k0820
$$ 545383 1106783 932369 834251 1213602 1067457 893502 1125501 855125 968056 947236
16961I47236K5169j08505L26926l02857L56516n68560N22202m74151P8540L2200
$$ 947236 972405 863900 1190826 887969 1244485 675925 1198127 723976 802516 834716
16951H34716J20892K04486N7939m1265j19998Q7159k44083L72941k89210O2225
$$ 834716 955608 1160094 1218033 1176768 1056770 1143929 899846 1272787 983577 1045802
16941A045802p1065K53719l3667M6376l8489r2200m52085P52943J35211R3957
$$ 1045802 974737 1228456 1194789 1241165 1202676 1110476 658391 1411334 1546545 1640502
16931A640502k56686l93223L56400j3232K25475l72478K88212m15869J61391M24072
$$ 1640502 1383816 990593 1346993 1333761 1559236 1186758 1474970 1059101 1220492 1644564
16921A644564j64098l39226M62952j77616K5893k08762K23605K36665J39056n00313
$$ 1644564 1480466 1141240 1604192 1426576 1452469 1243707 1467312 1703977 1843033 1342720
16911A342720l34322L95337L0003N7760J23022J22222K0832R2388l60796l0179
$$ 1342720 1008398 1403735 1433738 1491498 1614520 1736742 1757574 1849962 1489166 1458987
16901A458987N28702k51564K91134l06701k59777M01914k5068K78546n47561K32365
$$ 1458987 1987689 1736125 2027259 1720558 1460781 1862695 1837627 2116173 1568612 1800977
16891A800977k61223M12678j88049L42664j33149j62739J68306K50725l07981
$$ 1800977 1539754 1952432 1764383 2107047 1973898 1811159 1979465 2230190 1922209
16882A922209J49894J27579O8789j01557K64558J6109j60946L0927o290j52857
$$ 1922209 2072103 2199682 2268471 2166914 2431472 2447581 2286635 2317562 2311272 2158415
16872B158415J09814L72381p06916N11573K30947q6730k08316P2195j56633J10572
$$ 2158415 2268229 2640610 1933694 2445267 2676214 2589484 2381168 2453363 2296730 2407302
16862B407302P37703j50936k74047j43934J24012M32009j38998L7021P5048m74422
$$ 2407302 3145005 2994069 2720022 2576088 2700100 3132109 2993111 3030132 3105180 2630758
16852B630758O73628m2868j58082K90007k65887K13478K12915k05734J90820K32296
$$ 2630758 3304386 3261518 3103436 3393443 3127556 3341034 3553949 3348215 3539035 3771331
16842C771331j45445J28215p6438k26K08470R1215J32331m1359j91446M76042
$$ 3771331 3625886 3754101 3677663 3677437 3885907 3977122 4109453 4068094 3876648 4352690
16832D352690J41680p5491j2151K40204K65535k79665J53287R7265J60489k03395
$$ 4352690 4494370 4418879 4406728 4646932 4912467 4632802 4786089 4883354 5043843 4840448
16822D840448J38170M37846K11560p0529k9366K13973J45540M7419J08472K90636
$$ 4840448 4978618 5416464 5628024 5557495 5528129 5742102 5887642 5935061 6043533 6334169
16812F334169K13576J7554L3833L40193Q685J69617N4867J3752M16514R1030j3515
$$ 6334169 6547745 6565299 6599132 6939325 6948010 7117627 7172494 7186246 7602760 7693790 7680275
16801G680275J18931P04031N3609K09718M18540k95061K43096O20786j0711O27611
$$ 7680275 7799206 8503237 8556846 8766564 9185104 8890043 9133139 9753925 9743214 10370825
16791A0370825k74601N38197K58359K44507J47766R13135j45240K82245O97427
$$ 10370825 10096224 10634421 10892780 11137287 11285053 12198188 12052948 12335193 13032620
16782A3032620L57423K91464K50647N91817M69990J65699M55036N30379Q14729
$$ 13032620 13390043 13681507 13932154 14523971 14993961 15159660 15614696 16145075 16959804
16773A6959804P11911K12810N38856O83552J017820N24244J025397M54010J103317
$$ 16959804 17671715 17884525 18423381 19106933 20124753 20648997 21674394 22128404 23231721
16764B3231721Q27222N69307R48103J541440J101165J072040Q86804J356670J272716
$$ 23231721 24058943 24628250 25576353 27117793 28218958 29290998 30177802 31534472 32807188
16755C2807188J669940J694004J312408J657705K332421J861549J683106K484176
$$ 32807188 34477128 36171132 37483540 39141245 41473666 43335215 45018321 47502497
16747D7502497K483873K600265K601807L116778K854850L609534L431213L693452
$$ 47502497 49986370 52586635 55188442 58305220 61160070 64769604 68200817 71894269
16739G1894269M137843L985872M556607M981339M797408N521271N682950N490154
$$ 71894269 76032112 80017984 84574591 89555930 94353338 99874609 105557559 111047713
16731A11047713O140320O065570O348845N878864O123784O306894N532508N368300
$$ 111047713 117188033 123253603 129602448 135481312 141605096 147911990 153444498 158812798
16723A58812798M887702L740508L314875K272155J528079m3833l98780j796065
$$ 158812798 163700500 167441008 170755883 173028038 174556117 174512284 174113504 172317439
16715A72317439k894873l620016m241728m819010n563604o101073o386001n801896
$$ 172317439 169422566 165802550 161560822 156741812 151178208 145077135 138691134 132889238
16707A32889238o263204o476166o182900o324042n303586n496066n180230n099963
$$ 132889238 126626034 120149868 113966968 107642926 102339340 96843274 91663044 86563081
16699H6563081n007287m364864m165166l888459l760327l241770l578894k740074
$$ 86563081 81555794 77190930 73025764 69137305 65376978 62135208 58556314 55816240
16691E5816240l016957k574974k641485k278963j860478k180755k189234j451062
$$ 55816240 52799283 50224309 47582824 45303861 43443383 41262628 39073394 37622332
16683C7622332j852453j712738j820103r62979j300238j325210j300914r86735
$$ 37622332 35769879 34057141 32237038 31274059 29973821 28648611 27347697 26360962
16675B6360962j099508j312327n37227r07894p69026q75677p08634o38668q36907
$$ 26360962 25261454 23949127 23411900 22504006 21734980 20859303 20150669 19512001 18675094
16666A8675094o59414l77701r27483n44969l25608j30751q48365o64056k09296
$$ 18675094 18015680 17637979 16710496 16165527 15839919 15709168 14860803 14196747 13987451
16657A3987451m39742l68161p31477r2766o34639j99987l02455m64289j10793
$$ 13987451 13547709 13179548 12448071 12355305 11720666 11520679 11218224 10753935 10643142
16648A0643142k71551k94636m06654K901j98856m26822l70884k28896n0800P2614
$$ 10643142 10371591 10076955 9670301 9673202 9474346 9047524 8676640 8447744 8396944 8469558
16638H469558k91774q42428J90581l61191q9000k17892l289j31713k5856o1573
$$ 8469558 8177784 7335356 7525937 7164746 7075746 6857854 6854565 6722852 6696996 6635423
16628F635423l73334m3379o6409m54204K84445n03373M2830J85264j58112n76430
$$ 6635423 6262089 6218710 6152301 5698097 5982542 5479169 5521999 5707263 5549151 4972721
16618D972721J90456k66059K80549k98329m84146P0358K80438j17804k77010k8601
$$ 4972721 5163177 4897118 5177667 4879338 4395192 4465550 4745988 4628184 4351174 4322573
16608D322573K66220l88408j29435l8542J79210l72812J60960j48461J75967l63642
$$ 4322573 4588793 4200385 4070950 4032408 4211618 3838806 3999766 3851305 4027272 3663630
16598C663630n190l98466K25152k09725K73030j83610l97251O48069l58461J13823
$$ 3663630 3658440 3259974 3485126 3275401 3548431 3364821 2967570 3615639 3257178 3371001
16588C371001m90337n5171p1529L44384m14458K36171j36632r9319j42290M656
$$ 3371001 2880664 2825493 2753964 3098348 2683890 2920061 2783429 2684110 2541820 2546476
16578B546476j14381J20385K02934K3959l15820M6921j57633j47207j14665k7898
$$ 2546476 2432095 2552480 2755414 2779373 2463553 2510474 2352841 2205634 2090969 2063071
16568B063071j15448J22609O5583M3845j21489R8339j26033j10414J38969j04699
$$ 2063071 1947623 2070232 2135815 2179660 2058171 2156510 2030477 1920063 2059032 1954333
16558A954333l1415j27147N45914l13122m2283j09954r1062J1855J07569l53215
$$ 1954333 1922918 1795771 2341685 2028563 1986280 1876326 1785264 1797119 1904688 1551473
16548A551473M61232j86188n2723k02244M58933m06429Q9026J58721l75249Q6577
$$ 1551473 2012705 1826517 1773794 1571550 2030483 1624054 1713080 1871801 1496552 1583129
16538A583129q6483m5470Q0313k15622n5431K42069N4175J73067l21818r3503
$$ 1583129 1496646 1451176 1531489 1315867 1260436 1502505 1556680 1729747 1407929 1314426
16528A314426L11784l7462m56630L35825m12608L01201P566L5946p8470k30700
$$ 1314426 1626210 1588748 1132118 1467943 1055335 1356536 1364102 1400048 1321578 1090878
16518A090878K76957l68141L38605j77522J72177j41948k47090O3047m8681M5312
$$ 1090878 1367835 999694 1338299 1160777 1332954 1191006 943916 1006963 958282 1003594
16508A003594J10670K00440j08003j53628J90842o3898K21858M2836m42186P5493
$$ 1003594 1114264 1314704 1206701 1053073 1243915 1180017 1401875 1444711 1002525 1078018
16498A078018K9112M0250j86118R8452O9518m67871K54926J05750l32462J27108
$$ 1078018 1107130 1147380 961262 1059714 1129232 661361 916287 1022037 689575 816683
16488H16683j74768Q2326R4155J15125j21465K41722m40057K16340P8227j19962
$$ 816683 641915 724241 818396 933521 812056 1053778 613721 830061 908288 788326
16478G88326j13915J58824n6725K0436j05781L49626m42381N22926m94452j51440
$$ 788326 674411 833235 776510 796946 691165 1040791 598410 1121336 626884 475444
16468D75444J60155K7211K91200J8283j76545j28029k8628J12827N8079l10551
$$ 475444 635599 662810 954010 972293 795748 667719 639091 751918 809997 499446
16458D99446L94022O0247j70359q0236R203K73889m26623L96952m26481A35901
$$ 499446 893468 953715 783356 703120 712323 986212 559589 956541 530060 135901
16447D45594j2138J69651j80746L15160K08945l39792k29106J49975K21247p0589
$$ 445594 433456 603107 422361 737521 946466 606674 377568 527543 748790 678201
16437F78201k86254J16110j86416K29750q1923K142j15299K36243J15732l04003
$$ 678201 391947 508057 321641 551391 469468 471610 356311 592554 708286 404283
16427D04283K35064O5821k33863L0714M829q3945P9064j08980k7335r2857M69586
$$ 404283 639347 705168 471305 502019 506848 422903 501967 392987 365652 272795 742381
16416G42381B17648K94326J98196j20453k21403Q2010p0346N56514k35759q6004
$$ 742381 217648 511974 710170 589717 368314 450324 379978 936492 700733 614729
16406F14729n1284Q9455A52559L77498j3205j52022J35210j28631L26837B23555
$$ 614729 563445 652900 152559 530057 516852 364830 500040 371409 698246 223555
16395D33396B01761K50904k0477M0324B08941J16514L04979n2126n5706j28006
$$ 433396 201761 452665 432188 472512 208941 325455 630434 578308 522602 394596
16385C94596J40245B57510L02015A00887L74992k33111k4758l9842K20828J09358
$$ 394596 534841 257510 559525 100887 475879 242768 218010 178168 398996 508354
16375E08354A27325J76026K63146j68305j23070A08450K12098L14024l4497k57380
$$ 508354 127325 303351 566497 398192 275122 108450 320548 634572 600075 342695
16365C42695l7888j06587J68803O7850j95383D721M87630q2388L5281m4387A35746
$$ 342695 304807 198220 367023 434873 239490 4721 492351 409963 445244 400857 135746
16353E13219O2506l9685B28400J44634j24273n5866M0560K69245m3784j7764j63272
$$ 513219 575725 536040 228400 373034 248761 192895 233455 502700 458916 441152 277880
16342B77880d9507C87371p311j16460L28949A07249L71453j66865A53456K25994
$$ 277880 -49507 387371 380060 263600 592549 107249 478702 311837 153456 379450
16332C79450b0236C85690M4453j15008J80571B07840c4751C9643L4373K74859
$$ 379450 -20236 385690 430143 315135 495706 207840 -34751 39643 74016 348875
16322C48875o0628D4350L91353j27362J37972B3770J51206n934k1955M05330A71163
$$ 348875 288247 44350 435703 308341 446313 23770 174976 169042 147087 552417 171163
16310B22299M2422M1775a00294A60834Q9890k9016j8951L07583B35986J35216
$$ 222299 264721 306496 -100294 160834 250724 221708 202757 510340 235986 371202
16300C71202j11887M5608G0135M6355B5432K94879m02P4289o5721J92830C2616
$$ 371202 259315 304923 70135 116490 25432 320311 319909 394198 328477 521307 32616
16288D85542B41429r5978o077C9416K28317e3840B11895c4682B54247R532j8014
$$ 485542 241429 145451 139374 39416 267733 -53840 211895 -34682 254247 263779 245765
16277B45765q1764e8541D7848J50395J38924A03587K45531A2516b8319B18468
$$ 245765 164001 -58541 47848 198243 337167 103587 349118 12516 -28319 218468
16266A61204L68135A75678i3732C45456J01383A50071J3937N2485L7843F8617
$$ 161204 529339 175678 -93732 345456 446839 150071 164008 216493 254336 68617
16255d379B02046Q672R256g8417E9807K10204o1817O4676j22391O8808o8506E7531
$$ -4379 202046 210718 219974 -78417 59807 270011 208194 272870 150479 219287 150781 57531
16242B33265q2670J87761A19562n1074b12742o4046A47889a250C85002j34237
$$ 233265 150595 338356 119562 68488 -212742 -276788 147889 -1250 385002 250765
16232B50765c0170A81175G4231R620L58757J74383B27215G6676J88565B1461a31109
$$ 250765 -30170 181175 74231 83851 442608 616991 227215 76676 265241 21461 -131109
16220A52939a1073C83293J4201A9572K43546K1514C4062M15750A96359e4324E21278
$$ 152939 -11073 383293 397494 19572 263118 284632 34062 449812 196359 -54324 521278
16208D08851D150J82042l0086C5629K83929G4658M7901K23752d8756l7524A45465
$$ 408851 4150 186192 156106 35629 319558 74658 122559 346311 -48756 -86280 145465
16196g9569A9953K21814r1818M5820j8237J25103e4582G8263b2051k41489A72898
$$ -79569 19953 241767 149949 195769 177532 302635 -54582 78263 -22051 -263540 172898
16184B89347E4702k4138J31279b9429A61726J51818a02900j31718o2718A38024
$$ 289347 54702 30564 161843 -29429 161726 313544 -102900 -234618 -297336 138024
16173d9875B25492j5623l4609a80609A03663L4604K35726D9635P1915K00987B9938
$$ -49875 225492 209869 175260 -180609 103663 138267 373993 49635 121550 322537 29938
16161E9243L93401D0072J81133C3815J86339A3340M3948J62505a66417O9320j73729
$$ 59243 452644 40072 221205 33815 220154 13340 57288 219793 -166417 -97097 -270826
16150b70826A40824f4753A75884a24111q3189A7494J01280b05685B697b5318n4321
$$ -270826 140824 -64753 175884 -124111 -207300 17494 118774 -205685 2697 -25318 -79639
16139g9639C00610F7562H835e1281r2184d522B74495i6539B97632a19747B25613
$$ -79639 300610 67562 8835 -51281 -143465 -4522 274495 -96539 297632 -119747 225613
16127A38507J78119G7239J5913f7986O271E4945b42186c577m013E700g6342A25541
$$ 138507 316626 77239 93152 -67986 -61715 54945 -242186 -3577 -7590 5700 -76342 125541
16114H0316b25955C04407k4765a7538B74496a82298e073j07026B49498g5428k32048
$$ 80316 -225955 304407 279642 -17538 274496 -182298 -5073 -112099 249498 -75428 -307476
16103c07476A30835J14950h6546K1908B44302d8477C16741a20756M2693j29822
$$ -307476 130835 245785 -86546 -64638 244302 -48477 316741 -120756 -78063 -207885
16093b07885A60740g8206r480f837k37878O5235c1743j115j02133c9071A16253
$$ -207885 160740 -78206 -87686 -6837 -244715 -179480 -31743 -32858 -134991 -39071 116253
16081b47397H3873L52610A4527O9962a19373A91075c5599r0600A75273E2864K43415
$$ -247397 83873 436483 14527 84489 -119373 191075 -35599 -126199 175273 52864 296279
16070B96279b75149C54012b31933E7407J55056b6994C0800J79135b88000A0440
$$ 296279 -275149 354012 -231933 57407 212463 -26994 30800 209935 -288000 10440
16059B37406m1657o283d1871A32375C9420b2615G7757J36805A4088c28430A60354
$$ 237406 195749 189466 -41871 132375 39420 -22615 77757 214562 14088 -328430 160354
16047h8515B2482M9180i7414B7067b8694m2280r6206j25707J0352d2549o0427
$$ -88515 22482 71662 -97414 27067 -28694 -70974 -167180 -292887 -282535 -42549 -102976
16036a02976A38133r796b02179G6177a47967B49727L2034c1135k45571a6738Q007
$$ -102976 138133 128337 -202179 76177 -147967 249727 281761 -31135 -276706 -16738 -8731
16025h731B72071a13526H7282K5228i8532A18792k521L3570a83656c5747j9994
$$ -8731 272071 -113526 87282 112510 -98532 118792 116271 149841 -183656 -35747 -55741
16014e5741B7253J11783a51823d1962j80360C9061R2838a11316q1066B02170a29687
$$ -55741 27253 139036 -151823 -41962 -222322 39061 131899 -111316 -192382 202170 -129687
16002B51197a10908K5534A37035A0468b18926b3243k61443H0840b2972l4324n6319
$$ 251197 -110908 -85374 137035 10468 -218926 -23243 -284686 80840 -22972 -57296 -113615
15991a13615k18801b4979j96538A09050C8793g7156C97010h6416E8805K36604
$$ -113615 -332416 -24979 -221517 109050 38793 -77156 397010 -86416 58805 295409
15981B95409I0166a85115B65736e3790B24653c52037I0276J0274k5323c70458
$$ 295409 90166 -185115 265736 -53790 224653 -352037 90276 100550 75227 -370458
15970B68995B9931b57672j4994i7377B59676m3856d9939k07600h6737I1426l4824
$$ 268995 29931 -257672 -272666 -97377 259676 215820 -49939 -257539 -86737 91426 56602
15959E6602e8650C75169B8091K48143A25433R9455b7318E33J5117O5926b01313
$$ 56602 -58650 375169 28091 276234 125433 224888 -27318 533 15650 81576 -201313
15947f1143A0571P4559F419a33135M5354B6411M4659a61371f4281r5516C04914
$$ -61143 10571 85130 6419 -133135 -87781 26411 71070 -161371 -64281 -159797 304914
15935a74656j11077A85049a40475j00773f0811k6628A14900k7564O4270p3057
$$ -174656 -285733 185049 -140475 -241248 -60811 -87439 114900 87336 151606 78549
15925G8549A3501O2502L4058c6690D2124c875l72324a81895P8902k54707A40479
$$ 78549 13501 76003 110061 -36690 42124 -3875 -376199 -181895 -102993 -357700 140479
15913a16179D3722J01678l8282n2904a59426A36269a61888A66993b32660l007
$$ -116179 43722 145400 107118 54214 -159426 136269 -161888 166993 -232660 -235667
15903b35667p8844A1107a29281r5544K8516d185F8089i153q3525A00606B730a4791
$$ -235667 -314511 11107 -129281 -224825 -196309 -4185 68089 -9153 -92678 100606 2730 -14791
15890B10421i6751j93586B11357p9060a08642A16785J24786m0559G5515N2979
$$ 210421 -96751 -290337 211357 132297 -108642 116785 241571 201012 75515 128494
15880A28494J12262b4471A96993c3470j02871a1826r2134j03345l13953C06613
$$ 128494 240756 -24471 196993 -33470 -136341 -11826 -103960 -207305 -521258 306613
15869F978g1179p0748c1158A40737m3191a60355A2267b48276Ne7532a3870j07322
$$ 6978 -71179 -141927 -31158 140737 97546 -160355 12267 -248276 -248271 -57532 -13870 -121192
15857a21192o124N5386j46240I9809a00077B05774n2550K39005e7074p9028A09309
$$ -121192 -127316 -71930 -218170 99809 -100077 205774 153224 392229 -57074 -136102 109309
15845D4089a24559o0678c5511I6216b27432R5169d0988r3291K1611C9089L07332
$$ 44089 -124559 -185237 -35511 96216 -227432 -132263 -40988 -134279 -112668 39089 346421
15834C46421A05748a95607g4824p006B38122c04241E166b32228B02183c0550j29249
$$ 346421 105748 -195607 -74824 -81830 238122 -304241 5166 -232228 202183 -30550 -159799
15823a59799A05937b633o0583e64F1768J5205c68535c13j05188l7031d8126j26449
$$ -159799 105937 -2633 -63216 -564 61768 76973 -368535 -313 -105501 -142532 -48126 -174575
15811a74575A70054l6718L29965a02534k54282A03963D7376b54759l3364A73285
$$ -174575 170054 133336 463301 -102534 -356816 103963 47376 -254759 -288123 173285
15800A7595d6002k00913A5838a27530e0217j75234B3416P8295c68894d8165A8915
$$ 17595 -46002 -246915 15838 -127530 -50217 -225451 23416 101711 -368894 -48165 18915
15788c0364j76808J01709j99401H7429a9931D0207J1373K6824a26973k524B79701
$$ -30364 -207172 -105463 -304864 87429 -19931 40207 51580 78404 -126973 -129497 279701
15776a00628j53C0644b4813A14855A1336b46536k34816G3882N1035D2510M3222
$$ -100628 -100781 30644 -24813 114855 11336 -246536 -481352 73882 124917 42510 85732
15765H5732a52403A10736a54166A26507E1709c8908F8318P5828J63913i5409d133
$$ 85732 -152403 110736 -154166 126507 51709 -38908 68318 144146 308059 -95409 -4133
15753B05007n3870o0318B7486J68432c9407O318j04171D5342N9811K70541m9117
$$ 205007 151137 90819 27486 195918 -39407 -33089 -137260 45342 105153 375694 326577
15742C26577A48386a257k36389E9689A6539a42731N3244D3445a14717F6894b93133
$$ 326577 148386 -1257 -237646 59689 16539 -142731 -89487 43445 -114717 66894 -293133
15730a96229R1984L5997j90520a6814j48446j08693E466j894K2485a76987H8671
$$ -196229 -104245 -68248 -258768 -16814 -165260 -273953 5466 3572 26057 -176987 88671
15718b84327Q1691b2822E8868a31046e5539I1114a05037c8550B06374i0392n7984
$$ -284327 -202636 -22822 58868 -131046 -55539 91114 -105037 -38550 206374 -90392 -148376
15707a48376M0265F2227g4831m145K7183j349o7611k7560B98870b36910C3781
$$ -148376 -108111 62227 -74831 -78976 -51793 -53142 -120753 -148313 298870 -236910 33781
15695A67850c01992a9138B73374F8494N4227a67907O7383H3211Q2280o1856L6162
$$ 167850 -301992 -19138 273374 68494 122721 -167907 -100524 83211 165491 103635 139797
15684A39797n358d08723a01841I2569a20201F0137B3191h7387K8042j93637C02599
$$ 139797 134439 -408723 -101841 92569 -120201 60137 23191 -87387 -59345 -252982 302599
15672A95020c50288A85493a42861L823B06550a39775r879j16298H8311M9068E0538
$$ 195020 -350288 185493 -142861 -139038 206550 -139775 -149654 -265952 88311 137379 50538
15660a1748q3035H0121a27322n460A28257O8138b87583A55021a8447B1591g1750
$$ -11748 -94783 80121 -127322 -132782 128257 196395 -287583 155021 -18447 21591 -71750
15648b9478q1380K6012L8453j31224j4569o0112b4595A1026c07581G3514b79914
$$ -29478 -110858 -84846 -46393 -177617 -192186 -252298 -24595 11026 -307581 73514 -279914
15636A10463b73419g8419j0072j32572g8717F6725b6445j06289K4148H7066a87874
$$ 110463 -273419 -78419 -88491 -221063 -78717 66725 -26445 -132734 -108586 87066 -187874
15624A0354a07675B29462C0846i3065p907j47499D94354e6053j750J2645d553
$$ 10354 -107675 229462 30846 -93065 -100972 -248471 494354 -56053 -57803 -45158 -4553
15612d17881A95977F5553a38659p0128e418C43149b65330C1978d71341i6126j4442
$$ -417881 195977 65553 -138659 -208787 -5418 343149 -265330 31978 -471341 -96126 -110568
15601a10568A2437a33473H103K8931N5618j5518L5451D332a82421Q6736k65768
$$ -110568 12437 -133473 8103 37034 92652 77134 112585 4332 -182421 -95685 -361453
15590c61453C8379a56506d8061C81517j03014a47407k34897a3322j21753B15096
$$ -361453 38379 -156506 -48061 381517 278503 -147407 -382304 -13322 -135075 215096
15579A65365f6226J9957A30950c1676F6638J83431d7707l5193l9685B26814B2067
$$ 165365 -66226 -46269 130950 -31676 66638 250069 -47707 -82900 -122585 226814 22067
15567e1925P307o1171n9074A63826h7076j39478b3354A01421Q0949a28063j1624
$$ -51925 -44618 -105789 -164863 163826 -87076 -226554 -23354 101421 182370 -128063 -139687
15556a39687m8270j70049i2A37466R1193c25950A7651L0213a75864D1493c6367
$$ -139687 -187957 -358006 -92 137466 228659 -325950 17651 47864 -175864 41493 -36367
15544c9041C71156f5085k47730B78076a98995F3344b06160A36400a72418j75370
$$ -39041 371156 -65085 -312815 278076 -198995 63344 -206160 136400 -172418 -347788
15534c47788B90798p1314a9204e614A84197c12311F2836a27589C12537a86565
$$ -347788 290798 219484 -19204 -5614 184197 -312311 62836 -127589 312537 -186565
15523b82452N5995a9499B4969b6546l6604B86167E3111I269J98304c6243J6332
$$ -282452 -226457 -19499 24969 -26546 -63150 286167 53111 9269 207573 -36243 -19911
15512a9911A10050O541b04051j58042A87176a78767A29838a31331F1730A7043
$$ -19911 110050 116591 -204051 -362093 187176 -178767 129838 -131331 61730 17043
15501b3901B0564d254I2836D4376i6862H8019N3924a6905A9536J2870O7066c70168
$$ -23901 20564 -4254 92836 44376 -96862 88019 141943 -16905 19536 32406 99472 -370168
15488a51199C53340a59406e0359j35742P9458O251I9614a28767B75797C3686b28002
$$ -151199 353340 -159406 -50359 -186101 -106643 -100392 99614 -128767 275797 33686 -228002
15476a51362f0897l8117j54238L0619B81428a00745I5967a7375D2775d65399B19373
$$ -151362 -60897 -99014 -253252 -222633 281428 -100745 95967 -17375 42775 -465399 219373
15464A48045p377a89628B65214j26351b08743C9527b65791J03203p0873A44433
$$ 148045 140668 -189628 265214 138863 -208743 39527 -265791 -162588 -233461 144433
15453a92294h5794B03670a03635o3791A67344b26367R902A96513g5263p2587N2999
$$ -192294 -85794 203670 -103635 -167426 167344 -226367 -216465 196513 -75263 -147850 -94851
15442i4851A22290a8653m92955f0942a4052D6897A8331g7747A06123B3484d3378
$$ -94851 122290 -18653 -511608 -60942 -14052 46897 18331 -77747 106123 23484 -43378
15430c5590j41401d9j50771a9423j71140A6643Q5563m818C4590J389J36924c5782
$$ -35590 -176991 -49 -150820 -19423 -190563 16643 102206 97388 34590 35979 172903 -35782
15417H9590K22927b0147c083m1648A91743F9791M776d0504k08791G2989K41461
$$ 89590 312517 -20147 -3083 -44731 191743 69791 74567 -40504 -249295 72989 314450
15406C14450h7034A55684o6818a0157j37671A06645C4443b37269E3070L79084
$$ 314450 -87034 155684 88866 -10157 -147828 106645 34443 -237269 53070 432154
15396D32154B5604b00162j23556J49832j66353b9754A12733J76191j18239b61311
$$ 432154 25604 -200162 -323718 -173886 -340239 -29754 112733 288924 170685 -261311
15385I4655a24466b4293A39805C3436M50763D4969J78465a30031j2085d0626l21348
$$ 94655 -124466 -24293 139805 33436 484199 44969 223434 -130031 -142116 -40626 -361974
15374c61974I6340b09537A3513L4994e1847J7264G9415d0624l693j53029m1558
$$ -361974 96340 -209537 13513 48507 -51847 -34583 79415 -40624 -44317 -197346 -238904
15363b38904B01897H5226Q456d5603A39723a08538H8892a42310E8141M9494a604
$$ -238904 201897 85226 93682 -45603 139723 -108538 88892 -142310 58141 107635 -1604
15351i1265D7373b47231e7724A12226a19983j50274k7649B6080K56585b15378
$$ -91265 47373 -247231 -57724 112226 -119983 -270257 -297906 26080 282665 -215378
15340B4545J87220J19610A64659M9746N8238b7554k5609A26821J28061n5253d3873
$$ 24545 211765 331375 164659 214405 272643 -27554 -53163 126821 254882 199629 -43873
15328B44737H9743a88934F0019a20950C94020A81534Q7960j19333a82408A74863
$$ 244737 89743 -188934 60019 -120950 394020 181534 269494 150161 -182408 174863
15317b89212d573F7773K9294J5082l113M248A0249e19443B28328h3761r2313B17950
$$ -289212 -4573 67773 97067 112149 109036 113284 10249 -519443 228328 -83761 -176074 217950
15304e2023l4250j27119B47084a75247A79343e8512A77521a43730F2030a08353
$$ -52023 -86273 -213392 247084 -175247 179343 -58512 177521 -143730 62030 -108353
15293D7703a08017A11124K76268a4500H8829J5150a00061r5633A8154L08302A33414
$$ 47703 -108017 111124 387392 -14500 88829 103979 -100061 -195694 18154 326456 133414
15281a0337q6482A10065a03676D0014P6798a07136D6468Q8946B1722l747j07b37563
$$ -10337 -96819 110065 -103676 40014 116812 -107136 46468 135414 21722 17975 17868 -237563
15268a03496j43550C32828l8552g245A0037c67231B32845b56174C79772c46959
$$ -103496 -247046 332828 294276 -7245 10037 -367231 232845 -256174 379772 -346959
15257B56631A18977J77760C8805R8112J11488r8161e6353A78866O44656k4774
$$ 256631 118977 296737 38805 136917 248405 150244 -56353 178866 823522 798748
15247G98748J471935j099668M36621J15859F33261A42327a03261L9200A37913
$$ 798748 2270683 1171015 1607636 1723495 633261 142327 -103261 -64061 137913
15237A2915h6734D3742M9882a46256A62783b1146A59677L170b37723a00174I4803
$$ 12915 -86734 43742 93624 -146256 162783 -21146 159677 162847 -237723 -100174 94803
15225A5379b8042l4957j49351A02093R8219p794O2584i7129k0456B11810J58371
$$ 15379 -28042 -62999 -212350 102093 200312 192518 255102 -97129 -117585 211810 370181
15214C70181a45708F5314j6590O6993A9604c5389q8652K0514q3081B29549b1792
$$ 370181 -145708 65314 48724 115717 19604 -35389 -124041 -103527 -186608 229549 -21792
15202A60150f0806q2198B3806L24402E8372b62897a4782j43639d7054B20152p0501
$$ 160150 -60806 -143004 23806 348208 58372 -262897 -14782 -158421 -47054 220152 149651
15191A49651a41253G8870a85621B7842L21618L8217B287J77719R1966O0947b39577
$$ 149651 -141253 78870 -185621 27842 349460 387677 2287 180006 271972 332919 -239577
15179I4787b6270o9206C06672p061J5068j23511i9796E1106a82525B13991m3755
$$ 94787 -26270 -95476 306672 299611 314679 191168 -99796 51106 -182525 213991 170236
15168A70236a75463B77984D0901J32159P5133A14652K03335I7497M1297E6851
$$ 170236 -175463 277984 40901 173060 248193 114652 317987 97497 138794 56851
15157i1974A94203d8168C51761b33107a3548m6734B46471d9756C55971K0165j83835
$$ -91974 194203 -48168 351761 -233107 -13548 -60282 246471 -49756 355971 376136 192301
15146A92301n9235a6741A83386J1579g3245H7677J38190J5499K08840k14061R2859
$$ 192301 133066 -16741 183386 194965 -73245 87677 225867 241366 450206 236145 329004
15135C29004a97106D9629j1738K69555j6251c0294A09363d2328j74584O8072A67309
$$ 329004 -197106 49629 37891 307446 291195 -30294 109363 -42328 -216912 -148840 167309
15123b5707H9013K80660o5130A21058a14389A36793C9981K53350R528F3627J9180
$$ -25707 89013 369673 304543 121058 -114389 136793 39981 293331 302859 63627 82807
15112H2807J56037j5598H7620b04798A34699g207B09330a01575A95249I7185R0356
$$ 82807 238844 223246 87620 -204798 134699 -7207 209330 -101575 195249 97185 187541
15101A87541B346e4376H3068j8251J27764c9341j64116B25444k3584m5738R713
$$ 187541 2346 -54376 83068 64817 192581 -39341 -203457 225444 201860 156122 165835
15090A65835b71211A76982q0340C0803c7461B40648G2506P9776E5444b41055j51204
$$ 165835 -271211 176982 96642 30803 -37461 240648 72506 152282 55444 -241055 -392259
15079c92259C03147p8803R9828p9000A12054K73655G9003Q9478a205C29969A3832
$$ -392259 303147 224344 324172 245172 112054 385709 79003 168481 -1205 329969 13832
15067B05533P9534g2261A93004l4104r571b902k59627B32781j7914P219a10652
$$ 205533 285067 -72261 193004 158900 149329 -2902 -262529 232781 214867 222086 -110652
15055C13864d6471B51334D4190K61625l4464j31971J72762m955J33017J2257A24837
$$ 313864 -46471 251334 44190 305815 271351 139380 312142 307187 440204 452461 124837
15043f019A44911K2209J41971A39484J05159r7660N793J34657C6339P6769J75780
$$ -6019 144911 167120 309091 139484 244643 146983 152776 287433 36339 113108 288888
15032B88888j30966a53251B85677J7157d4740A98496Q3347r92r1678J06815A24693
$$ 288888 157922 -153251 285677 302834 -44740 198496 281843 280851 189173 295988 124693
15020B65179J30086M0631j37553C4409J23234A5225L69857r3671F5895K57390
$$ 265179 395265 435896 298343 34409 157643 15225 385082 291411 65895 323285
15010C23285j15433J994J78774j86675m8401k344l4452J15585N6893A2890a978
$$ 323285 207852 209846 388620 201945 153544 151200 116748 232333 289226 12890 -1978
14998a65842a4576C24091m3285A23410a71330A64235O3048j03085I588J88118
$$ -165842 -14576 324091 280806 123410 -171330 164235 227283 124198 9588 197706
14988A97706d7185C73319A01703a48633E0731Q2215a59255A25580C2638J13748
$$ 197706 -47185 373319 101703 -148633 50731 132946 -159255 125580 32638 146386
14978A46386J20624F2959B4358J61060a43891o8058B50098J81226A4521N38322
$$ 146386 267010 62959 24358 185418 -143891 -211949 250098 431324 14521 552843
14968E52843C7492K40106P6834j63129L06327k43536A20986n4350M36202A49302
$$ 552843 37492 277598 354432 191303 497630 254094 120986 66636 502838 149302
14957A32501J00054P7951J32607K5929p0566r9949I3176k2400M07281A26419L2189
$$ 132501 232555 310506 443113 469042 398476 298527 93176 70776 478057 126419 158608
14946A58608l0234J18235J25857j63357N0144A0479K04879K0330p9157R7774A20465
$$ 158608 128374 246609 372466 209109 259253 10479 215358 235688 156531 254305 120465
14934C33709F3915J28114K19760j70444J9372k8681r9646L29502A07809O7765
$$ 333709 63915 192029 411789 241345 260717 232036 132390 461892 107809 175574
14924A75574K70639A43823K60456A05903M9326J23376P191J98760P674q4653q767
$$ 175574 446213 143823 404279 105903 155229 278605 285796 484556 492230 407577 398810
14913C98810j71841R7313J8988k3729K11068F9331K16472J37926c6274B97464
$$ 398810 226969 324282 343270 319541 530609 69331 285803 423729 -36274 297464
14902E06604L1973A39983K06653j56545K19680C3348K06136O2878J99213j83607
$$ 506604 538577 139983 346636 190091 409771 33348 239484 302362 501575 317968
14892C17968R5696q9337J4220K71743J08056j82204o3068l8744J39283a18232
$$ 317968 413664 324327 338547 610290 718346 536142 473074 434330 573613 -118232
14881D93603j69715J10327i5924A59306J2208J82015F8401L02816j56487L83332
$$ 493603 323888 434215 -95924 159306 171514 353529 68401 371217 214730 598062
14871E98062k10998A13976L40095N5030j76308o3495M32987D9402L33347c9483
$$ 598062 387064 113976 454071 509101 332793 269298 702285 49402 382749 -39483
14860F73766j91320B00102N37374C57890p2669K7360K63135m0928j70685J24606
$$ 673766 482446 200102 737476 357890 285221 312581 575716 534788 364103 488709
14850D88709r5572O1441j66823K2948A22189K41270O31P1606j29035K19084j84271
$$ 488709 393137 454578 287755 310703 122189 363459 364090 435696 306661 525745 341474
14839C41474p8066N02654l34949P8097k22592L91417k91195p9161j5391j08263
$$ 341474 263408 766062 431113 509210 286618 678035 386840 307679 292288 184025
14829A84025M31067k20284h3555C64629N6290N28020k57666J01500B01273K09183
$$ 184025 615092 394808 -83555 364629 420919 948939 691273 792773 201273 410456
14819D10456j55881M88189q2053j64657M6432R051J8853k55784k6128M69372l19497
$$ 410456 254575 742764 660711 496054 542486 551537 570390 314606 288478 757850 438353
14808D38353J1510K07170B43623L65244J76655l05028M3823O4036j48945j11981
$$ 438353 449863 657033 243623 608867 785522 480494 524317 588353 439408 327427
14798C27427M2448J36100J13535p8073B04015M57484j08778n9768p1060J03971
$$ 327427 369875 505975 619510 541437 204015 661499 552721 492953 421893 525864
14788E25864J06372A82776l5247N97017k23490J67644j46352q5439j8562J22378
$$ 525864 632236 182776 147529 744546 521056 688700 542348 456909 438347 560725
14778E60725j78821Q0306K53018j21177n6352L34332K48086n33652q7315L4187
$$ 560725 381904 462210 715228 594051 537699 872031 1120117 586465 499150 533337
14768E33337J9452P4159J52855n9136J53729k12467J02349l52735L77615j47087
$$ 533337 552789 626948 779803 720667 874396 661929 764278 411543 789158 642071
14758F42071j07714R5161L9329k78328K92830k42858J563K61695k00412o9870
$$ 642071 534357 629518 668847 390519 683349 440491 442054 703749 503337 433467
14748D33467K83037q9662p787L8672J13934J33214j10554l00164J52433K81370
$$ 433467 716504 626842 619055 657727 771661 904875 794321 494157 646590 927960
14738I27960J5774k22328J90181j33982j61152K27837q969p1685o4486K21451
$$ 927960 943734 721406 911587 777605 616453 844290 835321 763636 699150 920601
14728I20601l51129R382J10810q9336K89967j44659L1751J24107k88592Q3432
$$ 920601 569472 578854 689664 600328 890295 745636 777387 901494 612902 696334
14718F96334R0848q147M3908k78282J62689j55782k17504J31485L60574m4059
$$ 696334 787182 779035 822943 544661 707350 551568 334064 465549 826123 782064
14708G82064m6050J09496K4889P6152l30276k54792L73799j98804L45902j56274
$$ 782064 736014 845510 870399 946551 616275 361483 735282 536478 882380 726106
14698G26106L41263k68995l41931J03948J07451j17511N38692l35202K89888l90576
$$ 726106 1067369 798374 456443 560391 667842 550331 1089023 753821 1043709 653133
14688F53133L11783m6860k26812M39940m48432L54210k64943K12104M9949k57964
$$ 653133 964916 918056 691244 1131184 682752 1036962 772019 984123 1034072 776108
14678G76108M29104l63259J333l3561J56492j85708K09889k74729K19633M62963
$$ 776108 1205212 841953 843286 809725 966217 780509 990398 715669 935302 1398265
14668A398265m25444J67276j88754k09639N13030k54658O0634N262M0675j57415
$$ 1398265 972821 1140097 951343 741704 1254734 1000076 1060710 1065972 1106647 949232
14658I49232k01786N66050k56980p6076L56132m86315K75663o5844J89794K41601
$$ 949232 747446 1313496 1056516 980440 1336572 850257 1125920 1060076 1249870 1491471
14648A491471n00550K89172j28710P1917L3321q2154K9338o181P9674J6953J72722
$$ 1491471 990921 1280093 1151383 1223300 1256621 1174467 1203805 1197624 1277298 1294251 1466973
14637A466973P245R4788k13168k50994n0959J36081M3197j5016J46085k04149
$$ 1466973 1474218 1569006 1355838 1104844 1053885 1189966 1233163 1218147 1364232 1160083
14627A160083J11595k68611L32166J48500j43272l7206k3552J88498l55924j404
$$ 1160083 1271678 1003067 1335233 1483733 1340461 1303255 1279703 1468201 1112277 1110873
14617A110873L32799k79020J86912N17963j11380k24146N4236l35533J03499J77501
$$ 1110873 1443672 1164652 1351564 1869527 1758147 1534001 1588237 1252704 1356203 1533704
14607A533704l74694L97454m5462n3364J72706J3560r5684K0001m7789L93197
$$ 1533704 1159010 1556464 1511002 1457638 1630344 1643904 1548220 1568221 1520432 1913629
14597A913629m10455N9186K83047k85089J07936J39335k12913K48004j74661o3158
$$ 1913629 1503174 1562360 1845407 1560318 1668254 1807589 1594676 1842680 1668019 1604861
14587A604861K37417q402j43771P0016o8852K37085l23650M28593k0850j20703
$$ 1604861 1842278 1833876 1690105 1760121 1691269 1928354 1604704 2033297 2012447 1891744
14577A891744J0878K987L67301o02536O28583j68831j00870M75887l03144J84466
$$ 1891744 1902622 1905609 2272910 1670374 2298957 2130126 2029256 2505143 2201999 2386465
14567B386465k86107K23769K17045m22009J85356J94928r6271J82216M84138k62787
$$ 2386465 2100358 2324127 2541172 2119163 2304519 2499447 2403176 2585392 3069530 2806743
14557B806743L69219p7195r4493K88638M52895K00309R09032P86541J702205L967857
$$ 2806743 3175962 3098767 3004274 3292912 3745807 3946116 4855148 5641689 7343894 11311751
14547A1311751P667492J9203721P485684A9720583q629378E047815j827491r74833
$$ 11311751 18979243 38182964 45668648 19720583 11091205 5047815 3220324 2245491
14539B245491n9779j77766K43848k92541o3366p8338K95554o0554o9949o3842
$$ 2245491 2185712 2007946 2251794 1959253 1895887 1817549 2113103 2052549 1982600 1918758
14529A918758M41717l00979n5643J80693J449K04490j75843j41975M76748l93111
$$ 1918758 2360475 2059496 2003853 2184546 2185995 2390485 2214642 2072667 2549415 2156304
14519B156304K99904k9259J62239o2753K08578o3013k45633Q8597R7715N6796
$$ 2156304 2456208 2426949 2589188 2526435 2735013 2672000 2426367 2514964 2612679 2669475
14509B669475J556N8801K47474J54716j19067k92940j8775L09725l73334M78429
$$ 2669475 2671031 2729832 2977306 3132022 3012955 2720015 2701240 3010965 2637631 3116060
14499C116060k34820J21492L0753K1297N27045j80937j12381k28662Q7626J68060
$$ 3116060 2881240 3002732 3033485 3054782 3581827 3400890 3288509 3059847 3147473 3315533
14489C315533r9816K20443Q1026m08211P02811m6018k77315O0165J61022q0408
$$ 3315533 3215717 3436160 3517186 3108975 3811786 3765768 3488453 3548618 3709640 3629232
14479C629232K25395j21182J28435o6956r3362K15858P4890N1551R9048r6564
$$ 3629232 3854627 3733445 3861880 3794924 3701562 3917420 3992310 4043861 4142909 4046345
14469D046345M787K80074j09891J64338j46274J32487J08726q3525L38927o17037
$$ 4046345 4051132 4331206 4221315 4385653 4239379 4371866 4480592 4397067 4735994 4118957
14459D118957J039497j82379j83602K23103J95711j57008K0183K04353N243j44169
$$ 4118957 5158454 4976075 4792473 5015576 5211287 5054279 5074462 5278815 5284058 5139889
14449E139889M0430J67659j44455K12505L64188k04355L31419o0726k59415J24944
$$ 5139889 5180319 5347978 5203523 5416028 5780216 5575861 5907280 5846554 5587139 5712083
14439E712083L16781J16723j50386M67407m89735K26086K8353M29568k303J78557
$$ 5712083 6028864 6145587 5995201 6462608 5972873 6198959 6227312 6656880 6654577 6833134
14429F833134k16435L85697k41229q0142J49819J61754R6084K0693O50748j08125
$$ 6833134 6616699 7002396 6761167 6681025 6830844 6992598 7088682 7109375 7760123 7651998
14419G651998k8787J94680m8044L74273l3215l8273K45352M5373O33413m44670
$$ 7651998 7623211 7817891 7769847 8144120 8110905 8072632 8317984 8363357 8996770 8552100
14409H552100M22653k2458J79392J01839K85290L23381j35497K12058L07495l30345
$$ 8552100 8974753 8952295 9131687 9233526 9518816 9842197 9706700 9918758 10226253 9895908
14399I895908N74525K61719j23293M45087n0798J8403K82062L55363l1497J60134
$$ 9895908 10470433 10732152 10608859 11053946 11003148 11021551 11303613 11658976 11627479 11787613
14389A1787613M56219J78667J37816M14671k04317M66280R4886M79628N01989
$$ 11787613 12243832 12422499 12560315 12974986 12770669 13236949 13331835 13811463 14313452
14380A4313452j77633N10368K45831l3100M59665L10298M38320M29599K21715
$$ 14313452 14135819 14646187 14892018 14858918 15318583 15628881 16067201 16496800 16718515
14371A6718515L63231P5898O61035K07406O38420J18864M97222K0578P25838L86908
$$ 16718515 17081746 17157644 17818679 18026085 18664505 18783369 19280591 19301169 20027007 20413915
14361B0413915M51856M96687K51212Q08510M90373N78131L63477P30529N44721
$$ 20413915 20865771 21362458 21613670 22422180 22912553 23490684 23854161 24584690 25129411
14352B5129411L56071P43011Q07952L77937Q83820P25209L89503R85868J105850
$$ 25129411 25485482 26228493 27036445 27414382 28298202 29023411 29412914 30398782 31504632
14343C1504632Q03625Q60965O25334P40733J067631J044236R60610J137194R77360
$$ 31504632 32308257 33169222 33794556 34535289 35602920 36647156 37607766 38744960 39722320
14334C9722320J378032J192530Q47958J694708J400695J443183J496172J617309
$$ 39722320 41100352 42292882 43140840 44835548 46236243 47679426 49175598 50792907
14326E0792907J642548J303130K172077J826353K105938K193566J898400K531442
$$ 50792907 52435455 53738585 55910662 57737015 59842953 62036519 63934919 66466361
14318F6466361K463762K336832K917113K549105L278421K959456L159206L651669
$$ 66466361 68930123 71266955 74184068 76733173 80011594 82971050 86130256 89781925
14310H9781925L714847L954366M323536M119502M626439M863635N283364N411896
$$ 89781925 93496772 97451138 101774674 105894176 110520615 115384250 120667614 126079510
14302A26079510N654256O753399O485778O659462P266623P864903P855810Q871627
$$ 126079510 131733766 138487165 144972943 151632405 158899028 166763931 174619741 183491368
14294A83491368R159251R791626J0309278J0637613J1026726J1805278J2170664
$$ 183491368 192650619 202442245 212751523 223389136 234415862 246221140 258391804
14287B58391804J2684968J3417215J3359492J3925874J3851751J4551791J3676294
$$ 258391804 271076772 284493987 297853479 311779353 325631104 340182895 353859189
14280C53859189J3718739J3254668J2462757J1406829J0541403Q917493O915903
$$ 353859189 367577928 380832596 393295353 404702182 415243585 424161078 431076981
14273D31076981M034901J661289O30642N8242j180780l230608m717331p128674
$$ 431076981 435111882 436773171 437403813 437462055 436281275 433050667 428333336 421204662
14265D21204662r069885j0535850j1904593j2782700j3904273j4210193j4366398
$$ 421204662 412134777 401598927 389694334 376911634 363007361 348797168 334430770
14258C34430770j4629446j4413539j4370701j3776280j2757004j1954168j2580697
$$ 334430770 319801324 305387785 291017084 277240804 264483800 252529632 239948935
14251B39948935j1666513j1131593j0765005r906455r392151r276714q282064
$$ 239948935 228282422 217150829 206385824 196479369 187087218 177810504 169528440
14244A69528440p981351p519426p071865p039868o005101o326768n379219m688529
$$ 169528440 161547089 154027663 146955798 139915930 133910829 127584061 122204842 117516313
14236A17516313n311984m892663m686360l939705m042389l221691l618693l440954
$$ 117516313 112204329 107311666 102625306 98685601 94643212 91421521 87802828 84361874
14228H4361874l714701k781943k789851l107295k458253k203785k602824k109665
$$ 84361874 80647173 77865230 75075379 71968084 69509831 67306046 64703222 62593557
14220F2593557j790564k316642j791226j640425k048376j573385j528470j341543
$$ 62593557 60802993 58486351 56695125 55054700 53006324 51432939 49904469 48562926
14212D8562926j359719k115535j300875j234745r58128m25731j063099j913573
$$ 48562926 47203207 45087672 43786797 42552052 41593924 41168193 40105094 38191521
14204C8191521j240405o72303r65069o94019p98043j223572o82347r65293o88623
$$ 38191521 36951116 36278813 35313744 34619725 33821682 32598110 31915763 30950470 30261847
14195C0261847p98051m27615r42174m02236r08008q62411m48166p99261m60160
$$ 30261847 29463796 29036181 28094007 27691771 26783763 25921352 25473186 24673925 24213765
14186B4213765m48131p11985l71564n20448m80816m87976m44485m73806o03315
$$ 24213765 23765634 23053649 22682085 22161637 21680821 21192845 20748360 20274554 19671239
14177A9671239r6423n10855l08121j86727n16330l43365m92369n29619N1475o26161
$$ 19671239 19574816 19063961 18755840 18569113 18052783 17709418 17217049 16687430 16738905 16112744
14167A6112744j85307N2779m58005m68066k43021l71274N836m37185j59893j15171
$$ 16112744 15927437 15980216 15522211 15054145 14811124 14439850 14445686 14008501 13848608 13733437
14157A3733437o5088l02530j80330m07930k27406m06913J55821n98285N4363m54523
$$ 13733437 13668349 13365819 13185489 12777559 12550153 12143240 12299061 11700776 11755139 11300616
14147A1300616o618J24448k39681j48138k53007j81807m75428K90610m70416l02782
$$ 11300616 11293998 11418446 11178765 11030627 10777620 10595813 10120385 10410995 9940579 9637797
14137I637797o1836L64336m62522l25248Q4494J46763j52331k72742l62185k08073
$$ 9637797 9575961 9940297 9477775 9152527 9237021 9383784 9231453 8958711 8596526 8388453
14127H388453K67222j81409j89876j6944j16863l31268j40819l1508K03194n95082
$$ 8388453 8655675 8474266 8284390 8267446 8150583 7819315 7678496 7646988 7850182 7255100
14117G255100K82276j51503n5366j32542Q751q3873m82214K3695K52465j74861
$$ 7255100 7537376 7385873 7330507 7197965 7206716 7122843 6640629 6664324 6916789 6741928
14107F741928k571m66946K06050m5270l8773n15076N82699k15314k36068j35207
$$ 6741928 6739357 6272411 6478461 6433191 6394418 5879342 6462041 6246727 6010659 5875452
14097E875452R4354p268l67994K12491r0294l78882j12354L52275K4997j11531
$$ 5875452 5969806 5962538 5594544 5807035 5716741 5337859 5225505 5577780 5602777 5491246
14087E491246k73566R465n2420R0641k59351J49117j61301l26910p7706N9071
$$ 5491246 5217680 5227145 5174725 5265366 5006015 5155132 4993831 4666921 4589215 4648286
14077D648286m03697K37998n1774J34620R7290m09305K55003l29876M24330k91031
$$ 4648286 4244589 4482587 4430813 4565433 4662723 4253418 4508421 4178545 4602875 4311844
14067D311844k32877k3979k03992K07560k90837M03274N6261m90327M34611p0400
$$ 4311844 4078967 4054988 3850996 4058556 3767719 4170993 4227254 3736927 4171538 4101138
14057D101138n14205J22494K86377m8714K3077l86403J67215l15808K86979m61834
$$ 4101138 3586933 3709427 3995804 3947090 3970167 3583764 3750979 3435171 3722150 3260316
14047C260316o4470J68894N908k22613N7788L51102l18508j08879m3649J92080
$$ 3260316 3195846 3364740 3370648 3148035 3205823 3556925 3238417 3129538 3085889 3277969
14037C277969k57346L77503l24577q0167J33702r8989J21704l15363L98090q6477
$$ 3277969 3020623 3398126 3073549 2993382 3127084 3028095 3149799 2834436 3232526 3146049
14027C146049k50980K38803l45783l3578p015Q7216k13269M6952k31720K7732
$$ 3146049 2895069 3133872 2788089 2754511 2747496 2834712 2621443 2668395 2436675 2464407
14017B464407K50674J55819m05275j55454L56268J05629m39371O9878o7350j26351
$$ 2464407 2715081 2870900 2465625 2310171 2666439 2772068 2332697 2402575 2335225 2208874
14007B208874j77956N41656o41923L57043o0877j89165K21599k1332k54116J80923
$$ 2208874 2030918 2572574 1930651 2287694 2226817 2037652 2259251 2237919 1983803 2164726
13997B164726l51663O5806p2019K29964K94362j86576L07973M03482O25680K731307
$$ 2164726 1813063 1878869 1806850 2036814 2331176 2144600 2452573 2856055 3481735 6213042
13987F213042N728472J8437387J7373724k2666335A2525852m804026j974290r38906
$$ 6213042 11941514 30378901 47752625 25086290 12525852 7721826 5747536 4808630
13979D808630p71934m42860j06824m90123k33767j885L55364l57508l09094K12691
$$ 4808630 4036696 3593836 3487012 2996889 2763122 2761237 3116601 2759093 2449999 2662690
13969B662690j56976J87549k57503J14372n27029M86137j63465k34207j42665
$$ 2662690 2505714 2693263 2435760 2550132 2023103 2509240 2345775 2111568 1968903
13960A968903k06985M76136m53748R6359j88041L27263n6126p3579K11688k32018
$$ 1968903 1761918 2238054 1784306 1880665 1692624 2019887 1963761 1890182 2101870 1869852
13950A869852J3584l7239l4021j15922J36947k31333P1374q9708M06680j10849
$$ 1869852 1883436 1846197 1812176 1696254 1833201 1601868 1673242 1583534 1990214 1879365
13940A879365j27657J67528m05492K17678l6886q2406r1576j38978M10698k08200
$$ 1879365 1751708 1919236 1513744 1731422 1694536 1612130 1520554 1381576 1792274 1584074
13930A584074J10876k92491K08069k55117j26898J13704j12059J22148K05729
$$ 1584074 1694950 1402459 1610528 1355411 1228513 1342217 1230158 1352306 1558035
13921A558035o1107j6534m8693P9399J77336m75245O6453N3751Q2624m9386K08398
$$ 1558035 1496928 1480394 1431701 1511100 1688436 1213191 1279644 1333395 1416019 1366633 1575031
13910A575031K5284l34265L94871l16657J32632k25592J16574J45929n08723L05110
$$ 1575031 1600315 1266050 1660921 1344264 1476896 1251304 1367878 1513807 1005084 1310194
13900A310194P3029k52183L56960m03633L67842J86081m5309k24507p6546r5785
$$ 1310194 1383223 1131040 1488000 1084367 1452209 1638290 1592981 1368474 1291928 1196143
13890A196143J48792J68452l66461r2174J01206L3144p5774L82722k73000k95413
$$ 1196143 1344935 1513387 1146926 1054752 1155958 1189102 1113328 1496050 1223050 927637
13880I27637N60145k65488O0331J3768j06024q7314k84966K67551L24743l85163
$$ 927637 1487782 1222294 1282625 1296393 1190369 1103055 818089 1085640 1410383 1025220
13870A025220l2122M3441l8694p9492M94963m4536n46785J86927k38484L80197
$$ 1025220 993098 1036539 997845 918353 1413316 1368780 821995 1008922 770438 1150635
13860A150635M32389l78023k03273o9576k02694P4443L48730j18938j77532J85884
$$ 1150635 1583024 1205001 1001728 932152 729458 803901 1152631 1033693 856161 1042045
13850A042045k1953J26599k45498M8233R713l02367L21932J35020l02142L68797
$$ 1042045 1020092 1146691 901193 949426 959139 656772 978704 1113724 811582 1180379
13840A180379l31469K93410j00115k8206k7921K4413j35913k65437K16721P5085
$$ 1180379 848910 1142320 1042205 1013999 986078 1010491 874578 609141 825862 900947
13830I00947J84148k9380k37194K11492j8202o3658l2964J62959l29801O7860
$$ 900947 1085095 1055715 818521 1030013 1011811 948153 915189 1078148 748347 816207
13820H16207j014k09644N1667M6549O5534N44966r4658n74813K87912j39218k42729
$$ 816207 815193 605549 657216 703765 769299 1314265 1219607 644794 932706 793488 550759
13809E50759O47515r8312n33076M32954L4574l53715K80334M5919k62063J46443
$$ 550759 1198274 1099962 566886 999840 1034414 680699 961033 1006952 744889 891332
13799H91332k36357p5202K7716R3664j3219J05194K12011k19673n037J823j60125
$$ 891332 654975 579773 607489 701153 687934 793128 1005139 785466 780429 782252 622127
13788F22127k1468K2476p5719L72288k1178k00802j16612K78933N5234M2204k22888
$$ 622127 600659 623135 547416 919704 898526 697724 581112 860045 915279 957483 734595
13777G34595k95365K59333l24643K56238j5460j63418L83101k916J90949l00090
$$ 734595 439230 698563 373920 630158 614698 451280 834381 831465 1022414 722324
13767G22324J299j16910L60490l56706M07297j38021j69998Q201l28020L803M37377
$$ 722324 723623 606713 967203 610497 1017794 879773 709775 717976 389956 393759 831136
13756H31136k06345J54392j00127j09381O3424R496H2500L99088L7928o2141O491
$$ 831136 624791 779183 679056 569675 633099 642595 82500 481588 519516 457375 463866
13745D63866j98668L76256K81112l18079J2399Q3816Q8972l42215N8045n9613
$$ 463866 265198 641454 922566 604487 616886 700702 789674 447459 505504 445891
13735D45891Q9761M24634A31945K88639Q08293D43941J82008L82752A09763M17548
$$ 445891 535652 960286 131945 420584 1228877 443941 625949 1008701 109763 527311
13725E27311o2314q0606J79991r1214J05929M49501j54899m17790J11368n1010
$$ 527311 464997 384391 564382 473168 579097 1028598 873699 455909 567277 516267
13715E16267J30783B65235L39548J81153C90615R2964J66623K5085C12027J50715
$$ 516267 647050 265235 604783 785936 390615 483579 650202 675287 312027 462742
13705D62742N7100L58525j87974p3172j14304J76041A02129L99030J0005j52227
$$ 462742 519842 878367 690393 617221 502917 678958 102129 501159 511164 358937
13695C58937K92090B75004Q6294L18450l2847k1408j71019M02853l74140A82970
$$ 358937 651027 275004 361298 679748 646901 625493 454474 857327 483187 182970
13684G09468O2450l72369A54534J74000M72404k75316j19645n9860J50928j24637
$$ 709468 771918 399549 154534 328534 800938 525622 405977 346117 497045 372408
13674C72408K2000M79947l93600k37309K08293j31721J41854j53773J82092m1242
$$ 372408 394408 874355 480755 243446 451739 320018 461872 308099 490191 448949
13664D48949J74444p7229j4637j52784L63808k19412j24279N5564B03296J79521
$$ 448949 623393 546164 531527 378743 742551 523139 398860 454424 203296 382817
13654C82817j09561J8449K69827j71737o8773o0844M632L55361J21625C39971
$$ 382817 273256 291705 561532 389795 321022 260178 264810 620171 741796 339971
13643C11859J34512J9351J05145k19416D5086K01982K94K26709k24071J65864
$$ 311859 446371 465722 570867 351451 45086 247068 247362 474071 250000 415864
13633D15864j55620R7693j34739M56580r6234j69437M0794j25113K56797J09776
$$ 415864 260244 357937 223198 679778 583544 414107 454901 329788 586585 696361
13623F96361l21010j06282N6083K01647r6095H8791K13704K95983o8909R8991
$$ 696361 375351 269069 325152 526799 430704 88791 302495 598478 529569 628560
13613F28560B80674N5624B9009K67404K4985J27682K5294j29183L49776j32438
$$ 628560 280674 336298 29009 296413 321398 449080 474374 345191 694967 562529
13603E62529O023B61124J48468p7413K5583n3705J50190E223L24216e7833E23416
$$ 562529 568552 261124 409592 332179 357762 304057 454247 5223 329439 -57833 523416
13591B88553c8806D05821J36828p9145K30717A58488J82125M005K7303J07550
$$ 288553 -38806 405821 542649 463504 694221 158488 340613 344618 371921 479471
13581D79471R6230k35985K29080q0163B08085I7715P5784Q7175H0562L70889o051
$$ 479471 575701 339716 568796 488633 208085 97715 173499 260674 80562 451451 445400
13570D45400B04726c7125m2158C06457D666J40268J31658Q6287A18416J37837
$$ 445400 204726 -37125 -79283 306457 4666 144934 276592 362879 118416 256253
13560B56253B137O30205B33098K06618O2757K2092o4771K9575j10889c2529A35535
$$ 256253 2137 632342 233098 439716 502473 524565 459794 489369 378480 -32529 135535
13548E27292q4326j48369J22938D7697L5003J24734K28302K6396r9383j04246
$$ 527292 442966 294597 417535 47697 82700 207434 435736 462132 362749 258503
13538B58503J38025J12728k34203O0216q120K20981A62991K35910j82574r8404
$$ 258503 396528 509256 275053 335269 327149 548130 162991 398901 216327 117923
13528A17923N33702A47718M52710e4609C60477j54238I3597J04146e6380B92067
$$ 117923 651625 147718 600428 -54609 360477 206239 93597 197743 -56380 292067
13517C37928r9823N8104k5191A18266M48575B54876m1948R9027n1536i8476C02653
$$ 337928 238105 296209 271018 118266 566841 254876 212928 311955 260419 -98476 302653
13505C44519A452J38574J10581k2172b8497D43755j96796j03266N7769J94771
$$ 344519 1452 140026 250607 228435 -28497 443755 246959 143693 201462 396233
13495C96233j05661R1605j78078K5872H2983O7921p2183J79898K69571B08138
$$ 396233 290572 382177 204099 229971 82983 150904 78721 258619 528190 208138
13484A29194L46144A68787K44777H7014R5212L08009j34680j70751r0583K97120
$$ 129194 475338 168787 413564 87014 182226 490235 355555 184804 94221 391341
13474C91341B1545M40338j48567L19571k56680N0398A19469K65666j49778J3810
$$ 391341 21545 461883 313316 632887 376207 426605 119469 385135 235357 249167
13464B49167p6593p8582K73416o7115O0158Q9090I8585J31138K1584n5935G4949
$$ 249167 172574 93992 367408 300293 360451 449541 98585 229723 251307 195372 74949
13452F14315k71722C772a31289C51605C8755N39001j64960a2883I2415J74589
$$ 614315 342593 3772 -131289 351605 38755 577756 412796 -12883 92415 267004
13442B67004i323C21459K41962j85916A86494E8465a3724A15401J17387A02012
$$ 267004 -9323 321459 563421 377505 186494 58465 -13724 115401 232788 102012
13431D89918A62888K45639j18178J53459k16784J51615G4281K00427q8966M6515
$$ 489918 162888 408527 290349 443808 227024 378639 74281 274708 185742 232257
13421B32257N8890J41389A53755J45840J52429j19765I1705J43076r8519J71420
$$ 232257 291147 432536 153755 299595 452024 332259 91705 234781 136262 307682
13411C07682K8350f6778B23972K11700n9443C9927J89714a10988B25104K549l6716
$$ 307682 336032 -66778 223972 435672 376229 39927 229641 -110988 225104 227653 190937
13400A90937J75107e9056C70617K6611J72116k59228j50678J43477i4536C2495
$$ 190937 366044 -59056 370617 397228 569344 310116 159438 302915 -94536 32495
13389A29459k1207a53196B88261k4700L7975F8547J94454f7942C31691j06337
$$ 129459 108252 -153196 288261 263561 301536 68547 263001 -67942 331691 225354
13379B25354J34918J1766J10021B02329O5440p1436J7728J34276j23918m9434
$$ 225354 360272 372038 482059 202329 267769 196333 214061 348337 224419 174985
13369A74985K93099A4753c333C51240n7129m0928K7886F5684K16619f3168C00719
$$ 174985 468084 14753 -3333 351240 294111 253183 281069 65684 282303 -63168 300719
13357B09180B8656K1363L32997p5585j6742n6118Q2566eB77406e3119C61394G2781
$$ 209180 28656 50019 383016 307431 290689 234571 317137 -5 277406 -53119 361394 72781
13344C43224l6055k7435M0811O0335J00142Q0210A84616J77988K6308A71645a22246
$$ 343224 307169 279734 320545 380880 481022 561232 184616 362604 388912 171645 -122246
13332D48987m0572K0936A94148J6411O0835E4499K75719c4979I8208K07708J32628
$$ 448987 408415 429351 194148 210559 271394 54499 330218 -34979 98208 305916 438544
13321D38544E0761K38761p1703e8030A22207J03918A11909L24247B03802K24374
$$ 438544 50761 289522 217819 -58030 122207 226125 111909 436156 203802 428176
13311D28176j75137A25405h3308A34357c0896A84081R5978F2467L02907r5174
$$ 428176 253039 125405 -83308 134357 -30896 184081 280059 62467 365374 270200
13301B70200n6066f9882a3927l8476k58926A77583a25160B77429D3053J648g7911
$$ 270200 214134 -69882 -13927 -52403 -311329 177583 -125160 277429 43053 44701 -77911
13289B24637j329a2128B26146a41080A86193J39494G3738L56607g4139A43180
$$ 224637 223308 -12128 226146 -141080 186193 325687 73738 430345 -74139 143180
13278c8627B99497f3088A43983b04621G5345K10579b23206A86517N6995P2427
$$ -38627 299497 -63088 143983 -204621 75345 285924 -223206 186517 243512 315939
13268C15939f6160B56336K27134A83568N2029A2118J24876K52262c1039C274J91122
$$ 315939 -66160 256336 483470 183568 235597 12118 136994 389256 -31039 3274 194396
13257A94396J18069A53299g0534B89338o5644H8920R9924J46857C76L27776j10833
$$ 194396 312465 153299 -70534 289338 223694 88920 188844 335701 376 328152 217319
13246B17319O3476b13054A35776f5713B93729a36247a3026C77056c32839a29354
$$ 217319 280795 -213054 135776 -65713 293729 -136247 -13026 377056 -332839 -129354
13235A7212L1253K36223a67089A20351e3523G7258j4862A3725J37293J22485J61348
$$ 17212 48465 284688 -167089 120351 -53523 77258 62396 13725 151018 273503 434851
13224D34851j55457A12668b5866B21449r2216h0774n8391B00604J3317O7691n6876
$$ 434851 279394 112668 -25866 221449 129233 -80774 -139165 200604 213921 281612 224736
13213B24736J11724b4598B21186I0128j1257a01456B40738E0132L5823b2596C1944
$$ 224736 336460 -24598 221186 90128 78871 -101456 240738 50132 85955 -22596 31944
13201a10458B64642K01926A26610a7981C8233b3750A96052C6398J60434H7631
$$ -110458 264642 466568 126610 -17981 38233 -23750 196052 36398 196832 87631
13190B22870i8505c6967A12875l4031O0910P282N4963H0169R6256M7601i2251
$$ 222870 -98505 -36967 112875 78844 139754 147036 201999 80169 176425 224026 -92251
13178E0281O3496e3487B57154C4719J6536N109O6952L25020A19891b40417c0293
$$ 50281 113777 -53487 257154 34719 51255 56364 123316 448336 119891 -240417 -30293
13166B08452q2374p657J19819k5032p2592J77347d0886A19987O2614J12833i6923
$$ 208452 126078 118421 238240 213208 140616 317963 -40886 119987 182601 295434 -96923
13154B11012L6585I6622i8236B49568G2405R8441N8434F5831M5512l6457b20945
$$ 211012 247597 96622 -98236 249568 72405 170846 229280 65831 111343 74886 -220945
13142a30475h520B3456M44129a69485r2242A1654J41675o7364d994D11708A26363
$$ -130475 -8520 23456 467585 -169485 -261727 11654 153329 85965 -4994 411708 126363
13130A08750c06655a05499N1359A69349N4831E8531G919i4741C21975a7985F1902
$$ 108750 -306655 -105499 -54140 169349 224180 58531 7919 -94741 321975 -17985 61902
13118A51593q111b337o8255B28051n9304c03249A01476m6231E634K18496K63641
$$ 151593 143482 -2337 -70592 228051 168747 -303249 101476 55245 5634 224130 487771
13107D87771A40585J10062K26098a37360B45478b66499D38932A0685K73219g094
$$ 487771 140585 250647 476745 -137360 245478 -266499 438932 10685 283904 -7094
13096D22060A05274k9365a83657B4420a4665A79365f3371b3731A9998f5782B1339
$$ 422060 105274 75909 -183657 24420 -14665 179365 -63371 -23731 19998 -65782 21339
13084B22000K74077a35875D48803a11152B60382n9234h4202A475M83484a81540
$$ 222000 496077 -135875 448803 -111152 260382 201148 -84202 1475 484959 -181540
13073d5567F3155e067j09699n0107A31964a87234D1845J82583A9454a1619j97671
$$ -45567 63155 -5067 -114766 -164873 131964 -187234 41845 224428 19454 -11619 -209290
13062b09290A62336D9561J75375E2553A497b24012e1320D5061J89552a07342e457
$$ -209290 162336 49561 224936 52553 1497 -224012 -51320 45061 234613 -107342 -5457
13050B74692c4485A11513M7016a76750C47258I5924m6675R2599c581j02322L2757
$$ 274692 -34485 111513 158529 -176750 347258 95924 49249 141848 -3581 -105903 -73146
13039g3146F9871J55604c0249A1242a51889f1117i069E20031A75095E6216L15735
$$ -73146 69871 225475 -30249 11242 -151889 -61117 -9069 520031 175095 56216 371951
13028C71951I745J85955l821m0519K55698j27888r8603b10822d64I2263J62066
$$ 371951 9745 195700 191879 151360 407058 279170 180567 -210822 -464 92263 254329
13017B54329a54224I8601b40592i7713B75648h6163B55929A24694A6410K30809
$$ 254329 -154224 98601 -240592 -97713 275648 -86163 255929 124694 16410 247219
13007B47219n8860H1845h3575E06964f7652o7097B62844H6812a94988B36121m070
$$ 247219 188359 81845 -83575 506964 -67652 -134749 262844 86812 -194988 236121 232051
12996B32051M045q8253h041G1536K83042G5915h7749C5675g2882D06601h2557
$$ 232051 236096 147843 -8041 71536 354578 75915 -87749 35675 -72882 406601 -82557
12984F3405j3814O7225i9746A24538L8404L4804B3186K4222b61936k22159C03058
$$ 63405 49591 116816 -99746 124538 162942 197746 23186 47408 -261936 -484095 303058
12972C07334A32584g3582A42977g746j5938B7176J08684P4315a48782h130B87006
$$ 307334 132584 -73582 142977 -7746 -23684 27176 135860 210175 -148782 -8130 287006
12960A12928j2677a20011B47240D0701a7635B16979b04145C7925a22024j35256
$$ 112928 100251 -120011 247240 40701 -17635 216979 -204145 37925 -122024 -257280
12950b57280a06026d861C6507M8529J34766a38916B98770l3589I2040L10006F0659
$$ -257280 -106026 -4861 36507 85036 219802 -138916 298770 265181 92040 402046 60659
12938G282c2710c809I884J89169N6687b62394N2314A48008a03493A8215a76144
$$ 7282 -32710 -3809 9884 199053 255740 -262394 -210080 148008 -103493 18215 -176144
12926a89000N7896C45558j28833b33117A44016m2746d1229a9795k3875j89305
$$ -189000 -131104 345558 216725 -233117 144016 101270 -41229 -19795 -43670 -232975
12916b32975a7429j01561C37383b95938A448J81712g9763A38279J29303F5106
$$ -232975 -17429 -118990 337383 -295938 1448 183160 -79763 138279 267582 65106
12905G5947d2390A06965b20726e6672k19536O7824a6605A02560B2269K27753E2943
$$ 75947 -42390 106965 -220726 -56672 -276208 -208384 -16605 102560 22269 250022 52943
12893A89785a5298F5534D005K63122a74134A58603J86537A21008K87810A89505
$$ 189785 -15298 65534 4005 267127 -174134 158603 345140 121008 408818 189505
12882H5640a48481o915k2216L2753M8690A35695O258A4180Q2838g4838J7700a3191
$$ 85640 -148481 -155396 -177612 -144859 -96169 135695 141953 14180 97018 -74838 -57138 -13191
12869a14577G9083K7669K31584a00523H6133d7840B7409P8764A578b52235C99375
$$ -114577 79083 106752 338336 -100523 86133 -47840 27409 106173 1578 -252235 399375
12857a01545H0006h6714o0491A42570E0913a84701r3610B53462b42836B1331N9739
$$ -101545 80006 -86714 -147205 142570 50913 -184701 -278311 253462 -242836 21331 81070
12846H1070L8793j3398K9966B6102b7675E7139O0080a05225m8340P242B70431
$$ 81070 119863 106465 136431 26102 -27675 57139 117219 -105225 -153565 -146323 270431
12834h1921A30353L11507b72368c4840h642C21308O6513G9942d2084H3721b9314
$$ -81921 130353 441860 -272368 -34840 -8642 321308 387821 79942 -42084 83721 -29314
12822B209L49948G6398N4336c1305k4216B59997a62077H7779b4243A22108I04
$$ 2209 352157 76398 130734 -31305 -55521 259997 -162077 87779 -24243 122108 904
12810C34759A01494h9123c0524A00378e2852A45571J3736b8529B45049D3310b43890
$$ 334759 101494 -89123 -30524 100378 -52852 145571 159307 -28529 245049 43310 -243890
12798A43524l9768b60493L2882A07598h7884C1303a90816G8674J20608C605O7488
$$ 143524 103756 -260493 -227611 107598 -87884 31303 -190816 78674 199282 3605 71093
12787G1093K05758j135a19996N3220A30398B790P784J35299B7647b86955a27636
$$ 71093 276851 275716 -119996 -66776 130398 2790 10574 145873 27647 -286955 -127636
12775a66461c28m2466A17721n8014B1764a70449F8713J39624q6980A1828N8357
$$ -166461 -328 -42794 117721 59707 21764 -170449 68713 208337 121357 11828 70185
12764G0185O6804c60621I84Q762g6291A04354K23629j9090a42100P255B30447
$$ 70185 136989 -360621 984 9746 -76291 104354 327983 308893 -142100 -134845 230447
12752B42442a02459j24795e8448l4825A24020E5008b68307R6864C41171B6446
$$ 242442 -102459 -227254 -58448 -93273 124020 55008 -268307 -171443 341171 26446
12741g9650p4373A02055c7442A2201a23522A40607J04716a31592a4870l9680A12066
$$ -79650 -154023 102055 -37442 12201 -123522 140607 245323 -131592 -14870 -54550 112066
12729H8078e5977k23398i9115A66020a54606B939J88112a82922D32814a26003
$$ 88078 -55977 -279375 -99115 166020 -154606 2939 191051 -182922 432814 -126003
12718F2150a00295A04796c42524a9217i583k98808G8725c02525J1328a35513B72433
$$ 62150 -100295 104796 -342524 -19217 -9583 -308391 78725 -302525 -291197 -135513 272433
12706a47052b9214C64177a40725B01389d3013B1221i2930A69342M5796F0304Q788
$$ -147052 -29214 364177 -140725 201389 -43013 21221 -92930 169342 215138 60304 69092
12695F9092J02829C5756e4058j5693D13839A39383k5271b35576g6372A09428c20713
$$ 69092 171921 35756 -54058 -69751 413839 139383 114112 -235576 -76372 109428 -320713
12683B91268i4352K1557j53671A91820I2057N5524n5525F239J98242A2681J99188
$$ 291268 -94352 -72795 -226466 191820 92057 147581 92056 6239 204481 12681 211869
12672B11869F3491J12584A4605d0752I5658M2106a09782j21870R6294k4767j34957
$$ 211869 63491 176075 14605 -40752 95658 137764 -109782 -231652 -135358 -160125 -295082
12661b95082A78290b5198C49568d1467A12889l9027M35200A63111N6524a84827
$$ -295082 178290 -25198 349568 -41467 112889 73862 509062 163111 219635 -184827
12650C07721O7186A22868J37793g3206B44705p3429K9790B1809L59478I6463K61857
$$ 307721 374907 122868 260661 -73206 244705 171276 201066 21809 381287 96463 358320
12639C58320q0842q3100J64234H0869J02996b64457f5066B23716I2264k0512K4055
$$ 358320 277478 194378 358612 80869 183865 -264457 -65066 223716 92264 71752 95807
12628I5807k8168d5219O873B74719j31850a58606J5223C53570R0636c0639A4086
$$ 95807 67639 -45219 -38346 274719 142869 -158606 -143383 353570 444206 -30639 14086
12616A5637b0619j76205C647b53546i8493M0928j1395N949B10722I0446b8622
$$ 15637 -20619 -196824 3647 -253546 -98493 -57565 -68960 -63011 210722 90446 -28622
12604i5767j39458E6274K42327A49223N435j755K41973c6471j03932d3357C12056
$$ -95767 -235225 56274 298601 149223 154658 152903 394876 -36471 -140403 -43357 312056
12592D04621C0802J14618e8057A71568a92358C3430J21698b80223f0360J2553
$$ 404621 30802 145420 -58057 171568 -192358 33430 155128 -280223 -60360 -47807
12582d7807r2152B73163j05693p8624a950r8119p0981H8940J31890a03326E1538
$$ -47807 -139959 273163 167470 88846 -1950 -100069 -171050 88940 220830 -103326 51538
12570b24855B47869d56164A40491a68868j622C45922a32382j81701a03234K7551
$$ -224855 247869 -456164 140491 -168868 -170490 345922 -132382 -314083 -103234 -75683
12560g5683k24466A68116a63827A53388C1328O2163a54056B80272g217I5371D6641
$$ -75683 -300149 168116 -163827 153388 31328 93491 -154056 280272 -7217 95371 46641
12548G7075k2638A3735c43975A0419a4038A41448a13851l27664A46339J3649a08229
$$ 77075 54437 13735 -343975 10419 -14038 141448 -113851 -441515 146339 159988 -108229
12536B4232d2850q1371A35507B1177R441J58551l5022m9799b87512F1162K8394
$$ 24232 -42850 -124221 135507 21177 30618 189169 154147 104348 -287512 61162 89556
12525H9556L15091D1679K99143F5547f6805A88149J05579H4072j4358b17248c2945
$$ 89556 404647 41679 340822 65547 -66805 188149 293728 84072 69714 -217248 -32945
12513A37788a68187c0816D6380M26011j94606B0573b13202i1861o6295D0566J74254
$$ 137788 -168187 -30816 46380 472391 277785 20573 -213202 -91861 -158156 40566 214820
12502B14820I1003N307a88888A46474a9268B21063A6390o627N4754N9123M9564
$$ 214820 91003 96310 -188888 146474 -19268 221063 16390 9763 64517 123640 173204
12491A73204N2144C4291d23465B82453c83B32922A16013K3825O5637c8096B38513
$$ 173204 225348 34291 -423465 282453 -383 232922 116013 139838 205475 -38096 238513
12479A04453J2702e5768F2536L401L12625A48541a51469B40276q0149C1697h9713
$$ 104453 117155 -55768 62536 65937 378562 148541 -151469 240276 160127 31697 -89713
12467A34459a65353A59499b5417B52260c18602J12199g0678A84858d4046B68740
$$ 134459 -165353 159499 -25417 252260 -318602 -206403 -70678 184858 -44046 268740
12456I5439a2245k27129Q2708B06307a70406A646a63745L9763C20314b82144h6555
$$ 95439 -12245 -239374 -156666 206307 -170406 1646 -163745 -123982 320314 -282144 -86555
12444A69250d1182A26398a32988B9782h0365B9558a51877A77187a40479j3165
$$ 169250 -41182 126398 -132988 29782 -80365 29558 -151877 177187 -140479 -153644
12434a53644A4419O9265j3631R0597c462j0341j72407K3636r0099I8907m0544
$$ -153644 14419 83684 70053 160650 -3462 -13803 -186210 -162574 -252673 98907 58363
12423E8363e9699A41128a35550q6387A41037b54610A96015b83851A68467a71694
$$ 58363 -59699 141128 -135550 -221937 141037 -254610 196015 -283851 168467 -171694
12412g0377G7513B6641J54229B5559J44477J3799i5708k87662a51704B86443E0104
$$ -70377 77513 26641 180870 25559 170036 183835 -95708 -383370 -151704 286443 50104
12400A3592K33179A15031c21909a09753A5180a54271j35007g8558A47349e6136
$$ 13592 246771 115031 -321909 -109753 15180 -154271 -289278 -78558 147349 -56136
12389e731B87725c14324A70297d6092K2346k01024r0025e064j7226A98689J18080
$$ -5731 287725 -314324 170297 -46092 -23746 -224770 -314795 -5064 -22290 198689 316769
12378C16769d4127q2081J839N0527E0199b27319a07526B0767L57766a55916B0546
$$ 316769 -44127 -126208 -124369 -73842 50199 -227319 -107526 20767 378533 -155916 20546
12366f0637B86667i4449A5652J75563F7431b22918e0190j03375A1397c03409B31908
$$ -60637 286667 -94449 15652 191215 67431 -222918 -50190 -153565 11397 -303409 231908
12354g3250A14876L0858b43192R363K8609j78277A29114C0571Q7991a89053D4263
$$ -73250 114876 145734 -243192 -233829 -205220 -383497 129114 30571 118562 -189053 44263
12342b25787C4565K85063c2964E0813K08556j15766E0273L69044E6374b23371
$$ -225787 34565 319628 -32964 50813 259369 143603 50273 419317 56374 -223371
12331b56244B7397K3856k4211K9558J88458q7349a58977E9646J75723L1630a5237
$$ -256244 27397 51253 27042 56600 245058 157709 -158977 59646 235369 266999 -15237
12319a10020l304D25445j99138j5467a71855A1974J97817c87043l8348F467Q2066
$$ -110020 -113324 425445 226307 210840 -171855 11974 209791 -387043 -425391 6467 88533
12308H8533a09417J752A17579M6333a57835g0947j29607A93498a61690R254A9126
$$ 88533 -109417 -107665 117579 163912 -157835 -70947 -200554 193498 -161690 -152436 19126
12296B11019A0790a20936j48684i0728A26959K11d9776A00122a47315N0643K6236
$$ 211019 10790 -120936 -269620 -90728 126959 127170 -49776 100122 -147315 -96672 -70436
12285g0436l5937F9089J88819D3374h9968J1494A69511b46179D6344L54445A58717
$$ -70436 -106373 69089 257908 43374 -89968 -78474 169511 -246179 46344 400789 158717
12273A01202K40706E1583A6578K25996a26213a508A95773J5208K6759a43244d2128
$$ 101202 341908 51583 16578 242574 -126213 -1508 195773 210981 237740 -143244 -42128
12261A6390c45143B96325a9316A02180R812B8624g6504B29118o6058M0504a45302
$$ 16390 -345143 296325 -19316 102180 111992 28624 -76504 229118 163060 203564 -145302
12249A19211G051M76503j97655a5063G4506J27174l5201h9771B20787r0156R3714
$$ 119211 7051 483554 285899 -15063 74506 201680 166479 -89771 220787 130631 224345
12238B24345c5942A95459J09890e5500B06494J22976B7411A2249K01155e0135
$$ 224345 -35942 195459 305349 -55500 206494 329470 27411 12249 213404 -50135
12227A92549J96479a06462B02857B5003J66626G7363L44225H5227C5408P8738
$$ 192549 389028 -106462 202857 25003 191629 77363 421588 85227 35408 114146
12217A14146K08478q7281J89124q0831c9842A00422m0064j3612F194b22495A26993
$$ 114146 322624 235343 424467 343636 -39842 100422 60358 46746 6194 -222495 126993
12205A66745q14a15342D64677h336C73615A67635o4295J04764a48954I4802J23654
$$ 166745 165931 -115342 464677 -8336 373615 167635 103340 208104 -148954 94802 218456
12194B18456J88870n0144j75303K5015J1424Q6110H7459D2543J16618h1413C3847
$$ 218456 407326 357182 181879 206894 218318 304428 87459 42543 159161 -81413 33847
12182C71988M6220B3301K75722F6617a31456C6101i1650B15567b01573B78330
$$ 371988 418208 23301 299023 66617 -131456 36101 -91650 215567 -201573 278330
12171I0857a1272j71983A12590J29948J56450A73399b82982A53516e3723A05904
$$ 90857 -11272 -183255 112590 242538 398988 173399 -282982 153516 -53723 105904
12160g3167B29532A01213b47508L9010B68372j28240e3207b5795l971A65693a36585
$$ -73167 229532 101213 -247508 -208498 268372 140132 -53207 -25795 -29766 165693 -136585
12148H6888K89478b37312C04583O8454c5534m6066G3927J48807c3409j61496B66396
$$ 86888 376366 -237312 304583 373037 -35534 -81600 73927 222734 -33409 -194905 266396
12136C22988c9401C3852M8349O5496b17387A64059F0565a40358e9996A55905i3295
$$ 322988 -39401 33852 82201 147697 -217387 164059 60565 -140358 -59996 155905 -93295
12124A47020L1985N7962J080c9108A64311c77406M8223A34415m0818R8384K30395
$$ 147020 179005 236967 238047 -39108 164311 -377406 -329183 134415 93597 191981 422376
12113D22376h3297q1437e969o4686A03909c8590a5687j12008A70215A1558c7908
$$ 422376 -83297 -164734 -5969 -70655 103909 -38590 -15687 -127695 170215 11558 -37908
12101B37489G7948L30570j94314a73775B37633a58177A74936c5877B22879I8061
$$ 237489 77948 408518 214204 -173775 237633 -158177 174936 -35877 222879 98061
12090A65227r380f9969A37990a33265A07924j3937i9681l464J2653C06707e6164
$$ 165227 155847 -69969 137990 -133265 107924 93987 -99681 -103145 -90492 306707 -56164
12078d6007F7658J36774C9247b30274I4677g2891A32147b12911D72825R75075
$$ -46007 67658 204432 39247 -230274 94677 -72891 132147 -212911 472825 1447900
12068A447900m45308f6917A75745b72177C8084J03781g8592K0918B8783m575K25926
$$ 1447900 1002592 -66917 175745 -272177 38084 141865 -78592 -57674 28783 24208 250134
12057B50134a29802O3820B63003K03962i7287M1884K4005j26577l77108a52611
$$ 250134 -129802 -65982 263003 466965 -97287 -55403 -31398 -157975 -535083 -152611
12046F3833b20145F3724a95866A87372b02422A25306c39000E0516c15533a29094
$$ 63833 -220145 63724 -195866 187372 -202422 125306 -339000 50516 -315533 -129094
12035A75213K46202A35723a75678M9117j26577h1037A31052a75710F9445J75676
$$ 175213 421415 135723 -175678 -126561 -253138 -81037 131052 -175710 69445 245121
12025B45121b32157Q0323B1150b7679D10800A54286a39274b0344j4686j29855
$$ 245121 -232157 -151834 21150 -27679 410800 154286 -139274 -20344 -35030 -164885
12015a64885A03583j0381l1062j7126K7553J8307J41076b67011A13437D4615h0374
$$ -164885 103583 93202 62140 45014 72567 90874 231950 -267011 113437 44615 -80374
12003d36036H0577N573e0847E8682A1400R2720c24127d5492A99247e3837I6016
$$ -436036 80577 86150 -50847 58682 11400 104120 -324127 -45492 199247 -53837 96016
11991a45321c0217G1789b16041g7025l2655J1298j1801H1490R2372b1629j20402
$$ -145321 -30217 71789 -216041 -77025 -109680 -98382 -110183 81490 173862 -21629 -142031
11980a42031c8793j744j39087C2354d7061D7079K1523a10379A24397J53549b1983
$$ -142031 -38793 -40537 -179624 32354 -47061 47079 68602 -110379 124397 277946 -21983
11968b60697A59505b19535B5361J9292J04741N4592d3556r7632D35964i0058A38892
$$ -260697 159505 -219535 25361 44653 149394 203986 -43556 -141188 435964 -90058 138892
11956g4844k69574F6070b5379A76849b5970j11226K7952H1044l7729Q8357i4840
$$ -74844 -344418 66070 -25379 176849 -25970 -137196 -109244 81044 43315 131672 -94840
11944a88432O1059C25781F4727a8746I2635f478D9069N3289m3791b2300l23976
$$ -188432 -127373 325781 64727 -18746 92635 -6478 49069 102358 58567 -22300 -346276
11933c46276I7375a48539c486B6651A1908l664K12582i4301c9404A13652n600
$$ -346276 97375 -148539 -3486 26651 11908 8244 220826 -94301 -39404 113652 108052
11922A08052J48295i1716E8879b01818A6159d6508j2782e424l45477J50749I2419
$$ 108052 256347 -91716 58879 -201818 16159 -46508 -59290 -5424 -350901 -200152 92419
11910e2635k33276J18331A3705a5203B40163j04374O6756a13246A43470d12579
$$ -52635 -285911 -167580 13705 -15203 240163 135789 202545 -113246 143470 -412579
11899F8583b61348c8113k28856J22454e3167b5675j88205k3063B17288D9518J83815
$$ 68583 -261348 -38113 -266969 -144515 -53167 -25675 -213880 -236943 217288 49518 233333
11888B33333b2888R957B5468b28989f1316D465R2538P530b62908o1809E8847a90027
$$ 233333 -22888 -12931 25468 -228989 -61316 4465 97003 104533 -262908 -324717 58847 -190027
11875A31733i3715o2255m7M3415D9751e5251j16595f0406j11093B65038b20523
$$ 131733 -93715 -155970 -156017 -112602 49751 -55251 -171846 -60406 -171499 265038 -220523
11863a4095A00970b51786A8945K999J15747b12547h6439n2293A12626O4993J30046
$$ -14095 100970 -251786 18945 21944 137691 -212547 -86439 -138732 112626 177619 307665
11852C07665A19923Q4222O2979E5108O4921J01614b54709K5968A5839P0104b79568
$$ 307665 119923 204145 267124 55108 120029 221643 -254709 -228741 15839 85943 -279568
11840a07848j46816E994b31865B39520q6016g7188E921J20388J56049F4984b86577
$$ -107848 -254664 5994 -231865 239520 153504 -77188 5921 126309 282358 64984 -286577
11828C1907Q6390a92976A83660c16752F8071J46251q5998b2732B3734b52757B58989
$$ 31907 118297 -192976 183660 -316752 68071 214322 128324 -22732 23734 -252757 258989
11816B2018b65090b9974r8734E47271a8717j651k5505J2988j5115l87850a34144
$$ 22018 -265090 -29974 -128708 547271 -18717 -20368 -45873 -32885 -48000 -435850 -134144
11804H048K23792D7351m18Q4879Q6174b96337J02189d8615K0506H3275a87911
$$ 8048 231840 47351 46933 131812 217986 -296337 -194148 -48615 -28109 83275 -187911
11792A4385K8615J98119b40941i9090C6043e9409l09198K2024a5692l8710j0802
$$ 14385 43000 241119 -240941 -99090 36043 -59409 -368607 -346583 -15692 -54402 -65204
11781f5204B8715K66085K19961a06640j23898b9278A32732J74753A24377j6391
$$ -65204 28715 294800 514761 -106640 -230538 -29278 132732 307485 124377 107986
11771A07986J28304c3266A38464C6694K76541a84285Q0505l37174A21977f1142
$$ 107986 236290 -33266 138464 36694 313235 -184285 -103780 -440954 121977 -61142
11760G0136c6206q6812J593A23392B6551M2551a04998B22367c25681m3552a71954
$$ 70136 -36206 -123018 -121425 123392 26551 69102 -104998 222367 -325681 -369233 -171954
11748a14780J5044B17304I8173o159R7307h2632H6087b86412B90855b94368a4858
$$ -114780 -99736 217304 98173 92014 189321 -82632 86087 -286412 290855 -294368 -14858
11736c0397A50902m9920a61361j26611J13651N9323p6707J3464O0804M2751p5042
$$ -30397 150902 100982 -161361 -287972 -174321 -114998 -191705 -178241 -117437 -74686 -149728
11725a49728B86500b66222F7832j026J37335c1668A4804d19697J90445a07160
$$ -149728 286500 -266222 67832 66806 204141 -31668 14804 -419697 -229252 -107160
11714e0623a6595l1674j73162A8593K1227b85709A6149c18290D42111A6628b59852
$$ -50623 -16595 -48269 -221431 18593 39820 -285709 16149 -318290 442111 16628 -259852
11702C3009J01647b37178A62193A5075e8636j44300D0922R5842a41658B89777
$$ 33009 134656 -237178 162193 15075 -58636 -202936 40922 136764 -141658 289777
11691a51484D03938A82469F1413a926A58899C2671J529g9396H803O5889j0948
$$ -151484 403938 182469 61413 -1926 158899 32671 34200 -79396 8803 74692 63744
11680F3744L59039a77332l41881B70516p9945G4181a4615A65428J5929J47653
$$ 63744 422783 -177332 -519213 270516 190571 74181 -14615 165428 181357 329010
11670C29010c1988G616K7572a82982C6930i0807A6321i3376k61190A10375a53454
$$ 329010 -31988 7616 35188 -182982 36930 -90807 16321 -93376 -354566 110375 -153454
11658c9223r9281I0209J27127F3586P8336J25997n8870B9065N1413a5291A16450
$$ -39223 -138504 90209 217336 63586 141922 267919 209049 29065 80478 -15291 116450
11646a30686M460C4887J18483C7118a37094A1124K16674d6465n3684C12561k1314
$$ -130686 -126226 34887 153370 37118 -137094 11124 227798 -46465 -100149 312561 291247
11635B91247c04388A27928b51096B19514b71870C2562O3380a86092H9121K0114
$$ 291247 -304388 127928 -251096 219514 -271870 32562 95942 -186092 89121 109235
11625A09235J93639f3743o6850C79597d4254B32206a09628F408K6035c27094j42573
$$ 109235 302874 -63743 -130593 379597 -44254 232206 -109628 6408 32443 -327094 -469667
11614d69667A10093f9710I711K81059q4350a86255k4343k2433A94858b4580k2662
$$ -469667 110093 -69710 9711 290770 206420 -186255 -210598 -233031 194858 -24580 -47242
11603d7242A09393n2658N6564l1144b3008I5910L1987b03120K1411M2545k80914
$$ -47242 109393 56735 113299 82155 -23008 95910 127897 -203120 -181709 -139164 -420078
11592d20078J49228j43140a59687D4704L5932L13192b96850A47411a7023E5227
$$ -420078 -270850 -413990 -159687 44704 80636 393828 -296850 147411 -17023 55227
11581E2282Q655B5534O2229K09341h4001A58170a43331A04328C756M4397J92657
$$ 52282 60937 25534 87763 297104 -84001 158170 -143331 104328 3756 48153 240810
11570B40810a41226j49713h0845C22777A27926F2442A8446L21299A24078A4399
$$ 240810 -141226 -290939 -80845 322777 127926 62442 18446 339745 124078 14399
11559A39940k6901c33364C01303B1952J87623a04053a4520A22793b58452D01256
$$ 139940 113039 -333364 301303 21952 209575 -104053 -14520 122793 -258452 401256
11548A68673c09090B59217n6816b42451C2542K22657A7977a91072R3822a7489
$$ 168673 -309090 259217 202401 -242451 32542 255199 17977 -191072 -97250 -17489
11537A60243a86494q9511d7533k2479A76897l6870f735j09597A56292N5197l8930
$$ 160243 -186494 -276005 -47533 -70012 176897 140027 -6735 -116332 156292 211489 172559
11526A72559a75372b6777B57151e955A42239J58843H108a41633M3415H1578J41723
$$ 172559 -175372 -26777 257151 -5955 142239 301082 8108 -141633 -98218 81578 223301
11515B23301c4897C00878A48177E9422j0544K50065C4155K36360a18417K1677
$$ 223301 -34897 300878 148177 59422 48878 298943 34155 270515 -118417 -96740
11505i6740c5963A6746e686j13043E8936d8982A18180J17908C7118c16754B33739
$$ -96740 -35963 16746 -5686 -118729 58936 -48982 118180 236088 37118 -316754 233739
11493E1106c680j15730a4829B0924L4898B601M5303f4941B49775N9579I9104J64316
$$ 51106 -3680 -119410 -14829 20924 55822 2601 47904 -64941 249775 309354 99104 263420
11481B63420i4880C64587A73097N6201q6003J31851J18609j9740A21192J02762
$$ 263420 -94880 364587 173097 229298 143295 275146 393755 374015 121192 223954
11471B23954G4757J39309j6000c2385F514O7930J79358G3146L4694J97454H8079
$$ 223954 74757 214066 198066 -32385 6514 74444 253802 73146 107840 305294 88079
11459I0252p005A4112J17087a45499A21692m5803K59531F5998N787c96566A82807
$$ 90252 83247 14112 131199 -145499 121692 75889 335420 65998 71785 -396566 182807
11447E6567B3345J79828a320A44226a375E8283L7446e771n9128A89073A9163a78749
$$ 56567 23345 203173 -1320 144226 -1375 58283 95729 -5771 -64899 189073 19163 -178749
11434A44751b21948B18241J27263A71202a35169R510n5600a2318F7132J32110
$$ 144751 -221948 218241 345504 171202 -135169 -125659 -181259 -12318 67132 199242
11424A99242a68193A88602C7287c22771H5776i2151B69762I9339a34003B47216
$$ 199242 -168193 188602 37287 -322771 85776 -92151 269762 99339 -134003 247216
11413a19494o2959B35747R2262j45693m4488m6139J23257F608b8091q7176B66832
$$ -119494 -182453 235747 328009 182316 137828 91689 214946 6608 -28091 -115267 266832
11401a68090B7939J86407q4709a29301j20288D5603J23403g8610A2147O5767a61342
$$ -168090 27939 214346 129637 -129301 -249589 45603 169006 -78610 12147 77914 -161342
11389A82038d2533j03273N6747F140J18805M8875a87522R307K5874A2797J11897
$$ 182038 -42533 -145806 -89059 6140 124945 173820 -187522 -178215 -152341 12797 124694
11378A24694a61557A5467b0833G4688K19681r9001a80840A48113c5043G5327a97021
$$ 124694 -161557 15467 -20833 74688 294369 195368 -180840 148113 -35043 75327 -197021
11366d0806j33275A19028a15133k43308c7673r7086N1484b1708E7688L5966b52199
$$ -40806 -174081 119028 -115133 -358441 -37673 -134759 -83275 -21708 57688 93654 -252199
11354c06406P7383D8568d0776A78623e5175m6197p3258A22389a08492B6830b24917
$$ -306406 -229023 48568 -40776 178623 -55175 -101372 -174630 122389 -108492 26830 -224917
11342a78350O4506j12414i8871L4909A89889e8959G2628e6244C9831K2957c37856
$$ -178350 -113844 -226258 -98871 -63962 189889 -58959 72628 -56244 39831 62788 -337856
11330g0203c4323I7173e9256A97435E6641b38300A17200c06504A21246J50995
$$ -70203 -34323 97173 -59256 197435 56641 -238300 117200 -306504 121246 272241
11320B72241a8717A09467n1596B7849R4710m3019a25706q2231k0953j81205D1693
$$ 272241 -18717 109467 57871 27849 122559 79540 -125706 -207937 -228890 -410095 41693
11308i8136k4520A8321e237G042i7531J7547j13438M2822j32774F4563g4234D7412
$$ -98136 -122656 18321 -5237 7042 -97531 -79984 -193422 -150600 -283374 64563 -74234 47412
11295a89303h6624B32700c29519D9523r774K7803a6912D3617J41077d0090J7392
$$ -189303 -86624 232700 -329519 49523 39749 67552 -16912 43617 184694 -40090 -22698
11284b2698A93313a76739A52794o1797a37760B68110c87216A26292c24678a61067
$$ -22698 193313 -176739 152794 90997 -137760 268110 -387216 126292 -324678 -161067
11273A48976L7862d4183G4507g3069E6012b83128B7842e5937n7638n1730B11165
$$ 148976 186838 -44183 74507 -73069 56012 -283128 27842 -55937 -113575 -165305 211165
11261A34130a85098k77673J86636j28013a03271Q37K6025G6522J90277E667e2108
$$ 134130 -185098 -462771 -276135 -404148 -103271 -102434 -76409 76522 266799 5667 -52108
11249a15355b6883a0258A9150b57327D34904c01588e0449C90293c9805A32573
$$ -115355 -26883 -10258 19150 -257327 434904 -301588 -50449 390293 -39805 132573
11238C2115e6193A59164a48449A05074C857J05128a31161k02297L4704I269K13225
$$ 32115 -56193 159164 -148449 105074 3857 108985 -131161 -333458 -298754 9269 222494
11227B22494a08873A66339b52668A05900a79996J9907j59590J33006B63165f0967
$$ 222494 -108873 166339 -252668 105900 -179996 -160089 -319679 -186673 263165 -60967
11216b35154J16789o5059B82794j18724j3368C3872b34374d7590A9883c23406
$$ -235154 -118365 -183424 282794 164070 150702 33872 -234374 -47590 19883 -323406
11205f7490B89729j5820H6042O5224h3822L7531j58105R5130B0947J38799a82918
$$ -67490 289729 273909 86042 151266 -83822 -46291 -204396 -109266 20947 159746 -182918
11193C22173a75875A75954J9549K656P9108a08250K5599j61411i8469r864j68482
$$ 322173 -175875 175954 195503 198159 277267 -108250 -82651 -244062 -98469 -108333 -276815
11182b76815A68578a13367f648A06627g9867c5612k95205A44185E7332a33390
$$ -276815 168578 -113367 -6648 106627 -79867 -35612 -330817 144185 57332 -133390
11171a19125M9888j37266L3742L9607j02117Q5653A28331j8951d57307a00103
$$ -119125 -69237 -206503 -172761 -133154 -235271 -149618 128331 109380 -457307 -100103
11160c2240k17963a19229K9867L9043A24686J04699a88889B99370a59338f559
$$ -32240 -250203 -119229 -89362 -50319 124686 229385 -188889 299370 -159338 -6559
11149c5674F84477a37267j22674a142j66280j2340E0563J31375D7424e952B3438
$$ -35674 684477 -137267 -259941 -1142 -167422 -179762 50563 181938 47424 -5952 23438
11137f038C73087I1998G106a98491a1754k0611j08429H8671J94420I2124D434
$$ -6038 373087 91998 7106 -198491 -11754 -32365 -140794 88671 283091 92124 4434
11125a26605E3473J58532b92382A14631g9836j39730b4695C45517J49986b24465
$$ -126605 53473 212005 -292382 114631 -79836 -219566 -24695 345517 495503 -224465
11114H7447K96237d4883A06093L2134D9168J0322f653A61716n5491i8423p9679
$$ 87447 383684 -44883 106093 138227 49168 59490 -6653 161716 106225 -98423 -178102
11103a78102j12609A34825L84732A04238M987J29257K06108j46804o3589C3427
$$ -178102 -290711 134825 519557 104238 109225 238482 444590 297786 234197 33427
11092B36128j12873K75483a6903C46007A46351K24016C0564M21292j22658q4544
$$ 236128 123255 398738 -16903 346007 146351 370367 30564 451856 329198 244654
11082B44654J45772r6775e5207B30627J55772I1473J59358M9969f4741C03323
$$ 244654 390426 293651 -55207 230627 386399 91473 250831 300800 -64741 303323
11071B08377K76477M3761k24527E5409J87975J96931A37316L9885M58457k61307
$$ 208377 484854 528615 304088 55409 243384 440315 137316 177201 635658 374351
11061C74351K3149m3562R5405j01843j1840K78372j44464K40111j10590r2627
$$ 374351 397500 353938 449343 347500 335660 614032 469568 709679 599089 506462
11051E06462L39995j86199r0048K53737j11619k04981j87n7263K22350l13095
$$ 506462 846457 660258 570210 823947 712328 507347 507160 449897 672247 359152
11041C59152L2845K33986J49384l29392q2749N42644k14602l21988N3262j16824
$$ 359152 391997 625983 775367 445975 363226 905870 691268 369280 422542 305718
11031C05718K52527j56714K62858k89189J6456J54831K00308R4126l35608K16864
$$ 305718 558245 401531 664389 375200 391656 546487 746795 840921 505313 722177
11021G22177l3714m6861B52666J36757J75040M25180l49899j70470L48096k29245
$$ 722177 688463 641602 252666 389423 564463 989643 639744 469274 817370 588125
11011E88125m3084R7408k59119N992J94945p2913J04378j2126k38454j74256K80089
$$ 588125 545041 642449 383330 389322 584267 511354 615732 603606 365152 190896 470985
11000D70985O6845k5854O15169D39689K88181C45386J45964J17656k3532k02305
$$ 470985 537830 511976 1127145 439689 727870 345386 491350 609006 585474 383169
10990C83169K10458J72745J77098k16821P9275j1298R8163l70047L15796J86197
$$ 383169 593627 766372 943470 726649 805924 794626 892789 522742 838538 1024735
10980A024735K24645k26566K77216R1954K40694K02357K63367j72876J94061L83703
$$ 1024735 1249380 1022814 1300030 1391984 1632678 1835035 2098402 1925526 2119587 2503290
10970B503290L3801j54830k96371m40539J97010l03637r0122k53965J46J3159
$$ 2503290 2537091 2382261 2085890 1645351 1842361 1538724 1448602 1194637 1194783 1207942
10960A207942J03691l21993J92881L8065O077k85733P8567l94907M76841m16585
$$ 1207942 1311633 989640 1182521 1220586 1226663 940930 1019497 624590 1101431 684846
10950F84846k17456J38073j09188k31924J02370b27655I2182L61098A87745J1805
$$ 684846 467390 605463 496275 264351 366721 -227655 92182 453280 187745 199550
10940A99550b45515A77342J57866j41916l7953C5352c4218C23873A52499l9920
$$ 199550 -245515 177342 335208 193292 155339 35352 -34218 323873 152499 112579
10930A12579d9085E8368a55895G8474C0471L51568H0877J95831a26578D2741a78740
$$ 112579 -49085 58368 -155895 78474 30471 382039 80877 276708 -126578 42741 -178740
10918a21599J3046j73409g845B3526a05442a0218m2653k8945A72920K0624d68549
$$ -121599 -108553 -281962 -7845 23526 -105442 -10218 -52871 -81816 172920 193544 -468549
10906D475J47013F5503a38861A25154c45282a02160B87360A8659K72232a19068
$$ 4475 151488 65503 -138861 125154 -345282 -102160 287360 18659 290891 -119068
10895b06813h349E0497a32921B12740a51875A22032d7294m5815B4712a93395j9792
$$ -206813 -8349 50497 -132921 212740 -151875 122032 -47294 -93109 24712 -193395 -213187
10884b13187Q7584I5777d1378A37414h5535j10652B20214a14954A09977d24656
$$ -213187 -125603 95777 -41378 137414 -85535 -196187 220214 -114954 109977 -424656
10873E7483b8065k61913b5294A40422J42019I6142b13415i8656k84739c0400p949
$$ 57483 -28065 -289978 -25294 140422 282441 96142 -213415 -98656 -383395 -30400 -38349
10862c8349m4875j6171L6399R134q4303C2523J1711a43292a8182r01F0349j8533
$$ -38349 -83224 -99395 -62996 -53862 -138165 32523 44234 -143292 -18182 -19083 60349 41816
10850D1816a12297j42446h0809l86692f8110j26718A02038g4440A42792a01181
$$ 41816 -112297 -254743 -80809 -467501 -68110 -194828 102038 -74440 142792 -101181
10839c5300o4166j37697c1376a2243p5009C55754a0959A20939C6742a69328D0060
$$ -35300 -99466 -237163 -31376 -12243 -87252 355754 -10959 120939 36742 -169328 40060
10827A70245j6970K00565c8995k41780J10483D3763A0020K14331H4293J10203
$$ 170245 153275 353840 -38995 -280775 -170292 43763 10020 224351 84293 194496
10817A94496m0093b49145A69908D8180L88358A47970a57035r7438g9473F5995
$$ 194496 154403 -249145 169908 48180 436538 147970 -157035 -254473 -79473 65995
10806H4765O7563a86842K5490B8885J43231m0382d0282k86340n2197a51952b3004
$$ 84765 152328 -186842 -161352 28885 172116 131734 -40282 -326622 -378819 -151952 -23004
10794a03824j73332I9430J97556f9846j63507B08724A0801J0285c9652m2933q5714
$$ -103824 -277156 99430 296986 -69846 -233353 208724 10801 21086 -39652 -82585 -168299
10783a68299O0378k14915A09225e3370I9451k414K68356f1715H6212b66955a8990
$$ -168299 -107921 -322836 109225 -53370 99451 97037 365393 -61715 86212 -266955 -18990
10771A65250b83301D04352a54226d4859B71174a0446j05083A28175i7131j24526
$$ 165250 -283301 404352 -154226 -44859 271174 -10446 -115529 128175 -97131 -221657
10761b21657D7034a23764n8092B30527b84089h8442C59955b92483A52393d7714
$$ -221657 47034 -123764 -181856 230527 -284089 -88442 359955 -292483 152393 -47714
10750B15958b87919i7341H9424j7936J21285I2533e9672A44551F2432R3271a60185
$$ 215958 -287919 -97341 89424 71488 192773 92533 -59672 144551 62432 155703 -160185
10738b3880c220C34749b73795P5202j57319a15372p5130j55343I381b1061j96656
$$ -23880 -3220 334749 -273795 -198593 -355912 -115372 -190502 -345845 9381 -21061 -217717
10727b17717Q2140r8576e3714k0296j09263p1540j27569B14148a57853A6338N6023
$$ -217717 -135577 -234153 -53714 -74010 -183273 -254813 -382382 214148 -157853 16338 72361
10716G2361e9489k35759i2208C86218a34899B4038O7419a4155A67788i7382n4636
$$ 72361 -59489 -295248 -92208 386218 -134899 24038 91457 -14155 167788 -97382 -152018
10705a52018A71340e1288j10622A18633a21918J1337J7525A9496M28921B17060
$$ -152018 171340 -51288 -161910 118633 -121918 -110581 -93056 19496 448417 217060
10694g4817F3482J205b99900d0331G0421b01986h6734B10081r9647Q0696l9304
$$ -74817 63482 64687 -299900 -40331 70421 -201986 -86734 210081 110434 191130 151826
10683A51826c14998d0661p5233C18611b03668I3183b29018m2952k5136a16542
$$ 151826 -314998 -40661 -115894 318611 -203668 93183 -229018 -271970 -297106 -116542
10672I4606b70680C3383M6167a63964O9095j59143L4301A63371e7647k59020B39870
$$ 94606 -270680 33383 79550 -163964 -94869 -254012 -219711 163371 -57647 -316667 239870
10660a58009A59348a98074G2119J53861a24743j20415K5798A40638e75207b29047
$$ -158009 159348 -198074 72119 225980 -124743 -245158 -219360 140638 -575207 -229047
10649e1736C369i3367k48012B76978n9395J76692a25508j57802f131m184r3841
$$ -51736 3369 -93367 -341379 276978 217583 394275 -125508 -283310 -6131 -10315 -104156
10638a04156A40114c47358A23168a02316B27353a37748b7033D39856a32726c6504
$$ -104156 140114 -347358 123168 -102316 227353 -137748 -27033 439856 -132726 -36504
10627F9517h6430q8490c2162A81120B3789b332j02091A86767h3334A2916a3388
$$ 69517 -86430 -174920 -32162 181120 23789 -2332 -104423 186767 -83334 12916 -13388
10615F0763a12410A14787K455b12047a1654n1921N767p2523K3630j12830k3025
$$ 60763 -112410 114787 117242 -212047 -11654 -63575 -57808 -130331 -106701 -219531 -242556
10604b42556h5917I2937k9630b2795j96007J05615j34192A79910o042a03509l35236
$$ -242556 -85917 92937 63307 -22795 -218802 -113187 -247379 179910 173868 -103509 -438745
10593d38745A76198B9776a18241B6201a02225o5453c0945l2313C1675b0910p8061
$$ -438745 176198 29776 -118241 26201 -102225 -167678 -30945 -63258 31675 -20910 -98971
10582i8971F6838c88628J57904F9255k5938i6544k3420B83740c47722B16256a53892
$$ -98971 66838 -388628 -230724 69255 43317 -96544 -119964 283740 -347722 216256 -153892
10570b2660o7344J4686B01309B8523a6745m60339f8630B42542A7887J61094a30329
$$ -22660 -90004 -75318 201309 28523 -16745 -477084 -68630 242542 17887 178981 -130329
10558C0725b8418G2704c24698R6674p4709B53860a23015B68482j6042h980l23515
$$ 30725 -28418 72704 -324698 -228024 -302733 253860 -123015 268482 252440 -8980 -332495
10547c32495J26188C19921a3392j05999B92153a60625g6146j82693a0355H7893
$$ -332495 -206307 319921 -13392 -119391 292153 -160625 -76146 -258839 -10355 87893
10536c29654a61585K3146a2326l05334B81706a0702o7614k20211A53137b4753
$$ -329654 -161585 -138439 -12326 -317660 281706 -10702 -78316 -298527 153137 -24753
10525e4373C0510a41018j39236A99191g8360a849p9018E7448b49150a1567j90103
$$ -54373 30510 -141018 -280254 199191 -78360 -1849 -80867 57448 -249150 -11567 -201670
10514b01670J4496E4379b32343N9267j7110f237A7995L1125F751b22419j95402
$$ -201670 -187174 54379 -232343 -173076 -190186 -6237 17995 49120 6751 -222419 -417821
10503d17821i9445j5963d1863H9325l3866i5385b9293A36834b74877d9652k60485
$$ -417821 -99445 -115408 -41863 89325 55459 -95385 -29293 136834 -274877 -49652 -310137
10492c10137B77999E1711N0144f5000p612A50395J35489J43479r5274l3818G8011
$$ -310137 277999 51711 101855 -65000 -72612 150395 285884 429363 334089 300271 78011
10480B80453L6937j24242Q455P4199H4938F239a12202B67180a62156g8193q5346
$$ 280453 317390 193148 201603 275802 84938 6239 -112202 267180 -162156 -78193 -163539
10469a63539I5889d7653A88J79227H9377A4948a36345N6794A63638m8837f7459
$$ -163539 95889 -47653 188 179415 89377 14948 -136345 -79551 163638 114801 -67459
10457g6615k25245a26813l3023J5295r4458M3806K6390D25523C3615J989b48059
$$ -76615 -301860 -126813 -159836 -144541 -238999 -195193 -168803 425523 33615 35604 -248059
10445B22683g2478B02659I3352J15243a60863L3506A88592a25355K0873B01874
$$ 222683 -72478 202659 93352 208595 -160863 -127357 188592 -125355 -104482 201874
10434A86375h1887A2015R5287a07903B24544a05257j81301A21461b2618B57331
$$ 186375 -81887 12015 107302 -107903 224544 -105257 -286558 121461 -22618 257331
10423b68736j16752H7043N6281a22967j07751J13479B43994E1257M9893c0977
$$ -268736 -385488 87043 143324 -122967 -230718 -117239 243994 51257 101150 -30977
10412F690R1958B3198c13538A62073f4783k8402q5483A30582D8903P6029J99425
$$ 6690 98648 23198 -313538 162073 -64783 -93185 -178668 130582 48903 124932 324357
10401C24357A3068a29018K7758B61736a46886o397j64585a35421j2576G9935b81905
$$ 324357 13068 -129018 -101260 261736 -146886 -153283 -317868 -135421 -147997 79935 -281905
10389b90141a7146C475a33766B44517j13204n5667b0139B63931f7747C13851A15712
$$ -290141 -17146 3475 -133766 244517 131313 75646 -20139 263931 -67747 313851 115712
10377C24168M9814B4994J66684o2500N8441a7291B44447B4742J99865O8878C5995
$$ 324168 373982 24994 191678 129178 187619 -17291 244447 24742 224607 293485 35995
10365D33180M9296k25783l6457F0861O01662l24755p9721a79930B9161M2841h6027
$$ 433180 482476 256693 220236 60861 662523 337768 258047 -179930 29161 72002 -86027
10353D50084k14794n6582J45303N1645L43678A33950J22637a4735A76656D9546
$$ 450084 235290 178708 324011 375656 719334 133950 256587 -14735 176656 49546
10342B6812K38373K0532L9028l7778j4723a59965B76169H9119m1015N0851j2645
$$ 26812 265185 285717 324745 286967 272244 -159965 276169 89119 48104 98955 86310
10331H6310J0849J2226J61053c99161B02659p2155M5367a74462A20204J3849O562
$$ 86310 97159 109385 270438 -399161 202659 130504 175871 -174462 120204 134053 140615
10320A40615k3866L12000B12328H4119a56005a7371A06073m3175b12096I738i8578
$$ 140615 116749 428749 212328 84119 -156005 -17371 106073 62898 -212096 9738 -98578
10308a3404A22818a40694c5603A09383n1946a95610A18308a76543F6119c1192
$$ -13404 122818 -140694 -35603 109383 57437 -195610 118308 -176543 66119 -31192
10297B78172H8153I512P1585b49758B45886q1965A3543b04992R2778l3037M3655
$$ 278172 88153 9512 81097 -249758 245886 163921 13543 -204992 -112214 -145251 -101596
10286a01596B02444e58o4431j22415h4955j5858a6417A24899p634f6511c1071
$$ -101596 202444 -558 -64989 -187404 -84955 -100813 -16417 124899 117265 -66511 -31071
10274C9787M0918j9246j028K01788g5606C002J69792k9329n3386d363m7664E8709
$$ 39787 80705 61459 60431 262219 -75606 3002 172794 143465 90079 -4363 -52027 58709
10261a82715A5962b3545D17490d176E41474F6109K80832A33492g6239a2426A05680
$$ -182715 15962 -23545 417490 -4176 541474 66109 346941 133492 -76239 -12426 105680
10249i1050A61931L29607A91511b2354k3044B65679i148r8472G5674P6908b0682
$$ -91050 161931 491538 191511 -22354 -45398 265679 -9148 -107620 75674 152582 -20682
10237a9480l1348B64045b50132I2724a42570B28649a12583m2425B07589c11594
$$ -19480 -50828 264045 -250132 92724 -142570 228649 -112583 -155008 207589 -311594
10226b33703A00376N091A954L45256c76575B37833b21438B60170b1058C4946a88421
$$ -233703 100376 105467 1954 347210 -376575 237833 -221438 260170 -21058 34946 -188421
10214a1694j01866k61804Q5790a10866k26660A84129b42117e4430k1653J2181
$$ -11694 -113560 -375364 -289574 -110866 -337526 184129 -242117 -54430 -76083 -63902
10204f3902k1999C57954c46217J44091l7478e3626j61560f1906A02659B7579K0621
$$ -63902 -85901 357954 -346217 -202126 -239604 -53626 -215186 -61906 102659 27579 48200
10193D8200c97172A22855b32557E9981J8466a78268c7458m2847A60170d7114j98706
$$ 48200 -397172 122855 -232557 59981 78447 -178268 -37458 -80305 160170 -47114 -245820
10182b45820a15850a6643A18321b30237j04759B97881d3352l65519A11748d17699
$$ -245820 -115850 -16643 118321 -230237 -334996 297881 -43352 -408871 111748 -417699
10171d5073l09331k0288J25643n2604G110J8519a23988F2926e0390j0382B11265
$$ -45073 -354404 -374692 -249049 -301653 7110 25629 -123988 62926 -50390 -60772 211265
10159G3909f5499A0864a9471A25602k6362C222J53350J0475d5098o9994r1627
$$ 73909 -65499 10864 -19471 125602 99240 3222 156572 167047 -45098 -115092 -206719
10148b06719J8566K3641j4276P3028L9298k42290I9653k2477d62195E9371i205
$$ -206719 -188153 -164512 -178788 -105760 -66462 -308752 99653 77176 -462195 59371 -9205
10136e1695B24379J8615a31775I5141L1266L2140c63087B27926a8648j26290L0016
$$ -51695 224379 242994 -131775 95141 126407 158547 -363087 227926 -18648 -144938 -114922
10125a14922A28458a01563A06213a70476G2045J8334b1918j69515j01594D914
$$ -114922 128458 -101563 106213 -170476 72045 90379 -21918 -191433 -293027 4914
10114d15819g9442m0498B59028G0902J00794J23934d6084j48591D8226c0032B18404
$$ -415819 -79442 -119940 259028 70902 171696 295630 -46084 -194675 48226 -30032 218404
10102B53795b43850K9302F8917B2951c05870b0619A65062b20689A02073a34243
$$ 253795 -243850 -214548 68917 22951 -305870 -20619 165062 -220689 102073 -134243
10091a87962m33A09338F643a980m10690P472R7487a47050k1519e0598E0001a24334
$$ -187962 -188395 109338 6643 -1980 -412670 -405198 -307711 -147050 -168569 -50598 50001 -124334
10078c03928J06113C45367A09361G247b80308A6110a1141o901r5315L9876r7294
$$ -303928 -197815 345367 109361 7247 -280308 16110 -11141 -18042 -113357 -73481 -170775
10067a70775o3773H8364b32008M1391F8741J33943A00536c71837C7412O0336b21431
$$ -170775 -234548 88364 -232008 -190617 68741 202684 100536 -371837 37412 97748 -221431
10055B62320f7952j49677k9066k73F9936a80938A48644b3964B37240F430a37875
$$ 262320 -67952 -217629 -246695 -246968 69936 -180938 148644 -23964 237240 6430 -137875
10043e6642F3783L14339H4299J20654I2325l071g3114k75354a01022J4023A16468
$$ -56642 63783 378122 84299 204953 92325 89254 -73114 -348468 -101022 -86999 116468
10031b09036f5139M386o1801A12342d18738A07650l7582a13713k85803P7593k49550
$$ -209036 -65139 -60753 -122554 112342 -418738 107650 70068 -113713 -399516 -321923 -571473
10020e71473E8443a79259m7027N7057F1991i6405j08567B48863g364j93117J7521
$$ -571473 58443 -179259 -226286 -169229 61991 -96405 -204972 248863 -7364 -200481 -182960
10009a82960k41453j24256H2847a56486C586b14996A46790b53920H3837l0382
$$ -182960 -424413 -548669 82847 -156486 3586 -214996 146790 -253920 83837 53455
9999E3455b07025q8860g6478K8410C41026j69040p3960M795K56083a38332j45494
$$ 53455 -207025 -295885 -76478 -48068 341026 171986 98026 102821 358904 -138332 -283826
9988b83826f5803K6045j3138k3083A32640c5955A58510h4379k3218C6762f0871
$$ -283826 -65803 -39758 -52896 -75979 132640 -35955 158510 -84379 -107597 36762 -60871
9976G3239a83059J4415I4700c27548A66039b1776B94028A9553a06658J390E438
$$ 73239 -183059 -168644 94700 -327548 166039 -21776 294028 19553 -106658 -105268 5438
9964a62594C8231i5572k1162I2986K11184a85193C4437j1484m578F661f8847L3444
$$ -162594 38231 -95572 -116734 92986 304170 -185193 34437 22953 18375 6661 -68847 -35403
9952c5403q0405m2453B21770B9273b34476j57426N8276d9270q0946l7709f7828
$$ -35403 -115808 -158261 221770 29273 -234476 -391902 -333626 -49270 -130216 -167925 -67828
9940B10056B3894b8771l6597j11760B03744a76325A33451b50753B21853f9485
$$ 210056 23894 -28771 -65368 -177128 203744 -176325 133451 -250753 221853 -69485
9929c2660C91b10974k45999J94883e5665D2904J77554A5028g4548b1150B78625
$$ -32660 391 -210974 -456973 -262090 -55665 42904 220458 15028 -74548 -21150 278625
9917a07206K3045j43371P9346M6345H1617d6895B41535B827J69082k0112c92388
$$ -107206 -84161 -227532 -148186 -101841 81617 -46895 241535 2827 171909 151797 -392388
9905a28028A52532a41638m9015A3408c61820J76236e5467D1441a42509p3391A0027
$$ -128028 152532 -141638 -190653 13408 -361820 -185584 -55467 41441 -142509 -215900 10027
9893b9476p3028q4480a2410o1099A9932a29231g146m02086a98331m4528d7417
$$ -29476 -102504 -186984 -12410 -73509 19932 -129231 -7146 -409232 -198331 -242859 -47417
9881a83396g1739o95j36571J1028j07936G1942L30241b27743e0140p1193l6185
$$ -183396 -71739 -72434 -209005 -197977 -305913 71942 402183 -227743 -50140 -121333 -157518
9870a57518b7330A16364a32604b0438j60900A44459b13647o4383h1287q9724h1138
$$ -157518 -27330 116364 -132604 -20438 -181338 144459 -213647 -278030 -81287 -171011 -81138
9858H5273i1308a962j44668j3488g000E7180a18405N0458A33675h8593j60592
$$ 85273 -91308 -1962 -146630 -160118 -7000 57180 -118405 -67947 133675 -88593 -249185
9847b49185g4677j57323B9042L7571O9563D7906e8352O568k23243G389c96781
$$ -249185 -74677 -232000 29042 66613 136176 47906 -58352 -51784 -275027 7389 -396781
9835b59825A10574b84041O5972I518i0024k23919b0582b157A23099h7413B54125
$$ -259825 110574 -284041 -218069 9518 -90024 -313943 -20582 -2157 123099 -87413 254125
9823a8137j34370j73254B1039a76487c315j48547I3807j2606b46799B71848i5171
$$ -18137 -152507 -325761 21039 -176487 -3315 -151862 93807 81201 -246799 271848 -95171
9811D9571b73847B58747c3426B3784b49596K3545O8273j73248C05162j41622f3968
$$ 49571 -273847 258747 -33426 23784 -249596 -226051 -157778 -331026 305162 163540 -63968
9799a79094F3401g8607A4826b00756R5760p1401F5745O4611g605m1339m8725C0621
$$ -179094 63401 -78607 14826 -200756 -104996 -176397 65745 130356 -7605 -48944 -97669 30621
9786A3459a37480j69151A73231d1439B29244F2746b84436e0126j12829n0764j46072
$$ 13459 -137480 -306631 173231 -41439 229244 62746 -284436 -50126 -162955 -213719 -359791
9775c59791j20008b349j58902n3674a7184j55519e8878K3322j44086C03362a31017
$$ -359791 -479799 -2349 -161251 -214925 -17184 -172703 -58878 -35556 -179642 303362 -131017
9763f7162C700J93662J86301f7015A5884A758J61279a06164A7925f1784p5750
$$ -67162 3700 197362 383663 -67015 15884 1758 163037 -106164 17925 -61784 -137534
9752a37534L7104A9494b44327J17524j23908A28660a37557A73533M7373q030c15124
$$ -137534 -100430 19494 -244327 -126803 -250711 128660 -137557 173533 220906 212876 -315124
9740e13j00104j84205A2125M4939A9190D14h38p6312m235B11071g7605B37352
$$ -513 -100617 -284822 12125 57064 19190 414 -838 -77150 -81385 211071 -77605 237352
9727c70770C5438o260M5875a75288B38018k6709f6538k70934A17319n052d3357
$$ -370770 35438 29178 75053 -175288 238018 211309 -66538 -337472 117319 112267 -43357
9715A4259a23430b4809p1973j23381B7592l28M4695a18957c5040j36266O6553
$$ 14259 -123430 -24809 -96782 -220163 27592 27264 71959 -118957 -35040 -171306 -104753
9704a04753A27811J44580A431a67958N6141k38834L0756A27849i8685R650o626
$$ -104753 127811 272391 1431 -167958 -111817 -350651 -319895 127849 -98685 -89035 -95661
9693i5661j19077n1835G2539i8636j32280L6124k96599I4588a17647L9111n448
$$ -95661 -214738 -266573 72539 -98636 -230916 -194792 -491391 94588 -117647 -78536 -83984
9682h3984k02742M3924J15596q7011l05108G1703i4908A28641d51809f9541C1896
$$ -83984 -286726 -242802 -127206 -214217 -519325 71703 -94908 128641 -451809 -69541 31896
9670a2108c707k98368J40131j11269b3988p1255E5131e4568A32092k9243f9560
$$ -12108 -3707 -302075 -161944 -273213 -23988 -95243 55131 -54568 132092 102849 -69560
9658a20831E8589k0829b34524i1533j38488j82909B43769A04191a52113k53449
$$ -120831 58589 37760 -234524 -91533 -230021 -412930 243769 104191 -152113 -405562
9648d05562J69529E1960a27739A17758a65583e2152j071C21460A33517b92911
$$ -405562 -236033 51960 -127739 117758 -165583 -52152 -53223 321460 133517 -292911
9637a15494B9338a1743j79561G7150A3175c08154J40458A68911a5993D0620e0593
$$ -115494 29338 -11743 -191304 77150 13175 -308154 -167696 168911 -15993 40620 -50593
9625H1926L0633a50185j53663Q0047P3449B1899O1035K70365h6609H0996d981
$$ 81926 112559 -150185 -303848 -223801 -150352 21899 82934 353299 -86609 80996 -4981
9613B64835b2009l14504A8094a67442L3768e6258O09o6969A45683k8410C4287
$$ 264835 -22009 -336513 18094 -167442 -133674 -56258 -55649 -122618 145683 117273 34287
9601a59891A36474C6974L1633a2000p6245l07274B6928L6222a48471k7282A19738
$$ -159891 136474 36974 68607 -12000 -88245 -395519 26928 63150 -148471 -175753 119738
9589i9958D9982a02519B34522a07908b9512G9291a1489A20983b97274F2524a2930
$$ -99958 49982 -102519 234522 -107908 -29512 79291 -11489 120983 -297274 62524 -12930
9577a83649h0963D3278J05267h2611k6710d6217j45517L9107A32022J95928b47817
$$ -183649 -80963 43278 148545 -82611 -109321 -46217 -191734 -152627 132022 327950 -247817
9565b73130D8919a19624l6211b2076A39658g3150k54569a8689n02427K42670A67668
$$ -273130 48919 -119624 -155835 -22076 139658 -73150 -327719 -18689 -521116 -278446 167668
9553c6981C1217N4141b3765m26912a67786k24609J71830i4628j4841j92579j06799
$$ -36981 31217 85358 -23765 -450677 -167786 -392395 -220565 -94628 -109469 -302048 -408847
9542d08847J57584h788k11850g9721b1409C5435O6698A3303K30584A316J95142
$$ -408847 -251263 -8788 -220638 -79721 -21409 35435 102133 13303 243887 1316 196458
9531A96458a40113m0214M7392p7107d7029j55430e449l37741A23841I589d9886
$$ 196458 -140113 -180327 -132935 -210042 -47029 -202459 -5449 -343190 123841 9589 -49886
9519a67863c8202k7029C42672a99914P9461k13784k6658h4072B21541i8560H2856
$$ -167863 -38202 -65231 342672 -199914 -120453 -334237 -360895 -84072 221541 -98560 82856
9507A92838i7365r8396c9785J2933l00758a33288I4759i4491i989G1335P7909
$$ 192838 -97365 -195761 -39785 -26852 -327610 -133288 94759 -94491 -9989 71335 149244
9496A49244n8584l902d43579J23217R2345J05769k65052I2484e1050j94091a02644
$$ 149244 90660 86758 -443579 -320362 -228017 -122248 -387300 92484 -51050 -245141 -102644
9484A47769A4490c2952k47717O964J12356g2019j05795M2983B472a32749j36124
$$ 147769 14490 -32952 -280669 -273705 -161349 -72019 -177814 -134831 2472 -132749 -268873
9473b68873J6722g6594m4011C5444c99395d2340K010o9327k5387j76915J09082
$$ -268873 -252151 -76594 -120605 35444 -399395 -42340 -40330 -109657 -135044 -311959 -202877
9462b02877I0405R3906a46629H932k619M2489a66878A9950a57902G5249k1777
$$ -202877 90405 184311 -146629 8932 6313 48802 -166878 19950 -157902 75249 53472
9451E3472j2258a1428d21B4458a18352j78338B07760g7892k98474F6937J44876
$$ 53472 41214 -11428 -421 24458 -118352 -296690 207760 -77892 -376366 66937 211813
9440B11813k46G8039P8892F6964b04874B08396b24585p0803b8603B08112a51987
$$ 211813 211567 78039 156931 66964 -204874 208396 -224585 -295388 -28603 208112 -151987
9428b91738J30906M457j28512E9312M0378a80639j70065c8474A8707o534a54500
$$ -291738 -160832 -156375 -284887 59312 99690 -180639 -350704 -38474 18707 12173 -154500
9416e5058k08928j77758b8382c753k41532N4101B77165a23283B44347A0094M3548
$$ -55058 -263986 -441744 -28382 -3753 -245285 -191184 277165 -123283 244347 10094 53642
9405E3642a31564a3743k91234k61642b44456O1965O9610j87715m3846A19483N6037
$$ 53642 -131564 -13743 -304977 -566619 -244456 -182491 -112881 -300596 -344442 119483 175520
9394A75520P2012d5392k26605f347l76573a55481L0353F394b75148m6220a09659
$$ 175520 247532 -45392 -271997 -6347 -382920 -155481 -125128 6394 -275148 -321368 -109659
9382I8500b05722N1442F2533J7493J44459a97304f8284j20807M7724C45306g3358
$$ 98500 -205722 -154280 62533 80026 224485 -197304 -68284 -189091 -141367 345306 -73358
9370c83763c0967k56656G1964M5741e6076A6657J05663c32019j8681a46187c696
$$ -383763 -30967 -287623 71964 117705 -56076 16657 122320 -332019 -350700 -146187 -3696
9358a57774A44430d68316A45795a90963B1572J15476a73411c4247j03731d9571
$$ -157774 144430 -468316 145795 -190963 21572 137048 -173411 -34247 -137978 -49571
9347C16502a05473p209H7154a20074j28452J1468B26739I3449c7248j9816k2988
$$ 316502 -105473 -112682 87154 -120074 -248526 -237058 226739 93449 -37248 -57064 -80052
9336h0052L7943j20767F867o26K78482j03017G6127n920g2975m5513j38772F9945
$$ -80052 -42109 -162876 6867 6241 284723 181706 76127 70207 -72975 -118488 -257260 69945
9323c16124m9207B12236m1404b16257A30723a38798E9406K084i2453F7022c85624
$$ -316124 -365331 212236 170832 -216257 130723 -138798 59406 61490 -92453 67022 -385624
9311B97115c7814E2068b69229J00117E3075b68017A50697j3596e9653B26203b42834
$$ 297115 -37814 52068 -269229 -169112 53075 -268017 150697 137101 -59653 226203 -242834
9299d5218B23761D881c18342E5451F428J20825M8637J02273Q3107a92793A62823
$$ -45218 223761 4881 -318342 55451 6428 127253 175890 278163 361270 -192793 162823
9287f4044j35015Q2489A37971d3015A81331a84369C10863A11544b73193h8534
$$ -64044 -199059 -116570 137971 -43015 181331 -184369 310863 111544 -273193 -88534
9276a4864B05174d3448l1742o3538a9103A37158f6767H3563c39345J42807e203
$$ -14864 205174 -43448 -75190 -138728 -19103 137158 -66767 83563 -339345 -196538 -5203
9264c33835H1561h1745m16702a3260A27441g7705E818b91615d9591A50331a56587
$$ -333835 81561 -81745 -498447 -13260 127441 -77705 5818 -291615 -49591 150331 -156587
9252D73406f4393j74559B114h9629c2322l01715A39301a22385j74134b5656E6914
$$ 473406 -64393 -238952 2114 -89629 -32322 -334037 139301 -122385 -296519 -25656 56914
9240c50226H4139b8676I556b39023c4321m5133B60179b05055o0438d6273b2859
$$ -350226 84139 -28676 9556 -239023 -34321 -79454 260179 -205055 -265493 -46273 -22859
9228a92406g775p9823a9768D6510g8350A98487c96783a91581c2760k29601F0168
$$ -192406 -7775 -87598 -19768 46510 -78350 198487 -396783 -191581 -32760 -262361 60168
9216d5822A9433a04090G0686e0785C00522a05272m34123A19266c61671f0400m11919
$$ -45822 19433 -104090 70686 -50785 300522 -105272 -539395 119266 -361671 -60400 -472319
9205d72319K10933A101J04158a9769A55773a19767A25548a11425B66818b64664
$$ -472319 -261386 1101 105259 -19769 155773 -119767 125548 -111425 266818 -264664
9194d83269K13232B11745a1561j68678A82634h8256G7184a27898A66332a87653
$$ -483269 -270037 211745 -11561 -180239 182634 -88256 77184 -127898 166332 -187653
9183G219K22430B9272h5495j13550q0499I106b81063e8290k30787g6469A28210
$$ 7219 229649 29272 -85495 -199045 -279544 9106 -281063 -58290 -289077 -76469 128210
9171d12602A39906b58418j47345f2277k31583A83808l2591a95335n3178D6728
$$ -412602 139906 -258418 -405763 -62277 -293860 183808 151217 -195335 -248513 46728
9160a0356J986C79353E0397K7893h4743E975L0233Q5337c10553A49065A4122b98952
$$ -10356 -8370 379353 50397 78290 -84743 5975 36208 121545 -310553 149065 14122 -298952
9147a27573j63223p366a22761A64474C538J1907J59875b98607A7635c4130r6932
$$ -127573 -290796 -298162 -122761 164474 3538 15445 175320 -298607 17635 -34130 -131062
9136a31062l8900j12627B65221p0462J2698a3990k75552a18257A04123b18677
$$ -131062 -169962 -282589 265221 194759 207457 -13990 -289542 -118257 104123 -218677
9125a42991j64429a1273j15414A74619b81655k52769A02213b6419d931k58362
$$ -142991 -307420 -11273 -126687 174619 -281655 -534424 102213 -26419 -4931 -263293
9115b63293g2869J2455B43102j11297b22962A08904a16557I6386R695a06438D5064
$$ -263293 -72869 -60414 243102 131805 -222962 108904 -116557 96386 106081 -106438 45064
9103C45629I0152k5758a60361K7376D00838e656j72427m2488D3895a83126j62484
$$ 345629 90152 64394 -160361 -132985 400838 -5656 -178083 -220571 43895 -183126 -345610
9092c45610E3025L5761N4420O6983a73285p7637j6070G5434k3830c05903D18378
$$ -345610 53025 88786 143206 210189 -173285 -250922 -266992 75434 51604 -305903 418378
9080i9357J2357L4024j17517b6982j84118j18179B04590J55328j15871c17848
$$ -99357 -87000 -52976 -170493 -26982 -211100 -329279 204590 359918 244047 -317848
9069A5000b0385j35460j11147J31530a925B68191k9109E2600c06616B37625A00435
$$ 15000 -20385 -155845 -266992 -135462 -1925 268191 239082 52600 -306616 237625 100435
9057a29695K470j40210f3942F541J03031g0869A06132a85565C1984a74057k1171
$$ -129695 -127225 -267435 -63942 6541 109572 -70869 106132 -185565 31984 -174057 -195228
9046a95228B96941b14477k61465K16341L1512c806l5417H9365c3407j51959B1670
$$ -195228 296941 -214477 -475942 -259601 -228089 -3806 -39223 89365 -33407 -185366 21670
9034a87856E3703J27741a52564A80186a80336A586a46845b1776A26720b3620m0585
$$ -187856 53703 181444 -152564 180186 -180336 1586 -146845 -21776 126720 -23620 -64205
9023f4205l16613a32935e4067K3339C25042A46666A0952f8629H56b93268e5947
$$ -64205 -380818 -132935 -54067 -30728 325042 146666 10952 -68629 856 -293268 -55947
9011i64D2666K81584a07990j42320a04883m2346k77482a1367c335A77477E0500
$$ -964 42666 324250 -107990 -250310 -104883 -147229 -424711 -11367 -3335 177477 50500
8999b67792e7746j51861R5471F7031a91412m8190D00568a20348N2129L3090A0830
$$ -267792 -57746 -209607 -114136 67031 -191412 -239602 400568 -120348 -68219 -35129 10830
8987A88321n3924h5529b0415j49617e069l8260A43475f8689A3180P0416A9773
$$ 188321 134397 -85529 -20415 -170032 -5069 -43329 143475 -68689 13180 83596 19773
8975A18295M3305b8213m9687A12905h0350A59553c7662b195D3011J73078a4536
$$ 118295 161600 -28213 -77900 112905 -80350 159553 -37662 -2195 43011 216089 -14536
8963a17499j31598A45391D5350i3430m706L4800k03942c9658k55006B83733G2176
$$ -117499 -249097 145391 45350 -93430 -98136 -63336 -267278 -39658 -294664 283733 72176
8951b2223q1898n0091f9209k20268A4999N2690b90451J35109m9189d1694L333
$$ -22223 -104121 -154212 -69209 -289477 14999 67689 -290451 -155342 -204531 -41694 -38361
8940c8361B77585c5073J3298A29636b56628C09827J13251A67385o3097J750b14004
$$ -38361 277585 -35073 -21775 129636 -256628 309827 423078 167385 104288 106038 -214004
8928a81740A77395L16761A28559M13895N02286R46046P038745R658119C969178
$$ -181740 177395 494156 128559 542454 1044740 1990786 9029531 18687650 3969178
8918A066237m75263M5367j39195k18322a35117C37168H8831k7435L33849a53954
$$ 1066237 590974 636341 497146 278824 -135117 337168 88831 61396 395245 -153954
8907C83929A18744J82377j02540b5205B62420m3625F6500a93617B9406c1395C22701
$$ 383929 118744 301121 198581 -25205 262420 218795 66500 -193617 29406 -31395 322701
8895d9562E3853a20183G4416a59460f2517B71592c36791Q8579J20073j7690A24741
$$ -49562 53853 -120183 74416 -159460 -62517 271592 -336791 -248212 -128139 -145829 124741
8883g8573a8298B14340b73136k32432c1730l3506A24001a48814k3672B20297C0036
$$ -78573 -18298 214340 -273136 -505568 -31730 -65236 124001 -148814 -172486 220297 30036
8871c55887N3069R0116B1066J03495A8725a09929E0155O4869i3111Q127A38344
$$ -355887 -302818 -212702 21066 124561 18725 -109929 50155 115024 -93111 -84984 138344
$$ [...]
##END NTUPLES=NMR SPECTRUM
##END=
