
##TITLE=UV1274_M13_1250-1169_50_7414553_5RR6XNuXHQ
##JCAMPDX= 6.0         $$ Bruker NMR JCAMP-DX V2.0
##DATA TYPE= NMR SPECTRUM
##DATA CLASS= NTUPLES
##ORIGIN= BRUKER
##OWNER= Administrator
$$ 1.72 TOPSPIN		Version 2.1
$$ 2013-01-25 23:19:24.804 -0500  Administrator@X
$$ Compression mode = diff/dup
##.OBSERVE FREQUENCY= 400.02188249412
##.OBSERVE NUCLEUS= ^1H
##.ACQUISITION MODE= SIMULTANEOUS (DQD)
##.ACQUISITION SCHEME= undefined
##.AVERAGES= 64
##.DIGITISER RES= 22
##SPECTROMETER/DATA SYSTEM= spect
##.PULSE SEQUENCE= noesygpps1d.comp
##.SOLVENT NAME= COFFEE_meoh
##.SHIFT REFERENCE= INTERNAL, COFFEE_meoh, 1, 14.96102
##AUDIT TRAIL= $$ (NUMBER, WHEN, WHO, WHERE, PROCESS, VERSION, WHAT)
$$ ##TITLE= Audit trail, TOPSPIN		Version 2.1
$$ ##JCAMPDX= 5.01
$$ ##ORIGIN= Bruker BioSpin GmbH
$$ ##OWNER= Administrator
$$ $$ E:\/data/COFFEE/nmr/UV1274_M13_1250-1169_50_7414553_5RR6XNuXHQ/12/pdata/1/auditp.txt
$$ ##AUDIT TRAIL=  $$ (NUMBER, WHEN, WHO, WHERE, PROCESS, VERSION, WHAT)
(   1,<2013-01-25 23:19:18.851 -0500>,<Administrator>,<X>,<go>,<TOPSPIN 2.1>,
      <created by zg
	started at 2013-01-25 23:07:49.085 -0500,
	POWCHK enabled, PULCHK disabled,
       configuration hash MD5:
       86 BA 57 50 F2 9D 5C 9B 26 00 A9 28 5F 66 2E 89
       data hash MD5: 64K
       7E D5 E5 9D 31 0F 22 08 E4 97 9B 3E 99 86 27 FC>)
(   2,<2013-01-25 23:19:22.132 -0500>,<Administrator>,<X>,<proc1d>,<TOPSPIN 2.1>,
      <Start of raw data processing
       efp LB = 0.3 FT_mod = 6 PKNL = 1 PHC0 = 0 PHC1 = 0 SI = 128K 
       data hash MD5: 128K
       B1 B3 AE 1E 26 1F 4A 01 B2 B2 90 44 67 18 6D 6D>)
(   3,<2013-01-25 23:19:23.163 -0500>,<Administrator>,<X>,<proc1d>,<TOPSPIN 2.1>,
      <pk PHC0 = -80.80444 PHC1 = 0 
       data hash MD5: 128K
       23 10 C2 7E ED 95 E0 04 C8 B7 2C 9A CC 54 1C AE>)
(   4,<2013-01-25 23:19:23.772 -0500>,<Administrator>,<X>,<proc1d>,<TOPSPIN 2.1>,
      <abs ABSG = 1 
       data hash MD5: 128K
       60 C7 A7 37 C5 55 0A A3 53 13 BC 27 2A 84 41 AB>)
(   5,<2013-01-25 23:19:23.944 -0500>,<Administrator>,<X>,<proc1d>,<TOPSPIN 2.1>,
      <abs ABSG = 2 
       data hash MD5: 128K
       1D D4 60 58 CA A2 BE 5A 12 68 10 75 DB 0A A5 3C>)
(   6,<2013-01-25 23:19:24.116 -0500>,<Administrator>,<X>,<proc1d>,<TOPSPIN 2.1>,
      <abs ABSG = 3 
       data hash MD5: 128K
       36 6B C7 9C 04 4E 41 96 9E E7 43 BF FB 35 D1 34>)
(   7,<2013-01-25 23:19:24.288 -0500>,<Administrator>,<X>,<proc1d>,<TOPSPIN 2.1>,
      <abs ABSG = 4 
       data hash MD5: 128K
       14 23 C2 5D 59 41 53 78 C0 00 F3 4B C6 75 89 19>)
(   8,<2013-01-25 23:19:24.476 -0500>,<Administrator>,<X>,<proc1d>,<TOPSPIN 2.1>,
      <abs ABSG = 5 
       data hash MD5: 128K
       25 84 0E D3 A0 0F A7 5A 80 89 5E 85 E1 3E 6D 9A>)
$$ ##END=
$$ 
$$ $$ hash MD5
$$ $$ C1 9B 41 3D 5F 93 A0 F4 1D 4A E0 14 39 5F DE FD
##$RELAX= 
##$RELAX= 
##$RELAX= 
##$RELAX= 
##$RELAX= 
##$RELAX= 
##$RELAX= 
##$RELAX= 
$$ Bruker specific parameters
$$ --------------------------
##$DU= <E:\>
##$EXPNO= 12
$$ [...]
##$TP07= 0
##$TPNAME0= <>
##$TPNAME1= <>
##$TPNAME2= <>
##$TPNAME3= <>
##$TPNAME4= <>
##$TPNAME5= <>
##$TPNAME6= <>
##$TPNAME7= <>
##$TPOAL= (0..7)
0.5 0.5 0.5 0.5 0.5 0.5 0.5 0.5
##$TPOFFS= (0..7)
0 0 0 0 0 0 0 0
##$TUNHIN= 0
##$TUNHOUT= 0
##$TUNXOUT= 0
##$USERA1= <user>
##$USERA2= <user>
##$USERA3= <user>
##$USERA4= <user>
##$USERA5= <user>
##$V9= 5
##$VALIST= <valist>
##$VCLIST= <CCCCCCCCCCCCCCC>
##$VD= 0
##$VDLIST= <DDDDDDDDDDDDDDD>
##$VPLIST= <PPPPPPPPPPPPPPP>
##$VTLIST= <TTTTTTTTTTTTTTT>
##$WBST= 2048
##$WBSW= 25
##$XGAIN= (0..3)
0 0 0 0
##$XL= 0
##$YL= 0
##$YMAX_a= 6007898
##$YMIN_a= -12188466
##$ZGOPTNS= <>
##$ZL1= 120
##$ZL2= 120
##$ZL3= 120
##$ZL4= 120
##$ABSF1= 14.96102
##$ABSF2= -5.597161
##$ABSG= 5
##$ABSL= 3
##$ALPHA= 0
##$AQORDER= 0
##$ASSFAC= 0
##$ASSFACI= 0
##$ASSFACX= 0
##$ASSWID= 0
##$AUNMP= <proc_prof1d_extract.lims>
##$AXLEFT= 0
##$AXNAME= <>
##$AXNUC= <1H>
##$AXRIGHT= 0
##$AXTYPE= 0
##$AXUNIT= <>
##$AZFE= 0.1
##$AZFW= 0.1
##$BCFW= 0
##$BC_mod= 0
##$BYTORDP= 0
##$COROFFS= 0
##$CY= 15
##$DATMOD= 1
##$DC= 0
##$DFILT= <>
##$DTYPP= 0
##$F1P= 0
##$F2P= 0
##$FCOR= 0.5
##$FTSIZE= 131072
##$FT_mod= 6
##$GAMMA= 0
##$GB= 0
##$INTBC= 1
##$INTSCL= 1
##$ISEN= 128
##$LB= 0.3
##$LEV0= 0
##$LPBIN= 0
##$MAXI= 10000
##$MC2= 0
##$MEAN= 0
##$ME_mod= 0
##$MI= 0
##$NCOEF= 0
##$NC_proc= -2
##$NLEV= 6
##$NOISF1= 0
##$NOISF2= 0
##$NSP= 0
##$NTH_PI= 0
##$NZP= 0
##$OFFSET= 14.96102
##$PC= 1
##$PHC0= -80.80444
##$PHC1= 0
##$PH_mod= 1
##$PKNL= yes
##$PPARMOD= 0
##$PPDIAG= 0
##$PPIPTYP= 0
##$PPMPNUM= 2147483647
##$PPRESOL= 1
##$PSCAL= 4
##$PSIGN= 0
##$PYNMP= <proc.py>
##$REVERSE= no
##$SF= 400.020009626931
##$SI= 131072
##$SIGF1= 0
##$SIGF2= 0
##$SINO= 400
##$SIOLD= 131072
##$SPECTYP= <>
##$SREGLST= <1H.CDCl3>
##$SSB= 0
##$STSI= 131072
##$STSR= 0
##$SW_p= 8223.68421052631
##$SYMM= 0
##$S_DEV= 0
##$TDeff= 65536
##$TDoff= 0
##$TI= <>
##$TILT= no
##$TM1= 0
##$TM2= 0
##$TOPLEV= 0
##$USERP1= <user>
##$USERP2= <user>
##$USERP3= <user>
##$USERP4= <user>
##$USERP5= <user>
##$WDW= 1
##$XDIM= 131072
##$YMAX_p= 440078441
##$YMIN_p= -11488
##$CURPLOT= <Network HP LaserJet P1505>
##$CURPRIN= <$Network HP LaserJet P1505>
##$DFORMAT= <normdp>
##$LAYOUT= <+/1D_H.xwp>
##$LFORMAT= <normlp>
##$PFORMAT= <normpl>
##$SURQMSG= 1
$$ End of Bruker specific parameters
$$ ---------------------------------
##NTUPLES= NMR SPECTRUM
##VAR_NAME=  FREQUENCY,     SPECTRUM/REAL,   SPECTRUM/IMAG
##SYMBOL=    X,             R,               I
##VAR_TYPE=  INDEPENDENT,   DEPENDENT,       DEPENDENT
##VAR_FORM=  AFFN,          ASDF,            ASDF
##VAR_DIM=   131072,        131072,          131072
##UNITS=     HZ,            ARBITRARY UNITS, ARBITRARY UNITS
##FACTOR=    0.0627417313425164, 1,          1
##FIRST=     8223.62146879497, 1550,         -57777
##LAST=      0,             3737,            -57919
##MIN=       0,             -11488,          0
##MAX=       8223.62146879497, 440078441,    0
$$ Real data points
##PAGE= N=1
##DATA TABLE= (X++(R..R)), XYDATA
$$ [...]
63904A276871j01567q7804p5360o5063n5950m6993l9022l3381k9480k5535k1276
$$ 1276871 1175304 1087500 1012140 947077 891127 844134 805112 771731 742251 716716 695440
63893F95440j8091j6557j5508j3913j2156j0967j0185r220p946o582n342m511
$$ 695440 677349 660792 645284 631371 619215 608248 598063 588843 580897 574315 568973 564462
63881E64462m327m530m581m442m497m566l752j572J357M130O578R167J2217J5503
$$ 564462 560135 555605 551024 546582 542085 537519 533767 532195 533552 537682 544260 553427 565644 581147
63867E81147J8505K0867K2707K4414K6038K7167K7590K7769K8234K8854K9149
$$ 581147 599652 620519 643226 667640 693678 720845 748435 776204 804438 833292 862441
63856H62441K8915K8063K6295K3570K0550J7786J4786J0727N852J275k504o004
$$ 862441 891356 919419 945714 969284 989834 1007620 1022406 1033133 1038985 1040260 1037756 1031752
63844A031752r717j3598j7610k1884k6103k9523l1842l3432l4613l5305l5511
$$ 1031752 1022035 1008437 990827 968943 942840 913317 881475 848043 813430 778125 742614
63833G42614l5408l4847l3435l1318k9280k7799k6627k5399k4028k2345j9997
$$ 742614 707206 672359 638924 607606 578326 550527 523900 498501 474473 452128 432131
63822D32131j7129j4609j3178j2658j2275j1455j0208r011q342q086p447n843
$$ 432131 415002 400393 387215 374557 362282 350827 340619 331608 323266 315180 307733 301890
63810C01890l827k600k635l288l740l781l588l334l168l182l219l004k539k156
$$ 301890 298063 295463 292828 289540 285800 282019 278431 275097 271929 268747 265528 262524 259985 257829
63796B57829k123k475l036l388l097k317j824j998k192j695q86o77j147j614j776
$$ 257829 255706 253231 250195 246807 243710 241393 239569 237571 235379 233684 232798 232121 230974 229360 227584
63781B27584j887j902j457o83k12k66m90o35o78m07K47N59k60j706k343j651m71
$$ 227584 225697 223795 222338 221655 221443 221177 220687 220052 219374 218967 219214 219773 219513 217807 215464 213813 213342
63764B13342M14J063J489J222K47n91p30o60j051j772k282k334j870q38M66J424
$$ 213342 213756 214819 216308 217530 217777 217186 216456 215796 214745 212973 210691 208357 206487 205649 206115 207539
63748B07539J820J986K060J739J084Q15J397K369K956K877K263J377O97O99J254
$$ 207539 209359 211345 213405 215144 216228 217043 218440 220809 223765 226642 228905 230282 230979 231678 232932
63733B32932J687J651J473J545J949K644L426L763L456L319M257N715O238N602
$$ 232932 234619 236270 237743 239288 241237 243881 247307 251070 254526 257845 262102 267817 274055 279657
63719B79657N046N130M919L888L079L321L605K530M32j245k054k749l780m768
$$ 279657 284703 289833 294752 298640 301719 305040 308645 311175 311607 310362 308308 305559 301779 297011
63705B97011n334n402m799l399j738p14o56j060j216p07M52J828K842L315L520
$$ 297011 291677 286275 281476 278077 276339 275625 274969 273909 272693 271986 272438 274266 277108 280423 283943
63690B83943L569L231K527K008K012K180K050J674J309R87P09N58L45k69j027
$$ 283943 287512 290743 293270 295278 297290 299470 301520 303194 304503 305490 306199 306757 307102 306833 305806
63675C05806j150n13M2M2K09J273K671L271K900K345K248K607L051K967J781l42
$$ 305806 304656 304143 304185 304227 304436 305709 308380 311651 314551 316896 319144 321751 324802 327769 329550 329208
63659C29208k340l332l500l578l931m545n307n766n273l910k764k578k752k368
$$ 329208 326868 323536 320036 316458 312527 307982 302675 296909 291636 287726 284962 282384 279632 277264
63645B77264j600j244j345j149k44J036K219L072L564L824M031M024L527K898
$$ 277264 275664 274420 273075 271926 271682 272718 274937 278009 281573 285397 289428 293452 296979 299877
63631B99877L026M031M913N041N149O078P395Q246Q832R927J1449J2681J3551
$$ 299877 302903 306934 311847 316888 322037 328115 335510 343756 352588 362515 373964 386645 400196
63618D00196J4559J5700J6558J7288J8542K0489K2803K5425K8366L1014L2675
$$ 400196 414755 430455 447013 464301 482843 503332 526135 551560 579926 610940 643615
63607F43615L3694L4947L6202L6058L3591K9108K3146J5905Q063J054m137p838
$$ 643615 677309 712256 748458 784516 818107 847215 870361 886266 894329 895383 891246 883408
63595H83408j0821j3105j4096j3621j2248j0893j0448j1599j4480j8371k2026
$$ 883408 872587 859482 845386 831765 819517 808624 798176 786577 772097 753726 731700
63584G31700k4521k5810k6327k6068k4518k1681j8656j6520j4912j2697r889p741
$$ 731700 707179 681369 655042 628974 604456 582775 564119 547599 532687 519990 510101 502360
63572E02360o674n464l113l73J569K864M333N826O601O882P674R151J0421J0868
$$ 502360 495686 490222 487109 486736 488305 491169 495502 501328 507929 514811 522485 531636 542057 552925
63558E52925J0802J0744J0954J1639J2946J4700J6727J9239K2322K5456K8353
$$ 552925 563727 574471 585425 597064 610010 624710 641437 660676 682998 708454 736807
63547G36807L1823L6839M2794M7515M8918M5870L7938K5557J0735l368j4102k0425
$$ 736807 768630 805469 848263 895778 944696 990566 1028504 1054061 1064796 1061428 1047326 1026901
63535A026901k2685k2042j9858j6916j3290r419o803o822r193j2624j6563k1237
$$ 1026901 1004216 982174 962316 945400 932110 922691 915888 909066 899873 887249 870686 849449
63523H49449k6184l0097l2282l3184l3297l2538l0913k8851k6672k4422k2341
$$ 849449 823265 793168 760886 727702 694405 661867 630954 602103 575431 551009 528668
63512E28668k0747j9344j7481j5159j3032j1413j0058q922q194p614o676n531
$$ 528668 507921 488577 471096 455937 442905 431492 421434 412512 404318 396704 390028 384497
63500C84497m751m230l344k273j928k428k823k674k618k946k801j554QP53O93
$$ 384497 379746 375516 372172 369899 367971 365543 362720 360046 357428 354482 351681 350127 350135 350888 351581
63485C51581O23Q19R36Q43Q96J483K643L954M711M519L751L048K470J718J009
$$ 351581 352204 353023 353959 354802 355698 357181 359824 363778 368489 373008 376759 379807 382277 383995 385004
63470C85004Q94J211J058m8j712l412m794n310m679l832m129n309n506l882j901
$$ 385004 385898 387109 388167 388119 386407 382995 378201 372891 368212 364380 360251 354942 349436 345554 343653
63455C43653j198j358r31L64J679K597L358L878L804L437L623M653O034P413Q989
$$ 343653 342455 341097 340166 340530 342209 344806 348164 352042 355846 359283 362906 367559 373593 381006 389995
63440C89995J0901J2818J4471J6234J8899K2960K8098L3270L7163L8563L6507
$$ 389995 400896 413714 428185 444419 463318 486278 514376 547646 584809 623372 659879
63429F59879L0726K2408J4097Q013M507K663K172L720P573J2874J8612K4375K9822
$$ 659879 690605 713013 727110 735123 739630 742293 744465 748185 755758 768632 787244 811619 841441
63416H41441L4336L7738M0470M2418M2193L8331L0768K0766R933j66q102j3149
$$ 841441 875777 913515 953985 996403 1038596 1076927 1107695 1128461 1138394 1138228 1130126 1116977
63404A116977j5627j6316j5786j4540j3327j2884j3658j5972j9922k4869k9610
$$ 1116977 1101350 1085034 1069248 1054708 1041381 1028497 1014839 998867 978945 954076 924466
63393I24466l3400l6261l8115l8350l6782l4233l1590k8846k5643k2172j8846
$$ 924466 891066 854805 816690 778340 741558 707325 675735 646889 621246 599074 580228
63382E80228j5667j2566r925q054o478m424j776Q95L008M289M894N560P154R607
$$ 580228 564561 551995 542070 534016 527538 523114 521338 522233 525241 529530 534424 539984 547138 556745
63368E56745J1804J3001J3759J4978J6670J8444K0518K3303K6408K9007L1046
$$ 556745 568549 581550 595309 610287 626957 645401 665919 689222 715630 744637 775683
63357G75683L3252L6029L9015M1493M2652M1638L8038L2294K5170J7074Q368o2
$$ 775683 808935 844964 883979 925472 968124 1009762 1047800 1080094 1105264 1122338 1130706 1130644
63345A130644p174j2514j6028j7539j7152j5817j4718j4258j4437j5823j9118
$$ 1130644 1123470 1110956 1094928 1077389 1060237 1044420 1029702 1015444 1001007 985184 966066
63334I66066k3813k8334l1717l4227l6104l6620l4991l1606k7785k4533k1895
$$ 966066 942253 913919 882202 847975 811871 775251 740260 708654 680869 656336 634441
63323F34441j9233j5855j1520o638k013J491K968J470l340j0350j7150k1445k2467
$$ 634441 615208 599353 587833 581195 579182 580673 583641 585111 581771 571421 554271 532826 510359
63310E10359k1119j8944j6917j5044j2963j0712q798p533o710n993n297m679m143
$$ 510359 489240 470296 453379 438335 425372 414660 405862 398329 391619 385626 380329 375650 371507
63297C71507l777l717l791l612l192k993l163l228k876k522k534k548k124j674
$$ 371507 367730 364013 360222 356610 353418 350425 347262 344034 341158 338636 336102 333554 331430 329756
63283C29756j939k847l573l611l103k306j351n37k32m43q88j333j559j197k56
$$ 329756 327817 324970 321397 317786 314683 312377 311026 310489 310257 309814 308926 307593 306034 304837 304581
63268C04581N28M86k1q5L94O88N30N55J188J896J964J496J181J412J985K464K562
$$ 304581 305109 305595 305574 305489 305883 306571 307101 307656 308844 310740 312704 314200 315381 316793 318778 321242 323804
63251C23804K283J930J813J920K037K132K419L000L715M425N162N995O836P477
$$ 323804 326087 328017 329830 331750 333787 335919 338338 341338 345053 349478 354640 360635 367471 374948
63237C74948P692P436P107P452Q853J0809J2361J2997J2894J2463J2048J1970
$$ 374948 382640 390076 397183 404635 413488 424297 436658 449655 462549 475012 487060 499030
63225D99030J2396J3036J3372J3235J2916J2688J2514J2333J2285J2468J2676
$$ 499030 511426 524462 537834 551069 563985 576673 589187 601520 613805 626273 638949
63214F38949J2594J2192J1657J0988R779P603M614J548j107l699o805j0189j2906
$$ 638949 651543 663735 675392 686380 696159 703762 708376 709924 708817 705118 698313 688124 675218
63201F75218j4498j5487j6365j6762j6071j4477j2753j1245r657p734n620l519
$$ 675218 660720 645233 628868 612106 596035 581558 568805 557560 547903 540169 534549 531030
63189E31030j414Q25L241N700P870R476J0709J2066J3592J4680J4945J4892J5240
$$ 531030 529616 530441 533682 539382 547252 556728 567437 579503 593095 607775 622720 637612 652852
63176F52852J5934J6344J6172J5621J4883J4099J3620J3693J3855J3265J1682
$$ 652852 668786 685130 701302 716923 731806 745905 759525 773218 787073 800338 812020
63165H12020R621P536N270K414j218n479r896j3783j6809j9381k2035k4500k5934
$$ 812020 821641 829177 834447 836861 835643 830164 820268 806485 789676 770295 748260 723760 697826
63152F97826k6119k5769k5429k4686k2919k0370j7944j6063j4297j2209j0149
$$ 697826 671707 645938 620509 595823 572904 552534 534590 518527 504230 492021 481872
63141D81872q846q345p811o568m995l954l506k858j603l60J71J74K29L63K55J20
$$ 481872 473026 464681 456870 450302 445307 441353 437847 434989 433386 433026 433197 433371 433600 433963 434218 434338
63125D34338O81K196M049N367N717N212M291L463L016K950L259M017M996N551
$$ 434338 435019 437215 441264 446631 452348 457560 461851 465314 468330 471280 474539 478556 483552 489103
63111D89103N292M672M450M777N196N376N347N133M641L967L447L349L694M194
$$ 489103 494395 499067 503517 508294 513490 518866 524213 529346 533987 537954 541401 544750 548444 552638
63097E52638M305L614K501K017K677L631L635K620J694J685K237K362J493j06
$$ 552638 556943 560557 563058 565075 567752 571383 575018 577638 579332 581017 583254 585616 587109 587003
63083E87003j679k645l126l595m015l776k772j901j901k218j826p95j04j02j45
$$ 587003 585324 582679 579553 575958 571943 568167 565395 563494 561593 559375 557549 556754 556650 556548 556403
63068E56403K55P83J103J476K307L617N251P147R121J0797J2006J3037J4373J6257
$$ 556403 556658 557441 558544 560020 562327 565944 571195 578342 587463 598260 610266 623303 637676 653933
63054F53933J8513K0678K2524K4515K7322L0593L2868L3310L2877L2988L3589
$$ 653933 672446 693124 715648 740163 767485 798078 830946 864256 897133 930121 963710
63043I63710L3632L3029L2751L3043L2936L1847L0445K9474K8777K8080K7774
$$ 963710 997342 1030371 1063122 1096165 1129101 1160948 1191393 1220867 1249644 1277724 1305498
63032A305498K8137K8474K7801K5854K2839J8742J3493P452J059n748j3125k0575
$$ 1305498 1333635 1362109 1389910 1415764 1438603 1457345 1470838 1478290 1479349 1473601 1460476 1439901
63020A439901k7141l2338l6485m0063m2954m4402m3698m1006l7364l3718l0091
$$ 1439901 1412760 1380422 1343937 1303874 1260920 1216518 1172820 1131814 1094450 1060732 1030641
63009A030641k6000k1432j6804j2188p281k131K844P585J2368J6883K0212K2059
$$ 1030641 1004641 983209 966405 954217 946936 944805 947649 955234 967602 984485 1004697 1026756
62997A026756K3201K4334K5276K5784K6319K7252K8016K7838K6909K5989K5295
$$ 1026756 1049957 1074291 1099567 1125351 1151670 1178922 1206938 1234776 1261685 1287674 1312969
62986A312969K4562K3815K3200K2095J9424J4890R270L294l004r671j6225k2097
$$ 1312969 1337531 1361346 1384546 1406641 1426065 1440955 1450225 1453519 1450515 1440844 1424619 1402522
62974A402522k7332l2374l7340m1772m5084m7037m7766m7499m6293m4049m0783
$$ 1402522 1375190 1342816 1305476 1263704 1218620 1171583 1123817 1076318 1030025 985976 945193
62963I45193l6864l2887k9380k6635k4652k3137k1634j9858j8021j6655j6104
$$ 945193 908329 875442 846062 819427 794775 771638 750004 730146 712125 695470 679366
62952F79366j6158j6271j6122j5848j5716j5683j5343j4357j2760j0961r575r113
$$ 679366 663208 646937 630815 614967 599251 583568 568225 553868 541108 530147 520572 511459
62940E11459r504r947r560q311o979o096n381m441l556l316l725m131l963l211
$$ 511459 501955 492008 482448 474137 467158 461062 455681 451240 447684 444368 440643 436512 432549 429338
62926D29338k286j644j415j286r26n38n63q34o41O6L12n03j585j797j189o50n51
$$ 429338 427052 425408 423993 422707 421781 421243 420680 419846 419205 419271 419583 419080 417495 415698 414509 413859 413308
62909D13308o24p53r53q62k27L99L68J08N21J452J881J601J494K054K822L449
$$ 413308 412684 411931 410978 410116 409889 410288 410656 410764 411285 412737 414618 416219 417713 419767 422589 426038
62893D26038M182M945N077M346L348K515J678Q74N90P28L95p27j717j709j077
$$ 426038 430220 435165 440242 444588 447936 450451 452129 453003 453593 454321 454716 453989 452272 450563 449486
62878D49486p72j190k178l415m256m005k907k146k358k914l150l367l975m573
$$ 449486 448714 447524 445346 441931 437675 433670 430763 428617 426259 423345 420195 416828 412853 408280
62864D08280m665m472m239l535k145r13o78r53p42j37L3k68k74J58K83k84r84
$$ 408280 403615 399143 394904 391369 389224 388311 387633 386680 385938 385801 385834 385566 385292 385450 385733 385449 384465
62847C84465j144p92l94k77m06n02m06m00q32j294r05K84R48K27r17j060l28M2
$$ 384465 383321 382529 382135 381858 381452 380950 380544 380144 379312 378018 377113 377397 378345 378572 377655 376595 376267 376309
62829C76309k63l22L42J049J119P58M71L34K61L19M98O03O20P98J229J696K056
$$ 376309 376046 375724 376066 377115 378234 378992 379463 379797 380058 380377 380875 381478 382098 382896 384125 385821 387877
62812C87877K389K669K749K736L007L682M400M684M401L822L446L661M413N252
$$ 387877 390266 392935 395684 398420 401427 405109 409509 414193 418594 422416 425862 429523 433936 439188
62798D39188N861O268O475O270N712N390N706O354P044Q233J0402J2965J4828
$$ 439188 445049 451317 457792 464062 469774 475164 480870 487224 494268 502501 512903 525868 540696
62785E40696J6000J7719K0812K4686K8216L1023L3564L6409L9788M3500M7006
$$ 540696 556696 574415 595227 619913 648129 679152 712716 749125 788913 832413 879419
62774H79419M9786N1682N2737N2788N1549M9010M5349M0483L4150K6509J8202
$$ 879419 929205 980887 1033624 1086412 1137961 1186971 1232320 1272803 1306953 1333462 1351664
62763A351664R675Q82q225j7244k5578l2815l8672m2968m5819m7708m9083m9950
$$ 1351664 1361339 1362221 1353996 1336752 1311174 1278359 1239687 1196719 1150900 1103192 1054109 1004159
62751A004159n0012m9064m7163m4542m1527l8437l5446l2464k9265k5811k2547
$$ 1004159 954147 905083 857920 813378 771851 733414 697968 665504 636239 610428 587881
62740E87881k0160j8908j8214j7170j5377j3073j0592q196o375n573n453m973
$$ 587881 567721 548813 530599 513429 498052 484979 474387 466191 459816 454243 448790 443817
62728D43817l654k232j641j777j761j092m9Q11J154J108J377K700M853O601P200
$$ 443817 440163 437931 436290 434513 432752 431660 431611 432422 433576 434684 436061 438761 443614 450215 457415
62713D57415P407Q378J0025J1363J2061J2723J3711J4814J6131J8248K1283K4563
$$ 457415 464822 473200 483225 494588 506649 519372 533083 547897 564028 582276 603559 628122
62701F28122K7601L0674L4041L7293M0017M2540M5434M8698N1864N4647N6868
$$ 628122 655723 686397 720438 757731 797748 840288 885722 934420 986284 1040931 1097799
62690A097799N8014N7434N5007N1192M6316M0137L2168K2294J1001q02j2184k2558
$$ 1097799 1155813 1213247 1268254 1319446 1365762 1405899 1438067 1460361 1471362 1470560 1458376 1435818
62678A435818l1861m0249m7611n3382n6969n8390n8336n7515n6078n3794n0689
$$ 1435818 1403957 1363708 1316097 1262715 1205746 1147356 1089020 1031505 975427 921633 870944
62667H70944m7204m3780m0467l7063l3450k9840k6705k4371k2515k0328j7514
$$ 870944 823740 779960 739493 702430 668980 639140 612435 588064 565549 545221 527707
62656E27707j4847j3190j2188j0716q570o868o472o941p417p769q199q375p790
$$ 527707 512860 499670 487482 476766 468196 461328 454856 447915 440498 432729 424530 416155 408365
62643D08365o581n261l950k566j514j331j802k012j411k81Q07J488J563R19k80
$$ 408365 401784 396523 392573 390007 388493 387162 385360 383348 381937 381656 382463 383951 385514 386433 386153
62628C86153j577k440k521j917j190q84q77o84l46m28q73p57L10J369J457J062
$$ 386153 384576 382136 379615 377698 376508 375624 374747 374063 373717 373289 372416 371659 371969 373338 374795 375857
62612C75857J283K170K951L464M111M595M052K656J820K463L946N220O165P317
$$ 375857 377140 379310 382261 385725 389836 394431 398483 401139 402959 405422 409368 414588 420753 428070
62598D28070Q923J0843J2933J5037J6852J8235J9505K1142K3260K5467K7130K7704
$$ 428070 436993 447836 460769 475806 492658 510893 530398 551540 574800 600267 627397 655101
62586F55101K6962K4977K1905J7986J3788R992O596K717k304p892j2842j6531
$$ 655101 682063 707040 728945 746931 760719 770711 777307 780024 777720 769828 756986 740455
62574G40455j9066k0611k1356k1911k2845k3814k3885k2771k1086j9389j7708
$$ 740455 721389 700778 679422 657511 634666 610852 586967 564196 543110 523721 506013
62563E06013j6053j4652j3542j2452j1298j0212r067p547n794m400l638l296l234
$$ 506013 489960 475308 461766 449314 438016 427804 418737 411190 405396 400996 397358 394062 390828
62550C90828l428l373k365o42N32L54n26r68o51%O70J310J733J663J126L88l87
$$ 390828 387400 384027 381662 381020 381552 381906 381380 380412 379761 379761 380431 381741 383474 385137 386263 386651 386264
62533C86264j165j764j810j013N57K438M010M917N272N438N755O528P978R892
$$ 386264 385099 383335 381525 380512 381069 383507 387517 392434 397706 403144 408899 415427 423405 433297
62519D33297J1630J2855J4036J5809J8081K0296K2336K4502K6729K8538K9838
$$ 433297 444927 457782 471818 487627 505708 526004 548340 572842 599571 628109 657947
62508F57947L1130L2634L3769L3753L2401L0054K6976K3043J8038J2125N967J28
$$ 657947 689077 721711 755480 789233 821634 851688 878664 901707 919745 931870 937837 937965
62496I37965n468j1031j5870j8668j9148j8601j8115j7132j4668j1166p925n199
$$ 937965 932497 921466 905596 886928 867780 849179 831064 813932 799264 788098 780173 774974
62484G74974k164J450N023Q271J1465J4359J6159J6707J6499J5326J2208P159
$$ 774974 772810 774260 779283 787554 799019 813378 829537 846244 862743 878069 890277 897436
62472H97436J721k791o541j0258j4110j8161k2677k7236l0457l1620l1753l2170
$$ 897436 899157 896366 889825 879567 865457 847296 824619 797383 766926 735306 703553 671383
62460F71383l2578l1697k9259k6271k3514k0766j7639j4468j2006j0568r600q145
$$ 671383 638805 607108 577849 551578 528064 507298 489659 475191 463185 452617 443017 434872
62448D34872n793l210j472r17r63r65o97r0R00K000K844L573M560N511N628M776
$$ 434872 429079 425869 424397 423480 422517 421552 420855 420765 421665 423665 426509 430082 434642 440153 445781 450557
62432D50557L636K510R40j145k918l843m387m992n282n068n162o204p384p377
$$ 450557 454193 456703 457643 456498 453580 449737 445350 440358 435076 430008 424846 418642 411258 403881
62418D03881o166m878m171l729l227k810k630k552k392j974j109PO08J37q84j371
$$ 403881 397715 392837 388666 384937 381710 378900 376270 373718 371326 369352 368243 368250 368858 368995 368111 366740
62402C66740r22r3N33R13J226J504J740K066K587L173L517L337K695K132K252
$$ 366740 365818 365725 366258 367171 368397 369901 371641 373707 376294 379467 382984 386321 389016 391148 393400
62387C93400L069L927M205L999L985M767O306P896Q733Q755Q693R063R527R635
$$ 393400 396469 400396 404601 408600 412585 417352 423658 431554 440287 449042 457735 466798 476325 485960
62373D85960R775J0518J1414J1493J0904J0909J2139J3906J5564J7445J9991K2970
$$ 485960 495735 506253 517667 529160 540064 550973 563112 577018 592582 610027 630018 652988
62361F52988K6126K9759L4138L9021M4216M9820N5473O0237O3601O5711O6251
$$ 652988 679114 708873 743011 782032 826248 876068 931541 991778 1055379 1121090 1187341
62350A187341O4141N9014N1816M3298L3094K1195R247r09r082j6076k2093k7096
$$ 1187341 1251482 1310496 1362312 1405610 1438704 1459899 1469146 1468237 1459155 1443079 1420986 1393890
62338A393890l1848l7071m2018m5347m7058m8135m8549m7147m3568l8990l4735
$$ 1393890 1362042 1324971 1282953 1237606 1190548 1142413 1093864 1046717 1003149 964159 929424
62327I29424l1193k8234k5719k3437k1327j9872j9470j9608j9431j9032j9166
$$ 929424 898231 869997 844278 820841 799514 779642 760172 740564 721133 702101 682935
62316F82935j9815k0097j9614j8845j8044j6792j4946j3098j1693j0462r101p843
$$ 682935 663120 643023 623409 604564 586520 569728 554782 541684 529991 519529 510428 502585
62304E02585o984o406n871n236m278k873j518r82j187j079jJ411K140K104K082
$$ 502585 495601 489195 483324 478088 473810 470937 469419 468437 467250 466171 466170 467581 469721 471825 473907
62289D73907K648L614M403M592M206L706L681M327N202N580N140M331L933M173
$$ 473907 476555 480169 484572 489164 493370 497076 500757 505084 510286 515866 521006 525337 529270 533443
62275E33443M460M242L863M088M966N919O894Q458J0536J2160J3047J4347J7075
$$ 533443 537903 542145 546008 550096 555062 560981 567875 576333 586869 599029 612076 626423 643498
62262F43498K0691K4173K7671L1950L6985M2284M8022N4397O0330O4354O6583
$$ 643498 664189 688362 716033 747983 784968 827252 875274 929671 990001 1054355 1120938
62251A120938O8189O8891O6612O0092N0363L9184K7331J5204L800o023j4559k2661
$$ 1120938 1189127 1258018 1324630 1384722 1435085 1474269 1501600 1516804 1520604 1514581 1500022 1477361
62239A477361l0590l8135m5295n2031n7692o1404o2923o2665o1097n8460n4858
$$ 1477361 1446771 1408636 1363341 1311310 1253618 1192214 1129291 1066626 1005529 947069 892211
62228H92211n0269m4684l8559l2937k8723k5877k3527k0823j7601j4407j1942
$$ 892211 841942 797258 758699 725762 697039 671162 647635 626812 609211 594804 582862
62217E82862j0384r275q153p138o573o303n763m769l634k497j045Q53K756M185
$$ 582862 572478 563203 555050 547912 541339 535036 529273 524504 520870 518373 517328 518181 520937 525122
62203E25122N243O361P626Q677R211R460J0002J1099J2234J2604J2077J1383J1161
$$ 525122 530365 536726 544352 553029 562240 571700 581702 592801 605035 617639 629716 641099 652260
62190F52260J1245J1155J0839J0396R542Q008O306N419N660O412O897O700N666
$$ 652260 663505 674660 685499 695895 705437 713445 719751 725170 730830 737242 744139 750839 756505
62177G56505L941K108Q11J51m7M78K318N544R586J3958J8616K3517K8458L3440
$$ 756505 760446 762554 763365 763516 763469 763947 766265 771809 781395 795353 813969 837486 865944 899384
62163H99384L8682M3965M8355N0756N0502M7439M1747L3871K4501J4618N516j770
$$ 899384 938066 982031 1030386 1081142 1131644 1179083 1220830 1254701 1279202 1293820 1299336 1297566
62151A297566p412j2727j8630k4550k9434l3332l7079m0728m3259m3898m2813
$$ 1297566 1290154 1277427 1258797 1234247 1204813 1171481 1134402 1093674 1050415 1006517 963704
62140I63704m0456l7101l3185k9265k5417k1335j7239j3936j1778j0232q772p623
$$ 963704 923248 886147 852962 823697 798280 776945 759706 745770 733992 723760 714988 707365
62128G07365p200p306p285o675n533m312l437k778j621M17K790M774O555Q789
$$ 707365 700165 692859 685574 678899 673366 669054 665617 662839 661218 661635 664425 669199 675754 684543
62114F84543J1330J3225J3850J3119J0743O475J320k640m179l859k678q95J182
$$ 684543 695873 709098 722948 736067 746810 753285 754605 751965 747786 743927 741249 740354 741536
62101G41536K184P08l032p267j0279j1425j0944r402p379n197k891n32J590L224
$$ 741536 743720 744428 741396 734129 723850 712425 701481 692079 684700 679503 676612 676080 677670 680894
62087F80894M422N387O228P000P812Q836J0254J2138J4219J6024J7476J9053K1046
$$ 680894 685316 690703 696931 703931 711743 720579 730833 742971 757190 773214 790690 809743 830789
62074H30789K3020K4533K5928K7678K9343L0072K9895K9608K9526K9411K9542
$$ 830789 853809 878342 904270 931948 961291 991363 1021258 1050866 1080392 1109803 1139345
62063A139345L0644L2538L4066L4588L4467L3636L0928K5598J8552J1294M353
$$ 1139345 1169989 1202527 1236593 1271181 1305648 1339284 1370212 1395810 1414362 1425656 1430009
62052A430009k448q860j4216j8283k1491k4549k8222l2921l8050m2168m4318m4851
$$ 1430009 1427561 1418701 1404485 1386202 1364711 1340162 1311940 1279019 1240969 1198801 1154483 1109632
62040A109632m4562m3581m1705l9340l7324l5959l4685l2775l0048k7036k4459
$$ 1109632 1065070 1021489 979784 940444 903120 867161 832476 799701 769653 742617 718158
62029G18158k2444k0349j7688j4999j3165j1992j0478q599p726q691j0385j1030
$$ 718158 695714 675365 657677 642678 629513 617521 607043 598444 590718 582027 571642 560612
62017E60612j0256r137q651q803r029q899q517q435q808q618o537k864K75J344
$$ 560612 550356 541219 532568 523765 514736 505837 497320 488885 480077 471459 464922 462058 462333 463677
62003D63677J219J792L463N064N830O137O330N953M580K666J032j05j162k366
$$ 463677 464896 466688 470151 475215 481045 487182 493512 499465 504045 506711 507743 507638 506476 504110
61989E04110l360l775l930m577n838o889p045o727o834p408p745p566p256o852
$$ 504110 500750 496975 493045 488468 482630 475741 468696 461969 455135 447727 439982 432416 425160 418308
61975D18308n843m198k720j964j568j068n83k23M52J730L111L872L916L555L066
$$ 418308 412465 408267 405547 403583 402015 400947 400364 400141 400593 402323 405434 409306 413222 416777 419843
61960D19843K749K878L148K804J787J097J523K649L672M528N452O102O034N670
$$ 419843 422592 425470 428618 431422 433209 434306 435829 438478 442150 446678 452130 458232 464266 469936
61946D69936N920O979Q238R271J0315J1786J3787J6076J8242K0014K1527K3030
$$ 469936 475856 482835 491073 500344 510659 522445 536232 552308 570550 590564 612091 635121
61934F35121K4329K4916K4687K3965K2733K0629J7915J5557J3916J2227R821P065
$$ 635121 659450 684366 709053 733018 755751 776380 794295 809852 823768 835995 845816 852881
61922H52881M485J841j173m125o533q626j0556j1530j0686q314n278j800K230
$$ 852881 857366 859207 858034 853909 847376 838750 828194 816664 805978 797664 792386 790586 792816
61909G92816O255R454J1888J4206J6422J7893J8310J7786J6170J3147R000M426
$$ 792816 799071 808525 820413 834619 851041 868934 887244 905030 921200 934347 943347 947773
61897I47773l26n448j0730j5477j9200k1844k3396k3897k3699k3159k2285k1094
$$ 947773 947447 941999 931269 915792 896592 874748 851352 827455 803756 780597 758312 737218
61885G37218j9990j9204j8288j6869j5430j4578j3996j3067j2135j2025j2497
$$ 737218 717228 698024 679736 662867 647437 632859 618863 605796 593661 581636 569139
61874E69139j2340j1063r456q288p390o231m674k887j085M46J591K688M082N517
$$ 569139 556799 545736 536280 527992 520602 514371 509697 506810 505725 506171 507762 510450 514532 520049
61860E20049O572P600R419J2114J4900J7261J9522K2136K5068K8103L1182L4221
$$ 520049 526621 534221 543640 555754 570654 587915 607437 629573 654641 682744 713926 748147
61848G48147L6938L9049M0298M0423L9467L7942L6128L3461K9140K3291J6799
$$ 748147 785085 824134 864432 904855 944322 982264 1018392 1051853 1080993 1104284 1121083
61837A121083J0172L340l370q932j2549j4280j4529j3454j1114p755l633J118
$$ 1121083 1131255 1134595 1131225 1122293 1109744 1095464 1080935 1067481 1056367 1048612 1044979 1046097
61825A046097O261J1326J5758J9017K0601K0252J8116J4499R599L682k820r677
$$ 1046097 1052358 1063684 1079442 1098459 1119060 1139312 1157428 1171927 1181526 1185208 1182388 1172711
61813A172711j6958k4358l0892l5705l8889m0932m1846m1489m0223l8493l6123
$$ 1172711 1155753 1131395 1100503 1064798 1025909 984977 943131 901642 861419 822926 786803
61802G86803l2864k9301k6258k3547k0422j7088j4611j3289j2224j0744r215q139
$$ 786803 753939 724638 698380 674833 654411 637323 622712 609423 597199 586455 577240 569101
61790E69101p441p026p094p416p058n543l709k814l067l596l658l403l477m050
$$ 569101 561660 554634 547540 540124 533066 527523 523814 521000 517933 514337 510679 507276 503799 499749
61776D99749m363l411j294M65M57r99k211k005o58Q11J557J187m4j145j111PJ205
$$ 499749 495386 491975 490681 491146 491603 490604 488393 486388 485730 486541 488098 489285 489241 488096 486985 486992 488197
61759D88197J740J699J397R75P00R35J526J808J500J082R93R75N71k04r60j449
$$ 488197 489937 491636 493033 494008 494708 495643 497169 498977 500477 501559 502552 503527 504098 503894 502934 501485
61743E01485j647j608j477j454j632j926k151k056j452n41J07K95N51J299K039
$$ 501485 499838 498230 496753 495299 493667 491741 489590 487534 486082 485541 485648 485943 486494 487793 489832
61728D89832K040J594J676K466L126L139L049L480M199M548M319L788L252K895
$$ 489832 491872 493466 495142 497608 500734 503873 506922 510402 514601 519149 523468 527256 530508 533403
61714E33403K781K756K497J843R24m2r26j696k480l425m296m545m039l414l263
$$ 533403 536184 538940 541437 543280 544204 544162 543236 541540 539060 535635 531339 526794 522755 519341 516078
61699E16078l375l304l231l512l799l455k698k367k646k926k875k773k740k496
$$ 516078 512703 509399 506168 502656 498857 495402 492704 490337 487691 484765 481890 479117 476377 473881
61685D73881k064j842j857j665j206r67j127j268j139j026j140j292j384j566
$$ 473881 471817 469975 468118 466453 465247 464280 463153 461885 460746 459720 458580 457288 455904 454338
61671D54338j750j629j325j370j865k320k455k488k510k327k082k199k461k016
$$ 454338 452588 450959 449634 448264 446399 444079 441624 439136 436626 434299 432217 430018 427557 425541
61657D25541p25L43L02l00k76O33J580J739J161N85P58J817L205M227M662M735
$$ 425541 424816 425159 425461 425161 424885 425518 427098 428837 429998 430583 431341 433158 436363 440590 445252 449987
61641D49987M708M788N073N194M382K444L35r44j570k317l204l732m109m926n736
$$ 449987 454695 459483 464556 469750 474132 476576 476911 475967 474397 472080 468876 465144 461035 456109 450373
61626D50373n328l628k065j726k181k518k485k187j640j091r62j109q97l27j85
$$ 450373 445045 441417 439352 437626 435445 432927 430442 428255 426615 425524 424562 423453 422556 422229 422044
61611D22044q12j599k066k523l331m394n661p183q375q312p139o078n659n100
$$ 422044 421232 419633 417567 415044 411713 407319 401658 394475 386100 377788 370649 364571 358912 353812
61597C53812l953l008k894k992k710k636l332l987l556k450j905k162k409k107
$$ 353812 349859 346851 343957 340965 338255 335619 332287 328300 324744 322294 320389 318227 315818 313711
61583C13711j438p36l21n86j454k126k047j696j768k055j911j348q33m46mL02
$$ 313711 312273 311537 311216 310630 309176 307050 305003 303307 301539 299484 297573 296225 295392 294946 294942 295244
61567B95244J84k9K41R27J376J170M23m83j050q96k31J96J2l37l53j66n2L1R9
$$ 295244 295428 295399 295640 296567 297943 299113 299536 299053 298003 297107 296876 297072 297084 296747 296394 296228 296176 296207 296306
61548B96306r1l82j40P23J382J407J483K097K517K082J602K126L043K889J682
$$ 296306 296215 295833 295693 296416 297798 299205 300688 302785 305302 307384 308986 311112 314155 317044 318726
61533C18726R32J399K227K458K106J490N55n85j330j366j219j579k410l079l094
$$ 318726 319658 321057 323284 325742 327848 329338 329893 329308 327978 326612 325393 323814 321404 318325 315231
61518C15231k498j727j218j089j095r77o62j84L29N51K05l92m60L16J413K121
$$ 315231 312733 311006 309788 308699 307604 306627 305965 305781 306110 306661 306866 306474 306014 306330 307743 309864
61502C09864K146J373k08k027l016k700j714q38j82L62N34K39k4R2J71j41l67
$$ 309864 312010 313383 313175 311148 308132 305432 303718 302880 302698 303060 303594 303833 303809 303901 304072 303931 303564
61485C03564J7O41Q50P05N63K46m46r02m21O33J340J577J895K296K250J791J531
$$ 303564 303581 304222 305072 305777 306340 306586 306140 305238 304817 305450 306790 308367 310262 312558 314808 316599 318130
61468C18130J522J109M6r80j225o61K06P99O77j68j138j493j007O9J365K377K484
$$ 318130 319652 320761 320807 319827 318602 317941 318147 318946 319623 319455 318317 316824 315817 315886 317251 319628 322112
61451C22112J593M74m4P4M27R64J705K196K033J662J778K194K195J836J933K734
$$ 322112 323705 324179 324135 324209 324636 325600 327305 329501 331534 333196 334974 337168 339363 341199 343132 345866
61435C45866L494L586L289L146L132K809K058J354J286J770J927J101q9l63M96
$$ 345866 349360 352946 356235 359381 362513 365322 367380 368734 370020 371790 373717 374818 374729 374366 374862
61420C74862J386J655J965K856L525L133K331K229K552K201J176M11R1m15j077
$$ 374862 376248 377903 379868 382724 386249 389382 391713 393942 396494 398695 399871 400282 400373 399958 398881
61405C98881j168p72q92j747k365k165j765j654j329l96M37L12n36j158j078n33
$$ 398881 397713 396941 396049 394302 391937 389772 388007 386353 385024 384628 385065 385377 384841 383683 382605 382072
61389C82072M2K75Jm86o09k28J95L17L86O93R95R05N40L79O49J092J329J236R98
$$ 382072 382114 382389 382390 381904 381295 381067 381262 381579 381965 382658 383653 384558 385098 385477 386126 387218 388547 389783 390781
61370C90781R01J048J289J415J341J125R27R46J232J521J565J530J742K136K494
$$ 390781 391682 392730 394019 395434 396775 397900 398827 399773 401005 402526 404091 405621 407363 409499 411993
61355D11993L111M430O017O841O841P126Q181R069R105R134J0078J1157J0865
$$ 411993 415104 419534 425551 432392 439233 446359 454540 463609 472714 481848 491926 503083 513948
61342E13948R069O905N147L818L078L151L609L754L512L082K126L78j419k317
$$ 513948 523017 529922 535069 538887 541965 545116 548725 552479 555991 559073 561199 561577 560158 557841
61328E57841k575l141m048m600m732m846m626l464j908j179j266j031k32J46k18
$$ 557841 555266 552125 548077 543477 538745 533899 529273 525809 523901 522722 521456 520425 520193 520339 520121
61313E20121l12N21J691K611L558M792O040P315R101J1175J2518J2872J3164J3804
$$ 520121 519809 520330 522021 524632 528190 532982 539022 546337 555438 566613 579131 592003 605167 618971
61299F18971J3746J2062R250O211K978n62l706n717o889p868q535q442p788p095
$$ 618971 632717 644779 654029 660240 663218 662656 658950 653233 646344 638476 629941 621499 613711 606616
61285F06616o414n652n266n724o557o805o202n270m369l300j849j43J532K970
$$ 606616 600202 594550 589284 583560 577003 570198 563996 558726 554357 551057 549208 549065 550597 553567
61271E53567L988M513M647M653M743M935M956M510L785L468L967M944O082P817
$$ 553567 557555 562068 566715 571368 576111 581046 586002 590512 594297 597765 601732 606676 612758 620575
61257F20575J0517J3273J4586J4166J3052J1809R810O633L103L03j627l091m131
$$ 620575 631092 644365 658951 673117 686169 697978 707788 714421 717524 717827 716200 713109 708978
61244G08978m715n325o529q091r083q816p426n662m306l594l145k614k224k238
$$ 708978 704263 698938 692409 684318 675235 666419 658993 653331 649025 645431 642286 639672 637448 635210
61230F35210k237j459J15J772L057M111M959N286N092M865M886M957M939M941
$$ 635210 632973 631514 631629 633401 636458 640569 645528 650814 655906 660771 665657 670614 675553 680494
61216F80494M884M539M130M143M500M668M599M610M311K749J01j960k213j372
$$ 680494 685378 689917 694047 698190 702690 707358 711957 716567 720878 723627 723728 721768 719555 718183
61202G18183r19j120r74L74K880N937Q835J1069J2662J4079J5663J7299J8631
$$ 718183 717264 716144 715170 715544 718424 724361 733196 744265 756927 771006 786669 803968 822599
61189H22599J9283J8817J6998J4152J0910P644M579K292J286J148Q76R7p78j563
$$ 822599 841882 860699 877697 891849 902759 910403 914982 917274 918560 919708 920584 920681 919903 918340
61175I18340k609l952n089n818o526p400q190q936j0091j1627j2917j3751j4624
$$ 918340 915731 911779 906690 900872 894346 886946 878756 869820 859729 848102 835185 821434 806810
61162H06810j5664j6269j6176j6030j6282j6382j5654j4248j2701j1100r287p315
$$ 806810 791146 774877 758701 742671 726389 710007 694353 680105 667404 656304 647017 639702
61150F39702n285l118q29J370L375N033N643M460J746j446m617p891j0603j1243
$$ 639702 634417 631299 630470 631840 635215 640248 645891 650351 652097 650651 646034 638143 627540 616297
61136F16297r476o989n447m537k948m99J789L229M059M777N691O960Q561J0306
$$ 616297 606821 599832 594385 589848 586900 586401 588190 591419 595478 600255 605946 612906 621467 631773
61122F31773J2165J4314J6625J8614K0096K1410K2679K3519K3811K4101K4763
$$ 631773 643938 658252 674877 693491 713587 734997 757676 781195 805006 829107 853870
61111H53870K5341K5222K4516K3739K3010K2079K0845J9482J8138J6747J4978
$$ 853870 879211 904433 928949 952688 975698 997777 1018622 1038104 1056242 1072989 1087967
61100A087967J2372Q825M818Q28l263p716j2121j5814j8798k1505k3778k5033
$$ 1087967 1100339 1109164 1113982 1114810 1111547 1103831 1091710 1075896 1057098 1035593 1011815 986782
61088I86782k5355k5475k5678k5609k5113k4331k3107k1299j9527j8508j7746
$$ 986782 961427 935952 910274 884665 859552 835221 812114 790815 771288 752780 735034
61077G35034j6167j3952j2351j1617j0694r129p770p053o092m145j770P8J131
$$ 735034 718867 704915 692564 680947 670253 661124 653354 646301 640209 636064 634294 634372 635503
61064F35503J556J640J979K971L956M026L720M493O346P640P601P374Q041R230
$$ 635503 637059 638699 640678 643649 647605 651631 655351 659844 666190 673830 681431 688805 696846 706076
61050G06076J0390J1880J3949J5950J7323J8418J9758K1465K3630K6127K8084
$$ 706076 716466 728346 742295 758245 775568 793986 813744 835209 858839 884966 913050
61039I13050K8814K9193L0501L2210L2846L2799L3878L6097L7597L8031L9255
$$ 913050 941864 971057 1001558 1033768 1066614 1099413 1133291 1169388 1206985 1245016 1284271
61028A284271M2095M5197M7789N0671N3712N5352N5610N6507N8479N9735O0434
$$ 1284271 1326366 1371563 1419352 1470023 1523735 1579087 1634697 1691204 1749683 1809418 1869852
61017A869852O3907P2031Q2927R4938J09033J25154J40403J53738J68718J88935
$$ 1869852 1933759 2005790 2088717 2183655 2292688 2417842 2558245 2711983 2880701 3069636
61007C069636K14891K48248K94005L54493M26478N09045O09012P33625Q85700
$$ 3069636 3284527 3532775 3826780 4181273 4607751 5116796 5725808 6459433 7345133
60998G345133J074546J322955J647928K035592K444910K823763L091780L109247
$$ 7345133 8419679 9742634 11390562 13426154 15871064 18694827 21786607 24895854
60990B4895854K720269J892132Q22793j31685o77536p47281m67022j2749M59939
$$ 24895854 27616123 29508255 30331048 30199363 29521827 28774546 28307524 28294775 28754714
60981B8754714P74636P21754J74559p69138j801465k594265k987787l018597k813551
$$ 28754714 29529350 30251104 30425663 29656525 27855060 25260795 22273008 19254411 16440860
60972A6440860k488393k122120j768806j459250j198940r80827q00311o54915
$$ 16440860 13952467 11830347 10061541 8602291 7403351 6422524 5622213 4967298
60964D967298n37913m41435l62962l02726k57418k21570j92836j71137j54357
$$ 4967298 4429385 3987950 3624988 3322262 3064844 2843274 2650438 2479301 2324944
60955B324944j39146j24600j11564r9517q7232p5248o4696n5027m5657l8513l5913
$$ 2324944 2185798 2061198 1949634 1850117 1762885 1687637 1622941 1567914 1522257 1483744 1447831
60944A447831l6991l8799m0059m1272m2101m1376l9172l6619l4049l1290k9088
$$ 1447831 1410840 1372041 1331982 1290710 1248609 1207233 1168061 1131442 1097393 1066103 1037015
60933A037015k8237k7857k6443k4099k2017k0393j8621j6951j6115j5698j4602
$$ 1037015 1008778 980921 954478 930379 908362 887969 869348 852397 836282 820584 805982
60922H05982j2833j1296j0233r207q302p908p699p023n993n059m029k554r90K80
$$ 805982 793149 781853 771620 762413 754111 746203 738504 731481 725488 720429 716400 713846 712856 713136
60908G13136J715L716N559O400O672P314Q279Q997R590J0446J1205J1407J1539
$$ 713136 714851 718567 724126 730526 737198 744512 752791 761788 771378 781824 793029 804436 815975
60895H15975J2257J3204J3708J4007J4652J5365J5674J5986J6805J7552J7478
$$ 815975 828232 841436 855144 869151 883803 899168 914842 930828 947633 965185 982663
60884I82663J7042J7118J7355J6798J5539J4371J3188J1125Q134N117K556P5k725
$$ 982663 999705 1016823 1034178 1050976 1066515 1080886 1094074 1105199 1113333 1118450 1121006 1121081 1118356
60871A118356n874r232j2362j4545j5672j6590j7812j8650j8476j8009j8203j8676
$$ 1118356 1112482 1103250 1090888 1076343 1060671 1044081 1026269 1007619 989143 971134 952931 934255
60859I34255j8516j7931j7701j7584j6840j5897j5957j7029j7826j7564j6656
$$ 934255 915739 897808 880107 862523 845683 829786 813829 796800 778974 761410 744754
60848G44754j5629j4579j3679j3154j2670j1737j0654j0195j0480j1103j2101
$$ 744754 729125 714546 700867 687713 675043 663306 652652 642457 631977 620874 608773
60837F08773j3690j5212j5465j4235j2467j0882r399q003p148o935o738o052n112
$$ 608773 595083 579871 564406 550171 537704 526822 517423 509420 502272 495337 488599 482547 477435
60824D77435m398l947l449k718j878j229q70n28Q7P54J059J155J575K173K172
$$ 477435 473037 469090 465641 462923 461045 459816 458946 458418 458505 459259 460318 461473 463048 465221 467393
60809D67393J570J400K108K689K233J292Q26P37N49O53J553K521K315R37n11j416
$$ 467393 468963 470363 472471 475160 477393 478685 479511 480248 480797 481450 483003 485524 487839 488776 488265 486849
60793D86849j953k152j795j128p04o20p17j212k292l392l809l756l877m095l904
$$ 486849 484896 482744 480949 479821 479117 478497 477780 476568 474276 470884 467075 463319 459442 455347 451443
60778D51443l548l803m746n635o001n962n662n130m595m201l607k559j521j039
$$ 451443 447895 444092 439346 433711 427710 421748 416086 410956 406361 402160 398553 395994 394473 393434
60764C93434q44l73K22M46L97L94J51o82j439j082L01J630K294K495K392J972
$$ 393434 392590 392217 392439 392885 393282 393676 393827 393145 391706 390624 390925 392555 394849 397344 399736 401708
60748D01708J715K287L539M689N430N966O023M937K821P65l88p77r16j033j185
$$ 401708 403423 405710 409249 413938 419368 425334 431357 436294 439115 439880 439492 438715 437799 436766 435581
60733D35581j448j835k342l020l809m479m984n481n764n316m350l943m511m987
$$ 435581 434133 432298 429956 426936 423127 418648 413664 408183 402419 397103 392753 388810 384299 379312
60719C79312m356l199k661k727k635k415k649l131l071k375j634j128q86j293
$$ 379312 374956 371757 369096 366369 363734 361319 358670 355539 352468 350093 348459 347331 346445 345152
60705C45152k453l353k858j360j53M01Q69J271J069M30J15J82J32J95R91K007
$$ 345152 342699 339346 336488 335128 334975 335376 336245 337516 338585 339015 339130 339312 339444 339639 340630 342637
60689C42637J973Q62L4K09P65J290K215L482M107L745L447M179N558O695P274
$$ 342637 344610 345472 345506 345715 346480 347770 349985 353467 357574 361319 364766 368945 374503 381198 388472
60674C88472P265O519N293M396M248M414M443M395M222L479K097P75R5j20k85
$$ 388472 395737 402256 407549 411945 416193 420607 425050 429445 433667 437146 439243 440018 440113 439993 439708
60659D39708m30m54m35m19l68l85n67o52m25k68n80q36j76J104J616N62j487l539
$$ 439708 439278 438824 438389 437970 437602 437217 436650 435998 435573 435305 434725 433889 433713 434817 436433 436995 435508 431969
60641D31969m952n352m764l976l837m078l809l077k798l091l051k408k015k227
$$ 431969 427017 421665 416901 412925 409088 405010 401201 398124 395326 392235 389184 386776 384761 382534
60627C82534k154j196j76m7m42m21J21N89O93N69L36J02J33N40J116J633J958
$$ 382534 380380 379184 379008 378961 378519 378098 378219 378808 379501 380070 380406 380508 380641 381181 382297 383930 385888
60610C85888J848J220O11O86J228J420J094Q15O64N8r56j407q49p3J72J88M72
$$ 385888 387736 388956 389567 390253 391481 392901 393995 394810 395474 395532 394576 393169 392320 392247 392419 392607 393079
60593C93079P39N96M34Q55J720K383K477K046J332P64P27R85R18N60O78J602K672
$$ 393079 393818 394414 394848 395703 397423 399806 402283 404329 405661 406425 407152 408137 409055 409615 410293 411895 414567
60576D14567L226L393L551L778M171N033O258P289Q139R689J2433J5624J8219
$$ 414567 417793 421186 424737 428515 432686 437719 443977 451266 459405 469094 481527 497151 515370
60563E15370K0047K1429K2260K2124K0859J8472J4832R900M008k317q372j3044
$$ 515370 535417 556846 579106 601230 622089 640561 655393 665293 669301 666984 658612 645568
60551F45568j5289j5184j3863j2106r731o625l460q23J580M260P123R967J3103
$$ 645568 630279 615095 601232 589126 579395 572770 569310 568487 570067 574327 581450 591417 604520
60538F04520J6765K0495K3788K6891L0190L3113L4345L2945K8850K2561J4911
$$ 604520 621285 641780 665568 692459 722649 755762 790107 823052 851902 874463 889374
60527H89374O891p49p553j2884j5832j6138j4902j3790j3559j3608j2921j1244
$$ 889374 896265 895516 887963 875079 859247 843109 828207 814417 800858 787250 774329 763085
60515G63085r371q257p796o829m657k100l48Q17K644N396P974R687J1178J3257
$$ 763085 753714 745457 737661 730832 726175 724075 723727 724544 727188 732584 740558 750245 761423 774680
60501G74680J5948J9302K4051L0595L8157M5753N3350O1271O9087P5923Q1379
$$ 774680 790628 809930 833981 864576 902733 948486 1001836 1063107 1132194 1208117 1289496
60490A289496Q5277Q6771Q4575P8118O7969N5095M0054K2927L895j6142l5630
$$ 1289496 1374773 1461544 1546119 1624237 1692206 1747301 1787355 1810282 1814177 1798035 1762405
60479A762405n3293o8670q1391r0334r4411r3978r0550q5239p8425p0862o3650
$$ 1762405 1709112 1640442 1559051 1468717 1374306 1280328 1189778 1104539 1026114 955252 891602
60468H91602n6941m9940m2649l6275l1406k7150k2867j9412j7621j6726j5428
$$ 891602 834661 784721 742072 705797 674391 647241 624374 604962 587341 570615 555187
60457E55187j3679j2215j1069r820q649q015p584o686n453m509l867l130k511
$$ 555187 541508 529293 518224 508404 499755 491740 484156 477470 472017 467508 463641 460511 458000
60444D58000k576l087l140k446j666j404j522j541j132k57P45J248R52K92j12
$$ 458000 455424 452337 449197 446751 445085 443681 442159 440618 439486 439229 439974 441222 442174 442466 442354
60429D42354k18l86q08j466k338l188l486l066k561k604k873k476j185K24P96
$$ 442354 442136 441750 440942 439476 437138 433950 430464 427398 424837 422233 419360 416884 415699 415923 416719
60414D16719K88o50r76j72J159J898J658J022M99Qm09k46N70J171Q46J05j24J87
$$ 416719 417007 416357 415381 415209 416368 418266 419924 420946 421445 421453 421044 420798 421368 422539 423385 423490 423366 423553
60396D23553L98L67N27R68J254J173J037J168J443J521J289J039J222J916K629
$$ 423553 423951 424318 424845 425813 427067 428240 429277 430445 431888 433409 434698 435737 436959 438875 441504
60381D41504K897K890K987K939K180R54K78O16J313J620J475J112O82N43J093
$$ 441504 444401 447291 450278 453217 455397 456351 456629 457245 458558 460178 461653 462765 463447 463990 465083
60366D65083K004K429K250K190K416K114R60j14k20L41R10J452J988K067J644
$$ 465083 467087 469516 471766 473956 476372 478486 479446 479332 479112 479453 480363 481815 483803 485870 487514
60351D87514J583K503L906N159O383P628Q160P600O786O435N850M064J505p09
$$ 487514 489097 491600 495506 500665 507048 514676 522836 530436 537222 543657 549507 553571 555076 554367
60337E54367k381l972n348o025o136o056n580m525l560l249k948j840n05j29n92
$$ 554367 551986 548014 542666 536641 530505 524449 518869 514344 510784 507535 504587 502747 502242 502113 501521
60322E01521p43k25K30J40l33j044j765j721m19J260K047K169L034N154P581R363
$$ 501521 500778 500553 500783 500923 500590 499546 497781 496060 495641 496901 498948 501117 504151 509305 516886 526249
60306E26249J0540J1733J3693J7125K1935K6893L0839L3735L5510L4646K9531
$$ 526249 536789 548522 562215 579340 601275 628168 659007 692742 728252 762898 792429
60295G92429K0894J1186J641q358j8869k8059l3881l5793l4372l0526k5579k1033
$$ 792429 813323 824509 826150 817792 798923 770864 736983 701190 666818 636292 610713 589680
60283E89680j7537j4707j2203j0187q545o762m873l649l481l803l916l614k962
$$ 589680 572143 557436 545233 535046 526501 519739 514866 511217 507736 503933 500017 496403 493441
60270D93441k270k305l533n021n115l491j567o57o48p69n98M3J237K517K976K326
$$ 493441 491171 488866 485333 480312 475197 471706 470139 469482 468834 468065 467467 467510 468747 471264 474240 476566
60254D76566J232M02l3j28M9M2o19j497j570o55L38Q26J124J345R04k60j032n64
$$ 476566 477798 478200 478167 478039 478088 478130 477511 476014 474444 473789 474127 474953 476077 477422 478326 478066 477034 476470
60236D76470M15N90j42o63r0J322K579K861K238J678K006K861L135K449J514J010
$$ 476470 476885 477475 477333 476670 476580 477902 480481 483342 485580 487258 489264 492125 495260 497709 499223 500233
60220E00233Q71Q75J104J473J551J317J401K171L152L765M027M176M192M151M471
$$ 500233 501104 501979 503083 504556 506107 507424 508825 510996 514148 517913 521940 526116 530308 534459 538930
60205E38930N237N771N414M398L522L245L417L573L197K053N80l71m62k66m21
$$ 538930 544167 549938 555352 559750 563272 566517 569934 573507 576704 578757 579337 578966 578504 578238 577817
60190E77817q06q59m88k09n47j442k366k853k976l135l407l385k864k252j960
$$ 577817 577011 576152 575664 575455 574908 573466 571100 568247 565271 562136 558729 555344 552480 550228 548268
60175E48268j805j519j353j510j387l98Q00R17j87j368j821j864j900j752j310
$$ 548268 546463 544944 543591 542081 540694 540296 541096 542013 541826 540458 538637 536773 534873 533121 531811
60160E31811r27p16k87L98P31M48J83N06J120J523J868K494L134L245K934K907
$$ 531811 530884 530168 529881 530279 531010 531458 531641 532147 533267 534790 536658 539152 542286 545531 548465 551372
60144E51372L531M390M796M608M439M931N891O461O331O289P081Q266Q904Q858
$$ 551372 554903 559293 564089 568697 573136 578067 583958 590419 596750 603039 610120 618386 627290 636148
60130F36148Q557P902O471M587K953J299j270m428o507o600n604m645l651k150
$$ 636148 644705 652607 659078 663665 666618 667917 666647 662219 655712 649112 643508 638863 635212 633062
60116F33062m69P39J384J651J479R91Q41J457K331K677K292J355j16k081m107
$$ 633062 632593 633332 634716 636367 637846 638837 639678 641135 643466 646143 648435 649790 649674 647593 643486
60101F43486n720o730p011o391n095l808k926k201j322l49O53J753K761L330L710
$$ 643486 637766 631036 624025 617634 612539 608731 605805 603604 602282 601933 602586 604339 607100 610430 614140
60086F14140M544N678O060N280M304L994L836K898J377K30k79p89j911l739o022
$$ 614140 618684 624362 630422 635702 640006 644000 647836 650734 652111 652341 652062 651273 649362 645623 639601
60071F39601q178r440r520r005q631q477q230p853p460o911o024n024m346m173
$$ 639601 631423 621983 612463 603458 594827 586350 578120 570267 562807 555896 549872 544848 540502 536329
60057E36329m483n196n937o044n250m059l095k423j786j147n36K40J296K294K768
$$ 536329 531846 526650 520713 514669 509419 505360 502265 499842 498056 496909 496373 496613 497909 500203 502971
60042E02971K706K535K683L275L937L953K996J711J025Q78M21m91j004p76p43
$$ 502971 505677 508212 510895 514170 518107 522060 525056 526767 527792 528670 529091 528600 527596 526820 526077
60027E26077j634k675k722k098k226l729n807p383q078q054p576o841n878m585
$$ 526077 524443 521768 519046 516948 514722 510993 505186 497803 489725 481671 474095 467254 461376 456791
60013D56791l086j875j300j179j191j393j898k379k343j799j187p46l38J65O43
$$ 456791 453705 451830 450530 449351 448160 446767 444869 442490 440147 438348 437161 436415 436077 436242 436885
59998D36885Q87Q24N72L58L25M01M40M55N45P27J092J876K997L732L445K453J636
$$ 436885 437772 438596 439168 439526 439851 440252 440692 441147 441692 442419 443511 445387 448384 452116 455561 458014 459650
59981D59650J276J044R06J124J325O98o15j392r94k67k07n97p11n77p41j222j494
$$ 459650 460926 461970 462876 464000 465325 466023 465408 464016 463022 462755 462548 461951 461240 460663 459922 458700 457206
59964D57206j232m70P00K080L247L884M062L995L800L616L508L154K196J064O61
$$ 457206 455974 455504 456204 458284 461531 465415 469477 473472 477272 480888 484396 487550 489746 490810 491471
59949D91471J052J252P36K40M96R87P98Q9k16J53N62M65qm44o28o37p07r55j103
$$ 491471 492523 493775 494511 494751 495247 496234 497032 497121 496905 497058 497620 498085 498077 497633 497005 496368 495661 494706 493603
59930D93603p88j46K99M21N94R19R82O16K63L06O65J250K115K906K955K311J948
$$ 493603 492815 492669 492968 493389 493983 494902 495884 496500 496763 497069 497734 498984 501099 504005 506960 509271 511219
59913E11219K511L568M501N319O115O533O293N585M455K662O07n49m36k17r66
$$ 511219 513730 517298 521799 527118 533233 539766 546059 551644 556099 558761 559368 558819 558383 558166 557200
59898E57200k088k362j747j152r20o62j92L17R06J751K682L440M130M859N317
$$ 557200 555112 552750 551003 549851 548931 548269 548077 548394 549300 551051 553733 557173 561303 566162 571479
59883E71479N288N136N229N289M953M441M120L928L760L785L749K730M46j948
$$ 571479 576767 581903 587132 592421 597374 601815 605935 609863 613623 617408 621157 623887 624333 622385
59869F22385l235l749m582n805o605o699o455n839m541l046k405k795l185k662
$$ 622385 619150 615401 610819 605014 598409 591710 585255 579416 574875 571829 569424 566629 563444 560782
59855E60782j354L4J015J497J726K165L110M456O066Q066J0448J2707J4205J4639
$$ 560782 559428 559462 560477 561974 563700 565865 568975 573431 579497 587563 598011 610718 624923 639562
59841F39562J3833J1583Q086M119M60k358l536k209J205M618O017N059K476j204
$$ 639562 653395 664978 673064 677183 677643 675285 671749 669540 670745 675363 681380 686439 688915 687711
59827F87711n505r373j1846j2988j3345j3021j2096j1243j0968j0730r756q279
$$ 687711 682206 672833 660987 647999 634654 621633 609537 598294 587326 576596 566840 558561
59815E58561o952n694m151k793k336k425k056j103l62k56n34r61j425j564j262
$$ 558561 551609 545915 541764 538971 536635 534210 532154 531051 530689 530433 529899 528938 527513 525949 524687
59800E24687j184j914k855k996k371j786j470j134r88j416j908j603p78m89q08
$$ 524687 523503 521589 518734 515738 513367 511581 510111 508977 507989 506573 504665 503062 502284 501795 500987
59785E00987p31K7M71q5j028j484j509j709k333l102l452k928j666n16k23o09
$$ 500987 500256 500283 500754 500669 499641 498157 496648 494939 492606 489504 486052 483124 481458 480942 480719 480110
59769D80110j030j267j438j419j004m11R5O70J402J870J799J606J561J225N60
$$ 480110 479080 477813 476375 474956 473952 473541 473636 474306 475708 477578 479377 480983 482544 483769 484329
59754D84329O55K117L625L632K764K857M114N088N188N208N380M876L589K667
$$ 484329 484984 487101 490726 494358 497122 499979 504093 509181 514369 519577 524957 529833 533422 536089
59740E36089K688K836K401J782J430J084N64K71L66M26L54N70R47O77m08j382
$$ 536089 538777 541613 544014 545796 547226 548310 548874 549145 549511 549937 550291 550861 551808 552485 552077 550695
59724E50695j559j333j227j076o45k13r2k15m81r28j370j545j655k003k192j580
$$ 550695 549136 547803 546576 545500 544855 544642 544550 544335 543854 542926 541556 540011 538356 536353 534161 532581
59708E32581m35L45O23R96J472J402Q10M52M55J97k65p4Q55J489J374J280J700
$$ 532581 532146 532491 533114 534110 535582 536984 537794 538246 538701 538898 538633 538559 539414 540903 542277 543557 545257
59691E45257K014J738J300J033O05K0n4M11M32l74j052r27p23j141j603j380r85
$$ 545257 547271 549009 550309 551342 551947 551967 551913 552324 552756 552382 551330 550403 549680 548539 546936 545556 544571
59674E44571j319k277l194l976m791n342n341n102m937m488l462k336j655j226
$$ 544571 543252 540975 537781 533805 529014 523672 518331 513229 508292 503804 500342 498006 496351 495125
59660D95125o64j14K31O09J100J253J046J345K636M019M363L810L200K737K119
$$ 495125 494461 494347 494578 495187 496287 497540 498586 499931 502567 506586 510949 514759 517959 520696 522815
59645E22815J413P60k61j883l227l246k371k059k789l551l408k558j592o34L51
$$ 522815 524228 524988 524727 522844 519617 516371 514000 511941 509152 505601 502193 499635 498043 497409 497760
59630D97760R90P95j76j300j986k084j775j281p49l12k9K24N33N38l63k121l706
$$ 497760 498750 499545 499369 498069 496083 493999 492224 490943 490194 489882 489853 490077 490610 491148 490785 488664 484958
59613D84958m075l144j519K51J659K096J553J019J317J939J937J539J669K220
$$ 484958 480883 477739 476220 476471 478130 480226 481779 482798 484115 486054 487991 489530 491199 493419
59599D93419K132J076k77j558k829l479k598p31L18o5o04l50M9K2K76J243J776
$$ 493419 495551 496627 496350 494792 491963 488484 485886 485155 485473 485408 484804 484454 484503 484525 484801 486044 487820
59582D87820Q22p41j392j184j278j951k456k505k545k726k696k331j810j091j07
$$ 487820 488642 487901 486509 485325 484047 482096 479640 477135 474590 471864 469168 466837 465027 463936 463829
59567D63829O10L76n99j253r19J7P00P32M26L56P60J376J852K100K092J652Q60
$$ 463829 464439 464815 464216 462963 462044 462061 462761 463493 463919 464275 465035 466411 468263 470363 472455 474107 474967
59550D74967M12R49K190L307L939M177L945L323L163M331O476Q559J0450J2947
$$ 474967 475379 476328 478518 481825 485764 489941 493886 497209 500372 504703 511179 519738 530188 543135
59536E43135J6372K0198K3561K4726K0832J0618k451j2144j5322j4037j1501q465
$$ 543135 559507 579705 603266 627992 648824 659442 656991 644847 629525 615488 603987 595522
59524E95522m622j027J055K114L302M420M576L805K522M26k502m926n719n787
$$ 595522 590900 589873 590928 593042 596344 600764 605340 609145 611667 612093 609591 604665 598946 593159
59510E93159o705q283r111q936q780r031q982q176o920n553m318l805m371n361
$$ 593159 586454 578171 569060 560124 551344 542313 533331 525155 518235 512682 508364 504559 500188 494827
59496D94827n737n298m448l264j727l51M00R15J646K052J436L26j09L08Q80J396
$$ 494827 489090 483792 479344 476080 474353 474002 474402 475317 476963 479015 480451 480777 480668 480976 481856 483252
59480D83252K204L147L609L625L889M658N493O034O265O096N436M543L734K905
$$ 483252 485456 488603 492212 495837 499726 504384 509877 515911 522176 528272 533708 538251 541985 544890
59466E44890J949J248J071R86N97M71J371K934M058M398M632N425O868Q712J0431
$$ 544890 546839 548087 549158 550144 550741 551212 552583 555517 559575 563973 568605 574030 580898 589610 600041
59451F00041J1260J0967J0345J0218J0260R530P900O039M141J563k106o253r756
$$ 600041 611301 622268 632613 642831 653091 662621 670521 676560 680701 682264 680158 673905 664149
59438F64149j1889j2640j2401j1393r533p055m956m179m390m354l508k299r64
$$ 664149 652260 639620 627219 615826 606293 599238 594282 590103 585713 581359 577851 575552 574588
59425E74588Q40L009M713N677O607P972R446J0957J3028J5623J7957J9837K1864
$$ 574588 575428 578437 583150 588827 595434 603406 612852 623809 636837 652460 670417 690254 712118
59412G12118K3998K5627K7137K8935K8236K0136M017j3611k5131k8790k7428k2870
$$ 712118 736116 761743 788880 817815 846051 866187 870204 856593 831462 802672 775244 752374
59400G52374j5217o041J858P650J1882J2796P076m850j7410k5285k7915k7636
$$ 752374 737157 731116 732974 740624 752506 765302 772378 767528 750118 724833 696918 669282
59388F69282k5799k2471j8227j4191j0939q443o604n100l440j659l87J36M08Q14
$$ 669282 643483 621012 602785 588594 577655 569212 562608 557508 554068 552409 552022 552158 552566 553380
59374E53380J208J516K005K735L457M187N155O151O640O567O368O189N883N610
$$ 553380 554588 556104 558109 560844 564301 568488 573643 579794 586434 593001 599369 605558 611441 617051
59360F17051N749O301P002P790Q437Q312P322O643P430R250J0831J1911J3062
$$ 617051 622800 629101 636103 643893 652330 660642 667964 674607 682037 691287 702118 714029 727091
59347G27091J4217J4771J4950J5529J6294J6167J4940J3524J2327J0665P966M515
$$ 727091 741308 756079 771029 786558 802852 819019 833959 847483 859810 870475 878441 882956
59335H82956P81k951o189q416r795j0967j2218j3485j4843j6143j6653j6027j5086
$$ 882956 883737 880786 874597 866181 856386 845419 833201 819716 804873 788730 772077 756050 740964
59322G40964j4597j3872j1892r206p310o550o154n897o099o269n463l904k706
$$ 740964 726367 712495 700603 691397 684087 677537 671383 665486 659387 653118 647655 643751 641045
59309F41045k081j324l78J18K50P07J449K051L085N406Q276J0157J1215J3118
$$ 641045 638964 637640 637262 637380 637630 638337 639786 641837 644922 650328 658604 668761 679976 693094
59295F93094J6279J9334K1230K1627J9125J1785K75j1562k0237k5019k6483k4937
$$ 693094 709373 728707 749937 771564 790689 802474 802749 791187 770950 745931 719448 694511
59283F94511k1347j7681j4926j2210q841n685l484j532Q10K800L827M855P004
$$ 694511 673164 655483 640557 628347 619506 613821 610337 608805 609615 612415 616242 621097 628101
59270F28101R746J1815J2903J3390J3297J2606J1769J0850R045N929K371o55l344
$$ 628101 637847 649662 662565 675955 689252 701858 713627 724477 733522 739451 741822 741167 737823
59257G37823o239r013j0986j2109j2562j2125j0821r486q902q807q501p749o541
$$ 737823 731584 722571 711585 699476 686914 674789 663968 654482 645580 636773 628272 620523 613982
59244F13982m700k372l31R57J960L192M298M624M231L785L852M605N742O465O017
$$ 613982 609282 606910 606579 607536 609496 612688 616986 621610 625841 629626 633478 638083 643825 650290 656307
59229F56307M554K972J773O95n91k115l887n719o864o710n797n155m816m106l208
$$ 656307 660861 663833 665606 666301 665710 663595 659708 653989 647125 640415 634618 629463 624647 620541 617333
59214F17333l014l417l220j969n12N38J414K001J597L32o02o95p68j385j954j963
$$ 617333 614319 610902 607682 605713 605201 605739 607153 609154 610751 611083 610481 609786 609018 607633 605679 603716
59198F03716j751j435m81R38J530O80m69o16O2N50M18m8m12k92K48M54j43o47
$$ 603716 601965 600530 600049 600987 602517 603197 602728 602112 602174 602724 603142 603094 602682 602390 602638 603092 602949 602302
59180F02302O0J319J451M36m3O58J482K057L428N620O806O130N333O183Q004R174
$$ 602302 602362 603681 605132 605568 605525 606183 607665 609722 613150 618770 625576 631706 637039 643222 651226 660400
59164F60400R454R472R311Q994Q996R115Q090N584L042J487r0k671n198o178o029
$$ 660400 669854 679326 688637 697631 706627 715742 723832 729416 732458 733945 733855 731184 725986 719808 713779
59149G13779o159o804p313p601p798p458o588o387p530q717q527p651p638q286
$$ 713779 707620 700816 693503 685902 678104 670646 664058 657671 650141 641424 632897 625246 617608 609322
59135F09322q133o891n657n100m940m960n085m732l330j369J34R71J699K609L552
$$ 609322 601189 594298 588641 583541 578601 573641 568556 563824 560494 559125 559259 560230 561929 564538 568090
59120E68090M480N442O421P645R452J1476J2785J3177J3400J3618J3053J1621
$$ 568090 572570 578012 584433 592078 601530 613006 625791 638968 652368 665986 679039 690660
59108F90660J0498J0200R626Q040O414N601M732K865Q56r1n36j649l071l698l832
$$ 690660 701158 711358 720984 729024 735438 741039 745771 748636 749492 749401 748865 747216 744145 740447 736615
59093G36615m628n933o324n167l292j824j363j881k622k676k326k959m930o767
$$ 736615 731987 726054 719730 714563 711271 709447 708084 706203 703581 700905 698579 695620 690690 683923
59079F83923p432p864r021r857q962p060o012o191o579o725o837o547n270l490
$$ 683923 676491 668627 659606 649749 640787 633727 627715 621524 614945 608220 601383 594836 589566 586076
59065E86076k200j510j009r44j716k748l108k721j989j017j92m65j838k673j895
$$ 586076 583876 582366 581357 580413 578697 575949 572841 570120 568131 567114 566922 566457 564619 561946 560051
59050E60051o91n00o72R4J185J086P0l51q0l25j199j469o40M82J223J547J303
$$ 560051 559360 558860 558188 558282 559467 560553 560623 560272 560192 559867 558668 557199 556559 557041 558264 559811 561114
59033E61114M74p7N22J798K703L263M175N397O461P592R045J0114J0197J0154
$$ 561114 561588 561511 562033 563831 566534 569797 573972 579369 585830 593422 602467 612581 622778 632932
59019F32932J1036J2197J2354J1632J0767R168N881J892p80j928k990m345m929
$$ 632932 643968 656165 668519 680151 690918 700086 705967 707859 707079 705151 702161 697816 692887
59006F92887m445l864l479k383j64K381M477N960O621O310N655N457N525N230
$$ 692887 688442 684578 681099 678716 678552 680933 685410 691370 697991 704301 709956 715413 720938 726168
58992G26168M750M524M058K687R99l3p43k125m010n473o418p170p186n907m188
$$ 726168 730918 735442 739500 742187 743186 743153 742410 740285 736275 730802 724384 717214 710028 704121 699933
58977F99933l122k205m57J483K424K965M423O295P216P749R462J1704J2272J1230
$$ 699933 696811 694606 694149 695632 698056 701021 705444 711739 718955 726704 736166 747870 760142 771372
58963G71372J0979J2315J3256J2473J1066J0091Q789O354L344L51l019o839j0238
$$ 771372 782351 794666 807922 820395 831461 841552 850341 856695 860039 860390 857371 850532 840294
58950H40294j2744j4837j6554j7178j6699j6084j5610j4526j2715j1080r927q594
$$ 840294 827550 812713 796159 778981 762282 746198 730588 716062 703347 692267 682340 673746
58938F73746p085o303o250n722m302l098k910l121k942k389j643p41j74m48j003
$$ 673746 666661 660358 654108 648386 644084 640986 638076 634955 632013 629624 627981 627240 627066 626618 625615
58923F25615q86m97j095k592l518l199k295j179K91J432J150m7m29L34Q92P97
$$ 625615 624729 624232 623137 620545 617027 613828 611533 610354 610645 612077 613227 613180 612751 613085 613977 614774
58907F14774J263K908M753O129P595R439J0985J2079J3469J5138J5943J5471J4650
$$ 614774 616037 618945 623698 629827 637422 646861 657846 669925 683394 698532 714475 729946 744596
58894G44596J4078J3452J3026J3835J5890J7962J9619K1696K4319K6237K6751
$$ 744596 758674 772126 785152 798987 814877 832839 852458 874154 898473 924710 951461
58883I51461K6449K5544K3205J9213J4546R800M689n35m911q463j2244j6275j9349
$$ 951461 977910 1003454 1026659 1045872 1060418 1070218 1074907 1074372 1069461 1060998 1048754 1032479 1013130
58870A013130k1205k2810k4045k3313k0179j6385j3480j1394j0001r842j0537
$$ 1013130 991925 969115 945070 921757 901578 885193 871713 860319 850318 840476 829939
58859H29939j0640j0000j0217j1828j3157j3063j2620j2880j2971j1900j0450
$$ 829939 819299 809299 799082 787254 774097 761034 748414 735534 722563 710663 700213
58848G00213r803r669r166q236p152n868m756m644n418n939n876o071o587o315
$$ 700213 690410 680741 671575 663339 656187 650319 645563 640919 635501 629562 623686 617615 611028 604713
58834F04713n141m513m967n153m219l270l300l603l367l069l138k863j787n72
$$ 604713 599572 595059 590092 584939 580720 577450 574150 570547 567180 564111 560973 558110 556323 555751
58820E55751M36J883L790M969M950M748M899M638L828L638M286M264K933J739
$$ 555751 556187 558070 561860 566829 571779 576527 581426 586064 589892 593530 597816 602080 605013 606752
58806F06752J618J349o6j522j818j680k180k840k932l002l637m203m198m309m918
$$ 606752 608370 609719 609653 608131 606313 604633 602453 599613 596681 593679 590042 585839 581641 577332 572414
58791E72414n092m258l246k684k038j202j036j321l66K082L841L608L004L714
$$ 572414 567322 563064 559818 557134 555096 553894 552858 551537 551171 553253 557094 560702 563706 567420
58777E67420M856M971M485M274L738K255P26j63j358l384m819m676m296m950n505
$$ 567420 572276 577247 581732 586006 589744 591999 592725 592562 591204 587820 583001 578325 574029 569079 563574
58762E63574m622l271k856k623j321K35O61N67J296K480L054L362M054M267L132
$$ 563574 558952 555681 552825 550202 548881 549116 549777 550344 551640 554120 557174 560536 564590 568857 571989
58747E71989J748J558K027K065K377M089O315P376P402P574P892P755P651Q230
$$ 571989 573737 575295 577322 579387 581764 585853 592168 599544 606946 614520 622412 630167 637818 646048
58733F46048Q760Q477Q237Q892R412Q680P745Q039Q722Q188O892O284O055N035
$$ 646048 654808 663285 671522 680414 689826 698506 706251 714290 723012 731200 738092 744376 750431 755466
58719G55466L793L827M935N803O439P726R242R799R490R064Q016N445K170k63
$$ 755466 759259 763086 768021 773824 780263 787989 797231 807030 816520 825584 833600 839045 841215 840952
58705H40952k029m534p936j1227j4125j7043j9662k1294k2170k2827k2968k2277
$$ 840952 838923 834389 826453 815226 801101 784058 764396 743102 720932 698105 675137 652860
58693F52860k1324k0289j8093j4436j1118r540q461o322m227m220n923p324p751
$$ 652860 631536 611247 593154 578718 567600 558060 549599 543277 539050 534830 528907 521583 513832
58680E13832p683o787m640k399j407j047j41P38O39O51K342M911O459P053Q015
$$ 513832 506149 499362 494722 492323 490916 489869 489728 490466 491105 491756 494098 499009 505468 512521 520536
58665E20536R190R646J0061J1619J3322J3123J1023Q522N790K088j777m195n408
$$ 520536 529726 539372 549433 561052 574374 587497 598520 607042 612832 614920 613143 608948 603540
58652F03540o799q115p990o682n742n421m838m151m212m616m383l888l892l615
$$ 603540 596741 588626 580636 573954 568212 562791 557953 553802 549590 544974 540591 536703 532811 529196
58638E29196k096l37K97O14J870K896K007M05M10J367Q76q08j353o83r08k167
$$ 529196 527100 526763 527060 527674 529544 532440 534447 534852 535262 536629 537505 536697 535344 534661 533753 531586
58622E31586k324r68j08m82m58Q93K627M247O346Q613R819J0049J0394J0439Q701
$$ 531586 529262 528294 528186 527704 527246 528139 530766 535013 541359 549972 559791 569840 580234 590673 599374
58607E99374N566L046J650K05j299j627j057j345k756l844m211m739n133m171
$$ 599374 604940 607986 609636 609841 608542 606915 605858 604513 601757 597913 593702 588963 583830 579659
58593E79659k457j956k554j990M27K901M236N172O264P086P910R617J1606J2171
$$ 579659 577202 575246 572692 570702 571129 574030 578266 583438 589702 596788 604698 614315 625921 638092
58579F38092J1183J0055R107P456N387M302M288M242M270N462P547R303J0860
$$ 638092 649275 659330 668437 675893 681280 685582 689870 694112 698382 703844 711391 720694 731554
58566G31554J3014J4966J5587J6235J9006K2810K4637K4195K3667K3303K1179
$$ 731554 744568 759534 775121 791356 810362 833172 857809 882004 905671 928974 950153
58555I50153J7221J3474J0187N629J12l784n533p325r769j0798r735q691q899
$$ 950153 967374 980848 991035 996664 996776 992992 987459 980134 970365 959567 949832 941141 932242
58542I32242r248r371j0664j3162j4902j5406j6472j8444j9178j7796j6155j5353
$$ 932242 922994 913623 902959 889797 874895 859489 843017 824573 805395 787599 771444 756091
58530G56091j4050j1423q714o675m465k140j108j161j70K274M013M099M164N057
$$ 756091 742041 730618 721904 715229 710764 708624 707516 706355 706185 708459 712472 716571 720735 725792
58516G25792N314M129K744J778K07j951l011k695k765l726m043l455l764n322
$$ 725792 731106 735235 737979 739757 739964 738013 735002 732307 729542 725816 721773 718318 714554 709232
58502G09232o149n499n012n274m731l082k274k897l020j887j285j926j986o63
$$ 709232 703083 697584 692572 687298 682567 679485 677211 674314 671294 669407 668122 666196 664210 663547
58488F63547K11l67p75J51J417K488M391O959Q330Q405R419J1884J3430J2917
$$ 663547 663758 663391 662616 662767 664184 666672 671063 678022 686352 694757 704176 716060 729490 742407
58474G42407J2114J1979J0920Q138N151K565j020n490q318q628q544r101q583
$$ 742407 754521 766500 777420 785558 790709 793274 792254 786764 778446 769818 761274 752173 743590
58461G43590o380m521l782k208Q24L059L597M606P013Q584Q143P677Q195P564
$$ 743590 737210 732689 728907 726699 727523 730582 734179 738785 745798 754382 762525 770202 778397 785961
58447G85961M658J622q1j963m714o231n643n221o063n935l712j739j403n97J891
$$ 785961 790619 792241 792160 790197 785483 779252 773609 768388 762325 756390 752678 750939 749536 748939 750830
58432G50830L713L335K877L870M443L568L830O793R715J0134R817J0922J1990
$$ 750830 754543 757878 760755 764625 769068 772636 776466 783259 792974 803108 812925 823847 835837
58419H35837J1005Q929P114M616J026j653k633m204p284r037p678n714n569n960
$$ 835837 846842 855771 862885 867501 868527 866874 864241 860037 852753 843716 836038 830324 824755 818795
58405H18795n475n550o919p253n413l875l965l075K43L027L094K930M843O789
$$ 818795 813320 807770 800851 793598 788185 784310 780345 777270 777513 780540 783634 786564 791407 798196
58391G98196O586N846N967M860J498q04K12J580L22j599j657j476k853l552j552
$$ 798196 804782 810628 816595 821455 822953 822149 822361 823941 824263 822664 821007 819531 816678 813126 811574
58376H11574Q04J226J745M201O068N277M637O743Q995Q462P221Q002R065Q352
$$ 811574 812378 813604 815349 819550 825618 830895 835532 842275 851270 859732 866953 874955 884020 892372
58362H92372Q179J0611J2743J1819J0576J2116J3947J2727J0418J0032R667O602
$$ 892372 900551 911162 923905 935724 946300 958416 972363 985090 995508 1005540 1015207 1021809
58350A021809L180K639L243K249J599L756O109N510M266N695P913Q077Q375J1513
$$ 1021809 1024989 1027628 1030871 1033120 1034719 1038475 1044584 1050094 1054360 1060055 1067968 1076045 1084420 1095933
58336A095933J4638J4285J3106J5049J7983J7871J6231J6568J7304J5135J1718
$$ 1095933 1110571 1124856 1137962 1153011 1170994 1188865 1205096 1221664 1238968 1254103 1265821
58325A265821J0307R451O591L990M544N719M236K464L608N116L758K443M837Q022
$$ 1265821 1276128 1285579 1292170 1296160 1300704 1306423 1310659 1313123 1316731 1321847 1325605 1328048 1332885 1340907
58311A340907Q019P551J0604J4266J4191J3232J6048J9957J9830J7605J8072J9761
$$ 1340907 1348926 1356477 1367081 1381347 1395538 1408770 1424818 1444775 1464605 1482210 1500282 1520043
58299A520043J8829J7420J9222K1268J9317J6715J8516K1626K0431J7496J8587
$$ 1520043 1538872 1556292 1575514 1596782 1616099 1632814 1651330 1672956 1693387 1710883 1729470
58288A729470K1771K1776K0580K3176K7180K7266K5602K7311L0031K8805K6645
$$ 1729470 1751241 1773017 1793597 1816773 1843953 1871219 1896821 1924132 1954163 1982968 2009613
58277B009613K9180L3492L3602L2137L4918L9077L8750L7371M1516M7627M8115
$$ 2009613 2038793 2072285 2105887 2138024 2172942 2212019 2250769 2288140 2329656 2377283 2425398
58266B425398M5834M8658N4478N5751N4510N8181O4661O6323O4984O7899P2753
$$ 2425398 2471232 2519890 2574368 2630119 2684629 2742810 2807471 2873794 2938778 3006677 3079430
58255C079430P1906O7791O8762P3274P3726P2079P5882Q2792Q5182Q5918R3047
$$ 3079430 3151336 3219127 3287889 3361163 3434889 3506968 3582850 3665642 3750824 3836742 3929789
58244C929789J03296J07894J10034J18840J31086J37326J40948J51813J66372
$$ 3929789 4033085 4140979 4251013 4369853 4500939 4638265 4779213 4931026 5097398
58235E097398J74305J79402J92699K10428K20953K27980K43752K64899K79284
$$ 5097398 5271703 5451105 5643804 5854232 6075185 6303165 6546917 6811816 7091100
58226G091100K91173L14102L44411L68493L90442M24643M66878N02522N37236
$$ 7091100 7382273 7696375 8040786 8409279 8799721 9224364 9691242 10193764 10731000
58217A0731000N88159O50814P07997P65364Q42770R36657J028901J126998J255183
$$ 10731000 11319159 11969973 12677970 13443334 14286104 15222761 16251662 17378660 18633843
58208A8633843J411829J578764J766715K005555K296442K624085L009878L498288
$$ 18633843 20045672 21624436 23391151 25396706 27693148 30317233 33327111 36825399
58200C6825399M097463M792234N607562O594591P767663R135047J0784767J2857797
$$ 36825399 40922862 45715096 51322658 57917249 65684912 74819959 85604726 98462523
58192I8462523J5455686J8677523K2710154K7696907L3438617L9263407M4050677
$$ 98462523 113918209 132595732 155305886 183002793 216441410 255704817 299755494
58185B99755494M6111128M3211336L3542966J7457517j743024j9271276l1511422
$$ 299755494 345866622 389077958 422620924 440078441 438335417 419064141 387552719
58178C87552719l7489524l8295270l5762338l1744945k7847098k4997323k3130922
$$ 387552719 350063195 311767925 276005587 244260642 216413544 191416221 168285299
58171A68285299k1555791j9720256j7566912j5295483j3071796j1007098r204374
$$ 168285299 146729508 127009252 109442340 94146857 81075061 70067963 60863589
58164F0863589p702510o452781n403892m549254l871014l312236k833798k440042
$$ 60863589 53161079 46708298 41304406 36755152 32884138 29571902 26738104 24298062
58156B4298062k126721j858065j614343j411940j257783j128045j007480r08243
$$ 24298062 22171341 20313276 18698933 17286993 16029210 14901165 13893685 12985442
58148A2985442q35109p69963p03879o49274o08506n63886n09694m62368m28800
$$ 12985442 12150333 11380370 10676491 10027217 9418711 8854825 8345131 7882763 7453963
58139G453963l94704l53831l19331k96520k72511k42730k21245k14780k11105
$$ 7453963 7059259 6705428 6386097 6089577 5817066 5574336 5353091 5138311 4927206
58130D927206k02383j96458j96210j90611j75488j61908j55395j46997j32779
$$ 4927206 4724823 4528365 4332155 4141544 3966056 3804148 3648753 3501756 3368977
58121C368977j22171j19084j13899j02071r2520q9938q6372p7710p1490p1232
$$ 3368977 3246806 3127722 3013823 2911752 2819232 2729294 2642922 2565212 2493722 2422490
58111B422490o9368o2633n8556o0075n9294n3095m9595n2520n4047m9804m6532
$$ 2422490 2353122 2290489 2231933 2171858 2112564 2059469 2009874 1957354 1903307 1853503 1806971
58100A806971m8237m8673m4179m0655m1307m0443l5523l2758l4709l4831l0093
$$ 1806971 1758734 1710061 1665882 1625227 1583920 1543477 1507954 1475196 1440487 1405656 1375563
58089A375563k6729k7826k7436k2732j9857k1740k2099j7754j5194j8537k2105
$$ 1375563 1348834 1321008 1293572 1270840 1250983 1229243 1207144 1189390 1174196 1155659 1133554
58078A133554k1328k0301k2269k3080k0324j8857k1123k1892j8392j5983j7800
$$ 1133554 1112226 1091925 1069656 1046576 1026252 1007395 986272 964380 945988 930005 912205
58067I12205j8604j4901j1633j2615j3548j0797q170q791q879n800l951o501r341
$$ 912205 893601 878700 867067 854452 840904 830107 821937 813146 804267 798467 794516 788015 778674
58054G78674r128r433j2931j5393j3435j0770j0871j0737p695n178o006o865n073
$$ 778674 769546 760113 747182 731789 718354 707584 696713 685976 678281 673103 667097 660232 655159
58041F55159l978o158q039o721n462p019q251o567n134o388p081n067m332p716
$$ 655159 651181 645023 636984 630263 624801 617782 609531 602964 597830 591442 584361 579294 574962 567246
58027E67246j1174j0874r644j0706j1381q912o443p152q180o274l976m327m854
$$ 567246 556072 545198 535554 524848 513467 504555 498112 490960 482780 476506 472530 468203 463349
58014D63349k730o53j706l312k177m86j437l123k562j369j915k188L1K118J171
$$ 463349 460619 459966 458260 454948 452771 452285 450848 447725 445163 443794 441879 439691 439722 441840 443011
57999D43011m27O51K705K566J385J689K373J523O94J578J993j58k537k469j715
$$ 443011 442584 443235 445940 448506 449891 451580 453953 455476 456170 457748 459741 459583 457046 454577 452862
57984D52862k760m088l605k921l854m511l258k595m553o292m992l075l747n211
$$ 452862 450102 446014 442409 439488 435634 431123 427865 425270 420717 414425 409433 406358 402611 397400
57970C97400m405k666k619k935j379K91m21j758r79N25K10n83N00J948J305mM75
$$ 397400 392995 390329 387710 384775 383396 383687 383266 381508 380529 381054 381264 380681 381181 383129 384434 384430 384905
57953C84905J354K46j425j183k64q81j568j12J737J321K12J339L620M358M397
$$ 384905 386259 386505 385080 383897 383633 382752 381184 381072 382809 384130 384342 385681 389301 393659 398056
57938C98056O069Q376R113R342J0980J2434J1511J0179J1258J2822J1192P356
$$ 398056 404125 412501 421614 430956 441936 454370 465881 476060 487318 500140 511332 518688
57926E18688N043M350K638j8j601k849n873r394j0429r637j0027j1521j1708j0806
$$ 518688 523731 528081 530719 530701 529100 526251 520378 510984 500555 490918 480891 469370 457662 446856
57912D46856j0970j1663j0602q462p770p932o185k939j431k324l162k986l212
$$ 446856 435886 424223 413621 405159 397389 389457 383272 380333 378902 376578 373416 370430 367218
57899C67218m048m063l391l579m412m133k600j084L93K392L693K974J792K534
$$ 367218 363170 359107 355716 352137 347725 343592 340992 339908 340301 342693 346386 349360 351152 353686
57885C53686M435N066M521M590N016M379L477L938M506K734n56k443k752l728
$$ 353686 358121 363187 367708 372298 377314 381693 385170 389108 393614 396348 395792 393349 390597 386869
57871C86869n616o484o029n782n959n555m968n206n305m002k781l627m941l727
$$ 386869 381253 374769 368740 362958 356999 351444 346476 341270 335965 331963 329182 325555 320614 316887
57857C16887p65O63K99P58K450L196K708L095M709N510M768L745K650N57j695
$$ 316887 316122 316785 317084 317842 320292 323488 326196 329291 334000 339510 344278 348023 350673 351230 349535
57842C49535k176j348j425k455k582j911k307l639l964l346l629m506l763j524
$$ 349535 347359 346011 344586 342131 339549 337638 335331 331692 327728 324382 320753 316247 312484 310960
57828C10960k98n78k85J130J850J448J634K745L034K140J804K515K755K185K299
$$ 310960 310662 310084 309799 310929 312779 314227 315861 318606 321640 323780 325584 328099 330854 333039 335338
57813C35338L365L860L412L177K965J239j700l701m303n052o054n647l889k886
$$ 335338 338703 342563 345975 349152 352117 353356 351656 347955 343652 338600 332546 326899 323010 320124
57799C20124l125k874j721j299j869j650l26J56q94j786j735k043l128l555k889
$$ 320124 316999 314125 312404 311105 309236 307586 307260 307416 306522 304736 303001 300958 297830 294275 291386
57784B91386k452k486j563L45J377J143J487K982L903L616L757M979N663N074
$$ 291386 288934 286448 284885 285230 286607 287750 289237 292219 296122 299738 303495 308474 314137 319211
57770C19211M737N390N531M325L091K573J541n04j976j935j643k004k004j017
$$ 319211 323948 329338 334869 339194 342285 344858 346399 345895 343919 341984 340341 338337 336333 335316
57756C35316k58n41q88n84m57j009j447j560k288l518l697k568j887k532l304
$$ 335316 335058 334517 333629 333045 332588 331579 330132 328572 326284 322766 319069 316501 314614 312082 308778
57741C08778l480l942m844m821l641l048l726m046l046k125k422k959k741k348
$$ 308778 305298 301356 296512 291691 288050 285002 281276 277230 274184 272059 269637 266678 263937 261589
57727B61589k180j416l8M39m73j153o47j51n42q01k52m2r49j875j947k005k668
$$ 261589 259409 257993 257955 258394 257921 256768 256121 255970 255428 254627 254375 254333 253384 251509 249562 247557 244889
57710B44889l063k744k748l531m006l749l858m471l983k064q24j456k253j686
$$ 244889 241826 239082 236334 232803 228797 225048 221190 216719 212736 210672 209848 208392 206139 204453
57696B04453q73j093j262j08J318J472Q60O18L85m29q89l6J287K001K669M090
$$ 204453 203580 202487 201225 201117 202435 203907 204767 205385 205770 205341 204452 204416 205703 207704 210373 214463
57680B14463N552O211O804Q252J0006J1458J3543J7253K1894K6593L2231M0170
$$ 214463 220015 226226 233030 241282 251288 262746 276289 293542 315436 342029 374260 414430
57668D14430N0157O1003P1919Q1333Q5354P9250O0572L0675n287l9273o3554p5152
$$ 414430 464587 525590 597509 678842 764196 843446 904018 934693 929406 890133 826579 751427
57656G51427p6702p2477o4964n5677m6662l9259l2962k7059k2051j8238j4640
$$ 751427 674725 602248 537284 481607 434945 395686 362724 335665 313614 295376 280736
57645B80736j0788p987p213p284o651n564m929m409l290k010j285q36k55j9l85
$$ 280736 269948 261961 254748 247464 240813 235249 230320 225911 222621 220611 219326 218490 218235 218216 217831
57630B17831n51PN44M73L19L60j46j334k027j766j733k507k811j909j200j840
$$ 217831 217280 217287 217831 218304 218623 218983 218837 217503 215476 213710 211977 209470 206659 204750 203550 201710
57614B01710k685k351j502j300j290p85p06j955l317l076j569l55R3K12Qm67m46
$$ 201710 199025 196674 195172 193872 192582 191797 191091 189136 185819 182743 181174 180819 180912 181124 181132 180665 180219
57597A80219K66N18k77q93l94N0q37k174k467k017j919j952j409q04r42j287j027
$$ 180219 180485 181003 180726 179833 179439 179489 178652 176478 174011 171994 170075 168123 166714 165910 164968 163681 162654
57580A62654p07j138j764j758j570j793j729p21K98K46l13m05m19j000j554j445
$$ 162654 161947 160809 159045 157287 155717 153924 152195 151474 151772 152018 151705 151300 150881 149881 148327 146882
57564A46882j317j614j337l6O86l60j676j406l50l07r20p07O8J36j99J93Q93P54
$$ 146882 145565 143951 142614 142578 143264 142904 141228 139822 139472 139165 138245 137538 137606 137742 137543 137736 138629 139383
57546A39383K60O44J376J038lj83N91J127J237J568J803J254O45J036J545N07
$$ 139383 139643 140287 141663 142701 142698 142515 143106 144233 145470 147038 148841 150095 150740 151776 153321 153828
57530A53828j564k519j795q31n05l69k72n66p85l1J340K109K066J842J391L69
$$ 153828 152264 149745 147950 147119 146614 146245 145973 145407 144622 144591 145931 148040 150106 151948 153339 153708
57514A53708n12l50K28N8m76k45L41P6o17k20J160J858J287M91J14k73q29j203
$$ 153708 153196 152846 153074 153132 152656 152411 152752 152828 152211 151991 153151 155009 156296 156787 156901 156628 155799 154596
57496A54596j467j799j624o57j33j158k537k308p65J92J59K38M37l49j837k343
$$ 154596 153129 151330 149706 149049 148916 147758 145221 142913 142148 142340 142499 142737 143174 142825 140988 138645
57480A38645j509p88r64j273j224j292j544j448j185j472j968j638o86l39p57
$$ 138645 137136 136348 135384 134111 132887 131595 130051 128603 127418 125946 123978 122340 121654 121315 120558
57465A20558r18n16j55J84J012J823J664J030J198J909J799R81R08J659J731P35
$$ 120558 119640 119124 118969 119153 120165 121988 123652 124682 125880 127789 129588 130569 131477 133136 134867 135602
57449A35602nJ71M51M90R65J731J602M93k11K0J62k14q2R92J865J698J143Q89
$$ 135602 135597 135768 136219 136709 137674 139405 141007 141500 141289 141309 141471 141257 141175 142167 144032 145730 146873 147762
57431A47762N70j08n72m80l79o40r04q85p13k33P76J654J387J70p82r07m88M20
$$ 147762 148332 148224 147652 147172 146793 146153 145249 144364 143651 143418 144194 145848 147235 147405 146623 145716 145228 145648
57413A45648J753K444J547O5j83O68Q95J33l07j6p4p95j157q90r15j299r34K52
$$ 145648 147401 149845 151392 151457 151274 151942 152837 152970 152663 152647 152573 151778 150621 149731 148816 147517 146583 146835
57395A46835R59R09J355K518K831J583K24k9J51p1j62L96R15Q93J067J965K777
$$ 146835 147794 148703 150058 152576 155407 156990 157214 157185 157336 157265 157103 157499 158414 159307 160374 162339 165116
57378A65116K671J987J349P81M26P92J606J691O73m77j030j245j143j70J380K167
$$ 165116 167787 169774 171123 171904 172330 173122 174728 176419 177092 176615 175585 174340 173197 173027 174407 176574
57362A76574J738J160J177J252J004R59J232J059L34M1M42M71l62j018o95J0M67
$$ 176574 178312 179472 180649 181901 182905 183864 185096 186155 186489 186530 186972 187443 187081 186063 185368 185378 185845
57345A85845J029J904K409K180J745J306L52r68j590j273j034j234r50J13Q19
$$ 185845 186874 188778 191187 193367 195112 196418 196770 195802 194212 192939 191905 190671 189721 189834 190653
57330A90653N29J46L63M92p2p17q72q30o20L58J783K220J295M50O12Q53L37k31
$$ 190653 191182 191328 191691 192183 192111 191394 190522 189692 189072 189430 191213 193433 194728 195178 195790 196643 196980 196749
57312A96749j26J48K77J027K480L138K191J103J458K637L158K934K675K180R48
$$ 196749 196623 196771 197048 198075 200555 203693 205884 206987 208445 211082 214240 217174 219849 222029 222977
57297B22977m65j061p78j77N73J494K331K964L474L459K518J638K528M915O386
$$ 222977 222512 221451 220673 220496 221069 222563 224894 227858 231332 234791 237309 238947 241475 246390 252776
57282B52776N727M595M734N396M968L556K368J805J660K085K993L408K669J472
$$ 252776 258503 263098 267832 273228 278196 281752 284120 285925 287585 289670 292663 296071 298740 300212
57268C00212P96O80P99J149J411R93K69L94J276J433N38J90J215K243K174J975
$$ 300212 301008 301688 302487 303636 305047 306040 306309 306703 307979 309412 309950 310140 311355 313598 315772 317747
57252C17747K643L336L125K793L171L510L155L203M591O156O493O237O556O875
$$ 317747 320390 323726 326851 329644 332815 336325 339480 342683 347274 353430 359923 366160 372716 379591
57238C79591O167N210N434O570P465Q175R308J0269J0201R807J0317J1357J1666
$$ 379591 385758 390968 396402 402972 410437 418612 427920 438189 448390 458197 468514 479871 491537
57225D91537J1214J0877J0736J0387J0191J0593J0994J0827J0900J2063J3548
$$ 491537 502751 513628 524364 534751 544942 555535 566529 577356 588256 600319 613867
57214F13867J4240J4629J5766J7158J7556J7050J6627J6378J5865J5513J5937
$$ 613867 628107 642736 658502 675660 693216 710266 726893 743271 759136 774649 790586
57203G90586J6589J6689J6728J7492J8379J8419J8127J8674J9942K1100K2253
$$ 790586 807175 823864 840592 858084 876463 894882 913009 931683 951625 972725 994978
57192I94978K3843K5192K5447K5180K5334K5411K4516K3376K3409K4444K5238
$$ 994978 1018821 1044013 1069460 1094640 1119974 1145385 1169901 1193277 1216686 1241130 1266368
57181A266368K5564K5968K6197K5723K5186K5409K5649K4664K2923K1869K1636
$$ 1266368 1291932 1317900 1344097 1369820 1395006 1420415 1446064 1470728 1493651 1515520 1537156
57170A537156K1372K1107K1370K1593K0984K0313K0835K2031K2525K2599K3669
$$ 1537156 1558528 1579635 1601005 1622598 1643582 1663895 1684730 1706761 1729286 1751885 1775554
57159A775554K5710K7429K8608L0023L1418L1853L1806L2648L4117L4623L4012
$$ 1775554 1801264 1828693 1857301 1887324 1918742 1950595 1982401 2015049 2049166 2083789 2117801
57148B117801L3796L4591L5478L6070L7096L8655L9841M0431M1131M1996M2362
$$ 2117801 2151597 2186188 2221666 2257736 2294832 2333487 2373328 2413759 2454890 2496886 2539248
57137B539248M2542M3715M5984M8190M9890N1804N4197N6445N8450O0794O3338
$$ 2539248 2581790 2625505 2671489 2719679 2769569 2821373 2875570 2932015 2990465 3051259 3114597
57126C114597O5183O6248O7425O9111P0987P3171P6229Q0101Q4499R0082R7721
$$ 3114597 3179780 3246028 3313453 3382564 3453551 3526722 3602951 3683052 3767551 3857633 3955354
57115C955354J06728J15460J23504J31760J40712J50414J62011J77412J97539
$$ 3955354 4062082 4177542 4301046 4432806 4573518 4723932 4885943 5063355 5260894
57106E260894K22388K52693K89898L34898L88658M53866N34365O33392P54137
$$ 5260894 5483282 5735975 6025873 6360771 6749429 7203295 7737660 8371052 9125189
57097I125189R01272J079565J291153J536004J814349K126122K468072K833408
$$ 9125189 10026461 11106026 12397179 13933183 15747532 17873654 20341726 23175134
57089B3175134L213187L594909L959542M282469M537409M698134M739666M644127
$$ 23175134 26388321 29983230 33942772 38225241 42762650 47460784 52200450 56844577
57081E6844577M405872M024895L493070K793978J924444R17863j55770j213677
$$ 56844577 61250449 65275344 68768414 71562392 73486836 74404699 74248929 73035252
57073G3035252k186723l030788l722609m250047m606255m791005m814936m700002
$$ 73035252 70848529 67817741 64095132 59845085 55238830 50447825 45632889 40932887
57065D0932887m474810m169547l813686l434400l053958k688291k348051k039916
$$ 40932887 36458077 32288530 28474844 25040444 21986486 19298195 16950144 14910228
57057A4910228j766664j527599j320225j141339r87024q53335p37596o38123n52814
$$ 14910228 13143564 11615965 10295740 9154401 8167377 7314042 6576446 5938323 5385509
57048E385509m79314m16417l63577l19108k80594k47097k19040j95858j75792
$$ 5385509 4906195 4489778 4126201 3807093 3526499 3279402 3060362 2864504 2688712
57039B688712j58169j43645j31839j20807j09396r8119q7358p6730o6379n6695
$$ 2688712 2530543 2386898 2255059 2134252 2024856 1926737 1839379 1762649 1696270 1639575
57029A639575m6589l4504k1063p699P399K8271N5406Q4848J13433J39114J53093
$$ 1639575 1592986 1558482 1537419 1529720 1537119 1565390 1620796 1705644 1819077 1958191 2111284
57018B111284J38214Q3161k013q9482j53602j85446j90591j79061j59301j37140
$$ 2111284 2249498 2332659 2330646 2241164 2087562 1902116 1711525 1532464 1373163 1236023
57008A236023j15889r6749q0113o6382n5538m6817l9363l2905k7746k4326k2590
$$ 1236023 1120134 1023385 943272 876890 821352 774535 735172 702267 674521 650195 627605
56997F27605k1606k0250j8405j6843j5764j4395j2438j0691r561p962m705j97
$$ 627605 605999 585749 567344 550501 534737 520342 507904 497213 487652 479690 474985 474788
56985D74788M103P324R558J1051J1543J0048N310k603j1190j7232j9917k0980
$$ 474788 478891 486215 495773 506824 518367 528415 533725 531122 519932 502700 482783 461803
56973D61803k1653k1194j8948j5892j3096j0276p096m442k951j565J035M520P827
$$ 461803 440150 418956 400008 384116 371020 360744 353648 349206 346255 344690 345725 350245 358072
56960C58072J1089J5216K0156K4758K7837K8341K5088J7512O581n628j6920k5378
$$ 358072 369161 384377 404533 429291 457128 485469 510557 528069 534650 529022 512102 486724
56948D86724k9750l0238k8279k5102k1043j6450j2179q683n590k589K56L266P068
$$ 486724 456974 426736 398457 373355 352312 335862 323683 315000 309410 306821 307077 310343 317411
56935C17411J1444J5556J9648K4931L1245L6262L7551L4048K5269J1258n717k1269
$$ 317411 328855 344411 364059 388990 420235 456497 494048 528096 553365 564623 558906 537637
56923E37637l2130l8081m0099l8539l4175k9070k4733k0762j6612j3160j1137
$$ 537637 505507 467426 427327 388788 354613 325543 300810 280048 263436 250276 239139
56912B39139r615p579n645m746m408l882l606l985m029k839j329p88q53m88J86
$$ 239139 229524 221945 216300 211554 207146 203264 199658 195673 191644 188805 187476 186688 185835 185347 185533
56897A85533O77J573L420N200N751N896P351J0299J3684J7115K0745K3939K5768
$$ 185533 186210 187783 191203 196403 202154 208050 215401 225700 239384 256499 277244 301183 326951
56884C26951K6212K5296K1787J4583M927m403j1684j6684j9139j8663j5901j2353
$$ 326951 353163 378459 400246 414829 419756 415353 403669 386985 367846 349183 333282 320929
56872C20929q945n757k633Q71N446J0886J5824J9719K4140L0716L8777M6569N3714
$$ 320929 311984 306227 303594 304465 309911 320797 336621 356340 380480 411196 449973 496542 550256
56859E50256O0462O5039O3697N3620L4862J0223j5344l6027m8073n1868n0367
$$ 550256 610718 675757 739454 793074 827936 838159 822815 786788 738715 686847 636480
56848F36480m5881l9260l1205k2612j3888n242K698R673J6708K5074L4844M5555
$$ 636480 590599 551339 520134 497522 483634 478392 481090 490763 507471 532545 567389 612944
56836F12944N7531P1196Q5593R8551J07252J07438R3713O3497K1080k3780o1512
$$ 612944 670475 741671 827264 925815 1033067 1140505 1234218 1297715 1318795 1295015 1233503
56825A233503q6774r8597r9167r2450q2094o9904n6705m3889l2839k3435j4561
$$ 1233503 1146729 1048132 948965 856515 774421 704517 647812 603923 571084 547649 533088
56814E33088n784K740J1487K1321L2307M3889N5766O7234P5907P8143P0682N1788
$$ 533088 527304 530044 541531 562852 595159 639048 694814 762048 837955 916098 986780 1038568
56802A038568K2431j2314m4263o6737p8208q0923p7304o9170n8922m8931l9874
$$ 1038568 1060999 1048685 1004422 937685 859477 778554 701250 632080 573158 524227 484353
56791D84353l1293k3376j6727j0982n313K85N570J1257J8059K5242L1583L6769
$$ 484353 453060 429684 412957 401975 396662 396947 402517 413774 431833 457075 488658 525427
56779E25427M0014L8356K8794J2055p449k5051l7891m4769m6311m4976m2871l9741
$$ 525427 565441 603797 632591 644646 637197 612146 574255 529486 483175 438199 395328 355587
56767C55587l4626k8574k3635j9968j6314j2848j1000j0642r955q300o880o294
$$ 355587 320961 292387 268752 248784 232470 219622 208622 197980 188025 179725 172845 166551
56755A66551n602m213k795j891j271r58j319k018k301k327k713l069k576j737
$$ 166551 160949 156736 153941 152050 150779 149821 148502 146484 144183 141856 139143 136074 133498 131761
56741A31761j682k094j691n70k6k02k8O04O89J72M0K88r2r38q82K54J082R60O83
$$ 131761 130079 127985 126294 125724 125698 125496 125468 126072 126761 126933 126973 127261 127169 126231 125349 125603 126685 127645 128328
56722A28328O37K49l63k28N76Q06K69J87R04J288R45J044K156L081K722J589P42
$$ 128328 128965 129214 128851 128623 129199 130005 130274 130461 131365 132653 133598 134642 136798 139879 142601 144190 144932
56705A44932N28R33J784K233J400j78j039q61n57l79K72J091Q46n05j514j431
$$ 144932 145460 146393 148177 150410 151810 151632 150593 149732 149175 148796 149068 150159 151005 150500 148986 147555
56689A47555r71o22N8J007J309Q17M67N90M78r0m47m24n51p43m63j93q56j871
$$ 147555 146584 145962 146020 147027 148336 149153 149620 150210 150688 150598 150151 149727 149176 148433 147970 147777 146921 145050
56671A45050j806r98j104k026j837j58J078R77J020K063K645J694N61P11J410
$$ 145050 143244 142246 141142 139116 137279 137121 138199 139176 140196 142259 144904 146598 147159 147870 149280
56656A49280J421J195J748K675K897K300J495Q99R22J861K904K564Q63m08k32
$$ 149280 150701 151896 153644 156319 159216 161516 163011 163910 164832 166693 169597 172161 173024 172616 172384
56641A72384L92M42M01Q73J331J310J345J691J536N17l99n35o43j407k214k312
$$ 172384 172776 173218 173619 174492 175823 177133 178478 180169 181705 182222 181823 181288 180645 179238 177024 174712
56625A74712j978j636j122o42j037k234k813k006q94p03j206j605j787j809j398
$$ 174712 172734 171098 169976 169334 168297 166063 163250 161244 160350 159647 158441 156836 155049 153240 151842
56610A51842o59k65l04j69J20j53p44m11R18J663J008J16J69P25Q18L07n17j323
$$ 151842 151183 150918 150614 150445 150565 150412 149668 149257 150175 151838 152846 152962 153131 153856 154674 154981 154464 153141
56592A53141j286J72J849J778J23q99l59L26K25L57J334J925J230K08k01m76q95
$$ 153141 151855 152027 153876 155654 155777 154878 154519 154845 155070 155427 156761 158686 159916 160124 159923 159447 158552
56575A58552n77O11J224O42K63J004J700J429J342K524L995M451M260M165L830
$$ 158552 157975 158586 159810 160452 160715 161719 163419 164848 166190 168714 172709 177160 181420 185585 189415
56560A89415L307L992O348Q456Q624P729P165O276L978J281l1rJ46K22N81O96
$$ 189415 192722 196714 203062 211518 220142 227871 235036 241312 245290 246571 246540 246531 246677 246899 247480 248176
56544B48176L0o95p38q03j664k446k032j014o38p82o36m35q73j689k230k602l033
$$ 248176 248206 247511 246773 245970 244306 241860 239828 238814 238176 237394 236758 236323 235450 233761 231531 228929 225896
56527B25896l033k379j832j794j476m40L97L73K11L91K0j372k611k736k500k650
$$ 225896 222863 220484 218652 216858 215382 214942 215339 215712 215923 216314 216334 214962 212351 209615 207115 204465
56511B04465k491j601j048j410j458m85Q3q09j714j113m8j53q97j024j005j685
$$ 204465 201974 200373 199325 197915 196457 195972 196055 195246 193532 192419 192371 192218 191321 190297 189292 187607
56495A87607k129j308k99m38p89j0R15M73l12L84J686J373j52m49Q99J814J164
$$ 187607 185478 184170 183871 183433 182644 182634 183549 184022 183710 184094 185780 187153 187001 186552 187451 189265 190429
56478A90429l5q45j431j779j433o18P0P84J777K212J324R6l3O44R30R21J375J834
$$ 190429 190394 189549 188118 186339 184906 184288 184358 185142 186919 189131 190455 190551 190518 191162 192092 193013 194388 196222
56460A96222J355M50K96O51N43K59P44J632J892J702J761J548K50j243j332j74
$$ 196222 197577 198027 198323 198974 199517 199776 200520 202152 204044 205746 207507 209055 209305 208062 206730 206556
56444B06556P92J108J325J436J122Q40R89Q70M3l85L71J002K40o79n0J186J025
$$ 206556 207348 208456 209781 211217 212339 213179 214168 215038 215081 214696 215067 216069 216309 215630 215580 216766 217791
56427B17791j00k50N46N97k50n69j11P4m3L90J019P10k02m42j77n27j238j112
$$ 217791 217691 217441 217987 218584 218334 217765 217654 217728 217685 218075 219094 219804 219602 219160 218983 218456 217218 216106
56409B16106l99l07o56l70K06o3o84k57Q35J064O39J067K234K626K219K391L054
$$ 216106 215707 215400 214744 214374 214580 214517 213833 213576 214411 215475 216114 217181 219415 222041 224260 226651 229705
56392B29705K599Q54n38q53j009j417j470j248j476j737j004R4j68j701k601k103
$$ 229705 232304 233158 232620 231767 230758 229341 227871 226623 225147 223410 222406 222500 222332 220631 218030 215927
56376B15927j273p09J92J509K536L309M472N500N151L616K309J654R95M35O70
$$ 215927 214654 213945 214137 215646 218182 221491 225963 231463 236614 240230 242539 244193 245188 245623 246293
56361B46293J265J158O34P54J242J045M89O13R13J51j010q22N32J209P87N18P33
$$ 246293 247558 248716 249350 250104 251346 252391 252880 253493 254406 254557 253547 252725 253257 254466 255253 255771 256504
56344B56504N74J61N13J321J202J13o96q59q61l20J297K853K908K323K946M345
$$ 256504 257078 257239 257752 259073 260275 260388 259692 258833 257972 257652 258949 261802 264710 267033 269979 274324
56328B74324M660M011M041M616M201L047K831L331K845J606J461K228J875M27
$$ 274324 278984 282995 287036 291652 295853 298900 301731 305062 307907 309513 310974 313202 315077 315504
56314C15504Q2J227J742Q43J67M50L79m01l05J260K737L091L107L382L489L574
$$ 315504 315586 316813 318555 319398 319565 320015 320394 319993 319688 320948 323685 326776 329883 333265 336754 340328
56298C40328M375N310M914L393K346K119J869J890L045M276L768K296K292L867
$$ 340328 344703 350013 354927 358320 360666 362785 364654 366544 369589 373865 377633 379929 382221 386088
56284C86088M944N003N270N565M728L795M876P006P185N571N359P302Q753Q649
$$ 386088 391032 396035 401305 406870 411598 415393 420269 427275 434460 440031 445390 452692 461445 470094
56270D70094Q974J0428J1059J0341J0437J2240J3995J4909J6280J8184J9085J9619
$$ 470094 479068 489496 500555 510896 521333 533573 547568 562477 578757 596941 616026 635645
56258F35645K2518K7653L1508L2956L5199M0482M7104N3332O0004O7398P3702
$$ 635645 658163 685816 717324 750280 785479 825961 873065 926397 986401 1053799 1127501
56247A127501P8611Q4564R2438R9715J04669J08517J11667J11955J08614J03921
$$ 1127501 1206112 1290676 1383114 1482829 1587498 1696015 1807682 1919637 2028251 2132172
56237B132172R8697R0159P6599O0368M3815K6042O198j3602l1294m7487o2616
$$ 2132172 2230869 2321028 2397627 2457995 2501810 2527852 2534050 2520448 2489154 2441667 2379051
56226B379051p4788q2931q8942r4349r7907r8586r7776r6436r3229q7636q1716
$$ 2379051 2304263 2221332 2132390 2038041 1940134 1841548 1743772 1647336 1554107 1466471 1384755
56215A384755p6793p1596o5536o0330n6456n1734m5461m0226l7439l4861l0868
$$ 1384755 1307962 1236366 1170830 1110500 1054044 1002310 956849 916623 879184 844323 813455
56204H13455k7310k5647k4066k1094j8374j7182j5793j2993j0626r924q982o569
$$ 813455 786145 760498 736432 715338 696964 679782 663989 650996 640370 630446 621464 614895
56192F14895m796n152n551m228k948l351l678k255p71j007j598j049o40j397j544
$$ 614895 610099 604947 599396 595168 592220 588869 585191 582936 582165 581158 579560 578511 577871 576474 574930
56177E74930N9J282M92m32K85J156P49O62K159L442L177L162M574N384M436M188
$$ 574930 574989 576271 576763 576331 576616 577772 578521 579183 581342 584784 587961 591123 595697 601081 605517 609705
56161F09705O170P785O989O118P518R357R474R390J0751J1749J0956J0846J3531
$$ 609705 615875 623660 630649 636767 644285 653642 663116 672506 683257 695006 705962 716808 730339
56148G30339J6777J8231J9689K3167K6734K8590L1375L7883M6203N3586O1618
$$ 730339 747116 765347 785036 808203 834937 863527 894902 932785 978988 1032574 1094192
56137A094192P2897Q6055R8411J10002J20426J25353J21052J09515R4911P8564
$$ 1094192 1167089 1253144 1351555 1461557 1581983 1707336 1828388 1937903 2032814 2111378
56127B111378O1614M8559M2746M1383L9613L6269L1446K2580Q333o975j7953k4317
$$ 2111378 2172992 2221551 2264297 2305680 2345293 2381562 2413008 2435588 2443921 2436946 2418993 2394676
56115B394676k8346l0245l0946l5399m7356o3897p9932r4414j07265j14592j13013
$$ 2394676 2366330 2336085 2305139 2269740 2222384 2158487 2078555 1984141 1876876 1762284 1649271
56104A649271j05346r6242q5672p2128n8451m8386m0642l2218k4293j9166j4990
$$ 1649271 1543925 1447683 1362011 1289883 1231432 1183046 1142404 1110186 1085893 1066727 1051737
56093A051737r358m596l520l595j294J499J535Q34K792N472N379M270N588P673
$$ 1051737 1042379 1037783 1034263 1030668 1029374 1030873 1032408 1033242 1036034 1041506 1046885 1051155 1056743 1064416
56079A064416P339O436Q082R965Q464N879O401Q502Q467P887J0228J3563J4145
$$ 1064416 1071755 1078191 1086273 1096238 1104702 1110581 1116982 1125484 1133951 1141838 1152066 1165629 1179774
56066A179774J3714J5885J8899J9426J9588K2495K4918K2587J8767J8998K1301
$$ 1179774 1193488 1209373 1228272 1247698 1267286 1289781 1314699 1337286 1356053 1375051 1396352
56055A396352K0274J7057J6182J6427J4055J1529J3436J7193J7342J5668J7458
$$ 1396352 1416626 1433683 1449865 1466292 1480347 1491876 1505312 1522505 1539847 1555515 1572973
56044A572973K1134K1561K0237K2120K5592K5851K4892K7720L1936L1788K9360
$$ 1572973 1594107 1615668 1635905 1658025 1683617 1709468 1734360 1762080 1794016 1825804 1855164
56033A855164L0769L4556L5031L3848L6707M1691M2729M1591M4414M9210M9246
$$ 1855164 1885933 1920489 1955520 1989368 2026075 2067766 2110495 2152086 2196500 2245710 2294956
56022B294956M6121M6984N1338N3157N3381N7490O3346O4647O3744O7838P5181
$$ 2294956 2341077 2388061 2439399 2492556 2545937 2603427 2666773 2731420 2795164 2863002 2938183
56011B938183P8563P9435Q4515R1597R3406R2421R6838J04914J08741J10267J17515
$$ 2938183 3016746 3096181 3180696 3272293 3365699 3458120 3554958 3659872 3768613 3878880 3996395
56000C996395J28229J34019J37310J46893J60107J67639J72406J84630K01603
$$ 3996395 4124624 4258643 4395953 4542846 4702953 4870592 5042998 5227628 5429231
55991E429231K12371K19157K33217K52635K66175K76257K95286L21803L44040
$$ 5429231 5641602 5860759 6093976 6346611 6612786 6889043 7184329 7506132 7850172
55982G850172L64431L95718M35297M69690N02195N48548O07231O62983P17940
$$ 7850172 8214603 8610321 9045618 9515308 10017503 10566051 11173282 11836265 12554205
55973A2554205P88808Q75039R62072J054591J172461J315543J469075J642085
$$ 12554205 13343013 14218052 15180124 16234715 17407176 18722719 20191794 21833879
55965B1833879J861137K128383K429469K781675L227018L778898M427209N194574
$$ 21833879 23695016 25823399 28252868 31034543 34261561 38040459 42467668 47662242
55957D7662242O129858P249467Q555292J0114776J2051743J4463556J7441186
$$ 47662242 53792100 61041567 69596859 79711635 91763378 106226934 123668120
55950A23668120K1161402K5802901L1275886L7049816M2131192M4946790M3310397
$$ 123668120 144829522 170632423 201908309 238958125 281089317 326036107 369346504
55943C69346504L5189295K0319447J284233j7392535l1671614l9851518m2512628
$$ 369346504 404535799 424855246 426139479 408746944 377075330 337223812 294711184
55936B94711184m1249954l7644459l2955111k8090816k3568288j9576760j6164940
$$ 294711184 253461230 215816771 182861660 154770844 131202556 111625796 95460856
55929I5460856j3343533j1057696r194809p667092o435452n451343m641658l961178
$$ 95460856 82117323 71059627 61864818 54197726 47762274 42310931 37669273 33708095
55921C3708095l403973k953427k569568k232407j951498j724323j525739j344932
$$ 33708095 30304122 27350695 24781127 22548720 20597222 18872899 17347160 16002228
55913A6002228j194231j074281r65565q60780p72898p04882o41987n79656n30001
$$ 16002228 14807997 13733716 12768151 11907371 11134473 10429591 9787604 9207948 8677947
55904H677947m94709m58946m17941l83867l60700l36785l07924k84439k69492
$$ 8677947 8183238 7724292 7306351 6922484 6561784 6224999 5917075 5632636 5363144
55895E363144k52476k29614k10375j98025j83642j64749j50693j44138j35387
$$ 5363144 5110668 4881054 4670679 4472654 4289012 4124263 3973570 3829432 3694045
55886C694045j20420j07295r9528q9619p4153n9495m7771l2455j2682K492Q324
$$ 3694045 3573625 3466330 3366802 3277183 3203030 3143535 3095764 3063309 3050627 3053119 3061443
55875C061443Q976M584j1563l8745o5633q5689j02757j17897j24603j21520j16671
$$ 3061443 3070419 3075003 3063440 3024695 2959062 2873373 2770616 2652719 2528116 2406596 2289925
55864B289925j14079j08460r7605q7900q2726p7038o8199o1199n8374n4703m7842
$$ 2289925 2175846 2067386 1969781 1881881 1799155 1722117 1653918 1592719 1534345 1479642 1431800
55853A431800m2610m1155l8738l3506l0535l1978l2804l0468k9345l1397l1822
$$ 1431800 1389190 1348035 1309297 1275791 1245256 1213278 1180474 1150006 1120661 1089264 1057442
55842A057442k8255k5261k5404k4628k0742j8046j9080j9901j7756j5718j5848
$$ 1057442 1029187 1003926 978522 953894 933152 915106 896026 876125 858369 842651 826803
55831H26803j5332j3033j2307j3827j3204r165o513p575q387o794o497r340j1345
$$ 826803 811471 798438 786131 772304 759100 749935 743422 735847 727460 720666 714169 704829 693484
55818F93484j0307r958j2505j4270j2815j1350j2038j1774q716o283o518o044
$$ 693484 683177 673219 660714 646444 633629 622279 610241 598467 589751 583468 576950 570906
55806E70906k722P0k2J24K862N266N117N379Q307J0816J0057Q139P157M952N5
$$ 570906 568184 568254 568232 568356 571218 576484 581601 586980 595287 606103 616160 624299 631456 636408 636463
55791F36463m396n957p046r818j1880j1157j0050j0613j0477p856n912p790j1443
$$ 636463 632067 626110 619064 609246 597366 586209 576159 565546 555069 547213 541301 533511 522068
55778E22068j3535j4402j5251j4519j1002o905m076q39M179Q817J1027J1753J1257
$$ 522068 508533 494131 478880 464361 453359 446454 442378 441539 445718 454535 465562 477315 488572
55765D88572P006j300q973j2173j2611j3106j2808j0548q580q879r403p979o401
$$ 488572 495578 494278 485305 473132 460521 447415 434607 424059 415479 406600 397197 389218 382817
55752C82817o861p840p412p211r151j1302j1007r229q163p313n459l812l762m005
$$ 382817 375956 368116 360704 353493 344342 333040 322033 312804 304641 297328 291869 288057 284295 280290
55738B80290k992j710j215l85J130R26k057m682m125k235k069l093l264l104m107
$$ 280290 277298 275588 274373 273988 275118 276044 273987 269305 265180 262945 260876 257783 254519 251415 247308
55723B47308n442n608n182n032m118j871k20n02r22K29J598J732K040L846N366
$$ 247308 241866 236258 231076 226044 221926 220055 219835 219333 218411 218640 220238 221970 224010 227856 233222
55708B33222M835L806M148M489K874M21r64k017m026n807n946n718o527o968n591
$$ 233222 238057 241863 246011 250500 253374 253795 252831 250814 246788 240981 235035 229317 222790 215822 210231
55693B10231m119m559n506m726l114k627k454q43J279K007J925K512K990K111
$$ 210231 206112 201553 196047 191321 188207 185580 183126 182283 183562 185569 187494 190006 192996 195107
55679A95107J232K175L705L515K123J471J299J79j320j766j764k642l639l346
$$ 195107 196339 198514 202219 205734 207857 209328 210627 210806 209486 207720 205956 203314 199675 196329
55665A96329k518k551k675j604l06j95k68R13K221K110J921L599N826O045M911
$$ 196329 193811 191260 188585 186981 186675 186480 186212 187125 189346 191456 193377 196976 202802 208847 213758
55650B13758M981O146O113M514K933J614l87k447l133l161m374o328p090o835
$$ 213758 218739 224885 230998 235512 238445 240059 239672 237225 234092 230931 226557 220229 213139 206304
55636B06304p394q601q389o365m321l197k339j687k014k910l012k318k091k581
$$ 206304 198910 190309 181920 175555 171234 168037 165698 164011 161997 159087 156075 153757 151666 149085
55622A49085k872k745k713k611j994j408j482j503p26j03p11j596j342p00j185
$$ 149085 146213 143468 140755 138144 136150 134742 133260 131757 131031 130928 130217 128621 127279 126579 125394
55607A25394k201k119j288j214j600r83K45K71j014j870j487o15K54J141J380
$$ 125394 123193 121074 119786 118572 116972 115989 116234 116505 115491 113621 112134 111519 111773 112914 114294
55592A14294L31j068j477j289j611j953j162J29L52l12m35O7J87M6M70R54L69
$$ 114294 114625 113557 112080 110791 109180 107227 106065 106194 106546 106234 105799 105866 106053 106099 106569 107523 107892
55575A07892p19p83J04O68Q08J284J694J122K36L17Q67N34j98J86J277J351M65
$$ 107892 107173 106390 106494 107162 107970 109254 110948 112070 112306 112623 113490 114024 113826 114012 115289 116640 117105
55558A17105K73R48J043L02j7L55L71j29j94J94R6m04l60ql89j196j173m78l41
$$ 117105 117378 118326 119369 119671 119654 120009 120380 120251 120057 120251 120347 119943 119583 119575 119186 117990 116817 116339 115998
55539A15998o14j17Q64Q60n5m09o8k77r60o28P72J480P39l08q86j395j733j061
$$ 115998 115384 115267 116131 116991 116936 116527 116459 116182 115222 114594 115366 116846 117585 117277 116391 114996 113263 112202
55521A12202L39J100R51Q73J020P22N04J612L357L454J492m24r56j037j559j991
$$ 112202 112541 113641 114592 115465 116485 117207 117711 119323 122680 126134 127626 127202 126246 125209 123650 121659
55505A21659k089k647l674l876k824j726j338r83l14j38p12j010n19p3k27m41
$$ 121659 119570 116923 113249 109373 106549 104823 103485 102502 102188 102050 101338 100328 99809 99736 99509 99068
55489I9068m38p06j175j006k49ln24q18n06l25m17LQ75J065M30K19Q90J398J194
$$ 99068 98630 97924 96749 95743 95494 95491 94967 94149 93643 93318 92901 92904 93779 94844 95274 95493 96383 97781 98975
55470I8975J010J079N38o90j404j213j258k023k358j553n90k87j1P28J131O72
$$ 98975 99985 101064 101602 100912 99508 98295 97037 95014 92656 91103 90513 90226 90215 90943 92074 92746
55454I2746K11M33N72j01q52o94R6O78Q39O45m4r25j136m86J50J86k6j87n38r10
$$ 92746 92957 93390 93962 93861 93009 92315 92411 93089 93928 94573 94529 93604 92468 91982 92132 92318 92292 92105 91567 90657
55434I0657o48M9J16n77q57j49O37P78P64J005J012O11N20R32R42K18j82L33O31
$$ 90657 90009 90058 90174 89597 88740 88591 89228 90006 90770 91775 92787 93398 93918 94850 95792 96010 95828 96161 96792
55415I6792l64j816k097r83L55R33O59Om43m57m16o67p26qQ91Q13j13o04k24J72
$$ 96792 96428 94612 92515 91532 91887 92820 93479 93485 93042 92585 92169 91502 90776 90768 91659 92472 92359 91755 91531 91703
55395I1703K4l33p67j422j651o25Q44R41l81j241p87k25l54k54O28J242Q89M65
$$ 91703 91727 91394 90627 89205 87554 86929 87773 88714 88333 87092 86305 86080 85726 85472 86100 87342 88231 88696
55377H8696N97L89o62j320n82N09N58j44o33r94j596j841j154j85K73N49J112
$$ 88696 89293 89682 89020 87700 87118 87627 88185 88041 87408 86414 84818 82977 81823 81638 81911 82460 83572
55360H3572J443J163J043J596J761N56j003j231k34M92L44J9O0K58L58L38J90
$$ 83572 85015 86178 87221 88817 90578 91134 90131 88900 88666 89158 89502 89521 89581 89839 90197 90535 90725
55343I0725N8K43N73M19k58o69m60k68m54m56k6J15l69o08QP02O58L40M41O18
$$ 90725 90783 91026 91599 92018 91760 91091 90631 90363 89909 89453 89427 89542 89173 88565 88573 89275 89933 90273 90714 91332
55323I1332L52J4oj91q07r93j51P52N61l22q11q61j004j068p09m30o96p70J66
$$ 91332 91684 91698 91692 91501 90694 89701 89550 90302 90863 90541 89730 88869 87865 86797 86088 85658 84962 84192 84358
55304H4358J370J558R15O54R45P71k90j457j853j301j51Q04O87l95j080m24P65
$$ 84358 85728 87286 88201 88855 89800 90571 90281 88824 86971 85670 85519 86323 87010 86615 85535 85111 85876
55287H5876J195J008J245J947K122J354K77m57o88m16J88O13N85N50Q96J154P61
$$ 85876 87071 88079 89324 91271 93393 94747 95024 94567 93879 93463 93651 94264 94849 95399 96295 97449 98210
55270I8210P6k28k88o51j112j007l95P0J90L72P55R76P46J57m32n38N2P02M09
$$ 98210 98286 98058 97770 97119 96007 95000 94605 94675 94865 95237 95992 96968 97714 97871 97439 96901 96953 97655 98064
55251I8064p83j584j182k90J16J44L16M95M41N44J006J067J46r67j186o94l76
$$ 98064 97281 95697 94515 94225 94341 94485 94801 95296 95737 96281 97287 98354 98500 97533 96347 95653 95277
55234I5277l31j30M4k84q26r64p95p10m59L11J063J132Q69Q93P61k50j444j391
$$ 95277 94946 94816 94860 94576 93750 92786 91991 91281 90822 91133 92196 93328 94197 95090 95851 95601 94157 92766
55216I2766n7J138J392J220J106P56O4m40m56l98o05p77m69L36J214J600J185
$$ 92766 92709 93847 95239 96459 97565 98321 98385 97945 97489 97091 96486 95709 95240 95576 96790 98390 99575
55199I9575L76k4J01K7m69n02L61R47Q3j449j950j276p21q13q25m43l11o37o85
$$ 99575 99951 99927 100028 100055 99586 99084 99445 100392 100475 99026 97076 95800 95079 94266 93441 92998 92687 92050 91365
55180I1365j8Q13J218J250J030M47k40l44L70J333J936K048J687R35K13m6r5n27
$$ 91365 91347 92160 93378 94628 95658 96105 95865 95521 95891 97224 99160 101208 102895 103830 104043 103997 103902 103375
55162A03375j180j181k33Q50J189P76J22m49q50j012r16o47k89J15N31R32J177
$$ 103375 102195 101014 100781 101631 102820 103596 103718 103269 102419 101407 100491 99844 99555 99670 100201 101133 102310
55145A02310Q92j26j271j522p80o0LKM91Q21K82l98K2J320K107J806J163P85M64
$$ 102310 103202 103076 101805 100283 99503 99443 99446 99448 99939 100760 101042 100644 100666 101986 104093 105899 107062 107847 108311
55126A08311J3l09m12n32o29m12q1k73j003j436r35J55R70R88L48l29m82k23k02
$$ 108311 108324 108015 107603 107071 106442 106030 105949 105676 104673 103237 102302 102457 103427 104415 104763 104434 103952 103729 103527
55107A03527o48j028r63q32r18p17R7P66N60J33N74J568J889J438J312J853K085
$$ 103527 102879 101851 100888 100056 99138 98421 98518 99284 99844 99977 100551 102119 104008 105446 106758 108611 110696
55090A10696J364L58o9O1K92M23L53n9o29r13q50q05q00m01M74J235J328Q11J26
$$ 110696 112060 112418 112349 112410 112702 113125 113478 113419 112790 111877 111027 110222 109422 109021 109495 110730 112058 112869 112995
55071A12995k68q2N40R10M63n17j222j315j103r10p76o65n15j73L35P33R20J101
$$ 112995 112727 112645 113185 114095 114558 114041 112819 111504 110401 109491 108715 108050 107535 107362 107697 108430 109350 110451
55053A10451J150N42n55r61jJ380J892J586J187N60p77k192k499j716r33n89k34
$$ 110451 111601 112143 111588 110627 110626 112006 113898 115484 116671 117231 116454 114262 111763 110047 109114 108525 108291
55036A08291J30n0n72m74M03J062P91n8r05j532j667j053q8M99P03J008J211O50
$$ 108291 108421 108371 107799 107325 107728 108790 109581 109523 108618 107086 105419 104366 104278 104777 105480 106488 107699 108349
55018A08349m49j081j022j023j319j237n74m4Q5N11J563K418K285J451O97M16
$$ 108349 107900 106819 105797 104774 103455 102218 101644 101600 101685 102196 103759 106177 108462 109913 110610 111026
55002A11026O58J248J582J133K95n8J21J76N1K95P20N25j16j29N22N12o12j544
$$ 111026 111684 112932 114514 115647 115942 115884 116005 116181 116232 116527 117247 117772 117656 117527 118049 118561 117949 116405
54984A16405j286o22n50o54k00L66K97m4J27O22P65O24O88Q27O69M78P47J234
$$ 116405 115119 114497 113947 113293 113093 113459 113756 113712 113839 114461 115226 115850 116538 117365 118034 118512 119259 120493
54966A20493J351J117R35Q09N59M60Q00J126P64p3m95j66K71J55l85o62l08K41
$$ 120493 121844 122961 123896 124705 125264 125724 126524 127650 128414 128341 127846 127680 127951 128106 127721 127059 126751 126992
54948A26992J97n44j157j016o67r09j316p64O54J595J505J315J639J694Q08k62
$$ 126992 127189 126645 125488 124472 123805 122896 121580 120816 121470 123065 124570 125885 127524 129218 130026 129764
54932A29764n57l55l19r6R84K442L174L095L077L520M025M413N080O292P738Q832
$$ 129764 129207 128852 128533 128437 129421 131863 135037 138132 141209 144729 148754 153167 158247 164539 172277 181109
54916A81109R084Q287O769N130L414R45k514n937p993q444q018p317o490n661
$$ 181109 190193 198480 205249 210379 213793 214738 212224 206287 198294 189850 181832 174515 168025 162364
54902A62364m947m218l417k899k955l263l219k663j811q71o8K95K64L44P54J035
$$ 162364 157417 153199 149782 146883 143928 140665 137446 134783 132972 132101 132033 132328 132592 132936 133690 134725
54886A34725Q99R30J765L034L765L608K997K416K220K871M554O615Q005Q295P809
$$ 134725 135624 136554 138319 141353 145118 148726 151723 154139 156359 159230 163784 170399 178404 186699 194508
54871A94508O867N432L450J114j280l448n183o499p478p962p689o946o460o395
$$ 194508 201375 206807 210257 211371 210091 206643 201460 194961 187483 179521 171832 164886 158426 152031
54857A52031o004m763l247k347k083j872j545j352j267j068r38j281j958k254
$$ 152031 146027 141264 138017 135670 133587 131715 130170 128818 127551 126483 125545 124264 122306 120052
54843A20052j711n29P58J647J786J179K84l88p35r62j170j274j166p99l22j47
$$ 120052 118341 117812 118570 120217 122003 123182 123466 123078 122343 121381 120211 118937 117771 116972 116650 116503
54827A16503n60j124r72O9J114J300P61J89p6p8J64O00R23Q49M61N0j10K04R28
$$ 116503 115943 114819 113847 113916 115030 116330 117091 117280 117204 117126 117290 117890 118813 119662 120123 120173 120063 120267 121195
54808A21195J449J117K06l17j19J67K00M87J226J603J014J46o0J44j45j034j840
$$ 121195 122644 123761 123967 123650 123531 123698 123898 124385 125611 127214 128228 128374 128314 128458 128313 127279 125439
54791A25439k156k041j507o27J20L20K65N07J086J708K201K350J846J007Q36J667
$$ 125439 123283 121242 119735 119108 119228 119548 119813 120320 121406 123114 125315 127665 129511 130518 131354 133021
54775A33021K479K393K021K320K970L180L404M584O151O530N649N273O480Q222
$$ 133021 135500 137893 139914 142234 145204 148384 151788 156372 162523 169053 174702 179975 186455 194677
54761A94677Q824P805N677L009K82k060l971n677p065p736p752p561p121o013
$$ 194677 203501 211306 216983 219992 220274 218214 214243 208566 201501 193765 186013 178452 171331 165318
54747A65318m536l692l783l864l092j810q16l04j3J20O0k5N7K78N56Q04P44K55
$$ 165318 160782 157090 153307 149443 146351 144541 143725 143421 143408 143528 143588 143563 143620 143898 144454 145258 146002 146257
54729A46257j00M19J563K256K206K427L632N060N682N790O333P141P013N464L413
$$ 146257 146157 146576 148139 150395 152601 155028 158660 163720 169402 175192 181525 188666 195679 201143 204556
54714B04556J784L50j560l775n409o038o180o459o742o413n282l916l030k827
$$ 204556 206340 206690 205130 201355 195946 189908 183728 177269 170527 164114 158832 154916 151886 149059
54700A49059l023l239l239k905k237j346m10K68K80n06j499j745r56J17O20M98
$$ 149059 146036 142797 139558 136653 134416 133070 132660 132928 133208 132702 131203 129458 128502 128619 129239 129737
54684A29737K17m8m70j035j446j511j270q11k66J56M11O85J041J236J115R21Q27
$$ 129737 129954 129906 129436 128401 126955 125444 124174 123363 123097 123253 123664 124349 125390 126626 127741 128662 129489
54667A29489N30k28j063j324q75j10N66Q14L32o61j209n87O65J318R91M21K49
$$ 129489 130019 129791 128728 127404 126529 126419 126985 127799 128131 127470 126261 125674 126339 127657 128648 129069 129318
54650A29318K39j12p75j236j052k54O33R90P23L42K54K93K05K07N42R39R53N69
$$ 129318 129557 129445 128670 127434 126382 126128 126761 127751 128474 128816 129070 129363 129568 129775 130317 131256 132209 132778
54632A32778lp52j521j717j067k61k5m8L05O93L26n08o95o6L87K05J23O72J280
$$ 132778 132775 132023 130502 128785 127718 127457 127432 127384 127689 128382 128708 128200 127505 127439 127826 128031 128154 128826 130106
54613A30106J298R48O87M38P6l7L29O22J58r46j902k069j344r4J040J567J585
$$ 130106 131404 132352 133039 133477 133553 133516 133845 134467 134625 133679 131777 129708 128364 128270 129310 130877 132462
54596A32462J538J505J193O30K21N2k04n89p07n17n62j097j618j653j420j263
$$ 132462 134000 135505 136698 137328 137549 137601 137397 136808 136101 135584 135022 133925 132307 130654 129234 127971
54580A27971j037m51M04J245J915K206J866J066M10J86L3l38o38n74l44k21o7
$$ 127971 126934 126483 126887 128132 130047 132253 134119 135185 135595 135781 135814 135476 134838 134264 133920 133699 133632
54563A33632L05P31R75J031Q86M84J09K83R46J317J000M85K13j39q44j371j126
$$ 133632 133937 134668 135643 136674 137560 138044 138153 138436 139382 140699 141699 142184 142397 142258 141414 140043 138917
54546A38917m41m0M8K61O84J163J801K535K653J678M40J94Q56J163N95k0N9M32
$$ 138917 138476 138436 138484 138745 139429 140592 142393 144928 147581 149259 149699 149893 150749 151912 152507 152487 152546 152978
54528A52978M32J21j25l24n93o83l90p5j67m65m33l8K47J24l00q97j622k176k106
$$ 152978 153410 153531 153406 153082 152489 151806 151416 151341 151174 150709 150276 150238 150485 150609 150309 149412 147790 145614 143508
54509A43508j376n28nL32P80J178J113N99Q8j86m43q11r50n45J41N45N74O71J135
$$ 143508 142132 141604 141599 141931 142711 143889 145002 145601 145689 145503 145060 144249 143299 142754 142895 143440 144014 144685 145820
54490A45820J625J523O61m34j005q01l06j50l50l30K87J217J905K098J833J220
$$ 145820 147445 148968 149629 149195 148190 147389 147083 146933 146583 146253 146540 147757 149662 151760 153593 154813
54474A54813M86J9k0J56L76Q24J585K204K168J596R94N68K26Pm0k11p29j180r74
$$ 154813 155299 155318 155298 155454 155830 156654 158239 160443 162611 164207 165201 165769 165995 166002 165962 165751 165022 163842 162868
54455A62868l03O0j28l48k50m7J08M18Q63R70M62l56j105j733k176k135j537q26
$$ 162868 162565 162625 162497 162149 161899 161852 161960 162378 163241 164211 164673 164317 163212 161479 159303 157168 155631 154805
54437A54805n19o80r82r87l85O71J449J305M88k36o13r83j315j050p2R57J526
$$ 154805 154286 153606 152624 151637 151252 151923 153372 154677 155165 154929 154316 153333 152018 150968 150896 151853 153379
54420A53379J808J962J741J166Q18Q89P42lo58n38j91o30j745k401j982r86j27
$$ 153379 155187 157149 158890 160056 160874 161763 162505 162502 161844 161306 161115 160485 158740 156339 154357 153371 153244
54403A53244M19P59Q54O07J24k48j34N47J347J678J545J556J987K284J823Q25
$$ 153244 153663 154422 155276 155883 156007 155759 155625 156172 157519 159197 160742 162298 164285 166569 168392 169217
54387A69217N4j06J41M62O34N32K00k05p75j736k798l104k280j162q39j284j526
$$ 169217 169271 169165 169306 169768 170402 170934 171134 170929 170154 168418 165620 162516 160236 159074 158235 156951 155425
54370A55425r63P1R47J346J242Q32N59Q15J520K216K537K380J779Q82J0n25n88
$$ 155425 154462 154533 155480 156826 158068 158900 159459 160274 161794 164010 166547 168927 170706 171588 171598 171073 170485
54353A70485j44P73J810K374K225J793J596J624J584J474J467J453J111L83m12
$$ 170485 170341 171114 172924 175298 177523 179316 180912 182536 184120 185594 187061 188514 189625 190008 189596
54338A89596r34j112j205j669k714l912m496m175l295k188r05K37N95P9n36o08
$$ 189596 188662 187550 186345 184676 181962 178050 173554 169379 166084 163896 162991 163228 163823 163902 163366 162758
54322A62758m24m38m12n5J54l61j138j181m15K82L75J66Jk08n12p26p71p35n18
$$ 162758 162334 161896 161484 161429 161583 161222 160084 158903 158488 158770 159145 159311 159312 159104 158592 157866 157095 156360 155842
54303A55842j1M01J93m49p57m59j49l84r73j359j190l91Q06J713J625O50k41k79
$$ 155842 155831 156232 156425 155976 155219 154760 154611 154227 153254 151895 150705 150314 151120 152833 154458 155108 154867 154588
54285A54588L79J076J351J017j4j479k601k604j445Q4J092J338J297J483J743
$$ 154588 154967 156043 157394 158411 158397 156918 154317 151713 150268 150352 151444 152782 154079 155562 157305
54270A57305J510P33J36K40N84L93k72o88o16n38p25q16n23j40N1K82Q22J338
$$ 157305 158815 159548 159684 159924 160508 160901 160629 159941 159325 158787 158062 157246 156723 156583 156634 156916 157738 159076
54252A59076J268O48Q7n2n5k65m22J9R49J450Q47l28r35o52k67m76j033j326j160
$$ 159076 160344 160992 161079 161027 160972 160707 160285 160304 161253 162703 163550 163222 162287 161635 161368 160892 159859 158533 157373
54233A57373o59P5O63M22p26j776j732q28k7L12M08J98n27j196q66L97J439J518
$$ 157373 156714 156789 157452 157874 157148 155372 153640 152812 152785 153097 153505 153703 153176 151980 151114 151511 152950 154468
54215A54468J023N01p2p32j131j178j386j984k322j714m05Q51J731K241K151J252
$$ 154468 155491 155992 155920 155188 154057 152879 151493 149509 147187 145473 145068 145919 147650 149891 152042 153294
54199A53294N7m77K5R73J514J298N44k69p20p02m80l98n43p18p70p39o74m66o9
$$ 153294 153351 152874 152899 153872 155386 156684 157228 156959 156239 155537 155057 154659 154116 153398 152628 151889 151215 150749 150680
54180A50680K37M1n56q14k27O46P96K04o2O12J424J373P37N43R20R56J44r06j395
$$ 150680 150917 150958 150402 149588 149361 150007 150803 151007 150945 151557 152981 154354 155091 155634 156554 157510 157654 156748 155353
54161A55353j244q56n21l57m21o33p96p86n45j6O77J162J249J140Q99J73r86j545
$$ 155353 154109 153253 152732 152375 151954 151321 150525 149739 149194 149178 149855 151017 152266 153406 154305 154478 153492 151947
54143A51947p25O17R44K23j36M54R86O91K37L76O48L94R1N21J291J369O94K18
$$ 151947 151222 151839 152783 153006 152870 153324 154310 155001 155238 155614 156262 156656 156747 157268 158559 159928 160622 160840
54125A60840M24P92P19K68j54l48l70l95n02n31k38K59N36M96N07P30Q37O58N53
$$ 160840 161264 162056 162775 163043 162889 162541 162171 161776 161274 160743 160505 160764 161300 161796 162303 163033 163870 164528 165081
54106A65081O43L75n91j523j485o41M0J30P3K94P30J160J381J164N73J48K44L76
$$ 165081 165724 166099 165508 163985 162500 161859 161899 162029 162102 162396 163126 164286 165667 166831 167404 167552 167796 168172
54088A68172q0p60p14J69J029J339J450J561J201J66p58p58j48J47p7j71K29O56
$$ 168172 168092 167332 166618 166787 167816 169155 170605 172166 173367 173533 172775 172017 171869 172016 171939 171768 171997 172653
54070A72653O14L84O60J551K391K569K265K094K269K539K852L559M771N987O805
$$ 172653 173267 173651 174311 175862 178253 180822 183087 185181 187450 189989 192841 196400 201171 207158 213963
54055B13963P559Q838J0582J2097J2709J1876R035M211j238n333p262p855q094
$$ 213963 221522 230360 240942 253039 265748 277624 286659 290870 289632 284299 277037 269182 261088
54042B61088p853o591m697l241k648k238j256J96J424K030K318K905M041N251
$$ 261088 253235 246644 241947 238706 236058 233820 232564 232760 234184 236214 238532 241437 245478 250729
54028B50729N648M742L036J677J355J670J733J339J137J600K172J936Q98lk19
$$ 250729 256377 261119 264155 265832 267187 268857 270590 271929 273066 274666 276838 278774 279672 279669 279450
54013B79450l08j021k178l018l327l628m283m995n315n201m919m641m384m095
$$ 279450 279142 278121 275943 272925 269598 265970 261687 256692 251377 246176 241257 236616 232232 228137
53999B28137l691l094k348j601j019p98j125j864k406k164j261m76m18r73j577
$$ 228137 224446 221352 219004 217403 216384 215586 214461 212597 210191 208027 206766 206290 205872 204899 203322
53984B03322j731j300n95k56o88j447j550n96P02J339J074L68l67j019j430j302
$$ 203322 201591 200291 199696 199440 198752 197305 195755 195159 195861 197200 198274 198642 198275 197256 195826 194524
53968A94524o08K51Q28J087J340J825K441K903L127L390M022M882N350M968L978
$$ 194524 193916 194167 194995 196082 197422 199247 201688 204591 207718 211108 215130 220012 225362 230330 234308
53953B34308K992K204J254j04j495k288k347k125k013j822j131N5J226K005K512
$$ 234308 237300 239504 240758 240654 239159 236871 234524 232399 230386 228564 227433 227488 228714 230719 233231
53938B33231K961L193K968K596K721L464M163M271M016L845L647L025K171J729
$$ 233231 236192 239385 242353 244949 247670 251134 255297 259568 263584 267429 271076 274101 276272 278001
53924B78001J858K004J847J793K236K818K959K812L086M025N152O030O787P725
$$ 278001 279859 281863 283710 285503 287739 290557 293516 296328 299414 303439 308591 314621 321408 329133
53910C29133Q815R795J0476J0791J0754J0604J0811J1649J2808J3489J2863J0417
$$ 329133 337948 347743 358219 369010 379764 390368 401179 412828 425636 439125 451988 462405
53898D62405O122N28n291j0131j3160j4253j3933j2996j2011j1098j0230r572
$$ 462405 468527 469055 463764 453633 440473 426220 412287 399291 387280 376182 365952 356380
53886C56380r305r201q769p860o848o078n512n088n000n325n617n316m469l704
$$ 356380 347075 337874 329105 321245 314397 308319 302807 297719 292719 287394 281777 276461 271992 268288
53872B68288l449l496l363k913k501k519k872k934k255j243q72j620k905l665
$$ 268288 264839 261343 257980 255067 252566 250047 247175 244241 241986 240743 239871 238251 235346 231681
53858B31681l296k035p98o02j623k726k513j083l7l70j185j121k39M13N12N90
$$ 231681 228385 226350 225552 224950 223327 220601 218088 217005 216968 216598 215413 214292 214053 214466 214978 215568
53842B15568P59N52k3m57p99j614k641k714j423J43Q63Q28N71O1p24j074l93O89
$$ 215568 216327 216879 216856 216399 215600 213986 211345 208631 207208 207351 208214 209042 209613 209674 208950 207876 207483 208172
53824B08172J063N88k7m97j093j729j818j214m79l0L61J012J749K184K225K074
$$ 208172 209235 209823 209796 209299 208206 206477 204659 203445 202966 202936 203297 204309 206058 208242 210467 212541
53808B12541K019K247K737L249L581L807M069M243M129L871L881M213M372L940
$$ 212541 214560 216807 219544 222793 226374 230181 234250 238493 242622 246493 250374 254587 258959 262899
53794B62899L170K805L239M029M371M030L571L469L344K508J099k6n17r55j775
$$ 262899 266069 268874 272113 276142 280513 284543 288114 291583 294927 297435 298534 298508 297991 297036 295261
53779B95261k585k981l331m045m667m536l971l847m230m299l659k845k443k474
$$ 295261 292676 289695 286364 282319 277652 273116 269145 265298 261068 256769 253110 250265 247822 245348
53765B45348k813l432l991l890l137k514k439k281j357j64J07q66k077k377j726
$$ 245348 242535 239103 235112 231222 228085 225571 223132 220851 219494 219330 219437 218571 216494 214117 212391
53750B12391j059j131j721j986j466n80l9mn3J40M71P74J118J476J474Q20j55
$$ 212391 211332 210201 208480 206494 205028 204448 204409 204405 204352 204492 204963 205737 206855 208331 209805 210625 210470
53733B10470o60j98R95K187K724K426J630Q84N10M18L53K98M92J076J737J874
$$ 210470 209810 209612 210607 212794 215518 217944 219574 220458 220968 221386 221739 222037 222529 223605 225342 227216
53717B27216J191J20m92j81P26J510J788J727J719J929K163K131J826J615J858
$$ 227216 228407 228527 228035 227854 228580 230090 231878 233605 235324 237253 239416 241547 243373 244988 246846
53702B46846K401K723K575K254K137K251K465K823L317L595L326K747K482K705
$$ 246846 249247 251970 254545 256799 258936 261187 263652 266475 269792 273387 276713 279460 281942 284647
53688B84647K882K425J398M05r1k05l69p97j263j468j437j373j288j108j049j440
$$ 284647 287529 289954 291352 291757 291666 291461 291092 290295 289032 287564 286127 284754 283466 282358 281309 279869
53672B79869k053k183j601r41q12r70q28l58j1j4k30n04o75n79m35q35j774k223
$$ 279869 277816 275633 274032 273091 272279 271309 270481 270123 270112 270098 269868 269364 268689 268110 267675 266840 265066 262843
53654B62843j379J0N61J60j05K13L22k68q37o35RM04N95R43J256J090N97L43M70
$$ 262843 261464 261474 262035 262195 262090 262303 262625 262357 261520 260885 260894 261298 261893 262836 264092 265182 265779 266122 266592
53635B66592O79Q58J180J648J953J843J327O54K58N60J549K700L421L504L067
$$ 266592 267271 268129 269309 270957 272910 274753 276080 276734 276992 277552 279101 281801 285222 288726 291793
53620B91793K422K108K533L364L732L336K890L067L553L691L529L590L907M048
$$ 291793 294215 296323 298856 302220 305952 309288 312178 315245 318798 322489 326018 329608 333515 337563
53606C37563L906L702L326K482J422R23J328K199K984L411L250K405J461J446
$$ 337563 341469 345171 348497 350979 352401 353324 354652 356851 359835 363246 366496 368901 370362 371808
53592C71808K556L718L797K910K014J644J547J330R02K68n54j401k016k386k823
$$ 371808 374364 378082 381879 384789 386803 388447 389994 391324 392226 392494 391940 390539 388523 386137 383314
53577C83314l535m295m600m217l448k854k639k493k130j776j803j990j679p50
$$ 383314 379779 375484 370884 366667 363219 360365 357726 355233 353103 351327 349524 347534 345855 345105
53563C45105Q5K30n0k12k59n02p89o79k11J36K68N65J114J448J296R85R11J081
$$ 345105 345190 345420 345370 345158 344899 344397 343608 342929 342718 342854 343122 343687 344801 346249 347545 348530 349441 350522
53545C50522J462K235L288M020M112M029M233M371L941L398L729N065O518P394
$$ 350522 351984 354219 357507 361527 365639 369668 373901 378272 382213 385611 389340 394405 400923 408317
53531D08317P805Q027Q078Q157Q723R763J0624J0892J0938J1245J1750J2212J2717
$$ 408317 416122 424149 432227 440384 449107 458870 469494 480386 491324 502569 514319 526531 539248
53518E39248J3342J3883J4356J5217J6627J7961J8772J9623K1255K3291K4638
$$ 539248 552590 566473 580829 596046 612673 630634 649406 669029 690284 713575 738213
53507G38213K4929K4727K4506K4242K3939K3707K3329K2507K1598K1239K1223
$$ 738213 763142 787869 812375 836617 860556 884263 907592 930099 951697 972936 994159
53496I94159K0671J9464J8545J8485J8686J8523J8348J8674J9130J9037J8498
$$ 994159 1014830 1034294 1052839 1071324 1090010 1108533 1126881 1145555 1164685 1183722 1202220
53485A202220J8108J7902J7490J6928J6689J6765J6623J6043J5391J4875J4136
$$ 1202220 1220328 1238230 1255720 1272648 1289337 1306102 1322725 1338768 1354159 1369034 1383170
53474A383170J2749J0721Q279N570K821M04j552l444n817q713j1561j3710j5002
$$ 1383170 1395919 1406640 1414919 1420489 1423310 1423714 1422162 1418718 1412901 1404188 1392627 1378917 1363915
53461A363915j5852j6783j7848j8570j8554j8110j8043j8827k0096k1103k1528
$$ 1363915 1348063 1331280 1313432 1294862 1276308 1258198 1240155 1221328 1201232 1180129 1158601
53450A158601k1677k1907k2103k1934k1392k0781k0192j9404j8393j7566j7028
$$ 1158601 1136924 1115017 1092914 1070980 1049588 1028807 1008615 989211 970818 953252 936224
53439I36224j6068j3895j0794p952o164n167m320l329k191r12L94J586K857M603
$$ 936224 920156 906261 895467 887515 881351 876184 871864 868535 866344 865432 865826 867412 870269 874872
53425H74872O696Q394R381J0320J1982J4146J5974J7131J7960J8764J9587K0639
$$ 874872 881568 889962 899343 909663 921645 935791 951765 968896 986856 1005620 1025207 1045846
53413A045846K2235K4168K5650K6270K6633K7791L0102L2847L4979L6137L6911
$$ 1045846 1068081 1092249 1117899 1144169 1170802 1198593 1228695 1261542 1296521 1332658 1369569
53402A369569L8120L9921M1900M3883M6209M9019N1795N3965N5539N6719N7267
$$ 1369569 1407689 1447610 1489510 1533393 1579602 1628621 1680416 1734381 1789920 1846639 1903906
53391A903906N6968N6413N6500N7089N6981N5451N3236N1552N0590M9434M7212
$$ 1903906 1960874 2017287 2073787 2130876 2187857 2243308 2296544 2348096 2398686 2448120 2495332
53380B495332M3866L9953L6068L2485K9119K5663K1831J7515J2790P863L022j572
$$ 2495332 2539198 2579151 2615219 2647704 2676823 2702486 2724317 2741832 2754622 2762485 2765507 2763935
53368B763935o108j1098j7011k3934l1483l8959m5682n1294n5771n9132o1221
$$ 2763935 2757827 2746729 2729718 2705784 2674301 2635342 2589660 2538366 2482595 2423463 2362242
53357B362242o1918o1394o0083n8508n7192n6442n5956n4918n2868n0351m8340
$$ 2362242 2300324 2238930 2178847 2120339 2063147 2006705 1950749 1895831 1842963 1792612 1744272
53346A744272m7140m6323m5593m5129m4945m4478m3173m1090l8734l6517l4606
$$ 1744272 1697132 1650809 1605216 1560087 1515142 1470664 1427491 1386401 1347667 1311150 1276544
53335A276544l2935l1118k8665k5569k2485j9982j7871j5578j3057j0959r855
$$ 1276544 1243609 1212491 1183826 1158257 1135772 1115790 1097919 1082341 1069284 1058325 1048470
53324A048470r629r669r500r102q735q473p991o918n368l895k753j535K16K226
$$ 1048470 1038841 1029172 1019672 1010570 1001835 993362 985371 978453 973085 969190 966437 964902 965118 967344
53310I67344L741M432M711N181O119P495R079J0386J1029J1378J2496J4935J7828
$$ 967344 971085 975517 980228 985409 991528 999023 1008102 1018488 1029517 1040895 1053391 1068326 1086154
53297A086154J9759K0472K1133K2783K5091K7000K8104K8804K9387K9656K9440
$$ 1086154 1105913 1126385 1147518 1170301 1195392 1222392 1250496 1279300 1308687 1338343 1367783
53286A367783K8903K8090K6717K4697K2482K0472J8479J6173J3736J1523R277
$$ 1367783 1396686 1424776 1451493 1476190 1498672 1519144 1537623 1553796 1567532 1579055 1588332
53275A588332O321K563j270m541p331r932j2249j4117j5791j7679j9795k1910
$$ 1588332 1594653 1597216 1595946 1591405 1584074 1574142 1561893 1547776 1531985 1514306 1494511 1472601
53263A472601k4019k6231k8265k9569l0061l0287l0762l1478l2267l3160l4070
$$ 1472601 1448582 1422351 1394086 1364517 1334456 1304169 1273407 1241929 1209662 1176502 1142432
53252A142432l4434l3691l2070l0416k9204k8089k6664k5262k4579k4705k4957
$$ 1142432 1107998 1074307 1042237 1011821 982617 954528 927864 902602 878023 853318 828361
53241H28361k4746k4211k3814k3600k3148k2153k0773j9291j7766j6154j4614
$$ 828361 803615 779404 755590 731990 708842 686689 665916 646625 628859 612705 598091
53230E98091j3398j2459j1392r939q445p576p574p945q012p663p397p685q431
$$ 598091 584693 572234 560842 550903 542458 534882 527308 519363 511351 503688 496291 488606 480175
53217D80175r099r285r092q958r113r302r130q641q300q295q111p183n801m929
$$ 480175 471076 461791 452699 443741 434628 425326 416196 407555 399255 390960 382849 375666 369865 364936
53203C64936n013n427n318m694m282m507m980n078m718m358m326m340l876k986
$$ 364936 359923 354496 349178 344484 340202 335695 330715 325637 320919 316561 312235 307895 304019 301033
53189C01033k491l055m170m548l620k250j616j849k173k145k028k036j894j421
$$ 301033 298542 295487 291317 286769 283149 280899 279283 277434 275261 273116 271088 269052 267158 265737
53175B65737j005j082j469j665j543j406j351j148p76o93j263k091k343j709q31
$$ 265737 264732 263650 262181 260516 258973 257567 256216 255068 254292 253599 252336 250245 247902 246193 245362
53160B45362n42q81j085n47M62J153J112N65p0o31j118j473j663j790j946k007
$$ 245362 244820 243939 242854 242307 242769 243922 245034 245599 245529 244898 243780 242307 240644 238854 236908 234901
53144B34901j790j292o38J10Q66J305J102L67l92q52j029q47j6J292K155J848
$$ 234901 233111 231819 231181 231291 232157 233462 234564 234931 234539 233687 232658 231811 231795 233087 235242 237090
53128B37090Q94M43P76J107R43P23Q93J042O83K03L22R44J276R24K49k65l52Q6
$$ 237090 237984 238427 239203 240310 241253 241976 242869 243911 244594 244797 245119 246063 247339 248263 248512 248247 247895 247981
53110B47981P93R94J70j042j431q04k25n27j318j756j608j177p97q08j488k527
$$ 247981 248774 249768 249938 248896 247465 246661 246436 245909 244591 242835 241227 240050 239253 238445 236957 234430
53094B34430k992k301r57Q2L75J09l20m42R2R78J354Q30J3l25j81N4L90R47J360
$$ 234430 231438 229137 228180 228262 228637 228746 228426 227984 228076 229054 230408 231238 231251 230926 230745 230799 231189 232136 233496
53075B33496J164N24J8j17RL22O42N03k10q31p91n41p73j175r98n06o68j446j702
$$ 233496 234660 235184 235202 235085 235094 235416 236058 236561 236351 235520 234729 234188 233415 232240 231242 230736 230068 228622 226920
53056B26920j016l25l54n03j4O85O40j97r92j145p78l28q9o0n7r0n35j504k210
$$ 226920 225904 225579 225225 224722 224708 225393 226033 225836 224844 223699 222921 222593 222504 222444 222387 222297 221762 220258 218048
53037B18048j734m72J25n03j237r85j59K21J26J62K91m7p65j105p60j93J97N41
$$ 218048 216314 215842 215967 215464 214227 213242 213083 213304 213430 213592 213883 213836 213071 211966 211206 211013 211210 211751
53019B11751R99J372J340P71k11j135j275k60J364K604K922K434J404O5j169j751
$$ 211751 212750 214122 215462 216233 216022 214887 213612 213352 214716 217320 220242 222676 224080 224145 222976 221225
53003B21225j481o78R8L75L5m98o20l57m08j060j475p79N69J273R81N77O82Q28
$$ 221225 219744 219066 219164 219539 219574 219076 218456 218099 217691 216631 215156 214377 214946 216219 217200 217777 218459 219287
52985B19287M98Q0K04O88R13Q05P92R13P19J60q4N40J610K155J761R42L64J39
$$ 219287 219785 219865 220069 220757 221670 222475 223267 224180 224899 225059 224975 225515 227125 229280 231041 231983 232347 232486
52967B32486O8K28Q36J621J928J555J047Q94Q81O14K01p5m22j218k176k491j916
$$ 232486 232554 232782 233618 235239 237167 238722 239769 240663 241544 242158 242359 242284 241862 240644 238468 235977 234061
52950B34061j111q25j156j714k101k068j573r15n68p22j166j579j799j772j570
$$ 234061 232950 232125 230969 229255 227154 225086 223513 222598 222030 221308 220142 218563 216764 214992 213422
52935B13422j397j315j083n57j08r1j10N13J495J651M96q85j124j45J018J562
$$ 213422 212025 210710 209627 209070 208962 208871 208761 209274 210769 212420 212916 212031 210907 210762 211780 213342
52919B13342J439R06J86m18o49n66m33l36j54J49M95P90Q74N19j79o35m00J75
$$ 213342 214781 215687 215873 215455 214806 214240 213807 213471 213317 213466 213961 214751 215625 216144 215965 215330 214930 215105
52901B15105L28j29o03n52n5M97R11J192J322J246R78N84J41k29m13l80j34K77
$$ 215105 215433 215304 214701 214149 214094 214591 215502 216694 218016 219262 220240 220824 220965 220736 220323 219943 219809 220086
52883B20086N78K65q49k133k537j687l53L76J85k39k7R77K043K320J771J196J228
$$ 220086 220664 220929 220080 217947 215410 213723 213370 213746 213931 213692 213665 214642 216685 219005 220776 221972 223200
52866B23200J598J724J697K058K692K749J864P53J54j62p24j283j213p10p04j496
$$ 223200 224798 226522 228219 230277 232969 235718 237582 238335 238489 238327 237603 236320 235107 234397 233693 232197
52850B32197k335k517k240k046k020j907j661j430j313j402j761k070j730p11
$$ 232197 229862 227345 225105 223059 221039 219132 217471 216041 214728 213326 211565 209495 207765 207054
52836B07054J07l9p56j035n98jM51J050J843K249J882J205Q52P94N81Q8m35q45
$$ 207054 207161 207122 206366 205331 204733 204732 205183 206233 208076 210325 212207 213412 214264 215058 215639 215727 215292 214447
52818B14447j193j428j383r78j62J137K708L892M138L674L212L023K659J645J14
$$ 214447 213254 211826 210443 209465 209303 210440 213148 217040 221178 224852 228064 231087 233746 235391 235505
52803B35505j336k222k564k812l336l886l783k903k088k129k646k578j678p53
$$ 235505 234169 231947 229383 226571 223235 219349 215566 212663 210575 208446 205800 203222 201544 200791
52789B00791m07l66k68l09n83n71O2P19O79K95M93J282J680J199N97Q15J691K238
$$ 200791 200384 200018 199750 199441 198858 198287 198349 199068 199747 200042 200535 201817 203497 204696 205293 206108 207799 210037
52771B10037J793N97o12j247j277j154j302j655j757j334n30K98Q01P25J33m84
$$ 210037 211830 212427 211815 210568 209291 208137 206835 205180 203423 202089 201559 201857 202658 203383 203516 203032
52755B03032o67n29m94n01p1P35J162Q93O85J336K430K843K215J240O62N76O95
$$ 203032 202365 201836 201342 200841 200770 201505 202667 203560 204245 205581 208011 210854 213069 214309 214971 215547 216242
52738B16242P26M79J01J68R96J927J958J080L53M76J005J276J287J228Q51j4q11
$$ 216242 216968 217447 217548 217716 218712 220639 222597 223677 224030 224506 225511 226787 228074 229302 230153 230139 229328
52721B29328r09n95o55j175j529j496j548j907k097j723j122q69j033j279j329
$$ 229328 228419 227824 227169 225994 224465 222969 221421 219514 217417 215694 214572 213703 212670 211391 210062
52706B10062j028k39Q82J760J899J380O78O2m54p90p74m69k16k31l32j46M37J115
$$ 210062 209034 208795 209677 211437 213336 214716 215394 215456 215002 214212 213438 212969 212753 212522 212190 212044 212481 213596
52688B13596J359Q74q1q37q29j6J151K045K144J282j41j270j422o84K16O46N66
$$ 213596 214955 215829 215748 214911 214082 214066 215217 217262 219406 220688 220547 219277 217855 217171 217387 218033 218599
52671B18599L55K96M10O89J252K062K622K256Q51q04j724j650j086n32OO96J463
$$ 218599 218954 219250 219660 220349 221601 223663 226285 228541 229392 228588 226864 225214 224128 223596 223602 224298 225761
52654B25761K103K573K952L266L462L410K877J665L2j399k241k706l059l048k291
$$ 225761 227864 230437 233389 236655 240117 243527 246404 248069 248101 246702 244461 241755 238696 235648 233357
52639B33357j118m62p91j566j870j356m30L29O97Q80J236J908K702L276L406L029
$$ 233357 232239 231777 230986 229420 227550 226194 225764 226093 226790 227670 228906 230814 233516 236792 240198 243227
52623B43227K206J155K46l37q12j498k266k615k306j650j064o00j55J04j57q78
$$ 243227 245433 246588 246834 246497 245685 244187 241921 239306 237000 235350 234286 233686 233531 233635 233478 232600
52607B32600j441j247l73M73O85L18j65m63n88m88L7R05J541J395N39m64j103
$$ 232600 231159 229912 229539 230012 230697 231015 230850 230387 229799 229311 229348 230253 231794 233189 233728 233264 232161
52590B32161j147n85K83Q59P66L41K51P04J370J962K397K482J970J051K33l52
$$ 232161 231014 230429 230712 231571 232337 232678 232929 233633 235003 236965 239362 241844 243814 244865 245098 244746
52574B44746j000j677j831j239m42%J67K12j59j042j734j509p20k80l29k18L06
$$ 244746 243746 242069 240238 238999 238557 238557 238724 238936 238777 237735 236001 234492 233772 233492 233163 232945 233251
52557B33251P45P22M10j4n90j106j141p85o14p32n84m4J78l13q08n75j3J02j5
$$ 233251 233996 234718 235128 235114 234524 233418 232277 231492 230878 230146 229562 229518 229696 229383 228575 228000 227987 228089 228074
52538B28074M41J391J846J385P13N49P30P21L85j00n69p75m78Q4K29k34n32P8
$$ 228074 228515 229906 231752 233137 233850 234399 235129 235850 236235 236135 235566 234791 234313 234397 234626 234392 233860 233938
52520B33938J126J331K36j123j407n02N18Q41Q95J647L127M254M195L455L128
$$ 233938 235064 236395 236631 235508 234101 233599 234117 234958 235853 237500 240627 244881 249076 252531 255659
52505B55659L433L562K867J554J06j347k758l728l871l328k635k130j757j367
$$ 255659 259092 262654 265521 267075 267181 265834 263076 259348 255477 252149 249514 247384 245627 244260
52491B44260r65p21p53q42n16L61J153J063K19m09k61K19M77O57J034J287R98
$$ 244260 243295 242574 241821 240979 240463 240824 241977 243040 243259 242850 242589 242808 243285 243942 244976 246263 247261
52474B47261M95M87J062J719K103K161J783J026N29R18J804K196J883J645J932
$$ 247261 247756 248243 249305 251024 253127 255288 257071 258097 258626 259544 261348 263544 265427 267072 269004
52459B69004K204J860J040O6j192k831m303m916m550l509j991l27O79L48r91k199
$$ 269004 271208 273068 274108 274174 272982 270151 265848 260932 256382 252873 250882 250555 251234 251582 250591 248392
52443B48392k473j927j129n15k72l82n96n49r1N14P63L57m74j116j164p95l92
$$ 248392 245919 243992 242863 242348 242076 241694 241098 240549 240458 240972 241735 242092 241618 240502 239338 238543 238151
52426B38151L9P14J418J575J046M34K99N62Q60J117J410J639J691J636J538J363
$$ 238151 238190 238904 240322 241897 242943 243377 243676 244238 245098 246215 247625 249264 250955 252591 254129 255492
52410B55492J283J619K259K711L029M056O178Q470R740R877R345P923M978Q33
$$ 255492 256775 258394 260653 263364 266393 270449 276627 285097 294837 304714 314059 321982 326960 327793
52396C27793l233o284q200q953q472p279o237n444m240k593j445j299j377p26
$$ 327793 324560 318276 310076 301123 292651 285372 279135 273691 269451 266858 265413 264114 262737 262011
52382B62011N28J624K132J946J013k46q59k75R88K168L125L859M001L567L465
$$ 262011 262539 264163 266295 268241 269254 269008 268149 267874 268862 271030 274155 278014 282015 285582 289047
52367B89047M217M723L648J538J82K3k53j358k244j916j034o94o95j81O91R56
$$ 289047 293264 297987 301635 303173 303355 303378 303125 301767 299523 297607 296573 295879 295184 295003 295694 296650
52351B96650M48K6K42P38J039J156J225J212J260J688K392K769K525K129K129
$$ 296650 297098 297124 297366 298104 299143 300299 301524 302736 303996 305684 308076 310845 313370 315499 317628
52336C17628K422K597K644K885L370L792L990M206M752N689O865Q076R158J0033
$$ 317628 320050 322647 325291 328176 331546 335338 339328 343534 348286 353975 360840 368916 378074 388107
52322C88107J0686J1035J0879J0200R398Q980Q960Q834Q250P520P266P680Q387
$$ 388107 398793 409828 420707 430907 440305 449285 458245 467079 475329 482849 490115 497795 506182
52309E06182Q998R525J0156J0809J1182J1201J1210J1530J2011J2235J2117J1969
$$ 506182 515180 524705 534861 545670 556852 568053 579263 590793 602804 615039 627156 639125
52297F39125J1936J1580J0371Q466O676N615N102M480L404K079Q77j27j086k066
$$ 639125 651061 662641 673012 681478 688154 693769 698871 703351 706755 708834 709711 709584 708498 706432
52283G06432k916l482l717l592l131k602k432k633k531j550j30P13Q03J089K263
$$ 706432 703516 700034 696317 692725 689594 686992 684560 681927 679396 677846 677716 678429 679232 680321 682584
52268F82584L753M662N035N475N932N881N489N522N996N991N233M879O028Q099
$$ 682584 686337 690999 696034 701509 707441 713322 718811 724333 730329 736320 741553 746432 752460 760559
52254G60559R539R792R720J0174J0906J1079J0321Q988P570O181M686L193K085
$$ 760559 770098 779890 789610 799784 810690 821769 832090 841078 848648 854829 859515 862708 864793
52241H64793J420O05q18k205k421j441o10r21j778k083j887k099k977l761l805
$$ 864793 866213 866818 866000 863795 861374 859933 859323 858402 856624 854541 852654 850555 847578 843817 840012
52226H40012l296k787k602k753l055l185l012k755k570k182j353l65M51J337K543
$$ 840012 836716 833929 831327 828574 825519 822334 819322 816567 813997 811815 810462 810097 810548 811885 814428
52211H14428L438L175K190J961L031M216M260L425K771K618K432J963J602J804
$$ 814428 817866 821041 823231 825192 828223 832439 836699 840124 842895 845513 847945 849908 851510 853314
52197H53314K653L911N080N562N248M848N132N922O239N502M128K839J764O19
$$ 853314 855967 859878 864958 870520 875768 880616 885748 891670 897909 903411 907539 910378 912142 912761
52183I12761n82j436j866k462l726n234o082o114o150o702p103o497n222m412
$$ 912761 912179 910743 908877 906415 902689 897455 891373 885259 879109 872407 865304 858807 853585 849173
52169H49173m421m450l862k977k284j557k78J441K861L373K975K157J498J208
$$ 849173 844752 840302 836440 833463 831179 829622 829344 830785 833646 837019 839994 842151 843649 844857
52155H44857J028O93M06L92K76m40j274j047N08K140K633K207J887K121K612K946
$$ 844857 845885 846578 846984 847376 847652 847212 845938 844891 845399 847539 850172 852379 854266 856387 858999 861945
52139H61945K658J235j096l050l563l143l037l319k914j378M16J648K610L958
$$ 861945 864603 865838 864742 861692 858129 854986 851949 848630 845716 844338 844754 846402 849012 852970
52125H52970N759P788J0126J2835J5413J7207J8084J8291J7850J6703J5253J4224
$$ 852970 858729 866517 876643 889478 904891 922098 940182 958473 976323 993026 1008279 1022503
52113A022503J3899J3879J3722J3439J3109J2366J0720Q446O682O335P096P895
$$ 1022503 1036402 1050281 1064003 1077442 1090551 1102917 1113637 1122083 1128765 1135100 1142196 1150091
52101A150091Q175Q308Q720R227R455R433R217Q388O453L609N08k576n787q932
$$ 1150091 1158266 1166574 1175294 1184521 1193976 1203409 1212626 1221014 1227467 1231076 1231584 1229008 1223221 1214289
52087A214289j1343j2627j3016j2771j1799j0111q185o524n204m164l589l622
$$ 1214289 1202946 1190319 1177303 1164532 1152733 1142622 1134437 1127913 1122709 1118545 1114956 1111334
52075A111334l970m229m386m549m319l002n69J970L421L495K918K585K807L384
$$ 1111334 1107364 1103135 1098749 1094200 1089881 1086879 1086310 1088280 1091701 1095196 1098114 1100699 1103506 1106890
52061A106890M197N383O814P742P465O356N685O189P224P642P125O123M917L368
$$ 1106890 1111087 1116470 1123284 1131026 1138491 1144847 1150532 1156721 1163945 1171587 1178712 1184835 1189752 1193120
52047A193120J549j73j770l556n379o481o661o820p712q626q204o349m495l884
$$ 1193120 1194669 1194496 1192726 1189170 1183791 1177310 1170649 1163829 1156117 1147491 1139287 1132938 1128443 1124559
$$ [...]
##END NTUPLES=NMR SPECTRUM
##END=
