
##TITLE=UV1275_M13_1250-1169_70_7414729_PPFFXUzeCW
##JCAMPDX= 6.0         $$ Bruker NMR JCAMP-DX V2.0
##DATA TYPE= NMR SPECTRUM
##DATA CLASS= NTUPLES
##ORIGIN= BRUKER
##OWNER= Administrator
$$ 1.72 TOPSPIN		Version 2.1
$$ 2013-01-25 22:30:28.692 -0500  Administrator@X
$$ Compression mode = diff/dup
##.OBSERVE FREQUENCY= 400.02188249412
##.OBSERVE NUCLEUS= ^1H
##.ACQUISITION MODE= SIMULTANEOUS (DQD)
##.ACQUISITION SCHEME= undefined
##.AVERAGES= 8
##.DIGITISER RES= 22
##SPECTROMETER/DATA SYSTEM= spect
##.PULSE SEQUENCE= zg30
##.SOLVENT NAME= COFFEE_meoh
##.SHIFT REFERENCE= INTERNAL, COFFEE_meoh, 1, 14.98509
##AUDIT TRAIL= $$ (NUMBER, WHEN, WHO, WHERE, PROCESS, VERSION, WHAT)
$$ ##TITLE= Audit trail, TOPSPIN		Version 2.1
$$ ##JCAMPDX= 5.01
$$ ##ORIGIN= Bruker BioSpin GmbH
$$ ##OWNER= Administrator
$$ $$ E:\/data/COFFEE/nmr/UV1275_M13_1250-1169_70_7414729_PPFFXUzeCW/10/pdata/1/auditp.txt
$$ ##AUDIT TRAIL=  $$ (NUMBER, WHEN, WHO, WHERE, PROCESS, VERSION, WHAT)
(   1,<2013-01-25 22:30:20.630 -0500>,<Administrator>,<X>,<go>,<TOPSPIN 2.1>,
      <created by zg
	started at 2013-01-25 22:29:14.349 -0500,
	POWCHK enabled, PULCHK disabled,
       configuration hash MD5:
       86 BA 57 50 F2 9D 5C 9B 26 00 A9 28 5F 66 2E 89
       data hash MD5: 64K
       7E FB 43 D4 AD 73 B9 27 7A 40 18 F7 10 FB 84 89>)
(   2,<2013-01-25 22:30:23.599 -0500>,<Administrator>,<X>,<proc1d>,<TOPSPIN 2.1>,
      <Start of raw data processing
       efp LB = 0 FT_mod = 6 PKNL = 1 PHC0 = 0 PHC1 = 0 SI = 32K 
       data hash MD5: 32K
       2E F7 C7 31 27 B9 DF D7 77 39 06 9E 12 AD 9E 47>)
(   3,<2013-01-25 22:30:24.067 -0500>,<Administrator>,<X>,<proc1d>,<TOPSPIN 2.1>,
      <pk PHC0 = 96.63025 PHC1 = 0 
       data hash MD5: 32K
       0D 6C A6 2B 91 EE 79 3A 8A 24 D1 76 7D 9A 48 6F>)
(   4,<2013-01-25 22:30:24.286 -0500>,<Administrator>,<X>,<proc1d>,<TOPSPIN 2.1>,
      <abs ABSG = 1 
       data hash MD5: 32K
       06 A8 A2 4A 65 E9 C4 06 37 E9 A3 FB C9 FB 1C C0>)
(   5,<2013-01-25 22:30:24.442 -0500>,<Administrator>,<X>,<proc1d>,<TOPSPIN 2.1>,
      <abs ABSG = 2 
       data hash MD5: 32K
       C9 49 BF C8 0E BD C1 7A 00 CF E3 70 09 9C 1F B1>)
(   6,<2013-01-25 22:30:24.599 -0500>,<Administrator>,<X>,<proc1d>,<TOPSPIN 2.1>,
      <abs ABSG = 3 
       data hash MD5: 32K
       FC 34 F1 D8 FA 7D 1A 09 4D 1C 7B F2 56 18 61 8D>)
(   7,<2013-01-25 22:30:24.739 -0500>,<Administrator>,<X>,<proc1d>,<TOPSPIN 2.1>,
      <abs ABSG = 4 
       data hash MD5: 32K
       09 DB 16 76 68 C3 C6 E7 DC 60 D5 D1 43 1E FE 03>)
(   8,<2013-01-25 22:30:24.896 -0500>,<Administrator>,<X>,<proc1d>,<TOPSPIN 2.1>,
      <abs ABSG = 5 
       data hash MD5: 32K
       1F 17 54 DC C0 D4 D8 1B F7 79 88 14 84 95 8B B5>)
$$ ##END=
$$ 
$$ $$ hash MD5
$$ $$ FE A6 C1 6A 24 D8 53 1F 96 23 A4 F5 1C 79 37 1A
##$RELAX= 
##$RELAX= 
##$RELAX= 
##$RELAX= 
##$RELAX= 
##$RELAX= 
##$RELAX= 
$$ Bruker specific parameters
$$ --------------------------
##$DU= <E:\>
##$EXPNO= 10
$$ [...]
150 150 150 150 150 150 150 150
##$TP07= 0
##$TPNAME0= <>
##$TPNAME1= <>
##$TPNAME2= <>
##$TPNAME3= <>
##$TPNAME4= <>
##$TPNAME5= <>
##$TPNAME6= <>
##$TPNAME7= <>
##$TPOAL= (0..7)
0.5 0.5 0.5 0.5 0.5 0.5 0.5 0.5
##$TPOFFS= (0..7)
0 0 0 0 0 0 0 0
##$TUNHIN= 0
##$TUNHOUT= 0
##$TUNXOUT= 0
##$USERA1= <user>
##$USERA2= <user>
##$USERA3= <user>
##$USERA4= <user>
##$USERA5= <user>
##$V9= 5
##$VALIST= <valist>
##$VCLIST= <CCCCCCCCCCCCCCC>
##$VD= 0
##$VDLIST= <DDDDDDDDDDDDDDD>
##$VPLIST= <PPPPPPPPPPPPPPP>
##$VTLIST= <TTTTTTTTTTTTTTT>
##$WBST= 2048
##$WBSW= 25
##$XGAIN= (0..3)
0 0 0 0
##$XL= 0
##$YL= 0
##$YMAX_a= 630686
##$YMIN_a= -537189
##$ZGOPTNS= <>
##$ZL1= 120
##$ZL2= 120
##$ZL3= 120
##$ZL4= 120
##$ABSF1= 14.98509
##$ABSF2= -5.573092
##$ABSG= 5
##$ABSL= 3
##$ALPHA= 0
##$AQORDER= 0
##$ASSFAC= 0
##$ASSFACI= 0
##$ASSFACX= 0
##$ASSWID= 0
##$AUNMP= <proc_prof1d_extract_pilot.lims>
##$AXLEFT= 0
##$AXNAME= <>
##$AXNUC= <1H>
##$AXRIGHT= 0
##$AXTYPE= 0
##$AXUNIT= <>
##$AZFE= 0.1
##$AZFW= 0.1
##$BCFW= 0
##$BC_mod= 0
##$BYTORDP= 0
##$COROFFS= 0
##$CY= 15
##$DATMOD= 1
##$DC= 0
##$DFILT= <>
##$DTYPP= 0
##$F1P= 0
##$F2P= 0
##$FCOR= 0.5
##$FTSIZE= 32768
##$FT_mod= 6
##$GAMMA= 0
##$GB= 0
##$INTBC= 1
##$INTSCL= 1
##$ISEN= 128
##$LB= 0
##$LEV0= 0
##$LPBIN= 0
##$MAXI= 10000
##$MC2= 0
##$MEAN= 0
##$ME_mod= 0
##$MI= 0
##$NCOEF= 0
##$NC_proc= -8
##$NLEV= 6
##$NOISF1= 0
##$NOISF2= 0
##$NSP= 0
##$NTH_PI= 0
##$NZP= 0
##$OFFSET= 14.98509
##$PC= 1
##$PHC0= 96.63025
##$PHC1= 0
##$PH_mod= 1
##$PKNL= yes
##$PPARMOD= 0
##$PPDIAG= 0
##$PPIPTYP= 0
##$PPMPNUM= 2147483647
##$PPRESOL= 1
##$PSCAL= 4
##$PSIGN= 0
##$PYNMP= <proc.py>
##$REVERSE= no
##$SF= 400.02
##$SI= 32768
##$SIGF1= 0
##$SIGF2= 0
##$SINO= 400
##$SIOLD= 32768
##$SPECTYP= <>
##$SREGLST= <1H.CDCl3>
##$SSB= 0
##$STSI= 32768
##$STSR= 0
##$SW_p= 8223.68421052631
##$SYMM= 0
##$S_DEV= 0
##$TDeff= 65536
##$TDoff= 0
##$TI= <>
##$TILT= no
##$TM1= 0
##$TM2= 0
##$TOPLEV= 0
##$USERP1= <user>
##$USERP2= <user>
##$USERP3= <user>
##$USERP4= <user>
##$USERP5= <user>
##$WDW= 1
##$XDIM= 32768
##$YMAX_p= 472380018
##$YMIN_p= -737661
##$CURPLOT= <Network HP LaserJet P1505>
##$CURPRIN= <$Network HP LaserJet P1505>
##$DFORMAT= <normdp>
##$LAYOUT= <+/1D_H.xwp>
##$LFORMAT= <normlp>
##$PFORMAT= <normpl>
##$SURQMSG= 1
$$ End of Bruker specific parameters
$$ ---------------------------------
##NTUPLES= NMR SPECTRUM
##VAR_NAME=  FREQUENCY,     SPECTRUM/REAL,   SPECTRUM/IMAG
##SYMBOL=    X,             R,               I
##VAR_TYPE=  INDEPENDENT,   DEPENDENT,       DEPENDENT
##VAR_FORM=  AFFN,          ASDF,            ASDF
##VAR_DIM=   32768,         32768,           32768
##UNITS=     HZ,            ARBITRARY UNITS, ARBITRARY UNITS
##FACTOR=    0.250966925370066, 1,           1
##FIRST=     8223.43324360094, 9549,         -113341
##LAST=      0,             -82760,          157961
##MIN=       0,             -737661,         0
##MAX=       8223.43324360094, 472380018,    0
$$ Real data points
##PAGE= N=1
##DATA TABLE= (X++(R..R)), XYDATA
$$ [...]
19542b0411j993k73894b1994E350a18019G4242P7457c11862a46716A30174b44931
$$ -20411 -22404 -296298 -21994 5350 -118019 74242 151699 -311862 -146716 130174 -244931
19530b06459d9703l47780a86385A69737f7268J3184K0249c942A86546a78186j95030
$$ -206459 -49703 -397483 -186385 169737 -67268 -54084 -33835 -3942 186546 -178186 -373216
19519c73216f1731j99871J09222g5511k39496h6971K1854q026E9760a12134d4524
$$ -373216 -61731 -261602 -152380 -75511 -315007 -86971 -65117 -73143 59760 -112134 -44524
19507f9173J56E5137o431J67523I8179b19824B6859a97521j3187A62957K20471
$$ -69173 -69017 55137 48706 216229 98179 -219824 26859 -197521 -210708 162957 383428
19496C83428b21224A76163a28669d9399I9706A2844K90835C2426M9117a11117
$$ 383428 -221224 176163 -128669 -49399 99706 12844 303679 32426 81543 -111117
19485b03853i4903q2220F9180a36174I2890O8150a59230a1088A65315f2993B9962
$$ -203853 -94903 -177123 69180 -136174 92890 161040 -159230 -11088 165315 -62993 29962
19473A10840a77282A38092e3863F9820J13260b02734O5580e3547A74200c38419
$$ 110840 -177282 138092 -53863 69820 183080 -202734 -137154 -53547 174200 -338419
19462F2033b97049a43111J3128j724j3933B0571a75158b1932p8356m4267q4768
$$ 62033 -297049 -143111 -129983 -131707 -145640 20571 -175158 -21932 -100288 -144555 -229323
19451b29323e2519l88606J72867f4716R080F5200a18133M3471j08867f2869A72562
$$ -229323 -52519 -441125 -268258 -64716 -55636 65200 -118133 -74662 -183529 -62869 172562
19439a42594d2654j085r2596m3170B23104F2644b422E1722j65J8697A5486h5235
$$ -142594 -42654 -43739 -136335 -179505 223104 62644 -2422 51722 51557 70254 15486 -85235
19426D00407A19758d6874n05662a18137B58330a33090E2535K73740i1200l5336
$$ 400407 119758 -46874 -552536 -118137 258330 -133090 52535 326275 -91200 -126536
19416a26536b7255B45640e1617A79050a24197j3380A68370g7074j51150B39620
$$ -126536 -27255 245640 -51617 179050 -124197 -137577 168370 -77074 -228224 239620
19405F4227b04823c995C25709a13911j08023M4339B48556j4309D3403j631O9511
$$ 64227 -204823 -3995 325709 -113911 -221934 -177595 248556 234247 43403 41772 111283
19394A11283b1882k54934a06930H8105b6554E2290J5066b24093i014j5566k90876
$$ 111283 -21882 -276816 -106930 88105 -26554 52290 67356 -224093 -9014 -24580 -315456
19383c15456b3866j33150d6844m9055j56991N9171A4995g9641l51728A38711j7937
$$ -315456 -23866 -157016 -46844 -95899 -252890 -193719 14995 -79641 -431369 138711 120774
19372A20774b1942f048j7706j60339j9422A03153b73658d7423j10517g7298j47963
$$ 120774 -21942 -6048 -23754 -184093 -203515 103153 -273658 -47423 -157940 -77298 -225261
19361b25261M8556K9963a1382C2552J19286b21549A68651J09798a27496A63975
$$ -225261 -176705 -146742 -11382 32552 151838 -221549 168651 278449 -127496 163975
19350a15148j5138A36096b43293j02766f538o4017k37096d9486n6467j84909E1588
$$ -115148 -130286 136096 -243293 -346059 -6538 -70555 -307651 -49486 -105953 -290862 51588
19338g786m4836H784e2629j16672D4966b24322f706l20960A15288B0247M6202
$$ -7786 -52622 8784 -52629 -169301 44966 -224322 -6706 -327666 115288 20247 66449
19327F6449h9486a3552p80j45114M2432r6287P3785C6326a69794j44765J02599
$$ 66449 -89486 -13552 -14332 -159446 -117014 -213301 -139516 36326 -169794 -314559 -211960
19316b11960a6332j99399n3801L5505i2843g903j40638k43364B2217a9640k80138
$$ -211960 -16332 -215731 -269532 -234027 -92843 -7903 -148541 -391905 22217 -19640 -299778
19305b99778k51213b23574O3092H938a68491k8670Q1530M5678B69367B0246e7964
$$ -299778 -550991 -223574 -160482 8938 -168491 -197161 -115631 -69953 269367 20246 -57964
19293e2108j18824C4160a80892d0299j19724m682k6982H2145B1590J27756B2863
$$ -52108 -170932 34160 -180892 -40299 -160023 -164705 -191687 82145 21590 149346 22863
19281A40853a39309D2108P7771K84323c12892D0123b7983B10298e337l6851l1514
$$ 140853 -139309 42108 119879 404202 -312892 40123 -27983 210298 -5337 -42188 -73702
19270g3702m0139A52123b8830C90034A66999a73962r3312A1388i993l2564j50879
$$ -73702 -113841 152123 -28830 390034 166999 -173962 -267274 11388 -9993 -42557 -193436
19259a93436e0696K70P745e398C22838G365J33757C8165c05682A22473a21170
$$ -193436 -50696 -50426 -42681 -5398 322838 7365 141122 38165 -305682 122473 -121170
19247A54586A2796b05949a1051C6816k622i6738j17695e2647k21117a14315a6201
$$ 154586 12796 -205949 -11051 36816 34194 -96738 -214433 -52647 -273764 -114315 -16201
19235b9515m1759B40515G4995c07220R5139A45968L5890a92995A06797a37921
$$ -29515 -71274 240515 74995 -307220 -212081 145968 181858 -192995 106797 -137921
19224a72185C3297b04454A54525p7124g1915E6485c6037A82230G7308a95201C87829
$$ -172185 33297 -204454 154525 77401 -71915 56485 -36037 182230 77308 -195201 387829
19212b27396L4765M5353j09527K2651C30145a23416F4531J45062c18516d5965
$$ -227396 -192631 -147278 -256805 -234154 330145 -123416 64531 209593 -318516 -45965
19201B8159c40965g782e24C8120a9544m8128A57628c7984A46116g7111B19027
$$ 28159 -340965 -7782 -524 38120 -19544 -67672 157628 -37984 146116 -77111 219027
19189E0337g9294j95335h8170I6721a85567j52666h2168K6529B23655b68472R408
$$ 50337 -79294 -274629 -88170 96721 -185567 -338233 -82168 -55639 223655 -268472 -259064
19178b59064A3114a9589A21697J28736a07509E8791g9824c1771r1196j21611b0762
$$ -259064 13114 -19589 121697 250433 -107509 58791 -79824 -31771 -122967 -244578 -20762
19166b46453O1687P9989n4032j99845G6684M678c8702J3798j31505B2108C148
$$ -246453 -184766 -104777 -158809 -358654 76684 81362 -38702 -24904 -156409 22108 3148
19154B10946a82537A2356b44723b4826d809C4298N3241b89356P0524b6579I0962
$$ 210946 -182537 12356 -244723 -24826 -4809 34298 87539 -289356 -218832 -26579 90962
19142e0290a8834j26218c7934B5766d21777a66220A10960L57220B07771d8068
$$ -50290 -18834 -145052 -37934 25766 -421777 -166220 110960 468180 207771 -48068
19131I505a90389k07879d0570l769A82224J22740b71897A00336A870g1303B20151
$$ 9505 -190389 -398268 -40570 -44339 182224 304964 -271897 100336 1870 -71303 220151
19119a99605i2977k69596B12952b37964C22248B0008J34614F2711a64587g5783
$$ -199605 -92977 -362573 212952 -237964 322248 20008 154622 62711 -164587 -75783
19108b47297a14019E118b8886j34339C14O5243d6949C5821L28940A20140b03231
$$ -247297 -114019 5118 -28886 -163225 314 65557 -46949 35821 364761 120140 -203231
19096b36027E0926L5625A1365a31517A14811a02581A10342c18875a53665d0647
$$ -236027 50926 86551 11365 -131517 114811 -102581 110342 -318875 -153665 -40647
19085d7456A43854g9257A71979b89850H616J87365b3713j84498A44974M6784b04903
$$ -47456 143854 -79257 171979 -289850 8616 195981 -23713 -208211 144974 191758 -204903
19073a17803H2981b83182N9414A4708a04342j50308D6621a70212c4286i661q7847
$$ -117803 82981 -283182 -223768 14708 -104342 -254650 46621 -170212 -34286 -9661 -97508
19062i7508A10616a58232A45515B0578b80538M9428A97029a25510j52490B17625
$$ -97508 110616 -158232 145515 20578 -280538 -231110 197029 -125510 -278000 217625
19051a41392j54219a20473l07432a82593q0378d5018j97989A11199a38565j38469
$$ -141392 -295611 -120473 -427905 -182593 -262971 -45018 -243007 111199 -138565 -277034
19041b77034M213a12751L0330A71249q3574b57014l7594d8167l65564a3123E8661
$$ -277034 -272821 -112751 -82421 171249 87675 -257014 -294608 -48167 -413731 -13123 58661
19029B73184B7230J84497E1644a15211d4786n3114C9059a3051k29186J1053M7678
$$ 273184 27230 211727 51644 -115211 -44786 -97900 39059 -13051 -242237 -231184 -183506
19018a83506c8328k1155A38190E5105h5985M1267j72526E1942b33823K3525C7300
$$ -183506 -38328 -59483 138190 55105 -85985 -44718 -217244 51942 -233823 -210298 37300
19006h1389B41976c15927k0979a40927r6703A7256i0754j07360I7901a0761k89283
$$ -81389 241976 -315927 -336906 -140927 -237630 17256 -90754 -198114 97901 -10761 -300044
18995c00044C7271A5204J0212c38916g0604E4331j0511O5342a92966l7304H6194
$$ -300044 37271 15204 25416 -338916 -70604 54331 43820 109162 -192966 -230270 86194
18983e9353q3764E4467b59289C18059a46348j70768B91271c94529H6158a96917
$$ -59353 -143117 54467 -259289 318059 -146348 -317116 291271 -394529 86158 -196917
18972A49264b77422F114J60381F4008C216K82934D1424a42583A08231B2826J45308
$$ 149264 -277422 6114 166495 64008 3216 286150 41424 -142583 108231 22826 168134
18961A68134k7122o2487a58617M2794m99156A71855a56389o0881c6699k72963
$$ 168134 141012 78525 -158617 -115823 -614979 171855 -156389 -217270 -36699 -309662
18951c09662e680C7739J7399h8045n0884D622K19885n3341a26258A75908n9986
$$ -309662 -5680 37739 55138 -88045 -138929 4622 224507 171166 -126258 175908 115922
18940A15922m0034B8413a16180D8362c5921j71800B13195C2184K3627d47602A28781
$$ 115922 75888 28413 -116180 48362 -35921 -207721 213195 32184 55811 -447602 128781
18928A99315m8286g7880j91350J29773G3765K500R8958d04306A27544a10716A34197
$$ 199315 151029 -77880 -269230 -139457 73765 76265 175223 -404306 127544 -110716 134197
18916b70777O2465f5266a5651E9711N6445a67224H2632e6713C55097A1753c44354
$$ -270777 -208312 -65266 -15651 59711 116156 -167224 82632 -56713 355097 11753 -344354
18904E8938L4071a30297N1341C77271a09872j31343N2883O1744F1606J91256K4697
$$ 58938 93009 -130297 -78956 377271 -109872 -241215 -188332 -126588 61606 252862 277559
18893B77559a33621m6319h902r2069B02297b33016P0273d2209B37855G5450J05993
$$ 277559 -133621 -179940 -8902 -100971 202297 -233016 -162743 -42209 237855 75450 181443
18882A81443a80878M8969l4284F3612c42939J62993J3765j43926c2959A61434
$$ 181443 -180878 -131909 -166193 63612 -342939 -179946 -166181 -310107 -32959 161434
18871g5294j24196l0946A51969a93509G5973e1506A51128h3188j03761r7238E64953
$$ -75294 -199490 -230436 151969 -193509 75973 -51506 151128 -83188 -186949 -284187 564953
18859C001a09148K9219r2112E092b73197h0156A48862h7423o3042j9933A10665
$$ 3001 -109148 -79929 -172041 5092 -273197 -80156 148862 -87423 -150465 -170398 110665
18847a40427c0829j42006j0210H0753j4248b14548Q3520d8129I9915J15189b856
$$ -140427 -30829 -172835 -183045 80753 66505 -214548 -131028 -48129 99915 215104 -2856
18835b54230B06739C0484M452b96317C45468c85657B02939d82323b35114A82363
$$ -254230 206739 30484 34936 -296317 345468 -385657 202939 -482323 -235114 182363
18824B6533a92011b617k03059m934B86573A31101a12494l4814I8070J81416N9308
$$ 26533 -192011 -2617 -205676 -210610 286573 131101 -112494 -147308 98070 279486 338794
18813C38794j52523K0353n0588J09320I1317a23913e0489j23883M1689q9305J1772
$$ 338794 186271 206624 156036 265356 91317 -123913 -50489 -174372 -132683 -221988 -210216
18802b10216F4627b88790b3976D0945b92995a14265A66970f142A00310a44104
$$ -210216 64627 -288790 -23976 40945 -292995 -114265 166970 -6142 100310 -144104
18791D0278d14465h3929E2347M9808B0127e1757a2809l0735A55493e2028A06115
$$ 40278 -414465 -83929 52347 102155 20127 -51757 -12809 -43544 155493 -52028 106115
18779c9041a1138j69056A43167c04516G9940a84018a1440F0167N9366a96684c4346
$$ -39041 -11138 -180194 143167 -304516 79940 -184018 -11440 60167 119533 -196684 -34346
18767b80901A00344J67028a43148D2409j7587R3452c72586C87246c33675g236
$$ -280901 100344 267372 -143148 42409 24822 118274 -372586 387246 -333675 -7236
18756A05389b39385A16766K5293d26783M7941c8765l7565j02931l7355F5475c3578
$$ 105389 -239385 116766 142059 -426783 -378842 -38765 -76330 -179261 -216616 65475 -33578
18744d22285F2363h7419m10527d6532k72479a09295L7148j00077O5112D8696j6854
$$ -422285 62363 -87419 -497946 -46532 -319011 -109295 -72147 -172224 -107112 48696 31842
18733C1842J39319b4833M904m19811Q4574J02623L5204h3736I887e2237k5681
$$ 31842 171161 -24833 -19929 -439740 -355166 -252543 -217339 -83736 9887 -52237 -77918
18722g7918j0443B65812q2697d8240j82532J00838B79972e3066j91770D9106c1269
$$ -77918 -88361 265812 183115 -48240 -230772 -129934 279972 -53066 -244836 49106 -31269
18710a35182H817g2623k83456P5109e0435A09385e9380D3837a4761B46989c58857
$$ -135182 8817 -72623 -356079 -280970 -50435 109385 -59380 43837 -14761 246989 -358857
18698A51108f1052D5074b18617a1572A02878a1908m10328B27777b73611a02636
$$ 151108 -61052 45074 -218617 -11572 102878 -11908 -422236 227777 -273611 -102636
18687A22386o1138b5612F9883f2438A87553K69153j01792a02450k91491a51955
$$ 122386 61248 -25612 69883 -62438 187553 456706 354914 -102450 -393941 -151955
18676b68887R5137k73776A810b8348A26507a32511B13389n4750N2341a78883A48185
$$ -268887 -173750 -447526 1810 -28348 126507 -132511 213389 158639 210980 -178883 148185
18664B12919J6287D4079L6821M0134D1475h4669C51722j35169G6265j8268E117
$$ 212919 229206 44079 80900 121034 41475 -84669 351722 216553 76265 57997 5117
18652a70429j1478c9033j00411H3867A7232J13220h8725J6662k9535a652j32790
$$ -170429 -181907 -39033 -139444 83867 17232 130452 -88725 -72063 -101598 -1652 -134442
18641a34442a9441e614A83488b19668n7637a15289A38675N0405d43848h9545j49685
$$ -134442 -19441 -5614 183488 -219668 -277305 -115289 138675 189080 -443848 -89545 -239230
18630b39230C47400a7863j67657b0681A80683a26809E1970f1010B24281b18311
$$ -239230 347400 -17863 -185520 -20681 180683 -126809 51970 -61010 224281 -218311
18619i154j37983j96117J09675j51196c6040J1914H5689g5997C5441A3422d5666
$$ -9154 -147137 -343254 -233579 -384775 -36040 -24126 85689 -75997 35441 13422 -45666
18607b48938A57703b9483I7787J04293b28376F8429e6105j87167d2666l6845m17867
$$ -248938 157703 -29483 97787 202080 -228376 68429 -56105 -243272 -42666 -79511 -497378
18596d97378F8821c7249F0955c9723j02903E8936a10309E5633b22202N6060P1182
$$ -497378 68821 -37249 60955 -39723 -142626 58936 -110309 55633 -222202 -166142 -94960
18585i4960A85852l2363L3532a2722I8044F498g0288a517k61772Q11J02693e0381
$$ -94960 185852 153489 187021 -12722 98044 6498 -70288 -1517 -263289 -262478 -159785 -50381
18572D7888A5103q80e554A88091a02826a9737k65710J4575C63343a4136q6157
$$ 47888 15103 14223 -5554 188091 -102826 -19737 -285447 -270872 363343 -14136 -100293
18561a00293p177k4092j29313h2067q3100k79590m560i1808r7767B7964d4086
$$ -100293 -107470 -131562 -260875 -82067 -165167 -444757 -449317 -91808 -189575 27964 -44086
18549f1157E7223P7727a04718B16914d30853E8552J49070b91911f114A7172a74817
$$ -61157 57223 134950 -104718 216914 -430853 58552 207622 -291911 -6114 17172 -174817
18537e3386A47192b39956R5988e3489b5922B08953a05245A49271n0828J25549
$$ -53386 147192 -239956 -143968 -53489 -25922 208953 -105245 149271 98443 223992
18527B23992b39707A1342e6782F5084b22668J8906c1211B48562E4353a04064n3275
$$ 223992 -239707 11342 -56782 65084 -222668 -203762 -31211 248562 54353 -104064 -157339
18516a57339j44660B17869a07957j30540A25088a17434j33616a1843D4608N845
$$ -157339 -301999 217869 -107957 -238497 125088 -117434 -251050 -11843 44608 50453
18506E0453K26428p2588b10964A52557f3543B42249j12443a67005O252a2161B20644
$$ 50453 276881 204293 -210964 152557 -63543 242249 129806 -167005 -160753 -12161 220644
18494a44795f2942A51604c7184B00172D7241l425Q8505c34100c0533q3908r6874
$$ -144795 -62942 151604 -37184 200172 47241 43816 132321 -334100 -30533 -114441 -211315
18483b11315Q6099j4913j6909D05526a94235L8877b3871B2509N6809i7988j052
$$ -211315 -125216 -140129 -157038 405526 -194235 -155358 -23871 22509 79318 -97988 -99040
18472i9040m5080G4766C687c1742j55334d4700B04862A8558J55431o8687a48199
$$ -99040 -144120 74766 3687 -31742 -187076 -44700 204862 18558 173989 105302 -148199
18460B8655i8641j29026N4869A57077a57895L9258q6064A55043a4524k47717A16568
$$ 28655 -98641 -227667 -172798 157077 -157895 -118637 -204701 155043 -14524 -262241 116568
18448c67152g6634n9494A56309i0049A71910c3198k52576E4872a86519F3243R8071
$$ -367152 -76634 -136128 156309 -90049 171910 -33198 -285774 54872 -186519 63243 161314
18437A61314c3144G2405K6805J41015a62361I4115d89871J24020h9892G8781a15197
$$ 161314 -33144 72405 99210 240225 -162361 94115 -489871 -365851 -89892 78781 -115197
18425B09349f9929A45653b03024c7927m2817j49940K7388A34486f5575I3801e4023
$$ 209349 -69929 145653 -203024 -37927 -80744 -230684 -203296 134486 -65575 93801 -54023
18413B8808M01460d891A53091k8979a79922B15343h1631r0710h1953L3303J6771
$$ 28808 430268 -4891 153091 124112 -179922 215343 -81631 -172341 -81953 -48650 -31879
18402c1879j54251e0360j86858N7880f0755E4171d8625j97463J16906M9831m9127
$$ -31879 -186130 -50360 -237218 -179338 -60755 54171 -48625 -246088 -129182 -79351 -128478
18391a28478f1928l035F9047A9990M8358b30914a9613A09922G53g2743k21400
$$ -128478 -61928 -64963 69047 19990 68348 -230914 -19613 109922 753 -72743 -294143
18380b94143m6781A03900c03365a4705j33336P2892j25544c6802l5681n7478j16769
$$ -294143 -340924 103900 -303365 -14705 -148041 -75149 -200693 -36802 -72483 -129961 -246730
18369b46730o240a6788C8905d51693a42652B08671A2438c01985B23393K5142j23767
$$ -246730 -252970 -16788 38905 -451693 -142652 208671 12438 -301985 223393 248535 124768
18358A24768a64129i998l19608A2601d1485I4994f5549A04086a84513B77364b08117
$$ 124768 -164129 -9998 -329606 12601 -41485 94994 -65549 104086 -184513 277364 -208117
18346c02466J24755f0182A57240G6683a45431f414B20714j02547n4717a67430
$$ -302466 -177711 -60182 157240 76683 -145431 -6414 220714 118167 63450 -167430
18335b61779A24326B7029a72664j56951h9190r0368R812N385B6306b41645A60233
$$ -261779 124326 27029 -172664 -329615 -89190 -179558 -169746 -164361 26306 -241645 160233
18323a28448B33216a27223K3450A49568k2462O2466b77330J07430A02164b31032
$$ -128448 233216 -127223 -103773 149568 127106 189572 -277330 -169900 102164 -231032
18312d7646j63139K022A14369h3075h271r0715A75568C007g913o2316k9172o9198
$$ -47646 -210785 -208763 114369 -83075 -8271 -98986 175568 3007 -7913 -70229 -99401 -168599
18300a68599E2893j5817b95470J01564A46988C1874a04989A85365A151L9228b60692
$$ -168599 52893 37076 -295470 -193906 146988 31874 -104989 185365 1151 40379 -260692
18288i0860j24473H0760J4068a42505e0687a1149F7878a38137L9192j34554A83330
$$ -90860 -215333 80760 94828 -142505 -50687 -11149 67878 -138137 -98945 -233499 183330
18276E4762a30415J1764c1281F6419K66237E6756a1906F4266a09592I8869d11439
$$ 54762 -130415 -118651 -31281 66419 332656 56756 -11906 64266 -109592 98869 -411439
18264a70547d8001I7636A0185a1142k20462g9605E7083K2658a21295F0555J0861
$$ -170547 -48001 97636 10185 -11142 -231604 -79605 57083 79741 -121295 60555 71416
18253G1416a2465A20818O8294n6239i6179B2030J20910a11989k59103a07428A02071
$$ 71416 -12465 120818 189112 132873 -96179 22030 142940 -111989 -371092 -107428 102071
18241c89490e9745l5695J1065A0956b58465f267o0870K5769E4823a06044J2708
$$ -389490 -59745 -95440 -84375 10956 -258465 -6267 -67137 -41368 54823 -106044 -93336
18230i3336M4032K3100r7741c7296j29214L9279B80470A26219e1369C05372c14945
$$ -93336 -49304 -26204 -123945 -37296 -166510 -127231 280470 126219 -51369 305372 -314945
18218b66968J9874F602a56553A81451b21102q5203a8479k6964A62316o8703L6604
$$ -266968 -247094 6602 -156553 181451 -221102 -306305 -18479 -45443 162316 93613 130217
18207A30217f6518f793H3377f675j09799q1497J8221d9862q6043B4955d67113
$$ 130217 -66518 -6793 83377 -6675 -116474 -197971 -179750 -49862 -135905 24955 -467113
18195e2240r0033c8763k70409f8016A73833h2669E2748g7852B30466N383g9216
$$ -52240 -142273 -38763 -309172 -68016 173833 -82669 52748 -77852 230466 235849 -79216
18183b68374A78527J18148H5907b93745P1912a10426A37550a12038a0516n82j90880
$$ -268374 178527 296675 85907 -293745 -221833 -110426 137550 -112038 -10516 -11098 -201978
18172b01978B30413A8194M8870c48435i1722n0595A09272a05734A66413R111G7561
$$ -201978 230413 18194 67064 -348435 -91722 -142317 109272 -105734 166413 175524 77561
18160a40129m7592a3248q4304k55632a07314D3080e6940l80648M9164I6361c14859
$$ -140129 -187721 -13248 -97552 -353184 -107314 43080 -56940 -437588 -388424 96361 -314859
18148c97314D5129i7340a9006A6573R2966K136i7107C7254c3814H8165f3283E1421
$$ -397314 45129 -97340 -19006 16573 109539 111675 -97107 37254 -33814 88165 -63283 51421
18135h2853d0338A15881a09019m7589E8358b8137j8290I6440c97029D948J24313
$$ -82853 -40338 115881 -109019 -156608 58358 -28137 -46427 96440 -397029 4948 129261
18124A29261g6222b7818o9953K3234j7192L0773C08195a55478e9844F870a46194
$$ 129261 -76222 -27818 -97771 -74537 -91729 -60956 308195 -155478 -59844 6870 -146194
18112b92365A67836d7124b988o3158j1580l7495j08493j11429A85802c9794k05826
$$ -292365 167836 -47124 -2988 -66146 -77726 -115221 -223714 -335143 185802 -39794 -245620
18101b45620J21549A09716N2711D8975O6326L7319c44149J58469h6475j11091
$$ -245620 -124071 109716 162427 48975 115301 152620 -344149 -185680 -86475 -197566
18091a97566C3147d296M74j32282j8608C1217M1957j0175b16317j59660a39345
$$ -197566 33147 -4296 -3822 -136104 -154712 31217 73174 62999 -216317 -375977 -139345
18079a73199k3944e8188j05699A61938l8906J23478b41001J00424N1683B08337
$$ -173199 -197143 -58188 -163887 161938 123032 246510 -241001 -140577 -88894 208337
18068B33064I4034b37130N3826R323O9732H2963A6374b54329C351R643K24971
$$ 233064 94034 -237130 -183304 -173981 -104249 82963 16374 -254329 3351 12994 237965
18057B37965c0202k6672B9524b86380b9570A54984a06496D2342f7180l19308A62173
$$ 237965 -30202 -56874 29524 -286380 -29570 154984 -106496 42342 -67180 -386488 162173
18045F7667a57088C4924L5138d9174B29774b55488P3330C34084g8573I1206c45040
$$ 67667 -157088 34924 70062 -49174 229774 -255488 -182158 334084 -78573 91206 -345040
18033a62921j85267a0188j44215H0191b61580M1281M4493c3257a6553A15341a29523
$$ -162921 -348188 -10188 -154403 80191 -261580 -220299 -175806 -33257 -16553 115341 -129523
18021b5149q9181M2067A20255K83643I467K73530A02564a94192H1071a02140A42925
$$ -25149 -114330 -72263 120255 403898 9467 282997 102564 -194192 81071 -102140 142925
18009h9003b3356k36422B51631F0269J69995b70970G2374a42875H9866g8466H3114
$$ -89003 -23356 -259778 251631 60269 230264 -270970 72374 -142875 89866 -78466 83114
17997C35103i9242H2035c13237a50697c4733B0933G145g3548b226l29611C70944
$$ 335103 -99242 82035 -313237 -150697 -34733 20933 7145 -73548 -2226 -331837 370944
17985d08034A47418b90153f7930A59230L03305a49716A49658C536c15896A58222
$$ -408034 147418 -290153 -67930 159230 462535 -149716 149658 3536 -315896 158222
17974B0621a34018j55052P5408A2507J57457a564B8301g2906K456D8384L5296
$$ 20621 -134018 -289070 -213662 12507 169964 -1564 28301 -72906 -70450 48384 83680
17963H3680j7343a35959c8012E2004J12418Q6873A08979a81499j87717A33887
$$ 83680 66337 -135959 -38012 52004 164422 251295 108979 -181499 -369216 133887
17952a34012J82A59135k8422i5350B56179c37060i1720c6404H3907i272j15569
$$ -134012 -133830 159135 130713 -95350 256179 -337060 -91720 -36404 83907 -9272 -124841
17941a24841j37184L5379J11097H7111a79436E9618m788Q0316c53350G2559g2131
$$ -124841 -262025 -226646 -115549 87111 -179436 59618 54830 135146 -353350 72559 -72131
17929b5807o119A80068a50151A82868J9475d61817F9472a22508A07279h3393A3664
$$ -25807 -31926 180068 -150151 182868 202343 -461817 69472 -122508 107279 -83393 13664
17917e066B59645K2437o001b27899N2264B21836A1876a75851B21001b13923B25489
$$ -5066 259645 282082 276081 -227899 -175635 221836 11876 -175851 221001 -213923 225489
17905D1594a50732A37239b9288o2013E3637a31797j58286A02266C9156a19025
$$ 41594 -150732 137239 -29288 -91301 53637 -131797 -290083 102266 39156 -119025
17894a57748j45042A16440f6259j43746a03265G4454a49935A17918B8752K2538
$$ -157748 -302790 116440 -66259 -210005 -103265 74454 -149935 117918 28752 51290
17884E1290h4143G2873c190A50180c3155D7862K67600c2601E5847K01859n7252
$$ 51290 -84143 72873 -3190 150180 -33155 47862 315462 -32601 55847 257706 200454
17873B00454a31372j69624G013J45854a31521m4974B92439I0811a53216d3066
$$ 200454 -131372 -300996 7013 152867 -131521 -176495 292439 90811 -153216 -43066
17862d9523A03807a19733B11443M9088D4828J83880a71513B26089b66176A46941
$$ -49523 103807 -119733 211443 260531 44828 228708 -171513 226089 -266176 146941
17851b96345b4139B30794e2279C0775a3676k5846A81098a92928A71801b91403
$$ -296345 -24139 230794 -52279 30775 -13676 -39522 181098 -192928 171801 -291403
17840A04211d52195b3167A27777b66241f5647l8229l6127L012o9745R226b4870
$$ 104211 -452195 -23167 127777 -266241 -65647 -103876 -140003 -136991 -206736 -197510 -24870
17828b11609d9771L062l05998A05036j6297K2032a9874D2912a60586k80716e4662
$$ -211609 -49771 -46709 -352707 105036 88739 110771 -19874 42912 -160586 -441302 -54662
17816a6921A91429E6589b75718F9452f08482a70494L0180f7109A05536j4323b00
$$ -16921 191429 56589 -275718 69452 -608482 -170494 -140314 -67109 105536 91213 -200
17804G8620m436k4353B0815P8961c12306k2771A56481p1836d5576C25517b10739
$$ 78620 74184 49831 20815 99776 -312306 -335077 156481 84645 -45576 325517 -210739
17792a30919A200J57547e7921C49138A33989n6265j1183i1129k9851a1431k87173
$$ -130919 1200 158747 -57921 349138 133989 77724 66541 -91129 -120980 -11431 -298604
17781b98604J26687a5248B9910c1176I7413a45333B61156a57475A02687J59657
$$ -298604 -171917 -15248 29910 -31176 97413 -145333 261156 -157475 102687 262344
17771B62344j03144b50704C804J23914B7542J42509n5951K61859a03483A33687
$$ 262344 159200 -250704 3804 127718 27542 170051 114100 375959 -103483 133687
17760D06696b98488I0791C7797a5829O875A33688a42991j33604R6182A41210b11796
$$ 406696 -298488 90791 37797 -15829 -8954 133688 -142991 -276595 -180413 141210 -211796
17748A04911D7101P0468K759C7073J90922k6204K5007G1768l5140J33208E2910
$$ 104911 47101 117569 120328 37073 227995 201791 226798 71768 36628 169836 52910
17736a50282a2499C1119c82844i2734K7441B09212b98476J35378B83821f018A84016
$$ -150282 -12499 31119 -382844 -92734 -65293 209212 -298476 -163098 283821 -6018 184016
17724g5586a3704B9866a33263c3659q5166B1871b44246A11332D5933K05460a83462
$$ -75586 -13704 29866 -133263 -33659 -118825 21871 -244246 111332 45933 251393 -183462
17712h3948B0869a28386E35968A67886a47819l1926D74024a77738B27713i2971
$$ -83948 20869 -128386 535968 167886 -147819 -179745 474024 -177738 227713 -92971
17701B43534F6369C0623a41483E6260f1765j78834A7012K40418b47458A60231
$$ 243534 66369 30623 -141483 56260 -61765 -240599 17012 257430 -247458 160231
17690a15114J6277n022B80002m2909j09717a42662A08894M8820h1184A7563b1273
$$ -115114 -98837 -103859 280002 237093 127376 -142662 108894 157714 -81184 17563 -21273
17678H3176C1421c7966A31294a08487c9630C46338a09883H6875K26815A22554
$$ 83176 31421 -37966 131294 -108487 -39630 346338 -109883 86875 313690 122554
17667d3112j22364A59285E6091J25584O6887a00423J4832C2044J25262G0672i1290
$$ -43112 -165476 159285 56091 181675 248562 -100423 -85591 32044 157306 70672 -91290
17655a67314A22472e3577A32649l3427a94242k06872D2253j9469b05038F5484
$$ -167314 122472 -53577 132649 99222 -194242 -401114 42253 22784 -205038 65484
17644b119j74869Q0053C46007D168K11466A04924b32825D09124p1465E5432L33943
$$ -2119 -176988 -96935 346007 4168 215634 104924 -232825 409124 337659 55432 389375
17633C89375a55528D0272J45347h4559j29936J04921n978B83551a80932I8649
$$ 389375 -155528 40272 185619 -84559 -214495 -109574 -115552 283551 -180932 98649
17622a47549L9457D27677B07685a83915b8148l62107C99915A85392J71875a44313
$$ -147549 -108092 427677 207685 -183915 -28148 -390255 399915 185392 357267 -144313
17611a42217A73452G6890k3753a7267G0668N754B2957K03441a5070A88053a39929
$$ -142217 173452 76890 53137 -17267 70668 76422 22957 226398 -15070 188053 -139929
17599b81964E2051a30646F4928g6988B75305a36998L3272B38K01787P7074g427
$$ -281964 52051 -130646 64928 -76988 275305 -136998 -103726 238 202025 279099 -7427
17587b60944J24113f3303C32416b60595F2339b9805k50627d557n4162p5459M9573
$$ -260944 -136831 -63303 332416 -260595 62339 -29805 -280432 -4557 -58719 -134178 -84605
17576h4605L1259A92894h3883l1921d3173o7691E2196a3596D23498A49312F9535
$$ -84605 -53346 192894 -83883 -115804 -43173 -110864 52196 -13596 423498 149312 69535
17564a93545K6933B1788N3118i4242k21156C5663a52631A14991f7840j94810c5232
$$ -193545 -166612 21788 74906 -94242 -315398 35663 -152631 114991 -67840 -262650 -35232
17552A91725a29388E8011J0786r87f2462G7757f6059j52771b8134A04676l5643
$$ 191725 -129388 58011 68797 67810 -62462 77757 -66059 -218830 -28134 104676 69033
17541F9033J20247q6018A1141E438J50857d5129o1818b7103B09656l7048K09975
$$ 69033 189280 103262 11141 5438 156295 -45129 -106947 -27103 209656 172608 382583
17530C82583b70374A64465a27642A6596O8476a37218A93438J76306A66072C8117
$$ 382583 -270374 164465 -127642 16596 85072 -137218 193438 369744 166072 38117
17519c6121C31125K72450H150L38059A51269a27516D0550L05736j25940r2303
$$ -36121 331125 603575 8150 346209 151269 -127516 40550 346286 220346 128043
17509A28043n2278k1118N0393a00453j03989A12940b21214C5970N68117f0660
$$ 128043 75765 54647 105040 -100453 -204442 112940 -221214 35970 604087 -60660
17498B07367A01923f9807F9348A0079J86414B386i3677H389K31552J2473F7105
$$ 207367 101923 -69807 69348 10079 196493 2386 -93677 8389 239941 252414 67105
17486a25459G1782L80556A08165a06465A86754c5372m4319n0421B83474n718g4315
$$ -125459 71782 452338 108165 -106465 186754 -35372 -79691 -130112 283474 277756 -74315
17474A50775G5380O5342Q6734E0350L9552J46919m892m6588c462B13934K62656
$$ 150775 75380 140722 227456 50350 89902 236821 231929 185341 -3462 213934 476590
17463D76590A49467J97027J31842g472A84350A1690a89979D394Q1846K1096l8416
$$ 476590 149467 346494 478336 -7472 184350 11690 -189979 4394 86240 107336 68920
17452F8920O6717J16132h0250C07884J19412n5803k7101k0791j53162b98796C90051
$$ 68920 135637 251769 -80250 307884 427296 371493 344392 323601 170439 -298796 390051
17440A39292J35677a71988j8357B26158C2163L14342A53874K05930c4041C26182
$$ 139292 274969 -171988 -190345 226158 32163 346505 153874 359804 -34041 326182
17429D64300j47967C2396d9512D27724G6357K10848H6166g8596B8733J9483M6899
$$ 464300 316333 32396 -49512 427724 76357 287205 86166 -78596 28733 48216 95115
17418I5115c43609B62568R7886A23128Q0030m1392c9044h086o2622A46222b13676
$$ 95115 -343609 262568 360454 123128 203158 161766 -39044 -8086 -70708 146222 -213676
17406b0487A45689J28391h9440I517c0139j2790B93535j01907p9207J80942m1345
$$ -20487 145689 274080 -89440 9517 -30139 -42929 293535 191628 112421 293363 252018
17395B52018K61187B05130H123R4628d1283B17981a52810A45514A2055N16845
$$ 252018 513205 205130 8123 102751 -41283 217981 -152810 145514 12055 528900
17385E28900d3041A80133a30215F5471C600J58687o1437j9511O7236b36442C20921
$$ 528900 -43041 180133 -130215 65471 3600 162287 100850 81339 148575 -236442 320921
17373C06743F884M9907J23610J89601j47598J43655A08344f4508C85416c70302
$$ 306743 6884 56791 180401 370002 222404 366059 108344 -64508 385416 -370302
17362B55345i1700j67562B54555a39247B11470o737d0449A91569B8912K19138
$$ 255345 -91700 -259262 254555 -139247 211470 204733 -40449 191569 28912 248050
17352B48050h246C246a16381C86618A18356K96435K6871I1284J2486O6065N1858
$$ 248050 -8246 3246 -116381 386618 118356 414791 441662 91284 103770 169835 221693
17341B21693j5861k8059J33677g7010N879A88480P8571O3919H3021d893A83562
$$ 221693 205832 177773 311450 -77010 -71131 188480 267051 330970 83021 -4893 183562
17329b1066C2823K1465J56779a80019A73928L7287a23319A99835l4344L1157K54308
$$ -21066 32823 54288 211067 -180019 173928 211215 -123319 199835 165491 196648 450956
17318D50956k19560C8600e3157B22571K6492K9919G0426J29103L7600f5216D20141
$$ 450956 231396 38600 -53157 222571 249063 278982 70426 199529 237129 -65216 420141
17306c6485D72705a54055F9054c1350M868A04712j794J32231J05293A7617a40844
$$ -36485 472705 -154055 69054 -31350 -26482 104712 102918 235149 340442 17617 -140844
17294B49560J575a028A51085B0880N5348K21995j2245O5692j71253h9151A56417
$$ 249560 251135 -1028 151085 20880 76228 298223 285978 351670 180417 -89151 156417
17282A95405J4243j0071n3289k5855N5512a71119D0585R159O8049n4798J87776
$$ 195405 209648 199577 146288 120433 175945 -171119 40585 49744 117793 62995 250771
17271B50771H4084d0970H3979J54681n840K28132E2762L18368j78862n2434N3992
$$ 250771 84084 -40970 83979 238660 232820 460952 52762 371130 192268 139834 193826
17260A93826b6677A41774A8613J54878J81651c34011C7754J81301J95158a96130
$$ 193826 -26677 141774 18613 173491 355142 -334011 37754 219055 414213 -196130
17249b5621A21551K90806j87398l0293K12082r5558j19536r3023L1075J14367
$$ -25621 121551 412357 224959 194666 406748 311190 191654 98631 129706 244073
17239B44073j09564l5666R6861k6272j6827a14340l4032F2550c1669A98988C3164
$$ 244073 134509 98843 195704 169432 152605 -114340 -148372 62550 -31669 198988 33164
17227a3313j09458r014B69414P1228j28461j639n6534J18039D9559J4885M1051
$$ -13313 -122771 -131785 269414 340642 212181 210542 154008 272047 49559 64444 105495
17216A05495f610o4828a2904o9395A71838L7886f9837A627J46240J79172G1848
$$ 105495 -6610 -71438 -12904 -82299 171838 209724 -69837 1627 147867 327039 71848
17204A64716J48185k0678o1792c6655B89123J15218j79238J00037A30072J65471
$$ 164716 312901 292223 230431 -36655 289123 404341 225103 325140 130072 295543
17194B95543o3195R8709j07111r9455J29781o8637F0869k9032c16646J01186R4555
$$ 295543 232348 331057 223946 124491 254272 185635 60869 31837 -316646 -215460 -120905
17183a20905A75809K29027h8793B80540J94197J87579A32911J79202L413K3051
$$ -120905 175809 404836 -88793 280540 474737 662316 132911 312113 315526 338577
17173C38577g2512D82926A26433K15569J227G1939J19719K72171j47811M7673
$$ 338577 -72512 482926 126433 342002 343229 71939 191658 463829 316018 363691
17163C63691A33094J28261A0079L21939o4993j2674p1633K51893E4471L67382
$$ 363691 133094 261355 10079 332018 267025 254351 182718 434611 54471 421853
17153D21853A8971K90698J44626E049J57465J22839h9002D8498K00931H2131K75016
$$ 421853 18971 309669 454295 5049 162514 285353 -89002 48498 249429 82131 357147
17142C57147j26865n4672d4908B45059j14719L87724j81457j04349J54025j76214
$$ 357147 230282 175610 -44908 245059 130340 518064 336607 232258 386283 210069
17132B10069P8946A02017K90669j67404A04934K95741J46163j37902J8164A06134
$$ 210069 289015 102017 392686 225282 104934 400675 546838 408936 427100 106134
17121B79271L13822j16233B27300L83271F3996J15188M5151M33348a4447D15034
$$ 279271 593093 476860 227300 610571 63996 179184 224335 657683 -14447 415034
17110B69523J64079C2788J6765l839K90960L06699k98912q2869L6365K5679d0077
$$ 269523 433602 32788 49553 45714 336674 643373 344461 261592 297957 323636 -40077
17098C62634j01081j14226L51395k23639C2907K07388K0755O5757J491K33035
$$ 362634 261553 147327 498722 275083 32907 240295 261050 326807 328298 561333
17088E61333k42356q0148J57814j08935J80550l7652k12954k9267R0639J55222
$$ 561333 318977 238829 396643 287708 468258 430606 217652 188385 279024 434246
17078D34246N205J73968A43884Q9199L16893k42814j14965J1468J67138j21805
$$ 434246 439451 613419 143884 233083 549976 307162 192197 203665 370803 248998
17068B48998J38236q5143j32934P2301J85134k0587L72496C87679J9143J41895
$$ 248998 387234 302091 169157 241458 426592 406005 778501 387679 406822 548717
17058E48717n896o1472A44876N22645C15701J21266k9348q4113J77354j07290
$$ 548717 542821 481349 144876 667521 315701 436967 407619 323506 500860 393570
17048C93570J18194k34674K87100J54482B15223K61417o6004J17291k0403n7894
$$ 393570 511764 277090 564190 718672 215223 476640 410636 527927 507524 449630
17038D49630A05416J99845K35478J2564j48581k4694P2859J13128J7355L07793
$$ 449630 105416 305261 540739 553303 404722 380028 452887 566015 583370 891163
17028H91163C49979Q4361J24063J86785A52580O49182P1786C70017L57310k59114
$$ 891163 349979 434340 558403 745188 152580 801762 873548 370017 727327 468213
17018D68213J09569k31895P97319m31415B34706N34776l66807J90288J12931J65432
$$ 468213 577782 345887 1143206 711791 234706 769482 402675 592963 705894 871326
17008H71326C56834j01604M62823J46638o9496k28611K71364K3940j73904J84482
$$ 871326 356834 255230 718053 864691 795195 566584 837948 861888 687984 872466
16998H72466C55773m2891N51214j04835q8884J6736J15450j08094k24336K07296
$$ 872466 355773 312882 864096 759261 670377 687113 802563 694469 470133 677429
16988F77429p4273L47055k33271j13811j9712K14324J01837k03235J83501k43932
$$ 677429 603156 950211 716940 603129 583417 797741 899578 696343 879844 635912
16978F35912M09144j65109l17862J10137K660O3564L5490j81255N18456l52093
$$ 635912 1045056 879947 562085 672222 674882 738446 773936 592681 1111137 759044
16968G59044M6554K21742k73330J63294q4760L95174l40990k5521J22981k83613
$$ 759044 805598 1027340 754010 917304 832544 1227718 886728 861207 984188 700575
16958G00575J22974J20389j27034L05061j39918j11771J28972J42196P3875k98218
$$ 700575 823549 943938 816904 1121965 982047 870276 999248 1141444 1215319 917101
16948I17101k8990M87663m32348N8783K06407j64954L74121k16393l49118K96883
$$ 917101 888111 1375774 943426 1002209 1208616 1043662 1417783 1201390 852272 1149155
16938A149155K9682j4617k45119L34036j46670l3271K01097m34729K87322K6658
$$ 1149155 1178837 1164220 919101 1253137 1106467 1073196 1274293 839564 1126886 1153544
16928A153544j53497L75140k75258L01906j30419J5763n9593J30018K8638P5628
$$ 1153544 1000047 1375187 1099929 1401835 1271416 1287179 1227586 1357604 1386242 1461870
16918A461870m66318M39163k98808L62837j35858P1886J05100k95286j08159K73430
$$ 1461870 995552 1434715 1135907 1498744 1362886 1434772 1539872 1244586 1136427 1409857
16908A409857J36012N76107o44991K14506k85325k54817K46723o3913L54089M8019
$$ 1409857 1545869 2121976 1476985 1691491 1406166 1151349 1398072 1334159 1688248 1736267
16898A736267K4793J64037j86963j13277j13288J61303j0586j02145J67290K65203
$$ 1736267 1761060 1925097 1738134 1624857 1511569 1672872 1662286 1560141 1727431 1992634
16888A992634k18644J49548J90762j70019K76252j33076p8839N650L7658j46464
$$ 1992634 1773990 1923538 2114300 1944281 2220533 2087457 2008618 2014268 2051926 1905462
16878A905462K15557o4031R358q1752O6266K80433J31465k09806M08194m75707
$$ 1905462 2121019 2056988 2066346 1984594 2050860 2331293 2462758 2252952 2661146 2185439
16868B185439J17366K01515l42307K55829M99966p7595j87334M8353k13082q2874
$$ 2185439 2302805 2504320 2162013 2417842 2917808 2840213 2652879 2701232 2488150 2405276
16858B405276J84275K37755l08533L95820k55154K2283L65537k04032r251L42500
$$ 2405276 2589551 2827306 2518773 2914593 2659439 2681722 3047259 2843227 2833976 3176476
16848C176476P8748K1892k1489L59094k30838j50137K85442K11905O7659m1136
$$ 3176476 3255224 3277116 3255627 3614721 3383883 3233746 3519188 3731093 3798752 3757616
16838C757616p2136O8750J09941M6923k27117L71026j25578L36767R9611L6201
$$ 3757616 3685480 3754230 3864171 3911094 3683977 4055003 3929425 4266192 4365803 4402004
16828D402004m634j7109K88203L5929m21188O38131j17553K88657Q2990k18645
$$ 4402004 4397370 4380261 4668464 4704393 4283205 4921336 4803783 5092440 5175430 4956785
16818D956785K75877r4290L87053K6804J22243J00654J77849q5894N02563l19487
$$ 4956785 5232662 5138372 5525425 5552229 5674472 5775126 5952975 5867081 6369644 6050157
16808F050157M08948K80670k54481N64594j86061M58398j83371L56473J9593J57931
$$ 6050157 6459105 6739775 6485294 7049888 6863827 7322225 7138854 7495327 7514920 7672851
16798G672851L59610J86003K40254L26159j63486M23744L25386L02588O4592J79743
$$ 7672851 8032461 8218464 8458718 8784877 8621391 9045135 9370521 9673109 9737701 9917444
16788I917444K24510L97894L62644J10958O58845J80533K67357M34048O45761
$$ 9917444 10141954 10539848 10902492 11013450 11672295 11852828 12120185 12554233 13199994
16779A3199994J30883M36479K29128Q01210k1650Q35326J80041Q93912M22291
$$ 13199994 13330877 13767356 13996484 14797694 14776044 15611370 15791411 16685323 17107614
16770A7107614J49498P78704P83869Q86194N54680P66427Q17654N81719J078233
$$ 17107614 17257112 18035816 18819685 19705879 20260559 21026986 21844640 22426359 23504592
16761B3504592J177764Q05478J236592Q47110J274365R17725J595663J626861
$$ 23504592 24682356 25487834 26724426 27571536 28845901 29763626 31359289 32986150
16753C2986150J161899J552928J783862K002860J646855J879091K543552K376476
$$ 32986150 34148049 35700977 37484839 39487699 41134554 43013645 45557197 47933673
16745D7933673K352712K616646K898034K892657L328226L416265L945557L977114
$$ 47933673 50286385 52903031 55801065 58693722 62021948 65438213 69383770 73360884
16737G3360884M280532M521375M658985N340101N230971N697714O232244O464340
$$ 73360884 77641416 82162791 86821776 92161877 97392848 103090562 109322806 115787146
16729A15787146O208186P039746O893525O728213O974481O531458O170881O011851
$$ 115787146 121995332 129035078 135928603 142656816 149631297 156162755 162333636 168345487
16721A68345487N427519L491427L789650K569843J215617l49216r56312k533914
$$ 168345487 173773006 177264433 181054083 183623926 184839543 184490327 183534015 181000101
16713A81000101l462544m624047n057426n923756o171524o802056o832345o929581
$$ 181000101 177537557 172913510 167856084 161932328 155760804 148958748 142126403 135196822
16705A35196822o795110o710914o812221o287554o292958n450781n546724n005027
$$ 135196822 128401712 121690798 114878577 108591023 102298065 96847284 91300560 86295533
16697H6295533n347714l910707m618239l921983m112951l190162l306159l495610
$$ 86295533 80947819 77037112 72418873 68496890 64383939 61193777 57887618 54392008
16689E4392008k043780l138076k354529k235969j794930k447173k184960j312520
$$ 54392008 52348228 49210152 46855623 44619654 42824724 40377551 38192591 36880071
16681C6880071j876023j764825j296103j702154j327447r55213p26829j480758
$$ 36880071 35004048 33239223 31943120 30240966 28913519 27958306 27231477 25750719
16673B5750719p89445j412407p43718o92994p55019j222832o88698l63416q47803
$$ 25750719 24961274 23548867 22805149 22112155 21357136 20134304 19445606 19082190 18234387
16664A8234387k55910j125906k36323o63280m11737q02660j81148m03162n60915
$$ 18234387 17978477 16852571 16616248 15952968 15541231 14738571 14557423 14154261 13593346
16655A3593346l24737n07436m16494m25806j89308n09783m88755j54384j07163
$$ 13593346 13268609 12761173 12344679 11918873 11729565 11219782 10731027 10576643 10469480
16646A0469480l58454l583o16115q0311k52680m57980l43738j76551N8942k4631
$$ 10469480 10111026 10107443 9491328 9411017 9158337 8700357 8356619 8180068 8239010 8214379
16636H214379k14249l42084l39211r5220K27037o73072J31002m77599j75851J34554
$$ 8214379 8000130 7658046 7318835 7223615 7450652 6777580 6908582 6430983 6255132 6389686
16626F389686J55737n25312j73375O1681j24307l50858j166l81740M51393j66327
$$ 6389686 6545423 6020111 5846736 5908417 5784110 5433252 5432086 5050346 5501739 5335412
16616E335412o5435k60483r6575l01461l4218J61669k55931J22534l76862j27772
$$ 5335412 5269977 5009494 4912919 4611458 4577240 4738909 4482978 4605512 4228650 4100878
16606D100878J67497j99381l8641L1468m3605l4595m66869M85565l63161j77979
$$ 4100878 4268375 4068994 4030353 4061821 4018216 3983621 3516752 4002317 3639156 3461177
16596C461177J43245k7279k89077n3952J03533k74631J54577j61238J05512k17763
$$ 3461177 3604422 3577143 3288066 3234114 3337647 3063016 3217593 3056355 3161867 2944104
16586B944104J89272j01224k57577j47267R5119K1405J28341j29082j50365o0660
$$ 2944104 3133376 3032152 2774575 2627308 2722427 2743832 2872173 2743091 2592726 2532066
16576B532066q7177L5964R6774l5664k15643R1183j33734K99476r8510k40720
$$ 2532066 2444889 2480853 2577627 2541963 2326320 2417503 2283769 2583245 2484735 2244015
16566B244015o0406j34364J3613P5703j55957p141p5811J82151J96828j95468
$$ 2244015 2183609 2049245 2062858 2138561 1982604 1975463 1899652 2081803 2278631 2083163
16556B083163j86180r0017n4744k72647M96174m18123M23563k23799J9558n6317
$$ 2083163 1896983 1806966 1752222 1479575 1975749 1557626 1981189 1757390 1776948 1720631
16546A720631m985l2437K56749k04092j49672j694m1916K52633m7293k07442n5743
$$ 1720631 1715646 1683209 1939958 1735866 1586194 1584500 1542584 1795217 1747924 1540482 1484739
16535A484739Q3185L727O0977k80271J58785j68800j36745R0520K4027K16974
$$ 1484739 1567924 1571651 1632628 1352357 1511142 1342342 1205597 1296117 1320144 1537118
16525A537118j23034R4929L21719j10252o21867L6263o0991K55627n8459R6002
$$ 1537118 1414084 1509013 1830732 1720480 1098613 1134876 1073885 1329512 1271053 1367055
16515A367055j82865Q9540j85259J027J12161k05648m1430P6833o0569K88039
$$ 1367055 1184190 1273730 1088471 1089498 1201659 996011 954581 1031414 970845 1258884
16505A258884k15671j38768J78436m2926j26401J23488L49418j13987m31045J30013
$$ 1258884 1043213 904445 1082881 1039955 913554 1037042 1386460 1272473 841428 971441
16495I71441k4743r2539M11869m00546L5465Q5219J18022k10721J91429m12771
$$ 971441 946698 854159 1266028 865482 900947 986166 1104188 893467 1084896 672125
16485F72125L84472k27728J70083O8787J04448l44278P2723K815l13007N11066
$$ 672125 1056597 828869 998952 1067739 1172187 827909 900632 903447 590440 1101506
16475A101506l45119J50283Q9483m16819L517K79173k54914L32533D63586K83917
$$ 1101506 756387 906670 996153 579334 582851 862024 607110 939643 463586 747503
16465G47503j62862L62623m45202K37777K23146j05444l55836J42737L1965j28622
$$ 747503 584641 947264 502062 739839 962985 857541 501705 644442 676407 547785
16455E47785L18916k34426l6016J23193o5908J49344J52246m20934J83244k20762
$$ 547785 866701 632275 596259 719452 653544 802888 955134 534200 717444 496682
16445D96682J42496L7822C38269K82483J2177O9890L90321E06323J19708j36353
$$ 496682 639178 677000 338269 620752 632929 702819 1093140 506323 626031 489678
16435D89678J58731N0253q878j11562J14446l39763M41078j41228j30444K56135
$$ 489678 648409 698662 689784 578222 692668 352905 793983 652755 522311 778446
16425G78446k54054o7829K45839P8904k04770K76607k60447J09928j95283o7074
$$ 778446 524392 456563 702402 781306 576536 853143 592696 702624 507341 440267
16415D40267L71007j09647l08674n4029M35348o4735j08468j69298J43063J46153
$$ 440267 811274 701627 392953 338924 774272 709537 601069 431771 574834 720987
16405G20987k02646B47230N56274B86006J21977J08148m3711M0736m2438J39026
$$ 720987 518341 247230 803504 286006 407983 516131 472420 513156 470718 609744
16395F09744G7921K5618N31893p1504j67849K78212n5833j92619O2661L6000k32686
$$ 609744 77921 103539 635432 563928 396079 674291 618458 425839 488500 524500 291814
16384B91814k9338K70079M9547B49323A22405j7058J31937J65209i755F73759
$$ 291814 262476 532555 582102 249323 122405 105347 237284 402493 -9755 673759
16373F15478j89276K4300M6085p2367j73164M41900B57828M3350L9714r1421J20323
$$ 615478 426202 450502 496587 424220 251056 692956 257828 301178 340892 249471 369794
16362C69794r7290K73261L77k61087J1080J99538A87656K53294j72875R8628n7122
$$ 369794 272504 545765 546142 285055 296135 495673 187656 440950 268075 366703 309581
16351C09581l2202l535M6153J2743J0058L3301L23544C4894K99933P6191A84821
$$ 309581 277379 273844 319997 332740 342798 376099 699643 34894 334827 411018 184821
16339C88356j40640J55015L46067l05508m6210D4700K29890e4276p5197C64251
$$ 388356 247716 402731 748798 443290 397080 44700 274590 -54276 -129473 364251
16328C60633J39651P5916l778G3308L14889J29028A68286F8823L2860J88800J74664
$$ 360633 500284 576200 572422 73308 388197 517225 168286 68823 101683 290483 465147
16317D65147G6283K09727J6094K96392B59970d7561B58381m1317R3879J86318
$$ 465147 76283 286010 302104 598496 259970 -47561 258381 217064 310943 497261
16307D97261h7794C833K70380r153A17315L61635A82425M4738P4616J55595j62001
$$ 497261 -87794 3833 274213 265060 117315 478950 182425 227163 301779 457374 295373
16296B95373L65142B11123B8736J27744j9314J18641F7757J59776M0717J73138
$$ 295373 660515 211123 28736 156480 137166 255807 67757 227533 268250 441388
16286D41388j70007A26772J7824K17407F0472N4543L25875k12773J31735j48760
$$ 441388 271381 126772 144596 362003 60472 115015 440890 228117 359852 211092
16276B11092l289K91940F1968J41074J20459j2106j17756n3687J58286p8522J05531
$$ 211092 207803 499743 61968 203042 323501 311395 193639 139952 298238 219716 325247
16265C25247L72675c1141B70246q3714e2996B49558J15479F635d077A19365N2454
$$ 325247 697922 -31141 270246 186532 -52996 249558 365037 6635 -4077 119365 171819
16254A71819j946N274n3349a53034C5241e5828A93108K3372k4602a64907A88141
$$ 171819 169873 175147 121798 -153034 35241 -55828 193108 216480 191878 -164907 188141
16242g7773E53101a35414C74843j54450L4028A21406B9640J07309J8410j737I929
$$ -77773 553101 -135414 374843 220393 254421 121406 29640 136949 155359 153622 9929
16230h3676B65445c8177A71908k8792J81560b43255A00296L30108L840j48566
$$ -83676 265445 -38177 171908 143116 324676 -243255 100296 430404 434244 285678
16220B85678J24293n6662R551A10503j8238a51472D07571B5956R5740J66544a27635
$$ 285678 409971 353309 362860 110503 92265 -151472 407571 25956 121696 288240 -127635
16208B14323M218k9487d2808A51589k6669i650C64022j23102E0376L7517J99953
$$ 214323 218541 189054 -42808 151589 124920 -9650 364022 240920 50376 87893 287846
16197B87846A36779J4438O5972G370a46598C98030j67103r5355K38432a42563
$$ 287846 136779 151217 217189 7370 -146598 398030 230927 135572 374004 -142563
16186B01485n7230L42125A30765B4537e2582A57394a57043C14800H5519O789c1185
$$ 201485 144255 486380 130765 24537 -52582 157394 -157043 314800 85519 92308 -31185
16174B85820d1724A1961f9596I2837D4065b12496E86858k39919A9782M5281b74221
$$ 285820 -41724 11961 -69596 92837 44065 -212496 586858 346939 19782 65063 -274221
16162b90525f388A51037j4748n4560J48379m706o2943P6331Q310L5083g5917h922
$$ -290525 -6388 151037 136289 81729 230108 225402 162459 238790 247100 282183 -75917 -8922
16149B79664a94774f5347r2617J4428C41764a59581B97587a97865l661A26254
$$ 279664 -194774 -65347 -157964 -143536 341764 -159581 297587 -197865 -201526 126254
16138D09553a9037o3213c2044k25410A93055k0216J09583e9200j86835A5187P5069
$$ 409553 -19037 -82250 -32044 -257454 193055 172839 282422 -59200 -246035 15187 90256
16127I0256k1438f7299m5532l0688G9601d106A89041O3176G920J76610a75668
$$ 90256 68818 -67299 -112831 -143519 79601 -4106 189041 252217 7920 184530 -175668
16115A51905O8945b226n6028a5391F0431L37254a02682D61503A28335b0030A00199
$$ 151905 220850 -2226 -58254 -15391 60431 397685 -102682 461503 128335 -20030 100199
16103b18566E05260A05023g1888A54275p701a32626C19991A8555K7445a59071
$$ -218566 505260 105023 -71888 154275 146574 -132626 319991 18555 46000 -159071
16092B0430M8020a27213m883D0241c2090B80038F2095b01834A11692M24017a09297
$$ 20430 68450 -127213 -132096 40241 -32090 280038 62095 -201834 111692 535709 -109297
16080c3511G1993e8673B09523H2438i3611i506A68488k7799b0551A82290h2374
$$ -33511 71993 -58673 209523 82438 -93611 -9506 168488 140689 -20551 182290 -82374
16068D6730J17592f7834j74650A12539c952p1580A44616b64636A13398J48991
$$ 46730 164322 -67834 -242484 112539 -3952 -75532 144616 -264636 113398 262389
16058B62389c59592J28139J04113A90214b57590f5248n3895F0125k3148Q5790
$$ 262389 -359592 -231453 -127340 190214 -257590 -65248 -119143 60125 36977 122767
16048A22767J03509a16387J3403A48677b88520D3912J82279B9901a01185r9544
$$ 122767 226276 -116387 -102984 148677 -288520 43912 226191 29901 -101185 -200729
16038b00729B56826b06722a415C65925B3203f1973j13699m3104i5008j8131L9278
$$ -200729 256826 -206722 -1415 365925 23203 -61973 -175672 -218776 -95008 -113139 -73861
16027g3861j33627O104A18370E4199a3692p1510B49015D5811K15429i1513b3392
$$ -73861 -207488 -201384 118370 54199 -13692 -85202 249015 45811 261240 -91513 -23392
16015A29756J76a86758q8941c9573j26814D6886b28805H1479C7170i2802k1023
$$ 129756 129932 -186758 -275699 -39573 -166387 46886 -228805 81479 37170 -92802 -113825
16004a13825A03307N7170a81873d2659A76780C9775f0708F4250a88633G8388J32011
$$ -113825 103307 160477 -181873 -42659 176780 39775 -60708 64250 -188633 78388 210399
15993B10399a03431B02586a65886C42986H6582k2147J66491m2829d0083B35536
$$ 210399 -103431 202586 -165886 342986 86582 64435 230926 188097 -40083 235536
15982D02948j24918m5236r8394J37626j33115a27953A37988a71135o8482A97278
$$ 402948 278030 232794 134400 272026 138911 -127953 137988 -171135 -239617 197278
15971C8884g6958B2719N6656J41032l2188A3201b1160o2133j07392E9498a55680
$$ 38884 -76958 22719 79375 220407 188219 13201 -21160 -83293 -190685 59498 -155680
15959F9637J49677Q3052q7430a66161F4726a17001B14932a54829g5364K5720j51664
$$ 69637 219314 302366 214936 -166161 64726 -117001 214932 -154829 -75364 -49644 -201308
15948b01308g8472b8298n7351o6820b9708B34281H187b03908A91252a99053g8809
$$ -201308 -78472 -28298 -85649 -152469 -29708 234281 8187 -203908 191252 -199053 -78809
15936G390b02365i1684n4567l4085m2910K1522O3972D8512a76391A06496d02884
$$ 7390 -202365 -91684 -146251 -180336 -223246 -201724 -137752 48512 -176391 106496 -402884
15924b57190B04911a87038M5273A59227a1057l22539C7070i5332k49037C01271
$$ -257190 204911 -187038 -141765 159227 -11057 -333596 37070 -95332 -344369 301271
15913D0164a25995G5689J74025c62695a05948l065L6460F8216Q5897o7754a2780
$$ 40164 -125995 75689 249714 -362695 -105948 -109013 -72553 68216 154113 86359 -12780
15901G6968B0249a20677A67131g4951n4450A12923a58657J47P7180C9835K19131
$$ 76968 20249 -120677 167131 -74951 -129401 112923 -158657 -158510 -81330 39835 258966
15890B58966L7908c82111e9211A97099b6070I191J82637n4277a72972K1006A05276
$$ 258966 296874 -382111 -59211 197099 -26070 9191 191828 137551 -172972 -151966 105276
15878A07738l4784i3040p6222A17124O8414a16907A43836a621j09683k603A70451
$$ 107738 72954 -93040 -169262 117124 185538 -116907 143836 -1621 -111304 -113907 170451
15866H6485C0947J09431C477b25191a8398q967E1123P4328i9305a027I5118l5266
$$ 86485 30947 140378 3477 -225191 -18398 -27365 51123 125451 -99305 -1027 95118 59852
15854E9852a68719j1359A67529h3662q7973N5830A75579B765f6007N443K0853
$$ 59852 -168719 -180078 167529 -83662 -171635 -115805 175579 2765 -66007 -60564 -39711
15843c9711H8891i1273B56644L634d6589A63426M8302M3153A19480k6398c0211
$$ -39711 88891 -91273 256644 260278 -46589 163426 211728 254881 119480 93082 -30211
15831b8123n8213F3754J49756J8624D2926A7859c33869g8959A0832J46541i0276
$$ -28123 -86336 63754 213510 232134 42926 17859 -333869 -78959 10832 157373 -90276
15819B13572a58784g5026A93710c2776A74249a5021k3553E2046a67045J2797N3180
$$ 213572 -158784 -75026 193710 -32776 174249 -15021 -38574 52046 -167045 -154248 -101068
15808a01068E0879O721a15267B353J21643c18038A9842J1054c7493B3271M0081
$$ -101068 50879 57600 -115267 2353 123996 -318038 19842 30896 -37493 23271 63352
15797F3352a39153p2112a7629f389r7612B7442a77254B7357J37790n0160C613
$$ 63352 -139153 -211265 -17629 -6389 -104001 27442 -177254 27357 165147 114987 3613
15785i4900k57811g6801p9433m29D040a31489k07434C19460d8598A15110h9067
$$ -94900 -352711 -76801 -156234 -156663 4040 -131489 -338923 319460 -48598 115110 -89067
15773F9705e1959A32167E4198P8947M5916a21871D99785b8984j2204A5875c48876
$$ 69705 -51959 132167 54198 133145 179061 -121871 499785 -28984 -41188 15875 -348876
15761a30340l4042Q1378I0003L3361a35320B43386Q4762a25990E5523F525J18814
$$ -130340 -164382 -83004 90003 123364 -135320 243386 328148 -125990 55523 6525 125339
15750A25339i0918E6759c6555k1066B63850j9900H1676b05848l9807A78082i6192
$$ 125339 -90918 56759 -36555 -57621 263850 243950 81676 -205848 -245655 178082 -96192
15738f0249B06084a75655A5246a58597j51250P9112B86613b04249k50809a63645
$$ -60249 206084 -175655 15246 -158597 -309847 -230735 286613 -204249 -455058 -163645
15727d48218l2861K16157a12278h294n33964F9853a53821n7116i0727k0284e5257
$$ -448218 -481079 -264922 -112278 -8294 -542258 69853 -153821 -210937 -90727 -111011 -55257
15715a74303P1836A57362c63430o9406F3456l0158M067a53573F756i2664l25238
$$ -174303 -102467 157362 -363430 -432836 63456 33298 37365 -153573 6756 -92664 -417902
15704d17902K8054a44346I4090D2297a68091N7463A12948a58663A39779b25307
$$ -417902 -389848 -144346 94090 42297 -168091 -110628 112948 -158663 139779 -225307
15693a08977I9374p75b94985a39906h84j12095r2261A68817c02534J2683A16586
$$ -108977 99374 98599 -294985 -139906 -884 -112979 -205240 168817 -302534 -289851 116586
15681c9211o2542c6629C53652e854E1461i7873L0252m36351a43781A63032b14827
$$ -39211 -101753 -36629 353652 -5854 51461 -97873 -67621 -503972 -143781 163032 -214827
15669b0617H2893q516b10356M3458g1575D5661K9637P9208a12376L252l345A42184
$$ -20617 82893 74377 -210356 -166898 -71575 45661 75298 154506 -112376 -109124 -112469 142184
15656b10891B37609c10907G8073e4475A21735c28227A9151O1217a14691B69821
$$ -210891 237609 -310907 78073 -54475 121735 -328227 19151 80368 -114691 269821
15645c42113i7619H4377n269a38109o0844I3907a75125b3312k30363F5145M6142
$$ -342113 -97619 84377 79108 -138109 -198953 93907 -175125 -23312 -253675 65145 111287
15634A11287c2815i300j02449A45100b3892k14901N0722J7137a2369B57240f5178
$$ 111287 -32815 -9300 -111749 145100 -23892 -238793 -188071 -170934 -12369 257240 -65178
15622I3597O0743j4303c9288g592r2648B73629H9170J90601L0252i7418j7642
$$ 93597 154340 140037 -39288 -7592 -100240 273629 89170 279771 310023 -97418 -115060
15611a15060r6286d0208A48007h0252F9961K30025F0713j7024J20089c5101m9230
$$ -115060 -211346 -40208 148007 -80252 69961 299986 60713 43689 163778 -35101 -84331
15600h4331c9155G3498O447C0157a0516j52556a8585l5964k52333O8111A29645
$$ -84331 -39155 73498 79945 30157 -10516 -163072 -18585 -54549 -306882 -238771 129645
15588g3959g224j2747C05303l9542D2807g0489j64200h4155A19967i3988C7341
$$ -73959 -7224 -19971 305303 265761 42807 -70489 -234689 -84155 119967 -93988 37341
15576a10078I8778g605l7471n4604A92900p4237m6325b44086G2557a14739j1082
$$ -110078 98778 -7605 -45076 -99680 192900 118663 72338 -244086 72557 -114739 -125821
15565a25821E749c0808B03509d789k64204B44097d0344E6612K35898F0988j5290
$$ -125821 5749 -30808 203509 -4789 -268993 244097 -40344 56612 292510 60988 45698
15554D5698P8818C5583b09628j53963J53535k21269J90786C2522b79035J2659
$$ 45698 124516 35583 -209628 -363591 -210056 -431325 -240539 32522 -279035 -266376
15544b66376M6452h3817I9120A9942c16775a42958I0716a3848B47192H0272b35285
$$ -266376 -219924 -83817 99120 19942 -316775 -142958 90716 -13848 247192 80272 -235285
15532a29483j58360G6513L96288b8160l09535f0126G2512a31507B77627E4758
$$ -129483 -287843 76513 472801 -28160 -337695 -60126 72512 -131507 277627 54758
15521F1096h8803M2029p5498G6539P0952p2913C6820J7500c3660J004B23352p2320
$$ 61096 -88803 -46774 -122272 76539 147491 74578 36820 54320 -33660 -32656 223352 151032
15509A51032a36814E8589A5520J07460b23731J7740m1229m4270f4164k7654j34122
$$ 151032 -136814 58589 15520 122980 -223731 -205991 -247220 -291490 -64164 -91818 -225940
15498b25940j32139k16292i1023k52570d1376I8294a7254B09654q1833D62i4210
$$ -225940 -358079 -574371 -91023 -343593 -41376 98294 -17254 209654 127821 462 -94210
15486a09583A80382a33985p1603B17587a49417A00774k1890l2576B2161M20657
$$ -109583 180382 -133985 -205588 217587 -149417 100774 78884 46308 22161 442818
15476D42818E9853i2877B36902B4740K9565n895J8352L11175D9901a87260L2906
$$ 442818 59853 -92877 236902 24740 54305 48410 66762 377937 49901 -187260 -154354
15465a54354H8287e2672B39739p1913B4992R0406b67862G4261J30322a23591A34296
$$ -154354 88287 -52672 239739 167826 24992 115398 -267862 74261 204583 -123591 134296
15453C4430j4870I211L88614a5029C0863R0419a41025d4752k76287J02319E3366
$$ 34430 19560 9211 397825 -15029 30863 121282 -141025 -44752 -321039 -218720 53366
15441A72680g6975D384M9100B4148a33644d5889r3484g348l29418A51599a58420
$$ 172680 -76975 4384 53484 24148 -133644 -45889 -139373 -7348 -336766 151599 -158420
15429B22429b85926J04008H5244l4205b21105M6364k31663b5332j70612F5159
$$ 222429 -285926 -181918 85244 51039 -221105 -174741 -406404 -25332 -195944 65159
15418B52213a72658d8784i467E1709i5118d2305A18261P5222b2461H1094K88233
$$ 252213 -172658 -48784 -9467 51709 -95118 -42305 118261 193483 -22461 81094 369327
15407C69327I5480A8932a74285B63141b03194I7167h9886j5906F3380a62303B1029
$$ 369327 95480 18932 -174285 263141 -203194 97167 -89886 -105792 63380 -162303 21029
15395A1819b59395J28798A7448P2600a24482r9224e2448B20881f7480o3219m4103
$$ 11819 -259395 -130597 17448 90048 -124482 -223706 -52448 220881 -67480 -130699 -174802
15384a74802A00812J1792D7477b10304B58875j17975a95389B64397a19037K9400
$$ -174802 100812 112604 47477 -210304 258875 140900 -195389 264397 -119037 -89637
15374h9637J8028C079R5452b5208A07869b75818i6558B68237r7428c29935a42297
$$ -89637 -71609 3079 98531 -25208 107869 -275818 -96558 268237 170809 -329935 -142297
15362i6919n3390D5097K47826G5571L51107A02491M3684b4130H1999J43786n4962
$$ -96919 -150309 45097 292923 75571 426678 102491 146175 -24130 81999 225785 170823
15351A70823l2693m8639b19831N4441d7002j3579J7644o2233L6996A06721a72238
$$ 170823 138130 89491 -219831 -165390 -47002 -60581 -42937 -105170 -68174 106721 -172238
15339A62626b9149j81239D1687b49394B73021c33700a54400j60205A26904k4065
$$ 162626 -29149 -210388 41687 -249394 273021 -333700 -154400 -314605 126904 102839
15329A02839a35896j22921c8971j12866j9232a6369C66692j42788m8311j3142
$$ 102839 -135896 -258817 -38971 -151837 -171069 -16369 366692 223904 175593 162451
15319A62451c4899j91615a277I872J53933F3739K948c02821f2681E8722K4165
$$ 162451 -34899 -226514 -1277 9872 163805 63739 66687 -302821 -62681 58722 82887
15308H2887c715B58070b79822P9956d5351B10108i1609A26792c4419j14137A51572
$$ 82887 -3715 258070 -279822 -199866 -45351 210108 -91609 126792 -34419 -148556 151572
15296F9132B8098c89876E6681Q7961b6197C54041j74363b85195A04489Q7233m0756
$$ 69132 28098 -389876 56681 144642 -26197 354041 179678 -285195 104489 191722 150966
15285A50966A6161O3316J13424K1879J4239C0959R7407D2945b37371A1348a27153
$$ 150966 16161 79477 192901 214780 229019 30959 128366 42945 -237371 11348 -127153
15273A61988K84148d7106A93243L9812d0076l5673A40886d3622B55374n2736r748
$$ 161988 446136 -47106 193243 233055 -40076 -75749 140886 -43622 255374 202638 192890
15262A92890L6889E5181c44036A59047g7568B215i8011B85392b32703F6417L23711
$$ 192890 229779 55181 -344036 159047 -77568 2215 -98011 285392 -232703 66417 390128
15251C90128j21155A18974g4700E74956O18943J299616r49351M39956k83553A26052
$$ 390128 268973 118974 -74700 574956 1193899 2493515 1544164 1984120 1700567 126052
15240C12164G7149i2634A83794A2455J84787l1136m9603d5295j6293A52541J4942
$$ 312164 77149 -92634 183794 12455 197242 166106 116503 -45295 -61588 152541 167483
15229A67483l5184D1513N6531a92668A9953a90106h0936p1970A30988A0454K87321
$$ 167483 132299 41513 98044 -192668 19953 -190106 -80936 -152906 130988 10454 297775
15218B97775J38506h2253j43985a8073k37765D9649J23134E7419J07405a39762
$$ 297775 436281 -82253 -226238 -18073 -255838 49649 172783 57419 164824 -139762
15207I9219I439J3848a05750J4279B81746f4063k8164A97545K7194G1203B5845
$$ 99219 9439 23287 -105750 -91471 281746 -64063 -92227 197545 224739 71203 25845
15195B98546r6759k7052E4735K17812j21999a20369A88475o9581C3873L18998
$$ 298546 201787 174735 54735 272547 150548 -120369 188475 118894 33873 352871
15185C52871A36183a30057A14824J22039h9900j4969k38622a06458B13417G7787
$$ 352871 136183 -130057 114824 236863 -89900 -104869 -343491 -106458 213417 77787
15174g8838j94887A27853l082R9399l7897F0925N6161R4388F4722c8738F3033
$$ -78838 -273725 127853 124771 224170 186273 60925 117086 211474 64722 -38738 63033
15162b87571J35155b210r0641L234A45756a12906a1431A03658C0912K25700A21879
$$ -287571 -152416 -2210 -92851 -89617 145756 -112906 -11431 103658 30912 256612 121879
15150g8291k40154D8154K7554Q7978J23949a76954A29709d4791q300D29134E6689
$$ -78291 -318445 48154 75708 163686 287635 -176954 129709 -44791 -53091 429134 56689
15138c47038C14271q3715b61959f762C83637I5009J78708H8128J21338d8554k89609
$$ -347038 314271 230556 -261959 -6762 383637 95009 273717 88128 209466 -48554 -338163
15127c38163g4537B23291q5130R5924j00133K8936J20196j34900J27421o2111
$$ -338163 -74537 223291 138161 234085 133952 162888 283084 148184 275605 213494
15117B13494l7982p9512J2927b05737a4261j44387B4754K39389A21531J36110
$$ 213494 175512 96000 108927 -205737 -14261 -158648 24754 264143 121531 257641
15107B57641a4627B57386o4129J10031c6622D16729h6286B36910q1485k3145a43451
$$ 257641 -14627 257386 193257 303288 -36622 416729 -86286 236910 155425 132280 -143451
15095I0378J09311o6981N5996L80505j99592j48555C5747R7111K9133m8749L08553
$$ 90378 199689 132708 188704 569209 369617 221062 35747 132858 161991 113242 421795
15084D21795j83553d6971j3824m2048E9894K75215p3123G8625c8519A85095K55342
$$ 421795 238242 -46971 -60795 -102843 59894 335109 261986 78625 -38519 185095 440437
15073D40437A55388Q9588R2933j4073j11273n27D2689a9948A44895O4638a2296
$$ 440437 155388 244976 337909 323836 212563 212036 42689 -19948 144895 209533 -12296
15061B57267F9840J76198m5810r7654c417A1576j838a1007H2412K37874r3902
$$ 257267 69840 246038 200228 102574 -3417 11576 9738 -11007 82412 320286 226384
15050B26384k0421H3797M41333B43521C8762K67925G1739B1731M6598K74508k6943
$$ 226384 205963 83797 525130 243521 38762 306687 71739 21731 68329 342837 315894
15039C15894a06504B51698D9017J98252A19210k396f9814C33047j35260k8717
$$ 315894 -106504 251698 49017 247269 119210 116814 -69814 333047 197787 169070
15029A69070N5967A2642M0357b04676b3448j17395A43149M7554L8541l369E1793
$$ 169070 225037 12642 52999 -204676 -23448 -140843 143149 190703 229244 225875 51793
15017A92363F4114A0378a01010G1821M748J20681E4054J88179a100D18161j06606
$$ 192363 64114 10378 -101010 71821 76569 197250 54054 242233 -1100 418161 311555
15006C11555k5509Q4161C5685a30618G3219J765K54595a83892A34413A869M39255
$$ 311555 286046 370207 35685 -130618 73219 74984 329579 -183892 134413 1869 441124
14995D41124k11273j03258M1618h225B23825j08955L25089A70260F5513R8860
$$ 441124 229851 126593 168211 -8225 223825 114870 439959 170260 65513 164373
14985A64373n6844L2574d1110p7841a4272C09828k1295b5088D48674A09018K61659
$$ 164373 107529 140103 -41110 -118951 -14272 309828 288533 -25088 448674 109018 370677
14974C70677J12824j75438I7259K01530b10697C38348q4816a05599C29881K3921
$$ 370677 483501 308063 97259 298789 -210697 338348 253532 -105599 329881 353802
14964C53802l3491j12259K29858j52156b07304A51748f5409B63068j17995J0955
$$ 353802 320311 208052 437910 285754 -207304 151748 -65409 263068 145073 156028
14954A56028i7452j5689B10937Q1519P3862A72929K9737J39620A51660J30464
$$ 156028 -97452 -113141 210937 292456 366318 172929 202666 342286 151660 282124
14944B82124J93282I0096J6350L75396o4731j61271O1670b9917r536E41467B36133
$$ 282124 475406 90096 106446 481842 417111 255840 317510 -29917 -39453 541467 236133
14932B41492K72525A88665R1116L4716l3748n5949J47502A75590J07415i537F2014
$$ 241492 514017 188665 279781 314497 280749 224800 372302 175590 283005 -9537 62014
14920B31828K04450L7512B07467M3610J92111B04135I7010J027K25824J62117
$$ 231828 436278 473790 207467 251077 443188 204135 97010 98037 323861 485978
14910D85978A01089K64442j61152K0572M6173J04941J73255G7440J76810K24252
$$ 485978 101089 365531 204379 224951 271124 376065 549320 77440 254250 478502
14900D78502k22092k8603B2471L79940A36031L01112A65685J4712R1913r4347
$$ 478502 256410 227807 22471 402411 136031 437143 165685 180397 272310 177963
14890A77963J03837A08182L34671j92702K04271q9264R4994k4430N5210J34480
$$ 177963 281800 108182 442853 250151 454422 365158 460152 435722 490932 625412
14880F25412B63015i2828A55575N106J51720j51186L19107B01999L969K8273l4896
$$ 625412 263015 -92828 155575 160681 312401 161215 480322 201999 205968 234241 199345
14869A99345J07193A07787N48257B74544J68752B5879K84046j04825L07856j82328
$$ 199345 306538 107787 656044 274544 443296 25879 309925 205100 512956 330628
14859C30628J34628K48931e7949E39857k13853L67302A10054L80662k9375A06508
$$ 330628 465256 714187 -57949 539857 326004 693306 110054 490716 461341 106508
14848C98090j30467q3144B2552J32867J18753L98151j17741B16474M06058j97496
$$ 398090 267623 184479 22552 155419 274172 672323 554582 216474 622532 425036
14838D25036J53586j1165r7671k19388K51224j73169P4711F3393L63437J88429
$$ 425036 578622 567457 469786 250398 501622 328453 403164 63393 426830 615259
14828F15259B59810m0516J89687j13866J6888n8459K09366o6653J65226K25801
$$ 615259 259810 219294 408981 295115 312003 253544 462910 396257 561483 787284
14818G87284C03448M16581j67494p9724J8591j83047K16448l3140m5351o854Q4837
$$ 787284 303448 720029 552535 472811 491402 308355 524803 491663 446312 439458 524295
14807E24295j49742K78106C00499J90919l8584n8059A16743L37324N9840p1464
$$ 524295 374553 652659 300499 491418 452834 394775 116743 454067 513907 442443
14797D42443Q373P7607o245n7895m773r3972q6693N8256P0465M8349j01990J7065
$$ 442443 450816 528423 522178 464283 459510 365538 278845 337101 407566 455915 353925 370990
14785C70990j2873Q322K88241J29817C48665K03899B16626L06401K4665O2608
$$ 370990 358117 366439 654680 784497 348665 552564 216626 523027 547692 610300
14775F10300k85837L03312j17777J46355j8883O0822j20620j6477q6768K89507
$$ 610300 324463 627775 509998 656353 637470 698292 577672 561195 474427 763934
14765G63934l5512J25989j66926j38339K836R5829J3093j21097B44379K0389M00850
$$ 763934 728422 854411 687485 549146 551982 647811 660904 539807 244379 264768 665618
14754F65618M977k23799J82508K012k45590K59717K5475K7126j3355M9324l02621
$$ 665618 670595 446796 629304 631316 385726 645443 670918 698044 684689 734013 431392
14743D31392L77481j77047J53324m0024o8810k5M02889n18607O5510j85934K19807
$$ 431392 808873 631826 785150 745126 676316 676291 1079180 560573 626083 440149 659956
14732F59956j62750J41775m6282K51263j06456q9058j85270L04075j01831o5161
$$ 659956 497206 638981 592699 843962 737506 648448 463178 767253 665422 600261
14722F00261K0995K5756o5751L28889l62366l2143L45570N1793l1618j65047k40021
$$ 600261 621256 647012 581261 910150 547784 515641 861211 913004 881386 716339 476318
14711D76318L35628J929K9492k29752k1798M7777M83973j32771p6679p8834k27360
$$ 476318 811946 813875 843367 613615 591817 639594 1123567 990796 914117 835283 607923
14700F07923N02931n30534B88954Q68093D55892n9620K38521l8313J65284k33868
$$ 607923 1110854 580320 288954 1157047 455892 396272 634793 596480 761764 527896
14690E27896K51831k95624J80789J1572L14547k81040R6710p8831k35299L10080
$$ 527896 779727 484103 664892 676464 991011 709971 806681 727850 492551 802631
14680H02631J22574j29109r0532k8671j2776K01233J58375l97334K74156l80015
$$ 802631 925205 796096 705564 676893 664117 865350 1023725 626391 900547 520532
14670E20532L01102J93834j28825m13877O15218J55270l07757K44771Q860j15196
$$ 520532 821634 1015468 886643 472766 1087984 1243254 935497 1180268 1189128 1073932
14660A073932k05956l24687L46238J22646P6421k79222K69772K5532k13472K16651
$$ 1073932 867976 543289 889527 1012173 1088594 809372 1079144 1104676 891204 1107855
14650A107855l81371K58154p1398N9739N2295J90815m42957M19151o6936k01256
$$ 1107855 726484 984638 913240 972979 1025274 1216089 773132 1192283 1125347 924091
14640I24091l5669K04265J65420l06817P8382M28877k66537l66713L35042J54287
$$ 924091 888422 1092687 1258107 951290 1029672 1458549 1192012 825299 1160341 1314628
14630A314628r2886K9988j04587K55438j16471m0700j93890j34580Q18525k77940
$$ 1314628 1221742 1251730 1147143 1402581 1286110 1245410 1051520 916940 1735465 1457525
14620A457525k36758K22852k73868K02607K3673q8119n3609n4630O0832J08267
$$ 1457525 1220767 1443619 1169751 1372358 1396031 1307912 1254303 1199673 1260505 1368772
14610A368772K61497p5461j54946L44237j87365k33284J52478K14032q2839j41889
$$ 1368772 1630269 1554808 1399862 1744099 1556734 1323450 1475928 1689960 1607121 1465232
14600A465232N2520k6382R7881j46823K46207k97955J01263J86352q2016k64104
$$ 1465232 1517752 1491370 1589251 1442428 1688635 1390680 1491943 1678295 1596279 1332175
14590A332175L05257K01188J33606r02160O28332j4811K6703M0582K87716l67762
$$ 1332175 1637432 1838620 1972226 1070066 1698398 1683587 1710290 1750872 2038588 1670826
14580A670826L89371m13970K75399K3763M8982m30497J23603l3795M88504j01647
$$ 1670826 2060197 1646227 1921626 1945389 1994371 1563874 1687477 1653682 2142186 2040539
14570B040539J12568K2034j62496P8369r0004j44316M05488J18604j77028J50582
$$ 2040539 2153107 2175141 2012645 2091014 2001010 1856694 2262182 2380786 2203758 2354340
14560B354340J72732n03258M69285L28276r6342j09432N86844l7882O26543L61460
$$ 2354340 2527072 2023814 2493099 2821375 2725033 2615601 3202445 3164563 3791106 4152566
14550D152566J036234J454630L753418Q126326J9429927J1415374B0844815I497363
$$ 4152566 5188800 6643430 10396848 18523174 37953101 49368475 20844815 9497363
14541H807119m338052j911116m89236k21322J89857j59061k38504O6076K68654
$$ 8807119 4469067 2557951 2068715 1847393 2037250 1878189 1639685 1705761 1974415
14532A974415k23503L04645N637j38868o8064L47619j1915K84595n04546K77232
$$ 1974415 1750912 2055557 2061194 1922326 1854262 2201881 2189966 2474561 1970015 2247247
14522B247247J49248j92018J52247K56248n36002N39481K63433n36348p4185K59400
$$ 2247247 2396495 2204477 2356724 2612972 2076970 2616451 2879884 2343536 2269351 2528751
14512B528751K7570L6376l42789L75980J34725k4250m9663k22881K95558j38208
$$ 2528751 2556321 2592697 2249908 2625888 2760613 2736363 2686700 2463819 2759377 2621169
14502B621169K15491q8650M6442K08932k87838L41127j24206L55813j37287k9901
$$ 2621169 2836660 2748010 2794452 3003384 2715546 3056673 2932467 3288280 3150993 3121092
14492C121092J2058J08514p3408K92314j58989j86909L41096j45736j37930L58533
$$ 3121092 3133150 3241664 3168256 3460570 3301581 3114672 3455768 3310032 3172102 3530635
14482C530635l9712K03883l07735p2529M19475J7091j95130L11186L5804P5498
$$ 3530635 3490923 3694806 3387071 3314542 3734017 3751108 3555978 3867164 3902968 3978466
14472C978466K65585m97359L09290j39767L00191k52552L16552k37205K52798
$$ 3978466 4244051 3746692 4055982 3916215 4216406 3963854 4280406 4043201 4295999
14463D295999J17361m89449M16094P8437J30957k51910N19252o8064J97387l5095
$$ 4295999 4413360 3923911 4340005 4418442 4549399 4297489 4816741 4748677 4946064 4910969
14453D910969n6197j82855L00095J4648k69387N37434l51389O73467l69059j33118
$$ 4910969 4854772 4671917 4972012 4986660 4717273 5254707 4903318 5576785 5207726 5074608
14443E074608L30730J06228K15474k49058J60828J27208K8668K62397l8267Q7298
$$ 5074608 5405338 5511566 5727040 5477982 5638810 5766018 5794686 6057083 6018816 6106114
14433F106114l593J83767k71492M58525J42723J29563k02196M27059j74143J38955
$$ 6106114 6102521 6286288 6014796 6473321 6616044 6745607 6543411 6970470 6796327 6935282
14423F935282j48245j8832N33819P2961j59740J23250K48890L17781K72369l15717
$$ 6935282 6787037 6768205 7302024 7374985 7215245 7338495 7587385 7905166 8177535 7861818
14413G861818L42894J09762l15206N40722j65575L59395J0099J00203M61635j26682
$$ 7861818 8204712 8314474 7999268 8539990 8374415 8733810 8743909 8844112 9305747 9179065
14403I179065N8983M53713l30886O14710j78599N35539q1354J87273j9328L97808
$$ 9179065 9238048 9691761 9360875 9975585 9796986 10332525 10251171 10438444 10419116 10816924
14393A0816924J21376M08163L61521K75276l10191O03785l5019m1272L26873K36924
$$ 10816924 10938300 11346463 11707984 11983260 11673069 12276854 12241835 12200563 12527436 12764360
14383A2764360Q1406L21540L44392M25638K53564j17882N71457J23053M10948
$$ 12764360 12845766 13167306 13511698 13937336 14190900 14073018 14644475 14767528 15178476
14374A5178476K8810K66780N99261K13097L12537M73658M77626Q2725L86268K49485
$$ 15178476 15207286 15474066 16073327 16286424 16598961 17072619 17550245 17632970 18019238 18268723
14364A8268723P47038O09588J42822L14062K95084L77233N49881P87094M29845
$$ 18268723 19015761 19625349 19768171 20082233 20377317 20754550 21304431 22091525 22521370
14355B2521370N91546L15907P08945P6648J362339k464Q59636N80484N74006O80066
$$ 22521370 23112916 23428823 24137768 24214416 25576755 25574291 26433927 27014411 27588417 28268483
14345B8268483J006261M75422J101420P68443P46029R60696J003228R71619R55581
$$ 28268483 29274744 29750166 30851586 31620029 32366058 33326754 34329982 35301601 36257182
14336C6257182P61620J444508R94250J128491J170651J348071J231122J797802
$$ 36257182 37018802 38463310 39457560 40586051 41756702 43104773 44335895 46133697
14328D6133697J269871J546238J628300J653847J518394K023697J978724K514319
$$ 46133697 47403568 48949806 50578106 52231953 53750347 55774044 57752768 60267087
14320F0267087J735395K363257K225781K085007K999333L034655K687731K976551
$$ 60267087 62002482 64365739 66591520 68676527 71675860 74710515 77398246 80374797
14312H0374797L298886L592173L866913L623279M465482M360910M450025M987632
$$ 80374797 83673683 87265856 91132769 94756048 99221530 103582440 108032465 113020097
14304A13020097M950777N652348N715666O079463O945456O946619P942491P870867
$$ 113020097 117970874 123623222 129338888 135418351 142363807 149310426 157252917 165123784
14296A65123784Q476101R079138R432644J0369393J1028952J1231346J2160936
$$ 165123784 173599885 182679023 192111667 202481060 213510012 224741358 236902294
14289B36902294J2571230J3487348J4071108J4544898J5316950J5610808J6354519
$$ 236902294 249473524 262960872 277031980 291576878 306893828 322504636 338859155
14282C38859155J5751437J6423607J6004675J6055788J4992281J3926951J2796307
$$ 338859155 354610592 371034199 387038874 403094662 418086943 432013894 444810201
14275D44810201J1018906Q950880N495583K081403K3045j708584j730727j716681
$$ 444810201 455829107 464779987 470275570 472356973 472380018 470671434 468940707 467224026
14267D67224026o045099q553349j0718861j2718817j4233247j5192637j6069517
$$ 467224026 461178927 452625578 441906717 429187900 414954653 399762016 383692499
14260C83692499j6733155j6325268j6557006j6116217j5605674j5526205j4916398
$$ 383692499 366959344 350634076 334077070 317960853 302355179 286828974 271912576
14253B71912576j3262336j1819100j3095034j2166487j1420111j0722269j0290799
$$ 271912576 258650240 246831140 233736106 221569619 210149508 199427239 189136440
14246A89136440r141549r165690p898676p949657p708736p202695o117513o379561
$$ 189136440 179994891 170829201 162930525 154980868 147272132 140069437 133951924 127572363
14238A27572363n618177n172015n213206n009953m877459m260638l809535l175285
$$ 127572363 121954186 116782171 111568965 106559012 101681553 97420915 93611380 90436095
14230I0436095l597164l990157k823428l310798l248157k558046k515882k469512
$$ 90436095 86838931 82848774 80025346 76714548 73466391 70908345 68392463 65922951
14222F5922951k614685j957688j982908k116371j932352k059846j868715j749871
$$ 65922951 63308266 61350578 59367670 57251299 55318947 53259101 51390386 49640515
14214D9640515q11346j853806j160291j477781j339071j717521q52055n96316
$$ 49640515 48829169 46975363 45815072 44337291 42998220 41280699 40428644 39832328
14206C9832328p42617j883928q73727j057859r29347r01626p39364r97981r34218
$$ 39832328 39089711 37205783 36332056 35274197 34344850 33443224 32703860 31705879 30771661
14197C0771661n27456j254176j36943r88221m35394o79509r77618p12695m08671
$$ 30771661 30244205 28990029 28853086 27864865 27429471 26749962 25772344 25059649 24650978
14188B4650978o92710p06966L6467l59022q07251l27570q78990l81109l0598j140345
$$ 24650978 23958268 23251302 23287769 22928747 22121496 21793926 20914936 20533827 20503229 19362884
14178A9362884L78722q76348n00768j81088k70980n67241l07566n01514k27210
$$ 19362884 19741606 18865258 18364490 18183402 17912422 17345181 17037615 16536101 16308891
14169A6308891k43505k61138o27205j46593m62399k10567j25990k11174L1241
$$ 16308891 16065386 15804248 15177043 15030450 14568051 14357484 14231494 14020320 14051561
14160A4051561o15254j95617j15672j5723m95286R7435m92586p6205k15059k42085
$$ 14051561 13436307 13240690 13125018 13109295 12614009 12711444 12218858 12142653 11927594 11685509
14150A1685509k55685l80150k60230J76895k11846k38753m07160J9472O1642J38072
$$ 11685509 11429824 11049674 10789444 10966339 10754493 10515740 10108580 10128052 10189694 10327766
14140A0327766n89671J37018k00270n2119l73752l74423J25041p2007m9862m3188
$$ 10327766 9738095 9875113 9674843 9622724 9248972 8874549 8999590 8927583 8877721 8834533
14130H834533l5817n55110K26081l29788q3923k02365N1821j39825J03103j29531
$$ 8834533 8798716 8243606 8469687 8139899 8055976 7853611 7905432 7765607 7868710 7739179
14120G739179l33299l4994l1245o3649m14443r3509m787k17172J87174k0177k98368
$$ 7739179 7405880 7370886 7339641 7275992 6861549 6768040 6763253 6546081 6733255 6713078 6414710
14109F414710q2170L0717J645j15766l30409k9076N5786J87197p22686M37184
$$ 6414710 6332540 6363257 6364902 6249136 5918727 5889651 5945437 6132634 5409948 5847132
14099E847132m3447j30439K68049k58793k86982N2675k09354m3132M28072m07649
$$ 5847132 5803685 5673246 5941295 5682502 5395520 5448195 5238841 5195709 5623781 5216132
14089E216132j78499L6471J6574j30729j6334j14756j81021L0886k16169k70499
$$ 5216132 5037633 5074104 5090678 4959949 4943615 4828859 4647838 4678724 4462555 4192056
14079D192056N41037k52853j38115m8091K65809j12957k61055K36323n24468Q00866
$$ 4192056 4733093 4480240 4342125 4294034 4559843 4446886 4185831 4422154 3897686 4698552
14069D698552j112618O08343j55771J71416m98115J31892k0678L61832l44269
$$ 4698552 3585934 4194277 4038506 4209922 3711807 3843699 3823021 4184853 3840584
14060C840584J3824m4219J19790l78604j01980j30636N49543n1594n24861L85867
$$ 3840584 3854408 3810189 3929979 3551375 3449395 3318759 3868302 3816708 3291847 3677714
14050C677714j44307J81969j68948j90583j32916j14947l87L02610l17481J67103
$$ 3677714 3533407 3715376 3546428 3355845 3222929 3107982 3107595 3410205 3092724 3259827
14040C259827k78730K12763k13086K36513k00594j81149J25847j43166K59340
$$ 3259827 2981097 3193860 2980774 3217287 3016693 2835544 2961391 2818225 3077565
14031C077565k70627L36760k69461J7386P6622l23270k63147O9372K24045k6002
$$ 3077565 2806938 3143698 2874237 2891623 2968245 2644975 2381828 2451200 2675245 2649243
14021B649243j43335J81329L6636j10791j63291q8218L05836j69562j43968K31918
$$ 2649243 2505908 2687237 2723873 2613082 2449791 2361573 2667409 2497847 2353879 2585797
14011B585797k42286J1647m49065N17359o46760M71304l2486q116k00583N09566
$$ 2585797 2343511 2355158 1906093 2423452 1776692 2247996 2215510 2207394 2006811 2516377
14001B516377r84659L06444j08632L23861K63562n16422L54198K28922m16039
$$ 2516377 1531718 1838162 1729530 2053391 2316953 1800531 2154729 2383651 1967612
13992A967612k07469N20371l90538J427283K096407O299489J8456270K0109556
$$ 1967612 1760143 2280514 1889976 3317259 5413666 11713155 30169425 50278981
13984E0278981k3180148A2680388n099446k099858q74042o97140q56655n371q238
$$ 50278981 27098833 12680388 7580942 5481084 4607042 3909902 3053247 3047876 3039638
13975C039638k20694M9270p18k93142l69619K53116l14397M37240k59318J89025
$$ 3039638 2818944 2868214 2867496 2574354 2204735 2457851 2143454 2580694 2321376 2510401
13965B510401j95447J50320l70794K33498l3275n1433l20108r9811N10163n41924
$$ 2510401 2314954 2465274 2094480 2327978 2294703 2243270 1923162 1823351 2333514 1791590
13955A791590K53744K43821m29457L47089j25444O954k95116J85064j15951k87957
$$ 1791590 2045334 2289155 1859698 2206787 2081343 2088297 1793181 1978245 1862294 1574337
13945A574337J59499J80225n50043L42925P7225j96583J86227l31814J27367J00476
$$ 1574337 1733836 1914061 1364018 1706943 1784168 1587585 1773812 1441998 1569365 1669841
13935A669841M5522r0473k00126L64526j43079l02784J56253M7087L9026j2845
$$ 1669841 1715363 1624890 1424764 1789290 1646211 1343427 1499680 1546767 1585793 1572948
13925A572948P3598O2511k69144K35050l64406P0809K40280j40202l7414k83484
$$ 1572948 1646546 1709057 1439913 1674963 1310557 1381366 1621646 1481444 1444030 1160546
13915A160546j9946O0471N6641R5877N7694J62938l20040P9151K8260L25409k54997
$$ 1160546 1140600 1201071 1257712 1353589 1411283 1574221 1254181 1333332 1361592 1687001 1432004
13904A432004l57865J53794P8040J8171J48352j57680o2157J5262j54975K24933
$$ 1432004 1074139 1227933 1305973 1324144 1472496 1314816 1252659 1267921 1112946 1337879
13894A337879J85947p748j6819j02949l49429J46159l3449l066K32016K26497
$$ 1337879 1523826 1516078 1499259 1396310 1046881 1193040 1159591 1156525 1388541 1615038
13884A615038o20982J28787J44250N7416l11756K97058m28977M04111q6970k31755
$$ 1615038 994056 1122843 1267093 1324509 1012753 1309811 880834 1284945 1197975 966220
13874I66220n3973J71933k08834L81370p4788k53458J85426j26807J09640N3429
$$ 966220 912247 1084180 875346 1256716 1181928 928470 1113896 987089 1096729 1150158
13864A150158n7840J26565k56663J4716o5310K32562J38551K3765k22755j05465
$$ 1150158 1092318 1218883 962220 976936 911626 1144188 1282739 1306504 1083749 978284
13854I78284Q2592o7753j92489k6808K80464j71998K57347q363k31933J11754
$$ 978284 1060876 993123 800634 773826 1054290 882292 1139639 1131276 899343 1011097
13844A011097k15497K38947j90556J12122O9068o9359j39360M84211k14687j63315
$$ 1011097 795600 1034547 843991 956113 1025181 955822 816462 1300673 1085986 922671
13834I22671j29416J49399J6695j284r5803J19765l2700j71847J1932K18507j16644
$$ 922671 793255 942654 959349 958065 862262 982027 949327 777480 789412 1007919 891275
13823H91275M745j55706l5899N29267n48433K12275j91729N27111l99786L18649
$$ 891275 896020 740314 704415 1233682 685249 897524 705795 1232906 833120 1151769
13813A151769l85387o1713J57115L6505n5162L40576m3172p5468B56492N84305
$$ 1151769 766382 704669 861784 898289 843127 1183703 1140531 1065063 256492 840797
13803H40797j18653L63176k16992j28549K40196l96746J30733J92759j03855j95474
$$ 840797 722144 1085320 868328 739779 979975 583229 713962 906721 802866 607392
13793F07392L3402M9995j00736K84135J46508l34316K11920k97667J15791R6387
$$ 607392 640794 690789 590053 874188 1020696 686380 898300 600633 716424 812811
13783H12811p3245q0063M2865Q5410j89904j10540K36844R3602l73787j625K61381
$$ 812811 739566 659503 702368 787778 597874 487334 724178 817780 443993 442368 703749
13772G03749k03267L97161l03691J38668l59814K72778K75986K6882l89687J72534
$$ 703749 500482 897643 593952 732620 372806 645584 921570 948452 558765 731299
13762G31299J88816l54526J25073J27789j8492j31454L3525L83923D51868j45116
$$ 731299 920115 565589 690662 818451 799959 668505 702030 1085953 451868 306752
13752C06752L03223J29907k30313N01532k73774k61120K23798k78298M636M74475
$$ 306752 609975 739882 509569 1011101 737327 476207 700005 421707 426343 900818
13742I00818l81066K29487k18533K68103l15511J39000B35638K99451L1445n8652
$$ 900818 519752 749239 530706 798809 483298 622298 235638 535089 566534 507882
13732E07882N957j58628L44148r6194k3708k22948j53364K30102J01298j4358
$$ 507882 513839 355211 699359 603165 579457 356509 203145 433247 534545 520187
13722E20187L29482j57608l30048J53738j3307P4954m0823J87907J91559D45930
$$ 520187 849669 692061 362013 515751 502444 577398 536575 724482 916041 445930
13711C17325L21076j71313Q0782K16580l39644r8424K72023j76255q6234M6466
$$ 317325 638401 467088 547870 764450 424806 326382 598405 422150 335916 382382
13701C82382l0247L49156k06412N43487D10039P3774j124N631L3310L48251D00351
$$ 382382 352135 701291 494879 1038366 410039 483813 482689 488320 521630 869881 400351
13689E52328j00777j0772K54542J17587l68539K10247j93379Q8561l856o9301
$$ 552328 451551 440779 695321 812908 444369 654616 461237 549798 545942 476641
13679D76641L40647C00419k6399K41317J01725o6290p9080J99704C27921p978
$$ 476641 817288 300419 274020 515337 617062 550772 471692 671396 327921 319943
13669C19943A03443L0452K63379q8259K1912P7891D5104M54006P0230B75321l3775
$$ 319943 103443 133895 397274 309015 330927 408818 45104 499110 569340 275321 241546
13658B41546R0426N51110k69598M3965j040n8385B23319j8209N19531j76328j25941
$$ 241546 331972 883082 613484 657449 656409 598024 223319 205110 724641 548313 422372
13647D22372M9479j38607J48480r5478J69781J96345k18255j34822m9922K25214
$$ 422372 471851 333244 481724 386246 556027 752372 534117 399295 349373 574587
13637E74587F429L36277J95366B23002J18084R3926b617F29663l01318m1577K5776
$$ 574587 6429 342706 538072 223002 341086 435012 -2617 629663 328345 286768 312544
13626C12544j26738J67857L610j34707L82326k35147M4068A51992K25088Q924
$$ 312544 185806 353663 357273 222566 604892 369745 413813 151992 377080 386004
13616C86004M5595L8967J1147j79168J00047Q5795q2341j27659n5627J27960K72918
$$ 386004 431599 470566 481713 302545 402592 488387 406046 278387 222760 350720 623638
13605F23638k84423j34679L63419B46747H0116J06811K13225A44089J25894J76553
$$ 623638 339215 204536 567955 246747 80116 186927 400152 144089 269983 446536
13595D46536A12085L21996A12684C1259J67582j1288N9977K80674r9953P4937
$$ 446536 112085 434081 112684 31259 198841 187553 247530 528204 428251 503188
13585E03188j95116K75817k40479o5703n2230P9546Q3156J61521j68725q9708
$$ 503188 308072 583889 343410 277707 225477 305023 388179 549700 380975 291267
13575B91267J87649J06703B50423L28318j46485A53812J79526A11914J36468M06046
$$ 291267 478916 585619 250423 578741 432256 153812 333338 111914 248382 654428
13565F54428B54735J69082B03583O9361K48026k35190I1169K97736H380N22698
$$ 654428 254735 423817 203583 272944 520970 285780 91169 388905 8380 531078
13555E31078k14558M8702A49817L65046B41455D884M5312J21819n2556K58851
$$ 531078 316520 365222 149817 514863 241455 4884 50196 172015 119459 378310
13545C78310N3398k11621J88310A46832J75849J73878R8363A72627J3796K95052
$$ 378310 431708 220087 408397 146832 322681 496559 594922 172627 186423 481475
13535D81475f1406B92264q5017K21037J62112C7870O2092J53847K5312D7996J35756
$$ 481475 -61406 292264 207247 428284 590396 37870 99962 253809 279121 47996 183752
13524A83752K66654j7882k00597j9729C5696J37537L18458b4971E62258k15126
$$ 183752 450406 432524 231927 212198 35696 173233 491691 -24971 562258 347132
13514C47132D166K30043o9730M54501k70224A71882P2968K71890B06950N40315
$$ 347132 4166 234209 164479 618980 348756 171882 244850 516740 206950 747265
13504G47265k84186j47324o5202r6666D3062L41797A17589n3663K71757o961N516
$$ 747265 463079 315755 250553 153887 43062 384859 117589 63926 335683 328722 334238
13493C34238J78552B20900q7394J77418d99073C00037L7439J46487A76946j076
$$ 334238 512790 220900 133506 310924 -499073 300037 337476 483963 176946 175870
13483A75870K76348B22021k6555P3326J57511j04470j53943N02850A82149P0078
$$ 175870 452218 222021 195466 268792 426303 321833 167890 670740 182149 252227
13473B52227Q8699K04112B55153J20248j60762M60292k98719H2043B9520J17157
$$ 252227 340926 545038 255153 375401 214639 674931 376212 82043 29520 146677
13463A46677a0038B43509K33350A21725J62019p4964j111q8992R7491K14363j71631
$$ 146677 -10038 243509 476859 121725 283744 208780 207669 118677 216168 430531 258900
13452B58900j03010K29258j67183D0890J33783m6333K99795F7190j6578K98521
$$ 258900 155890 385148 217965 40890 174673 128340 428135 67190 50612 349133
13442C49133M12289k58756B26439J75195K7826A28220J16021L788A18135J19755
$$ 349133 761422 502666 226439 401634 429460 128220 244241 248029 118135 237890
13432B37890H9665L72301A54642P231K75422E8946b5104C9827Q7513c0032I044
$$ 237890 89665 461966 154642 161873 437295 58946 -25104 39827 127340 -30032 9044
13420a3968B11277k3424c8897E92735G6406R8120H2855A759Q0266K23501N4864
$$ -13968 211277 187853 -38897 592735 76406 174526 82855 1759 82025 305526 360390
13409C60390d9892B2696L09140j19411J67609j21236L5878p3816j91j04722Q1703
$$ 360390 -49892 22696 331836 212425 380034 258798 294676 220860 220669 115947 197650
13398A97650K01938j90110J78485A31562g3354B83053q2263Q0013J2542l4339
$$ 197650 399588 209478 387963 131562 -73354 283053 200790 280803 293345 259006
13388B59006P3426j55411J29551j19857L06329A12206J21749o6190N8874a45281
$$ 259006 332432 177021 306572 186715 493044 112206 233955 167765 226639 -145281
13377A08348f9389C65081j24785m3555O1508K36915D5104R0853E3156K00948E26
$$ 108348 -69389 365081 240296 196741 258249 495164 45104 135957 53156 254104 526
13365A56828N1883K8604b16048C74838A43174O4556L7989D0476K27155e5958A26099
$$ 156828 208711 237315 -216048 374838 143174 207730 245719 40476 267631 -55958 126099
13353D2164J92883L8195b5613B9428N1646C3357g1117C60188k6916L14775l19195
$$ 42164 235047 273242 -25613 29428 81074 33357 -71117 360188 333272 648047 328852
13342C28852A57837E7389J67849K09153K24124C10747A35244R0851A10506K49926
$$ 328852 157837 57389 225238 434391 658515 310747 135244 226095 110506 360432
13332C60432A14808Q3282K41834l0200j06829E9916B5370M07141B00531K54576
$$ 360432 114808 198090 439924 409724 302895 59916 25370 432511 200531 455107
13322D55107l3021N8426H3276j3657L6444L0833J76930k4392J31723A62774n6587
$$ 455107 422086 480512 83276 69619 106063 136896 313826 289434 421157 162774 106187
13311A06187L91350k20881r5572a25290D17392D0107M8378J19022f7274A26020
$$ 106187 497537 276656 181084 -125290 417392 40107 88485 207507 -67274 126020
13300A16994B0844P6790D1864K3316L7831H330L00146Q9557G9907L66567D1685
$$ 116994 20844 97634 41864 65180 103011 8330 308476 398033 79907 446474 41685
13288e9961A90231J11276B5093J14874J41622O526l083A38310L69888A11649l1830
$$ -59961 190231 301507 25093 139967 281589 288115 285032 138310 508198 111649 79819
13277G9819c0591B73687d279D37269p8107A44063p981L11179j96184P0237e7459
$$ 79819 -30591 273687 -4279 437269 359162 144063 136082 447261 251077 321314 -57459
13265A97409L14392A17617R7800E1365n560A6343P5651B6789N9653a2289F1375
$$ 197409 511801 117617 215417 51365 45805 16343 91994 26789 86442 -12289 61375
13253D48538b55629A43666K268F9620Q0520p1152B5901J6884J64646F1005K37588
$$ 448538 -255629 143666 145934 69620 150140 78988 25901 42785 207431 61005 298593
13242B98593j24641c32320G6930K29388i9453A26420N0334l8290b39402B5809
$$ 298593 173952 -332320 76930 306318 -99453 126420 176754 138464 -239402 25809
13231e2172D16244I7146c16579C2262a71720g5831M651B13350c0164j50925b8516
$$ -52172 416244 97146 -316579 32262 -171720 -75831 -71180 213350 -30164 -181089 -28516
13219a59576B73383j19667e5600B30032a32631c2021I5824P0104j1498C9880J96052
$$ -159576 273383 153716 -55600 230032 -132631 -32021 95824 165928 154430 39880 235932
13208B35932a20342A6013K74740m9664K28782k03124E1163M15063A93874O8551
$$ 235932 -120342 16013 290753 241089 469871 266747 51163 466226 193874 262425
13198B62425a9758p1169r3136a4905D14637A66492b00046A34443k5195J19813
$$ 262425 -19758 -90927 -184063 -14905 414637 166492 -200046 134443 109248 229061
13188B29061o7231J34282c1853A64355J42223J75785r5470A13667k3535b7686
$$ 229061 161830 296112 -31853 164355 306578 482363 386893 113667 90132 -27686
13177A20629J98323N7423l5674a64765b3423B04313g3363A5096c5858C5110K72460
$$ 120629 318952 376375 340701 -164765 -23423 204313 -73363 15096 -35858 35110 307570
13166C07570D0365e3304B87195a0655m4688m1711l1644l212l1948C14088d0477
$$ 307570 40365 -53304 287195 -10655 -55343 -97054 -128698 -131910 -163858 314088 -40477
13154A95982r5700l8633J36202g0966D0470a86748A01625c4867A99149r3038a07524
$$ 195982 100282 61649 197851 -70966 40470 -186748 101625 -34867 199149 106111 -107524
13142A5928N9302c8479C54861d143k4111C6082f4026A5885c39549C85214A03565
$$ 15928 75230 -38479 354861 -4143 -28254 36082 -64026 15885 -339549 385214 103565
13130H4903l9692J01961j5948c3754H6440j5219L0437b8173A53373m2577h397
$$ 84903 45211 147172 131224 -33754 86440 71221 101658 -28173 153373 110796 -8397
13118d248l64966B8413A434A10J83319c5772C8995f7675a6519D18448a8870C59059
$$ -4248 -369214 28413 1434 110 183429 -35772 38995 -67675 -16519 418448 -18870 359059
13105B47222H4427J11898n6831R3296D7108J37527N2918L967a88076A88015M8466
$$ 247222 84427 196325 139494 232790 47108 184635 237553 241520 -188076 188015 236481
13094B36481j08985K10771j60303M60625i7829q4555E9057J69889J25791j05908
$$ 236481 127496 338267 177964 638589 -97829 -182384 59057 228946 354737 248829
13084B48829k0319r4499J94261A26846J95273a43194M6810C41794B0622O6003
$$ 248829 228510 134011 328272 126846 322119 -143194 -96384 341794 20622 86625
13074H6625l7361j234N0334k5867k8126J14337C4936J07864n4848l9890b9742
$$ 86625 49264 48030 98364 72497 44371 158708 34936 142800 87952 48062 -29742
13062A62259J24598m5846E7764h795L431A30937b15067B6807L9124I348L40064
$$ 162259 286857 241011 57764 -8795 -5364 130937 -215067 26807 65931 9348 349412
13051C49412l2596j36332k3676J34359L3355D2441K6073J62972q6360J94173e9449
$$ 349412 316816 180484 156808 291167 324522 42441 68514 231486 145126 339299 -59449
13039b06999A00552a40024A00306m4426a41278A59392a16302e6117b1904B56172
$$ -206999 100552 -140024 100306 55880 -141278 159392 -116302 -56117 -21904 256172
13028I8704J75332a17194G4289a27025D31118i0067F7670J16848h0887K9515B45199
$$ 98704 274036 -117194 74289 -127025 431118 -90067 67670 184518 -80887 -51372 245199
13016A05659h8373G7710d4784a9043k03171A37679K28726I2580J3990K07661b1238
$$ 105659 -88373 77710 -44784 -19043 -222214 137679 366405 92580 106570 314231 -21238
13004C42990j52114M8895I2668B8988K299R4837J16342a54291a8891j38427A77123
$$ 342990 190876 239771 92668 28988 31287 126124 242466 -154291 -18891 -157318 177123
12992C63884c9327k5549J0522B648J68235i7979B60716d1550A08308C893J35066
$$ 363884 -39327 -64876 -54354 2648 170883 -97979 260716 -41550 108308 3893 138959
12981A38959i9319B9677b23602B4260f7299l74608h6869A64356K0507h3309L2583
$$ 138959 -99319 29677 -223602 24260 -67299 -441907 -86869 164356 184863 -83309 -50726
12970e0726B58787j28215L3219L1448J67804d3029G9732b31986A87223p8147K5145
$$ -50726 258787 130572 163791 195239 363043 -43029 79732 -231986 187223 109076 134221
12959A34221a88503f7372B02823p2603k806E4991P6664B7368K19686H9972a62572
$$ 134221 -188503 -67372 202823 130220 127414 54991 131655 27368 247054 89972 -162572
12947E8401P4351c3649C9942e1002j4558A56908J11817D9624A8825b54213b3769
$$ 58401 132752 -33649 39942 -51002 -65560 156908 268725 49624 18825 -254213 -23769
12935B10011A807a18988C3938b20144C11731H5924P1806d357p2624O228I3151
$$ 210011 1807 -118988 33938 -220144 311731 85924 157730 -4357 -76981 -70753 93151
12923e1650A45641h3262A77466K20627A04172K56487n4882a77927A23577k4961
$$ -51650 145641 -83262 177466 398093 104172 360659 305777 -177927 123577 98616
12913I8616a4321j78604B36283D935R6231O2886b44927J4252j8337A16728J510
$$ 98616 -14321 -192925 236283 4935 101166 164052 -244927 -230675 -249012 116728 118238
12902A18238j7370A8952G158h6007r0976A63242O5311M2119n9907c4272j86855
$$ 118238 100868 18952 7158 -86007 -176983 163242 228553 270672 210765 -34272 -221127
12891b21127r3126C3905Q6574M1812g4451J5494A36758O9927K908n3942d1418
$$ -221127 -314253 33905 120479 162291 -74451 -58957 136758 206685 209593 155651 -41418
12879A52573B1904g0780F6891E05P723J51096a59843D1310R1504K179a60551D0730
$$ 152573 21904 -70780 66891 505 8228 159324 -159843 41310 132814 134993 -160551 40730
12866a95150Q2715k53019A37377e1263o0781F5330J3675f1303B52559q8542B1502
$$ -195150 -112435 -365454 137377 -51263 -112044 65330 79005 -61303 252559 164017 21502
12854D8039J60727D088i2067b0800l4240A69668J77719e580F7040R5732a07404
$$ 48039 208766 4088 -92067 -20800 -55040 169668 347387 -5580 67040 162772 -107404
12842h9731j7564h014B12919b25952c6066B80832F6589J07557N389g1859m988
$$ -89731 -107295 -8014 212919 -225952 -36066 280832 66589 174146 179535 -71859 -76847
12831g6847q0953d1830C19021A18908J30869a58932B12415b93214h9246n3477
$$ -76847 -157800 -41830 319021 118908 249777 -158932 212415 -293214 -89246 -142723
12821a42723I0262c8065A92007j1460a28743C89870H3457a02200A71678A7265
$$ -142723 90262 -38065 192007 180547 -128743 389870 83457 -102200 171678 17265
12810D5517J03948R3251b34383e5309A77976M9824a8920p8438J6511j70870a52
$$ 45517 149465 242716 -234383 -55309 177976 227800 -18920 -97358 -80847 -251717 -152
12798B5602c4288C0760K23742q3631i391m37837I6860A6401L52198o2776p5813
$$ 25602 -34288 30760 254502 170871 -9391 -447228 96860 16401 368599 305823 230010
12787B30010F6918K19267M960D0130g1163l8580C10123o6032G265b99513a47745
$$ 230010 66918 286185 291145 40130 -71163 -109743 310123 244091 7265 -299513 -147745
12775a6166D4206K03147o3178A2188d07617h3272i304C50071a15818H6457L4829
$$ -16166 44206 247353 184175 12188 -407617 -83272 -9304 350071 -115818 86457 121286
12764A21286l888a71015D10734j12689l5765j04340a98893a6958k14457H1198
$$ 121286 117398 -171015 410734 298045 262280 157940 -198893 -16958 -231415 81198
12753B93257m4699q9914d0120B26524E9856a50608j38389B01262l2334G9870J35031
$$ 293257 248558 158644 -40120 226524 59856 -150608 -288997 201262 168928 79870 214901
12742B14901a61506A71541a2662B3700b57994B83758f954j60593A12727a16243
$$ 214901 -161506 171541 -12662 23700 -257994 283758 -6954 -167547 112727 -116243
12731I5096L1473a19421B1837d3330l8244D7573K1685A3202N1727a87064G5504
$$ 95096 126569 -119421 21837 -43330 -81574 47573 69258 13202 64929 -187064 75504
12719A0592a58396K4697c5875C63297d2726J4212j26114G6601a382q5170G348
$$ 10592 -158396 -133699 -35875 363297 -42726 -28514 -154628 76601 -1382 -86552 7348
12707B44600m2165l6301p3801k5074J59847H9641J12806C699K0405J75774a02900
$$ 244600 202435 166134 92333 67259 227106 89641 202447 3699 24104 199878 -102900
12695f6525J9487k50451H1908a50744I6747c3384G7975b67398J08315N2790D32598
$$ -66525 -47038 -297489 81908 -150744 96747 -33384 77975 -267398 -159083 -106293 432598
12683e5503d267j2858p0033q2346C9181L32369A51113F9437a0119k40797b7710
$$ -55503 -4267 -17125 -87158 -169504 39181 371550 151113 69437 -10119 -250916 -27710
12671A81828D6647J04571B0183e8357A78498m2827c0007G6837J05274L47076k20047
$$ 181828 46647 151218 20183 -58357 178498 135671 -30007 76837 182111 529187 309140
12660C09140h4596b9798D8108K20134a10442A07713P6010K25619I7605C7373B924
$$ 309140 -84596 -29798 48108 268242 -110442 107713 183723 409342 97605 37373 2924
12648e358A83778L5686Q7583E4041b34041A87994c20458c8356C73661j63854a88852
$$ -5358 183778 219464 307047 54041 -234041 187994 -320458 -38356 373661 209807 -188852
12636a90396B43860A10666J17538G198b4123j58012J1643E64595j80156A69129
$$ -190396 243860 110666 228204 7198 -24123 -182135 -170492 564595 384439 169129
12625C08461J53310A53157D7056O620J71502K90594A93129j5365J18024e6783
$$ 308461 461771 153157 47056 53676 225178 515772 193129 177764 295788 -56783
12614F0164b59949C7610L18666a05758N2474B24515h2918a0786A38395k2276D2295
$$ 60164 -259949 37610 356276 -105758 -53284 224515 -82918 -10786 138395 116119 42295
12602a2634j91459a01431A33749K04215e4297A6005J75454b07584B85385I0627
$$ -12634 -204093 -101431 133749 337964 -54297 16005 191459 -207584 285385 90627
12591a521m2107K658G9650d5394j22428j9084n0706O4435D8115f6051k5711A63036
$$ -1521 -43628 -40970 79650 -45394 -167822 -186906 -237612 -173177 48115 -66051 -91762 163036
12578a45537B10664B1184d7454A69680h406n3153M647A51629f8787k09825a10493
$$ -145537 210664 21184 -47454 169680 -8406 -61559 -56912 151629 -68787 -278612 -110493
12566C07690E748b29797A24433L08137A49267k4716N4593a05716F160J87209j2653
$$ 307690 5748 -229797 124433 432570 149267 124551 179144 -105716 6160 193369 180716
12555A80716a45235F7461b63465D37488A41337A7074a68929A23059d5944O350
$$ 180716 -145235 67461 -263465 437488 141337 17074 -168929 123059 -45944 -39594
12545c9594B76110a96263d2802B55227g7700B2038a46689n248M894g0762j55801
$$ -39594 276110 -196263 -42802 255227 -77700 22038 -146689 -151937 -147043 -70762 -226563
12534b26563A31306c9984G1662a18915A44660n7777I288a5725B74633A7737a32012
$$ -226563 131306 -39984 71662 -118915 144660 86883 9288 -15725 274633 17737 -132012
12522h3796G1210b97225C60007j55737o1758n1592a2188q5772k605C05042G0768
$$ -83796 71210 -297225 360007 204270 142512 90920 -12188 -97960 -100565 305042 70768
12510c4335j87744m1726g7696A08834K5605e1133q3724L4122B24733I541L3941
$$ -34335 -222079 -263805 -77696 108834 134439 -51133 -134857 -100735 224733 9541 43482
12499D3482c71369F329K89001G5414c46632A02075b51415a20007j17693A8432
$$ 43482 -371369 6329 295330 75414 -346632 102075 -251415 -120007 -237700 18432
12488b5377G8640k6903L2025j7837R2945h1894l162I645c585k96809c159B23825
$$ -25377 78640 51737 83762 65925 158870 -81894 -85056 9645 -3585 -300394 -3159 223825
12475a87200Q4167B36803K4727b49353A92953B0602d3623j52740a8139j29025
$$ -187200 -103033 236803 261530 -249353 192953 20602 -43623 -196363 -18139 -147164
12465a47164B45087d35489d4117A77121a38420N6469B5668K53432j17029F6488
$$ -147164 245087 -435489 -44117 177121 -138420 -81951 25668 279100 162071 66488
12454b0981j63518L6873a5538E7901k0091K6725J15142l1638K42418D1490J1778
$$ -20981 -184499 -147626 -15538 57901 37810 64535 179677 148039 390457 41490 53268
12443E3268I492J50957a40141j57971D48637a03782n2739H83P2842d7414A50715
$$ 53268 9492 160449 -140141 -298112 448637 -103782 -156521 883 73725 -47414 150715
12431b65425B75907F8337k929l0910K70282q7523D6159b22464p5614C47437d33394
$$ -265425 275907 68337 65408 34498 304780 217257 46159 -222464 -298078 347437 -433394
12419D96946f1392p6524I2796a69875j89234B34859I2400f8890G0337h7133D5719
$$ 496946 -61392 -137916 92796 -169875 -359109 234859 92400 -68890 70337 -87133 45719
12407B91062a96084A59045a51490l2446C5175b9690A28660E7124c25808c7973
$$ 291062 -196084 159045 -151490 -183936 35175 -29690 128660 57124 -325808 -37973
12396b66461r3054d6113o9156I4416Q8881C5053h0205c9314J5639m7897I0282
$$ -266461 -359515 -46113 -115269 94416 183297 35053 -80205 -39314 -23675 -71572 90282
12384a57757A43954l546b08793B00758K52297j96870j191G1589r719d7902r9412
$$ -157757 143954 140408 -208793 200758 453055 256185 254994 71589 61870 -47902 -147314
12373a47314A65238e5834e543k85211a11600B13328a62476M4935p6147e2274j04822
$$ -147314 165238 -55834 -5543 -290754 -111600 213328 -162476 -117541 -193688 -52274 -157096
12362a57096M2218n3691I9472e7966q4549G6912K09835a57206B27770e3704J343
$$ -157096 -114878 -168569 99472 -57966 -142515 76912 286747 -157206 227770 -53704 -52361
12351e2361A71726o0384a60805A96495a49188C42894H191J07191O6548L3158O560
$$ -52361 171726 111342 -160805 196495 -149188 342894 8191 115382 181930 215088 221648
12340B21648b33415j9667B37730a91953C8409b92443a27978c7707j69201A00956
$$ 221648 -233415 -253082 237730 -191953 38409 -292443 -127978 -37707 -206908 100956
12329A7244b261A86746r684e6637l15969H8756b9684E1548A0242K21047r0076
$$ 17244 -2261 186746 177062 -56637 -372606 88756 -29684 51548 10242 231289 141213
12318A41213a76031A38103C9602K20762j12066m14J42644a68363A487a57005G04
$$ 141213 -176031 138103 39602 260364 148298 147884 290528 -168363 1487 -157005 704
12306c86564B81476e1565B94226p8871d0877A20889b78586a0876k01124A15994
$$ -386564 281476 -51565 294226 215355 -40877 120889 -278586 -10876 -212000 115994
12295a82318C61987b26797B64785a28757A17065B3829R2333P0319c4318j36775
$$ -182318 361987 -226797 264785 -128757 117065 23829 116162 186481 -34318 -171093
12285a71093e3979E8776b13265h3237b8807j27106A47583c2280j30309A23208
$$ -171093 -53979 58776 -213265 -83237 -28807 -155913 147583 -32280 -162589 123208
12274A75770J946a43932H881K69180c9499D7289a43333A63609d5999J1144A04071
$$ 175770 177716 -143932 8881 278061 -39499 47289 -143333 163609 -45999 -34855 104071
12262E0657J78460F0926J81199N8027F1037a5998L880I7374a69608j6671k7316
$$ 50657 229117 60926 242125 300152 61037 -15998 -12118 97374 -169608 -186279 -213595
12251b13595C3053L23694A17616K2097a7234B83232J08412h2220j9746A77469
$$ -213595 33053 356747 117616 139713 -17234 283232 391644 -82220 -101966 177469
12240A32544b04030G0260L5043d0516A35971m4166M6935a71947Q5330j87668A68071
$$ 132544 -204030 70260 105303 -40516 135971 91805 138740 -171947 -86617 -274285 168071
12228B68877N3325A45125J15091j01252a81491B84322a45205B91881J44208A89584
$$ 268877 322202 145125 260216 158964 -181491 284322 -145205 291881 436089 189584
12217a10898B90293M5451D1126K75003E1300K9593e8806J1902q9268C9977K33039
$$ -110898 290293 335744 41126 316129 51300 80893 -58806 -46904 -136172 39977 273016
12206B73016h0184K3739j9412B95376C8647J94052q0274n0773J03773b3174j42803
$$ 273016 -80184 -56445 -75857 295376 38647 232699 152425 101652 205425 -23174 -165977
12195a65977A74734g7759I2630h8298B98980J05011H0233a25992D5493J10506
$$ -165977 174734 -77759 92630 -88298 298980 403991 80233 -125992 45493 155999
12185A55999g7765C90690j92681e1243A03729A8761a34567A26305b59949B4036
$$ 155999 -77765 390690 198009 -51243 103729 18761 -134567 126305 -259949 24036
12174B96093n2859H1933g8334A59670b2493A78679F0850R2655J04487A00239j3570
$$ 296093 243234 81933 -78334 159670 -22493 178679 60850 153505 257992 100239 86669
12163H6669A7131a23839j56597g2856I0554c6524k11285I8398m5573c28362I206
$$ 86669 17131 -123839 -280436 -72856 90554 -36524 -247809 98398 52825 -328362 9206
12151h4566F1997k4721i7656A5825G813Q6549a49920L4099A05330J3206M2469
$$ -84566 61997 37276 -97656 15825 7813 94362 -149920 -115821 105330 118536 161005
12140A61005G0928b12570D32228A93180r0148n953D4917j4944K4766e3514o2539
$$ 161005 70928 -212570 432228 193180 103032 97079 44917 29973 54739 -53514 -116053
12129a16053e5800l10783A22584B9707g44A08440a02942B07362k6395L8575J14659
$$ -116053 -55800 -366583 122584 29707 -744 108440 -102942 207362 180967 219542 334201
12118C34201e5663B41886a65082A43133l0433R0915I8714K31618i0387A84593
$$ 334201 -55663 241886 -165082 143133 112700 203615 98714 330332 -90387 184593
12107a58359a2578H4594L11700r9118B6667a98102A8217a22669B00134H1835a74956
$$ -158359 -12578 84594 396294 297176 26667 -198102 18217 -122669 200134 81835 -174956
12095B0255a27808A85343D1456b26843h3o2826k06420A98093i4325H1209a06980
$$ 20255 -127808 185343 41456 -226843 -83 -62909 -269329 198093 -94325 81209 -106980
12083c06475a32747A55201B7205d6355G8645A3599d985r7982o8989D8180b8285
$$ -306475 -132747 155201 27205 -46355 78645 13599 -4985 -102967 -171956 48180 -28285
12071A36636b54613a10787D3503J05048O0956D8127J58773J003108K15352C54278
$$ 136636 -254613 -110787 43503 148551 209507 48127 206900 1210008 1425360 354278
12060A49689b09635C83566c5527j73293c0246a0757k5910p4535b0052C52628j54883
$$ 149689 -209635 383566 -35527 -208820 -30246 -10757 -36667 -111202 -20052 352628 197745
12049A97745m5990b02981g003k65142B45252A18796b27603K0559r9064A03853
$$ 197745 151755 -202981 -7003 -272145 245252 118796 -227603 -207044 -306108 103853
12038g6527A45313j3432i6501A23085l0118N8258L3352a09507r4829A31999k5203
$$ -76527 145313 131881 -96501 123085 92967 151225 184577 -109507 -204336 131999 106796
12027A06796g5952C56261a89210i761n9800k57391i7297D6241Q6433a28051F3605
$$ 106796 -75952 356261 -189210 -9761 -69561 -326952 -97297 46241 132674 -128051 63605
12015a50053A00158K2264c48706d3171h943A18413L760g2220g355A08366a1521
$$ -150053 100158 122422 -348706 -43171 -8943 118413 122173 -72220 -7355 108366 -11521
12003b4530j1542C1648N7191K31051K7117j38132n7580a55515j80860C8987a11873
$$ -24530 -36072 31648 88839 319890 347007 208875 151295 -155515 -336375 38987 -111873
11991c60212B42334b77740e1229H1735L31867A01214K5452b6167A35417A298L5815
$$ -360212 242334 -277740 -51229 81735 413602 101214 126666 -26167 135417 1298 37113
11980C7113J0798J04325l2008I759b4200j29563j54107A75193a07641k6454F4194
$$ 37113 47911 152236 120228 9759 -24200 -153763 -307870 175193 -107641 -134095 64194
11968A72614a94257C4267J12849J48454E771J72505d086G4797j7190J2210J02995
$$ 172614 -194257 34267 147116 295570 5771 178276 -4086 74797 57607 69817 172812
11957A72812b38160h2144G9806f2375B62271B9642A1271R8606L6743a00511B70940
$$ 172812 -238160 -82144 79806 -62375 262271 29642 11271 109877 146620 -100511 270940
11945a69207B0571a00185B12616B9775M0339a82160N8613j0575m0814h852j38957
$$ -169207 20571 -100185 212616 29775 70114 -182160 -123547 -134122 -174936 -8852 -147809
11934a47809A46989a39094k18104B29026F0993b16437a8837A20677C4442b75575
$$ -147809 146989 -139094 -357198 229026 60993 -216437 -18837 120677 34442 -275575
11923I6275a76713C4561J60769m4427c82276A21499a09685j1553A22669A7429
$$ 96275 -176713 34561 195330 150903 -382276 121499 -109685 -121238 122669 17429
11912i6650A15779C8202a3415A51537C8661b47600c5938J0321h590m0224B37555
$$ -96650 115779 38202 -13415 151537 38661 -247600 -35938 -25617 -8590 -48814 237555
11900b10705B17875a52345G5486b19314O2656A25693a49517G6700R7138F4597
$$ -210705 217875 -152345 75486 -219314 -156658 125693 -149517 76700 173838 64597
11889e2958F0820M5093m1945a17655o8065B16204L7181b57534h9449j99537B11914
$$ -52958 60820 105913 63968 -117655 -185720 216204 253385 -257534 -89449 -288986 211914
11877c64609c8673B16292b92614a36990r2959c0203j96172A25222J3047Q346d02416
$$ -364609 -38673 216292 -292614 -136990 -229949 -30203 -226375 125222 138269 146615 -402416
11865e1926D5907a44594l0846M2968C17630a69000O3503L1157j38785G2793e49240
$$ -51926 45907 -144594 -175440 -132472 317630 -169000 -105497 -74340 -213125 72793 -549240
11853A94071d7801C0815d6779G5822c2035A67354b54411q7762I9667N1502i2671
$$ 194071 -47801 30815 -46779 75822 -32035 167354 -254411 -342173 99667 151169 -92671
11841A68311d977j45085A30652a87820q1614E4179a04501A88285c70750E7526
$$ 168311 -4977 -150062 130652 -187820 -269434 54179 -104501 188285 -370750 57526
11830H0733f7715l6976l399c165A11471m4213D343b98833a39051L2360B6676A785
$$ 80733 -67715 -104691 -108090 -3165 111471 67258 4343 -298833 -139051 -106691 26676 1785
11817B66608I4729K05241A36340h3175j56226B09747i474k6022B5456c8358C49330
$$ 266608 94729 299970 136340 -83175 -239401 209747 -9474 -35496 25456 -38358 349330
11805c6265B48962p5043A8908c27562E0432J14499N6665a72257A23748a16428
$$ -36265 248962 173919 18908 -327562 50432 164931 221596 -172257 123748 -116428
11794a58652m06674I923i8668K8164I898a82857C1391f8663B6486J01971i7157
$$ -158652 -565326 9923 -98668 -70504 9898 -182857 31391 -68663 26486 128457 -97157
11782b9234k0329A28803J18893H9815K299a71222D0760R1757m9607J49035C9662
$$ -29234 -49563 128803 247696 89815 92114 -171222 40760 132517 82910 231945 39662
11770a12737B67299f0672q7629d4863n616P832j78876B46177d5551j05966F8095
$$ -112737 267299 -60672 -148301 -44863 -50479 -42647 -221523 246177 -45551 -151517 68095
11758e0483j4115A45822N6085r2352n4521b80078a14463A0722J91583g0568c505
$$ -50483 -64598 145822 201907 109555 55034 -280078 -114463 10722 202305 -70568 -3505
11746B2681b70660A04195K2556J19457b36468I5631c17866B01823g9718K5835
$$ 22681 -270660 104195 126751 246208 -236468 95631 -317866 201823 -79718 -53883
11736e3883j88425c8136B1745c5868j78984A81276c73939a25335G8659a19711
$$ -53883 -242308 -38136 21745 -35868 -214852 181276 -373939 -125335 78659 -119711
11725c16532d384H4541h1654j57359a13466A40283a07770B40924G9062P4799B6508
$$ -316532 -4384 84541 -81654 -239013 -113466 140283 -107770 240924 79062 153861 26508
11713a81150C0669R3891l891M4240b09577B1129J92106G6686c22329A48251D5803
$$ -181150 30669 124560 120669 164909 -209577 21129 213235 76686 -322329 148251 45803
11701A05906d6773A02632a10729m3827C3681Q3244C744J73433l4318a10079A85494
$$ 105906 -46773 102632 -110729 -154556 33681 116925 3744 177177 142859 -110079 185494
11689A05923J43033M3556g1704J4281A51870a97506B46336N6588d08091a16971
$$ 105923 248956 292512 -71704 -57423 151870 -197506 246336 302924 -408091 -116971
11678a04618P434J9781E9244O4900d22800G389L23279l1290g5969k64737J19185
$$ -104618 -97184 -77403 59244 124144 -422800 7389 330668 299378 -75969 -340706 -221521
11667b21521F438L6615J89614K1488a89132q0596k32675J79598A8172J5437N3516
$$ -221521 6438 43053 232667 254155 -189132 -269728 -502403 -322805 18172 33609 87125
11656H7125j60N8589C4904b7541D0231J88263J00838a21603A32977K3963b3682
$$ 87125 86965 145554 34904 -27541 40231 228494 329332 -121603 132977 156940 -23682
11644a4749j52920j12247R8150h4326A14853A0758a36922C7533M73248C993e0666
$$ -14749 -167669 -279916 -181766 -84326 114853 10758 -136922 37533 510781 3993 -50666
11632A57866m2083K71142j65999D4542e464B8985g5128A07624a96893H9197a41750
$$ 157866 115783 386925 220926 44542 -5464 28985 -75128 107624 -196893 89197 -141750
11620a88489d6594F5926c16185C47144f02G5159b80345L0026A70869a59551D7985
$$ -188489 -46594 65926 -316185 347144 -602 75159 -280345 -250319 170869 -159551 47985
11608A13361J00297a23116E09710i7215C3238h0703k6791E1790b00547D0327L64088
$$ 113361 213658 -123116 509710 -97215 33238 -80703 -107494 51790 -200547 40327 404415
11597D04415b17137E6789G617L74760A84485E5644J47530m4125k9049n6239c56453
$$ 404415 -217137 56789 7617 382377 184485 55644 203174 159049 130000 73761 -356453
11585B87991n2489i6431n5626A20578i024j17204k0085I6855b12591g7956H0863
$$ 287991 235502 -96431 -152057 120578 -9024 -126228 -146313 96855 -212591 -77956 80863
11573i4630E612O6247J09129i2387c257A10918a55902A7668P8086C1628K6228
$$ -94630 5612 71859 180988 -92387 -3257 110918 -155902 17668 95754 31628 57856
11562E7856K2292J37738L58650I4567i2550F3394c1615r9820E9682c20415A58243
$$ 57856 80148 217886 576536 94567 -92550 63394 -31615 -131435 59682 -320415 158243
11550g1023k62054h1122C53162A6599a8542A6437J11536b62939M6648n4909D9358
$$ -71023 -333077 -81122 353162 16599 -18542 16437 127973 -262939 -216291 -271200 49358
11538B21416C6591j0000a58981O3221A34574m4485M0035a45171c7350j3164B43196
$$ 221416 36591 26591 -158981 -95760 134574 90089 130124 -145171 -37350 -50514 243196
11526c38370A32497P8351K17926G7155g723E6626a84641A83572J9728G0313A3699
$$ -338370 132497 210848 428774 77155 -7723 56626 -184641 183572 203300 70313 13699
11514A97911k3489D2179J81363a62586G3908M91432B03128G5985k0300I638P614
$$ 197911 174422 42179 223542 -162586 73908 565340 203128 75985 55685 9638 17252
11503A7252J65051G1124K6201O0580Q4158m3372b52101B39225J64829C268J46199
$$ 17252 182303 71124 97325 157905 242063 198691 -252101 239225 404054 3268 149467
11492A49467Q508F7396K97820I5017l8317c1911A6676a45544A87352p2157J81670
$$ 149467 157975 67396 365216 95017 56700 -31911 16676 -145544 187352 115195 296865
11481B96865K5092a56046C03802A42116q749K10764A07642k2016J09612n5031
$$ 296865 321957 -156046 303802 142116 133367 344131 107642 85626 195238 140207
11471A40207J70095A12282E2613J52024q788I6408J27625E9495J27270J21550
$$ 140207 310302 112282 52613 204637 195849 96408 224033 59495 186765 308315
11461C08315K3363j18995r0240L7335n6048K76741E7416K39076H4440g4964A42605
$$ 308315 331678 212683 122443 159778 103730 380471 57416 296492 84440 -74964 142605
11449b2578A82009m3140K1539a88613D6847M82464a90940G6068h547A88876D6821
$$ -22578 182009 138869 160408 -188613 46847 529311 -190940 76068 -8547 188876 46821
11437e4778j48446B00639C5994c45832J61870O1647A94453A4845c46220R049f2293
$$ -54778 -203224 200639 35994 -345832 -183962 -122315 194453 14845 -346220 -337171 -62293
11425a92103f6553n2402o5569C04245F0974f8916L3988q7289b9398j13812i580
$$ -192103 -66553 -118955 -184524 304245 60974 -68916 -34928 -122217 -29398 -143210 -9580
11413b67633e1222l23363N7229J27584A95368a88851O4067K0354A13343c5251
$$ -267633 -51222 -374585 -317356 -189772 195368 -188851 -124784 -104430 113343 -35251
11402C58278H5053a46636f4204I4550e20376c613D04794a71784b7959m2601l06928
$$ 358278 85053 -146636 -64204 94550 -520376 -3613 404794 -171784 -27959 -70560 -377488
11391c77488A42675b34431O1530g589r7629A58104i7095J7700b8970k29840R4774
$$ -377488 142675 -234431 -172901 -7589 -105218 158104 -97095 -79395 -28970 -258810 -164036
11380a64036A12753J40164j3069L6417j05460J88810c5407H9676a83062B5647
$$ -164036 112753 252917 239848 276265 170805 359615 -35407 89676 -183062 25647
11369A03529d00810c1062A42815J0388a8378A25130o1230a34337j96440A27397
$$ 103529 -400810 -31062 142815 153203 -18378 125130 63900 -134337 -330777 127397
11358B01817b23781L3638N7793B69169a34748D2488a3347B60648a0780k14191
$$ 201817 -223781 -190143 -132350 269169 -134748 42488 -13347 260648 -10780 -224971
11348b24971a04151A94398a35389N8838m0120D636h9666n8439j23393d5027B54745
$$ -224971 -104151 194398 -135389 -76551 -116671 4636 -89666 -148105 -271498 -45027 254745
11336A62604G5302f6251F5594N7271D659J16558D1105J17515j6121a71560A45973
$$ 162604 75302 -66251 65594 122865 4659 121217 41105 158620 142499 -171560 145973
11324a13806l2136M1038N1188b4754r4813E9025A8073J20192o2467f6776A13402
$$ -113806 -145942 -104904 -53716 -24754 -119567 59025 18073 138265 75798 -66776 113402
11312a79192A07478i3250q6687E2186i6544G4681M2729G58b00395f8515A61592
$$ -179192 107478 -93250 -179937 52186 -96544 74681 117410 758 -200395 -68515 161592
11300c13724R8658g553q6129q2454A4154a62967j77714B84186a12576B9740b56650
$$ -313724 -215066 -7553 -93682 -176136 14154 -162967 -340681 284186 -112576 29740 -256650
11288b23939F2486O1772F2104b80278I3989g5606A38459c07000E1237O6243b39550
$$ -223939 62486 124258 62104 -280278 93989 -75606 138459 -307000 51237 117480 -239550
11276B67387a6990A34736P3016b8359j23417L7391G2902j6175a92987L7699g1965
$$ 267387 -16990 134736 207752 -28359 -151776 -114385 72902 56727 -192987 -155288 -71965
11264g3984D83403i3589A81507c28642a48A16279a00j02501j18213F4196i662
$$ -73984 483403 -93589 181507 -328642 -148 116279 -100 -102601 -220814 64196 -9662
11252D9000J12993B4498b9223p1095H7086i7093c2364l5811C7213c06666A829
$$ 49000 161993 24498 -29223 -100318 87086 -97093 -32364 -68175 37213 -306666 1829
11240F50L7778J45769c01457D682K61095A22185h5464H9529J11106c9356H6197
$$ 650 38428 184197 -301457 4682 265777 122185 -85464 89529 200635 -39356 86197
11228d533E4978o595B2899h4760p3827O2757c5234B22711I4671c7980F8961a72053
$$ -4533 54978 48383 22899 -84760 -158587 -95830 -35234 222711 94671 -37980 68961 -172053
11215a95371f7333e667A37409F285a65591p6476E1542e6634n9168k6944G9617
$$ -195371 -67333 -5667 137409 6285 -165591 -242067 51542 -56634 -115802 -142746 79617
11203c8399G8761P5955c5806j44029O9717D0642M1953K1848d07296J51875b667
$$ -38399 78761 154716 -35806 -179835 -110118 40642 82595 104443 -407296 -255421 -2667
11191A98019G5636c84731i9074p6202B32242a7763D4183b39986I2117J22228j0534
$$ 198019 75636 -384731 -99074 -175276 232242 -17763 44183 -239986 92117 214345 203811
11180B03811d08456A45040g5811A87996c5768q723H8074c98290a59384j48991
$$ 203811 -408456 145040 -75811 187996 -35768 -44491 88074 -398290 -159384 -308375
11170c08375G2499j9859A8963a72843m9015O4886O7158G1272a35396B05755b15931
$$ -308375 72499 52640 18963 -172843 -221858 -156972 -89814 71272 -135396 205755 -215931
11158c1499m8610n2840K0624G3539b30459I6532g5379k00430A19028B5912L0839
$$ -31499 -80109 -132949 -112325 73539 -230459 96532 -75379 -275809 119028 25912 56751
11147E6751K33180N3949c5109A7274a28610B07246D2598b54532B31291J24513
$$ 56751 289931 343880 -35109 17274 -128610 207246 42598 -254532 231291 355804
11137C55804I4767C1782c2850J1252A3274e0218n8070A66536K6253b18232F7543
$$ 355804 94767 31782 -32850 -21598 13274 -50218 -108288 166536 192789 -218232 67543
11125D31144B0989l607e4605C87809I8439B6074b27235G932c52604B71682g4104
$$ 431144 20989 17382 -54605 387809 98439 26074 -227235 7932 -352604 271682 -74104
11113a16699o9134A22959Q1171c4532F7918B845K54592J07972a22094C7588f1503
$$ -116699 -185833 122959 204130 -34532 67918 2845 257437 365409 -122094 37588 -61503
11101B74128n9689b37359C8403a0559q2098C6651L32734d0527C26309j61534K10109
$$ 274128 214439 -237359 38403 -10559 -92657 36651 369385 -40527 326309 164775 374884
11090C74884G8124A8057K20587o1979J16448J03349j82303j05368K8769K7708
$$ 374884 78124 18057 238644 176665 293113 396462 214159 108791 137560 165268
11080A65268K02012e2070B72497D9309j4590J61743l8349K0798J48364o0874N5327
$$ 165268 367280 -52070 272497 49309 34719 196462 158113 178911 327275 266401 321728
11069C21728k1190m896j31779J97123j32256J96895J15082k28281p2724L86434
$$ 321728 300538 295642 163863 360986 228730 425625 540707 312426 239702 626136
11059F26136B84024k9651L50323Q1293j90563K11086Q3207k25378r3314K5766
$$ 626136 284024 254373 604696 685989 495426 706512 789719 564341 471027 496793
11049D96793O1504J89223C38870Q4420N3907K90929k99275m7081J78241B81919
$$ 496793 558297 747520 338870 423290 477197 768126 468851 421770 600011 281919
11038G53320j5343K54045D10745L16555J36516j66843k00469J90793C36663K89518
$$ 753320 737977 992022 410745 727300 863816 696973 496504 687297 336663 626181
11028F26181j44207K46483K0054k72201K94735C59207p0071r3166N21858j42450
$$ 626181 481974 728457 748511 476310 771045 359207 289136 195970 717828 575378
11018E75378B51370O46762m16894k00211M15536k79344k0322m3492M52376l54786
$$ 575378 251370 898132 481238 281027 696563 417219 396897 353405 805781 450995
11008D50995M2824Q1414B58805J58043A12235K98268J50382k16983K83303R6928
$$ 450995 493819 575233 258805 416848 112235 410503 560885 343902 627205 724133
10998G24133k11185J7076Q1288k17877J88027j29172P8537K1722J30650J29362
$$ 724133 512948 530024 611312 393435 581462 452290 530827 552549 683199 812561
10988H12561R2775l20501Q1119L83450k34685P872J23495J1322k08991K81175
$$ 812561 905336 584835 665954 1049404 814719 822591 946086 957408 748417 1029592
10978A029592M39595l54080L06172K77368N69985j85573J82179R9427j73460j0955
$$ 1029592 1469187 1115107 1421279 1698647 2268632 2083059 2265238 2364665 2191205 2180250
10968B180250K05560o58826K63817l75775j24269j84407J47796j02255l53766
$$ 2180250 2385810 1726984 1990801 1615026 1490757 1306350 1454146 1351891 998125
10959I98125L40070k93037J81319q5270J34288l45292J50181n02251k6758Q885
$$ 998125 1338195 1045158 1226477 1141207 1275495 930203 1080384 578133 551375 560260
10949E60260B43031n0647L08268A93008m8540l5119J40289l7400B6704f3156l6203
$$ 560260 243031 192384 500652 193008 144468 109349 249638 212238 26704 -63156 -99359
10938i9359B58975a36914O397C81635j61727q0599j298c51698i8976E6556R0880
$$ -99359 258975 -136914 -130517 381635 219908 139309 138011 -351698 -98976 56556 147436
10927A47436F3973g945A96883a32752g948q0432A18249D0271P6998b05340M5231
$$ 147436 63973 -7945 196883 -132752 -7948 -88380 118249 40271 117269 -205340 -160109
10916a60109H5200d3992A37826B4284M997i9517k52904A50119G4089R4238M7586
$$ -160109 85200 -43992 137826 24284 29281 -99517 -352421 150119 74089 168327 215913
10905B15913k0187h0609L4940k251B00518e9275B52301A3527K40569o3905F4162
$$ 215913 195726 -80609 -45669 -47920 200518 -59275 252301 13527 254096 190191 64162
10893D846M6566K12920A04411J13942A8619c03289B5658d2204k5043p4847k12811
$$ 4846 51412 264332 104411 218353 18619 -303289 25658 -42204 -67247 -142094 -354905
10882c54905a34662A09864a37991A2149g4361p1133A60060a80065E5374e18922
$$ -354905 -134662 109864 -137991 12149 -74361 -145494 160060 -180065 55374 -518922
10871b47078a17579k611B9771a39438M1339K5590A27635a65000P7505B57906b34755
$$ -247078 -117579 -120190 29771 -139438 -98099 -72509 127635 -165000 -87495 257906 -234755
10859A95375H3297a69011A35286c4721o7020B93034A581J73356P7407H424a43473
$$ 195375 83297 -169011 135286 -34721 -101741 293034 1581 174937 252344 8424 -143473
10847B1678i0136o5055A21868a15076a6761j01791C25425b8863o3690A7037C163
$$ 21678 -90136 -155191 121868 -115076 -16761 -118552 325425 -28863 -92553 17037 3163
10835b48007B76473A30346f4695m13636i0104B23231c07258H1893a55106l2159
$$ -248007 276473 130346 -64695 -478331 -90104 223231 -307258 81893 -155106 -187265
10825a87265b6220B98145i4820j45881a16199N5464A39617a13656B20599I1358
$$ -187265 -26220 298145 -94820 -240701 -116199 -60735 139617 -113656 220599 91358
10814a0529k02840E1927b30259j35525D76a05915D4715b79271h3706D6787D966
$$ -10529 -213369 51927 -230259 -365784 476 -105915 44715 -279271 -83706 46787 4966
10802G0913b0930A40426a77564A41748M4761H2165J70453q0542o7918c54826a47458
$$ 70913 -20930 140426 -177564 141748 186509 82165 252618 172076 104158 -354826 -147458
10790H75J93620a42912c1943j36835L4642j4538N0349A48254A2449a51932g2210
$$ 875 194495 -142912 -31943 -168778 -134136 -148674 -98325 148254 12449 -151932 -72210
10778D0758b29011B01258a01345B5575D953O2412e1174k5577L5613l9801j49795
$$ 40758 -229011 201258 -101345 25575 4953 67365 -51174 -76751 -41138 -80939 -230734
10767b30734p2055A16164m367a79646k6936B27610a23246M3567A62766F1731c58859
$$ -230734 -302789 116164 111797 -179646 -206582 227610 -123246 -79679 162766 61731 -358859
10755A16130d3497l120l37961F4160c2048F2151b55331e3527J4212j43619P4852
$$ 116130 -43497 -46617 -384578 64160 -32048 62151 -255331 -53527 -39315 -182934 -108082
10744a08082A55753a34727C2727a20907E8204R2046a28479K6809M5892F7962a51165
$$ -108082 155753 -134727 32727 -120907 58204 150250 -128479 -101670 -55778 67962 -151165
10732A07289c9178k94541e6309F1938i5834j5532j66328A87324m7467f9958a4946
$$ 107289 -39178 -333719 -56309 61938 -95834 -111366 -277694 187324 139857 -69958 -14946
10720b19666j99428a66881B13481b16509d5303j51189Q2377k70948D0373J07759
$$ -219666 -419094 -166881 213481 -216509 -45303 -196492 -114115 -385063 40373 148132
10710A48132n4865b56491g6774q0795m8312e6590B1479M6534J71580I5475M962
$$ 148132 93267 -256491 -76774 -157569 -205881 -56590 21479 68013 239593 95475 100437
10699A00437i9365J5696l04672A4336a52162B39239b82076A06014O5127D6361
$$ 100437 -99365 -83669 -388341 14336 -152162 239239 -282076 106014 171141 46361
10688D6978a42033g801n3336A16302k3781b2361k65299f7823j95131a03098q8890
$$ 46978 -142033 -7801 -61137 116302 92521 -22361 -287660 -67823 -262954 -103098 -191988
10677a91988G4806d792b206k31368A8912R6577a55019D9165b90210A65115a15362
$$ -191988 74806 -4792 -2206 -233574 18912 115489 -155019 49165 -290210 165115 -115362
10665a27520B2872a68941A245a7151j82868A6619a62922j36632C7936c98830A10532
$$ -127520 22872 -168941 1245 -17151 -200019 16619 -162922 -299554 37936 -398830 110532
10653H6877b07090b8009l06916J9636a09903j63795k8793c1764r2345M9156j20313
$$ 86877 -207090 -28009 -334925 -315289 -109903 -273698 -302491 -31764 -124109 -74953 -195266
10642a95266D1066a11603E840b28614A97713k2768c21149C0445c27462L433B2871
$$ -195266 41066 -111603 5840 -228614 197713 174945 -321149 30445 -327462 -324029 22871
10630b1718p0347j98176j03215a76490f6512j27807i395l1389C50346r0210A0508
$$ -21718 -92065 -290241 -393456 -176490 -66512 -194319 -9395 -40784 350346 260136 10508
10618b1972I3094c26696A06998M2704b93615i0148r5163o4277B3179J3797c12875
$$ -21972 93094 -326696 106998 149702 -293615 -90148 -185311 -249588 23179 36976 -312875
10606H1062a73356p0113B80259A15922a30854A20390j4433f6292H3422c6419k00011
$$ 81062 -173356 -243469 280259 115922 -130854 120390 105957 -66292 83422 -36419 -236430
10595b36430D273i7894L2496j77119J01665M7464D0145c6797j37577O1434E5887
$$ -236430 4273 -97894 -65398 -242517 -140852 -93388 40145 -36797 -174374 -112940 55887
10583G7183b7961k98032G8596B7103c85584a80428B42971E1310b2905o5874A69067
$$ 77183 -27961 -325993 78596 27103 -385584 -180428 242971 51310 -22905 -88779 169067
10571A65992O659b22387A26845F1797N6381D5583J14841A0824d23772I3347b34624
$$ 165992 172651 -222387 126845 61797 118178 45583 160424 10824 -423772 93347 -234624
10559d67998b4967k71298a31289A41778b33456B856J4335Q175Q8420O801a56801
$$ -467998 -24967 -296265 -131289 141778 -233456 2856 17191 25366 113786 120587 -156801
10547F9556a84625f2970R860C76205h0718a8767j44009O1664C0467J00214m8074
$$ 69556 -184625 -62970 -53110 376205 -80718 -18767 -162776 -101112 30467 130681 82607
10536H2607J48450n7267A3345a72510F2182b45685j0427I0707c33444B02425D7198
$$ 82607 231057 173790 13345 -172510 62182 -245685 -256112 90707 -333444 202425 47198
10524C6279a63466g050A15383a30465B9571J6289K6172P3216D4351c28083j5369
$$ 36279 -163466 -7050 115383 -130465 29571 45860 72032 145248 44351 -328083 -343452
10513c43452E5218N5381l5941b74088A71161B656b80025A14522b50717R1597o1392
$$ -343452 55218 110599 74658 -274088 171161 2656 -280025 114522 -250717 -159120 -220512
10502b20512L4739p4758E9513a6213g425D8172b71196O1452i025l9290k76941
$$ -220512 -185773 -260531 59513 -16213 -7425 48172 -271196 -209744 -9025 -48315 -325256
10491c25256c9155C36880e97720a23083A47946b19365A9044L186b32407N348C6220
$$ -325256 -39155 336880 -597720 -123083 147946 -219365 19044 22230 -232407 -227059 36220
10479F4758a25695A29541c2572A19939c6581k40506A98176a08576A64835l9924
$$ 64758 -125695 129541 -32572 119939 -36581 -277087 198176 -108576 164835 124911
10469A24911P3611b47662K1727G0816l4119i8241A44480B6467A2336a4082A41775
$$ 124911 198522 -247662 -225935 70816 36697 -98241 144480 26467 12336 -14082 141775
10457a32877F0352j0620g9168C67381A51799b08719a00298B4954R5113J6674b30954
$$ -132877 60352 49732 -79168 367381 151799 -208719 -100298 24954 120067 136741 -230954
10445i6520r6864C6380a41010J7595O0097k80782f4785G2885k651J13511A1519
$$ -96520 -193384 36380 -141010 -123415 -63318 -344100 -64785 72885 70234 183745 11519
10433a85622I375a15796n8245P6779k24953A30028J05671l1980D9023J76272a82032
$$ -185622 9375 -115796 -174041 -97262 -322215 130028 235699 203719 49023 225295 -182032
10421a68829k04338A66258E1314a03094B00257b19218B5920L0281L34238C1657
$$ -168829 -373167 166258 51314 -103094 200257 -219218 25920 56201 390439 31657
10410b28046E2991a0834E8875a78115A06751O9121d5639k4231j23823A20784B0812
$$ -228046 52991 -10834 58875 -178115 106751 175872 -45639 -69870 -193693 120784 20812
10398a87349B4510K47993P4731a32987A19474a06181A54419l8738N4863J50236
$$ -187349 24510 272503 347234 -132987 119474 -106181 154419 115681 170544 320780
10388C20780j16883b66971C6364N5969a5066A6703J05692J36755G1654K95439
$$ 320780 203897 -266971 36364 92333 -15066 16703 122395 259150 71654 367093
10378C67093j19872O5335o7923M2438H9380i166D65924F1175A6402K72205J24630
$$ 367093 247221 312556 244633 287071 89380 -9166 465924 61175 16402 288607 413237
10367D13237L4133o8374J97807A73170L58413d1448j63166e564B96566J56407
$$ 413237 447370 378996 576803 173170 531583 -41448 -204614 -5564 296566 452973
10357D52973A68827E4686h1937A4587J27402K1174M67998B57973K5602K43554
$$ 452973 168827 54686 -81937 14587 141989 163163 631161 257973 283575 527129
10347E27129A76280K34563A62037K65776n6006q2110l7957e7666F9970b849H9473
$$ 527129 176280 410843 162037 427813 371807 289697 251740 -57666 69970 -2849 89473
10335A40203A8399J99148a69841A25054a39384a731B04957d6665A73403p8667
$$ 140203 18399 217547 -169841 125054 -139384 -1731 204957 -46665 173403 94736
10325I4736K61480j58790J1349e8648C52011g1675d698B7929a33238H903J65230
$$ 94736 356216 197426 208775 -58648 352011 -71675 -4698 27929 -133238 8903 174133
10314A74133e0751q360H6559e4021C97661D5782Q7399a51627J517a0408j13388
$$ 174133 -50751 -59111 86559 -54021 397661 45782 133181 -151627 -150110 -10408 -123796
10303a23796A28715n4173d7759E6680N6856B5638N9316P4070f0063j56288c9531
$$ -123796 128715 74542 -47759 56680 113536 25638 84954 159024 -60063 -216351 -39531
10291a39546M1559E9845N8110b86405k1515b1698j28664B92633a0179j10541k21660
$$ -139546 -97987 59845 117955 -286405 -307920 -21698 -150362 292633 -10179 -120720 -342380
10280c42380R2780C3719a38659D22412b38387O8733a1308A76929e2330j76310
$$ -342380 -249600 33719 -138659 422412 -238387 -169654 -11308 176929 -52330 -228640
10270b28640r61a03707J2129A9714d6651B94675k0005a29815A06743j2312C1942
$$ -228640 -229601 -103707 -91578 19714 -46651 294675 274670 -129815 106743 94431 31942
10258C46381a03109D82781A26487K39227E0135i6391F7333B8914J8301J11755
$$ 346381 -103109 482781 126487 365714 50135 -96391 67333 28914 47215 158970
10248A58970a2108E00933b93955G7992e6388i058B0071a11769A79653R6771g3823
$$ 158970 -12108 500933 -293955 77992 -56388 -9058 20071 -111769 179653 276424 -73823
10236a1585B26174A9625R1592b82828R49a22076n4779j38141g5144k6660B04287
$$ -11585 226174 19625 111217 -282828 -281879 -122076 -176855 -314996 -75144 -101804 204287
10224b96730J36321g1166j75437d5081k03506O7381n44l0045j54234f9366B9547
$$ -296730 -160409 -71166 -246603 -45081 -248587 -181206 -181750 -211795 -366029 -69366 29547
10212a43912J8580B3734J10843F3869e9817A37480b03252A09267M739M0711a16069
$$ -143912 -125332 23734 134577 63869 -59817 137480 -203252 109267 114006 154717 -116069
10200B263b64684P6759K9777b8467j17154K8334I2824A3308J02437k3833O3889
$$ 2263 -264684 -187925 -158148 -28467 -145621 -117287 92824 13308 115745 91912 155801
10189A55801b68159P3902A45235a97112j00003a43157d4513m9079M2049o3991
$$ 155801 -268159 -194257 145235 -197112 -297115 -143157 -44513 -93592 -51543 -115534
10179a15534o92N0140a7177m5421o5929A80879a37904N8877C85936G5995i9869
$$ -115534 -116226 -66086 -17177 -62598 -128527 180879 -137904 -79027 385936 75995 -99869
10167a40423n1770L7585C18495f6443C37417c0510k81810H7912c23363A72005
$$ -140423 -192193 -154608 318495 -66443 337417 -30510 -312320 87912 -323363 172005
10156B15446d7305j9772J2639j11718a6455o7743A51163a96731A36707c164j9920
$$ 215446 -47305 -67077 -54438 -166156 -16455 -84198 151163 -196731 136707 -3164 -23084
10145b3084o4258q2133k05218J68274m6810B17898e5129k23175R6320D6226a0218
$$ -23084 -87342 -169475 -374693 -206419 -253229 217898 -55129 -278304 -181984 46226 -10218
10133d6090j79799e9405p6579G6110a78826P7808l34708A1141g1640g04C02691
$$ -46090 -225889 -59405 -135984 76110 -178826 -101018 -435726 11141 -71640 -704 302691
10121A76958D1777f0280B139J92118a35651F2720L40c68415B40444M6984a00028
$$ 176958 41777 -60280 2139 194257 -135651 62720 63060 -368415 240444 287428 -100028
10109C08259A3403J73446i8821p0317A5787i7116j63431G7202f1336H694L03379
$$ 308259 13403 186849 -98821 -169138 15787 -97116 -260547 77202 -61336 8694 312073
10098C12073b0883R833A03366e3256n7617D6364J95007c10769A01615a00292j37362
$$ 312073 -20883 -11050 103366 -53256 -110873 46364 241371 -310769 101615 -100292 -237654
10087b37654E8006b12287q843m6144B7321a73482q0693J20763D3594a90028P8442
$$ -237654 58006 -212287 -221130 -267274 27321 -173482 -254175 -133412 43594 -190028 -111586
10076a11586j4605O0086A78662b72386d2122a3123G0740a58764L0107A03373d6494
$$ -111586 -126191 -66105 178662 -272386 -42122 -13123 70740 -158764 -128657 103373 -46494
10064a25615a3363k64565C8933h581B0914a22085G1343k5569a2705l39637A05982
$$ -125615 -13363 -277928 38933 -8581 20914 -122085 71343 45774 -12705 -352342 105982
10052b97048r1201J12326j17087g7236a3632j12305q5099r4605i2506L8677k76862
$$ -297048 -388249 -275923 -393010 -77236 -13632 -125937 -211036 -305641 -92506 -53829 -330691
10041c30691d1429j56406m7161g7758A81939A3368b43126o235R5912e6952j30730
$$ -330691 -41429 -197835 -244996 -77758 181939 13368 -243126 -249361 -153449 -56952 -187682
10030a87682a87k88410J3775g136k64860a03427K0829L85G3463b59707a1685j18569
$$ -187682 -187 -288597 -274822 -7136 -271996 -103427 -82598 -82213 73463 -259707 -11685 -130254
10018a30254j79363B56532A17227i741c949B21228o2130d3292B7784J25226h2901
$$ -130254 -309617 256532 117227 -9741 -3949 221228 159098 -43292 27784 153010 -82901
10006B6661d10637a18995j30137j05993A15514A7476d99872J21841C03568b36489
$$ 26661 -410637 -118995 -249132 -355125 115514 17476 -499872 -378031 303568 -236489
9995C2539h6579H858J05728a43685H6226B7868a24497Q370a4553o2842G3844G531
$$ 32539 -86579 8858 114586 -143685 86226 27868 -124497 -116127 -14553 -77395 73844 7531
9982C3969J62918m7069a24117c0403G2363A3927i2049k7051N3921j81701a07933
$$ 33969 196887 149818 -124117 -30403 72363 13927 -92049 -119100 -65179 -246880 -107933
9970C66890c32203a19847c088k0663r8095H3044b16092g7739H343b68650m6748
$$ 366890 -332203 -119847 -3088 -23751 -121846 83044 -216092 -77739 8343 -268650 -315398
9959c15398K8191b5218q5271G2104a74760o5214i7925A37323o6545B9163J32183
$$ -315398 -287207 -25218 -110489 72104 -174760 -239974 -97925 137323 70778 29163 161346
9948A61346F7332c54841a18554C980P9718e0268G9375e5220o3811A54294l0288
$$ 161346 67332 -354841 -118554 3980 83698 -50268 79375 -55220 -119031 154294 124006
9937A24006m9093b48752A12527a19772K6510I8499g0389A4514c19856a16765A51441
$$ 124006 74913 -248752 112527 -119772 -93262 98499 -70389 14514 -319856 -116765 151441
9925G9503M78171F8623P9715d9699B6794b32865J8522C53704A36037g6682B81044
$$ 79503 557674 68623 148338 -49699 26794 -232865 -214343 353704 136037 -76682 281044
9913A87994E178K7428a52626A07989a08399k56329a3422C08219C604K14071b32636
$$ 187994 5178 32606 -152626 107989 -108399 -364728 -13422 308219 3604 217675 -232636
9901a69802A07532a28850c2745a814B78699c3942H7024a076l5922k48845J09697
$$ -169802 107532 -128850 -32745 -1814 278699 -33942 87024 -1076 -36998 -285843 -176146
9890a76146Q230K7518o5372f4848E10298A73d6343j22501m0140a5380r2766j08371
$$ -176146 -167916 -140398 -205770 -64848 510298 173 -46343 -168844 -208984 -15380 -108146 -216517
9878b16517R9255A0744d0808C5731d5358m43940b40926i5061E1314h522j38120
$$ -216517 -117262 10744 -40808 35731 -45358 -489298 -240926 -95061 51314 -8522 -146642
9867a46642A98639a79421f5774k57159H2066J68132b43324i8405l30137f3978
$$ -146642 198639 -179421 -65774 -322933 82066 250198 -243324 -98405 -428542 -63978
9856b6588B9155k819c9605r3674d3716B09018i7045H1223c05676J43229F7459
$$ -26588 29155 26336 -39605 -133279 -43716 209018 -97045 81223 -305676 -162447 67459
9844E5193h0261r8758O5530j72225G2351K41097n9273c8717C14572d8457j5979
$$ 55193 -80261 -179019 -113489 -285714 72351 313448 254175 -38717 314572 -48457 -64436
9833f4436H2072a36174D4522a02052j76355o0961I125K13735h9567C8709b19664
$$ -64436 82072 -136174 44522 -102052 -278407 -339368 9125 222860 -89567 38709 -219664
9821C2894L5613a41569j07843A20917E8072g8247j38741C4636K89004A4683J2255
$$ 32894 68507 -141569 -249412 120917 58072 -78247 -216988 34636 323640 14683 26938
9810B6938N9753J1186A8229i0784j83629g2489l06276R0153D02280b16528P3647
$$ 26938 86691 97877 18229 -90784 -274413 -72489 -378765 -288612 402280 -216528 -142881
9799a42881B29620a52791e0507k53140a31545j03843h4714d386k36938a1215j69400
$$ -142881 229620 -152791 -50507 -303647 -131545 -235388 -84714 -4386 -241324 -11215 -180615
9788a80615p459a9817l52663a33610B82937A40747i9664J299E2512R8140j480
$$ -180615 -188074 -19817 -372480 -133610 282937 140747 -99664 -98365 52512 150652 149172
9777A49172c81622B32005a24491a7098j38348A26092c42524I0888a4822l59369
$$ 149172 -381622 232005 -124491 -17098 -155446 126092 -342524 90888 -14822 -374191
9767c74191e9751a7743A13103a75410A30527g7732a9672j42341j06925I6036J91348
$$ -374191 -59751 -17743 113103 -175410 130527 -77732 -19672 -162013 -268938 96036 287384
9756B87384C1437K41775f8547I066m436N493O9746a67913g9815C39735a03617
$$ 287384 31437 273212 -68547 9066 4630 10123 79869 -167913 -79815 339735 -103617
9744G5470f3681B10487c8055j24672N9368j2016j49436R9403N0210j10266g1116
$$ 75470 -63681 210487 -38055 -162727 -103359 -115375 -264811 -165408 -115198 -225464 -71116
9732d58745b22499N3683A97332a49836I5949k9188P55b56832i9593A3254a33477
$$ -458745 -222499 -168816 197332 -149836 95949 66761 67516 -256832 -99593 13254 -133477
9720D7648b62717N8791P2838n0088m1933M9436r751k7637p5486a1267k25257A48226
$$ 47648 -262717 -203926 -131088 -181176 -223109 -173673 -183424 -211061 -286547 -11267 -236524 148226
9707E58011b01432A58422b07261B4708M6288k2280b30190o3589a45542b0840k5851
$$ 558011 -201432 158422 -207261 24708 70996 48716 -230190 -293779 -145542 -20840 -46691
9696d6691C37472a6646j84392Q7841M3993j09102J3173P8633c2371j31601q2313
$$ -46691 337472 -16646 -201038 -113197 -69204 -178306 -165133 -86500 -32371 -163972 -246285
9685b46285d9301r7272A68676e8222j19097B04490A01471k547b45464e3510j29727
$$ -246285 -49301 -146573 168676 -58222 -177319 204490 101471 98924 -245464 -53510 -183237
9674a83237B2362a33871j57318A83236b18717h6542j8189i929j5775l2512r232
$$ -183237 22362 -133871 -291189 183236 -218717 -86542 -104731 -9929 -25704 -58216 -67448
9663f7448k90240R6634j551Q7864K3883A80120a76464A35881n8802b2102E7674
$$ -67448 -357688 -261054 -262605 -174741 -150858 180120 -176464 135881 77079 -22102 57674
9651h5073j10146j33381J23022P9159o6777L8229B101h6426K0508E0275a53109
$$ -85073 -195219 -328600 -205578 -126419 -193196 -154967 2101 -86426 -65918 50275 -153109
9639B5800L410a46531N8615k8223A798i0012F9798a92852A01891J05691D2462
$$ 25800 29210 -146531 -87916 -116139 1798 -90012 69798 -192852 101891 207582 42462
9627f6109m20781I9634B8578i0950c905E7462c17854b6786B3781a22810B10574
$$ -66109 -486890 99634 28578 -90950 -3905 57462 -317854 -26786 23781 -122810 210574
9615A85725H4001F791P3984b91617E565f078k96328j54471A55270c59345h3752
$$ 185725 84001 6791 80775 -291617 5565 -6078 -302406 -456877 155270 -359345 -83752
9603g1227k99673B41817J49604b90320d9874a2616B90842A6960a61711D73628
$$ -71227 -370900 241817 391421 -290320 -49874 -12616 290842 16960 -161711 473628
9592e77274a1916r6343d9776j31254I770b00912P5213A67217e7013j0928l0514
$$ -577274 -11916 -108259 -49776 -181030 9770 -200912 -125699 167217 -57013 -67941 -98455
9581i8455o3842p4839h9743A86825H2480c4947j57493d9655A80327J65952a30190
$$ -98455 -162297 -237136 -89743 186825 82480 -34947 -192440 -49655 180327 346279 -130190
9569C3043a55673g2504k27097B1410b10224A74649a20139n019A3493e2399j71056
$$ 33043 -155673 -72504 -299601 21410 -210224 174649 -120139 -125158 13493 -52399 -223455
9558b23455A5712i0283j24528C6870b64219h2153C5491a02824j68331a8223b492
$$ -223455 15712 -90283 -214811 36870 -264219 -82153 35491 -102824 -271155 -18223 -2492
9546D9447O2376a53079A20609c18046c9851H5045g1559B28497a12007A83399a42392
$$ 49447 111823 -153079 120609 -318046 -39851 85045 -71559 228497 -112007 183399 -142392
9534f3684A01649B2467L7837e1027b2466l70218d1353E4199A511c7359l5894k16322
$$ -63684 101649 22467 60304 -51027 -22466 -392684 -41353 54199 1511 -37359 -73253 -289575
9522b89575G5962a28056d0762j20767I3142a10728r3686O1022G4230b8118G639
$$ -289575 75962 -128056 -40762 -161529 93142 -110728 -204414 -143392 74230 -28118 7639
9510a91408k35676a61189b7117n1728E1500a89323K810k8233A78018e3165h939
$$ -191408 -427084 -161189 -27117 -78845 51500 -189323 -186513 -214746 178018 -53165 -8939
9498B20228j02541a1104D0084Q2332b67615a7649C22268M3333b50154j6024O3649
$$ 220228 117687 -11104 40084 122416 -267615 -17649 322268 365601 -250154 -266178 -202529
9487b02529k24501A30176n1394e2402I1194f3824j06755e4846k6555j23245R8145
$$ -202529 -427030 130176 78782 -52402 91194 -63824 -170579 -54846 -81401 -204646 -106501
9476a06501o8054P8871A61981L1270K6778I8985a58370m3962j12064b0896N109
$$ -106501 -174555 -95684 161981 193251 220029 98985 -158370 -202332 -314396 -20896 -15787
9465a5787e978G8876K27724I1578O3030c10631F3678b76577B08703B958Q9166
$$ -15787 -5978 78876 306600 91578 154608 -310631 63678 -276577 208703 2958 92124
9454I2124a0263l10666P4814l1800l2584B5758b40348B906d3633f064k81396a21631
$$ 92124 -10263 -320929 -246115 -277915 -310499 25758 -240348 2906 -43633 -6064 -287460 -121631
9441a54735M6361a4697j91164a4370F6862k8189e5602n7756I1802g985A64217
$$ -154735 -108374 -14697 -205861 -14370 66862 38673 -55602 -113358 91802 -7985 164217
9429a54766A17977b38107J00733k65031b8878j5383c190j71179N8999G552d11710
$$ -154766 117977 -238107 -137374 -402405 -28878 -44261 -3190 -174369 -115370 7552 -411710
9417C4493b94114e453A0488b56180f6350k38938d1222J4908B07020M7480b2540
$$ 34493 -294114 -5453 10488 -256180 -66350 -305288 -41222 -26314 207020 254500 -22540
9405c7975n4123A4237b08261B919a50112B02058b61658b0120E2093a4061D4764
$$ -37975 -92098 14237 -208261 2919 -150112 202058 -261658 -20120 52093 -14061 44764
9393g898B0039e8756A97666I7349b4389B73585a53327A15598l6336c2883J5646
$$ -7898 20039 -58756 197666 97349 -24389 273585 -153327 115598 79262 -32883 -17237
9382a7237j87949A3448b82585j43253L7740B7788K58515e5131j44125M9629o694
$$ -17237 -205186 13448 -282585 -425838 -388098 27788 286303 -55131 -199256 -149627 -156321
9371a56321A40237a12105j4856o1779A91338G5695J6109f6055j06300B1948c18069
$$ -156321 140237 -112105 -126961 -188740 191338 75695 91804 -66055 -172355 21948 -318069
9359F7878M7499d86834b03848C40692f7412A87558q3376b57715m178C33551A6863
$$ 67878 115377 -486834 -203848 340692 -67412 187558 104182 -257715 -261893 333551 16863
9347B67766b96040J06885B03634b40456A76335D440P7940g3021k48654f3569A08198
$$ 267766 -296040 -189155 203634 -240456 176335 4440 82380 -73021 -321675 -63569 108198
9335F0368o996J23782b88827B8839c0509k7451A64322b19645B53309A01765k5036
$$ 60368 53372 177154 -288827 28839 -30509 -57960 164322 -219645 253309 101765 76729
9324G6729a86173h1398r3763M5885j32823P4060i2251j33027I8539a304l1474
$$ 76729 -186173 -81398 -175161 -129276 -262099 -188039 -92251 -225278 98539 -1304 -32778
9313c2778p8771L0120m1533I9564b15471l5292g2611k19494B6983J37534a00312
$$ -32778 -111549 -81429 -122962 99564 -215471 -250763 -72611 -292105 26983 164517 -100312
9301D2071P0297b65310R6350p7769C10028g7884m3042B30650B3207a88331r1869
$$ 42071 112368 -265310 -168960 -246729 310028 -77884 -120926 230650 23207 -188331 -280200
9290b80200C07482c87762J19560a09309A16008O8702d6742O576j25630e3973C5682
$$ -280200 307482 -387762 -268202 -109309 116008 184710 -46742 -40166 -165796 -53973 35682
9278a25707M9721K2077j44711C2331a13908B9399b38578D8674c55580a68448A38367
$$ -125707 -75986 -53909 -198620 32331 -113908 29399 -238578 48674 -355580 -168448 138367
9266a38307d0131A2218b02422k9777q3430A26058a76882A5484J81170c19323J19775
$$ -138307 -40131 12218 -202422 -232199 -315629 126058 -176882 15484 196654 -319323 -199548
9255a99548b4667A70086d22502a12253M7217A92913a0662j16329p7948J00335
$$ -199548 -24667 170086 -422502 -112253 -65036 192913 -10662 -126991 -204939 -104604
9245a04604A0207a08219A22479b09925g4926B33834G7307k6497c17594P5684k8537
$$ -104604 10207 -108219 122479 -209925 -74926 233834 77307 50810 -317594 -241910 -270447
9234b70447J33308l9925g8884C93891c65482f6400l16526B30018g8615j48814
$$ -270447 -137139 -177064 -78884 393891 -365482 -66400 -382926 230018 -78615 -227429
9224b27429B75725e2193m21889A9563b30800A24298c36510J40658p4057A35558
$$ -227429 275725 -52193 -474082 19563 -230800 124298 -336510 -195852 -269909 135558
9213A38143M7154M4920a9197H8075a00991n1781C5998A470h8174A31369l1689
$$ 138143 185297 230217 -19197 88075 -100991 -152772 35998 1470 -88174 131369 99680
9202I9680c32656a3541F2336J58954c6307r5351B58851a49703c7206r2963G577
$$ 99680 -332656 -13541 62336 221290 -36307 -131658 258851 -149703 -37206 -130169 7577
9190c38691d5446d94I8322b07812D5154K19210e6362B3755d5443e638j35433q009
$$ -338691 -45446 -494 98322 -207812 45154 264364 -56362 23755 -45443 -5638 -141071 -149080
9178a49080j18476q2607a02984p971A58203a15388B4228m811J337p322a49397
$$ -149080 -267556 -350163 -102984 -110955 158203 -115388 24228 19417 20754 13432 -149397
9166C88539a35810A63330L6255d3213a0310F0455L4274b65910J5768A5406b03042
$$ 388539 -135810 163330 199585 -43213 -10310 60455 94729 -265910 -250142 15406 -203042
9154E9415b46534F5960K19039a22114E2976M7558b82735m1560J60116j26807E6696
$$ 59415 -246534 65960 284999 -122114 52976 100534 -282735 -324295 -164179 -290986 56696
9142A27554b13103I912a94773B00367A8697L23915a30739r5131K2344i0065E0405
$$ 127554 -213103 9912 -194773 200367 18697 342612 -130739 -225870 -203526 -90065 50405
9130a14439j03696g4823m3869p2209d8829a7838j852C39708H1411a43040C2535
$$ -114439 -218135 -74823 -118692 -190901 -48829 -17838 -19690 339708 81411 -143040 32535
9118B9085a40276B53500c38802A07720c142j97453G7685O9206d95869C9922c94820
$$ 29085 -140276 253500 -338802 107720 -3142 -200595 77685 146891 -495869 39922 -394820
9106a5668D1132a37550d9615E3376A1275c43212a08921C1054J88659bD155J7460
$$ -15668 41132 -137550 -49615 53376 11275 -343212 -108921 31054 219713 -2 4155 21615
9094B1615J7651b0219q8878j3836G1900B900b9034n3479j7525r0385M401A86906
$$ 21615 39266 -20219 -109097 -122933 71900 2900 -29034 -82513 -100038 -190423 -186022 186906
9081b10391k60118h5002a807q1570k8905C79302b83368D1434f7188m4247A69085
$$ -210391 -470509 -85002 -1807 -83377 -112282 379302 -283368 41434 -67188 -111435 169085
9069E8038c217A87988b21021c3653k59855j09981J44886e6551B87009i4650q2598
$$ 58038 -3217 187988 -221021 -33653 -293508 -403489 -258603 -56551 287009 -94650 -177248
9058a77248h4224o4894K2965l4748f0304A3028a44911r1765H1800k1823e5703
$$ -177248 -84224 -149118 -126153 -160901 -60304 13028 -144911 -236676 81800 59977 -55703
9046d06970E5496Q6177m9587a52788K0753E2635i1087F6621a71867b8382D27639
$$ -406970 55496 141673 92086 -152788 -132035 52635 -91087 66621 -171867 -28382 427639
9034a45203J0982J3667c0022l20823h3948D1204J26622j2718a74324d8790l25515
$$ -145203 -134221 -120554 -30022 -350845 -83948 41204 167826 155108 -174324 -48790 -374305
9023c74305a4035D1783h1039A49001b06776D91854g9191H5684j8268b14194N9343
$$ -374305 -14035 41783 -81039 149001 -206776 491854 -79191 85684 67416 -214194 -154851
9012a54851M4101E1767d03768J6677a49841A99771c42336a57592I6815b41581
$$ -154851 -110750 51767 -403768 -387091 -149841 199771 -342336 -157592 96815 -241581
9001d6284a6746j18550p7390K5305B46198j05194k4248c649p2181j28076l5870
$$ -46284 -16746 -135296 -212686 -187381 246198 141004 116756 -3649 -75830 -203906 -239776
8990b39776A58348a10422j55677n4135A4254c511j70915B25934p6497a17226F7952
$$ -239776 158348 -110422 -266099 -320234 14254 -3511 -174426 225934 149437 -117226 67952
8978b17355A17094b37590e6605l2607p451k46991a521A59155a35566d6044E99
$$ -217355 117094 -237590 -56605 -89212 -96663 -343654 -1521 159155 -135566 -46044 599
8966D8160a30795h74B31298j04314D8781J24957a46317L315B482K56339b6460
$$ 48160 -130795 -874 231298 126984 48781 173738 -146317 -143002 2482 258821 -26460
8954b1331j17800B67846a5394E7856a23210M4038E2708a77246o799L2076p7074
$$ -21331 -139131 267846 -15394 57856 -123210 -79172 52708 -177246 -184045 -151969 -229043
8943b29043J08080o7493A99212J8060c4303B62350A18505P3882A2322M19660G110
$$ -229043 -120963 -188456 199212 217272 -34303 262350 118505 192387 12322 431982 7110
8931a8905F4933K40215F6263j350n436b8482D53090M47625R85522N569004J4140589
$$ -18905 64933 305148 66263 64913 59477 -28482 453090 900715 1886237 7455241 21595830
8920B1595830E551070A028854C81599A41461k6819O0898j8040c37060e7890j12709
$$ 21595830 5551070 1028854 381599 141461 114642 175540 157500 -337060 -57890 -170599
8910a70599B92331j23193L13840A4152J10457f8956j79439a4940k21764k78364
$$ -170599 292331 169138 482978 14152 124609 -68956 -248395 -14940 -236704 -515068
8900e15068b4331H0619a16581l32516B24169G6209b01364J4575a9510p0675C75223
$$ -515068 -24331 80619 -116581 -449097 224169 76209 -201364 -186789 -19510 -90185 375223
8888a08458j73593R2452M731j09444B93813b41241A3141J9560J03416c88463J52314
$$ -108458 -282051 -189599 -184868 -294312 293813 -241241 13141 32701 136117 -388463 -236149
8877b36149A45170i2368C73263c4711m76673B22752q2422a14870a4687k20427
$$ -236149 145170 -92368 373263 -34711 -511384 222752 140330 -114870 -14687 -235114
8867b35114N3432h8061I5046g3244K5622l932j94431O7206L3210C5428A0990c18676
$$ -235114 -181682 -88061 95046 -73244 -47622 -51554 -245985 -178779 -145569 35428 10990 -318676
$$ [...]
##END NTUPLES=NMR SPECTRUM
##END=
