
##TITLE=UV1275_M13_1250-1169_70_7414729_PPFFXUzeCW
##JCAMPDX= 6.0         $$ Bruker NMR JCAMP-DX V2.0
##DATA TYPE= NMR SPECTRUM
##DATA CLASS= NTUPLES
##ORIGIN= BRUKER
##OWNER= Administrator
$$ 1.72 TOPSPIN		Version 2.1
$$ 2013-01-25 22:43:31.382 -0500  Administrator@X
$$ Compression mode = diff/dup
##.OBSERVE FREQUENCY= 400.02188249412
##.OBSERVE NUCLEUS= ^1H
##.ACQUISITION MODE= SIMULTANEOUS (DQD)
##.ACQUISITION SCHEME= undefined
##.AVERAGES= 64
##.DIGITISER RES= 22
##SPECTROMETER/DATA SYSTEM= spect
##.PULSE SEQUENCE= noesygpps1d.comp
##.SOLVENT NAME= COFFEE_meoh
##.SHIFT REFERENCE= INTERNAL, COFFEE_meoh, 1, 14.96119
##AUDIT TRAIL= $$ (NUMBER, WHEN, WHO, WHERE, PROCESS, VERSION, WHAT)
$$ ##TITLE= Audit trail, TOPSPIN		Version 2.1
$$ ##JCAMPDX= 5.01
$$ ##ORIGIN= Bruker BioSpin GmbH
$$ ##OWNER= Administrator
$$ $$ E:\/data/COFFEE/nmr/UV1275_M13_1250-1169_70_7414729_PPFFXUzeCW/12/pdata/1/auditp.txt
$$ ##AUDIT TRAIL=  $$ (NUMBER, WHEN, WHO, WHERE, PROCESS, VERSION, WHAT)
(   1,<2013-01-25 22:43:25.647 -0500>,<Administrator>,<X>,<go>,<TOPSPIN 2.1>,
      <created by zg
	started at 2013-01-25 22:31:54.913 -0500,
	POWCHK enabled, PULCHK disabled,
       configuration hash MD5:
       86 BA 57 50 F2 9D 5C 9B 26 00 A9 28 5F 66 2E 89
       data hash MD5: 64K
       36 05 00 95 2B 87 5F 4F E7 13 C9 4D 1C B6 15 17>)
(   2,<2013-01-25 22:43:28.679 -0500>,<Administrator>,<X>,<proc1d>,<TOPSPIN 2.1>,
      <Start of raw data processing
       efp LB = 0.3 FT_mod = 6 PKNL = 1 PHC0 = 0 PHC1 = 0 SI = 128K 
       data hash MD5: 128K
       AA 16 E6 6C 8F 79 D3 2B ED 98 7D 78 26 69 AC 6B>)
(   3,<2013-01-25 22:43:29.741 -0500>,<Administrator>,<X>,<proc1d>,<TOPSPIN 2.1>,
      <pk PHC0 = -81.22742 PHC1 = 0 
       data hash MD5: 128K
       E5 36 10 A0 A0 CC C5 F7 49 CD B5 EC FA 74 EF 66>)
(   4,<2013-01-25 22:43:30.382 -0500>,<Administrator>,<X>,<proc1d>,<TOPSPIN 2.1>,
      <abs ABSG = 1 
       data hash MD5: 128K
       B0 C5 03 92 A5 C1 F8 30 E0 DB 6C 00 A9 E2 3A C2>)
(   5,<2013-01-25 22:43:30.554 -0500>,<Administrator>,<X>,<proc1d>,<TOPSPIN 2.1>,
      <abs ABSG = 2 
       data hash MD5: 128K
       55 E4 1F 42 8C FF 37 55 D5 62 55 3F D1 E2 FC 2C>)
(   6,<2013-01-25 22:43:30.726 -0500>,<Administrator>,<X>,<proc1d>,<TOPSPIN 2.1>,
      <abs ABSG = 3 
       data hash MD5: 128K
       AA 73 05 B3 BD A1 04 D3 8D 83 0A BB A6 84 84 CB>)
(   7,<2013-01-25 22:43:30.913 -0500>,<Administrator>,<X>,<proc1d>,<TOPSPIN 2.1>,
      <abs ABSG = 4 
       data hash MD5: 128K
       2B EA 55 25 1C A9 31 2D 4B 6F 7F 87 D6 AA F9 58>)
(   8,<2013-01-25 22:43:31.101 -0500>,<Administrator>,<X>,<proc1d>,<TOPSPIN 2.1>,
      <abs ABSG = 5 
       data hash MD5: 128K
       DC 83 EE BC C5 70 03 0E 43 2D 7E 56 1A ED C7 ED>)
$$ ##END=
$$ 
$$ $$ hash MD5
$$ $$ 3C 81 34 B8 2D 4E 10 96 FD 74 D5 C9 15 15 DB AE
##$RELAX= 
##$RELAX= 
##$RELAX= 
##$RELAX= 
##$RELAX= 
##$RELAX= 
##$RELAX= 
##$RELAX= 
$$ Bruker specific parameters
$$ --------------------------
##$DU= <E:\>
##$EXPNO= 12
$$ [...]
##$TP07= 0
##$TPNAME0= <>
##$TPNAME1= <>
##$TPNAME2= <>
##$TPNAME3= <>
##$TPNAME4= <>
##$TPNAME5= <>
##$TPNAME6= <>
##$TPNAME7= <>
##$TPOAL= (0..7)
0.5 0.5 0.5 0.5 0.5 0.5 0.5 0.5
##$TPOFFS= (0..7)
0 0 0 0 0 0 0 0
##$TUNHIN= 0
##$TUNHOUT= 0
##$TUNXOUT= 0
##$USERA1= <user>
##$USERA2= <user>
##$USERA3= <user>
##$USERA4= <user>
##$USERA5= <user>
##$V9= 5
##$VALIST= <valist>
##$VCLIST= <CCCCCCCCCCCCCCC>
##$VD= 0
##$VDLIST= <DDDDDDDDDDDDDDD>
##$VPLIST= <PPPPPPPPPPPPPPP>
##$VTLIST= <TTTTTTTTTTTTTTT>
##$WBST= 2048
##$WBSW= 25
##$XGAIN= (0..3)
0 0 0 0
##$XL= 0
##$YL= 0
##$YMAX_a= 5871975
##$YMIN_a= -11334606
##$ZGOPTNS= <>
##$ZL1= 120
##$ZL2= 120
##$ZL3= 120
##$ZL4= 120
##$ABSF1= 14.96119
##$ABSF2= -5.596992
##$ABSG= 5
##$ABSL= 3
##$ALPHA= 0
##$AQORDER= 0
##$ASSFAC= 0
##$ASSFACI= 0
##$ASSFACX= 0
##$ASSWID= 0
##$AUNMP= <proc_prof1d_extract.lims>
##$AXLEFT= 0
##$AXNAME= <>
##$AXNUC= <1H>
##$AXRIGHT= 0
##$AXTYPE= 0
##$AXUNIT= <>
##$AZFE= 0.1
##$AZFW= 0.1
##$BCFW= 0
##$BC_mod= 0
##$BYTORDP= 0
##$COROFFS= 0
##$CY= 15
##$DATMOD= 1
##$DC= 0
##$DFILT= <>
##$DTYPP= 0
##$F1P= 0
##$F2P= 0
##$FCOR= 0.5
##$FTSIZE= 131072
##$FT_mod= 6
##$GAMMA= 0
##$GB= 0
##$INTBC= 1
##$INTSCL= 1
##$ISEN= 128
##$LB= 0.3
##$LEV0= 0
##$LPBIN= 0
##$MAXI= 10000
##$MC2= 0
##$MEAN= 0
##$ME_mod= 0
##$MI= 0
##$NCOEF= 0
##$NC_proc= -2
##$NLEV= 6
##$NOISF1= 0
##$NOISF2= 0
##$NSP= 0
##$NTH_PI= 0
##$NZP= 0
##$OFFSET= 14.96119
##$PC= 1
##$PHC0= -81.22742
##$PHC1= 0
##$PH_mod= 1
##$PKNL= yes
##$PPARMOD= 0
##$PPDIAG= 0
##$PPIPTYP= 0
##$PPMPNUM= 2147483647
##$PPRESOL= 1
##$PSCAL= 4
##$PSIGN= 0
##$PYNMP= <proc.py>
##$REVERSE= no
##$SF= 400.020009562228
##$SI= 131072
##$SIGF1= 0
##$SIGF2= 0
##$SINO= 400
##$SIOLD= 131072
##$SPECTYP= <>
##$SREGLST= <1H.CDCl3>
##$SSB= 0
##$STSI= 131072
##$STSR= 0
##$SW_p= 8223.68421052631
##$SYMM= 0
##$S_DEV= 0
##$TDeff= 65536
##$TDoff= 0
##$TI= <>
##$TILT= no
##$TM1= 0
##$TM2= 0
##$TOPLEV= 0
##$USERP1= <user>
##$USERP2= <user>
##$USERP3= <user>
##$USERP4= <user>
##$USERP5= <user>
##$WDW= 1
##$XDIM= 131072
##$YMAX_p= 438970828
##$YMIN_p= -16695
##$CURPLOT= <Network HP LaserJet P1505>
##$CURPRIN= <$Network HP LaserJet P1505>
##$DFORMAT= <normdp>
##$LAYOUT= <+/1D_H.xwp>
##$LFORMAT= <normlp>
##$PFORMAT= <normpl>
##$SURQMSG= 1
$$ End of Bruker specific parameters
$$ ---------------------------------
##NTUPLES= NMR SPECTRUM
##VAR_NAME=  FREQUENCY,     SPECTRUM/REAL,   SPECTRUM/IMAG
##SYMBOL=    X,             R,               I
##VAR_TYPE=  INDEPENDENT,   DEPENDENT,       DEPENDENT
##VAR_FORM=  AFFN,          ASDF,            ASDF
##VAR_DIM=   131072,        131072,          131072
##UNITS=     HZ,            ARBITRARY UNITS, ARBITRARY UNITS
##FACTOR=    0.0627417313425164, 1,          1
##FIRST=     8223.62146879497, -1505,        -51085
##LAST=      0,             -543,            -51527
##MIN=       0,             -16695,          0
##MAX=       8223.62146879497, 438970828,    0
$$ Real data points
##PAGE= N=1
##DATA TABLE= (X++(R..R)), XYDATA
$$ [...]
63900I79221o8737n8221m9017m1506l5913l1603k7608k3742k0548j8229j6302
63889E87795j4415j2940j2403j2766j3386j3536j2774j1109q907o653m738l457
63877D60711k898k623j821j29J887L468M658O125Q137J0366J2636J5272J8427
63864E34216K1512K3724K5006K6180K8011L0312L2181L3157L3815L4895L6104
63853H59113L6382L5365L3790L2236L0108K6417K1068J4820Q388K186l372q064
63841A088437j2275j6614k1073k5034k8075l0424l2572l4745l6741l8080l8401
63830G74403l7885l7040l5977l4268l1812k9366k7712k6687k5529k3913k2046
63819D42168k0036j7804j5540j3621j2143j0964j0110r636r174q243o943n871
$$ plain form
63900 979221 910484 852263 803246 761740 725827 694224 666616 642874 622326 604097 587795
63889 587795 573380 560440 548037 535271 521885 508349 495575 484466 475559 468906 464168 460711
63877 460711 457813 455190 453369 453240 455127 458595 463253 469378 477515 487881 500517 515789 534216
63864 534216 555728 579452 604458 630638 658649 688961 721142 754299 788114 823009 859113
63853 859113 895495 930860 964650 996886 1026994 1053411 1074479 1089299 1097687 1099873 1096501 1088437
63841 1088437 1076162 1059548 1038475 1013441 985366 954942 922370 887625 850884 812804 774403
63830 774403 736518 699478 663501 629233 597421 568055 540343 513656 488127 464214 442168
63819 442168 422132 404328 388788 375167 363024 352060 341950 332314 323140 314897 307954 302083
63807C02083n244m673l880l162k928l077l071k552j760j351j723k567l285l750
63793B59060m287m874m924m150l069k309j881j532j362j526j740j663j424j295
63779B23024j151p49k41M7P4j01n26r95r34k20L83K34k76m11j83q2k10m19q28
63760B16436j333j264l89K82j99j163j287o54m64r25r74j47P66J102J110R96M66
63743B12359l51o64k73L8j30lJ177K953M281M709M341L363K187J526J725K329
63727B39567K708K761K718K761L045L653M289M531M496M753N387N769N446M633
63713B96517L660K550J394M50l31j325k588l763m673n323n286m108k444j671k054
63698B71005k304j521m20O1L17J204K468L133K987K684K658K837L151L521L458
$$ plain form
63807 302083 296839 292166 288286 285124 282196 279119 276048 273496 271736 270385 268662 266095 262810 259060
63793 259060 254773 249899 244975 240825 237756 235447 233566 232034 230672 229146 227406 225743 224319 223024
63779 223024 221873 221124 220883 220930 221004 220903 220377 219382 218448 218228 218611 218845 218569 218158 217975 217893 217683 217264 216436
63760 216436 215103 213839 213450 213732 213533 212370 211083 210429 209965 209040 208066 207919 208685 209787 210897 211893 212359
63743 212359 212008 211344 211071 211109 210979 210976 212153 215106 219387 224096 228437 231800 233987 235513 237238 239567
63727 239567 242275 245036 247754 250515 253560 257213 261502 266033 270529 275282 280669 286438 291884 296517
63713 296517 300177 302727 304121 304571 304240 302915 300327 296564 291891 286568 281282 277174 274730 273059 271005
63698 271005 268701 267180 266760 266821 267138 268342 270810 273943 276930 279614 282272 285109 288260 291781 295239
63683B95239K502J008p4k16L36J043J431J218N31m0jN29J145J774K542L256L522
63666C15745L291K922K636K289J653P76k9n28q75j518k675m007n011n569n819
63651C03281n740n348n103n324n356m090j555P61J491P40l55p86k06J035K019
63636B75464K052J575J756K916M119M548M494M563M789N077N741O903P984Q465
63622C40446Q638Q973R371R688J0358J1741J3338J4538J5653J7420J9771K2024
63610E01959K4049K6351K9053L1613L3594L5055L6072L6349L5381L2673K7905
63599H50054K1267J3558N701j625p716j1709j3275j3194j2699j2383j2191j2199
63587G93589j2830j4413j6904j9927k2755k4566k5094k4852k4329k3238k1038
$$ plain form
63683 295239 297741 298749 298675 298459 298795 299838 301269 302487 303018 302978 302977 303506 304651 306425 308967 312223 315745
63666 315745 319036 321958 324594 326883 328536 329312 329283 328755 327880 326362 323687 319680 314669 309100 303281
63651 303281 297541 292193 287090 281766 276410 272320 270765 271526 273017 273757 273402 272616 272410 273445 275464
63636 275464 277516 279091 280847 283763 287882 292430 296924 301487 306276 311353 317094 323997 331981 340446
63622 340446 349084 358057 367428 377116 387474 399215 412553 427091 442744 460164 479935 501959
63610 501959 526008 552359 581412 613025 646619 681674 717746 754095 789476 822149 850054
63599 850054 871321 884879 890580 888955 881239 869530 856255 843061 830362 817979 805788 793589
63587 793589 780759 766346 749442 729515 706760 682194 657100 632248 607919 584681 563643
63576E63643j7913j4665j1865r530p521n755m087k347m68J542L600N368O429O834
63562E13265P130P624Q079Q283Q424Q622Q759R013R911J1422J2859J4144J6297
63549F43832J9936K4166K7898L1483L5968M1298M6393N0258N1647M8302L8377
63538A059558K3025O233q181j8530k4510k6197k4411k0821j6846j3068j0036q715
63526I17501r544j1877j4938j8727k3323k7933l1345l3039l3332l2661l1296k9484
63514F20002k7461k5340k3204k1169j9217j7189j5070j3001j1048r230p900p532
63502D22641p950q222p682o639n720m900l736k331j424j474k034k343k197j984
63488C64005j946j828j335o40j25K02N91R93J149J263J977L377M666N204N339
$$ plain form
63576 563643 545730 531065 519200 509670 502149 496394 492307 489960 489492 491034 494634 500002 506431 513265
63562 513265 520395 528019 536098 544381 552805 561427 570186 579199 589110 600532 613391 627535 643832
63549 643832 663768 687934 715832 747315 783283 824581 870974 921232 972879 1021181 1059558
63538 1059558 1082583 1088816 1080635 1062105 1037595 1011398 986987 966166 949320 936252 926216 917501
63526 917501 907957 896080 881142 862415 839092 811159 779814 746775 713443 680782 649486 620002
63514 620002 592541 567201 543997 522828 503611 486422 471352 458351 447303 438073 430173 422641
63502 422641 414691 406469 398787 392148 386428 381528 377792 375461 374037 372563 370529 368186 365989 364005
63488 364005 362059 360231 358896 358256 358131 358333 358924 359917 361066 362329 364306 367683 372349 377553 382892
63473C82892N574N521M478K668J009j89j400k743l614l739l757m298n019n115
63459C72268m449l696l524l882m130l705k692j717j200q82k18Q44J907K749L551
63444C51224M476N458O379P213P964Q786J0132J2384J5367J8619K2097K6255L1309
63431E27663L6683M1046M2615L9731L2041K1396J1006L317j142k871k112J089
63419G50462O105J1843J7708K3933L0678L7113M1786M3817M3335M0631L5353K7080
63407A109844J6557N745l520j0519j5245j7725j8167j7330j6136j5192j5018j6368
63395I86926j9682k4335k9053l2907l5619l7057l7020l5544l3007k9891k6649
63384F46162k3657k0970j8367j5804j3537j1556r387o882m609k973j436O33K863
$$ plain form
63473 382892 388466 393987 398465 401133 402142 401953 400553 397810 394196 390457 386700 382402 377383 372268
63459 372268 367819 364123 360599 356717 352587 348882 346190 344473 343273 342391 342173 343017 344924 347673 351224
63444 351224 355700 361158 367537 374750 382714 391500 401632 414016 429383 448002 470099 496354 527663
63431 527663 564346 605392 648007 687738 719779 741175 752181 755498 754356 751485 749373 750462
63419 750462 756567 768410 786118 810051 840729 877842 919628 963445 1006780 1047411 1082764 1109844
63407 1109844 1126401 1132146 1128626 1118107 1102862 1085137 1066970 1049640 1033504 1018312 1003294 986926
63395 986926 967244 942909 913856 880949 845330 808273 771253 735709 702702 672811 646162
63384 646162 622505 601535 583168 567364 553827 542271 532884 526002 521393 518420 516984 517617 520480
63371E20480M502N752P415R450J0953J1607J2172J3370J5079J6917J8852K1010
63359F67559K3443K6235K9343L2316L4733L6879L9328M1787M3038M2057L8558
63348A055276L2555K4278J4645N053l508j0610j5732j8353j8800j8141j7164j6131
63336A013368j5555j6263j8436k1498k5056k9064l2922l5494l6317l5884l4441
63325G12438l1669k7816k3894k0179j5738j0152m441M04M513P639P780L035n655
63312E96265j4892k1690k5026k5213k3163k0182j7350j4790j2132r445p167n504
63300C99711m604m852o151p291p018n501l926l004k740l182m256n091m736l487
63286C33872k469j973j409q34j145k457l521l359k399j577j134q87q26q81p81
$$ plain form
63371 520480 524982 530734 538149 547599 558552 570159 582331 595701 610780 627697 646549 667559
63359 667559 691002 717237 746580 778896 813629 850508 889836 931623 974661 1016718 1055276
63348 1055276 1087831 1112109 1126754 1131807 1128299 1117689 1101957 1083604 1064804 1046663 1029499 1013368
63336 1013368 997813 981550 963114 941616 916560 887496 854574 819080 782763 746879 712438
63325 712438 680769 652953 629059 608880 593142 582990 578549 578953 583466 591105 598885 601920 596265
63312 596265 581373 559683 534657 509444 486281 466099 448749 433959 421827 412382 405215 399711
63300 399711 395107 390255 384104 376813 369795 364294 360368 357364 354624 351442 347186 342095 337359 333872
63286 333872 331403 329430 328021 327187 326042 323585 320064 316705 314306 312729 311595 310708 309882 309001 308220
63271C08220n77o84r75p26J10M25n07j856k376k082j806j644r88J69J050J279
63255B97032J317J527J648J482J434J877K483K611K178J714J629J753J652J281
63241C21618J123J559K281K592K404K503L572N242O504O910O904P097P631Q291
63227C86231Q763Q768Q304P831P869Q263Q289P574O576N938N774N893O294O996
63213D89363P606P560O862O170O077O413O336N016K344r36l823n856p180p943
63199E18009q049p701p643q337r130q871p225m902k705q95N11J520K463L946O109
63184D67100Q360J0073J1257J2276J3226J3940J4351J4513J4494J4414J4467J4632
63172F23103J4604J4167J3483J2806J2155J1419J0650R941R226Q255O717M325
$$ plain form
63271 308220 307643 306959 305984 305258 305368 305793 305286 303430 301054 298972 297166 295522 294534 294703 295753 297032
63255 297032 298349 299876 301524 303006 304440 306317 308800 311411 313589 315303 316932 318685 320337 321618
63241 321618 322741 324300 326581 329173 331577 334080 337652 342894 349398 356308 363212 370309 377940 386231
63227 386231 394994 403762 412066 419897 427766 436029 444318 451892 458468 464406 470180 476073 482367 489363
63213 489363 496969 504529 511391 517561 523638 530051 536387 541403 543747 542811 538988 533132 525952 518009
63199 518009 509960 502259 494616 486279 477149 468278 461053 456151 453446 452551 453062 454582 457045 460991 467100
63184 467100 475460 485533 496790 509066 522292 536232 550583 565096 579590 594004 608471 623103
63172 623103 637707 651874 665357 678163 690318 701737 712387 722328 731554 739809 746526 750851
63160G50851J086k525n980r319j2906j6565j9474k1178k2118k2916k3584k3798
63148E71574k3363k2050j9656j6658j4176j2654j1196q988o731n704n836n856
63136D18706n127m197l430k344o71Q61J424J168Q92J060J581K219K797L155L315
63121D21409L581M300N411O298O179M946L582L408M604N904O140N560N127M992
63107D91441M550L756L384L803M349M199L349K493K310K987M146N102N481N511
63093E46861N513N472N439N774O386O227M586K472J559J916J996Q63q45k371l853
63078E87995n345o143n940n679o318p427p858p220n984m610l355k560k359k284
63064E14913j774q90o5O28J513K813M510O489Q495J0186J1398J2242J2798J3176
$$ plain form
63160 750851 751937 749412 743432 734113 721207 704642 685168 663990 641872 618956 595372 571574
63148 571574 548211 526161 506505 489847 475671 463017 451821 442833 436102 430398 424562 418706
63136 418706 413579 409382 405952 403608 402937 403798 405222 406390 407282 408342 409923 412142 414939 418094 421409
63121 421409 424990 429290 434701 440999 447178 452124 455706 459114 463718 469622 475762 481322 486449 491441
63107 491441 495991 499747 503131 506934 511283 515482 518831 521324 523634 526621 530767 535869 541350 546861
63093 546861 552374 557846 563285 569059 575445 581672 586258 588730 590289 592205 594201 595064 594219 591848 587995
63078 587995 582650 576507 570567 564888 558570 551143 543285 536065 530081 525471 522116 519556 517197 514913
63064 514913 513139 512249 512184 512812 514325 517138 521648 528137 536632 546818 558216 570458 583256 596432
63050E96432J3906J5639J8206K0549K1936K2699K3417K4016K4139K3873K3490
63039H28302K2909K1991K1034K0489K0423K0655K1079K1413K1051J9647J7646
63028A056639J5792J4280J2674J0376O987K551k341p055j1671j6649k1647k5484
63016A034452k7603k8715k9425k9183k7353k4549k1882j9446j6589j3277j0074
63005G86356o988l435O72M730Q411J1944J5326J8088K0091K1894K3905K5690K6454
62992I53138K5977K4832K3885K3621K3795K3741K3115K2263K1662K1243K0485
62981A207757J8970J6530J2999Q253K448l977j0480j6538k1851k6574l1079l5269
62969A121189l8521m0463m1328m1312m0117l7626l4511l1618k9024k6331k3562
$$ plain form
63050 596432 610338 625977 644183 664732 686668 709367 732784 756800 780939 804812 828302
63039 828302 851211 873202 894236 914725 935148 955803 976882 998295 1019346 1038993 1056639
63028 1056639 1072431 1086711 1099385 1109761 1116748 1119299 1116958 1109903 1098232 1081583 1059936 1034452
63016 1034452 1006849 978134 948709 919526 892173 867624 845742 826296 809707 796430 786356
63005 786356 779368 775933 776605 781335 789746 801690 817016 835104 855195 877089 900994 926684 953138
62992 953138 979115 1003947 1027832 1051453 1075248 1098989 1122104 1144367 1166029 1187272 1207757
62981 1207757 1226727 1243257 1256256 1264509 1266957 1262980 1252500 1235962 1214111 1187537 1156458 1121189
62969 1121189 1082668 1042205 1000877 959565 919448 881822 847311 815693 786669 760338 736776
62958G36776k1172j9435j8249j7437j6775j5936j4877j4006j3605j3362j2966
62947E58956j2710j2906j3082j2513j1351j0429j0044r632q778p832p282p027
62935D35370o624n961n418n344n490n174m089k784j927j343m63L92K04j001j714
62920C88634r43L17N52j35m86j18J76q3n13q10j112j330j034k92K07J10j31n2
62902C82957J82J92J8N2O21J778L297M840O191P244P715P241O104N321N497N932
62886D45182N468L932K197J061O80Q72J263J234L54j162k759m141n194n725n811
62871D37451n993o538o865o388n473m913m738m450m047l929m000l776l259k858
62857C70224k538j909j065n56n96r73j565k191k217j242M1N64K96K4j8k55o86
$$ plain form
62958 736776 715604 696169 677920 660483 643708 627772 612895 598889 585284 571922 558956
62947 558956 546246 533340 520258 507745 496394 485965 475921 466289 457511 449679 442397 435370
62935 435370 428746 422785 417367 412023 406533 401359 397270 394486 392559 391216 390753 391145 391349 390348 388634
62920 388634 387691 388008 388560 388425 387939 387821 387997 387914 387401 386591 385479 384149 383115 382823 383030 383140 383009 382957
62902 382957 383139 383331 383349 383401 384022 385800 389097 393937 400128 407372 415087 422328 428432 433753 439250 445182
62886 445182 450650 454582 456779 457840 458520 459392 460655 461889 462243 461081 458322 454181 448987 443262 437451
62871 437451 431458 424920 418055 411667 406194 401281 396543 392093 388046 384117 380117 376341 373082 370224
62857 370224 367686 365777 364712 364156 363560 362587 361022 358831 356614 355372 355413 355977 356273 356297 356279 356024 355338
62840C55338q06n98n43o49n71n83j226k018j819o54J77Nm25m44l08j38O39K020
62822C47397K830K237R07r4o23r33p26K54J355J681J242P32O04Q74J420J925K000
62805C63082J759J796K193K239J614J078J419K392L378M352N378N762M795L108
62791D04345K282L024M405N093M830M583N430P566J0243J2734J5009J7294J9294
62778E16132K0500K1211K2463K4779K7646L0397L2795L4564L5120L4282L2603
62767H32492L0507K7688K3750J8927J3710Q285K787k491p481j2509j7611k2237
62755H95817k5952k8900l1144l2215l1874l0888l0341l0420l0322k9180k6797
62744E67784k3736k0897j8745j6862j4666j2475j1214j0974j0739r758q376p196
$$ plain form
62840 355338 354532 353934 353391 352742 352171 351588 350362 348344 346525 345871 346048 346053 345628 345184 344876 344738 345377 347397
62822 347397 350227 352464 353371 353277 352654 351721 350995 351249 352604 354285 355527 356259 356863 357737 359157 361082 363082
62805 363082 364841 366637 368830 371069 372683 373761 375180 377572 380950 385302 390680 396442 401237 404345
62791 404345 406627 409651 414056 419149 423979 428562 433992 441558 451801 464535 479544 496838 516132
62778 516132 536632 557843 580306 605085 632731 663128 695923 730487 765607 799889 832492
62767 832492 862999 890687 914437 933364 947074 955359 958146 955655 948174 935665 918054 895817
62755 895817 869865 840965 809821 777606 745732 714844 684503 654083 623761 594581 567784
62744 567784 544048 523151 504406 487544 472878 460403 449189 438215 427476 417718 409342 402146
62732D02146o212n222m334l562k636j606r66p86m84J68O15O11P22J288J749J680
62716C83171J570J906K438L034M230O047P366P551P753R365J2009J4340J6032
62703D76812J7579J8856J9506K0372K2778K6491K9920L2371L4691L7542M0471
62692G77389M3017M5456M7913M9762N0379M9711M7789M4374L9406L3126K5613
62681A253935J6847P327k095j1156k0211k9137l7006m3074m7435n0458n2215n2683
62669I32639n1923m9922m6819m3324m0221l7409l4191l0583k7407k4958k2591
62658E23291j9961j7666j6061j4485j2376j0361r289q808p982o883o457o854p019
62645C79089o210n005m359m253l934l127k345k025j942j645j140q10q04q25n25
$$ plain form
62732 402146 395934 390712 386378 382816 380180 378574 377608 376822 376338 376506 377121 377732 378454 379742 381491 383171
62716 383171 384741 386647 389085 392119 396349 402396 409762 417313 425066 434431 446440 460780 476812
62703 476812 494391 513247 532753 553125 575903 602394 632314 664685 699376 736918 777389
62692 777389 820406 865862 913775 963537 1013916 1063627 1111416 1155790 1195196 1228322 1253935
62681 1253935 1270782 1278109 1276014 1264858 1244647 1215510 1178504 1135430 1087995 1037537 985322 932639
62669 932639 880716 830794 783975 740651 700430 663021 628830 598247 570840 545882 523291
62658 523291 503330 485664 469603 455118 442742 432381 423092 414284 406302 399419 392962 386108 379089
62645 379089 372879 367874 363515 359262 355328 352201 349856 347831 345889 344244 343104 342294 341490 340665 340140
62630C40140N4M72K50p55k122l031k892j898q36l79n67q89p41Q2J042J224L90
62613C29544n01l30P72J676J806J695J842J887J407P76O80J173J792K265K674
62598C49158L240M234N812P601Q869R397R741J0386J1247J2280J3834J5810J7149
62585D78758J6934J5534J3995J2674J1185R224O795L864N25k859o103r320j2138
62572E39068j3562j3406j3097j3931j5145j5044j3550j2246j1964j1807j0830
62561C94486r294p890o752n788n105m579l712k417j376j203j644j952j643p99
62547C40332N8K98j36m54Q9J150J734J551J148Q28L78m3K19J161J770J303K72
62530C51658m01n37n03l53K15J289K589L760M617N273O116P418Q962J0346J1602
$$ plain form
62630 340140 340194 340666 340916 340161 338039 335008 332116 330218 329382 329003 328436 327547 326806 326888 327930 329154 329544
62613 329544 329043 328713 329485 331161 332967 334662 336504 338391 339798 340574 341254 342427 344219 346484 349158
62598 349158 352398 356632 362444 370045 378914 388311 398052 408438 419685 431965 445799 461609 478758
62585 478758 495692 511226 525221 537895 549080 558304 565099 568963 569488 566629 560526 551206 539068
62572 539068 525506 512100 499003 485072 469927 454883 441333 429087 417123 405316 394486
62561 394486 385192 377302 370550 364762 359657 355078 351366 348949 347573 346370 344726 342774 341131 340332
62547 340332 340390 340688 340552 340098 340187 341337 343071 344622 345770 346598 346976 346933 347152 348313 350083 351386 351658
62530 351658 351257 350720 350217 349864 350079 351368 353957 357717 362334 367607 373723 381141 390103 400449 412051
62515D12051J3019J4540J5910J7431J9675K2407K4599K5839K6855K8252K9500
62504F50078K9822K9303K8470K7182K4778K0978J6017J0187L934j806o186r372
62492H23385j2218j4790j5989j4955j2387r855q031o195l511q7L474O983J0519
62479G46343J3723J6000J7255J7626J6579J3311Q295L358l66l554p147j0786j3853
62466H16784j7071k1557k6727l0643l2296l2296l1481l0196k8905k8007k6912
62455E10693k4540k1016j7638j4994j2533j0143q566p667o053l295r78l68m85
62442C82417J92J357J834J870K540L500L288J864R93J781L262L960L609K722J451
62427D16640l12k256l800m686n090n302n573n954o137n757m892m010l349k764
$$ plain form
62515 412051 425070 439610 455520 472951 492626 515033 539632 565471 592326 620578 650078
62504 650078 679900 709203 737673 764855 789633 810611 826628 836815 840749 838943 832757 823385
62492 823385 811167 796377 780388 765433 753046 743191 735160 728965 725454 725367 728841 735824 746343
62479 746343 760066 776066 793321 810947 827526 840837 849132 852490 852124 848570 841423 830637 816784
62466 816784 799713 778156 751429 720786 688490 656194 624713 594517 565612 537605 510693
62455 510693 486153 465137 447499 432505 419972 409829 401263 393596 387543 384248 383270 382902 382417
62442 382417 382609 383966 385800 387670 390210 393710 396998 398862 399855 401636 404898 408858 412467 415189 416640
62427 416640 416328 414072 410272 405586 400496 395194 389621 383667 377530 371773 366881 362871 359522 356758
62413C56758k203j910j968k034j811j494j456j659j641j083k02M68O18M39L19
62398C41141L30K37M0K14J124K400L249L336L055K933L098L373L613L775L873
62383C75791M043M548N517O724P780Q558R259J0037J0694J0916J0737J0543J0633
62370D85780J0953J1313J1651J1997J2444J3325J5118J7812K0639K2962K5259
62359F59253K8719L3748L9441M4664M9248N3823N8828O3960O8281P0532O9519
62348A240016O4677N6399M5754L3922K1922J0631P25p585j4657k1156k7546l3756
62336A369346l9308m3781m7098m9309n0307m9854m7887m4664m0774l7003l3923
62325H85438l1475k9127k6678k4551k3130k2126k1069k0133j9880k0271k0543
$$ plain form
62413 356758 354555 352645 350677 348643 346832 345338 343882 342223 340582 339499 339297 339765 340383 340822 341141
62398 341141 341471 341708 341748 341962 343086 345486 348735 352071 355126 358059 361157 364530 368143 371918 375791
62383 375791 379834 384382 389899 396623 404403 412961 422220 432257 442951 453867 464604 475147 485780
62370 485780 496733 508046 519697 531694 544138 557463 572581 590393 611032 633994 659253
62359 659253 687972 721720 761161 805825 855073 908896 967724 1031684 1099965 1170497 1240016
62348 1240016 1304693 1361092 1406846 1440768 1462690 1473321 1474046 1466461 1451804 1430648 1403102 1369346
62336 1369346 1330038 1286257 1239159 1189850 1139543 1089689 1041802 997138 956364 919361 885438
62325 885438 853963 824836 798158 773607 750477 728351 707282 687149 667269 646998 626455
62314F26455k0106j9178j8375j7972j7634j6671j4641j1985r838q915q621p793
62302D54726o152m529l683l412l006k090q82K00R56J560K250K878L055K867K955
62287D47693L573M048L776L243L348M086M699M825M655M214L434K808K949L573
62273E00924L890L954M540N655O381O476O925Q471J0656J2863J5230J7983K0863
62260F24811K3883K7780L2939L8636M4083M9486N5247O0855O5438O8836P1158
62249A163152P1716O9302O3367N4274M2771K9914J7178N748m274j3489k2211l0371
62237A447077l8025m5246n1649n6653o0146o2356o3197o2249n9414n5203n0394
62226H42545m5587m0970l6329l1536k7078k3708k1396j9204j6558j4046j2501
$$ plain form
62314 626455 606349 587171 568796 550824 533190 516519 501878 489893 480055 471140 462519 454726
62302 454726 448574 444045 440362 436950 433944 431854 430972 431172 432128 433688 435938 438816 441871 444738 447693
62287 447693 451266 455314 459090 462333 465681 469767 474466 479291 483946 488160 491594 494402 497351 500924
62273 500924 504814 508768 513308 518963 525344 531820 538745 547216 557872 570735 585965 603948 624811
62260 624811 648694 676474 709413 748049 792132 841618 896865 957720 1023158 1091994 1163152
62249 1163152 1234868 1304170 1367537 1421811 1464582 1494496 1511674 1517422 1513148 1499659 1477448 1447077
62237 1447077 1409052 1363806 1312157 1255504 1195358 1133002 1069805 1007556 948142 892939 842545
62226 842545 796958 755988 719659 688123 661045 637337 615941 596737 580179 566133 553632
62215E53632j1829j1340j0758j0213r613q659p417o251n402m963n048n495n687
62202D50957n106l906k528j093M13J686K435K958L860N262O687P603P878P879
62188D84985Q303R568J1168J2117J2189J2188J2693J3311J3586J3834J4361J4563
62176F32866J3672J1863R925Q258P079P058Q782J1953J5941K0746K6564L2776
62164H07483L8498M3805M9348N4857N9074O1153O1001N8383N2757M4337L4313
62153A365009K3826J3391L424n606j3674k1079k7761l3532l8931m4640m9868n2607
62141A117952n2036m9661m7336m5120m1964l7707l3279k9326k5633k1865j8109
62130G15916j4655j1755r637q389p803p557p414p071o111m457k704j577j006j46
$$ plain form
62215 553632 541803 530463 519705 509492 499879 491220 483803 477552 472150 467187 462139 456644 450957
62202 450957 445851 441945 439417 438324 438737 440423 442858 445816 449676 454938 461625 469228 477106 484985
62188 484985 493288 502856 514024 526141 538330 550518 563211 576522 590108 603942 618303 632866
62176 632866 646538 658401 668326 676584 683663 690721 699503 711456 727397 748143 774707 807483
62164 807483 845981 889786 939134 993991 1053065 1114218 1175219 1233602 1286359 1330696 1365009
62153 1365009 1388835 1402226 1405650 1400044 1386370 1365291 1337530 1303998 1265067 1220427 1170559 1117952
62141 1117952 1065916 1016255 968919 923799 881835 844128 810849 781523 755890 734025 715916
62130 715916 701261 689506 679869 671480 663677 656120 648706 641635 635524 631067 628363 626786 625780 625634
62116F25634J696M398P277R784J1812J3574J5286J6838J7496J6103J1926N623
62104G57447p76n158o664n760l368m58J674J713o13m241p883j0995j3302j4093
62090F87523j2819j0053p026m314j683R47L225N109P071R333J1536J3416J5241
62077G17506J7270J9328K1205K3101K5201K7142K8360K8791K8914K9137K9382
62066I95337K9312K8867K8587K9307L1365L4048L6043L6519L5563L3530L0230
62055A348708K5079J7988R887K200m170r257j3537j7357k0965k4732k8851l2976
62043A252017l6630l9893m3085m5757m6762m5664m3412m1171l9084l6686l3935
62032G99938l1144k8286k5201k2230j9925j8212j6488j4479j2385j0336q397p039
$$ plain form
62116 625634 627330 631728 639005 648789 660601 674175 689461 706299 723795 739898 751824 757447
62104 757447 756671 751513 744849 739089 735721 735263 736937 738650 738037 733796 725913 714918 701616 687523
62090 687523 674704 664651 657625 653311 651628 652575 655800 660909 667980 677313 688849 702265 717506
62077 717506 734776 754104 775309 798410 823611 850753 879113 907904 936818 965955 995337
62066 995337 1024649 1053516 1082103 1111410 1142775 1176823 1212866 1249385 1284948 1318478 1348708
62055 1348708 1373787 1391775 1401662 1403862 1399692 1390435 1376898 1359541 1338576 1313844 1284993 1252017
62043 1252017 1215387 1175494 1132409 1086652 1039890 994226 950814 909643 870559 833873 799938
62032 799938 768794 740508 715307 693077 673152 654940 638452 623973 611588 601252 592855 585816
62020E85816o893p798q702q786q303q015q155q268p903p211o667o342n693m284
62006D82796k490r87L24K147M502O436P381P916Q613Q934Q216O986O282O023N200
61991E58279L473J542m1j471l027m585o000p315q523r627j0846j2168j2852j2173
61977D74666j0538r112q376p831p100o445o048n593m853m006l236k558k142k166
61963C94662k265j828r28l13l20m78k87K90J186K288L041K812J960J743K780M307
61947D08650N327N811O331P156Q311J0025J2413J5030J7205J8788K0199K1821
61935E57067K3592K5062K5802K5789K5334K4575K3286K1503J9899J8962J8091
61924H08962J6189J3027R286N448J459k501n832q277j0030j0962j0578r016p184
$$ plain form
62020 585816 578923 571125 562423 553637 545334 537319 529164 520896 512993 505782 499115 492773 487080 482796
62006 482796 480306 479319 479643 481790 486292 492728 500109 508025 516638 525572 533788 540774 547056 553079 558279
61991 558279 561752 563294 563253 561782 558755 554170 548170 540855 532332 522705 511859 499691 486839 474666
61977 474666 464128 455016 446640 438809 431709 425264 419216 413623 408770 404764 401528 398970 396828 394662
61963 394662 392397 390569 389641 389328 389008 388530 388243 388533 389719 392007 395048 397860 399820 401563 404343 408650
61947 408650 413977 419788 426119 433275 441586 451611 464024 479054 496259 515047 535246 557067
61935 557067 580659 605721 631523 657312 682646 707221 730507 752010 771909 790871 808962
61924 808962 825151 838178 847464 852912 854371 851870 846038 837761 827731 816769 806191 797175 789991
61911G89991n506l287K34M822R622J3994J7545J9964K1250K1728K1485K0201J7723
61898I49766J4244R740L940k834r401j4750j8839k2052k4438k5870k6406k6084
61886H07016k4836k2956k1191j9963j8940j7674j6281j5129j4348j3942j3956
61875F07800j4233j4354j4003j2995j0995p888m558k388j625j023M48K364L806
61862E30356M721N606O548P480Q900J1372J4554J7483J9773K1972K4688K7928
61850G01381L1201L3983L6105L7833L9510M0973M1673M1372M0294L8451L5399
61839A118175L0913K5368J9064J1774L449n055j2488j8147k1934k3825k3694k1461
61827A082139j7176j1224m617J376O218J0375J4369J7916K0167K0357J8026J3128
$$ plain form
61911 789991 784485 781198 781432 786254 795876 809870 827415 847379 868629 890357 911842 932043 949766
61898 949766 964010 973750 977690 974856 965455 950705 931866 909814 885376 859506 833100 807016
61886 807016 782180 759224 738033 718070 699130 681456 665175 650046 635698 621756 607800
61875 607800 593567 579213 565210 552215 541220 533332 528774 526386 524761 523738 524186 526550 530356
61862 530356 535077 540683 547231 554711 563611 574983 589537 607020 626793 648765 673453 701381
61850 701381 732582 766565 802670 840503 880013 920986 962659 1004031 1044325 1082776 1118175
61839 1118175 1149088 1174456 1193520 1205294 1208743 1203688 1191200 1173053 1151119 1127294 1103600 1082139
61827 1082139 1064963 1053739 1049122 1050498 1056716 1067091 1081460 1099376 1119543 1139900 1157926 1171054
61815A171054O191j963j0783j9775k7889l3997l8160m1449m4200m5399m4328m1822
61803H27480l9153l6542l3540l0174k6805k3429k0025j7092j5084j3633j2135
61792E59868j0632r485q589p624o678n939n223m503m256m470l999j993M91J494
61778D88462O21o16q89l36K99Q11J373K006K596L055L238L086K793K568K337K071
61762E13475K166K906L764L873L193K566K553K778K563J783Q79K99Q4j68q35j770
61746E40109k419k501k247j856j210l68J81J95L9qk78r96j650j758j718k107k567
61729E18841k239j106N3Q63J652K587L302L541L496L362L114K835K778K990L177
61714E49246L067K659K111J571R72j0j569l232m173m290m353m842n347n480n594
$$ plain form
61815 1171054 1177245 1175282 1164499 1144724 1116835 1082838 1044678 1003229 959029 913630 869302 827480
61803 827480 788327 751785 718245 688071 661266 637837 617812 600720 585636 572003 559868
61792 559868 549236 539751 531162 523538 516860 510921 505698 501195 496939 492469 488470 486477 486968 488462
61778 488462 489083 488467 487578 487242 487541 488352 489725 491731 494327 497382 500620 503706 506499 509067 511404 513475
61762 513475 515641 518547 522311 526184 529377 531943 534496 537274 539837 541620 542499 542798 542882 542714 541879 540109
61746 540109 537690 535189 532942 531086 529876 529508 529689 529884 529923 529915 529637 528641 526991 525233 523515 521408 518841
61729 518841 516602 515496 515549 516412 518064 520651 523953 527494 530990 534352 537466 540301 543079 546069 549246
61714 549246 552313 554972 557083 558654 559626 559616 558047 554815 550642 546352 541999 537157 531810 526330 520736
61699E20736n926n895n074m176m058m241l678k546k063k605l187k981k286j794
61685D70226j697j873k269k742k936k541j537l10L71j05j323k001j484n50k14
61670D49015m09m96l94k80J00P67Q14l89j803j927r73m07n67l99M89J133R06L52
61652D45532K1k35l81L9Q82J320J246J529K420L115L363M072N518O399N761M639
61636D85240M468M834M181K144k30k123l574m615m993m798m543m460m361m168
61622D63002l918l365k202p68J23J15k99m53j69K49L94Mq69j900k790l540m374
61605D39240n412o584p699q517q833q631q079p413o800o316n858n183m199l180
61591C46536k417j870j383j160j525k307k825k652k065j713j971k634l064k818
$$ plain form
61699 520736 514810 508915 503841 499665 495607 491366 487688 485142 483079 480474 477287 474306 472020 470226
61685 470226 468529 466656 464387 461645 458709 456168 454631 454321 454692 454587 453264 451263 449779 449229 449015
61670 449015 448606 448110 447716 447436 447536 448303 449117 448728 446925 444998 444025 443618 443051 442652 443141 444274 445180 445532
61652 445532 445553 445318 444937 444976 445858 447178 448424 449953 452373 455488 458851 462923 468441 474840 480601 485240
61636 485240 489708 494542 498723 500867 500637 498514 494940 490325 485332 480534 475991 471531 467170 463002
61622 463002 459084 455719 453517 452749 452872 452987 452688 452235 452066 452315 452709 452713 451844 449944 447154 443614 439240
61605 439240 433828 427244 419545 411028 402195 393564 385485 378072 371272 364956 359098 353915 349716 346536
61591 346536 344119 342249 340866 339706 338181 335874 333049 330397 328332 326619 324648 322014 318950 316132
61577C16132k236k112k591k866k371j671j504j543j049k92j89p34r70n80k80m65
61561B94679n94l17q8k27k62J64O26P34Q05J120J235P65K72N71J519K193K045
61544C05240J345O93M67O32P78N76K59L54Q34J139J124J325K028K747K969K798
61528C25308K473J851Q44j96r37j531k154k670l009l373l666l384k460j585j206
61513C04305q83k23K97J52k39k31o5l66q97q52k08K15Ql19k56O6K18jn50j170
61493B99001j376q65J7N59N10K64K07K92L27L38M26M82K48l54r83j110n98pm4
61474B97334o10p75J43J675K585K006K32j430j656l30J164J316J73q35p32K8N48
61457C00836O71P16P23N83M81O03O85L69j74m09o9O70J409J721J402P75M54O46
$$ plain form
61577 316132 313896 311784 309193 306327 303956 302285 300781 299238 298189 297897 297708 296974 296004 295424 295144 294679
61561 294679 294085 293768 293680 293453 293191 293355 293981 294715 295520 296640 297875 298640 298912 299483 301002 303195 305240
61544 305240 306585 307278 307745 308377 309155 309731 309990 310344 311178 312317 313441 314766 316794 319541 322510 325308
61528 325308 327781 329632 330476 330280 329343 327812 325658 322988 319979 316606 312940 309556 307096 305511 304305
61513 304305 303422 303199 303496 303648 303409 303178 303113 302747 301850 300998 300790 301005 301013 300694 300438 300504 300722 300721 300171 299001
61493 299001 297625 296760 296777 297336 297846 298110 298317 298609 298936 299274 299700 300182 300430 300076 299093 297983 297385 297378 297334
61474 297334 296724 295949 296092 297767 300352 302358 302590 301160 299504 299174 300338 301654 301827 300992 300260 300288 300836
61457 300836 301507 302223 302946 303529 304010 304613 305298 305667 305493 305084 305015 305685 307094 308815 310217 310992 311446 312092
61439C12092J039J432J989K658L054L148L459M117M469M041L264K738K388J962
61425C51850J675J719J646J100O21R24J820K624L275M071M693M387L097J568M30
61410C85500k17m38l83m71r65j609k173l017m320n228m747l282k193j925j697
61395C52835j029m59m14m95l18j56j88J9O63J046M92n62j056n91L05J010J331
61378C52433J340J138Q59O80P47J124J728K315K662K771K713K423J882J441J505
61363C77761J961K296K324K383K729L170L491L795M205M527M563M515M847N760
61349D28327P028Q260R295J0227J1098J1613J1413J0619R772R043P895N976L945
61336E44511K799K589K445J783Q02k10j303k419l257l860m706n846o549o288n536
$$ plain form
61439 312092 313131 314563 316552 319210 322264 325412 328871 332988 337457 341498 344762 347500 349888 351850
61425 351850 353525 355244 356890 357990 358611 359535 361355 363979 367254 371325 376018 380405 383502 385070 385500
61410 385500 385283 384845 384462 383991 383026 381417 379244 376227 371907 366679 361932 358650 356457 354532 352835
61395 352835 351806 351347 350933 350438 350120 349964 349776 349795 350458 351504 351996 351434 350378 349787 350092 351102 352433
61378 352433 353773 354911 355770 356450 357197 358321 360049 362364 365026 367797 370510 372933 374815 376256 377761
61363 377761 379722 382018 384342 386725 389454 392624 396115 399910 404115 408642 413205 417720 422567 428327
61349 428327 435355 443615 452910 463137 474235 485848 497261 507880 517652 526695 534590 540566 544511
61336 544511 547310 549899 552344 554127 554929 554719 553416 550997 547740 543880 539174 533328 526779 520491 514955
61321E14955n037m693l882k583j477q82l20O47J640J943J502J056J299K192L205
61306E09565M035M858N998P576R536J1755J3857J5144J4991J3332J0583P165L423
61293F31818j49k982m926o354p547q240q049p223o629o808p304p143n990m532
61279E47942l540k873j831l16R64J651K394L865N606O591O662O664P139P657P618
61264E96193P091O516O131O075O611P726Q829R386R793J1016J3275J5496J6229
61251G20367J4955J2316R277O292L239o7l418o330q499j0056j1264j2090j2260
61238G02462j1791j1185j0833j0399r210p282n519m611m217l637k944k704k752
61225F15378k158o31R34J742K275L411M924N700N235M173L348L072L333M001M566
$$ plain form
61321 514955 509918 505225 501343 498760 497283 496401 496081 496728 498368 500311 501813 502869 504168 506360 509565
61306 509565 513600 518458 524456 532032 541568 553323 567180 582324 597315 610647 621230 628395 631818
61293 631818 631669 628687 623761 617407 609860 601620 593571 586348 579719 572911 565607 558464 552474 547942
61279 547942 544402 541529 539698 539382 540346 541997 544391 548256 553862 560453 567115 573779 580918 588575 596193
61264 596193 603284 609800 615931 622006 628617 636343 645172 654558 664351 675367 688642 704138 720367
61251 720367 735322 747638 756915 763207 766446 766379 762961 756631 748132 738076 726812 714722 702462
61238 702462 690671 679486 668653 658254 649044 641762 636243 631632 627415 623778 620834 618130 615378
61225 615378 613220 612589 613523 615265 617540 620951 625875 631575 636810 640983 644331 647403 650736 654737 659303
61210F59303M369L406K447K078K025J779J463J583K141K520K280J779J873L196
61196F92242N694Q777J1766J4288J6285J7880J9335K0936K2627K3780K3604K1802
61184H99016J8634J4484R862N730L209K588K980L228K867J964N50j280l022m096
61170I56714m528m858n446o250p243q619j0520j2808j5151j7117j8347j8885j9250
61157H07692j9779j9987j9135j7285j5298j3674j2072j0103p968n929l771j290
61145F61401J072K619L161K949K045K71k370n534q675j1054j1970j1403j0174
61132F12338r013p705n671l110q88O41J946L429M912O211P687R879J2834J5986
61118F49476J8583K0267K1455K2974K5018K6746K7314K7013K6774K6874K6852
$$ plain form
61210 659303 663672 667078 669525 671603 673628 675407 676870 678453 680594 683114 685394 687173 689046 692242
61196 692242 697936 706713 718479 732767 749052 766932 786267 807203 829830 853610 877214 899016
61184 899016 917650 932134 941996 947726 950935 953523 956503 959731 962598 964562 965112 963832 960810 956714
61170 956714 952186 947328 941882 935632 928389 919770 909250 896442 881291 864174 845827 826942 807692
61157 807692 787913 767926 748791 731506 716208 702534 690462 680359 672391 666462 662691 661401
61145 661401 662473 665092 668253 671202 673247 673518 671148 665614 656939 645885 633915 622512 612338
61132 612338 603325 595620 589949 586839 585951 586592 588538 591967 596879 603090 610777 620656 633490 649476
61118 649476 668059 688326 709781 732755 757773 784519 811833 838846 865620 892494 919346
61107I19346K6508K6039K5313K3920K2071K0477J9185J7459J5006J2321R512N848
61095A143005J009m157q772j3009j7295k1221k4014k5598k6480k6967k7140k7165
61083I22196k7089k6615k5541k4109k2657k1280k0028j8870j7365j5072j2469
61072F91101j0624r677q617o916n279m333l703k943k345k039j383o6J217J916
61058F36309K485L307L882L934M286N623P424R023J0586J2166J3090J3300J3984
61045G39399J5735J7482J8428J9568K1819K4211K5541K6353K7541K8500K8541
61034I93118K8716L0100L1662L1984L1761L2396L3507L4224L5485L8448M1974
61023A363375M4405M6576N0098N3950N5821N5738N5327N4882N4418N6258O2806
$$ plain form
61107 919346 945854 971893 997206 1021126 1043197 1063674 1082859 1100318 1115324 1127645 1137157 1143005
61095 1143005 1144014 1139857 1131085 1118076 1100781 1079560 1055546 1029948 1003468 976501 949361 922196
61083 922196 895107 868492 842951 818842 796185 774905 754877 736007 718642 703570 691101
61072 691101 680477 670800 662183 655267 649988 645655 641952 639009 636664 634625 633242 633176 634393 636309
61058 636309 638794 642101 645983 649917 654203 659826 667250 676273 686859 699025 712115 725415 739399
61045 739399 755134 772616 791044 810612 832431 856642 882183 908536 936077 964577 993118
61034 993118 1021834 1051934 1083596 1115580 1147341 1179737 1213244 1247468 1282953 1321401 1363375
61023 1363375 1407780 1454356 1504454 1558404 1614225 1669963 1725290 1780172 1834590 1890848 1953654
61012A953654P2948Q4249R7129J12873J29392J43890J58171J76426J99789K28899
61002C357420K69283L26836M00168M86151N91020P26045Q95528J103718J370578
60993I526747J717119K128550K556625K967839L347129L609565L541001K923878
60985C2318453J783331M77799n18484r42869q51297m46183J09638O71935R97249
60976C3599572P89741o1224j319883k533012l333089l621930l512854l170881
60968A6836440k724296k263444j848709j502456j217036r81564p93222o46303
60960D859410n27706m28462l49184k90497k46839k12750j87108j68044j50792
60951B298028j33630j19504j09087r8270q5054p2792o3803n5796m7650m2957m4038
$$ plain form
61012 1953654 2026602 2110851 2207980 2320853 2450245 2594135 2752306 2928732 3128521 3357420
61002 3357420 3626703 3953539 4353707 4839858 5430878 6156923 7052451 8156169 9526747
60993 9526747 11243866 13372416 15929041 18896880 22244009 25853574 29394575 32318453
60985 32318453 34101784 34579583 34061099 33118230 32266933 31820750 31930388 32602323 33599572
60976 33599572 34389313 34328089 33008206 30475194 27142105 23520175 20007321 16836440
60968 16836440 14112144 11848700 9999991 8497535 7280499 6298935 5505713 4859410
60960 4859410 4331704 3903242 3554058 3263561 3016722 2803972 2616864 2448820 2298028
60951 2298028 2164398 2044894 1935807 1837537 1752483 1679691 1615888 1560092 1512442 1469485 1425447
60940A425447m7519m9549n0822n2831n3590n1172m7647m5515m3412l9178l4217
60929I09995l1075k9291k7075k4720k3166k1411j8498j5808j4553j3197j0277
60918F80924p445o738o949n853m069l567m068l987l480l580l700k719j328p89
60904F22652o92k61m34k134m004m366l980m376n005m684m360n512p160p322o475
60889E61887o608p731q150p519o868o241m927l550l382l945l708k800k664l401
60875D90393l743l290k650j704L6J721K039J517J823L053L806L756L974M774N295
60860E10800N314N488N813N615N120N293O058O326N824N319N060M518L664L035
60846E83247K621K069J739K162K638J917J21j492k506l632n162o599p663q380
$$ plain form
60940 1425447 1377928 1328379 1277557 1224726 1171136 1119964 1072317 1026802 983390 944212 909995
60929 909995 878920 849629 822554 797834 774668 753257 734759 718951 704398 691201 680924
60918 680924 673479 666741 659792 653939 649870 646303 642235 638248 634768 631188 627488 624769 623441 622652
60904 622652 621960 621699 621265 619131 615127 610761 606781 602405 597400 592716 588356 582844 575684 568362 561887
60889 561887 555279 547548 539398 531879 525011 518770 513843 510293 506911 502966 499258 496458 493794 490393
60875 490393 486650 483360 480710 479006 479042 480763 482802 484319 486142 489195 493001 496757 500731 505505 510800
60860 510800 516114 521602 527415 533030 538150 543443 549501 555827 561651 566970 572030 576548 580212 583247
60846 583247 585868 587937 589676 591838 594476 596393 596514 595022 592516 588884 583722 577123 569460 561080
60832E61080q409p562o699o642o608n273l069j651j272m55J501L401M003L657
60818E26002L589M471O047P524Q225Q365Q888J0132J1295J1806J2334J3549J4944
60805F47171J5984J7347J9552K1470K1842K1383K1582K2199K1833K0399J9042
60794H69804J7986J6426J4220J1852R003N039P22k425m336o261q635j0900j3160
60781H99335j5977j8575j9329j8300j7387j7646j8197j8079j7459j6666j5645
60770G06075j4753j4587j4689j3891j2180j0816j0355j0074r562r326r487r384
60758E66971q908q828r373r772r551r104q668p921o926o259o000n618n013m541
60744D60489m060l137k133j793j882j642j451k428m367n689n603m794l846k634
$$ plain form
60832 561080 552671 545109 538410 531768 525160 519887 516818 515167 513895 513440 514941 518342 522345 526002
60818 526002 529591 534062 540109 547633 555858 564223 573111 583243 594538 606344 618678 632227 647171
60805 647171 663155 680502 700054 721524 743366 764749 786331 808530 830363 850762 869804
60794 869804 887790 904216 918436 930288 939291 944330 945052 942627 938291 932030 923395 912495 899335
60781 899335 883358 864783 845454 827154 809767 792121 773924 755845 738386 721720 706075
60770 706075 691322 676735 662046 648155 635975 625159 614804 604730 595168 585842 576355 566971
60758 566971 558063 549235 539862 530090 520539 511435 502767 494846 487920 481661 475661 470043 465030 460489
60744 460489 456429 453292 451159 449366 447484 445842 444391 441963 437596 431907 426304 421510 417664 415030
60730D15030j460j066j199p82J79M91k5n3J013K056K122J712J430Q49l56j409
60714D18532j553j121q29q62j268k270l678m793n318n497n311m572l843l976m586
60699C69055m370l182k323k458k777k641k542k783k659j794r77r26j238j269j000
60684C36116m71N60J855K552K383K085K193K455K679L164L890M297M192L900L447
60669C75297K701K215K579L007K141L45o13l27j52n58k40J284K362J745O72R97
60653C93455K641M216N001N089M658M182M459N533O442O617O425N879M237J635
60639D60469m65j328k002l401m807n340n426n579n287m308l668l927l879k515
60625D08537r80q69j694j852j229j000j418j646j440j402j701j869j764j616j290
$$ plain form
60730 415030 413570 412504 411305 410523 410702 411193 411168 411115 412128 414184 416306 418018 419448 420297 419941 418532
60714 418532 416979 415858 415029 414167 412899 410629 406951 402158 396840 391343 386032 381460 377617 373641 369055
60699 369055 364685 361503 359180 356722 353945 351304 348762 345979 343320 341526 340549 339623 338385 337116 336116
60684 336116 335645 336205 338060 340612 342995 345080 347273 349728 352407 355571 359461 363758 367950 371850 375297
60669 375297 377998 380213 382792 385799 387940 388285 387672 387345 387193 386635 386395 387679 390041 391786 392458 393455
60653 393455 396096 400312 405313 410402 415060 419242 423701 429234 435676 442293 448718 454597 458834 460469
60639 460469 460004 458676 456674 453273 448466 443126 437700 432121 426834 422526 418858 414931 411052 408537
60625 408537 407557 406688 404994 403142 401913 400913 399495 397849 396409 395007 393306 391437 389673 388057 386767
60610C86767n24L63Q37R25Q75N09k73q86q08m50m81p94r15q82q58n11L53J156
60592C84403J360J387J794K218K018J427J097J010P79N40O41Q77R13J075J839
60577D03378K903L551L686L732L871M010M264M849N801P177R114J1409J3618J5820
60563D97183J8543K1649K4153K5593K6487K6969K6016K2797J7705J1456M203l566
60551G19188j0460j5444j8761k0636k0207j6967j2311q286n375k632N14L787O941
60538E99351J0147J3765J8286K3932K9772L4131L6389L7378L7397L5160K9678
60527I05386K1896J3329M344m845j2728j7733k0060k0770j9949j7380j4218j2156
60515H05116j1343j0695r811r098q364o938m898k799n03K360N105O647P237Q159
$$ plain form
60610 386767 386243 386606 387443 388368 389243 389752 389479 388593 387785 387335 386854 386060 385145 384263 383405 382894 383247 384403
60592 384403 385763 387150 388944 391162 393180 394607 395704 396714 397493 398033 398674 399551 400464 401539 403378
60577 403378 406281 409832 413518 417250 421121 425131 429395 434244 440045 447222 456336 467745 481363 497183
60563 497183 515726 537375 561528 587121 613608 640577 666593 689390 707095 718551 722754 719188
60551 719188 708728 693284 674523 653887 633680 616713 604402 596116 590741 588109 588623 592410 599351
60538 599351 609498 623263 641549 665481 695253 729384 765773 803151 840548 875708 905386
60527 905386 927282 940611 944955 940110 927382 909649 889589 868819 848870 831490 817272 805116
60515 805116 793773 783078 773267 764169 755805 748867 743969 741170 740667 743027 748132 754779 762016 770175
60501G70175R977J2397J5662K0546K7060L4406M2275N1001O0552P0462Q0515R0321
60489A285349R8468J03273J04154J01218R3987Q1994O6219M8348K8763O829j6849
60478B001753m0089o1175p9690r5052j05806j10998j11157j07424j00715r2090
60468A097557q2880p3905o5204n6843m9280m2744l7000l1909k7551k3761k0260
60457E86220j7256j5178j3777j2280j0431q700p515o912o828o994o756n795m843
60444D62955m799n363n408m594l560k713j873j142r63j221j153m59L38P22O88
60429D31455L63j47m96m04k27n66j358k042k509l076l667l821l506l125k697j824
60413D02353n20O17J076P73j31j176j585r62J40R42J408J966K606K947K784J988
$$ plain form
60501 770175 780152 792549 808211 828757 855817 890223 932498 983499 1044051 1114513 1195028 1285349
60489 1285349 1383817 1487090 1591244 1692462 1786449 1868443 1934662 1983010 2011773 2018602 2001753
60478 2001753 1961664 1900489 1820799 1725747 1619941 1508943 1397786 1290362 1189647 1097557
60468 1097557 1014677 940772 875568 818725 769445 726701 689701 657792 630241 606480 586220
60457 586220 568964 553786 540009 527729 517298 508598 501083 494171 487343 480349 473593 467798 462955
60444 462955 458156 452793 447385 442791 439231 436518 434645 433503 432540 431319 430166 429707 430045 430767 431455
60429 431455 431818 431671 431175 430771 430544 429978 428620 426578 424069 420993 417326 413505 409999 406874 404177 402353
60413 402353 401833 402450 403526 404299 404168 402992 401407 400445 400585 401527 402935 404901 407507 410454 413238 415226
60397D15226M50j150j328L61K186K206Q33N9N59J200J239J281J859K445K382J734
60381D31542Q56nm59j92L95N24J36j20P4M41P93J177J346R62K70r2R4O23J304
60362D39669J785J450L91j48O77J891K023J261Q87J153J280J196J559K173K138
60347D59385J592J662K540L232L401L835M735N163M656L918L320K178R8k128l656
60332D93931m457m606l872k554j677j732k088k091j812j415p71m5L74P17J572
60317D69474K593K679J798J261J742K380K418K383K931L754M537N847Q143J0818
60303E22758J3191J5662J9058K3517K8840L4976M1098M4755M3305L6316K5915
60292H49391J4715L770p397j9071k9871l7259l9760l8304l4969l0920k6366k1866
$$ plain form
60397 415226 415676 414526 413198 413559 415745 417951 418784 418843 419402 420602 421841 423122 424981 427426 429808 431542
60381 431542 432398 432393 431934 431742 432137 432661 432797 432677 432751 433192 433985 435162 436508 437470 437740 437648 437742 438365 439669
60362 439669 441454 442904 443295 443147 443824 445715 447738 448999 449886 451039 452319 453515 455074 457247 459385
60347 459385 460977 462639 465179 468411 471812 475647 480382 485545 490201 494119 497439 499617 499715 497587 493931
60332 493931 489474 484868 480996 478442 476765 475033 472945 470854 469042 467627 466856 466811 467185 467902 469474
60317 469474 472067 474746 476544 477805 479547 481927 484345 486728 489659 493413 497950 503797 511940 522758
60303 522758 535949 551611 570669 594186 623026 658002 699100 743855 787160 823476 849391
60292 849391 864106 867876 860479 841408 811537 774278 734518 696214 661245 630325 603959 582093
60280E82093j8351j5842j3459j0881q698p219o045n039m604m680m559m071l825
60267D74820l969l772k892j966j479j030l47N7k05o37o05k03J57L18K14j67l97
60250D57897J06J139J829J783J388Q56O2n83k81P50J201M07p58j253j071o63j27
60233D62682M96R58J302J805K244K057J533J699K788L858M269M328M140L123J356
60218D98638Q1J08P27R25P37O89Q79J276K042K969L401L239L113L232L072K574
60202E27702K482K920K967K206J476J414J543J562K070L066L165J537n12j279
60188E52319r50q55j340j782k065k589l220l433l237l044k923k747k730k990l061
60173E15353k531j695r65k09P02J289J168P70O28N97M15M24Q80J205P22l31j204
$$ plain form
60280 582093 563742 547900 534441 523560 514862 507643 501598 496559 491955 487275 482716 478645 474820
60267 474820 470851 467079 464187 462221 460742 459712 459365 459422 459217 458580 457975 457772 457929 458247 458461 458294 457897
60250 457897 458003 459142 460971 462754 464142 464998 465060 464477 464196 464946 466147 466554 465796 464543 463472 462809 462682
60233 462682 463178 464136 465438 467243 469487 471544 473077 474776 477564 481422 485691 490019 494159 497282 498638
60218 498638 498719 498827 499554 500479 501216 501905 502784 504060 506102 509071 512472 515711 518824 522056 525128 527702
60202 527702 530184 533104 536071 538277 539753 541167 542710 544272 546342 549408 552573 554110 553598 552319
60188 552319 551369 550514 549174 547392 545327 542738 539518 536085 532848 529804 526881 524134 521404 518414 515353
60173 515353 512822 511127 510162 509953 510655 511944 513112 513882 514510 515107 515522 515946 516826 518031 518753 518422 517218
60156E17218j533j289m37O66J243J138J269K255L323L404K748K559L469N106O802
60141E47941Q061Q670Q896R253R735R738R038Q133P375O546N630N031M658L744
60127F52449K096M34j023l072n877q030q257p062n671m348k819j431o84k72K77
60112F06710P02O19M74Q18J372J667J974K629L135K876K131J406M89r06k271l091
60096F20734l777m777n419m840l470k450j950j226L5J443K697L808M657N137N448
60081F16050N776O009O145O339O190M859K383q6j994m117o823q871r117q270p710
60066F06763p579p339p237p668p891o962n482m969n750o762p102o726n963n364
60052E13969n537o179n904m025j772o20k54N30J685K232K130K233K706K916K718
$$ plain form
60156 517218 515685 514396 513959 514625 515868 517006 518275 520530 523853 527257 530005 532564 536033 541139 547941
60141 547941 556002 564672 573568 582821 592556 602294 611332 619465 626840 633386 639016 644047 648705 652449
60127 652449 654545 654979 653956 650884 645007 636977 628720 621658 615987 611639 608820 607389 606705 606433 606710
60112 606710 607412 608031 608505 609323 610695 612362 614336 616965 620100 622976 625107 626513 627002 626096 623825 620734
60096 620734 616957 612180 606761 601921 598451 596001 594051 592825 592860 594303 597000 600808 605465 610602 616050
60081 616050 621826 627835 633980 640319 646509 651368 653751 653665 651671 647554 640731 631860 622743 614473 606763
60066 606763 599184 591845 584608 576940 569049 562087 556605 551636 545886 539124 532022 525296 519333 513969
60052 513969 508432 502253 496349 492324 490552 489932 489678 490208 491893 494125 496255 498488 501194 504110 506828
60037E06828K565K616K763L168L705L464J957K07o43j131k435m173m928m535m214
60022E05214m659n531o645p979q716p922o294n605o218o628n726m199l237l012
60008D22843k874k241r73N40J524J626J341J271J345J353J596K131K160J211K00
59993D33053K18R52J440J676K096K350K018J904K914M286M648M286M498N145M871
59978D76355L570K591K465K300J595Q02L7j030j830j302J42Q63N61O50J718K493
59962D91980K100J453J531J867J760J581J793J826J087J38j18J57O8p60j889k632
59946E01942k539j668o67j87j95l29o92j592k667l221l231l199l137k709k183
59931D73726k138k318j904q62J03Q18J698K583K810K444K215K198J886J539K061
$$ plain form
60037 506828 509393 512009 514772 517940 521645 525109 527066 527273 526630 525499 523064 518891 513963 509428 505214
60022 505214 500555 495024 488379 480400 471684 463762 457468 451863 445645 439017 433291 429092 425855 422843
60008 422843 419969 417728 416755 417295 418819 420445 421786 423057 424402 425755 427351 429482 431642 432853 433053
59993 433053 433271 434223 435663 437339 439435 441785 443803 445707 448621 452907 457555 461841 466339 471484 476355
59978 476355 479925 482516 484981 487281 488876 489678 489715 488685 486855 485553 485695 486558 487119 487769 489487 491980
59962 491980 494080 495533 497064 498931 500691 502272 504065 505891 506978 507116 506998 507155 507223 506463 504574 501942
59946 501942 499403 497735 497068 496881 496686 496357 495665 494073 491406 488185 484954 481755 478618 475909 473726
59931 473726 471588 469270 467366 466504 466607 467425 469123 471706 474516 476960 479175 481373 483259 484798 486859
59916D86859L338M095L762L132K876K680K258K015K150K221K013J914K128K408
59902E23849K757L407L908L375J832K95o86j476k213k413k015j652j547j105M0
59887E26356J432K514L157L342L209L369M292N413N806N604N648O010O043N682
59873E87877N355M861L757K564K036J465n08l472n529o044o126o265n622m140
59859E70209l177l239l122k196j677k504l616l590k588j537n88M87J505K493M099
59844E50959O427Q524R811J1101J3303J5959J7694J7345J4229Q553K176k174l182
59831F70725j685J057M463P576Q565O353J791l554q761j3230j6223j7565j7836
59818F21676j7334j5793j3514j1449r778p787n599m478m756n049m382l558l500
$$ plain form
59916 486859 490197 494292 498054 501186 504062 506742 509000 511015 513165 515386 517399 519313 521441 523849
59902 523849 526606 530013 533921 537296 539128 539423 538737 537261 535048 532635 530620 528968 527421 526316 526356
59887 526356 527788 530302 533459 536801 540010 543379 547671 553084 558890 564494 570142 576152 582195 587877
59873 587877 593232 598093 601850 604414 606450 607915 607407 603935 598406 592362 586236 579971 574349 570209
59859 570209 567032 563793 560671 558475 556798 554294 550678 547088 544500 542963 542375 542862 544367 546860 550959
59844 550959 557386 565910 575721 586822 600125 616084 633778 651123 665352 673905 676081 673907 670725
59831 670725 669040 670097 674560 682136 690701 697054 698845 695291 686530 673300 657077 639512 621676
59818 621676 604342 588549 575035 563586 553808 546021 540422 535944 531188 526139 521757 518199 514699
59805E14699l676l292k649k203j567n06J50k97j368k419l570m800n346m969m630
59790D73557m951n218m799m244m024l608k792k515l157l402k202n52J33R0K67
59775D32583M76Q4m79n02m39r68j477r98O5O11O44R23J478J803K004K394K521
59758D40723J869J050J015J563J830J745J873K270K643L157L980M537M278L615
59744D76148L184K769K008J433J640K039J683Q19M18O25Q30Q56R46R25M45k26
59728D96542n44m85l08NL44J89n36j063j007j060j633j842r55J90N22N02J072
59711D89933J755J389K15m20q3M68P79J054J283J259J260J603J782J172K51l8
59695E03662K55M50O98J656K961L376K500J180J44o38j236j415j227j038q22j22
$$ plain form
59805 514699 511023 507731 505082 502879 501312 500806 500956 500659 499291 496872 493302 488502 483156 478187 473557
59790 473557 468606 463388 458589 454345 450321 446713 443921 441406 438249 434847 432645 432093 432226 432316 432583
59775 432583 433059 433143 432664 432162 431723 430755 429278 428280 428345 428956 429600 430523 432001 433804 435808 438202 440723
59758 440723 442592 443642 444657 446220 448050 449795 451668 453938 456581 459738 463718 468255 472533 476148
59744 476148 479332 482101 484109 485542 487182 489221 490904 491723 492141 492766 493596 494452 495398 496323 496768 496542
59728 496542 495998 495513 495205 495210 495554 495743 495207 494144 493137 492077 490444 488602 487647 487837 488359 488861 489933
59711 489933 491688 493077 493292 492872 492789 493257 494036 495090 496373 497632 498892 500495 502277 503449 503700 503662
59695 503662 503917 504367 505065 506721 509682 513058 515558 516738 516882 516244 515008 513593 512366 511328 510506 510384
59679E10384J141K332K699J963M60j022j829k117k584l390l910l830l651l767
59665D92879l893l841l944m138l678k295p58L43J255K016K018J348J270K373L611
59650D84566M085M314M697M259K457O69K01J13j146l034l821l342k817k684k442
59635D86075k163k286k381j814j139j238j573j016J37O53M23L71O84Q78J104J748
59619D78463K167J537M89J65J13r07k469k922k106j527j770j781r21J55R46J708
59603D71340K294K060J215P34O82J19j068j783j535j126j130j078o27k77m06n79
59587D68835k54N98J619K118J246q64k535k359j227j155k351l145k667j916j899
59572D54044k337k614k623k309j544p67o33q59n63K19N53K37K3J34p2o84p86P8
$$ plain form
59679 510384 511525 513857 516556 518519 518979 517957 516128 514011 511427 508037 504127 500297 496646 492879
59665 492879 488986 485145 481201 477063 473385 471090 470332 470675 471930 473946 475964 477312 478582 480955 484566
59650 484566 488651 492965 497662 501921 504378 505047 505248 505361 504215 501181 497360 494018 491201 488517 486075
59635 486075 483912 481626 479245 477431 476292 475054 473481 472465 472602 473255 473678 474049 474733 475611 476715 478463
59619 478463 480630 482167 482656 482821 482934 482027 479558 476636 474530 473003 471233 469452 468531 468686 469632 471340
59603 471340 473634 475694 476909 477643 478325 478444 477376 475593 474058 472932 471802 470724 470097 469820 469414 468835
59587 468835 468581 469179 470798 472916 474162 473298 470763 468404 467177 466022 463671 460526 457859 455943 454044
59572 454044 451707 449093 446470 444161 442617 441850 441217 440358 439795 440014 440567 440804 440827 440961 440889 440205 439419 439497
59554D39497J185J783J977K068J952J606J396J570J977K420K788K979L165L860
59540D70223N171O518P673R314J1831J4596J7356K0874K4534K4715J8085O187
59528F37077n477j2734j5258j4344j0889o070j698J241L155M501N125N105M843
59515E94577M121K363j01k291m029n740p037p197o961p968j0212j1814j1590j0228
59501E15893q685p132n864n478n679n351m212l106k420j711j011r62j459j685
59487D61138j611j828j906p43J336K663K774K880L525L802L419L549M757N918
59473D89673O062N720N658N676N439N053M318K814J153N96J025R55Lm89K04J094
59457E34954J520K343M184O183P613R080J1099J2884J3648J3823J4002J3845J2969
$$ plain form
59554 439497 440682 442465 444442 446510 448462 450068 451464 453034 455011 457431 460219 463198 466363 470223
59540 470223 475394 481912 489585 498899 510730 525326 542682 563556 588090 612805 630890 637077
59528 637077 631600 618866 603608 589264 578375 572305 570607 571848 575003 579504 584629 589734 594577
59515 594577 598698 601061 600960 598669 594640 588900 581863 574666 567705 559737 549525 537711 526121 515893
59501 515893 507208 500076 494212 488734 483055 477704 473492 470386 467966 466255 465244 464282 462823 461138
59487 461138 459527 457699 455793 455050 456386 459049 461823 464703 468228 472030 475449 478998 483755 489673
59473 489673 495735 501455 507113 512789 518228 523281 527599 530413 531566 532162 533187 534142 534145 533656 533860 534954
59457 534954 536474 538817 543001 549184 556797 565877 576976 589860 603508 617331 631333 645178 658147
59444F58147J1758J0506Q632N476J014m429j0073j4299j5749j5030j3901j2793
59432F09259j0890q552p420p741p823o733n368m212k348M54K856M163N365P075
59418E68085Q564R772J1984J5421J8454K0291K2101K4366K5822K6276K7311K8063
59406H06510K3608J0776o538k0882k8461l0054k6974k0037j1554m294J667P853
59394G01620J2776J1620J885j2732k5388l1827l2291k9256k4717j9548j4364j0144
59382E27634p606o341n308m157l220k363j118%j07j051r79P31K481L005L117L843
59366E08561M566M448M152M621N415N694N712N981O102N762N718O462P160P274
59352E87628P855R743J1811J2708J3067J4271J6076J7298J7943J8785J9665J9943
$$ plain form
59444 658147 669905 680411 689043 694519 695533 691104 681031 666732 650983 635953 622052 609259
59432 609259 598369 589817 582397 574656 566833 560100 554732 550520 548172 548626 551482 555645 561010 568085
59418 568085 576649 586421 598405 613826 632280 652571 674672 699038 724860 751136 778447 806510
59406 806510 830118 840894 834356 813474 785013 754959 727985 707948 696394 692100 693767 701620
59394 701620 714396 726016 727901 715169 689781 657954 625663 596407 571690 552142 537778 527634
59382 527634 520028 513687 508379 504222 501002 498639 497521 497521 497414 496363 495384 496115 498596 501601 504718 508561
59366 508561 513127 517575 521727 526348 531763 537457 543169 549150 555252 561014 566732 573194 580354 587628
59352 587628 595483 605226 617037 629745 642812 657083 673159 690457 708400 727185 746850 766793
59340G66793J9947K0209J9952J8030J4787J1373P854L626r13m795q079j1431j4560
59327H42793j6574j7592j8479j9317j9411j8549j7075j5141j2988j1417j0853
59316F65397j0496r452q082p166o507n561m612m067l400k118r94r73j514j389
59302E99066m86M70J350K565M097N707P489R327J0786J2324J5324J9899K4189
59289G12107K6938K8842K9630K5992J5320K24j3420k2279k6939k8461k6730k2327
59277F98897j7182j2627q625n099k389j51K414N160P256Q733J0319J1801J2217
59264G10724J1473J0227Q393N427J937p84k796n338q591j1287j2709j3505j4278
59251F78893j4786j4769j4297j3221j1466r746q741p763n658k838q80j27O37K064
$$ plain form
59340 766793 786740 806949 826901 844931 859718 871091 878945 882571 881658 876863 868784 857353 842793
59327 842793 826219 808627 790148 770831 751420 732871 715796 700655 687667 676250 665397
59316 665397 654901 645449 637367 630201 623694 618133 613521 609454 606054 603936 602942 601969 600455 599066
59302 599066 598580 599050 600400 602965 607062 612769 620258 629585 640371 652695 668019 687918 712107
59289 712107 739045 767887 797517 823509 838829 839053 825633 803354 776415 747954 721224 698897
59277 698897 681715 669088 660463 655364 652975 652824 655238 660398 667654 676387 686706 698507 710724
59264 710724 722197 732424 740817 746244 748181 747397 744601 739263 730672 719385 706676 693171 678893
59251 678893 664107 649338 635041 621820 610354 600608 591867 584104 578446 575608 574728 574601 575238 577302
59237E77302L403M030M387M949N529N954O374O643O304N413M472L480J926k48
59223F39918k481m421o130p546q516r144r496r242q253p078o156n151l799k686
59209E49819k295k083j455q68r19j164r70o15m90r8R27J877K259K849M146N035
59193E55955M647M146M795N555M771L136K557L031L094K676K913L655L687L159
59179F07777L277L809L420K325K097K805K883K031J734K524L161L093L436M808
59165F49180O251P018P645Q494Q936Q615Q054P496O481M923L285J496q64l317
59151G23693m940o021p620r526j0414j0055r526r238q607p768p600p842p144n353
59137F12039l861l320k892k122j652j633j277m79j73o04q51m79n6K81J115K322
$$ plain form
59237 577302 580705 584735 589122 594071 599600 605554 611928 618571 624875 630288 634760 638240 640166 639918
59223 639918 637437 633016 626886 619340 610824 601680 592184 582942 574689 567611 561455 556304 552505 549819
59209 549819 547524 545441 543986 543118 542199 541035 540065 539450 538960 538862 539789 541666 543925 546774 550920 555955
59193 555955 560602 564748 569543 575098 579869 583005 585562 588593 591687 594363 597276 600931 604618 607777
59179 607777 611054 614863 618283 620608 622705 625510 628393 630424 632158 634682 637843 640936 644372 649180
59165 649180 655431 662449 670094 678588 687524 696139 704193 711689 718170 723093 726378 727874 727010 723693
59151 723693 718753 712732 705112 695586 685172 675117 665591 656353 647746 639978 632378 624536 617392 612039
59137 612039 608178 604858 601966 599844 598192 596559 595282 594803 594630 594026 593175 592696 592640 592921 594036 596358
59121E96358L087L612M999P180Q781R439J0297J1772J2698J2296J1277J0421R677
59108G11894R152R272R557Q855P178N686M614L045R98k24k86n13j712l186m346
59093G59984n522o607o718n782m767l931k657j312j225k421l446l917n050p056
59079F99573q399q419q455r392j0252j0277j0241j0593j0285q763p227o667o362
59066E84241n502m585m078l414k419k021k418k246p84O86Q90L26j41p34j627j994
59050E54180j474j107j576k023j734j487j918k146j341k56J31J80N45Q66P55Q52
59034E42447J661K407K275J715J545J773K125K678L287L659M468O861J0265J2438
59020E99604J2555J2366J3388J4714J4780J3501J1366Q191M175O58j560l245m951
$$ plain form
59121 596358 599445 603057 608056 615236 624017 633456 643753 655525 668223 680519 691796 702217 711894
59108 711894 721046 730318 739875 748730 755908 761594 766208 769253 770251 770027 769741 769228 767516 764330 759984
59093 759984 754462 747855 741137 735355 730588 726657 724000 722688 721463 719042 715596 711679 706629 699573
59079 699573 691174 682755 674300 664908 654656 644379 634138 623545 613260 604497 597270 590603 584241
59066 584241 578739 574154 570076 566662 564243 562222 559804 557558 556774 557460 558350 558676 558535 557801 556174 554180
59050 554180 552706 551599 550023 548000 546266 544779 542861 540715 539374 539118 539249 539429 539974 540840 541595 542447
59034 542447 544108 546515 548790 550505 552050 553823 555948 558626 561913 565572 570040 576901 587166 599604
59020 599604 612159 624525 637913 652627 667407 680908 692274 700465 704640 705298 703738 700493 695542
59007F95542n764n112m184m062l845k141Q00L758O179P874Q386P846P304P203
58993G19784O743N589M723M632M275K888J174l23k243m726o602p410q304r625
58979G10575r774q017o284o177o283m581j722M19J840L711N892P504Q903J0873
58965G06879J2782J3602J3881J4649J5379J4952J3739J2743J1559R234O290L857
58953H49546J491k084o632j0743j3987j6851j9011j9552j8677j7510j6476j5296
58941F94218j4166j3412j2303r841o532m052l229l430l726l639k997j981j054
58928F13856m33l7j90j352k834l110k026j188j525k083k100k360l288l624k508
58913E85198j154p46l69J169L017L740L720M090M601M547M688O184Q530J0476
$$ plain form
59007 695542 689778 684666 680482 676420 672575 670434 671234 674992 681171 689045 697431 705277 712581 719784
58993 719784 726527 732116 736839 741471 745746 748634 749808 749485 747242 742516 735914 728504 720200 710575
58979 710575 700801 692784 686500 680323 674040 669459 667737 668156 669996 673707 679599 687103 696006 706879
58965 706879 719661 733263 747144 761793 777172 792124 805863 818606 830165 839399 845689 849546
58953 849546 851037 848953 842321 831578 817591 800740 781729 762177 743500 725990 709514 694218
58941 694218 680052 666640 654337 644496 637964 633912 630683 627253 623527 619888 616891 614910 613856
58928 613856 613423 613386 613196 611844 609010 605900 603874 602686 601161 599078 596978 594618 591330 587706 585198
58913 585198 584044 583298 582929 584098 587115 590855 594575 598665 603266 607813 612501 618685 627215 637691
58899F37691J1989J3549J4539J4362J4115J5064J6336J6203J4946J4438J5470
58888G98702J7445K0113K3648K7323K9831L0732L0239K8103K4087J8984J3865
58877A063072Q966M258J34l618q258j4145j9571k2939k4781k6087k6212k4281
58865I06538k1278j8676j6203j3018r970q594q816r639j1037j3125j4616j4299
58853G47267j3149j2851j3099j2494j1206j0461j0189r411q309p780p524o656
58841F24138n589n324n546n319m916n074n310m912m621n304n997n417m361m311
58827E52137m769m354l514l508l664k382j61J196J756K985M648N043M202L943
58813E53558M771N271M766M160M001L887L773L857L360J540m29q14k05p01k500
$$ plain form
58899 637691 649680 663229 677768 692130 706245 721309 737645 753848 768794 783232 798702
58888 798702 816147 836260 859908 887231 917062 947794 978033 1006136 1030223 1049207 1063072
58877 1063072 1072038 1076296 1076430 1072812 1064554 1050409 1030838 1007899 983118 957031 930819 906538
58865 906538 885260 866584 850381 837363 827393 818799 809983 800344 789307 776182 761566 747267
58853 747267 734118 721267 708168 695674 684468 674007 663818 654407 646098 638318 630794 624138
58841 624138 618549 613225 607679 602360 597444 592370 587060 582148 577527 572223 566226 560809 556448 552137
58827 552137 547368 543014 539500 535992 532328 529946 529785 530981 532737 535722 540370 545413 549615 553558
58813 553558 558329 563600 568366 572526 576527 580414 584187 588044 591404 592944 592515 591701 591496 590795 588295
58798E88295l783l840l800m203m208l535l026l041l105l166l423l203j845k91
58784E43826J74K38J429L240L844L277L293M280M877M683M726N099M590K968J404
58769E91948L17j100k888l928l829l357k896k169j531j735k477k839k902l231
58755E57383l213j877J15J262J578K172L018L223L005L225L547L228L054M251
58741E83971O123P109P459Q374R339R081Q358Q959J0415J0726R803R268R238Q471
58727G06694P336P451Q502Q545P396O625O392N464M246M446N687N887N169N878
58713G95718Q360J0126R853Q927Q319P120M910K565M0l730q147j1127j2562j4560
58699H05812j7715k0190k1146k1926k3061k3204k1860k0259j8766j6335j3276
$$ plain form
58798 588295 584512 580672 576872 572669 568461 564926 561900 558859 555754 552588 549165 545962 544117 543826
58784 543826 544000 544238 545667 548907 552751 556028 559321 563601 568478 573161 577887 582986 587576 590544 591948
58769 591948 592265 591165 588277 584349 580520 577163 574267 572098 570567 568832 566355 563516 560614 557383
58755 557383 554170 552293 552408 553670 555248 557420 560438 563661 566666 569891 573438 576666 579720 583971
58741 583971 590094 597203 604662 613036 622375 631456 639814 648773 659188 669914 679717 688985 698223 706694
58727 706694 714030 721481 729983 738528 745924 752549 758941 764405 768651 773097 778784 784671 789840 795718
58713 795718 804078 814204 824057 832984 841303 848423 853333 855898 855938 852208 844061 832934 820372 805812
58699 805812 788097 767907 746761 724835 701774 678570 656710 636451 617685 601350 588074
58688E88074j1527j1286j0434q141o100n362m924m351m719n888n884m145k586
58675E02727k308k084j003O0O89J733L048L192K359K691M832P008Q459J0597J3762
58660E55762J5899J5655J3876J0998O097k31n092o887o995o832o082m880m683
58647E76605n629n998n389n439o327n831l227q49l14l12L29O41J89N37K251L361
58631E44598K653J663J721J731O28o75j373k119k880k272l80O32J57L74K460M722
58615E51640N964P499J0069J1960J1923J1054J0101Q047M883K585J686J74k601
58602F34984m458m486m885o639p236n192l078l334m430m035k849k440k156r88
58588E78778K10Q86K455N477P976Q888J0155J3059J5537J5682J4748J4178J2810
$$ plain form
58688 588074 576547 565261 554827 546686 540586 535224 530300 525949 521230 515342 509458 505313 502727
58675 502727 500419 498335 497332 497392 498081 499814 502862 506054 508413 511104 515936 522944 531403 542000 555762
58660 555762 571661 587316 601192 612190 618287 618056 612964 606077 599082 592250 586168 581288 576605
58647 576605 570976 564978 559589 554150 547823 541992 538765 537916 537602 537290 537619 538260 538449 538986 541237 544598
58631 544598 547251 548914 550635 552366 552994 552319 550946 548827 545947 543675 543295 543927 544084 544458 546918 551640
58615 551640 557604 565103 575172 587132 599055 610109 620210 628257 633140 635725 637411 637585 634984
58602 634984 630526 626040 621155 614516 607280 602088 599010 595676 591246 587211 584362 581922 579766 578778
58588 578778 578988 579874 582329 587806 595782 604670 614825 627884 643421 659103 673851 688029 700839
58575G00839R747O813N427M085J689J66R24K001J805K382N739J0033J2893J5420
58561G79963J9302K2919K4035K3777K4072K3627K0253J5101J0855P574L801q2
58549I75197k869n173p979j0296j1052j1351j2241j2486j1223j0356j1519j3152
58537H55500j3566j4124j6285j8203j7732j6261j5997j5783j3333r476o591m761
58525F93388k815j217o98L1K033L661L360K702L540M579L970K862L014L307K162
58510G23879J010J704K733J677o31j939k459l478m246l717l308m491n717n053
58496F95964l682l578m032l721l687m871n317l355r60m74o97K41J127N52M26K606
58480F66542N057N538O018Q991J2517J3586J3396J4351J4772J1840P226M398K649
$$ plain form
58575 700839 710586 717399 722826 726911 728600 728766 729690 731691 733496 735878 741617 751650 764543 779963
58561 779963 799265 822184 846219 869996 894068 917695 937948 953049 963904 971478 975279 975197
58549 975197 972328 967155 959176 948880 937828 926477 914236 901750 890527 880171 868652 855500
58537 855500 841934 827810 811525 793322 775590 759329 743332 727549 714216 704740 698149 693388
58525 693388 690573 689356 688658 688689 690722 694383 697743 700445 703985 708564 712534 715396 718410 721717 723879
58510 723879 724889 726593 729326 731003 730372 728433 725974 722496 718250 714533 711225 706734 701017 695964
58496 695964 692282 688704 684672 680951 677264 672393 667076 663721 662761 662287 661590 661831 662958 663510 663936 666542
58480 666542 671599 677137 683155 692146 704663 718249 731645 745996 760768 772608 779834 784232 786881
58467G86881q48n173p267p557q670j0124r439p095n473m342k052M26J247J695
58453G22209L871O300O416N380N714O384M997K644J633P24k224n302n553m484
58439G48709n158o220m580j644p93r40J231M539N242L918M074N481N293M242N354
58424G68748P780Q292P619Q980J1629J2168J0986J0919J0945P925L416J768K391
58411H73566Q47l133n608n814o654q267p987o408o738q371p762n303m651n513
58397G92204m060l27J707J450K215M350M676K986K413L087J995o56j490n32j112
58382H08906l167l270j354p73j577n21K208L077K155L015N605O176M545M500O637
58367H36162P649P031P627R397R514Q723J0554J4172J5155J3322J2644J3527J2657
$$ plain form
58467 786881 786033 780860 773593 766036 757366 747242 737803 730708 725235 720893 718841 719267 720514 722209
58453 722209 726080 732380 738796 744176 749890 756274 761271 763915 765548 766272 764048 758746 753193 748709
58439 748709 743551 737331 732751 731107 730314 729374 730605 735144 740386 744304 748378 753859 759152 763394 768748
58424 768748 776528 784820 792439 801419 813048 825216 836202 847121 858066 865991 869407 871175 873566
58411 873566 874413 871280 865672 859858 853204 844937 836950 830542 823804 815433 807671 802368 797717 792204
58397 792204 788144 787817 789524 790974 793189 797539 802215 805201 807614 810701 812696 812040 810550 810018 808906
58382 808906 805739 802469 801115 800342 798765 798244 800452 803529 805684 808699 814304 820480 825025 829525 836162
58367 836162 843811 850842 858469 867866 877380 886103 896657 910829 925984 939306 951950 965477 978134
58354I78134J0288R921J0853R001N121M049N724N357K680K346M761N304L471L873
58340A060883P183Q795P678P936J0369J1153J0086J1391J5073J6218J4205J3803
58328A194773J5917J6041J3251J1764J2226J0548O685N414P003O403L069K145
58316A305239M537N404L893M593P887Q857P278Q471J2715J4235J2307J2688J6257
58303A424361J7224J4566J4138J7219J8207J5909J5746J8471J8299J4627J3838
58292A602605J6964J7625J4750J4955J9553K1972K0842K2623K8089K9685K5842
58281A835505K4302K7521K8625K5719K5989L1195L3457L0247K9230L3417L5914
58270B161121L4378L5882M2293M5832M4431M6245N3558N7940N6843N8782O6252
$$ plain form
58354 978134 988422 998343 1009196 1018197 1023318 1027367 1033091 1038448 1041128 1043474 1048235 1053539 1057010 1060883
58340 1060883 1068066 1076861 1084539 1092475 1102844 1113997 1124083 1135474 1150547 1166765 1180970 1194773
58328 1194773 1210690 1226731 1239982 1251746 1263972 1274520 1281205 1286619 1293622 1300025 1303094 1305239
58316 1305239 1309776 1315180 1319073 1323666 1331553 1340410 1347688 1356159 1368874 1383109 1395416 1408104 1424361
58303 1424361 1441585 1456151 1470289 1487508 1505715 1521624 1537370 1555841 1574140 1588767 1602605
58292 1602605 1619569 1637194 1651944 1666899 1686452 1708424 1729266 1751889 1779978 1809663 1835505
58281 1835505 1859807 1887328 1915953 1941672 1967661 1998856 2032313 2062560 2091790 2125207 2161121
58270 2161121 2195499 2231381 2273674 2319506 2363937 2410182 2463740 2521680 2578523 2637305 2703557
58259B703557P0122O7223O6484P1197P2698O8365O7787P3832P6198P1503P0826
58248C479792P8933Q5344Q4814Q6968R6350J02998J02600J05810J17393J26669
58238D467671J28895J34920J49213J60247J63506J71321J88626K02570K07854
58229E974823K17881K38535K56442K66043K81711L09488L34589L51052L74799
58220H605363M12477M47881M74863N11675N66184O20727O68782P30693Q14736
58211A3853381R00975R83360J086880J222346J368478J521367J713956J962531
58203B4613274K246739K569716K981251L511964M146505M893320N812612O944846
58195E7720227Q295395R930405J1998287J4619867J7864755K1849711K6654243
$$ plain form
58259 2703557 2773679 2840902 2907386 2978583 3051281 3119646 3187433 3261265 3337463 3408966 3479792
58248 3479792 3558725 3644069 3728883 3815851 3912201 4015199 4117799 4223609 4341002 4467671
58238 4467671 4596566 4731486 4880699 5040946 5204452 5375773 5564399 5766969 5974823
58229 5974823 6192704 6431239 6687681 6953724 7235435 7544923 7879512 8230564 8605363
58220 8605363 9017840 9465721 9940584 10452259 11018443 11639170 12307952 13038645 13853381
58211 13853381 14754356 15737716 16824596 18046942 19415420 20936787 22650743 24613274
58203 24613274 26860013 29429729 32410980 35922944 40069449 44962769 50775381 57720227
58195 57720227 66015622 75946027 87944314 102564181 120428936 142278647 168932890
58188A68932890L2020289L7298259M1745130M4507801M4046438L8112848K5297780
58181D31961435P009393j2496189k8501262l8357475m2001442m0820964l6555030
58174B40238466l0830679k4862753j9272129j4415944j0889197r346395r737507
58167A20883862j1057443j2075933j2185751j1480085j0286225q870469p448848
58160D7479108o188231n135820m252559l520216k947502k504158k134301j821237
58152A8975084j575645j379069j197568j033186r08950q18752p37818o65710o16213
58143A0042173n80852n41542n03481m79593m58550m22285l79240l47772l22419
58134F006439k87887k51024k27819k12762j91008j68338j60486j64016j64367
$$ plain form
58188 168932890 200953179 238251438 279996568 324504369 368550807 406663655 431961435
58181 431961435 438970828 426474639 397973377 359615902 317614460 276793496 240238466
58174 240238466 209407787 184545034 165272905 150856961 139967764 130621369 120883862
58167 120883862 109826419 97750486 85564735 74084650 63798425 54927956 47479108
58160 47479108 41290877 36155057 31902498 28382282 25434780 22930622 20796321 18975084
58152 18975084 17399439 16020370 14822802 13789616 12880666 12061914 11324096 10658386 10042173
58143 10042173 9461321 8919779 8416298 7936705 7478155 7055870 6676630 6328858 6006439
58134 6006439 5718552 5467528 5239709 5026947 4835939 4667601 4507115 4343099 4178732
58125D178732j61891j64728j66736j57146j42314j34793j30460j18419j03559
58116B898686r7411r6083q8562p8141p4991p5848p1010o3551o2328o3660n8561
58105B068540n0759m9440n1422m8093m2740m3640m7033m4128l8305l8498m1867
58094A572615l9675l4263l3842l6091l3089k7200k6309k8244k5264j9405j8411
58083A250822k0743j9300j5807j7176k1459k1407j8429j9348k2832k2356j9313
58072A032652k0104k3241k2076j7611j6239j7507j5944j2344j1706j2666j0336
58061H52878o750p461j0593j0227p701q682j1982j2134j0173j0970j2826j0613
58049G32766o532o772r949r705o418n579o806n341k463l567p493q337o403o973
$$ plain form
58125 4178732 4016841 3852113 3685377 3528231 3385917 3251124 3120664 3002245 2898686
58116 2898686 2801275 2705192 2616630 2538489 2463498 2387650 2316640 2253089 2190761 2127101 2068540
58105 2068540 2017781 1968341 1916919 1868826 1826086 1782446 1735413 1691285 1652980 1614482 1572615
58094 1572615 1532940 1498677 1464835 1428744 1395655 1368455 1342146 1313902 1288638 1269233 1250822
58083 1250822 1230079 1210779 1194972 1177796 1156337 1134930 1116501 1097153 1074321 1051965 1032652
58072 1032652 1012548 989307 967231 949620 933381 915874 899930 887586 875880 863214 852878
58061 852878 846128 838667 828074 817847 810146 801464 789482 777348 767175 756205 743379 732766
58049 732766 726234 719462 709513 699808 693390 687811 681005 675664 673201 669634 662141 653804 647401 640428
58035F40428r628r197o212o065q610q674o311o614r701j0556q682q559j0570j0542
58021E20507q341q069r618q617n021l424m624m802l253l145m525m172k391k556
58007D47949m047l036NR03m78m32J084O05j488j280J163J871M92N57K283K308
57991D48459N54L55J773J580j20j26J215M81j944k307o65p85k945l756k916l317
57975D35536m584l597j288j705m228m082r06N54j118k188j223j129k566k339J59
57960D05296J527P87R66K929L771K658K209K928K179j25q18M89O58p58n92J496
57944D25600J969J38l70J525K174n9j787n30J741L166M920P435Q609P896P681
57929D70108Q761Q785O745M633L378J545q23j640j110j990m551n997n826o795
$$ plain form
58035 640428 630800 621603 615391 609326 600716 592042 585731 579117 569416 558860 550178 541619 531049 520507
58021 520507 512166 504097 494479 485862 480841 477417 472793 467991 464738 461593 457068 452896 450505 447949
58007 447949 443902 440866 440871 441774 441296 440864 441948 442553 441065 439785 440948 442819 443311 443868 446151 448459
57991 448459 449013 449368 451141 452721 452601 452475 453690 454171 452227 449920 449255 448470 445525 441769 438853 435536
57975 435536 430952 427355 426067 424362 420134 416052 415146 415700 414582 412394 411171 410042 407476 405137 405296
57960 405296 406823 407610 408576 411505 415276 417934 420143 423071 425250 425125 424307 424796 425454 424696 424104 425600
57944 425600 427569 427707 427337 428862 431036 430977 429190 428660 430401 433567 438487 445922 454531 462427 470108
57929 470108 478869 487654 494399 499032 502410 503955 503132 501492 500382 498392 493841 487844 482018 475223
57915D75223r433j0750r685q874r473r227p224n714n592m679k157k42M9L02O94
57900C93218p67l680m776l338k410l218l370k009j606k868k982r97J03j084j746
57885C58470j47J163J79j043m59M25r3q12o09r24k767m441m642m611n315n610
57869C28764n072n273o552o847n393m127l938l100j010K80j30k96Q59J799J859
57854B91823K629M347M910M078M551P081Q689P698O343O359O164M661L601L761
57840C66695K876J0k011j310k48j187k686k813k608l267l296j552M6j38m51Q07
57824C48867K182K004J598K554L579L051K145K489L115K491J384J064R03R2m69
57809C77049k49o54k430l923m074m504o494q516r025q976r383r118p475o192o439
$$ plain form
57915 475223 465790 455040 445355 436481 427008 417781 410557 404843 399251 394572 392415 392173 392222 392524 393218
57900 393218 392451 388771 383995 380657 378247 375029 371659 369650 368044 365176 362194 361197 361300 360216 358470
57885 358470 358323 359486 359665 358622 358163 358588 358495 357683 357074 356150 353383 348942 344300 339689 334374 328764
57869 328764 323692 318419 311867 305020 299627 295500 291562 288462 287452 287732 287602 287306 288165 289964 291823
57854 291823 294452 298799 303709 307787 312338 319419 328108 335806 342149 348508 354672 359333 362934 366695
57840 366695 369571 369581 367570 366260 366012 364825 362139 359326 356718 353451 350155 348603 348649 348511 348060 348867
57824 348867 351049 353053 354651 357205 360784 363835 365980 368469 371584 374075 375459 376523 377426 377518 377049
57809 377049 376800 376146 373716 369793 365719 361215 354721 346205 337180 328204 318821 309703 302228 296036 289597
57794B89597o412m485k161j363j309n43K91K60L19J226J639O95J84J679L772M539
57778B87928M537N046N586N464N492O111O084N099N031O556P322N744L763L300
57764C63063K904P32k010l574m861p091q793q413p561q383r796r579q281p783
57750B80574p814p004n806n307m751l111j603j736k453j960r44j118k112k429
57736B32426k170k204k105j325q86j540j911q37K73m6m63P81K496K524J403J130
57720B27546J685J773J672K384L081K192Q4j671k675l223k812j389n92j515k649
57705B23891k255j144r32j242j036q83j529j968j327p74j254j389j65O45m37j507
57689B06694l98J377J258J35M44J679J709J019J692L281L712L428M780P901J0718
$$ plain form
57794 289597 283185 278700 276539 275176 273867 273324 273615 273875 274194 275420 277059 277754 277938 279617 283389 287928
57778 287928 292465 297511 303097 308561 314053 320164 326248 331347 336378 342934 350256 356000 359763 363063
57764 363063 365967 366699 364689 361115 356254 349163 340370 331957 324396 316013 306217 296638 288357 280574
57750 280574 272760 265756 259950 254643 249892 246781 245178 243442 240989 239029 238085 236967 234855 232426
57736 232426 230256 228052 225947 224622 223736 222196 220285 219448 219721 219675 219212 219993 222489 225013 226416 227546
57720 227546 229231 231004 232676 235060 238141 240333 240417 238746 236071 232848 230036 228647 228055 226540 223891
57705 223891 221636 220492 219560 218318 217282 216399 214870 212902 211575 210801 209547 208158 207993 208638 208201 206694
57689 206694 206296 207673 208931 209066 209510 211189 212898 213917 215609 218890 222602 226030 230810 238711 249429
57674B49429J2689J5184J8586K2312K7304L5335M6065N7469O8779Q0275R0449
57663G23876R5579R1558P4543M2329j339m5165p7072r2716r5357q9415p7906o4488
57651D84427n2911m3794l5356k7409k1600j7974j4686j1151q428o504m293k176
57639B38145j577k080j875r38q18j502j463p38q42j661j464j34N42j0n32n46q92
57622B21615j538j531j215j928l414m034l541l153l104k644k268l168m636m725
57608A80716l343k042j015Q30L062M006L737L893M496L994K464J720K060J932
57594B06510R43L14R4r74k594k924j908j529k340k640j712r39j088j210q95j040
57578A86068j753j982j727k061k749k380j133o38r69o58J14m32k126k592j301
$$ plain form
57674 249429 262118 277302 295888 318200 345504 380839 426904 484373 553152 633427 723876
57663 723876 819455 911013 985556 1027885 1026546 981381 904309 811593 716236 626821 548915 484427
57651 484427 431516 387722 352366 324957 303357 285383 270697 259546 251118 244614 240321 238145
57639 238145 236568 234488 232613 231675 230857 229355 227892 227154 226312 224651 223187 223053 223595 223585 223053 222507 221615
57622 221615 220077 218546 217331 215403 211989 207955 204414 201261 198157 195513 193245 190077 185441 180716
57608 180716 177373 175331 174316 175146 178208 182214 185951 189844 194340 198334 200798 202518 204578 206510
57594 206510 207453 207767 207861 206887 204293 201369 199461 197932 195592 192952 191240 190301 189213 188003 187108 186068
57578 186068 184315 182333 180606 178545 175796 173416 172283 171645 170676 170018 170132 169700 167574 164982 163681
57563A63681n14j379k232j900j521j862j726m45P21R99J355K160K171J053L81
57548A60942Q89J192M77k4M64P71J68j32P03J537J430J237J661J801J041L66M81
57531A75004N47k9m55l73p03j552j425J99J547J176l3p61j142j490j089J95R73
57514A70589L96m47m61j72k38j39M03M60l66q84l40K63Mm09k71l32j255k189k285
57495A62327k165k595k996k567j646q91l10O9j62o81n24J47p8j431k276j662o68
57478A41891k50K36J240J703Q86k17n70o54j114j455j319j458k216k594j990j359
57462A30760j428j423o70N3O2N9O48J100P88M37O85Q83M85J43L03K43l25l29P82
57443A33256J766J543R13J032J568J715J625J630J291M51p9J9j94j119j581p72
$$ plain form
57563 163681 163167 161788 159556 157656 156135 154273 152547 152102 152823 153822 155177 157337 159508 160561 160942
57548 160942 161831 163023 163500 163476 163940 164711 164879 164747 165450 166987 168417 169654 171315 173116 174157 174523 175004
57531 175004 175551 175522 175067 174694 173991 172439 171014 171213 172760 173936 173903 173142 172000 170510 169421 169616 170589
57514 170589 170985 170538 170077 169905 169667 169528 169931 170391 170025 169141 168801 169064 169068 168659 168388 168056 166801 164612 162327
57495 162327 160162 157567 154571 152004 150358 149467 149157 149226 149064 148383 147859 148006 147928 146497 144221 142559 141891
57478 141891 141641 141877 143117 144820 145706 145489 144919 144265 143151 141696 140377 138919 136703 134109 132119 130760
57462 130760 129332 127909 127239 127292 127354 127413 128061 129161 129949 130386 131071 131954 132439 132582 132885 133128 132803 132474 133256
57443 133256 135022 136565 137478 138510 140078 141793 143418 145048 146339 146790 146711 146730 146536 145417 143836 143064
57427A43064K12R7o26p49j74M72R60J176Q51K98K87O29L43m00k94O72Q56j48o09
57408A46917M07J454J278P45P75O08l10q59k91J93l40p33R9J113R97L52K16K30
57390A52851J7N12J996K719J519N8L18J524J838J493J867K766L018K624K227J512
57374A78859J52p91m08K73J4l91L15J299R47l22p97k29L09M93P41P76J38n36m40
57355A80402o5j56j58O56J595J773J784K387K681J606Q8k89J62J28k82r4L91J48
57337A92757n72p97p06j014j209l92P65Q84J73rO20J156J136O82l01j544j864
57320A89765p38M80M51p1K23Q58O58Q6L43J040R56L33L45R61J296J430J953K444
57302B02813K238J965K407K819K275J691K356L465L332K217J594J500J013O23
$$ plain form
57427 143064 143276 143373 142747 141998 141824 142296 143256 144432 145283 145581 145868 146497 146840 146440 146146 146818 147674 147526 146917
57408 146917 147324 148778 150056 150801 151576 152184 151874 151015 150724 150917 150577 149844 149943 151056 152053 152405 152621 152851
57390 152851 152868 153380 155376 158095 159614 159672 159990 161514 163352 164845 166712 169478 172496 175120 177347 178859
57374 178859 179011 178220 177812 178085 178099 177708 178023 179322 180269 179947 179150 178921 179230 179723 180464 181240 181378 180842 180402
57355 180402 180337 180181 180023 180679 182274 184047 185831 188218 190899 192505 192593 192304 192466 192594 192312 192218 192609 192757
57337 192757 192185 191388 190682 189668 188459 188067 188832 189716 189889 189880 190500 191656 192792 193474 193173 191629 189765
57320 189765 189027 189507 189958 189887 190110 190968 191626 191712 192055 193095 194051 194384 194729 195690 196986 198416 200369 202813
57302 202813 205051 207016 209423 212242 214517 216208 218564 222029 225361 227578 229172 230672 231685 232308
57288B32308J506L043L541L053L084L794L916L162K439J889R77J83M44J076M76
57273B64891j335k834l446l740l692k898k183k745l908l921k684j627j201p13
57259B27964k78o31j263r94j28J49J56J105K475K529J291M76N62M51N8N92K056
57242B36570K916K601K078J831J454J366K477M073M347L283K685L097L216K585
57228B74579K370K955L222K794K743L309L216J962Q62R65J759K530L313M014M203
57213C14796M190M697N426N504N296N827O659O482N682N893P006P143N886M938
57199C95425N147N452N287N556O529P176P357Q354J0458J2299J3310J4524J6107
57186E12981J6528J5205J3803J3684J4162J4326J4648J5528J6022J5336J4177
$$ plain form
57288 232308 233814 236857 240398 243451 246535 250329 254245 257407 259846 261735 262712 262895 263339 264415 264891
57273 264891 263556 260722 257276 253536 249844 246946 244763 242018 238110 234189 231505 229878 228677 227964
57259 227964 227686 227055 225792 224798 224670 224819 224975 226080 228555 231084 232375 232851 233413 233864 233922 234514 236570
57242 236570 239486 242087 244165 245996 247450 248816 251293 255366 259713 262996 265681 268778 271994 274579
57228 274579 276949 279904 283126 285920 288663 291972 295188 297150 298012 298977 300736 303266 306579 310593 314796
57213 314796 318986 323683 329109 334613 339909 345736 352395 358877 364559 370452 377458 384601 390487 395425
57199 395425 400572 406024 411311 416867 423396 430572 437929 446283 456741 469040 482350 496874 512981
57186 512981 529509 544714 558517 572201 586363 600689 615337 630865 646887 662223 676400
57175F76400J3627J3858J4618J5632J6182J5722J5115J5621J6638J6429J5110
57164H44952J4644J5568J6292J6119J6416J8023J9876K1080K2057K2788K2333
57153A050148K0958K0398K0995K1023J9865J9322K0506K1967K2396K2771K4099
57142A284448K5255K4952K4005K3809K4203K4437K4707K5179K5061K4124K3706
57131A553886K4795K6538K7890K9253L1184L3086L4533L6463L9697M3570M7150
57120A928045N0536N3907N6820N9524O3408O9090P5566Q2279R0391J01030J14001
57109B744597J29238J47757J69966J94773K21593K51594K85955L24873L69684
57100D840030M24144M92226N76265O78429Q01940R49103J119718J312909J528722
$$ plain form
57175 676400 690027 703885 718503 734135 750317 766039 781154 796775 813413 829842 844952
57164 844952 859596 875164 891456 907575 923991 942014 961890 982970 1005027 1027815 1050148
57153 1050148 1071106 1091504 1112499 1133522 1153387 1172709 1193215 1215182 1237578 1260349 1284448
57142 1284448 1309703 1334655 1358660 1382469 1406672 1431109 1455816 1480995 1506056 1530180 1553886
57131 1553886 1578681 1605219 1633109 1662362 1693546 1726632 1761165 1797628 1837325 1880895 1928045
57120 1928045 1978581 2032488 2089308 2148832 2212240 2281330 2356896 2439175 2529566 2630596 2744597
57109 2744597 2873835 3021592 3191558 3386331 3607924 3859518 4145473 4470346 4840030
57100 4840030 5264174 5756400 6332665 7011094 7813034 8762137 9881855 11194764 12723486
57091A2723486J765980K019736K282149K544161K794512L018419L199459L323243
57083C3671145L379116L358444L249345L030451K672362K154234J486274P16185
57075E3717556q9172q69801j584695k208097k722463l115490l379917l514907
57067C6233014l528534l437948l265114l032505k762508k477133k194378j925164
57059A3609730j675397j449663j251078j079462r32515q08144p03987o16054n40260
57050D553170m74668m18461l69905l27029k89151k55871k25744j97594j71876
57041A822871j49123j28491j09480r3280q0561o9745n9398n0444m3904l8533l3019
57030I66893k8402k5669k3058j8595j3141p934j383Q325J9914L2108M7552O8832
$$ plain form
57091 12723486 14489466 16509202 18791351 21335512 24130024 27148443 30347902 33671145
57083 33671145 37050261 40408705 43658050 46688501 49360863 51515097 53001371 53717556
57075 53717556 53628384 52758583 51173888 48965791 46243328 43127838 39747921 36233014
57067 36233014 32704480 29266532 26001418 22968913 20206405 17729272 15534894 13609730
57059 13609730 11934333 10484670 9233592 8154130 7221615 6413471 5709484 5093430 4553170
57050 4553170 4078502 3660041 3290136 2963107 2673956 2418085 2192341 1994747 1822871
57041 1822871 1673748 1545257 1435777 1342497 1261936 1192191 1132793 1082349 1038445 999912 966893
57030 966893 938491 912822 889764 871169 858028 850094 848711 857036 876950 909058 956610 1025442
57018A025442R2829J14443J33500J50276J54326J27379O2706k2833j00412j50435
57008A587221j70670j69031j54696j34918j14541r5773p9162o5100n3845m4915
56998E04570l7585l1567k6562k1904j7361j3596j1151r618q280o872n244l055
56986C11775l00K432M648O426P980R089R022O738J611n455j2092j6391j8351j8845
56972B88287j7998j5645j2638j0155q151n793l082p13J289L439N625P457R432
56959B41354J2364J5838J8656K0494K1576K0959J6841Q935p92r851j6716k0777
56947C28881k2145k1663k0163j7713j4339j0928q319n996k968N33L541O125R245
56934B24091J3077J6918K0545K4300K7863L0032K9493K5051J5834K715j1046k1981
$$ plain form
57018 1025442 1118271 1232714 1366214 1516490 1670816 1798195 1860901 1838068 1737656 1587221
57008 1587221 1416551 1247520 1092824 957906 843365 747592 668430 603330 549485 504570
56998 504570 466985 435418 408856 386952 369591 355995 344844 335226 326946 320074 314830 311775
56986 311775 311475 313907 318555 324981 332961 342050 351072 357810 359421 353966 341874 325483 307132 288287
56972 288287 270289 254644 242006 231851 223700 217907 214825 214112 215401 218840 224465 231922 241354
56959 241354 253718 269556 288212 308706 330282 351241 368082 377017 376225 366374 349658 328881
56947 328881 306736 285073 264910 247197 232858 221930 213611 207615 204647 205180 208721 214846 224091
56934 224091 237168 254086 274631 298931 326794 356826 386319 411370 427204 429919 418873 396892
56922C96892k8929l2459l2884l0506k6862k3593k0433j6211j1490q199o822n940
56910A52564m618l435k952k847k773k683k255j269m00l43m71K07J225J407R98
56895A32355J307K504L573M238N140O342P456R072J2112J5837J8407J9318J9339
56882B57000J8101J3970O740j469q434j3357j5992j6110j4306j1810r050n672
56870A99611k013J000L496O583J0531J4580J8711K3954L0617L7669M4127M9672
56858D38538N3592N4311N0007L9134K1296q11k1247l4853m1258m3272m2260l7640
56846D35537l0151k2393j5692r192k493L474Q844J5566K4730L5279M6128N7421
56834E47058O8937P9187Q6677Q9780Q4876O7517L7354L70l5023o2790q0073q6216
$$ plain form
56922 396892 367963 335504 302620 272114 245252 221659 201226 185015 173525 165326 158504 152564
56910 152564 147946 144511 141559 138712 135939 133256 131001 129732 129332 128989 128518 128725 129950 131357 132355
56895 132355 133662 136166 139739 143977 149117 155459 162915 171987 184099 199936 218343 237661 257000
56882 257000 275101 289071 295811 294342 285908 272551 256559 240449 226143 214333 205283 199611
56870 199611 197598 198598 202094 208677 219208 233788 252499 276453 307070 344739 388866 438538
56858 438538 492130 546441 596448 635582 656878 656067 634820 599967 558709 515437 473177 435537
56846 435537 405386 382993 367301 358109 355616 359090 367934 383500 408230 443509 489637 547058
56834 547058 615995 695182 781859 871639 956515 1024032 1061386 1061756 1026733 963943 883870 797654
56822G97654q3056p4632o4506n3935m3176l3021k3960j5318o542J796R326J7071
56810D27701K6120L6038M5574N4015O0852O4579O2599N2146L1861L802k5878m9891
56798G89518o4307o9720o8533o2752n4379m5644l7683l0215k3055j6757j1409
56787C05064o164n31N115J0649J6434K2190K7000L0583L3028L3062K8367J8191
56775E22988M273j0982k5601l7175m3209m3301l9608l4505k9090k4107k0448j8088
56763B01147j6046j3908j1986r973p279m824m293n288n464m055k908l254l804
56750A08065l125j802r82o70o10j110j913j916j007n14j005j379r11l59j57M55
56734I1060J532J694M54o32l96K23Q3l07j41J53P1J15N96Q12M74M06Q72R15K27
$$ plain form
56822 797654 714598 639966 575460 521525 478349 445328 421368 406050 399508 401304 410630 427701
56810 427701 453821 489859 535433 589448 650300 714879 777478 829624 861485 865287 839409 789518
56798 789518 725211 655491 586958 524206 469827 424183 386500 356285 333230 316473 305064
56787 305064 298900 298369 303484 314133 330567 352757 379757 410340 443368 476430 504797 522988
56775 522988 527261 516279 490678 453503 410294 366993 327385 292880 263790 239683 219235 201147
56763 201147 185101 171193 159207 149234 141955 137131 132838 127550 122086 118031 115123 111869 108065
56750 108065 104940 103138 102156 101486 100876 99766 97853 95937 94930 94416 93411 92032 91121 90762 90605 91060
56734 91060 92592 94286 94740 94108 93712 93935 94018 93711 93570 93723 93794 93909 94505 95317 95791 96197 97069 97984 98211
56715I8211o8N67J140J049R86J073L14j088j296O7Q75K3n88N93K006J775R13J243
56697A07795K017J362l59j217p46pN02R52J032M87R6N39J116R97O30O65O60K65
56679A16786L39J345K053J387K60k8R3m06j180j342j076q82m41L03L18p45j375
56662A15409l80J137J612J273R14J20j359k027p04J226J727J047P00P71N24M42
56646A22432J332K270J804M54j42J90M78P22J546K377K103J134Q27J273J454J113
56630A41367P96M66k19p54m89L1r5n35m76j97m13p82o33m62j085j944j850r47
56612A31779m37p82j412j730j404k81R95J200J74q29j131j558k456k591j269K09
56596A18477O68P95J301J279K02l89O85J969J701O99O25J085Q83N96J253J911
$$ plain form
56715 98211 98143 98710 99850 100899 101885 102958 103272 102184 100888 100955 101830 101853 101265 101858 103864 105639 106552 107795
56697 107795 109812 111174 110815 109598 108852 108845 109347 110299 111331 111818 111914 112453 113569 114566 115196 115861 116521 116786
56679 116786 117125 118470 120523 121910 122170 122142 122235 121829 120649 119307 118231 117349 116908 117211 117529 116784 115409
56662 115409 115029 116166 117778 119051 119965 120085 118726 116699 115995 117221 118948 119995 120695 121466 121990 122432
56646 122432 123764 126034 127838 128292 128150 128340 128818 129540 131086 133463 135566 136700 137527 138800 140254 141367
56630 141367 142163 142629 142410 141656 141167 141198 141103 140568 140092 139895 139482 138700 138067 137605 136520 134576 132726 131779
56612 131779 131342 130560 129148 127418 126014 125733 126728 127928 128102 127273 126142 124584 122128 119537 118268 118477
56596 118477 119145 119940 121241 122520 122722 122333 123018 124987 126688 127387 128012 129097 129980 130576 131829 133740
56580A33740J206L5M0O12J72p29m35O18O96n3J1R64J450J363J840K862L308L097
56562A50797L093L337L474M218O216Q174Q433P600P298P193N799L459J894J375
56548B22360Q88M45O60P15n51k100j992p36n38j660k331j924j475j273p10l80
56532B09398j498l314l741k616j755j799j589p58l01m47k20N92J184J335J312
56517A95783N44j408l161l140k335k763l874l441j599p47j464j814r36j83j94
56502A69268J91J343J910J357R48J439J880J496P84K74m9J18J008J584P57m81
56486A83827k88R00R78l21j160q21n12p51o17K8O7o60j003o56n10o23j24P28O61
56467A79143k25m91J13M18J60K26N93L65q9M92J796K228J672J497J940J914J383
$$ plain form
56580 133740 134946 134981 135021 135633 135805 135076 134641 135259 135955 135902 135913 136877 138327 139690 141530 144392 147700 150797
56562 150797 153890 157227 160701 164919 171135 179309 187742 195342 202640 209833 215632 219091 220985 222360
56548 222360 223248 223693 224353 225068 224517 222417 220425 219689 219151 217491 215160 213236 211761 210488 209778 209398
56532 209398 207900 204586 200845 198229 196474 194675 193086 192328 192027 191580 191360 191952 193136 194471 195783
56517 195783 196327 194919 191758 188618 186283 183520 179646 176205 174606 173859 172395 170581 169645 169462 169268
56502 169268 169459 170802 172712 174069 175017 176456 178336 179832 180616 180890 180841 180959 181967 183551 184308 183827
56486 183827 183539 184439 185417 185096 183936 183115 182603 181852 181235 181263 181330 180670 179667 179011 178501 177878 177754 178482 179143
56467 179143 178918 178427 178540 178958 179118 179344 179937 180302 180213 180705 182501 184729 186401 187898 189838 191752 193135
56450A93135J312J426O24n57n88K10K63j14P03K155J938P0q54J70J386J622J651
56433B04552J746J088O1R4P59J61j396j418N66K095J743P94L10k72r05n39L11
56416B09750k05j796k001l70P48K79j12M92P68J87J09P13L03j231j632k30Q02
56399B06574L58K37J552K699K412J777J737J582J153J492K232J548k66o21Q89
56384B25355J603N50Q7J285J856N98j62J075K133J162o8L38J070N16j65L24O62
56367B38219m40j581j219l26o2M75J834K408J460J060K431L310J664o61r55K36
56351B47853Q92J006J442J463K70r12p91j84j27J10R94J167M7m21J030K582K451
56334B58872J787K012J952M42q13l4J311J055J08N37J830K161J785K133K946L024
$$ plain form
56450 193135 194447 195873 196497 195940 195352 195562 195825 195711 196414 198569 200507 200577 199723 199893 201279 202901 204552
56433 204552 206298 207386 207447 207541 208300 208461 207065 205647 206213 208308 210051 210845 211155 210883 209978 209439 209750
56416 209750 209545 207749 205748 205378 206126 206405 206293 206785 207553 207740 207849 208562 208865 207634 206002 205772 206574
56399 206574 206932 207169 208721 211420 213832 215609 217346 218928 220081 221573 223805 225353 225087 224466 225355
56384 225355 226958 227508 227595 228880 230736 231334 231172 232247 234380 235542 235474 235812 236882 237398 237233 237557 238219
56367 238219 237779 236198 234979 234653 234591 235066 236900 239308 240768 241828 244259 247569 249233 248572 247617 247853
56351 247853 248745 249751 251193 252656 252926 252014 251223 251039 250912 251022 252016 253183 253230 252809 253839 256421 258872
56334 258872 260659 262671 264623 265065 264252 264218 265529 266584 266692 267229 269059 271220 273005 275138 278084 281108
56318B81108K628K682K764K064J102N70q8j184j557n16P55J260J697K421K298
56303B98004J219J180K979M435L934L062L539M241L638K629K463K295J278O48
56289C35544J376K098J701J426K232K724K000J809L311M645M297L945N268O770
56275C79146O739O415P142P339N586L951M732O531P006P028Q521J0471J0800J0250
56261D81657J0904J2638J4204J5999J8742K1324K2773K4463K7656L1186L4103
56250G15649L8051M4186N0535N5434O0724O8223P5926Q1095Q4389Q7484Q9446
56239A451142Q9077Q7884Q6889Q3360P4801O3414N2370M0446K4874P077r200k3434
56227B028700l7369n0273n9754o6034p1200p5353p7237p7346p6942p5498p2242
$$ plain form
56318 281108 283736 286418 289182 291246 292348 292918 292830 291646 290089 289573 290328 291588 293285 295706 298004
56303 298004 299223 300403 303382 307817 311751 314813 318352 322593 326231 328860 331323 333618 334896 335544
56289 335544 336920 339018 340719 342145 344377 347101 349101 350910 354221 358866 363163 367108 372376 379146
56275 379146 385885 392300 399442 406781 412367 416318 421050 427581 434587 441615 450136 460607 471407 481657
56261 481657 492561 505199 519403 535402 554144 575468 598241 622704 650360 681546 715649
56250 715649 753700 797886 848421 903855 964579 1032802 1108728 1189823 1274212 1361696 1451142
56239 1451142 1540219 1628103 1714992 1798352 1873153 1936567 1988937 2029383 2054257 2061334 2052134 2028700
56227 2028700 1991331 1941058 1881304 1815270 1744070 1668717 1591480 1514134 1437192 1361694 1289452
56216A289452o8462o5244o1169n5394n0285m7553m4748l9430l3854l1258l0344
56205G61711k7926k4364k1792j9536j5938j2460j1253j0935r238p465p771q534
56193E84499p173n059m833n323m014k057j798j935k66J363K16j803j315L64j20
56178E50746j785j446L1l02j425l78J654J425l4N89K416K202Q83J842M163M222
56162E64803K639L107N381N996M990N486P336P576O515P199R460J0426J0215J1253
56148F62382J2950J2979J2635J4939J8694K0604K1768K5669L1271L4915L7655
56137I06461M3749N3188O2837P3507Q8239J04512J15839J20512J21254J17222
56127A807320J04689Q5569O7224N3462M3042L6636L6768M0270L9056K9903J6723
$$ plain form
56216 1289452 1220990 1155746 1094577 1039183 988898 941345 896597 857167 823313 792055 761711
56205 761711 733785 709421 687629 668093 652155 639695 628442 617507 608269 600804 593033 584499
56193 584499 577326 572267 567434 562111 558097 556040 554242 552307 552041 553404 553620 551817 550502 550866 550746
56178 550746 548961 547515 547546 547244 545819 545441 547095 548520 548486 549075 551491 553693 554576 556418 560581 564803
56162 564803 567442 570549 575930 581926 586916 592402 599738 607314 613829 621028 630488 640914 651129 662382
56148 662382 675332 688311 700946 715885 734579 755183 776951 802620 833891 868806 906461
56137 906461 950210 1003398 1066235 1139742 1227981 1332493 1448332 1568844 1690098 1807320
56127 1807320 1912009 1997578 2064802 2118264 2161306 2197942 2234710 2274980 2314036 2343939 2360662
56116B360662K876j1378k3509k8968k8395k7865l1072l7500m8002o4529q3810
56105A978510r8763j06901j10675j09806j01181q6554p2359o1002m9742l8410
56095A143117l0366k5401j9671j3300j0212r975p887l625j627k348j537J284K070
56082A020522O78J433M521N414L661L679O029O644N382O413R515R998Q037Q726
56068A100652J2233J3428J1968J2856J6222J6828J4720J5855K0746K3102K1274
56057A279884K0418K1713K0286J5768J3947J5861J5972J3179J2714J5302J5652
56046A460696J3542J4878J9828K1722J9685K0218K4243K5223K2379K2636K6909
56035A691959K7927K4543K4506K9739L2724L1085L1727L6730L9456L8510M0979
$$ plain form
56116 2360662 2363538 2352160 2328651 2299683 2271288 2243423 2212351 2174851 2126849 2062320 1978510
56105 1978510 1879747 1772846 1662171 1552365 1451184 1364630 1292271 1231269 1181527 1143117
56095 1143117 1112751 1087350 1067679 1054379 1044167 1034192 1026305 1022680 1021053 1018705 1017168 1018452 1020522
56082 1020522 1021200 1022633 1027154 1032568 1036229 1039908 1045937 1052581 1057963 1064376 1073891 1083889 1091926 1100652
56068 1100652 1112885 1126313 1138281 1151137 1167359 1184187 1198907 1214762 1235508 1258610 1279884
56057 1279884 1300302 1322015 1342301 1358069 1372016 1387877 1403849 1417028 1429742 1445044 1460696
56046 1460696 1474238 1489116 1508944 1530666 1550351 1570569 1594812 1620035 1642414 1665050 1691959
56035 1691959 1719886 1744429 1768935 1798674 1831398 1862483 1894210 1930940 1970396 2008906 2049885
56024B049885M7688N0195M6888M6773N2540N5576N2800N2465N7703O0538N8230
56013B631281N9139O6152P0810P0267P3195Q2312Q8224Q7465Q9115R6641J01197
56002C515798J00040J02879J12569J18839J18823J23710J37026J47257J50441
55993D627382J58315J74930J87884J92564K01668K20213K35414K42526K55528
55984F496424K80244L02909L17944L39864L74403M06294M29909M62246N10548
55975I920785N58432O00015O54518P29867Q07252Q80320R72106J093233J223922
55966A7440450J359314J529229J749365K000710K284318K645461L113971L676515
55958C5799333M340023N160471O175372P383780Q838578J0678642J3024565J5940030
$$ plain form
56024 2049885 2097573 2147768 2194656 2241429 2293969 2349545 2402345 2454810 2512513 2573051 2631281
56013 2631281 2690420 2756572 2827382 2897649 2970844 3053156 3141380 3228845 3317960 3414601 3515798
56002 3515798 3615838 3718717 3831286 3950125 4068948 4192658 4329684 4476941 4627382
55993 4627382 4785697 4960627 5148511 5341075 5542743 5762956 5998370 6240896 6496424
55984 6496424 6776668 7079577 7397521 7737385 8111788 8518082 8947991 9410237 9920785
55975 9920785 10479217 11079232 11733750 12463617 13270869 14151189 15123295 16216528 17440450
55966 17440450 18799764 20328993 22078358 24079068 26363386 29008847 32122818 35799333
55958 35799333 40139356 45299827 51475199 58858979 67697557 78376199 91400764 107340794
55950A07340794J9531467K3907722K8902669L3966618L8426119M1553222M2052038
55943C35680649L7816852K7100424J0487169q499764k5201356l6440226m1626824
55936B99316924m1951749l9090049l4541873k9477911k4644115k0353484j6678049
55929I2579694j3635337j1192291r232190p632195o336237n308665m478929l783375
55921C0980475l210434k757930k388514k065688j792307j576482j395828j228228
55913A4565064j083332r72323q77810p82262o96856o34959n84152n29877m81099
55904G922394m48394m20544l85676l53202l33263l15668k89550k63622k47599
55895D864876k32998k10928j90136j79473j70429j54291j39212j33395j28220
$$ plain form
55950 107340794 126872261 150779983 179682652 213649270 252075389 293628611 335680649
55943 335680649 373497501 400597925 411085094 402585330 377383974 340943748 299316924
55936 299316924 257365175 218275126 183733253 154255342 129611227 109257743 92579694
55929 92579694 78944357 67752066 58519876 50887681 44551444 39242779 34763850 30980475
55921 30980475 27770041 25012111 22623597 20557909 18765602 17189120 15793292 14565064
55913 14565064 13481732 12509409 11631599 10849337 10152481 9517522 8933370 8403493 7922394
55904 7922394 7474000 7053456 6667780 6314578 5981315 5665647 5376097 5112475 4864876
55895 4864876 4631878 4420950 4230814 4051341 3880912 3726621 3587409 3454014 3325794
55886C325794j14591r9844r2325q4782o8944n1614m0639k9168r241J2418K6949
55875B774013L8531N2463O0551N2812L2338N582k9898p4343j14388j37172j46094
55864B514395j50240j48657j37752j23610j13465j03907q9897p6583p0242o6405
55854A433637n8687n0822m8441m7438m2015l6002l5033l5385l1697k7796k8825
55843I91496l0416k6738k1878k2092k3923k1134j6646j6527j8421j6797j3813
55832G63111j4404j6128j4175j1080j1495j2655r858o239p247j0509j0669r434
55820F29218j1268j3940j2889j0501j1546j3781j2268q964q793j0117q226m640
55808E02285m000n026l379k48L38k78J814N090N477M337N671Q249Q168O451O459
$$ plain form
55886 3325794 3211203 3111359 3019034 2934252 2865308 2813694 2773055 2743887 2734646 2747064 2774013
55875 2774013 2812544 2865007 2925558 2978370 3010708 3016290 2986392 2912049 2797661 2660489 2514395
55864 2514395 2364155 2215498 2077746 1954136 1840671 1736764 1646867 1570284 1500042 1433637
55854 1433637 1374950 1324128 1275687 1228249 1186234 1150232 1115199 1079814 1048117 1020321 991496
55843 991496 961080 934342 912464 890372 866449 845315 828669 812142 793721 776924 763111
55832 763111 748707 732579 718404 707324 695829 683174 673316 667077 659830 649321 638652 629218
55820 629218 617950 604010 591121 580620 569074 555293 543025 534061 525268 515151 506925 502285
55808 502285 498285 493259 489880 489632 489970 489692 491506 496596 502073 506410 512081 520330 528498 534949 541408
55793E41408O621L315j713m278n389q584j2341j2606j0479j0017j0567q536m800
55780D62034l430m917o946r774j4391j7735j6179j1698q511o133j898K613M308
55767C67343M923P710J0307P955J743l233n914q785j1349j1132r526r910j1299
55754C28833j0275p670o973p749p041n666o594q540p882n536n329o763o059l441
55740B33315k643l840l670j828j245j972j134J115J562j05r49m47r29k505k904
55725B11821k324l170n058n238l873l848n373n801m639l891l518j564J352K500
55711A67376J912K182L598M131L897M886O494O087L890K626K375N76k917n432
55697B01681o196o961p926p430n759m983n019l961k152j704k291j745m30o54j961
$$ plain form
55793 541408 548029 551344 549631 545353 539964 531380 519039 506433 495954 485937 475370 466834 462034
55780 462034 458604 453687 446741 436967 422576 404841 388662 376964 368453 362320 360422 363035 367343
55767 367343 372266 379976 390283 398238 399981 396748 390834 382049 370700 359568 350042 340132 328833
55754 328833 318558 310888 303915 296166 289125 283459 276865 268325 260443 254907 249578 242815 236756 233315
55740 233315 230672 226832 223162 221334 220089 218117 216983 218098 219660 219555 218606 218159 217230 214725 211821
55725 211821 209497 206327 201269 196031 192158 188310 182937 177136 172497 168606 165088 163524 164876 167376
55711 167376 169288 171470 175068 179199 183096 187982 194476 200563 204453 207079 209454 210030 207113 201681
55697 201681 195485 188524 180598 173168 167409 162426 157407 153446 151294 149590 147299 145554 145124 144470 142509
55682A42509j595N16J760J639K172L539L821L004K844K836Q37k387l756l053k909
55667A51777l681l090j161o45j951k379j059j84n11r1J660K813K724L006L975
55652A51203M042L329L852N494N708L973K583K376J631r9j098j109j963l825m672
55637A71425m241m533n781n910m743m582n777n855m089k788k876k417q05k60j625
55622A15143k612j942j394k030k118p20K57m00r77j31O15j71j259j112l34lJ21
55605A00933J76o40k145k729j951j333j555j464o86n07j201j227k05J80o85j142
55589H3819l69J52m69r46m49r1m59l01R20J744J356J048J629J866Q80j94l27j82
55571H9627l20l4Q73J257P07L66P58R23N32N51J076Q59k51q73q11j508l007l288
$$ plain form
55682 142509 140914 141430 143190 144829 147001 150540 154361 157365 160209 163045 163882 161495 157739 154686 151777
55667 151777 148096 145006 143845 143200 141249 138870 137811 137627 137116 137025 138685 141498 144222 147228 151203
55652 151203 155245 158574 162426 167920 173628 177601 180184 182560 184191 184092 182994 181885 179922 176097 171425
55637 171425 167184 162651 156870 150960 146217 141635 135858 130003 125914 123126 120250 117833 117028 116768 115143
55622 115143 112531 110589 109195 107165 105047 104327 104584 104184 103207 103076 103691 103520 102261 101149 100815 100812 100933
55605 100933 101109 100469 98324 95595 93644 92311 90756 89292 88606 88099 86898 85671 85466 85646 84961 83819
55589 83819 83450 83602 83133 82187 81738 81647 81188 80887 81807 83551 84907 85955 87584 89450 90330 90136 89809 89627
55571 89627 89307 89273 90146 91403 92110 92476 93234 94157 94689 95240 96316 97175 96924 96051 95240 93732 90725 87437
55553H7437j718l61n97j149p49j71k84n02m20o76j077m08R55R63n06r31P25K176
55535H2707J666O24N96N00q38k019j384Q0N14L1j96j50k73r1P18J236P54rl40
55516H4126o16j018q56k03l19j436k102j681j436k000k149j272p51j468k159j751
55500F2909j165j270j264o17m44j267j587m04Q67Q04K74N87J192J086P56R65J222
55483F2644J082J246J853J530k63j779j579p29o77q24o8R58J179J061J408J564
55467F8606O90n03r27p76n68j3Q45Q93j66q90m34m0o87j252o99j14o02j006N4
55448F2411J528J613O85L14N69M52m8l08n53j142j321m14P42J086J034J367J592
55431F9607R73L1m22n76o38L9J373J758M62q07m54N05L70m48n94k69l25k60P07
$$ plain form
55553 87437 85719 85358 84761 83612 82863 82692 82408 81906 81486 80810 79733 79325 80280 81243 80737 79806 80531 82707
55535 82707 84373 84997 85593 86093 85255 83236 81852 81932 82446 82477 82281 82131 81858 81767 82485 83721 84475 84466 84126
55516 84126 83510 82492 81636 81433 81114 79678 77576 75895 74459 72459 70310 69038 68287 66819 64660 62909
55500 62909 61744 60474 59210 58593 58149 56882 55295 54891 55758 56562 56836 57423 58615 59701 60457 61422 62644
55483 62644 63726 64972 66825 68355 68092 66313 64734 64005 63328 62504 62436 63394 64573 65634 67042 68606
55467 68606 69296 68793 67866 67090 66522 66509 67354 68247 68081 67191 66757 66717 66030 64778 64079 63965 63363 62357 62411
55448 62411 63939 65552 66237 66551 67120 67572 67524 67216 66663 65521 64200 63786 64528 65614 66648 68015 69607
55431 69607 70580 70611 70189 69613 68975 69014 70387 72145 72607 71800 71346 71851 72221 71773 71179 70910 70585 70325 71032
55412G1032J702J508P43O08O42j59j114j037n81j063j858j436k30nq22j049j61
55395F6720O74P31N06L38L0k68j84k4k79n80l59M1P0P3M51N61j56r16q77p12j308
55374F4532j925j460n45n49j267j542j424j777k337k116j266o73j60J062K566
55359E1119L139K709K190J888J629J962L333M507L705J216q31j146k84P82J482
55344G7400J330K48q89j278j365j827k084j262NM35J62K38N81K66n31o54N9O65
55326G1499Q19J019J231Q68R0l15k53k56k87O8M77K64k75l52j23l73j016j311
55308G1774j229j220r97K6J372J986J803J502J075J52o94n65J25J79m22n99o1
55291G4207L91L89L78N48O55Q15J269J574J201O16N35N95J03m65k25L25m1j213
$$ plain form
55412 71032 72734 74242 74985 75593 76235 76076 74962 73925 73344 72281 70423 68987 68757 68752 67930 66881 66720
55395 66720 67394 68125 68631 68969 68999 68731 68547 68523 68244 67664 67305 67346 67416 67489 67940 68501 68345 67429 66552 65840 64532
55374 64532 62607 61147 60602 60053 58786 57244 55820 54043 51706 49590 48324 47651 47491 48553 51119
55359 51119 54258 56967 59157 61045 62674 64636 67969 72476 76181 77397 76566 75420 75136 75918 77400
55344 77400 78730 78978 78089 76811 75446 73619 71535 70273 70278 70713 70875 71113 71694 71960 71429 70775 70834 71499
55326 71499 72318 73337 74568 75436 75526 75211 74958 74702 74415 74483 74960 75224 74949 74597 74474 74101 73085 71774
55308 71774 70545 69325 68328 68354 69726 71712 73515 75017 76092 76244 75550 74985 75110 75289 74867 74268 74207
55291 74207 74598 74987 75365 75913 76568 77383 78652 80226 81427 82043 82578 83173 83276 82811 82586 82911 82870 81657
55273H1657j966j973j893j710p81N58J198J089J160J456J031j46q67n99j53j39
55257G7922r1M28J029J148O18m50j445j310J27J299O40j136j993j412o55m42k19
55240G4058K75M20L9k35j56j07p9K84O23L13r7M84J583J504L9r65l26Q24Q94o3
55220G9312r23j070o10K28J094J538J495J323J178Q79M03p1n15q63p63j47L11
55203H2799P2m55p05r60j512j606n50P68R62K22j74jj00o13q53p38p39o29J12
55184G5300Q59N53l48m14L85P04J71j28K86O53O32P89J123Q75J38n2L79K55p79
55165H1381j542j235m71P6N65J042J066P97R98J628J823J564J671J877Q29j394
55149I0675k643j602L52J192P47J20j52k41k67l42o20p81k79N54O60j10o96m97
$$ plain form
55273 81657 79691 77718 75825 74115 73334 73892 75090 76179 77339 78795 79826 79680 78813 78214 78061 77922
55257 77922 77831 78259 79288 80436 81054 80604 79159 77849 77976 79275 79915 78779 76786 75374 74719 74277 74058
55240 74058 74333 74753 74792 74557 74401 74294 74215 74499 75122 75435 75338 75822 77405 78909 78948 77983 77657 78481 79375 79312
55220 79312 78389 77319 76709 76937 78031 79569 81064 82387 83565 84444 84847 84776 84261 83398 82635 82488 82799
55203 82799 82871 82416 81711 80751 79239 77633 77083 77851 78813 79035 78861 78860 78760 78147 77294 76556 75817 75188 75300
55184 75300 76159 76712 76364 75950 76335 77039 77210 77082 77368 78021 78653 79442 80565 81440 81578 81526 81905 82160 81381
55165 81381 79839 78604 78133 78209 78774 79816 80882 81679 82677 84305 86128 87692 89363 91240 92069 90675
55149 90675 88032 86430 86782 87974 88721 88841 88689 88448 88181 87839 87219 86438 86159 86713 87373 87263 86567 86070
55131H6070j73l31o58p89q27o32J37R42O93m20q47M7J091J247R45Q19N85L2k88
55112H7643j50j78n41m25M31J005O47J06R3J05l56p01l93j1q3k8O73J325J138
55093I0300N73M81P44Q08P66R18R22L60m76j045j237j028k61O79Q62J36m26L5
55075I3111J090J920K222J863P07n74q20j05J17p05j221m37N58L54n95r64p20
55058I5801p39j068j039o27m20n77q05r70r28l48O04J034N81J04L58P75N03k11
55040I2028o27o96o94l68M15R48O25J3m2K79L70M11Q87J440J350P40K80P4j76
55021I7257l72k92k30m77n83q8M78L01m15p67m68KK37J73j83n61m18K90P47M19
55001I5050r5k7L78M83L93N13N69J17l89j39P08J197R18L49N0K19P71J252R89
$$ plain form
55131 86070 85897 85566 84908 84119 83292 82660 82797 83739 84432 84012 83165 83212 84303 85550 86495 87314 87899 87931 87643
55112 87643 87493 87315 86774 86349 86780 87785 88432 88538 88631 88736 88380 87679 87286 87275 87192 87164 87837 89162 90300
55093 90300 90873 91354 92098 92906 93672 94590 95512 95872 95396 94351 93114 92086 91825 92504 93366 93502 93076 93111
55075 93111 94201 96121 98343 100206 100913 100339 99519 99414 99531 98826 97605 97168 97726 98080 97485 96521 95801
55058 95801 95062 93994 92955 92328 91908 91331 90526 89556 88628 88280 88884 89918 90499 90603 90961 91736 92239 92028
55040 92028 91401 90705 90011 89643 90058 91006 91631 91644 91602 91881 92251 92662 93549 94989 96339 97079 97359 97433 97257
55021 97257 96885 96593 96363 95886 95303 95215 95693 95994 95579 94812 94344 94346 94583 94756 94573 94012 93594 93884 94631 95050
55001 95050 94955 94928 95306 95789 96182 96695 97264 97381 96992 96853 97561 98758 99676 100025 100075 100294 101065 102317 103306
54982A03306j15j258j712j629j391r34l05p2l80l98L52R85O45P2M97J589J993
54965A01245J433Q40O19L04j01J26J035J645J382Q54P59R05P65L46j1k10m19o61
54947A10856p58n61j79L8j15l46j93K51M21J59j9K13M80L90J22n7k12l76l15p1
54927A09728Q7M87J888M026N417N330M901N402O496P217P689Q483R116Q639P170
54912A92076N432L256%l777o528p592p642p343o781o162n854n619m861l743l047
54897A31815k846k399j517r41j116j425j141l51L52N76K69k33k82N04J558J926
54881A24749J521J316K117L685N243O356P138P926Q831R459R122P561N278K871
54867B03173L46k513n424p687q888r125q751q212p837p448o497m896l379k611
$$ plain form
54982 103306 103191 101933 100221 98592 97201 96267 95962 95890 95510 95112 95464 96449 97094 97166 97663 99252 101245
54965 101245 102678 103518 104137 104441 104340 104466 105501 107146 108528 109382 110141 111046 111811 112157 112146 111936 111517 110856
54947 110856 110098 109537 109358 109396 109281 108935 108742 108993 109414 109573 109554 109767 110247 110637 110759 110702 110490 110114 109799 109728
54927 109728 109815 110302 112190 116216 121633 126963 131864 137266 143762 150979 158668 167151 176267 184906 192076
54912 192076 197508 200764 200764 196987 190459 182867 175225 167882 161101 154939 149085 143466 138605 134862 131815
54897 131815 128969 126570 125053 124112 122996 121571 120430 120079 120431 121007 121276 121043 120761 121265 122823 124749
54881 124749 126270 127586 129703 133388 138631 144987 152125 160051 168882 178341 187463 195024 200302 203173
54867 203173 203519 201006 195582 187895 179007 169882 161131 152919 145082 137634 131137 126241 122862 120251
54853A20251k443k341k061j502n27M92O85j08p84m23L29K50o58j347j304q97m08
54836A07204J49M49O4o94r67m81J76M15K59P3J68N53P60K66o46r84l97K09J09
54817A06685j22K71P41L11o74r83m26l6l62p35l58P60J962K438J642k3j162q27
54799A09102K35N65j06p85p73k75K67N70L93j37l39J02M72J73q6N79J509J386
54781A12852M41J83R99J689J537J229J381J613J626J873K577L166L242L217L486
54766A41111L906M470N607P318Q800R371R063Q084O467M422K265k02l363o653
54752B00666q801r377r164q737p830o383n067m218l345k248j598j729j869j310
54738A28990m89j44j90j91k03l61k64L50R52J021R48J377K165K849L640M980O420
$$ plain form
54853 120251 117808 115467 113406 111904 111377 111869 112554 112446 111662 111239 111568 111818 111160 109813 108509 107612 107204
54836 107204 107353 107802 107866 107172 106205 105724 105900 106315 106574 106647 106815 107368 108128 108394 107748 106764 106367 106576 106685
54817 106685 106563 106834 107575 107886 107212 106229 105803 105767 105405 104670 104312 105072 107034 109472 111114 111091 109929 109102
54799 109102 109337 109902 109796 109011 108238 107963 108230 108800 109193 109056 108717 108819 109291 109464 109378 109957 111466 112852
54781 112852 113293 113476 114475 116164 117701 118930 120311 121924 123550 125423 128000 131166 134408 137625 141111
54766 141111 145017 149487 155094 162412 171212 180583 189646 197730 204197 208619 210884 210682 207319 200666
54752 200666 191865 182488 173324 164587 156757 150374 145307 141089 137744 135496 133898 132169 130300 128990
54738 128990 128501 128357 128167 127976 127773 127412 127148 127498 128450 129471 130419 131796 133961 136810 140450 145430 151850
54721A51850O958O458N861N952O561P034O825N529K930n77l939o144o997p140
54707A81161p366p896q253p806o416m571l001k203k125k128j513l69L41n7j025
54692A26773j517j378j285j414j077O1J272J688J336P20oq79j523j465r29o91
54676A19686j036j416j298r04p53q11o17k01k08q58j367r86j88k3n06o70j69K42
54658A07917J31J60Q25J454J291P03M02K13l19p01j35J034J652J335O88J97q8
54641A16759N5Q08J576J491O26j61n16p39q23m71Jq9o05p44m73o19j379j875j493
54622A11329o73JM99Q18P02K99J70L32J39n02p48j11P87J198J198J161J020O64
54604A18283L51K66J89rj04p7k81p05p63k25L35M25L46N91J077J427J498J297
$$ plain form
54721 151850 158808 165266 171127 177079 183640 190674 197499 203028 205958 205381 201442 195298 188301 181161
54707 181161 173795 165899 157646 149840 143424 138853 135852 133649 131524 129396 127883 127514 127855 127798 126773
54692 126773 125256 123878 122593 121179 120102 120163 121435 123123 124459 125179 125173 124294 122771 121306 120377 119686
54676 119686 118650 117234 115936 115032 114279 113468 112851 112650 112442 111584 110217 109231 109043 109020 108514 107844 107675 107917
54658 107917 108048 108208 109033 110487 111778 112481 112883 113096 112777 112076 111941 112975 114627 115962 116650 116847 116759
54641 116759 116814 117622 119198 120689 121315 121154 120638 119899 119076 118605 118606 118517 117912 117168 116695 116076 114697 112822 111329
54622 111329 110656 110657 111156 111974 112676 112975 113145 113477 113616 113114 112366 112255 113042 114240 115438 116599 117619 118283
54604 118283 118634 118900 119089 119080 118976 118899 118618 117913 117150 116925 117260 117685 118031 118622 119699 121126 122624 123921
54586A23921Q35L56J91K11j5l85k98K67M96o9q69j240j283j328j266q82l41J80
54568A18481P89J400J494Q26j03o69q22q16p23n59m93n42m43kP06J583K461K816
54550A25384K181R43M5j74j93k73m2O87J479J961K189K113J500O24J87K87K91
54533A39189L9J75R58J667J708J357R45J82r94j874j933j587j401j267j002r20
54517A35242j132j023k39N09M06k60n97l07K85Q54J064M75q13j863j859j008m4
54500A29690O10P89L71k81l62K98Q20N49L8P9M45M20m0m57o37o02k23L80O24L28
54480A32839K00P13J247J117P82R90J386J134M73M16J102J610J386Q87O93Q60
54464A47835J178J425J347R50O87Q24Q82L59l66n88n00r03j816k276j666n29K20
$$ plain form
54586 123921 124756 125112 125303 125514 125499 125114 124816 125083 125579 125510 124641 123401 122118 120790 119524 118642 118301 118481
54568 118481 119270 120670 122164 122990 122887 122218 121396 120580 119857 119298 118805 118263 117820 117818 118524 120107 122568 125384
54550 125384 127565 128508 128553 128379 128186 127913 127871 128558 130037 131998 134187 136300 137800 138424 138611 138898 139189
54533 139189 139228 139403 140361 142028 143736 145093 146038 146220 145226 143352 141419 139832 138431 137164 136162 135242
54517 135242 134110 133087 132848 133357 133763 133503 132906 132599 132884 133738 134802 135277 134464 132601 130742 129734 129690
54500 129690 130300 131089 131460 131179 130817 131115 131935 132484 132522 132601 133046 133466 133426 132969 132332 131730 131507 131887 132511 132839
54480 132839 133039 133752 134999 136116 136898 137888 139274 140408 140881 141297 142399 144009 145395 146282 146975 147835
54464 147835 149013 150438 151785 152735 153422 154246 155128 155487 155121 154533 154033 153130 151314 149038 147372 146843 147063
54447A47063L29K20L50O92P52J71o77r82n57j37k84o20n75l65n07q11o38N2O20
54428A44096O51L39M9o9k5P5J30K28N55R41R66O52M93N54K48o17j271j135p08
54409A46152o99q42m74K30M50j04r33j397j097k1J181J580J114P70J134J518J258
54392A49820R31J273J772J495P46N57R62J107P71N02M15J33k66m06o42j579k650
54375A54941k502j019L70O81M51M76N57K05l52n17j65L51O05L01m55r50n13N52
54357A53017J224J081O67M81L67P9k22m74r47j642j954j490p10l38l61j37O04
54340A49245J225R01k50j033n04P59J355R75Q11J664K687K714K012J620J569J098
54324A66848K76K1M23L93p14k166k972l011k665k055j184l46L8k58j181k261k691
$$ plain form
54447 147063 147392 147612 147962 148654 149406 149577 148900 147918 147361 147224 146940 146320 145745 145380 144873 144062 143424 143476 144096
54428 144096 144747 145086 145135 145066 145041 145116 145246 145474 146029 146970 147936 148588 149081 149635 149883 149266 147995 146860 146152
54409 146152 145453 144611 144137 144367 144817 144713 143780 142383 141286 141265 142446 144026 145140 145910 147044 148562 149820
54392 149820 150751 152024 153796 155291 156037 156594 157556 158663 159434 159936 160351 160484 160218 159812 159170 157591 154941
54375 154941 152439 151420 151790 152471 152922 153398 153955 154160 153808 153291 153126 153477 154082 154383 153928 152978 152465 153017
54357 153017 154241 155322 155989 156470 156837 156916 156694 156220 155273 153631 151677 150187 149477 149139 148778 148641 149245
54340 149245 150470 151371 151121 150088 149584 150343 151698 152673 153484 155148 157835 160549 162561 164181 165750 166848
54324 166848 167124 167145 167568 167961 167247 165081 162109 159098 156433 154378 153194 152848 152886 152628 151447 149186 146495
54307A46495k064r96m29l92j09O84J363J341P11j98j096j577j355q52p53r06m43
54290A39424P58J674J519P41J98L6m7m2J95M29L10o4k77j88K7J78K04O2k80p64
54270A44093j245j535j449r02%J075K065K528K101J063K34M4R9%J2M04P31M76
54252A49794n2k58k38l42l36J7L6r57k064j662J64J518J274L63M6K64M16N48Q59
54233A49390R44M03l27o05n21n09n38l89l27p74j529j932j637q49N6O97P54K50
54215A42557k85k89K32P08N53k64j112j242o51j50k46l60K56J180J321O03J02
54198A42913L56O03J07p16j050q01l63J24O38Q58N72J28L6K95N28N03K53j04l56
54179A44524k92kJ88K28L34M43J33o59j367j532j316j084r23p96p28n71j13L43
$$ plain form
54307 146495 144431 143435 143006 142614 142505 143189 144552 145893 146604 146406 145310 143733 142378 141526 140773 139867 139424
54290 139424 140182 141856 143375 144116 144314 144350 144303 144261 144456 144885 145195 145131 144854 144666 144693 144871 145075 145137 144857 144093
54270 144093 142848 141313 139864 138962 138962 140037 142102 144630 146731 147794 148028 148072 148171 148171 148183 148587 149318 149794
54252 149794 149742 149484 149246 148904 148568 148585 148621 147664 145600 143938 144102 145620 146894 147257 147303 147567 147983 148531 149390
54233 149390 150334 150737 150410 149805 149284 148775 148237 147848 147521 146747 145218 143286 141649 140800 140856 141553 142307 142557
54215 142557 142272 141983 142215 142923 143476 143212 142100 140858 140207 140057 139811 139451 139707 140887 142208 142811 142913
54198 142913 143269 143872 143979 143263 142213 141412 141049 141173 141811 142669 143241 143369 143405 143700 144228 144731 144984 144880 144524
54179 144524 144232 144230 144418 144646 144980 145423 145556 144897 143530 141998 140682 139598 138675 137879 137151 136580 136467 136810
54161A36810J08q42j536j176j60N53N99K86k3j30Q3M71N96L62K98P79J278R97
54143A39353O2n09j5J173K092K119J394N70J86J82R1k65m72p2P28J144O14n83
54125A47792j566j706j233q36p43n05J68Q38R60O63L92K19O5K72J124K007J978
54108A49889J103L62J66j18r39j784j994j630j108o22k76k61n00n85l46n2J31
54091A41436L77O97P90O31O33R63J174Q73K06m27p14l39P66J912K083J162R9l57
54073A51965l96m17l29m4J20K3M5M06O90N97M67O71R43R02O70N54N70O62Q69R94
54053A59962O94K17L15R86J157K52p50o17M89J457J788J800J719J528J435J738
54037A74170K323K875L438M151M790N119N413O039O819P416Q019Q963R954J0406
$$ plain form
54161 136810 136918 136076 134540 133364 133204 133757 134356 134642 134619 134489 134572 135043 135639 136001 136299 137078 138356 139353
54143 139353 139415 138906 138891 140064 142156 144275 145669 146239 146425 146607 146698 146433 145961 145889 146617 147761 148375 147792
54125 147792 146226 144520 143287 142451 141708 141203 141371 142209 143169 143832 144224 144443 144508 144780 145904 147911 149889
54108 149889 150992 151354 151520 151402 150463 148679 146685 145055 143947 143325 143049 142788 142288 141703 141357 141305 141436
54091 141436 141813 142510 143300 143931 144564 145527 146701 147574 147780 147353 146639 146300 147066 148978 151061 152223 152322 151965
54073 151965 151569 151152 150823 150779 150899 150922 150967 151373 152063 152660 153127 153798 154741 155643 156313 156867 157437 158099 158968 159962
54053 159962 160656 160873 161188 162174 163331 163583 162833 162216 162705 164162 165950 167750 169469 170997 172432 174170
54037 174170 176493 179368 182806 186957 191747 196866 202279 208318 215137 222553 230572 239535 249489 259895
54023B59895J0451J0842J1898J3150J4052J4425J4030J2214Q366K678l611q853
54011C59537j2065j3494j3906j3533j2226j0517r539r575r553q566p182o441o203
53998B26737n427l810k201j466j621k156k606k706k381j722q88j19J75l07j214
53983A98288j755j699j647k067k565k553k110j699j477j347j298j253r89n59l79
53968A74891m77k72M58R86O75m3l43j71LP0K01K80K03L68J105J967K316K274K318
53949A86809K309J763Q89N23J083K149K957K875J753L62J3J084K399K816K829
53934B12613L584M863N275M281K803J742J051M93K62M67P87J056J559K448L317
53919B46601L617L206K429J944K320L460M561N105N558O506P511P589O679N726
$$ plain form
54023 259895 270346 281188 293086 306236 320288 334713 348743 360957 369323 372001 368390 359537
54011 359537 347472 333978 320072 306539 294313 283796 274257 264682 255129 246563 239381 232940 226737
53998 226737 221310 217500 215299 213833 212212 210056 207450 204744 202363 200641 199753 199634 199809 199502 198288
53983 198288 196533 194834 193187 191120 188555 186002 183892 182193 180716 179369 178071 176818 175829 175270 174891
53968 174891 174414 174142 174600 175586 176261 176218 175875 175704 175707 175777 175978 176258 176461 176829 177934 179901 182217 184491 186809
53949 186809 189118 190881 191770 192293 193376 195525 198482 201357 203110 203472 203485 204569 206968 209784 212613
53934 212613 216197 221060 226335 230616 233419 235161 236212 236705 236967 237434 238221 239277 240836 243284 246601
53919 246601 250218 253424 255853 257797 260117 263577 268138 273243 278801 285307 292818 300407 307086 312812
53905C12812N389N395N249M749L776K287O83m33r49j264j607j898k141k371k344
53890C27333j892j523j876k768l475l873m426n101n263m781m289m146l935l275
53876B76710k339j281L8J457K342K404K127K006J898J487Q21J12m74n22N68K853
53860B90207N484P393P982P002M242k19n678j0921j4581j5644j4126j1331q859
53847B40951p269o098m977m079l446k790k182k098k508k674k286j981k198k282
53833A94083j458q6Q62J129J133R09N4j244k042j771r60m59m38n08m77m56l62
53816A87909P8P49R99M65k97m15K40J023J473J743K021K110J881J616J586J697
53800B04878J887K413L295L952L925L615L688M081M206L985L969M397M774M408
$$ plain form
53905 312812 318201 323596 328845 333594 337370 339657 340340 339907 338958 337694 336087 334189 332048 329677 327333
53890 327333 325441 323918 322042 319274 315799 311926 307500 302399 297136 292355 288066 283920 279985 276710
53876 276710 274371 273090 273128 274585 276927 279331 281458 283464 285362 286849 287670 287782 287308 286786 287354 290207
53860 290207 295691 303084 311066 318068 322310 322091 316413 305492 290911 275267 261141 249810 240951
53847 240951 233682 227584 222607 218528 215082 212292 210110 208012 205504 202830 200544 198563 196365 194083
53833 194083 192625 192539 193401 194530 195663 196572 196626 195382 193340 191569 190609 190150 189712 189204 188727 188271 187909
53816 187909 187987 188736 189735 190200 189903 189488 189728 190751 192224 193967 195988 198098 199979 201595 203181 204878
53800 204878 206765 209178 212473 216425 220350 223965 227653 231734 235940 239925 243894 248291 253065 257473
53786B57473L111J392J35p7L98O06J84k40k39l85j287k375k634k142j895k258
53770B49767k640k616k471k464k450k340k293k293k137j905j904k164k467k725
53756B16898k791k195q97L9n24k206l501l637l164k682k142j492r74n29J31O87
53740A91021M43m20q31l30L57O15P43J042J135P27K74K15L63M90P85J236J310
53723A99175P96K78K38M05M72O34R21P98J21l26Q1Q40J204J281J444J415R34P35
53705B11446J678L185L706K778J600J373J936K369K307K145K263K511K501K137
53691B43935J689J396J218J130J312J721J820J223L93M4P6j29n25n22k10l33q69
53674B53369q70j72N3p69j332k87J575K302J483N54O35J251J399Q13j03r21j377
$$ plain form
53786 257473 260584 261976 262111 262034 262432 263038 263222 262982 262743 262358 261071 258696 256062 253920 252025 249767
53770 249767 247127 244511 242040 239576 237126 234786 232493 230200 228063 226158 224254 222090 219623 216898
53756 216898 214107 211912 211015 211054 210530 208324 204823 201186 198022 195340 193198 191706 190732 190203 190334 191021
53740 191021 191464 191044 190213 189883 190240 190855 191598 192640 193775 194502 194776 194991 195354 195844 196629 197865 199175
53723 199175 199971 200249 200487 200892 201364 201998 202919 203717 203838 203512 203593 204433 205637 206918 208362 209777 210711 211446
53705 211446 213124 216309 220015 222793 224393 225766 227702 230071 232378 234523 236786 239297 241798 243935
53691 243935 245624 247020 248238 249368 250680 252401 254221 255444 255837 255881 255957 255828 255303 254781 254571 254238 253369
53674 253369 252499 252327 252380 251611 250279 249992 251567 253869 255352 255906 256541 257792 259191 260004 259901 258980 257603
53657B57603j423j366j643k264k715k535j831j117p78q13j011j242j442j355o89
53642B35379K50N84mn81j33R24J306P72L86Q20J463J573J288J012P31M64N75J138
53624B47947J669J934K236K502K134J262J084K117L192L127K511K652L534M065
53610B81966L883L634L652L560L150K795K821L107L261K845J717N29L31J198J833
53595C20282J213J4m30N5O28Q05P59N81K26j15m10j097k180k653j837p23p45j660
53577C12713k051j609j393j921k496k587k475k246j430r7Q46R18P02P38Q32P96
53561B99240J077J970K963L392L254K933K597K180J566O26n63j499j736j491j260
53546C15249r85l54L51O48Q90J790K921L006J951J279K002L286L919M022M394
$$ plain form
53657 257603 256180 254814 253171 250907 248192 245657 243826 242709 241931 241118 240107 238865 237423 236068 235379
53642 235379 235629 236213 236209 235628 235495 236419 237725 238497 238883 239703 241166 242739 244027 245039 245770 246234 246809 247947
53624 247947 249616 251550 253786 256288 258422 259684 260768 262885 266077 269204 271715 274367 277901 281966
53610 281966 285849 289483 293135 296695 299845 302640 305461 308568 311829 314674 316391 316920 317251 318449 320282
53595 320282 321495 321509 321079 321134 321762 322567 323326 323907 324133 324018 323608 322511 320331 317678 315841 315118 314373 312713
53577 312713 310662 309053 307660 305739 303243 300656 298181 295935 294505 294408 295254 296172 296874 297612 298444 299240
53561 299240 300317 302287 305250 308642 311896 314829 317426 319606 321172 321798 321235 319736 318000 316509 315249
53546 315249 314264 313910 314261 314909 315799 317589 320510 323516 325467 326746 328748 332034 335953 339975 344369
53531C44369N111N701O139O768P608Q466R375J0392J1252J1714J1870J1830J1567
53518D62162J1383J1879J3076J4178J4743J5334J6499J7841J8786J9597K0841
53507F36319K2341K3491K4125K4364K4046K3159K2375K2252K2255K1540K0387
53496H86654J9794J9842J9583J8675J7934J8030J8558J8879J9017J9176J9044
53485A095186J8322J7528J7505J8205J8605J7990J6845J6131J5938J5382J3928
53474A281565J2287J1414J0920R355O209K701J42j704l837o325q440j0091j1955
53461A292241j4168j5971j6917j7486j8171j8827j9324k0081k1325k2459k2869
53450A084643k2843k3058k3487k3485k2758k1609k0369j9184j8269j7795j7445
$$ plain form
53531 344369 349480 355181 361320 368088 375696 384162 393537 403929 415181 426895 438765 450595 462162
53518 462162 473545 485424 498500 512678 527421 542755 559254 577095 595881 615478 636319
53507 636319 658660 682151 706276 730640 754686 777845 800220 822472 844727 866267 886654
53496 886654 906448 926290 945873 964548 982482 1000512 1019070 1037949 1056966 1076142 1095186
53485 1095186 1113508 1131036 1148541 1166746 1185351 1203341 1220186 1236317 1252255 1267637 1281565
53474 1281565 1293852 1305266 1316186 1325541 1331750 1334451 1334593 1332889 1329052 1322727 1314287 1304196 1292241
53461 1292241 1278073 1262102 1245185 1227699 1209528 1190701 1171377 1151296 1129971 1107512 1084643
53450 1084643 1061800 1038742 1015255 991770 969012 947403 927034 907850 889581 871786 854341
53439H54341j6602j5094j3362j1786j0247q442o307m059k030o03M9K22M96J260
53425G67836K541M279O421Q749J0870J2525J3697J4525J5320J6496J8135J9686
53413I11080K0635K1340K2644K4586K6306K7355K8364K9926L1631L2861L3881
53402A210609L5354L7203L8883M0469M2523M5024M7339M9245N1147N3129N4631
53391A705556N5242N5154N4655N3845N3098N3029N3595N3851N2923N0757M7637
53380B289342M3771L9670L6197L3578L0984K7703K4096K0780J7419J3303Q664
53369B585507M367M81l824q999j4706k0807k7730l5464m2968m9227n4273n8532
53357B273825o1615o2591o1405n9350n7893n7370n7057n6198n4654n2679n0479
$$ plain form
53439 854341 837739 822645 809283 797497 787250 778808 772501 768442 766412 765809 765858 766080 766576 767836
53425 767836 770377 774656 781077 789826 800696 813221 826918 841443 856763 873259 891394 911080
53413 911080 931715 953055 975699 1000285 1026591 1053946 1082310 1112236 1143867 1176728 1210609
53402 1210609 1245963 1283166 1322049 1362518 1405041 1450065 1497404 1546649 1597796 1650925 1705556
53391 1705556 1760798 1815952 1870607 1924452 1977550 2030579 2084174 2138025 2190948 2241705 2289342
53380 2289342 2333113 2372783 2408980 2442558 2473542 2501245 2525341 2546121 2563540 2576843 2585507
53369 2585507 2589874 2590355 2586531 2577532 2562826 2542019 2514289 2478825 2435857 2386630 2332357 2273825
53357 2273825 2212210 2149619 2088214 2028864 1970971 1913601 1856544 1800346 1745692 1693013 1642534
53346A642534m8226m6283m5022m4427m4077m3641m3201m2868m2313m0928l8469
53335A163079l5353l2296k9788k7860k6200k4324k1802j8540j5109j2562j1520
53324I07725j1350j0669q943p139o390o467o277n538m961m753m039k186Q7J606
53310H30706K144K427L199M837P324R983J1625J1756J1396J1970J3590J5187J6196
53297I52340J7244J8994K1077K2670K3662K4740K6407K8309K9637L0056L0063
53286A225199L0185L0112K8934K6393K3401K1059J9464J7861J5673J3000J0264
53275A461545P771N504L114K06l151o436r291j1832j4097j5713j6539j7243j8705
53262A365133k1010k3592k6022k8160k9747l0579l0935l1323l1767l1949l1912
$$ plain form
53346 1642534 1594308 1548025 1503003 1458576 1414499 1370858 1327657 1284789 1242476 1201548 1163079
53335 1163079 1127726 1095430 1065642 1037782 1011582 987258 965456 946916 931807 919245 907725
53324 907725 896375 885706 876763 869624 863234 856767 850490 844952 839991 835238 831199 829013 829100 830706
53310 830706 832850 835277 838476 843313 850637 860620 872245 884001 895397 907367 920957 936144 952340
53297 952340 969584 988578 1009655 1032325 1055987 1080727 1107134 1135443 1165080 1195136 1225199
53286 1225199 1255384 1285496 1314430 1340823 1364224 1385283 1404747 1422608 1438281 1451281 1461545
53275 1461545 1469316 1474820 1477934 1478140 1474989 1468553 1459262 1447430 1433333 1417620 1401081 1383838 1365133
53262 1365133 1344123 1320531 1294509 1266349 1236602 1206023 1175088 1143765 1111998 1080049 1048137
53251A048137l2028l2207l1847l0712k9349k8336k7576k6613k5400k4417k4064
53240G35588k4157k4058k3379k2404k1670k1188k0477j9410j8412j7579j6234
53229E06620j3918j1290r391q364p557o608n712m979m347m033m388n267o166o949
53215D07651p780q412q316p609p076p079p081o602n986n820o013n938n267m319
53201C14353l610l313l173k911k665k857l589m471n137n545n566m781l220j773
53187B61742j295j594j929k065k133j910j231q22j567l013l665l005k056j718
53173B33739j540p38M40J105R70N76N31R31J340J145K18p73j012n64k17l79o92
53156B35080q27r92j373j705j691j385r62n49m34q79j598j883j468p29m6N44Q91
$$ plain form
53251 1048137 1016109 983902 952055 921343 891994 863658 836082 809469 784069 759652 735588
53240 735588 711431 687373 663994 641590 619920 598732 578255 558845 540433 522854 506620
53229 506620 492702 481412 472021 463657 456100 449492 443780 438801 434454 430421 426033 420766 414600 407651
53215 407651 399871 391459 383143 375534 368458 361379 354298 347696 341710 335890 329877 323939 318672 314353
53201 314353 310743 307430 304257 301346 298681 295824 292235 287764 282627 277082 271516 266735 263515 261742
53187 261742 260447 258853 256924 254859 252726 250816 249585 248763 247196 244183 240518 237513 235457 233739
53173 233739 232199 231461 231901 233006 233976 234552 235083 236014 237354 238499 238717 237944 236932 236368 236151 235772 235080
53156 235080 234253 233261 231888 230183 228492 227107 226145 225596 225162 224283 222685 220802 219334 218605 218559 219103 219994
53139B19994P39K49l7j7n4j47J18N68M43k23k55Q95J990J566Lj019p44k1J33k96
53119B23885o89o72l65j10o8j12o1p4m50j053j306r98n85n07o37o88o72o26l66
53100B13846M1M8n83j199j044l45ql97r97j189r33o09n57q05j086j115q97o34
53082B01537l71m6J38j80p95r19j78P34Q78K20m12m19LK86K42K54P49J544J921
53063B05186J568R91O75K39p52j658j456m99k45j048j552q02L16N82K45K31M55
53046B02476J98l98m76J41P54Q62N51p4r39j620j683j355j201j190q29j20L25
53029A95422J61l33p68r60p75k25K97L60R5r6k17n48r15q23l01N4p1l69n12m95
53009A88981k73L24J087J415J054M87K94M29M71K62P3J96N55P34L70l92r82j026
$$ plain form
53139 219994 220733 220982 220945 220928 220874 220727 220845 221413 221856 221633 221378 222273 224263 225829 225832 224813 224069 224048 224181 223885
53119 223885 223196 222524 222159 222049 221981 221869 221808 221734 221284 220231 218925 217927 217342 216835 216198 215510 214838 214212 213846
53100 213846 213887 213935 213352 212153 211109 210764 210756 210359 209362 208173 207240 206631 206074 205269 204183 203068 202171 201537
53082 201537 201166 201120 201258 201078 200283 199364 199186 199920 200798 201018 200606 200187 200190 200476 200718 200972 201721 203265 205186
53063 205186 206754 207745 208420 208659 207907 206249 204793 204294 204049 203001 201449 200647 200963 201545 201790 202021 202476
53046 202476 202674 202276 201800 201941 202695 203557 204108 204034 203095 201475 199792 198437 197236 196046 195217 195097 195422
53029 195422 195583 195250 194482 193522 192747 192522 192819 193179 193274 193178 192961 192413 191498 190675 190374 190428 190357 189988 189476 188981
53009 188981 188708 189032 190119 191534 192588 193075 193369 193798 194269 194531 194604 194800 195355 196089 196459 196067 195085 194059
52991A94059p56n89o04o62p98j063j179q34k18K00L77P12J317J740J594J050N50
52974A94896K93K56M57R12J397J498J052M74M46J162J977K118J622J240J335J425
52958B12560R77J97l89o93r89j326j546j676j855j975j846j632j662j846j684
52943A94615r98k40O0j11l58m06l33l57n16o89p91q49q42o65m28m58p71p82o6
52924A85015Q59J081N49N6L8J39P8J16L20K44k34m73l3N71O36K70mr4j92k78l58
52903A88306p33j388j535n55R74J831J551O37k62p86p02r0M58M11Qm2N39J394
52885A90016J958J743O09q57j642j445j056j136j267q70l82n22r33o13N10J477
52869A85590J657J328R40O67P04J200J876K310K561K969L486L816L910L666K576
$$ plain form
52991 194059 193303 192714 192110 191448 190650 189587 188408 187574 187356 187556 187933 188645 189962 191702 193296 194346 194896
52974 194896 195189 195445 195902 196814 198211 199709 200761 201235 201681 202843 204820 206938 208560 209800 211135 212560
52958 212560 213537 213734 213345 212652 211663 210337 208791 207115 205260 203285 201439 199807 198145 196299 194615
52943 194615 193617 193377 193437 193326 192968 192562 192229 191872 191356 190667 189876 189027 188185 187520 187092 186634 185863 185081 185015
52924 185015 185874 186955 187504 187560 187598 187737 187815 187931 188251 188495 188261 187788 187755 188326 188962 189232 189228 189134 188942 188664 188306
52903 188306 187573 186185 184650 184095 185069 186900 188451 189088 188826 188040 187338 187248 187706 188117 188125 188083 188622 190016
52885 190016 191974 193717 194326 193469 191827 190382 189326 188190 186923 186053 185671 185149 184216 183603 184113 185590
52869 185590 187247 188575 189515 190182 190886 192086 193962 196272 198833 201802 205288 209104 213014 216680 219256
52854B19256N15j450k087j602j233j395j400r36o16q69j414k038k868l616l585
52839A94662k790k158k211k403k154j698j416j145o45j26J83M69R21J352J586
52824A82427J728J854J810J505R83J66q93j582j299m50qn8K37J099J718J766K121
52807A93124L343M506M478L486K430J271o79l257n301o000n518m316k669j022
52793A83876q0j48p40j131j121r96r53q62n92l05j85n0L89R02Q95L83J82P08J233
52774A81405R88M11M30R35J064P28O62R44P20k75j078q72q1M15M10K23O5pl0l17
52754A86740j001j352m30J259J933Q59n61p79j49J8m54o49k23K39L50L89O14R19
52736A87722J206J496J616J319O38j32p00p30J06J510K411K089J146P49J020R90
$$ plain form
52854 219256 219771 218321 216234 214632 213399 212004 210604 209668 209052 208183 206769 204731 201863 198247 194662
52839 194662 191872 189714 187503 185100 182946 181248 179832 178687 178042 177916 178099 178568 179489 180841 182427
52824 182427 184155 186009 187819 189324 190307 190473 189580 187998 186699 186249 186241 186183 186420 187519 189237 191003 193124
52807 193124 196467 200973 205451 208937 211367 212638 211959 208702 203401 197401 191883 187567 184898 183876
52793 183876 183796 183648 182908 181777 180656 179660 178707 177845 177253 176948 176763 176713 177102 178004 178899 179282 179464 180172 181405
52774 181405 182393 182804 183234 184169 185233 185961 186623 187567 188287 188012 186934 186062 185981 186396 186806 187029 187094 187087 187057 186740
52754 186740 185739 184387 183957 185216 187149 188008 187447 186668 186519 186537 186083 185434 185211 185450 185800 186189 186803 187722
52736 187722 188928 190424 192040 193359 193997 193865 193165 192435 192541 194051 196462 198551 199697 200446 201466 202456
52720B02456J41q57j175j009j193j938k497k182j288p09p14o92k55j8o91j827
52704A85552k315j913j432j298j020k98K87K76J30L99Q05Q36O10M62J94m20q76
52687A79979n07M53J179J447J700K083K156J673R67M26J01m7O5L83N94M62J58
52670A93272J67P27J441J472M84p87j220o25Q3Q0n14j048j036k96R82K018K011
52653A97211J221Q64J511K420K897L424M529N289M187J196k006l913m416m197
52639B10217l706l019k184j411r88r31p55NR08R13m7n55N60K599L992M276M045
52622B13919L394J765o42k553l110k768k346j990j494r86p56p62p43n97l89j53
52606A99789J27M16N71L51l52j109j093l2J259J690J155M45J64K73N76R22R45
$$ plain form
52720 202456 202597 201740 200565 199556 198363 196425 193928 191746 190458 189749 189035 188343 188088 188070 187379 185552
52704 185552 183237 181324 179892 178594 177574 177276 177563 177839 177969 178368 179173 180009 180619 181081 181275 180855 179979
52687 179979 179472 179925 181104 182551 184251 186334 188490 190163 191130 191556 191657 191610 191675 192058 192652 193114 193272
52670 193272 193439 194166 195607 197079 197563 196776 195556 194931 195014 195094 194580 193532 192496 192200 193182 195200 197211
52653 197211 198432 199296 200807 203227 206124 209548 214077 219366 223553 224749 222743 218830 214414 210217
52639 210217 206511 203492 201308 199897 198909 197978 197223 197228 198136 199049 199002 198447 199007 201606 205598 209874 213919
52622 213919 217313 219078 218436 215883 212773 210005 207659 205669 204175 203189 202433 201671 200928 200331 199942 199789
52606 199789 199916 200332 200903 201254 200902 199793 198700 198668 199927 201617 202772 203217 203381 203654 204230 205152 206097
52589B06097K74p54j216o72K97Q92J030J132J338J335Q79K52L7M81J135J277P24
52572B14538pm04n01n63o47p59j044j375j191l03N43N00j91n43k14K57M46N04
52554B09046N14K08m24r12r85r23r98r83n86O4O75J163J482J387O92l71j265j523
52536B06261j014o8O30N48j25o59n85o7N12R74J267J318J120P52K21m29q54o53
52518B09149l7J96k97p69k54J138K252K259J584J287J781K488K677K362K153K365
52502B30334K535J948M70j225k247k264j740j434j627j904j727j051k22M67Q11
52487B21124M98n27j571j726r72j71J98N67J296J902J828J323R50P00L44J83O60
52470B26606J445J773J543J285J163P99K61L13J370K733L361L049K477K221K054
$$ plain form
52589 206097 206371 205617 204401 203729 204026 204918 205948 207080 208418 209753 210632 210884 210921 211402 212537 213814 214538
52572 214538 214531 214127 213626 213063 212416 211657 210613 209238 208047 207744 208287 208787 208596 208053 207839 208096 208542 209046
52554 209046 209560 209768 209344 208432 207447 206524 205526 204543 203957 204021 204696 205859 207341 208728 209420 209049 207784 206261
52536 206261 205247 205179 205809 206357 206232 205573 204988 204921 205433 206407 207674 208992 210112 210864 211085 210656 209802 209149
52518 209149 209112 209308 209011 208242 207988 209126 211378 213637 215221 216508 218289 220777 223454 225816 227969 230334
52502 230334 232869 234817 235287 234062 231815 229551 227811 226377 224750 222846 221119 220068 219846 220313 221124
52487 221124 221622 221095 219524 217798 216826 216655 216853 217420 218716 220618 222446 223769 224719 225419 225763 225946 226606
52470 226606 228051 229824 231367 232652 233815 234614 234875 235188 236558 239291 242652 245701 248178 250399 252453
52455B52453J318j84j835k864l181l280l414l414l293l395l628l299k205j228
52441B18551j165j527j244k07P67J161J059M75o15j589j531n01L59K42m20p19
52425B13096l34M63J317J919J975J428N76j36m04k37Qm7k85j53N43J329J833K310
52407B25201K927L240L090L306M611O347P429Q015Q856R351P889M299L14k698
52393B92177m994o923p736o946n584m929m837m365l381k425j549m46N81Q57M45
52378B39945J39L25N79M92K46L45J032K102K971L111K650K305K518K877K747K093
52362B66477J328O37q4q08j325j499j305q01k92k59p61j239j192q04n29m43l76
52345B56725l55l98j66M97R53M42o38q43O28K854M164L883K819K204K488L208
$$ plain form
52455 252453 253771 253587 251752 248888 245707 242427 239013 235599 232306 228911 225283 221984 219779 218551
52441 218551 217386 215859 214615 214408 215175 216336 217395 217870 217255 215666 214135 213634 213993 214235 213815 213096
52425 213096 212762 213225 214542 216461 218436 219864 220440 220304 219900 219663 219671 219624 219339 219186 219729 221058 222891 225201
52407 225201 228128 231368 234458 237764 242375 248722 256151 264166 273022 282373 290262 294561 294875 292177
52393 292177 287183 280260 272524 265578 259994 255065 250228 245863 242482 240057 238508 238062 238643 239500 239945
52378 239945 240084 240409 240988 241480 241726 242071 243103 245205 248176 251287 253937 256242 258760 261637 264384 266477
52362 266477 267805 268442 268358 267550 266225 264726 263421 262620 262328 262069 261308 260069 258877 258073 257544 257101 256725
52345 256725 256370 255972 255806 256303 257256 257698 257060 256217 256845 259699 263863 267746 270565 272769 275257 278465
52329B78465L756M021M237M510M767N095N735O671P546Q107Q446Q655Q637Q354
52315C67002P939P334O245M806L796L793M421M935N269N924O981P898Q253Q127
52301D52723P684P000O476O750P791Q613Q382P500O990O996O616N190L145J297
52287E43153L2n13p8J157K062J546K6r79p82k81m20q71q01k63O4R6L91J156J982
52268E46677K550K963L361L749M213M792N144M890M163L328K372J225N61J325
52254E91313L405N556O923P845Q897R879J0265R993R314Q250O763N089L571K352
52240F89415J509J137J109J093J015J096J267J118O55N17J032J621J637J253R63
52225G06437O41j49j177j612j080j24M70M31M8k46k48j31j50j74K89J385K503
$$ plain form
52329 278465 282221 286242 290479 294989 299756 304851 310586 317257 324803 332910 341356 350011 358648 367002
52315 367002 374941 382275 388520 393326 397122 400915 405336 410271 415540 421464 428445 436343 444596 452723
52301 452723 460407 467407 473883 480633 488424 497037 505419 512919 519909 526905 533521 538711 541856 543153
52287 543153 543185 542672 542594 543751 545813 547359 547385 546406 545624 545343 544923 544052 543251 542988 543052 543148 543539 544695 546677
52268 546677 549227 552190 555551 559300 563513 568305 573449 578339 582502 585830 588202 589427 589988 591313
52254 591313 594718 600274 607197 615042 623939 633818 644083 654076 663390 671640 678403 683492 687063 689415
52240 689415 690924 692061 693170 694263 695278 696374 697641 698759 699414 699931 700963 702584 704221 705474 706437
52225 706437 707078 706929 705752 704140 703060 702936 703406 703837 703885 703639 703391 703260 703110 702936 703225 704610 707113
52208G07113K922K723K718L517M887O012O148N110L387J820J069J186J746K310
52194G52668K828L575M661N699O186O195O243O334N693L933J930Q19M79j39j419
52179H05685k787l846m816n677o037o059o440o999o482m474k500k233l300l943
52165G40092l315k091j105m76q2M0J4K56J010K078L034L493L232K386J406O75
52149G50647J53l16o50o07o2R63K230L138L121K362J635J167K70j471l217l782
52133G55581l130k298k022k133k109j703r36J10J479L433O113R017J1251J2553
52119G85206J3575J4802J5746J5698J4726J3329J1652R722P998O857N936M737
52107I19984L581L129L229L187K943L082L755M520N323O594Q231R439R813R775
$$ plain form
52208 707113 710035 712758 715476 718993 723880 729892 736040 741150 744537 746357 747426 748612 750358 752668
52194 752668 755496 759071 763732 769431 775617 781812 788055 794389 800082 804015 805945 806764 807243 807104 805685
52179 805685 802898 799052 794236 788559 782522 776463 770023 763024 756542 752068 749568 747335 744035 740092
52165 740092 736777 734686 733581 733105 733023 733063 733077 733333 734343 736421 739455 742948 746180 748566 749972 750647
52149 750647 750800 750484 749834 749227 749165 750128 752358 755496 758617 760979 762614 763781 764051 762580 759363 755581
52133 755581 752451 750153 748131 745998 743889 742186 741250 741360 742839 746272 752385 761402 772653 785206
52119 785206 798781 813583 829329 845027 859753 873082 884734 894456 902454 909311 915247 919984
52107 919984 923565 926694 929923 933110 936053 939135 942890 947410 952733 959327 967558 976997 986810 996585
52093I96585R581Q740O875M463K100l88l471o824r415j0610j0687j0194r207p414
52079I60134m861k372j006j038j690j985j737j480j573j762j495n53O55J283Q16
52064I41336j93n03M08J712K358K395K562K952K959K409J915J979K436K963L492
52049I71180L874L734K909J625O0j850l943n678o680o992o592n234l116j210l54
52034I41733l31l28m7J72J31j7k98j024k127k919k934k645k839l468l734l307
52018I16018k817k858l099k901k417k286k371j701R3J962K554J659J00j525l391
52003H97020n862q889j2074j5030j7551j9525k0766k1053k0425j9324j8182j6943
51991G01396j5361j3687j2482j1741j0848r644q854r053r738r991r626r132q868
$$ plain form
52093 996585 1006166 1014906 1021781 1026244 1028344 1027956 1024485 1017661 1008246 997636 986949 976755 967548 960134
52079 960134 955273 952901 951895 950857 949167 947182 945445 943965 942392 940630 939135 938582 939237 940520 941336
52064 941336 941143 940640 941048 942760 945118 947513 950075 953027 955986 958395 960310 962289 964725 967688 971180
52049 971180 975054 978788 981697 983322 983382 981532 977589 971911 965231 958239 951647 946413 943297 942087 941733
52034 941733 941402 941074 941027 941199 941330 941313 941015 939991 937864 934945 932011 929366 926527 923059 919325 916018
52018 916018 913201 910343 907244 904343 901926 899640 897269 895568 895661 897623 900177 901836 901936 900411 897020
52003 897020 891158 882269 870195 855165 837614 818089 797323 776270 755845 736521 718339 701396
51991 701396 686035 672348 659866 648125 637277 627633 618779 609726 599988 589997 580371 571239 562371
51978E62371q955r647j1066j2604j3245j2583j1202r889q803p457n389k756k69
51965D48506J587L165N158P557R588J0658J0853J0370R218P665O249M921K914
51952E38409m3l094n285o552p144o926n899m711l810k711q85J361L678O521J0121
$$ plain form
51978 562371 553416 543769 532703 520099 506854 494271 483069 473180 464377 456920 451531 448775 448506
51965 448506 450093 453258 458416 465973 475561 486219 497072 507442 516660 524325 530574 535495 538409
51952 538409 538366 535272 529987 523435 516291 509365 503466 498755 494945 492234 491349 492710 496388 502909 513030
$$ [...]
##END NTUPLES=NMR SPECTRUM
##END=
