
##TITLE=UV1276_M13_1250-1169_90_7414773_4LIeapw943
##JCAMPDX= 6.0         $$ Bruker NMR JCAMP-DX V2.0
##DATA TYPE= NMR SPECTRUM
##DATA CLASS= NTUPLES
##ORIGIN= BRUKER
##OWNER= Administrator
$$ 1.72 TOPSPIN		Version 2.1
$$ 2013-01-25 21:54:43.363 -0500  Administrator@X
$$ Compression mode = diff/dup
##.OBSERVE FREQUENCY= 400.02188249412
##.OBSERVE NUCLEUS= ^1H
##.ACQUISITION MODE= SIMULTANEOUS (DQD)
##.ACQUISITION SCHEME= undefined
##.AVERAGES= 8
##.DIGITISER RES= 22
##SPECTROMETER/DATA SYSTEM= spect
##.PULSE SEQUENCE= zg30
##.SOLVENT NAME= COFFEE_meoh
##.SHIFT REFERENCE= INTERNAL, COFFEE_meoh, 1, 14.98509
##AUDIT TRAIL= $$ (NUMBER, WHEN, WHO, WHERE, PROCESS, VERSION, WHAT)
$$ ##TITLE= Audit trail, TOPSPIN		Version 2.1
$$ ##JCAMPDX= 5.01
$$ ##ORIGIN= Bruker BioSpin GmbH
$$ ##OWNER= Administrator
$$ $$ E:\/data/COFFEE/nmr/UV1276_M13_1250-1169_90_7414773_4LIeapw943/10/pdata/1/auditp.txt
$$ ##AUDIT TRAIL=  $$ (NUMBER, WHEN, WHO, WHERE, PROCESS, VERSION, WHAT)
(   1,<2013-01-25 21:54:35.378 -0500>,<Administrator>,<X>,<go>,<TOPSPIN 2.1>,
      <created by zg
	started at 2013-01-25 21:53:29.316 -0500,
	POWCHK enabled, PULCHK disabled,
       configuration hash MD5:
       86 BA 57 50 F2 9D 5C 9B 26 00 A9 28 5F 66 2E 89
       data hash MD5: 64K
       89 18 47 29 84 8D 51 CA 77 FC 33 9C C6 A6 F2 BF>)
(   2,<2013-01-25 21:54:38.363 -0500>,<Administrator>,<X>,<proc1d>,<TOPSPIN 2.1>,
      <Start of raw data processing
       efp LB = 0 FT_mod = 6 PKNL = 1 PHC0 = 0 PHC1 = 0 SI = 32K 
       data hash MD5: 32K
       5C 82 C0 96 8F 31 E1 66 E0 79 37 B1 DD 09 B8 9A>)
(   3,<2013-01-25 21:54:38.816 -0500>,<Administrator>,<X>,<proc1d>,<TOPSPIN 2.1>,
      <pk PHC0 = 99.32739 PHC1 = 0 
       data hash MD5: 32K
       C1 44 F5 63 BD 1D F0 E8 C8 EB E6 8A 42 E2 3C 4E>)
(   4,<2013-01-25 21:54:39.050 -0500>,<Administrator>,<X>,<proc1d>,<TOPSPIN 2.1>,
      <abs ABSG = 1 
       data hash MD5: 32K
       29 91 7C 84 3C 19 2B 31 4F 19 C6 57 ED AE 18 77>)
(   5,<2013-01-25 21:54:39.206 -0500>,<Administrator>,<X>,<proc1d>,<TOPSPIN 2.1>,
      <abs ABSG = 2 
       data hash MD5: 32K
       C7 D3 37 7F 6E 19 17 2C B2 BE 8C 91 F9 D3 5D 23>)
(   6,<2013-01-25 21:54:39.347 -0500>,<Administrator>,<X>,<proc1d>,<TOPSPIN 2.1>,
      <abs ABSG = 3 
       data hash MD5: 32K
       7F EB 42 FD F6 FA EB DC 3A 63 08 92 15 FF E5 F4>)
(   7,<2013-01-25 21:54:39.503 -0500>,<Administrator>,<X>,<proc1d>,<TOPSPIN 2.1>,
      <abs ABSG = 4 
       data hash MD5: 32K
       BA 04 7C 99 B7 EB 83 AA 23 3B D5 90 9D A8 59 FC>)
(   8,<2013-01-25 21:54:39.644 -0500>,<Administrator>,<X>,<proc1d>,<TOPSPIN 2.1>,
      <abs ABSG = 5 
       data hash MD5: 32K
       D8 6B 49 67 FB CD 3D A0 A0 D1 4F C6 B9 31 E7 E0>)
$$ ##END=
$$ 
$$ $$ hash MD5
$$ $$ A0 87 6C DF D0 4F 41 0D 43 1F D2 61 44 C9 A4 A9
##$RELAX= 
##$RELAX= 
##$RELAX= 
##$RELAX= 
##$RELAX= 
##$RELAX= 
##$RELAX= 
$$ Bruker specific parameters
$$ --------------------------
##$DU= <E:\>
##$EXPNO= 10
$$ [...]
150 150 150 150 150 150 150 150
##$TP07= 0
##$TPNAME0= <>
##$TPNAME1= <>
##$TPNAME2= <>
##$TPNAME3= <>
##$TPNAME4= <>
##$TPNAME5= <>
##$TPNAME6= <>
##$TPNAME7= <>
##$TPOAL= (0..7)
0.5 0.5 0.5 0.5 0.5 0.5 0.5 0.5
##$TPOFFS= (0..7)
0 0 0 0 0 0 0 0
##$TUNHIN= 0
##$TUNHOUT= 0
##$TUNXOUT= 0
##$USERA1= <user>
##$USERA2= <user>
##$USERA3= <user>
##$USERA4= <user>
##$USERA5= <user>
##$V9= 5
##$VALIST= <valist>
##$VCLIST= <CCCCCCCCCCCCCCC>
##$VD= 0
##$VDLIST= <DDDDDDDDDDDDDDD>
##$VPLIST= <PPPPPPPPPPPPPPP>
##$VTLIST= <TTTTTTTTTTTTTTT>
##$WBST= 2048
##$WBSW= 25
##$XGAIN= (0..3)
0 0 0 0
##$XL= 0
##$YL= 0
##$YMAX_a= 670457
##$YMIN_a= -571525
##$ZGOPTNS= <>
##$ZL1= 120
##$ZL2= 120
##$ZL3= 120
##$ZL4= 120
##$ABSF1= 14.98509
##$ABSF2= -5.573092
##$ABSG= 5
##$ABSL= 3
##$ALPHA= 0
##$AQORDER= 0
##$ASSFAC= 0
##$ASSFACI= 0
##$ASSFACX= 0
##$ASSWID= 0
##$AUNMP= <proc_prof1d_extract_pilot.lims>
##$AXLEFT= 0
##$AXNAME= <>
##$AXNUC= <1H>
##$AXRIGHT= 0
##$AXTYPE= 0
##$AXUNIT= <>
##$AZFE= 0.1
##$AZFW= 0.1
##$BCFW= 0
##$BC_mod= 0
##$BYTORDP= 0
##$COROFFS= 0
##$CY= 15
##$DATMOD= 1
##$DC= 0
##$DFILT= <>
##$DTYPP= 0
##$F1P= 0
##$F2P= 0
##$FCOR= 0.5
##$FTSIZE= 32768
##$FT_mod= 6
##$GAMMA= 0
##$GB= 0
##$INTBC= 1
##$INTSCL= 1
##$ISEN= 128
##$LB= 0
##$LEV0= 0
##$LPBIN= 0
##$MAXI= 10000
##$MC2= 0
##$MEAN= 0
##$ME_mod= 0
##$MI= 0
##$NCOEF= 0
##$NC_proc= -8
##$NLEV= 6
##$NOISF1= 0
##$NOISF2= 0
##$NSP= 0
##$NTH_PI= 0
##$NZP= 0
##$OFFSET= 14.98509
##$PC= 1
##$PHC0= 99.32739
##$PHC1= 0
##$PH_mod= 1
##$PKNL= yes
##$PPARMOD= 0
##$PPDIAG= 0
##$PPIPTYP= 0
##$PPMPNUM= 2147483647
##$PPRESOL= 1
##$PSCAL= 4
##$PSIGN= 0
##$PYNMP= <proc.py>
##$REVERSE= no
##$SF= 400.02
##$SI= 32768
##$SIGF1= 0
##$SIGF2= 0
##$SINO= 400
##$SIOLD= 32768
##$SPECTYP= <>
##$SREGLST= <1H.CDCl3>
##$SSB= 0
##$STSI= 32768
##$STSR= 0
##$SW_p= 8223.68421052631
##$SYMM= 0
##$S_DEV= 0
##$TDeff= 65536
##$TDoff= 0
##$TI= <>
##$TILT= no
##$TM1= 0
##$TM2= 0
##$TOPLEV= 0
##$USERP1= <user>
##$USERP2= <user>
##$USERP3= <user>
##$USERP4= <user>
##$USERP5= <user>
##$WDW= 1
##$XDIM= 32768
##$YMAX_p= 467954645
##$YMIN_p= -772213
##$CURPLOT= <Network HP LaserJet P1505>
##$CURPRIN= <$Network HP LaserJet P1505>
##$DFORMAT= <normdp>
##$LAYOUT= <+/1D_H.xwp>
##$LFORMAT= <normlp>
##$PFORMAT= <normpl>
##$SURQMSG= 1
$$ End of Bruker specific parameters
$$ ---------------------------------
##NTUPLES= NMR SPECTRUM
##VAR_NAME=  FREQUENCY,     SPECTRUM/REAL,   SPECTRUM/IMAG
##SYMBOL=    X,             R,               I
##VAR_TYPE=  INDEPENDENT,   DEPENDENT,       DEPENDENT
##VAR_FORM=  AFFN,          ASDF,            ASDF
##VAR_DIM=   32768,         32768,           32768
##UNITS=     HZ,            ARBITRARY UNITS, ARBITRARY UNITS
##FACTOR=    0.250966925370066, 1,           1
##FIRST=     8223.43324360094, -223249,      42506
##LAST=      0,             79135,           -237700
##MIN=       0,             -772213,         0
##MAX=       8223.43324360094, 467954645,    0
$$ Real data points
##PAGE= N=1
##DATA TABLE= (X++(R..R)), XYDATA
$$ [...]
19518h8848q9638j47561F6061a28930G7368d6721a0072j87520k16295a93962P5994
$$ -88848 -178486 -326047 66061 -128930 77368 -46721 -10072 -197592 -413887 -193962 -117968
19507a17968j97427c7504A47283o5752e4669k02023D0231h5272I4026Q2492c80962
$$ -117968 -315395 -37504 147283 81531 -54669 -256692 40231 -85272 94026 176518 -380962
19495A99515c1265l38847G6907c7680j61967e4432k56511M0022K6653A71475B4086
$$ 199515 -31265 -370112 76907 -37680 -199647 -54432 -310943 -270921 -244268 171475 24086
19483c25151a06130b208H3739h6877j94976i5561q113F7811e1759D0159a59490
$$ -325151 -106130 -2208 83739 -86877 -281853 -95561 -103674 67811 -51759 40159 -159490
19471B4858b43172j31508E1802b0577C4890K91662C3301a55739R827J296p280
$$ 24858 -243172 -374680 51802 -20577 34890 326552 33301 -155739 -145912 -144616 -151896
19460a51896B7768f7691m5428A2154a28378D3561a46841A30678g1183A44894b0098
$$ -151896 27768 -67691 -113119 12154 -128378 43561 -146841 130678 -71183 144894 -20098
19448a96221b9568H567a95147Q8619j64746F9316G491e1210A5456a37875k70500
$$ -196221 -29568 8567 -195147 -106528 -271274 69316 7491 -51210 15456 -137875 -408375
19437d08375d0647l190j75820a02706A15184b98587R4783O2074I7929e8851A37743
$$ -408375 -40647 -43837 -219657 -102706 115184 -298587 -203804 -141730 97929 -58851 137743
19425a16861k6372N2176M165A39397o7610h5798J0269j4274B5076b09894R0591
$$ -116861 -143233 -91057 -86892 139397 71787 -85798 -75529 -89803 25076 -209894 -119303
19414a19303A60898D3191J80081F1663h3393j0748C6301Q5964c01245d0155a9537
$$ -119303 160898 43191 223272 61663 -83393 -94141 36301 122265 -301245 -40155 -19537
19402A35991J07274r3478d789j88421I8433b2960q7851q4392A6003J6214a53657
$$ 135991 243265 149787 -4789 -193210 98433 -22960 -110811 -195203 16003 32217 -153657
19390A43091b19761j36104A38963K434D6487b57021d3947q6578l9526A88100J6800
$$ 143091 -219761 -355865 138963 141397 46487 -257021 -43947 -130525 -170051 188100 204900
19379B04900c30657F7593a9097D964c13221C0232e4056h089n5464l6095j43574
$$ 204900 -330657 67593 -19097 4964 -313221 30232 -54056 -8089 -63553 -99648 -243222
19368b43222f9716j6633j43812h8623L7143g396j96399j72542J15946A75695e8721
$$ -243222 -69716 -86349 -230161 -88623 -51480 -7396 -203795 -376337 -260391 175695 -58721
19356c7489D857J60627b24379P6988d4713l69644J53049j38117J35968a27461
$$ -37489 4857 165484 -224379 -147391 -44713 -414357 -261308 -399425 -263457 -127461
19345a21287N6382J8852k2797B48352c6226r6702O1950j20001b2361l9474k74875
$$ -121287 -64905 -46053 -68850 248352 -36226 -132928 -70978 -190979 -22361 -61835 -336710
19334c36710c1377j43469g8403j2862A64937I099i3153A27720b29555g6981A33873
$$ -336710 -31377 -174846 -78403 -91265 164937 9099 -93153 127720 -229555 -76981 133873
19322b28200e9019j20211p6147a03223B18029e5575A25231M0279i9445A65424
$$ -228200 -59019 -179230 -255377 -103223 218029 -55575 125231 165510 -99445 165424
19311H4442M3891c20121J47157A55543b15540e1867k40319a07835D2233J11614
$$ 84442 128333 -320121 -172964 155543 -215540 -51867 -292186 -107835 42233 153847
19301A53847a97850K848C4199b63306N4559k56056i8216A79601P235a3540k7606
$$ 153847 -197850 -195002 34199 -263306 -208747 -464803 -98216 179601 186836 -13540 -41146
19290d1146r1440j28699B58549a46633B30337a41123A02873e788k29719d5947
$$ -41146 -132586 -261285 258549 -146633 230337 -141123 102873 -5788 -235507 -45947
19279f5217j78129o4116C30210j30686G5461a17942r7158a00122l2583H42i2079
$$ -65217 -243346 -307462 330210 199524 75461 -117942 -215100 -100122 -132705 842 -92079
19267B20813a18523j63267C45801b89713a20148F7460i7342l81335A88292G5035
$$ 220813 -118523 -281790 345801 -289713 -120148 67460 -97342 -478677 188292 75035
19256G4612J39590i7852B1652g3564j3242a6117k72513f6577H0867b7204j36081
$$ 74612 214202 -97852 21652 -73564 -86806 -16117 -288630 -66577 80867 -27204 -163285
19245a63285M0427k02092a52654l3019C5499a90275g7174A94217a19473l69628
$$ -163285 -122858 -324950 -152654 -185673 35499 -190275 -77174 194217 -119473 -489101
19235d89101a39763J8714O0258A16767J3667f9278I7548b49096g9310B46145q5753
$$ -489101 -139763 -121049 -60791 116767 130434 -69278 97548 -249096 -79310 246145 160392
19224A60392B0932K4131d20203a87115A06149a32818A66687C7342M7767b24397
$$ 160392 20932 45063 -420203 -187115 106149 -132818 166687 37342 85109 -224397
19213a96447j6350r7040B62414b28962B73034N781a24244j56174j9867d6398D5540
$$ -196447 -212797 -309837 262414 -228962 273034 278815 -124244 -280418 -300285 -46398 45540
19201E9658h627A57750a93303A51625j6505a13367r2709P6210O1822F5550Q2012
$$ 59658 -8627 157750 -193303 151625 135120 -113367 -206076 -129866 -68044 65550 147562
19190A47562a52488j14393q437f6647j94848D0540g2741q6828k42457e0086J7346
$$ 147562 -152488 -266881 -275318 -66647 -261495 40540 -72741 -159569 -402026 -50086 -32740
19179c2740A39607b58148G1445b03179P8143B9458J46747d30729B26771a21539
$$ -32740 139607 -258148 71445 -203179 -125036 29458 176205 -430729 226771 -121539
19168g1456n0262j55156g2805A27919h5192A45717L0151a63635j29194C10413
$$ -71456 -121718 -276874 -72805 127919 -85192 145717 175868 -163635 -292829 310413
19157A76541n5903e7066K0955j28253m6375B7051c51941a65666L0892C61908b49947
$$ 176541 120638 -57066 -36111 -164364 -210739 27051 -351941 -165666 -134774 361908 -249947
19145B96690b35109A36351e0682I6658b62265c2556j39493N9783q3973P3457N8398
$$ 296690 -235109 136351 -50682 96658 -262265 -32556 -172049 -112266 -196239 -122782 -64384
19134f4384A5334b96886A46889f3321d797F4462g4395D2335c76304c198k00831
$$ -64384 15334 -296886 146889 -63321 -4797 64462 -74395 42335 -376304 -3198 -204029
19123b04029B33710c56770D3089a9198F8616a09509d1952j1215E8152a57645F939
$$ -204029 233710 -356770 43089 -19198 68616 -109509 -41952 -53167 58152 -157645 6939
19111h6218A33800c6095m9663L8861j34102O9253A41025k8463b54577b8099j07585
$$ -86218 133800 -36095 -85758 -46897 -180999 -111746 141025 112562 -254577 -28099 -135684
19100a35684A18940b26177c1430D18033A11151b20670J00308k01884H5530a79629
$$ -135684 118940 -226177 -31430 418033 111151 -220670 -120362 -322246 85530 -179629
19089G3704a5280l2294k1934D7956g5509E3561L5637d0214D39076e439B12532
$$ 73704 -15280 -47574 -69508 47956 -75509 53561 89198 -40214 439076 -5439 212532
19077d6478j11881R277j91946A79219b5513M260j44010A38040a50548B62446f2127
$$ -46478 -158359 -149082 -341028 179219 -25513 -21253 -165263 138040 -150548 262446 -62127
19065b92929f108A41609J75272a78940A50205b62907M6977A03677n1271K23339
$$ -292929 -6108 141609 316881 -178940 150205 -262907 -215930 103677 52406 275745
19055B75745p3449H6655b07927b7726j97933D9127R7353g8373A12479m3110f231
$$ 275745 202296 86655 -207927 -27726 -225659 49127 146480 -78373 112479 69369 -6231
19043b56561A02096a60962B8966P4035g7124j19661N1482B7482b97777A85300
$$ -256561 102096 -160962 28966 103001 -77124 -196785 -145303 27482 -297777 185300
19032g645j75387K1547D20833a0794C34760b03534F7587J01407b90894B22087
$$ -7645 -183032 -161485 420833 -10794 334760 -203534 67587 168994 -290894 222087
19021h53j37070B15696c36015A39720d9514e581o299A07804c2949B06798m9117
$$ -853 -137923 215696 -336015 139720 -49514 -5581 -11880 107804 -32949 206798 157681
19010A57681a38807c0835B8523c54979g1494l6872F481J85432J02809C5503a54902
$$ 157681 -138807 -30835 28523 -354979 -71494 -108366 6481 191913 294722 35503 -154902
18998B50977E8043O8007d04330A26045J14383J39637j06657C1131J20135K28320
$$ 250977 58043 126050 -404330 126045 240428 380065 273408 31131 151266 379586
18988C79586A89212a46533j24576a21564C02066a88796Q4475A18675a44104M5063
$$ 379586 189212 -146533 -271109 -121564 302066 -188796 -104321 118675 -144104 -99041
18978i9041K054c095j76929P7270p936M8719j13662N6401A77710a49014B77877
$$ -99041 -96987 -3095 -180024 -102754 -110690 -61971 -175633 -119232 177710 -149014 277877
18966e3025a46n2854A79014a05546J4050L5128q9085A28825A1062R1393N499A6478
$$ -53025 -146 -53000 179014 -105546 -91496 -56368 -145453 128825 11062 102455 107954 16478
18953a04235l87326D2825a73630Q5600D3648c4722p1915j94988J25092J237g9083
$$ -104235 -491561 42825 -173630 -88030 43648 -34722 -106637 -301625 -176533 -175296 -79083
18941b36887C1857C474J39181b48087B73742b09572j10148A11325b5747k26138
$$ -236887 31857 3474 142655 -248087 273742 -209572 -319720 111325 -25747 -251885
18931b51885A64485a15752L5047k00884E6626j3115J36511j7632b56877a2125
$$ -251885 164485 -115752 -80705 -281589 56626 43511 180022 162390 -256877 -12125
18920A23616A59d0172j7568n0759I9791a56053O2417m0872k51511G9875a99672
$$ 123616 159 -40172 -57740 -108499 99791 -156053 -93636 -134508 -386019 79875 -199672
18908A56553L8512H911O7047e0740B4223M43523j64393a80968C1547K14949G5760
$$ 156553 195065 8911 75958 -50740 24223 467746 303353 -180968 31547 246496 75760
18896a97673A6092a63048A1085g4913q1446f5166J4183f513k3938h955k22191
$$ -197673 16092 -163048 11085 -74913 -156359 -65166 -50983 -6513 -30451 -8955 -231146
18885b31146c7009n7613A34688E1457L8394h0577F4275K2859a89261k6947q1903
$$ -231146 -37009 -94622 134688 51457 89851 -80577 64275 87134 -189261 -216208 -298111
18874b98111J01302A13615b14029A64447n1099i331j92674j63125A65404f1700
$$ -298111 -196809 113615 -214029 164447 113348 -9331 -202005 -365130 165404 -61700
18863B763K26365b65693d8700A01225b2311j21598C16570b37342A72407a47577
$$ 2763 229128 -265693 -48700 101225 -22311 -143909 316570 -237342 172407 -147577
18852A17387b9022a791l9475j14309A04412b4341j40883A43463b6701A07653a60917
$$ 117387 -29022 -1791 -41266 -155575 104412 -24341 -165224 143463 -26701 107653 -160917
18840B6129c18151J20184E7635L18734b6530B3743O6748i8911n8817m4681I181
$$ 26129 -318151 -197967 57635 376369 -26530 23743 90491 -98911 -157728 -202409 9181
18828c44558A98068I2863L4499b10028j4432F7092p860L47638g9844I5816o950
$$ -344558 198068 92863 127362 -210028 -224460 67092 59232 406870 -79844 95816 88866
18817H8866b00168I4372J8182c53281B31754i9960A07603J12277h3460c3142E9022
$$ 88866 -200168 94372 112554 -353281 231754 -99960 107603 219880 -83460 -33142 59022
18805c51548A59868J95031F9870j2756J45796n0700F034a61251K3613j47145a22657
$$ -351548 159868 354899 69870 57114 202910 152210 6034 -161251 -137638 -284783 -122657
18793d50815i1243k0254A50040A5189b7720j28176k861o9117C5229J21725b51860
$$ -450815 -91243 -111497 150040 15189 -27720 -155896 -158757 -227874 35229 156954 -251860
18781h3740A59858K365d8834G0347K4241a31846e7346p471k5382j6000q8181c0026
$$ -83740 159858 162223 -48834 70347 94588 -131846 -57346 -64817 -90199 -106199 -194380 -30026
18768a23711j41515A63187b69093n2758a30252A8614b48748D5477d2323j78543
$$ -123711 -265226 163187 -269093 -321851 -130252 18614 -248748 45477 -42323 -220866
18758b20866A314L1916c4256l6896B47731b10326h6072r7924D6787M0411L936
$$ -220866 1314 33230 -34256 -71152 247731 -210326 -86072 -183996 46787 87198 91134
18747I1134c6919l88284A70325b17648N5587B0504J2180b08554n8385d9290j43197
$$ 91134 -36919 -425203 170325 -217648 -162061 20504 32684 -208554 -266939 -49290 -192487
18736a92487B02826B7326e7650p7225c0559A67625C6854c68748j3177f0598j21342
$$ -192487 202826 27326 -57650 -134875 -30559 167625 36854 -368748 -381925 -60598 -181940
18725a81940A94174d12412a71653j10645k76407C6122a25182N4698o853j31035
$$ -181940 194174 -412412 -171653 -282298 -558705 36122 -125182 -70484 -77337 -208372
18715b08372a7851n2848a6519F7830K62163n8107b13806R3948d4857G0781e3829
$$ -208372 -17851 -70699 -16519 67830 329993 271886 -213806 -119858 -44857 70781 -53829
18703a86296A52383e582C20363c26308c1900k1694d055l55699H9924a5006m39724
$$ -186296 152383 -5582 320363 -326308 -31900 -53594 -4055 -359754 89924 -15006 -454730
18692d54730h3501G0295f980B65495a29389A25332K0047A0655L5926f0575n2218
$$ -454730 -83501 70295 -6980 265495 -129389 125332 145379 10655 46581 -60575 -112793
18681a12793B95157a71328I5983f3068j89619A12182a9031l21157C731a33562
$$ -112793 295157 -171328 95983 -63068 -252687 112182 -19031 -340188 3731 -133562
18670a08943N3595B93377c33264a9657B36089c6683A22719n2727k5516m865a01601
$$ -108943 -55348 293377 -333264 -19657 236089 -36683 122719 69992 44476 39611 -101601
18658B75028A22295C5749a09943B23333a36220k02900f2037q0842b8474B60177
$$ 275028 122295 35749 -109943 223333 -136220 -339120 -62037 -142879 -28474 260177
18647e3614C3609c3073j15633b6398j17306B11590l3690b20030D17050d5328A09804
$$ -53614 33609 -33073 -148706 -26398 -143704 211590 177900 -220030 417050 -45328 109804
18635G5484Q1992c9276j4999a3948n2824A0301d4040j47871A10913J0470a37142
$$ 75484 157476 -39276 -54275 -13948 -66772 10301 -44040 -191911 110913 121383 -137142
18623B69120j17590e3891j53643A33045o3811a73701n925j56109B40964B0152
$$ 269120 151530 -53891 -207534 133045 69234 -173701 -179626 -335735 240964 20152
18612f0305j82165a16273j33530e4902l82637a52170j3435k12470g8698k52583
$$ -60305 -242470 -116273 -249803 -54902 -437539 -152170 -165605 -378075 -78698 -331281
18602c31281J13536B78088F8211d6591H1584b44663J1023h8967j9066B2325a11127
$$ -331281 -217745 278088 68211 -46591 81584 -244663 -233640 -88967 -108033 22325 -111127
18590C3633M1775a31309k17531h9489B35354a17793n0093F5703b98043f807c366
$$ 33633 75408 -131309 -348840 -89489 235354 -117793 -167886 65703 -298043 -6807 -3366
18578a76541B04391a2754C7239g7230k02395A43851l0750A9930a27584O2175k18194
$$ -176541 204391 -12754 37239 -77230 -279625 143851 113101 19930 -127584 -65409 -283603
18567b83603F9710a94375k9382j1288B7431J78972F9208a19553L4615l72528a55180
$$ -283603 69710 -194375 -223757 -235045 27431 206403 69208 -119553 -84938 -457466 -155180
18555A54698b13011L1767h1512D1490a7392o6814C0234N42685a65202A04870D6455
$$ 154698 -213011 -181244 -81512 41490 -17392 -84206 30234 572919 -165202 104870 46455
18543e4118n3238r5176L6092D5951J17217c2443k45122C9411L3080a30376j55049
$$ -54118 -107356 -202532 -166440 45951 163168 -32443 -277565 39411 72491 -130376 -285425
18532b85425A21827b84362C07426b6659j61469k71742E2794e8932b4298k73970
$$ -285425 121827 -284362 307426 -26659 -188128 -459870 52794 -58932 -24298 -298268
18522b98268b8914J2476A90855a44730j96492A10137b88727a074B07345a34104
$$ -298268 -28914 -16438 190855 -144730 -341222 110137 -288727 -1074 207345 -134104
18511B4071K3479J91228D1524M4511J83724a72112N3455I1709J16241h1464A6648
$$ 24071 47550 238778 41524 86035 269759 -172112 -118657 91709 207950 -81464 16648
18499c00266j8521h0928E40696A1989d8846j18788j5423C24330j34100P5647j1357
$$ -300266 -318787 -80928 540696 11989 -48846 -167634 -183057 324330 190230 265877 254520
18488B54520b64901p3443B00544a35491L7342d1916j15160B50048a95297h7129
$$ 254520 -264901 -338344 200544 -135491 -98149 -41916 -157076 250048 -195297 -87129
18477G0250J01918l6580L1597N7328i7104r9535L3394B1043a36040c4632l5694
$$ 70250 172168 135588 167185 224513 -97104 -196639 -163245 21043 -136040 -34632 -70326
18466g0326r1223p0247d1323D0515G773K2354Q1908L630g420n62678f0602j77376
$$ -70326 -161549 -231796 -41323 40515 7773 30127 112035 115665 -7420 -570098 -60602 -237978
18454b37978k27961F6497a72828L1238k12298g4679p4976j54630j7979a44580
$$ -237978 -465939 66497 -172828 -141590 -353888 -74679 -149655 -304285 -322264 -144580
18443G1377d96074a89612B15131a82750K7742F8114a7058j57564j2561Q1497i470
$$ 71377 -496074 -189612 215131 -182750 -155008 68114 -17058 -174622 -187183 -105686 -9470
18431H2968a99608N1298N6589A52523F0479K35978H4081b00260b1244j93378q9455
$$ 82968 -199608 -148310 -91721 152523 60479 296457 84081 -200260 -21244 -214622 -304077
18420c04077i9633k19993A15460E0963J17076N5017K2653a00027j74793g912b512
$$ -304077 -99633 -319626 115460 50963 168039 223056 245709 -100027 -274820 -7912 -2512
18408a88969j1610N0000c2655B43993b04262D04816b87375A01519N3976O5318
$$ -188969 -200579 -150579 -32655 243993 -204262 404816 -287375 101519 155495 220813
18398B20813a73606j74384a70495c885l55915B04735a32062B55860c25050a35966
$$ 220813 -173606 -347990 -170495 -3885 -359800 204735 -132062 255860 -325050 -135966
18387c6751h613k93637g2822H5193j068b50896C8423f8129h273r2582a5786l0324
$$ -36751 -8613 -302250 -72822 85193 84125 -250896 38423 -68129 -8273 -100855 -15786 -46110
18375d6110p0118B11775A6975a39333D9246f2017D1732a86959a8712m00830A78772
$$ -46110 -116228 211775 16975 -139333 49246 -62017 41732 -186959 -18712 -419542 178772
18363B05944c8077A59377a20441l0737K7674l55634c9157D4101Q3368b50745j56529
$$ 205944 -38077 159377 -120441 -151178 -123504 -479138 -39157 44101 127469 -250745 -407274
18352d07274B6019J15482N0255k1712c18531e2741B53010i1563A8306L01867n6388
$$ -407274 26019 141501 191756 170044 -318531 -52741 253010 -91563 18306 320173 263785
18341B63785i3164a8804M335k9883r8425A11321J95713a86971m4471m1727n2059
$$ 263785 -93164 -18804 -14469 -44352 -142777 111321 307034 -186971 -231442 -273169 -325228
18330c25228E5870a35178r6474a7694B309g9685k21657A07846l0958L424N5592
$$ -325228 55870 -135178 -231652 -17694 2309 -79685 -301342 107846 76888 80312 135904
18319A35904C633c16113a34675A3666a59328P9179B54090a46091A34430D1261
$$ 135904 3633 -316113 -134675 13666 -159328 -80149 254090 -146091 134430 41261
18308i9438o5084K5838B32733o9211a56775e271j67188B30639n6517a54774a3965
$$ -99438 -164522 -138684 232733 163522 -156775 -5271 -172459 230639 174122 -154774 -13965
18296B1412c5322C18901h17m9477l5998A05520N241a25680N2033j56858p791j64952
$$ 21412 -35322 318901 -817 -50294 -86292 105520 110761 -125680 -73647 -230505 -238296 -403248
18284d03248A13932f3236K0550j04330D3213L1688c3426r481B55281a7182l0877
$$ -403248 113932 -63236 -42686 -147016 43213 74901 -33426 -42907 255281 -17182 -48059
18273d8059A03377k4247L3539D1978b9968j58708D825a83151M8323A36904n8576
$$ -48059 103377 79130 112669 41978 -29968 -188676 4825 -183151 -134828 136904 78328
18262G8328a02985j12205R5169E1563c1946G9857h1866m15410G4431Q6530J58140
$$ 78328 -102985 -215190 -120021 51563 -31946 79857 -81866 -497276 74431 160961 319101
18251C19101B8088J0348a27393e3502j87151o1859d6814m3976A43439m3347P5590
$$ 319101 28088 38436 -127393 -53502 -240653 -302512 -46814 -90790 143439 100092 175682
18240A75682F7499r298J50218r0366d3415A04712J6225i1526A74638k2301b49496
$$ 175682 67499 58201 208419 118053 -43415 104712 120937 -91526 174638 152337 -249496
18228c1962D53269c9128I4766B56a48689l44776C71687A41435n4647J10418O1333
$$ -31962 453269 -39128 94766 256 -148689 -493465 371687 141435 86788 197206 258539
18217B58539B0661a24398B95637A19381J2495a99419a0033j00108j47704d0431
$$ 258539 20661 -124398 295637 119381 131876 -199419 -10033 -110141 -257845 -40431
18206a83069p514M4616j0265A6021K5281b62438Q1179G2585b74804d6847r4262
$$ -183069 -190583 -145967 -156232 16021 41302 -262438 -181259 72585 -274804 -46847 -141109
18195a41109c4321q5043B936b04834B80467b37154d6336k90048f8950A07121B8609
$$ -141109 -34321 -119364 2936 -204834 280467 -237154 -46336 -336384 -68950 107121 28609
18183a50227m3847c3029B78588d00040a77808A73810b68659j29898J49684i9911
$$ -150227 -194074 -33029 278588 -400040 -177808 173810 -268659 -398557 -248873 -99911
18172a33263k9097j26647A4717M6791b74975J28319j33986n2620b6983H6107B3890
$$ -133263 -162360 -289007 14717 61508 -274975 -146656 -280642 -333262 -26983 86107 23890
18160h9553G9961f2683B73983r5499g9352B18456j05812M7170J11202q6247D8807
$$ -89553 79961 -62683 273983 178484 -79352 218456 112644 159814 271016 184769 48807
18148B57237b10814J01083g108k34109a16583A92328o9894f6883i668A54148Q154
$$ 257237 -210814 -109731 -7108 -241217 -116583 192328 122434 -66883 -9668 154148 162302
18137A62302b63177J2429E8789a02510D39281g1400p6313m15759C6340Q1952a94586
$$ 162302 -263177 -250748 58789 -102510 439281 -71400 -147713 -563472 36340 118292 -194586
18125B28225b19957k18985B56915P1541C1615d0871j122A00635a3436B18125C8939
$$ 228225 -219957 -438942 256915 328456 31615 -40871 -41993 100635 -13436 218125 38939
18113A41197b92547B32882a90480g7959n6310m6214Q154b329j5751A8389c80141
$$ 141197 -292547 232882 -190480 -77959 -134269 -180483 -172329 -2329 -18080 18389 -380141
18101A99026a23439o7237j93289a03041r4410k45847O1079a40651B0612e1279
$$ 199026 -123439 -190676 -383965 -103041 -197451 -443298 -382219 -140651 20612 -51279
18090F5769b37710N1155K1221E8727b04237e5259I2848J41593I7775a29461M5819
$$ 65769 -237710 -186555 -165334 58727 -204237 -55259 92848 234441 97775 -129461 -83642
18079h3642B74302b79253J29255j02314D2778a27453C41343C712J02656J9939
$$ -83642 274302 -279253 -149998 -252312 42778 -127453 341343 3712 106368 126307
18069A26307E8815K00540M1914a48396B9783a94151H4454a59994j1793j99751
$$ 126307 58815 259355 301269 -148396 29783 -194151 84454 -159994 -171787 -371538
18059c71538D40241a05763m4517A7539K22062J50009a02481j51160f0883j68239
$$ -371538 440241 -105763 -150280 17539 239601 389610 -102481 -253641 -60883 -229122
18049b29122R9928k2469g4474D3159P6694b13325E5229J2436a61006G7056d03172
$$ -229122 -129194 -151663 -74474 43159 119853 -213325 55229 67665 -161006 77056 -403172
18037C5694a55032A05864b11772A44125a71136C6816J5473K23823b64910A46080
$$ 35694 -155032 105864 -211772 144125 -171136 36816 52289 276112 -264910 146080
18026A51775f7151G5643a50276A78119O8014b37198c3742A13174e0614I7223m6665
$$ 151775 -67151 75643 -150276 178119 246133 -237198 -33742 113174 -50614 97223 50558
18015E0558J71687c51830c1873r708A99739F1717j2194b40217i8669q8876O5200
$$ 50558 222245 -351830 -31873 -41581 199739 61717 49523 -240217 -98669 -187545 -122345
18004a22345C6158e9296A20512d32325e3752l5166A47157h2079k7751k5239A61948
$$ -122345 36158 -59296 120512 -432325 -53752 -88918 147157 -82079 -109830 -135069 161948
17992B13285A8336L40830c24629e3968i8n51889K00797A90324q9431J37724A12282
$$ 213285 18336 359166 -324629 -53968 -98 -551987 -351190 190324 100893 238617 112282
17980a62209A38589O6262A639R649h5539o4432k64763i4507l9497l9664B0760
$$ -162209 138589 204851 1639 11288 -85539 -149971 -414734 -94507 -134004 -173668 20760
17968e5462j21094o8725A79891a15705A92671B3693a71615A1396J41743n9808
$$ -55462 -176556 -245281 179891 -115705 192671 23693 -171615 11396 153139 93331
17958I3331k701J38848q5690a91820b9128A17406D384i3250A6627c12191i4075
$$ 93331 90630 229478 143788 -191820 -29128 117406 4384 -93250 16627 -312191 -94075
17946I0748g5999A07781a91252j1097E4986a12170A88247b51081m5318h3813n6938
$$ 90748 -75999 107781 -191252 -202349 54986 -112170 188247 -251081 -296399 -83813 -140751
17935a40751A43721A9404R5674j1774a22962A94535p2122i7425B25252b39122
$$ -140751 143721 19404 115078 103304 -122962 194535 122413 -97425 225252 -239122
17924E8382a72880a867j0685C6946a1197n23416B6521J20331l4629A7407a86731
$$ 58382 -172880 -1867 -12552 36946 -11197 -534613 26521 146852 112223 17407 -186731
17912A95038A0760K45145b83269A29968h6914M891F0512L3339h3148A59447c41497
$$ 195038 10760 255905 -283269 129968 -86914 -82023 60512 93851 -83148 159447 -341497
17900A12568n2593b46213e374A80909h4728E457R8374K7329d3750C2599i9649
$$ 112568 59975 -246213 -5374 180909 -84728 5457 103831 131160 -43750 32599 -99649
17888e3377n2309B03691b5780j4222A32545c0422j25998D44981g0208B992P0902
$$ -53377 -105686 203691 -25780 -40002 132545 -30422 -156420 444981 -70208 2992 73894
17877G3894a47102j29671J26790C3929R9163d5347l36745C67504g589E9595K70643
$$ 73894 -147102 -276773 -149983 33929 133092 -45347 -382092 367504 -7589 59595 330238
17866C30238b99807H3881C7713Q0635d5201K1062o6949m4583D0618b12930b7629
$$ 330238 -299807 83881 37713 118348 -45201 -24139 -91088 -135671 40618 -212930 -27629
17854b51751a00352C73062A01922a15477j1180A22584b17530e6562k66613A29009
$$ -251751 -100352 373062 101922 -115477 -126657 122584 -217530 -56562 -323175 129009
17843g9803A25069J41004D8763J9061J9181A8145J43583a89277b9221B74725P7123
$$ -79803 125069 266073 48763 67824 87005 18145 161728 -189277 -29221 274725 351848
17832C51848c7003A14378n017C3230h9242A4140b17502B58732H4450K01691d74147
$$ 351848 -37003 114378 109361 33230 -89242 14140 -217502 258732 84450 286141 -474147
17820b54066J23606A20799O443a89094r9312c9552o2937H4101B1617O6548f9054
$$ -254066 -130460 120799 127242 -189094 -288406 -39552 -102489 84101 21617 88165 -69054
17808a65501r0710B44202b24484B83910B1029J0817a73817d9034m0889q0294A49459
$$ -165501 -256211 244202 -224484 283910 21029 31846 -173817 -49034 -89923 -170217 149459
17796A72914d37162A26962C4419d6929j9310J9788p8837A62817A7913b65381C41915
$$ 172914 -437162 126962 34419 -46929 -66239 -46451 -125288 162817 17913 -265381 341915
17784A01456J54464F0029a28478j02351B22778b61167A1782a52043B35551A00261
$$ 101456 255920 60029 -128478 -230829 222778 -261167 11782 -152043 235551 100261
17773B27901b62051D634b8445F0157J3938J26221G5471B9131a39451j78546C6002
$$ 227901 -262051 4634 -28445 60157 74095 200316 75471 29131 -139451 -317997 36002
17761c0885k62610C0129a24470O1725l6717B80337i1219a9788C6011j6451J12525
$$ -30885 -293495 30129 -124470 -62745 -99462 280337 -91219 -19788 36011 19560 132085
17750A32085a81922C70087D2113a86732A77004a46407j43788B22995B783J87677
$$ 132085 -181922 370087 42113 -186732 177004 -146407 -290195 222995 2783 190460
17740A90460g532j45027B11509J81560a4941k79537f0701B50922F4702a64850
$$ 190460 -7532 -152559 211509 393069 -14941 -294478 -60701 250922 64702 -164850
17729F8723B4388J54149b61392e114l49024B28215d4454B4137n256a22704B54243
$$ 68723 24388 178537 -261392 -5114 -354138 228215 -44454 24137 18881 -122704 254243
17717b00700A17404a05482l27800a29530A16560a1931B49119j12911J4699b66948
$$ -200700 117404 -105482 -433282 -129530 116560 -11931 249119 136208 150907 -266948
17706F2770J6076D763L13852b72017B62195a21045A39040E9049K4277b34457P281
$$ 62770 78846 4763 318615 -272017 262195 -121045 139040 59049 83326 -234457 -227176
17695b27176p2849k5358i7581c8903A34198d0516d464A77554b28143e1094j51597
$$ -227176 -300025 -325383 -97581 -38903 134198 -40516 -4464 177554 -228143 -51094 -202691
17684b02691D2231O2049A5444F181K6460b20348B00675g5530A57729Q433R9867
$$ -202691 42231 104280 15444 6181 32641 -220348 200675 -75530 157729 166162 266029
17673B66029a5575A11682a37100K4488C0161P009b30490c7053A29620B255J28193
$$ 266029 -15575 111682 -137100 -112612 30161 37170 -230490 -37053 129620 2255 130448
17662A30448F980K42734i5842D7067a27379b2248m1181j54161D38629k18887G0710
$$ 130448 6980 249714 -95842 47067 -127379 -22248 -63429 -217590 438629 219742 70710
17650e342l10536h3322b3277B01405A5007a7383G1231C0198c3696j54309A02966
$$ -5342 -315878 -83322 -23277 201405 15007 -17383 71231 30198 -33696 -188005 102966
17638c40148E5474b33633N4306B85198h2897G1695L66301b04632B04704a385A81755
$$ -340148 55474 -233633 -179327 285198 -82897 71695 437996 -204632 204704 -1385 181755
17626B0387f9867A5434J28252Q5076b57613A16476J23463a01370A31502a74651
$$ 20387 -69867 15434 143686 228762 -257613 116476 239939 -101370 131502 -174651
17615a17307A20569n7268d42387A88466o9886a36604B60867F4484b6695A9094
$$ -117307 120569 63301 -442387 188466 118580 -136604 260867 64484 -26695 19094
17604A9280J02582d6034B62646A16898j8845a60685m1221A3728a92749A23719
$$ 19280 121862 -46034 262646 116898 98053 -160685 -201906 13728 -192749 123719
17593A13773b15045i0534F0818J63504J69582b38603A03351n1522r452b2144B58559
$$ 113773 -215045 -90534 60818 224322 393904 -238603 103351 51829 42377 -22144 258559
17581E6846B5261a23428c4325m0669j71461a11511G5521a01081B94710J8140j2870
$$ 56846 25261 -123428 -34325 -74994 -246455 -111511 75521 -101081 294710 312850 299980
17570B99980b8719l84965B15064a12023k57745B13941D8051a83504Q9471A75999
$$ 299980 -28719 -413684 215064 -112023 -369768 213941 48051 -183504 -94033 175999
17559g0814E8395a07626H0745a86169A8987J74356r2058K44013A24265L6949N2157
$$ -70814 58395 -107626 80745 -186169 18987 193343 101285 345298 124265 161214 213371
17548B13371A8689M57225A57327G0829a56230A47412D0105c0916p4078A28951
$$ 213371 18689 475914 157327 70829 -156230 147412 40105 -30916 -104994 128951
17537b11147f2636B88742j32815e4219H7321c82109a27647e1489j9674A53573
$$ -211147 -62636 288742 155927 -54219 87321 -382109 -127647 -51489 -71163 153573
17526B73131o5293I8195M8753n6573A5899N7325e5778I5225A8473L2292M5567
$$ 273131 207838 98195 146948 90375 15899 73224 -55778 95225 18473 50765 96332
17515I6332m0022R3803n5183J5802g3979A62220P4650D2390J98084J26893h7437
$$ 96332 56310 150113 94930 110732 -73979 162220 236870 42390 240474 367367 -87437
17503a34595e7706K7416k845G666J47807b96054D05837I35L03987b44500F6553
$$ -134595 -57706 -30290 -33135 7666 155473 -296054 405837 935 304922 -244500 66553
17491B6086J45305C2018N1715Q076D5012h235B8870K92670A08864a18161K673
$$ 26086 171391 32018 83733 91809 45012 -8235 28870 321540 108864 -118161 -115488
17480a15488c2777C01553p4675H1230N56947C03587m2616p5643J62699k1231b05980
$$ -115488 -32777 301553 226878 81230 638177 303587 260971 185328 348027 326796 -205980
17468A91990J06548A14728J68215f122F01104e3546C26743b21775A80476A9522
$$ 191990 298538 114728 282943 -6122 601104 -53546 326743 -221775 180476 19522
17457C59072a99530l7477B65127j8535C1770L05373D1153J51577J15400j05719
$$ 359072 -199530 -237007 265127 246592 31770 337143 41153 192730 308130 202411
17447B02411n6724M38882H0127K91176A61539H0111k0434R5794J13352j28070
$$ 202411 145687 584569 80127 371303 161539 80111 59677 155471 268823 140753
17437A40753Q5353K41303j27839J36047j01745j69150j0166K10221A22058c3519
$$ 140753 226106 467409 339570 475617 373872 204722 194556 404777 122058 -33519
17426B73952F6482J82631F059L16908q7258a5849A83539L31208E3219K24988D9941
$$ 273952 66482 249113 6059 322967 235709 -15849 183539 514747 53219 278207 49941
17414I8707O26349b75496H9839k2446d3158j36102D75176A48815J43016L9077
$$ 98707 725056 -275496 89839 67393 -43158 -179260 475176 148815 291831 330908
17404C30908A389L66729D0321J54870I5285O8180o9795I717a5895m8953A83149
$$ 330908 1389 368118 40321 195191 95285 163465 93670 9717 -15895 -64848 183149
17392G2140a8634H9025P4033o6483a15515C17991j08894n4334J94961J55861a25011
$$ 72140 -18634 89025 163058 96575 -115515 317991 209097 154763 349724 505585 -125011
17380a16707A00514J9123c9683A6741K79430j35982J00844d321A40023F9487F826
$$ -116707 100514 119637 -39683 16741 296171 160189 261033 -4321 140023 69487 6826
17368D9086K04174A15861E7922L3317b10725B52640C5275L77827n2352j25229
$$ 49086 253260 115861 57922 91239 -210725 252640 35275 413102 360750 235521
17358B35521J70267a61290I1813P747M9452R5225a79366g08B60300j17468d8868
$$ 235521 405788 -161290 91813 99560 149012 244237 -179366 -708 260300 142832 -48868
17346A60743j3081K70768L2347j72187i7478A93682g1223j2362D6512d2914A51100
$$ 160743 147662 418430 450777 278590 -97478 193682 -71223 -83585 46512 -42914 151100
17334A45039O0850P9909B5179J97942j4678D6741N9146K0714L03863k09831o4253
$$ 145039 205889 285798 25179 223121 208443 46741 105887 126601 430464 220633 156380
17323A56380a18320a7315Q522D78694k07458N4300A47667P4787Q6749a33979B7001
$$ 156380 -118320 -17315 -8793 478694 271236 325536 147667 222454 309203 -133979 27001
17311A58818i8318A955O8222a19108B75032f6169n2919B71738b3553p7597A89913
$$ 158818 -98318 1955 70177 -119108 275032 -66169 -119088 271738 -23553 -101150 189913
17299F52205b15393j2192B6522K73608G8151K5169Q192K07703d03413a72110b2448
$$ 652205 -215393 -227585 26522 300130 78151 103320 111512 319215 -403413 -172110 -22448
17287D27173a865G3014N2027c742p3309C35209A49047k4967M11889C0869J68586
$$ 427173 -1865 73014 125041 -3742 -77051 335209 149047 124080 535969 30869 199455
17276A99455a51832E58943a13113b7083A49720L2906e8986B62331J7926j06819
$$ 199455 -151832 558943 -113113 -27083 149720 182626 -58986 262331 280257 173438
17266A73438j3193K28874E7848K06185q0981J3541l3370K73923q9075j55125l4100
$$ 173438 160245 389119 57848 264033 183052 196593 163223 437146 348071 192946 158846
17255A58846h2708D8107J87120p174H5217P9031b9136C03134Q8644P4998H7427
$$ 158846 -82708 48107 235227 228053 85217 164248 -29136 303134 391778 466776 87427
17243h7022C5000J67926J71596G6758a48969B71006I2563g641D1881P8330K02317
$$ -87022 35000 202926 374522 76758 -148969 271006 92563 -7641 41881 120211 322528
17232C22528q3011I3680n807a5965l6622B66963O1836A10150J42485J47025j25844
$$ 322528 239517 93680 87873 -15965 -52587 266963 328799 110150 252635 399660 273816
17221B73816d2868C16755J05365c8390C77411e9510B99232J38637j55256M8935
$$ 273816 -42868 316755 422120 -38390 377411 -59510 299232 437869 282613 331548
17211C31548Q3798j27474A43395J2691O9839J58462j29121C3669N37986F6424
$$ 331548 415346 287872 143395 156086 225925 384387 255266 33669 571655 66424
17200I8344P4034p9747d0577E24555B53013j06716L8087J99321M2245B06060Q6561
$$ 98344 172378 92631 -40577 524555 253013 146297 184384 383705 425950 206060 292621
17189B92621E5139L64365c4457C19253a9493C84614A60623J7207p9514o697J0429
$$ 292621 55139 419504 -34457 319253 -19493 384614 160623 177830 98316 91619 102048
17178A02048m1506J96708k8393K14399j24006I3422L05664G2375J75835R1623
$$ 102048 60542 257250 228857 443256 319250 93422 399086 72375 248210 339833
17168C39833j7452A56282o783P4339K83505A48202N2810L35343B53882o1463a0222
$$ 339833 322381 156282 149499 223838 507343 148202 201012 536355 253882 192419 -10222
17156D41941B05470K34653k15381L20474j06413q0192O1164M9491m599J11489
$$ 441941 205470 440123 224742 545216 438803 358611 419775 469266 464667 576156
17146E76156B28578J6334D5037L24073J69764k37241l7991L3308m7487K27421
$$ 576156 228578 244912 45037 369110 538874 301633 263642 296950 249463 476884
17136D76884j58057g2219D34445Q9585A43061L31849o2995r8144K29168B52602
$$ 476884 318827 -72219 434445 524030 143061 474910 411915 313771 542939 252602
17125B72260J36927C2186c9303C26911K4914q0510J78320j09850j21405k5173
$$ 272260 409187 32186 -39303 326911 351825 271315 449635 339785 218380 193207
17115A93207L0243A8498Q35921C65296p022l9803d6993E79768j01460J1813p2395
$$ 193207 223450 18498 854419 365296 358274 318471 -46993 579768 478308 490121 417726
17104D17726A73909J55585C0342N42051j12872j60115J09706A18285K06172J10075
$$ 417726 173909 329494 30342 572393 459521 299406 409112 118285 324457 434532
17094D34532R4078A06302L29401B09404L50546k21575J50420J65689j72910J02432
$$ 434532 528610 106302 435703 209404 559950 338375 488795 654484 481574 584006
17084E84006B30893J24948G3155L59788l7076K05362m5517A46570L96992B25464
$$ 584006 230893 355841 73155 432943 395867 601229 555712 146570 543562 225464
17073D04061j46818N24934k41999j23540p6758K90232k4415N79226A39454M6148
$$ 404061 257243 782177 540178 416638 339880 630112 605697 1184923 139454 185602
17063A85602J27924J91369r5960K58705C12284J66064n5346J1918K50730m6903
$$ 185602 313526 504895 408935 667640 312284 478348 423002 434920 685650 638747
17053F38747L12704m10758N1384L5050j14509p0275K67764j68029K568L5007n4042
$$ 638747 951451 540693 592077 627127 512618 442343 710107 542078 544646 579653 525611
17042E25611L247N7019J17806r0737K63456l06531n4035K91482l30540j63098
$$ 525611 528858 585877 703683 612946 876402 569871 515836 807318 476778 313680
17032C13680K82148K28394j82797j47287r4967L0791J93576l1490r6350r4772
$$ 313680 595828 824222 641425 494138 399171 429962 623538 592048 495698 400926
17022D00926L25488j90796K18612k10868M90929l66609J49831q5277l06344L65004
$$ 400926 726414 535618 754230 543362 1034291 667682 817513 732236 425892 790896
17012G90896C76315J42289K44137K0757p4565j25458J12757q871r4877J12158
$$ 790896 376315 518604 762741 783498 708933 583475 696232 687361 592484 704642
17002G04642j71156M96065l91360k770J4016j37784p1771L66318K11783j06173
$$ 704642 533486 1029551 638191 635421 649437 511653 439882 806200 1017983 911810
16992I11810Q3706j54047p9936J04703J33588l68670K69623D26766M54082R7729
$$ 911810 995516 841469 761533 866236 999824 631154 900777 426766 880848 978577
16982I78577k41779r533L54812m91428Q3332J18176k0471j49246l2843J73895
$$ 978577 736798 727265 1082077 590649 673981 792157 771686 622440 589597 763492
16972G63492M41931j89299p4268p5418r1801M9471O3714J68710k71734L72483
$$ 763492 1205423 1016124 941856 866438 774637 824108 887822 1056532 784798 1157281
16962A157281l80739J76613m01547K38960L7734J66048k35591J92594J55456j35862
$$ 1157281 776542 953155 551608 790568 828302 994350 758759 951353 1106809 970947
16952I70947K81633j36181j94878L04590R5598j94510l63758M90597m37434L00166
$$ 970947 1252580 1116399 921521 1226111 1321709 1127199 763441 1254038 816604 1116770
16942A116770M564j13331O5383K3828O62832n54127j13621N42397k74657J89445
$$ 1116770 1121334 1008003 1073386 1097214 1760046 1205919 1092298 1634695 1360038 1549483
16932A549483J40585k31923l34111K53470K6178j71127j38575K2376M60796j46140
$$ 1549483 1690068 1458145 1124034 1377504 1403682 1232555 1093980 1116356 1577152 1431012
16922A431012M46829m12540k10937J07801j20326q3636L94907n53362N34509j9693
$$ 1431012 1877841 1465301 1254364 1362165 1241839 1158203 1553110 999748 1534257 1514564
16912A514564p0673K14166J94235l94955k48446L31165m17690M60621M5362K52450
$$ 1514564 1443891 1658057 1852292 1457337 1208891 1540056 1122366 1582987 1628349 1880799
16902A880799m72972O9788M60315m25793P6411K99621j56588J91956j32601R5871
$$ 1880799 1407827 1477615 1937930 1512137 1588548 1888169 1731581 1923537 1790936 1886807
16892A886807l57535L63877k7859R5965j52289K18757m3508K23020k33428L69568
$$ 1886807 1529272 1893149 1865290 1961255 1808966 2027723 1984215 2207235 1973807 2343375
16882B343375l60555J43231m9462J54364Q9885k4365p4933m32884M65794r53j82832
$$ 2343375 1982820 2126051 2076589 2230953 2320838 2296473 2221540 1788656 2254450 2253497 2070665
16871B070665J80713L07067K25426k76655j61615R2142L85134o9027n2443O4304
$$ 2070665 2251378 2558445 2783871 2507216 2345601 2437743 2822877 2753850 2701407 2765711
16861B765711n99904Q35495m67976K93551K94676j24658m1970l3872L44091k09976
$$ 2765711 2165807 3001302 2533326 2826877 3121553 2996895 2954925 2921053 3265144 3055168
16851C055168L02416q3630k32323K64683O9392J13891M1660J13569K81470k02241
$$ 3055168 3357584 3273954 3041631 3306314 3375706 3489597 3531257 3644826 3926296 3724055
16841C724055k3617r4087K00248j6942N40446l33200n7018K53108L34611l61506
$$ 3724055 3700438 3606351 3806599 3789657 4330103 3996903 3939885 4192993 4527604 4166098
16831D166098M32689k09302M24940J705K7057J2187K4684J70569J08921k70070
$$ 4166098 4598787 4389485 4814425 4816130 4843187 4855374 4880058 5050627 5159548 4889478
16821D889478P00093k28723m1276k227K01056K03283J30757K82893m9157M14458
$$ 4889478 5589571 5360848 5319572 5317345 5518401 5721684 5852441 6135334 6086177 6500635
16811F500635k99664M72674k21257M33503O10464n44058K19584J68131M32444
$$ 6500635 6200971 6673645 6452388 6885891 7496355 6952297 7171881 7340012 7772456
16802G772456n1235L44274q8611R7387P31743J22771J74300j64231L33203N12969
$$ 7772456 7721221 8065495 7976884 8074271 8806014 8928785 9103085 8938854 9272057 9785026
16792I785026L20851J01176R1095K95882M99232K35063Q380M62744L55148L85504
$$ 9785026 10105877 10207053 10298148 10594030 11093262 11328325 11336705 11799449 12154597 12540101
16782A2540101Q81904j11695P2994P41423K27544L89913P31556M98630P96029
$$ 12540101 13422005 13310310 13383304 14124727 14352271 14742184 15473740 15972370 16768399
16773A6768399L46544O85116N43612L23403R48741O53992O35537O38708R45369
$$ 16768399 17114943 17800059 18343671 18667074 19615815 20269807 20905344 21544052 22489421
16764B2489421P56070R59461J110733P69556Q01571J427510J449588R32024J263437
$$ 22489421 23245491 24204952 25315685 26085241 26886812 28314322 29763910 30695934 31959371
16755C1959371J626109J492188J385441J648571K439853J685422J588498K418129
$$ 31959371 33585480 35077668 36463109 38111680 40551533 42236955 43825453 46243582
16747D6243582K517479K622961K428147K661556L169019L212454L538777L996640
$$ 46243582 48761061 51384022 53812169 56473725 59642744 62855198 66393975 70390615
16739G0390615L681820M308947M385568M731329N639570N394319N688518O236346
$$ 70390615 74072435 78381382 82766950 87498279 93137849 98532168 104220686 110457032
16731A10457032O353461O663448O784216P258941P255457P204871O966342P013119
$$ 110457032 116810493 123473941 130258157 137517098 144772555 151977426 158943768 165956887
16723A65956887N991601O022350N368976L779389L378162J900773J120625l53603
$$ 165956887 171948488 177970838 183339814 187119203 190497365 192398138 193518763 193165160
16715A93165160j575828k462349l711194m646096n649413o288129o209819p310323
$$ 193165160 191589332 189126983 185415789 180769693 175120280 168832151 162622332 155312009
16707A55312009p249589o782623p746004o918800p006010o309496o384915o055316
$$ 155312009 148062420 141279797 133533793 126614993 119608983 113299487 106914572 100859256
16699A00859256n377521n778367n165675m760721m361765m095998m410842l271060
$$ 100859256 95481735 89703368 84537693 79776972 75415207 71319209 66908367 63637307
16691F3637307l404587l018219l008341k695888k425695k467495k219078j992985
$$ 63637307 60232720 57214501 54206160 51510272 49084577 46617082 44398004 42405019
16683D2405019k258810j873349j744247j575331j212570j890665j151214j642172
$$ 42405019 40146209 38272860 36528613 34953282 33740712 31850047 30698833 29056661
16675B9056661q19212j276902r08919j173702p86175r51153q66867q02042q00545
$$ 29056661 28237449 26960547 26051628 24877926 24091751 23140598 22273731 21471689 20671144
16666B0671144q08714n25415q64036n01619n52451r16724k94289m96571n50654
$$ 20671144 19862430 19337015 18472979 17971360 17418909 16502185 16207896 15711325 15160671
16657A5160671n69391l03356p04460j02020n05468m71861p72113M69942m25979
$$ 15160671 14591280 14287924 13583464 13481444 12975976 12504115 11732002 12201944 11775965
16648A1775965o67650k68634j66276n6075l91561o02763M3706N4945l92763o02106
$$ 11775965 11108315 10839681 10673405 10617330 10225769 9623006 9666712 9721657 9328894 8726788
16638H726788L3241k82048k03076k01544l97679j30173J07027n42352J62380j36003
$$ 8726788 8760029 8477981 8274905 8073361 7675682 7545509 7652536 7110184 7272564 7136561
16628G136561j06340l16360k61327o3493j93880k43542K02863m09506k54070K15147
$$ 7136561 7030221 6713861 6452534 6389041 6195161 5951619 6154482 5744976 5490906 5706053
16618E706053p2125o0670j71955k41863L6266m39197P8150Q4965m22697L25638
$$ 5706053 5633928 5573258 5401303 5159440 5195706 4756509 4834659 4919624 4496927 4822565
16608D822565m25557K66540m54528l9268J75246k85371j80323j05109K97607m51679
$$ 4822565 4397008 4663548 4209020 4169752 4344998 4059627 3879304 3774195 4071802 3620123
16598C620123L20811J30344m94495L45084o29784M46840n33049J76301k26754
$$ 3620123 3940934 4071278 3576783 3921867 3292083 3738923 3205874 3382175 3155421
16589C155421R2567M70708o43228K9732J81214k75576k6924l71809L12174o8797
$$ 3155421 3247988 3718696 3075468 3105200 3286414 3010838 2983914 2612105 2924279 2855482
16579B855482k9031k68137K72682k95177K22013o0686K54416n03177Q5975J1561
$$ 2855482 2826451 2558314 2830996 2535819 2757832 2697146 2951562 2448385 2534360 2545921
16569B545921k61495J92523P5154k55437k28438K44201J58718j41581k80449J88621
$$ 2545921 2284426 2476949 2552103 2296666 2068228 2312429 2471147 2329566 2049117 2237738
16559B237738k30776R3748J36512r9449P8480k98185m6332J0258k01818K24979
$$ 2237738 2006962 2100710 2237222 2137773 2216253 1918068 1871736 1881994 1680176 1905155
16549A905155J66626j86079r4360l2752j01014J94947l05907R2662k662J31944
$$ 1905155 2071781 1885702 1791342 1758590 1657576 1852523 1546616 1639278 1636616 1768560
16539A768560k87657K09429j77779K60788l74429j02253L76955k61618l0571K13519
$$ 1768560 1480903 1690332 1512553 1773341 1398912 1296659 1673614 1411996 1381425 1594944
16529A594944j86404K95895j98394J47396p3168k35549k29331L36659j57907L40255
$$ 1594944 1408540 1704435 1506041 1653437 1580269 1344720 1115389 1452048 1294141 1634396
16519A634396k17149L84390m12115q0388J6793l1875j20026J73987j55411N0326
$$ 1634396 1417247 1801637 1389522 1309134 1325927 1294052 1174026 1348013 1192602 1242928
16509A242928K03663j21848Q42l11885o7195M09580j27729n3645p6759q2532j52521
$$ 1242928 1446591 1324743 1325585 1013700 946505 1356085 1228356 1174711 1097952 1015420 862899
16498H62899o9077M16746k69970j40750J85877j3575K82044k32752K24265J2721
$$ 862899 793822 1210568 940598 799848 985725 972150 1254194 1021442 1245707 1258428
16488A258428j91591j69654M21663E94794N68176E61644O29697o1498N1216j08913
$$ 1258428 1066837 897183 1318846 594794 1162970 561644 1191341 1129843 1181059 1072146
16478A072146k71413M9171L20743p848J2450k98705m5280K39398j54803k45879
$$ 1072146 800733 849904 1170647 1162799 1175249 876544 831264 1070662 915859 669980
16468F69980N04696m39043q4833J78638j85678K52453J4602p4748J00758l18007
$$ 669980 1174676 735633 650800 829438 643760 896213 910815 836067 936825 618818
16458F18818K34228m4561O1798L4243n9070l5233K01765L477m3958J70867l24345
$$ 618818 853046 808485 870283 904526 845456 810223 1011988 1015465 971507 1142374 818029
16447H18029K00262l12476j42613J62357J58585j00378l04420J30040J62611k98383
$$ 818029 1018291 705815 563202 725559 884144 783766 479346 609386 771997 473614
16437D73614J24853L38999k52562J05544j17992q5332o2148K00061j41044K30884
$$ 473614 598467 937466 684904 790448 672456 587124 524976 725037 583993 814877
16427H14877k88175n8701J24366K75762j71791j62700K09422C15124K42666Q7266
$$ 814877 526702 468001 592367 868129 696338 533638 743060 315124 557790 645056
16417F45056j01008j42842K33989n2690R3722j28049L91934r6427j04345O7300
$$ 645056 544048 401206 635195 582505 676227 548178 940112 843685 739340 806640
16407H06640K1112k65425K6444M5655C11102Q1860m8543L88721M3238l41783k059
$$ 806640 827752 562327 588771 634426 311102 392962 344419 733140 776378 434595 432536
16396D32536J29059j00135j80734L6105p9550L32493j71692A22938L42347r7139
$$ 432536 561595 461460 280726 316831 237281 569774 398082 122938 465285 368146
16386C68146j76661K95847o5557J16851p4570O1039j55712A27859M86065j89866
$$ 368146 191485 487332 421775 538626 464056 525095 369383 127859 613924 424058
16376D24058R7565j8510K52198l31241j88624P4429q5428K40698J1305j9231O1976
$$ 424058 521623 503113 755311 424070 235446 309875 224447 465145 476450 457219 519195
16365E19195j88108K46852j77770L52105B04953N5283R4713j3109q9828L6590
$$ 519195 331087 577939 400169 752274 204953 260236 354949 341840 252012 288602
16355B88602L398K53117j32053Q8483M2717j58042Q5621r3286j30441O0711J82679
$$ 288602 292000 545117 413064 501547 544264 386222 471843 378557 248116 308827 491506
16344D91506j33176K253N4813F9048L15041m1943A24066K71641C0965J36684M4915
$$ 491506 358330 360583 415396 69048 384089 342146 124066 395707 30965 167649 212564
16333B12564r3580J77572A07992J28273H7761M12013a3754D08088A87089J48700
$$ 212564 118984 296556 107992 236265 87761 499774 -13754 408088 187089 335789
16323C35789Q6756A83699O297J41660r4276J71134j00549J52825J50757B70721
$$ 335789 422545 183699 189996 331656 237380 408514 307965 460790 611547 270721
16312B26855k8624J01403A48121J07446q7952N79544C72153j76159K07194j29334
$$ 226855 198231 299634 148121 255567 167615 747159 372153 195994 403188 273854
16302B73854J70165f4670D10293j21754n1879E6293L04709j9842d105E6069L6541
$$ 273854 444019 -64670 410293 288539 236660 56293 361002 341160 -4105 56069 92610
16291I2610K44900J52477A86371J95577J27171p7884E331P495L86385e1019A62731
$$ 92610 337510 489987 186371 381948 509119 431235 5331 12826 399211 -51019 162731
16279B57791K13079A87037J2823F4895L1455B6933L03012A31080J39661p7666
$$ 257791 470870 187037 199860 64895 96350 26933 329945 131080 270741 193075
16269A93075e647j85148B11638K19267j31786A03493K10043j11551K31335A71620
$$ 193075 -5647 -190795 211638 430905 299119 103493 313536 201985 433320 171620
16258A67274B2109L87642n7423l4668r8023R2224F8893L98410a6587A2617b2852
$$ 167274 22109 409751 352328 317660 219637 311861 68893 467303 -16587 12617 -22852
16246C11281R2043A6071g1245B02249q4573J15451j10955b15387F3458b82836
$$ 311281 403324 16071 -71245 202249 117676 233127 122172 -215387 63458 -282836
16235H750O0075b27421C69650A83441b48724B27832e1187k78932C30042A18299
$$ 8750 68825 -227421 369650 183441 -248724 227832 -51187 -330119 330042 118299
16224F9704J71726j08558n6594a6392a284F34593A21248n3836L5740k4496K56661
$$ 69704 241430 132872 76278 -16392 -1284 634593 121248 67412 103152 78656 335317
16213C35317b152C34865j49726a05835j61397A41970F1020a83139C4414O06591
$$ 335317 -2152 334865 185139 -105835 -267232 141970 61020 -183139 34414 641005
16203F41005B31825i7537a9916A30554J29022J09104j03837c2672q2750A08358
$$ 641005 231825 -97537 -19916 130554 259576 368680 264843 -32672 -115422 108358
16192B93113a7360m1331q9368q1567B64115A3265b03242A55553L9037n2444a17255
$$ 293113 -17360 -58691 -148059 -229626 264115 13265 -203242 155553 194590 142146 -117255
16180b03643c8761D4981O6563J09602a9788A10315a70512A96491P120C1582b33841
$$ -203643 -38761 44981 111544 221146 -19788 110315 -170512 196491 203611 31582 -233841
16168B87554J1860A10635B779J76219n5917O7434n7480L2944J46869q095c6448
$$ 287554 299414 110635 2779 178998 123081 190515 133035 165979 312848 304753 -36448
16156f8517C2550n153K95181A23847P3739n5925b43464B08922J7062b8083C41522
$$ -68517 32550 27397 322578 123847 197586 141661 -243464 208922 225984 -28083 341522
16144B86063h6938C22622A50129N2938B7148Q2749e1332E9506P3954J58044J91197
$$ 286063 -86938 322622 150129 203067 27148 109897 -51332 59506 133460 291504 482701
16133D82701A17030r392a52562A50968J07091b47550L7803J5205E0572P6550c9034
$$ 482701 117030 107638 -152562 150968 258059 -247550 -209747 -194542 50572 127122 -39034
16121G5024O9582a26641j56906A62315C5386L50682j12061c9815C58982a43147
$$ 75024 144606 -126641 -283547 162315 35386 386068 274007 -39815 358982 -143147
16110B06130J85971D1757K61435g2686j93109D24733G0023K3502c6463D6154c4846
$$ 206130 392101 41757 303192 -72686 -265795 424733 70023 93525 -36463 46154 -34846
16098A33914l4125a41531C6374k938a05768p033D12810a32775D23026i203j13155
$$ 133914 99789 -141531 36374 33436 -105768 -112801 412810 -132775 423026 -9203 -122358
16087a22358d9983k34748P21B07142h7548o3692f3776A26946J29922n3794a512
$$ -122358 -49983 -284731 -284010 207142 -87548 -151240 -63776 126946 256868 203074 -1512
16075A62133d9276A35048b7170A18217c6764A41732A3039b37910O0650e0824p0538
$$ 162133 -49276 135048 -27170 118217 -36764 141732 13039 -237910 -177260 -50824 -121362
16064a21362B4637m665K35508o4453b0098q9236A80540a19565C08459n4014a0673
$$ -121362 24637 19972 255480 191027 -20098 -109334 180540 -119565 308459 254445 -10673
16052B5353L47145b51760A37264n2699e1147j31124G2762J60796A8104J55503
$$ 25353 372498 -251760 137264 84565 -51147 -182271 72762 233558 18104 173607
16042A73607e6331B0364M567c5017p6003j68474a2644A51708f7487G5276A7535
$$ 173607 -56331 20364 24931 -35017 -111020 -279494 -12644 151708 -67487 75276 17535
16030g1026k44876a43393O4031k81638A57253M5328I1927h3729K3246q0267j29016
$$ -71026 -315902 -143393 -79362 -361000 157253 202581 91927 -83729 -60483 -140750 -269766
16019b69766A97792r3863m1929b3513k51634B85416G5338b96858J34901A10289
$$ -269766 197792 103929 62000 -23513 -275147 285416 75338 -296858 -161957 110289
16008b1558o8666a436j31738A40266a11419D7560e5282A67468D6418b11722a4082
$$ -21558 -90224 -1436 -133174 140266 -111419 47560 -55282 167468 46418 -211722 -14082
15996e9294K4540a5241C7201L9747a79028C53795j27131b71325B71J09777N744
$$ -59294 -34754 -15241 37201 76948 -179028 353795 226664 -271325 271 110048 115792
15985A15792j823a33193d2093B00437K62401e3487C93986j92410K07321a57806
$$ 115792 113969 -133193 -42093 200437 462838 -53487 393986 201576 408897 -157806
15974B3700c12557c2947j29960A76130i0020j9228j35001J15065C38534b94292
$$ 23700 -312557 -32947 -162907 176130 -90020 -109248 -244249 -129184 338534 -294292
15963b95847H1238A0641N7711j2941P1822K6539h4669B24855a65149H9767f671
$$ -295847 81238 10641 68352 55411 127233 153772 -84669 224855 -165149 89767 -6671
15951a2781j44893d5383H8263c4095F6013J67627p8869J57184b64928H3800J01091
$$ -12781 -157674 -45383 88263 -34095 66013 233640 154771 311955 -264928 83800 184891
15940A84891B0689A686M1517b58271J6793A8577c3828n1190k33593F0284A6058
$$ 184891 20689 1686 43203 -258271 -241478 18577 -33828 -85018 -318611 60284 16058
15928a13753A90045a94866O3984c9271k51711M8183e8609k31306M5713D55213
$$ -113753 190045 -194866 -130882 -39271 -290982 -242799 -58609 -289915 -244202 455213
15917B1260d25110l6246a16285J5919B53721a8052j71943B02129a89449P3821
$$ 21260 -425110 -461356 -116285 -100366 253721 -18052 -189995 202129 -189449 -115628
15907a15628C65161b69694C3972J12032a63041F63J39919a10953B57203g5613
$$ -115628 365161 -269694 33972 146004 -163041 663 140582 -110953 257203 -75613
15896G2800b73499h2465H0206J30120a54263A9248e1549C25016A35521A9090J94041
$$ 72800 -273499 -82465 80206 210326 -154263 19248 -51549 325016 135521 19090 213131
15885B13131K66488H758d1041k86250E73K87039j38714R8586b66439b0341j61098
$$ 213131 479619 8758 -41041 -327291 573 287612 148898 247484 -266439 -20341 -181439
15874a81439j1304E363K00900F2340B7985b54770J26855A46146A9351K62137n6123
$$ -181439 -192743 5363 206263 62340 27985 -254770 -127915 146146 19351 281488 225365
15863B25365c8407n4809J052n4932m6373A88663a69724A58618n4524a88402O9409
$$ 225365 -38407 -93216 -92164 -147096 -193469 188663 -169724 158618 104094 -188402 -118993
15852a18993m04848a01689A54057o3431K91129g7031j33765K6206H9491a95190
$$ -118993 -523841 -101689 154057 90626 381755 -77031 -210796 -184590 89491 -195190
15841A33009F1217a8615j71025B49443j13109L37447d5146k38679a34617J8846
$$ 133009 61217 -18615 -189640 249443 136334 473781 -45146 -283825 -134617 -115771
15831a15771C54318b78087e6257B16259q7507n4872O9801b13366o4175c4710l89420
$$ -115771 354318 -278087 -56257 216259 128752 73880 143681 -213366 -277541 -34710 -424130
15820d24130f7091B15823a69901N9918A60866c92986B5782f5222B89656a91862
$$ -424130 -67091 215823 -169901 -109983 160866 -392986 25782 -65222 289656 -191862
15809b938D6120f8025B09922E4120f5245b6863A7184J67607c77128a57207A44828
$$ -2938 46120 -68025 209922 54120 -65245 -26863 17184 184791 -377128 -157207 144828
15797A76158E3432c7490C36753b74308B055b22318L570c9851l08141A79971b31531
$$ 176158 53432 -37490 336753 -274308 2055 -222318 -218748 -39851 -347992 179971 -231531
15785b15929b4181j12058h942j69161D2080a42561A039P4689R2453a49620C876
$$ -215929 -24181 -136239 -8942 -178103 42080 -142561 1039 75728 168181 -149620 3876
15773a6832j73543n030j13396A06721a37004D0777a56301r0866m3499h2242A8302
$$ -16832 -190375 -195405 -308801 106721 -137004 40777 -156301 -247167 -290666 -82242 18302
15761A03294j1902A846b01631A77245m0259h5124m9936j54311A61281Q8207c57764
$$ 103294 91392 1846 -201631 177245 136986 -85124 -135060 -289371 161281 249488 -357764
15749d6147C3527K36901a48715f6849j1779r0105P8764J3419C40711a7519m9351
$$ -46147 33527 270428 -148715 -66849 -78628 -168733 -89969 -76550 340711 -17519 -66870
15738f6870k6371A6290a81151j07783B79198e7557B61146c9035B22221j9764c7479
$$ -66870 -93241 16290 -181151 -288934 279198 -57557 261146 -39035 222221 202457 -37479
15726A18345c36490e6762j70717J9981A32012b63298C68643c5643j111A52662
$$ 118345 -336490 -56762 -227479 -207498 132012 -263298 368643 -35643 -36754 152662
15715b499j92030C58285L3035b94744c9389A8500K2923J5582a06795A72801a18013
$$ -2499 -194529 358285 391320 -294744 -39389 18500 41423 57005 -106795 172801 -118013
15703g4891A26563a45708k24234B7868a78087A44814B4976b24330b4836l7507
$$ -74891 126563 -145708 -369942 27868 -178087 144814 24976 -224330 -24836 -62343
15693f2343B15511H8683J74771c15141c9442r2042l70576i7144A25421a38834
$$ -62343 215511 88683 263454 -315141 -39442 -131484 -502060 -97144 125421 -138834
15682f2430p309b0933A79764a31571A239b86365L5108P8490F4650K67197c7572
$$ -62430 -69739 -20933 179764 -131571 1239 -286365 -251257 -172767 64650 331847 -37572
15670A15432e7839B9733A0799d44182D7424a36371k84795g9268C52194a51497
$$ 115432 -57839 29733 10799 -444182 47424 -136371 -421166 -79268 352194 -151497
15659b09731A33787F0794p193a01246q3764j69537J51345d7804J0523j76925f0450
$$ -209731 133787 60794 53601 -101246 -185010 -354547 -203202 -47804 -37281 -214206 -60450
15647b18923I930O7712R3027d184G7565J98897I0477e8980a2914G562e9647B2519
$$ -218923 9930 77642 170669 -4184 77565 276462 90477 -58980 -12914 7562 -59647 22519
15634b58781a9121J948A9111a84261e1422H4380d0757j36155A18895a3581F2830
$$ -258781 -19121 -17173 19111 -184261 -51422 84380 -40757 -176912 118895 -13581 62830
15622c0144j44792F7949e6310a0958A47767a4607k30944d3854a7870r9220A83110
$$ -30144 -174936 67949 -56310 -10958 147767 -14607 -245551 -43854 -17870 -117090 183110
15610i462k15760G7990c96722d3987j74023a8338k70097A44371J56798b04407
$$ -9462 -225222 77990 -396722 -43987 -218010 -18338 -288435 144371 301169 -204407
15599B3570d3864m8377A82562b95334d7963j4070l7914k5807J5893A32769J92563
$$ 23570 -43864 -92241 182562 -295334 -47963 -62033 -99947 -125754 -109861 132769 325332
15588C25332A49119m6571N873f2211j73302A1246J23341n6131K01882a23439B49160
$$ 325332 149119 102548 108421 -62211 -235513 11246 134587 78456 280338 -123439 249160
15576a1686k86375B3933J04510c89156a18942k4607B7546a7690A24350a20058
$$ -11686 -298061 23933 128443 -389156 -118942 -143549 27546 -17690 124350 -120058
15565C4787f0388H5569L062B7963J65404m0459a8106l45730A61719d8748A66271
$$ 34787 -60388 85569 88631 27963 193367 152908 -18106 -363836 161719 -48748 166271
15553b06061H6215J02933r2729J81306F6662a0376k6388q0728G5052b45539f1343
$$ -206061 86215 189148 96419 277725 66662 -10376 -36764 -117492 75052 -245539 -61343
15541D569a69005C35913c23039A90238M2830c16232a34302o6553P7865A29256
$$ 4569 -169005 335913 -323039 190238 233068 -316232 -134302 -200855 -122990 129256
15530A19417J90789o9299l3453p2067Q6812l0463g060k73558J28022G3854B3610
$$ 119417 310206 240907 207454 135387 222199 191736 -7060 -280618 -152596 73854 23610
15518b2990j10873A94734n9994J9790K1888R1368a59152o6241i5061C96711A36441
$$ -22990 -133863 194734 134740 154530 176418 267786 -159152 -225393 -95061 396711 136441
15506b4592j29614N4168I888d7512p1726A31015j883l153a28444c5025m31108
$$ -24592 -154206 -100038 9888 -47512 -119238 131015 129132 125979 -128444 -35025 -466133
15495d66133a41577j7093B10099I6904m0338K98995A12897a82719H3994b62855
$$ -466133 -141577 -158670 210099 96904 56566 355561 112897 -182719 83994 -262855
15484a61125F370J5390e1036k41944j6705C16481j04658f6275F5914c5098j93244
$$ -161125 6370 21760 -51036 -292980 -309685 316481 211823 -66275 65914 -35098 -228342
15473b28342K2748c4343m0999A37256O2698p2713a23101j1492A24765M2943C9894
$$ -228342 -205594 -34343 -75342 137256 199954 127241 -123101 -134593 124765 167708 39894
15461I7165a11204I3864b56039D3747J14931D8949O004L27352c9267A15887E6140
$$ 97165 -111204 93864 -256039 43747 158678 48949 54953 382305 -39267 115887 56140
15449g4872k05966A22360K18086b6395f52j81590A91790C2746L0208B6704M4749
$$ -74872 -280838 122360 340446 -26395 -652 -182242 191790 32746 62954 26704 71453
15438G1453i9028L2780H8515m2530J20703a83766j58822h5293G3113i1657G7194
$$ 71453 -99028 -66248 88515 45985 166688 -183766 -342588 -85293 73113 -91657 77194
15426C94957a79236O7315I9772d1349j00916A13978m1328a97968C38002a75969
$$ 394957 -179236 -111921 99772 -41349 -142265 113978 72650 -197968 338002 -175969
15415b9875G8437C1224J65009b36129f3080l5031B47389h8645A40237d2083j34125
$$ -29875 78437 31224 196233 -236129 -63080 -98111 247389 -88645 140237 -42083 -176208
15404a76208O284P550i405A40167b84186c1946r8613f1032j3984H0859c7696A56223
$$ -176208 -169924 -162374 -9405 140167 -284186 -31946 -130559 -61032 -75016 80859 -37696 156223
15391B9599I025J26031G724J5549e7724l4739k36345a26899E4532K50983a22191
$$ 29599 9025 135056 7724 23273 -57724 -92463 -328808 -126899 54532 305515 -122191
15379a716B1854K11502M6708J16695a58223g9098I2512J58794b91940B61662j07507
$$ -1716 21854 233356 280064 396759 -158223 -79098 92512 251306 -291940 261662 154155
15368A54155n7288a20946G8773e341k01255f1697A91480n5227b10513A32192c14897
$$ 154155 96867 -120946 78773 -5341 -206596 -61697 191480 136253 -210513 132192 -314897
15356c03553A86526L125L9485a40015C34117E7229n406J13350G7915j2304d0055
$$ -303553 186526 189651 229136 -140015 334117 57229 51823 165173 77915 65611 -40055
15344H9563a70255p2365A82801m7921J00867d6575B13913d7420j53231e0116J7072
$$ 89563 -170255 -242620 182801 134880 235747 -46575 213913 -47420 -200651 -50116 -33044
15333c3044D6989b92786A57559c10639A98702l8522O3253p7650g9589l3503B97807
$$ -33044 46989 -292786 157559 -310639 198702 160180 223433 145783 -79589 -113092 297807
15321C3148d51654i4825C11568j14651F4811h9853q4327E6569L6582L38744a31013
$$ 33148 -451654 -94825 311568 196917 64811 -89853 -174180 56569 93151 431895 -131013
15309a97248A8121K47562a64843b2463B28437a89176c1610j62538g1343A33235
$$ -197248 18121 265683 -164843 -22463 228437 -189176 -31610 -194148 -71343 133235
15298C5375a97625a7471B07915G1105a56178j53355J52092I0327a32046A151L8011
$$ 35375 -197625 -17471 207915 71105 -156178 -309533 -157441 90327 -132046 1151 39162
15287C9162a33580C20281m1981i2197m7104c1680j55304D9580j3227a79166j60365
$$ 39162 -133580 320281 278300 -92197 -139301 -31680 -186984 49580 36353 -179166 -339531
15276c39531A04880A5651J25611n5364a35852A90243a21176C66819p5709A30284
$$ -339531 104880 15651 141262 85898 -135852 190243 -121176 366819 291110 130284
15265D11319A63368a2360C17051I3757J14387g1515D08318A60883f1631n7176
$$ 411319 163368 -12360 317051 93757 208144 -71515 408318 160883 -61631 -118807
15255a18807j15292I7217a21926B45792K7793r0116L91812J81601K71934R41592
$$ -118807 -234099 97217 -121926 245792 273585 183469 575281 756882 1028816 1970408
15245A970408J30862N2745N2051o86256D74821A68614K9047K52620H8202b1265
$$ 1970408 2101270 2154015 2206066 1519810 474821 168614 197661 450281 88202 -21265
15234H5091e5421B24260h8670E9856B3745J68746J68114j28005A10873A1196b45408
$$ 85091 -55421 224260 -88670 59856 23745 192491 360605 232600 110873 11196 -245408
15222a41388A13425K583D6881M729K68085K27850q4327B20726B29e4471B51702
$$ -141388 113425 116008 46881 51610 319695 547545 463218 220726 229 -54471 251702
15210f8839j06873B51044L0071h7551A46833k8086K0414B9425h8845A99466h5675
$$ -68839 -175712 251044 281115 -87551 146833 118747 139161 29425 -88845 199466 -85675
15198A48529E224Q8761a41005A61122J33477b69287A7346L39059I5973N5896L08107
$$ 148529 5224 93985 -141005 161122 294599 -269287 17346 356405 95973 151869 459976
15187D59976A11503J05679a2544j6372A44725R3470k28b66289D6510c7564A97551
$$ 459976 111503 217182 -12544 -28916 144725 238195 237967 -266289 46510 -37564 197551
15175B15205k943a0392o0684a0215A10972O5730a47941C5785J62660J15953j08253
$$ 215205 212262 -10392 -71076 -10215 110972 176702 -147941 35785 198445 314398 206145
15164B06145B46K83436g8613B15144A1538e7440A57232c45247e2497B85002c0987
$$ 206145 246 283682 -78613 215144 11538 -57440 157232 -345247 -52497 285002 -30987
15152C96981a70949j1031P4906A24351f9699A07643a6114j18774B36969e80B02798
$$ 396981 -170949 -181980 -107074 124351 -69699 107643 -16114 -134888 236969 -580 202798
15140i3158A03459a5336B27907d292A48641B6260L9632a00160B21321c420j40238
$$ -93158 103459 -15336 227907 -4292 148641 26260 65892 -100160 221321 -3420 -143658
15129a43658A69796J05176j23948K67490A43442K64922A29223n7817L93736k04896
$$ -143658 169796 274972 151024 418514 143442 408364 129223 71406 465142 260246
15119B60246J98380j91088J9265E5011J16248K37029j96356k5569q1612K20860
$$ 260246 458626 267538 286803 55011 171259 408288 211932 186363 104751 325611
15109C25611F0364J48322k5012M6967K39575b2399E27819j76170Q7115a54399
$$ 325611 60364 208686 183674 230641 470216 -22399 527819 351649 438764 -154399
15098a7146C9417Q3874J31899K3404k7501B0336a6993A58569R2114J27710H8490
$$ -17146 39417 123291 255190 278594 251093 20336 -16993 158569 250683 378393 88490
15086A30108J72778j30798d2430A80072a830j32584E27826k59464a11558F4433
$$ 130108 302886 172088 -42430 180072 -1830 -134414 527826 268362 -111558 64433
15075e944m9726C69270j49541K1091R798A01284k568A7263K53446g7921D088i746
$$ -5944 -55670 369270 219729 240820 250618 101284 98716 17263 270709 -77921 4088 -9746
15062b8151D526a32862D7192L94840i811D03216j10974m0056E4571O3714N15159
$$ -28151 4526 -132862 47192 442032 -9811 403216 292242 252186 54571 118285 633444
15051F33444A93301J92980H7463J93114b416B53757k5338B0483M8171M62784A17342
$$ 633444 193301 386281 87463 280577 -2416 253757 228419 20483 68654 531438 117342
15039c2641B48582O1407d4861o6805A08179C2998J29679K01233A47040K52869
$$ -32641 248582 309989 -44861 -111666 108179 32998 162677 363910 147040 399909
15029C99909b40355B648L00303k9045J5906j6851q5314J27692F6336K78548J4926
$$ 399909 -240355 2648 302951 273906 289812 272961 187647 315339 66336 344884 359810
15018C59810J5266M3766B00804n0590m6634b1175A85516q0008J40330L1314K6150
$$ 359810 375076 418842 200804 150214 103580 -21175 185516 105508 245838 277152 303302
15007C03302b4892C02246D983a30628h550D1617A9475O2302Q6696a30014B23471
$$ 303302 -24892 302246 4983 -130628 -8550 41617 19475 81777 168473 -130014 223471
14995D52943g4197B01298f7527A66272N1906K31004B04029a48426C24916l2478
$$ 452943 -74197 201298 -67527 166272 218178 449182 204029 -148426 324916 292438
14985B92438A38651k4098J89341l62j19428K24939j14245G9137N7231E3029J66924
$$ 292438 138651 114553 303894 303532 184104 409043 294798 79137 136368 53029 219953
14974B19953l9617N4631N1284Q3040A78749G2974J50277j03162L63908A59090
$$ 219953 180336 234967 286251 369291 178749 72974 223251 120089 483997 159090
14963D24238a21428B16076J37937J15664j20897f4306A13162J40770G2904a02737
$$ 424238 -121428 216076 354013 469677 348780 -64306 113162 253932 72904 -102737
14952a8372D3967L40380J8712r5612q7140K2866N6965p7469J6021L27765k39125
$$ -18372 43967 384347 403059 307447 220307 243173 300138 222669 238690 566455 327330
14941C27330r4765A15575J24363j1851A02959G844L21573A05554M32893k19798
$$ 327330 232565 115575 239938 228087 102959 7844 329417 105554 538447 318649
14931C18649Q907n6383O5694L114J44242j82717J71849k20554J07706R0048Q382
$$ 318649 327556 271173 336867 339981 484223 301506 473355 252801 360507 450555 458937
14920D58937j42808H7266J59500e288E68580A92212R2584K65172j36435A92127
$$ 458937 316129 87266 246766 -5288 568580 192212 284796 549968 413533 192127
14909D82704j55567A14892K18869q7606K14520l7154m202D3945N2324K30673q3159
$$ 482704 327137 114892 333761 246155 460675 423521 419319 43945 96269 326942 243783
14898B43783K26849l9204j23597K87714A54424K00340j68043K96168j10934M3087
$$ 243783 470632 431428 307831 595545 154424 354764 186721 482889 371955 415042
14888D15042C4189M39029L0709j39608l4731m8429o9242r8611L79881P7638k9755
$$ 415042 34189 473218 503927 364319 329588 281159 211917 113306 493187 570825 541070
14877E41070O5466k86943A17587N26446k46007A84219o3741K37806j70398n1609
$$ 541070 606536 319593 117587 644033 398026 184219 120478 358284 187886 136277
14867A36277L58175P772j61857j04085M17705q4427j16234J16533B45054P4586
$$ 136277 494452 502224 340367 236282 653987 569560 453326 569859 245054 319640
14857C19640K56475J7255B16041J7042K38692J36103J22390j37272A99173N26634
$$ 319640 576115 593370 216041 233083 471775 607878 730268 592996 199173 725807
14847G25807k28862A20606J75395K12241J25207I9395L76661A88630a78212D16357
$$ 725807 496945 120606 296001 508242 633449 99395 476056 188630 -178212 416357
14836D61479j50437J20022R551j44229J64709k4722M1598L8969q774A55829M62356
$$ 461479 311042 431064 440615 296386 461095 436373 477971 516940 508166 155829 618185
14825F18185j526k46167m3123H5379M06465k06660K74007j83771J49435L19761
$$ 618185 616659 370492 327369 85379 491844 285184 559191 375420 524855 844616
14815H44616l19996c3381D63485L9060n2989m9175J24501q2815L13515l33001
$$ 844616 524620 -33381 463485 502545 449556 400381 524882 442067 755582 422581
14805D22581J25004J13335O737k33437K29433J31263n2485C09886K65382k23148
$$ 422581 547585 660920 667657 434220 663653 794916 742431 309886 575268 352120
14795C52120Q4455J96437J38459l48616L19167j99792n8344N545j68620K94838
$$ 352120 436575 633012 771471 422855 742022 542230 483886 489431 320811 615649
14785F15649J169n7760J52963j46223j9936K00277j33041j49715K67131m8008
$$ 615649 616818 559058 712021 565798 545862 746139 613098 463383 730514 682506
14775F82506k2055k26738N75347D78558J18101j83974M04607j36238k54837L02074
$$ 682506 660451 433713 1009060 478558 596659 412685 817292 681054 426217 728291
14765G28291j979C48131Q0159L37884C33981A23305N11152l10806K91045j42293
$$ 728291 726312 348131 428290 766174 333981 123305 634457 323651 614696 472403
14755D72403J18752R8963L02354l76803N3341j7255o0585L384K35531k19507J20779
$$ 472403 591155 690118 992472 615669 669010 651755 591170 594554 830085 610578 731357
14744G31357l31023L56218j04007J01109J3786K1183J20079j96681j4520J38656
$$ 731357 400334 756552 652545 753654 767440 788623 908702 712021 697501 836157
14734H36157o8015j20136J22790P8320P6955j81139M24205l85014J35735K8081
$$ 836157 768142 648006 770796 849116 926071 744932 1169137 784123 919858 947939
14724I47939M7959k91993M45885k31078K01477j52992j02890J03155P7491j86689
$$ 947939 995898 703905 1149790 918712 1120189 967197 864307 967462 1044953 858264
14714H58264J50288l49063K79289K63339l04960L54978n33933L84310j31539k63659
$$ 858264 1008552 659489 938778 1202117 897157 1252135 718202 1102512 970973 707314
14704G07314K27058J85175k92913K31188k34287O5251J33863j39248K12725l5535
$$ 707314 934372 1119547 826634 1057822 823535 888786 1022649 883401 1096126 1060591
14694A060591j9219M7815j90894J92046j15838j63532J99985j36418q4013O19790
$$ 1060591 1041372 1089187 898293 1090339 974501 810969 1010954 874536 790523 1410313
14684A410313n60414L10618m26340M06720M8764j63965o17k87523M52409J22523
$$ 1410313 849899 1160517 734177 1140897 1189661 1025696 1025079 737556 1189965 1312488
14674A312488l29447l3003J28340r168n0222J36307j53878N2658j02181J5005
$$ 1312488 983041 950038 1078378 1069210 1018988 1155295 1001417 1054075 951894 966899
14664I66899k95793M30933o0854K40613J06772m77199L19855j51254R4393Q4065
$$ 966899 671106 1102039 1041185 1281798 1388570 911371 1231226 1079972 1174365 1258430
14654A258430k70066j12750R9789R5343K35424j8586l6517j2484l09590L78828
$$ 1258430 988364 875614 975403 1070746 1306170 1287584 1251067 1238583 928993 1307821
14644A307821j94448j12012L74364Q4181k9952M52973n46345j6435K2536j45466
$$ 1307821 1113373 1001361 1375725 1459906 1429954 1882927 1336582 1320147 1342683 1197217
14634A197217L0132P2418P681J81j42466L90486l11078J62927j58353J42675J36110
$$ 1197217 1227349 1299767 1307448 1307629 1165163 1555649 1244571 1407498 1249145 1391820 1527930
14623A527930m5237o78L3363j28765J68054j71149j26893L61217k2953m167l938
$$ 1527930 1482693 1482015 1515378 1386613 1554667 1383518 1256625 1617842 1594889 1590722 1586784
14612A586784j23961j64644J64199M13675m29263P5780Q9670j40128J5123L60920
$$ 1586784 1462823 1298179 1462378 1876053 1446790 1522570 1612240 1472112 1487235 1848155
14602A848155j16319J26006k18930J7307j28329K70573K77548m59018J62558l5939
$$ 1848155 1731836 1857842 1638912 1656219 1527890 1798463 2076011 1616993 1779551 1743612
14592A743612j5404O1007K73580l73808J24623J29214M24190l57734J09217l17099
$$ 1743612 1728208 1789215 2062795 1688987 1813610 1942824 2367014 2009280 2118497 1801398
14582A801398K85371K08455n17836N26424l34691o3685O6454K23005j48827j09092
$$ 1801398 2086769 2295224 1777388 2303812 1969121 1905436 1971890 2194895 2046068 1936976
14572A936976L03828j10233n811J94239j52647K36515k82881J73834M23313j19236
$$ 1936976 2240804 2130571 2124760 2318999 2166352 2402867 2119986 2293820 2717133 2597897
14562B597897j52689N64988l69302M1734M03487k53239N56176k32306K37529M19699
$$ 2597897 2445208 3010196 2640894 2682628 3086115 2832876 3389052 3156746 3394275 3813974
14552C813974L68498O56216J210935K123589M975450R011751J2791871Q172847
$$ 3813974 4182472 4838688 6049623 8173212 13148662 22160413 34952284 43125131
14544D3125131j9166330A1564860l626374m32909l212402j413886p89587R6004
$$ 43125131 23958801 11564860 7938486 7505577 4293175 2879289 2089702 2185706
14536B185706k94707J51191p229m3497L13788J4448k66521J96817n8592M5778
$$ 2185706 1890999 2042190 2034961 1991464 2305252 2319700 2053179 2249996 2191404 2237182
14526B237182o4074P6444j49462K24596O7637K37285r4851K57258l40696J04330
$$ 2237182 2173108 2249552 2100090 2324686 2392323 2629608 2534757 2792015 2451319 2555649
14516B555649L51329J03773q49540L25582L94741j55728j65969K06714J62750
$$ 2555649 2906978 3010751 2161211 2486793 2881534 2725806 2559837 2766551 2929301
14507B929301k98848L16270K77791j56475J86425m20573L52715j06518n0630j73581
$$ 2929301 2630453 2946723 3224514 3068039 3254464 2833891 3186606 3080088 3029458 2855877
14497B855877L55841P6274O4007J10951j8027J3735K23920j94225J00916K27462
$$ 2855877 3211718 3287992 3351999 3462950 3444923 3458658 3682578 3488353 3589269 3816731
14487C816731J3593m54741L63950j34299J76076J11717J70901K7540o3699P2409
$$ 3816731 3830324 3375583 3739533 3605234 3781310 3893027 4063928 4091468 4027769 4100178
14477D100178j0432K64514l11646o0961J84814M26685k6367k72417J09158k5547
$$ 4100178 4089746 4354260 4042614 3981653 4166467 4593152 4566785 4294368 4403526 4377979
14467D377979M19060k76353L6671J30347k98788L59670l51683M06828L19620j02549
$$ 4377979 4797039 4520686 4557357 4687704 4388916 4748586 4396903 4803731 5123351 5020802
14457E020802J72543j79462M46217k03484Q4678L2887j01268J04053L12085j8891
$$ 5020802 5193345 5013883 5460100 5256616 5341294 5374181 5272913 5376966 5689051 5670160
14447E670160J03700L8840j28789L91422j47216J78982K49970M4435M2609J86955
$$ 5670160 5773860 5812700 5683911 6075333 5928117 6107099 6357069 6401504 6444113 6631068
14437F631068j62673j14648K58693L16455k50822N00730j94242L6662m4327L17316
$$ 6631068 6468395 6353747 6612440 6928895 6678073 7178803 6984561 7021223 6976896 7294212
14427G294212j12287N51610q4713p9391J68877j46397J69207L35654K05793k29164
$$ 7294212 7181925 7733535 7648822 7569431 7738308 7591911 7761118 8096772 8302565 8073401
14417H073401K70623L73406n5643J88584J05855L7042L17497J36527j35615K99637
$$ 8073401 8344024 8717430 8661787 8850371 8956226 8993268 9310765 9447292 9311677 9611314
14407I611314N7027L16823J24111K16841K11003j37763J23113L45990K86446N1026
$$ 9611314 9668341 9985164 10109275 10326116 10537119 10399356 10522469 10868459 11154905 11205931
14397A1205931R7086M2676N12382K20466L08139J60337m4892K66526K54146K62804
$$ 11205931 11303017 11345693 11858075 12078541 12386680 12547017 12502125 12768651 13022797 13285601
14387A3285601K09990L58365N863P9098O73291Q4836M09225O1923K43501N28496
$$ 13285601 13495591 13853956 13859819 13938917 14612208 14697044 15106269 15168192 15411693 15940189
14377A5940189M57444j96390M14410O11575K16118L19526M40431K59991P53622
$$ 15940189 16397633 16201243 16615653 17227228 17443346 17762872 18203303 18463294 19216916
14368A9216916N3552P29566j52634K99336P00703P87626j5345N95282M52870J84129
$$ 19216916 19270468 20000034 19847400 20146736 20847439 21635065 21619720 22215002 22667872 22852001
14358B2852001O34238Q86607L08157N15107P89319O84852N81519N40831P74369
$$ 22852001 23486239 24372846 24681003 25196110 25985429 26670281 27251800 27792631 28567000
14349B8567000K61139R84737N32214J073225O31202R84926R24391O56999J135582
$$ 28567000 28828139 29812876 30345090 31418315 32049517 33034443 33958834 34615833 35751415
14340C5751415J069647R24490Q37390J171923J114161J318001J097133J062632
$$ 35751415 36821062 37745552 38582942 39754865 40869026 42187027 43284160 44346792
14332D4346792J249384J735485J446410J565417J211500J661357J918675J865815
$$ 44346792 45596176 47331661 48778071 50343488 51554988 53216345 55135020 57000835
14324E7000835K020096J637462K130704K325933K438370J970110K914968K234271
$$ 57000835 59020931 60658393 62789097 65115030 67553400 69523510 72438478 74672749
14316G4672749L242743K738330L143845L185978L621270L715415L659983M328046
$$ 74672749 77915492 80653822 83797667 86983645 90604915 94320330 97980313 102308359
14308A02308359L997626M655032M694597N027726N497747N882519O325172O233603
$$ 102308359 106305985 110961017 115655614 120683340 126181087 132063606 138388778 144622381
14300A44622381O551828P638540P364399Q382483Q228030R533399R633270J0182289
$$ 144622381 151174209 158812749 166177148 174559631 182787661 192321060 201954330 212136619
14292B12136619J0824561J1354081J1861080J2833536J2780731J3686677J4114928
$$ 212136619 222961180 234315261 246176341 259009877 271790608 285477285 299592213
14285B99592213J4544764J4975287J5282432J5116860J5534190J5141816J4730183
$$ 299592213 314136977 329112264 344394696 359511556 375045746 390187562 404917745
14278D04917745J3929266J3048473J1718825J0167353Q660868M843030O69085
$$ 404917745 418847011 431895484 443614309 453781662 462442530 467285560 467954645
14271D67954645k493671j072484R66015l122934j248717m506033p561646j0161514
$$ 467954645 465460974 464388490 465354505 462231571 460982854 456476821 448915175 438753661
14263D38753661j2397240j3549626j4211722j5174593j5687236j5552914j5676173
$$ 438753661 426356421 412806795 398595073 383420480 367733244 352180330 336504157
14256C36504157j5269025j5371627j4537267j4228633j2551372j1757482j2572399
$$ 336504157 321235132 305863505 291326238 277097605 264546233 252788751 240216352
14249B40216352j1622200j1325280j0631491j0275665r059479q541173q357647
$$ 240216352 228594152 217268872 206637381 196361716 187302237 178761064 170403417
14242A70403417q039680p648404o941310o636741n930659n542255n750971n326114
$$ 170403417 162363737 154715333 147774023 141137282 135206623 129664368 123913397 118587283
14234A18587283m987167m638958m287442l939862l986426l816587l817271l316503
$$ 118587283 113600116 108961158 104673716 100733854 96747428 92930841 89113570 85797067
14226H5797067l522553k663767l050524k737110k512251k639607j915618k150565
$$ 85797067 82274514 79610747 76560223 73823113 71310862 68671255 66755637 64605072
14218F4605072k507482j781168k245669j789096j673201j315255j771757j263734
$$ 64605072 62097590 60316422 58070753 56281657 54608456 53293201 51521444 50257710
14210E0257710j935752j279721j273586o96827j186724j683695j302639j073200
$$ 50257710 48321958 47042237 45768651 45071824 43885100 42201405 40898766 39825566
14202C9825566j134048q40756r88315p87225j424659o83806p20561j408563J4574
$$ 39825566 38691518 37850762 36862447 36075222 34650563 33966757 33246196 31837633 31852207
14193C1852207j020927j071510o80739m96063q93287o73883n08223n05442p19092
$$ 31852207 30831280 29759770 29079031 28582968 27689681 27015798 26507575 26002133 25283041
14184B5283041n61338l74143o14506o06817n09701l90197n26061k02523o01218
$$ 25283041 24721703 24347560 23733054 23126237 22616536 22226339 21700278 21497755 20896537
14175B0896537n38167m01581L172q34754m41509J466l51027m17658j4744q32449
$$ 20896537 20358370 19956789 19959961 19125207 18683698 18685164 18334137 17916479 17901735 17069286
14165A7069286p9142p11862m3984o86456J64157j74479r47720O92715j039222
$$ 17069286 16990144 16278282 16234298 15547842 15711999 15537520 14589800 15282515 14243293
14156A4243293L15778q14402K21364m95171J38603l70010j13122n37207r3043
$$ 14243293 14559071 13744669 13966033 13470862 13609465 13239455 13126333 12589126 12496083
14147A2496083n7024j46104m10046L1000l52035j48137j74833J37142n27788J54950
$$ 12496083 12439059 12292955 11882909 11913909 11561874 11413737 11238904 11376046 10848258 11003208
14137A1003208l67473k54238k27487q3496m2971k64974j69003J24333j63959j46494
$$ 11003208 10635735 10381497 10154010 10070514 10027543 9762569 9593566 9717899 9553940 9407446
14127I407446j04192j78487j98567j50510N3115k92266O9001o13562J46843L6240
$$ 9407446 9303254 9124767 8926200 8775690 8828805 8536539 8605540 7991978 8138821 8175061
14117H175061q6138M2493j74829o2415k16284L0558n09342K36973m27818j87879
$$ 8175061 8088923 8131416 7956587 7894172 7677888 7708446 7199104 7436077 7008259 6820380
14107F820380M11035j99754l4429J18275m95042K22087l12128O5670J59793o47170
$$ 6820380 7231415 7031661 6997232 7115507 6620465 6842552 6530424 6596094 6755887 6108717
14097F108717L35782j82619N9940l77987P0437J24239j59295l23016P2289Q269
$$ 6108717 6444499 6261880 6321820 5943833 6014270 6138509 5979214 5656198 5728487 5736756
14087E736756k50810J64902J42929m8217j89320m1908j88137L81391m15316M0696
$$ 5736756 5485946 5650848 5793777 5745560 5556240 5514332 5326195 5707586 5292270 5332966
14077E332966k03340k65043M0520k496j3497k92522J46927J87561j80039n1044
$$ 5332966 5129626 4864583 4905103 4902607 4889110 4596588 4743515 4931076 4751037 4699993
14067D699993k44272K25055K48039p06764O4701j16663K65925j80461K97737m3733
$$ 4699993 4455721 4680776 4928815 4222051 4286752 4170089 4436014 4255553 4553290 4509557
14057D509557l43864P5338J75357l24285j03825q0977o808J02778j06393n07775
$$ 4509557 4165693 4241031 4416388 4092103 3988278 3907301 3900493 4003271 3896878 3389103
14047C389103M62975R7003l40663M43824p31981K5666Q0938o4167K37707Q9262
$$ 3389103 3852078 3949081 3608418 4052242 3320261 3345927 3426865 3362698 3600405 3689667
14037C689667q3813j98572O1749j09797k48214l3511K95543L81445k10537m67827
$$ 3689667 3605854 3407282 3469031 3359234 3111020 3077509 3373052 3754497 3543960 3076133
14027C076133J89036L57422l73623j01222k29561J72948p3718j95631J40363L4275
$$ 3076133 3265169 3622591 3248968 3147746 2918185 3091133 3017415 2821784 2962147 2996422
14017B996422r6066k18675m10231M58990J3362n1878J02421n8147m9950k23106
$$ 2996422 2900356 2681681 2271450 2730440 2743802 2691924 2794345 2736198 2686248 2463142
14007B463142M1018Q1447m69415L87498K32291l69267J63372m22760R7721M04021
$$ 2463142 2504160 2585607 2116192 2503690 2735981 2366714 2530086 2107326 2205047 2609068
13997B609068k16901r3128j70239K62807j40368J45168m3244N94832Q25841M356477
$$ 2609068 2392167 2299039 2128800 2391607 2251239 2396407 2353163 2947995 3773836 8130313
13987H130313P772869J3717712J4097928j4526032j2608518p036054l000208j372774
$$ 8130313 15903182 29620894 43718822 29192790 16584272 9548218 6548010 5175236
13979E175236p48957m04185m77931k35570p1093j94870j14900j06956K96918m92231
$$ 5175236 4426279 4022094 3544163 3308593 3237500 3042630 2927730 2820774 3117692 2625461
13969B625461K92363k41462M292K02422m32875p1006J03324j74432J83316k78801
$$ 2625461 2917824 2676362 2680654 2883076 2450201 2379195 2482519 2308087 2491403 2212602
13959B212602K196L50366l99939j18390M15063k39251o086K47214j53783k60707
$$ 2212602 2214798 2565164 2165225 2046835 2461898 2222647 2216561 2463775 2309992 2049285
13949B049285K32998l03037q690n9240M344K60537j53165j33772o6364K56509
$$ 2049285 2282283 1979246 1970556 1911316 1915660 2176197 2023032 1889260 1822896 2079405
13939B079405k00930k84623L9005K50522O65j15908K67222m10756L71275k18472
$$ 2079405 1878475 1593852 1632857 1883379 1884044 1768136 2035358 1624602 1995877 1777405
13929A777405J43796O8261l77778o8961J11383k7174O4443k18693n2343L53309
$$ 1777405 1921201 1989462 1611684 1542723 1654106 1626932 1691375 1472682 1420339 1773648
13919A773648n0523j00631J74629o6025k41078K72943l32003K35008k11636J94923
$$ 1773648 1723125 1622494 1797123 1731098 1490020 1762963 1430960 1665968 1454332 1649255
13909A649255M6194j06934Q55n2958K7061J87403n09125K02058J26362J5862p7466
$$ 1649255 1695449 1588515 1589370 1536412 1563473 1750876 1241751 1443809 1570171 1586033 1508567
13898A508567j18966O7768K1163Q6837j80719p56K13797l25234O9726K26322j27984
$$ 1508567 1389601 1457369 1478532 1565369 1384650 1383894 1597691 1272457 1342183 1568505 1440521
13887A440521j66162L71836j01483l77218M31962l77107K62768k75910K37156
$$ 1440521 1274359 1646195 1544712 1167494 1599456 1222349 1485117 1209207 1446363
13878A446363m49853K48981L68039k95226N4463K6353k61267O0666N1713N7979
$$ 1446363 996510 1245491 1613530 1318304 1372767 1399120 1137853 1198519 1250232 1308211
13868A308211l50583K26570k21008M12136k91513J29188k7947j86248K94868p8216
$$ 1308211 957628 1184198 963190 1375326 1083813 1213001 1185054 998806 1293674 1215458
13858A215458q8964J53461J03483o10708N92244j57206k67387j36220N66308q9756
$$ 1215458 1126494 1279955 1383438 772730 1364974 1207768 940381 804161 1370469 1280713
13848A280713k08255j9868l4150r6736j12938N86140n40601J38828Q6931J30557
$$ 1280713 1072458 1052590 1018440 921704 808766 1394906 854305 993133 1080064 1210621
13838A210621m6036M6210m33394M64249k46290l5322q1036L79738k1042k18656
$$ 1210621 1164585 1210795 777401 1241650 995360 960038 879002 1258740 1237698 1019042
13828A019042k52556R2302Q9111M4285J84571J812k02692K28893n33667J54270
$$ 1019042 766486 858788 947899 992184 1176755 1178567 975875 1204768 671101 825371
13818H25371L98927m27832J22680j20178M06437j07252K77635n26290K52317j10984
$$ 825371 1224298 796466 919146 798968 1205405 1098153 1375788 849498 1101815 990831
13808I90831k630l3075j06810j84173L16594R7297j24206l71893L17889J45107
$$ 990831 988201 955126 848316 664143 980737 1078034 953828 581935 899824 1044931
13798A044931m48018J52493j37704M35096l89526K74935J24175k35114J88403
$$ 1044931 596913 749406 611702 1046798 657272 932207 1056382 821268 1009671
13789A009671k97286J70576l17724K26505C46013k3449O80530k37787J2826R647
$$ 1009671 712385 882961 565237 791742 346013 322564 1003094 765307 778133 787780
13779G87780j12997M11632l93449J90437j9505L9313j26530J75704l04380J73053
$$ 787780 674783 1086415 692966 883403 863898 903211 776681 952385 648005 821058
13769H21058R416j52740K00633k05896J31262K22361j77024K92773k78972l04053
$$ 821058 830474 677734 878367 672471 803733 1026094 849070 1141843 862871 558818
13759E58818J85698m5235n2686n6020j29606R9979n3622N2298p0782L56077p1154
$$ 558818 744516 699281 646595 590575 460969 560948 507326 559624 488842 844919 773765
13748G73765L2824n9207B30497M06745K5188l1799L0071J54919q0577K7832o8586
$$ 773765 806589 747382 230497 637242 662430 630631 660702 815621 735044 762876 694290
13737F94290j67711j5008L2130J11131M8856R5760R1781j56339j14945K40110
$$ 694290 526579 511571 543701 654832 703688 799448 891229 734890 619945 860055
13727H60055k84184J32228k07725M26807m44433J05801P3658m5153J80372j54192
$$ 860055 575871 708099 500374 927181 482748 588549 662207 617054 797426 643234
13717F43234j57544J14229P8894m9715J60690j99058q87j83224A14175M43324
$$ 643234 485690 599919 678813 629098 789788 590730 589843 406619 114175 557499
13707E57499J02965C10609M40929C35619K85539k0310L6759n0592J08036k04493
$$ 557499 660464 310609 751538 335619 621158 600848 637607 587015 695051 490558
13697D90558L0931j10091n7073L00146k96016K51833j68979J13850o3349N3840
$$ 490558 521489 411398 354325 654471 358455 610288 441309 555159 491810 545650
13687E45650j0681r2301J07742L14131l92463J95352m0766k45027R4568K4740
$$ 545650 534969 442668 550410 864541 472078 667430 626664 381637 476205 500945
13677E00945k3509o6992J63213j6100q1026N5300p4085J93869j86239J41329j5212
$$ 500945 477436 410444 573657 557557 476531 531831 457746 651615 465376 606705 591493
13666E91493J19275k43638H9402N50246P2697A93405K03455J53063j74710m7634
$$ 591493 710768 467130 89402 639648 712345 193405 396860 549923 375213 327579
13656C27579A59322L29677j68135J40318j44752K25922l4324j09392K84016l31436
$$ 327579 159322 488999 320864 461182 316430 542352 508028 398636 682652 351216
13646C51216K18200k64068J88747k0191K32133k09798j1013j36580O3719J45719
$$ 351216 569416 305348 494095 473904 706037 496239 485226 348646 412365 558084
13636E58084J5915N5472B75943M77527A94193N45018C00656J22975j47040K10735
$$ 558084 573999 629471 275943 753470 194193 739211 300656 423631 276591 487326
13626D87326o1257J55927n241A68103M51588k14640M6186p0983J0576j0544J79852
$$ 487326 426069 581996 576755 168103 619691 405051 451237 380254 390830 380286 560138
13615E60138k44507M24529Q2381B46132N97496l56559j93386J01401A65854J71742
$$ 560138 315631 740160 822541 246132 843628 487069 293683 395084 165854 337596
13605C37596G5754O36577l27612n2836H2507r706K19365M27872j89063k30697
$$ 337596 75754 712331 384719 331883 82507 72801 292166 720038 530975 300278
13595C00278O8570J78016j9519j34911K59858A06887K94094A93612K77265j73337
$$ 300278 368848 546864 527345 392434 652292 106887 400981 193612 470877 297540
13585B97540o1517L41154B23790J04055K81085k26333K30524k50088j02593K72462
$$ 297540 236023 577177 223790 327845 608930 382597 613121 363033 260440 532902
13575E32902j77203m234L1828K4139l1631K18656B95944G6805J10399K79268l5462
$$ 532902 355699 351465 383293 407432 375801 594457 295944 76805 187204 466472 431010
13564D31010O767J66055B88839J01645J17304B15721K1483N10158a01573A96977
$$ 431010 437777 603832 288839 390484 507788 215721 237204 747362 -101573 196977
13553C50404j34567M1537n8587K21423n2118l3532j2878j49721J64644J54943
$$ 350404 215837 257374 198787 420210 368092 334560 321682 171961 336605 491548
13543D91548A7231J79297K23913Q804n9274J00783j08909M31177n4629C68137
$$ 491548 17231 196528 420441 429245 369971 470754 361845 793022 738393 368137
13532e889D61045j34154A44597K85617J28444A74306L39774q3049a87286D51550
$$ -5889 461045 326891 144597 430214 558658 174306 514080 431031 -187286 451550
13521C25356J2243o252n107J31240n8406m0164E7027B6698L41152O2414j89999
$$ 325356 337599 331347 326240 457480 399074 358910 57027 26698 367850 430264 240265
13510B40265m9785K40093m1282j68203J58229j162d3377D24878Q08m5122A39179
$$ 240265 190480 430573 389291 221088 379317 378155 -43377 424878 425686 380564 139179
13498B48885K27284p633j2369j42647j33233K42453A16164J4255L27798j44659
$$ 248885 476169 468536 456167 313520 180287 422740 116164 130419 458217 313558
13488C13558A16942L08925A38633E4410i4315A50803o8945L7267k2651L71651
$$ 313558 116942 425867 138633 54410 -94315 150803 81858 119125 96474 468125
13478D68125i8992B82529M1735J2386k7233L16289j48305j56410J14225R9898
$$ 468125 -98992 282529 324264 336650 309417 625706 477401 320991 435216 535114
13468E35114F4160L42851H2718l0767M49235k26146p0625H5976h3505C82517A30632
$$ 535114 64160 407011 82718 51951 501186 275040 204415 85976 -83505 382517 130632
13456C91809p7986O4890F1522J79178J86571M15648A57757J58422g8821b5979
$$ 391809 313823 378713 61522 240700 427271 842919 157757 316179 -78821 -25979
13445B69139A11929O642J28101o1748L0480j03041J35887J81484j56070j32919
$$ 269139 111929 118571 246672 184924 215404 112363 248250 429734 273664 140745
13435A40745E1405n778M43002A8398J11486K94758A21408K7160Q5131b37228I3643
$$ 140745 51405 45627 488629 18398 129884 424642 121408 148568 233699 -237228 93643
13423A51334L13383b63014E0423L55342j58484D7492L78906J3673a341A01744
$$ 151334 464717 -263014 50423 405765 247281 47492 426398 440071 -1341 101744
13412A45416a0117C9159M00722A68996Q413a42803M4446B16750P2607e4347A58982
$$ 145416 -10117 39159 439881 168996 177409 -142803 -98357 216750 289357 -54347 158982
13400B18307H4734O1951j9920g1818C21168e3445G4634K25696J71894B12969K53012
$$ 218307 84734 146685 126765 -71818 321168 -53445 74634 300330 472224 212969 465981
13389D65981B888a21038B25202i5291D11077G9248a36403A58359J61226j09873
$$ 465981 2888 -121038 225202 -95291 411077 79248 -136403 158359 319585 209712
13379B09712a0881C28981m7973j3430C3421P4367N01430I9198J16235r2726d5725
$$ 209712 -10881 328981 281008 267578 33421 107788 609218 99198 215433 122707 -45725
13367D05275r8382A42524J51832L0639a60009E58376j37355G9186J93385k3636
$$ 405275 306893 142524 294356 324995 -160009 558376 421021 79186 272571 248935
13357B48935j6581F6182J50507H8689L29997E2831J82972q6066L68266A1203L63710
$$ 248935 232354 66182 216689 88689 418686 52831 235803 149737 518003 11203 374913
13346C74913N5601k08431K8543L41612A16722J51101l5132P0946K24300R3770
$$ 374913 430514 222083 250626 592238 116722 267823 232691 303637 527937 621707
13336F21707B54566h9098A14610N1250K61114I7752J0701J84496A11004K55305
$$ 621707 254566 -89098 114610 165860 426974 97752 108453 292949 111004 366309
13326C66309a39193B34988k7459Q4639m1360n0649R114K1588J09977A70093q007
$$ 366309 -139193 234988 207529 292168 250808 200159 209273 230861 340838 170093 162086
13315A62086K6210c50354B58844J52156j27619A37763f812A96068N4117q006J05172
$$ 162086 188296 -350354 258844 411000 283381 137763 -6812 196068 250185 242179 347351
13304C47351A63754P0609J0611L5264d5822B38927A2089a24079B6146K70309A31872
$$ 347351 163754 234363 244974 280238 -45822 238927 12089 -124079 26146 296455 131872
13292B74326M2196G7441l102L31103A26379n4278M14375b5569A36646J60178h2582
$$ 274326 316522 77441 74339 405442 126379 72101 486476 -25569 136646 296824 -82582
13280C22116j5851a85401A27338R5971m6388N251J22145a00041G0003K24894F1159
$$ 322116 306265 -185401 127338 223309 176921 182172 304317 -100041 70003 294897 61159
13268A92265K7185Q3561Q3635A15274B9231J94983e5786B45051K37456b15822
$$ 192265 219450 303011 386646 115274 29231 224214 -55786 245051 482507 -215822
13257A62289M0197N7278k2414Q1419c3407A69445d5739F9702P1987a1345l16189
$$ 162289 202486 259764 237350 318769 -33407 169445 -45739 69702 141689 -11345 -327534
13246c27534C66464j03977H7321l0302K37875q4011g0129D7292A5023M25440C4356
$$ -327534 366464 262487 87321 57019 294894 210883 -70129 47292 15023 440463 34356
13234B24676J15542r4561l0755a97014K6889A64334A5498g3112H8496K02607O2978
$$ 224676 340218 245657 214902 -197014 -170125 164334 15498 -73112 88496 291103 354081
13223C54081b39799h4809L4713A28963k9599a90147M8716C51760o5479a6573C89094
$$ 354081 -239799 -84809 -50096 128963 99364 -190147 -141431 351760 286281 -16573 389094
13211D40650I1783b07342g9631j18610A05768K07100a16919b7160G1108J06480
$$ 440650 91783 -207342 -79631 -198241 105768 312868 -116919 -27160 71108 177588
13201A77588o1273J45984A0054a66314g0170B42458H2094a74200A31314K26935
$$ 177588 116315 262299 10054 -166314 -70170 242458 82094 -174200 131314 358249
13191C58249f8645C02128q4726f672G8921O015m0791K05942c9229B23521K4691
$$ 358249 -68645 302128 217402 -6672 78921 84936 44145 250087 -39229 223521 248212
13180B48212j01313C2656L22518H3808L5609M26910A02106J38720j14868g1758
$$ 248212 146899 32656 355174 83808 119417 546327 102106 240826 125958 -71758
13169d59245B86769I2311d6899F6253a79410e5601A95366k5823f4129J9883B42818
$$ -459245 286769 92311 -46899 66253 -179410 -55601 195366 169543 -64129 -44246 242818
13157E0244J2528g7671C78154L2687E7492K6709J27794b9112k69977A13319a58127
$$ 50244 62772 -77671 378154 410841 57492 84201 211995 -29112 -299089 113319 -158127
13145b57335B3405Q2740J79171l2386C8111a02779a0202B16531a5966A39712N1245
$$ -257335 23405 106145 285316 252930 38111 -102779 -10202 216531 -15966 139712 190957
13134A90957A7305e4630C20183j4203A37686J07263Q231a02902I5987a02860A8245
$$ 190957 17305 -54630 320183 305980 137686 244949 253180 -102902 95987 -102860 18245
13122F5783N7117b0615l9361B59402l3638K26284B25211B331a67443K0118d1193
$$ 65783 122900 -20615 -59976 259402 225764 452048 225211 2331 -167443 -147325 -41193
13110a78285b6497A90482j8168k9610a16197A57483m8706d0898F01982k60778
$$ -178285 -26497 190482 172314 142704 -116197 157483 108777 -40898 601982 341204
13100C41204j29517G7845K23793a47965e1128C52399D493L00369n4023k0037b38027
$$ 341204 211687 77845 301638 -147965 -51128 352399 4493 304862 250839 230802 -238027
13088C2190J08961k1230R9421l7560D6675i8118A76905C0991J06364G466f141
$$ 32190 141151 119921 219342 181782 46675 -98118 176905 30991 137355 7466 -6141
13076G1438b17147L2566B8361J34777l8180N1095a77202Q2057A73549c2978B52253
$$ 71438 -217147 -184581 28361 163138 124958 176053 -177202 -95145 173549 -32978 252253
13064H8937Q2683J11983K37385B1149J8216i4650a2019A55250a20964a1192B46754
$$ 88937 171620 283603 520988 21149 39365 -94650 -12019 155250 -120964 -11192 246754
13052C01295n9880G2610N4599N7427b35655C33243a35265B044L38792f5155j62071
$$ 301295 241415 72610 127209 184636 -235655 333243 -135265 2044 340836 -65155 -227226
13041b27226A72888j1522D7418O0484K4601J37689b24704A42007D7105e2202A45682
$$ -227226 172888 161366 47418 107902 132503 270192 -224704 142007 47105 -52202 145682
13029A14973P8719q1096j4945J14701a00124p9336d679l3957A35879J46576J61186
$$ 114973 193692 112596 97651 212352 -100124 -179460 -4679 -38636 135879 282455 443641
13018D43641A54325F7661b6691D779K38085d7739j0412A75041b46074M0393c1155
$$ 443641 154325 67661 -26691 4779 242864 -47739 -58151 175041 -246074 -205681 -31155
13006a47500A85085K095g4312b3047B35081p2595Q1577p6379k2077Q7672c6411
$$ -147500 185085 187180 -74312 -23047 235081 162486 244063 167684 145607 233279 -36411
12994b7276A68893F6280J10307h7661b3661b068B56695G9579J36646h001B59784
$$ -27276 168893 66280 176587 -87661 -23661 -2068 256695 79579 216225 -8001 259784
12982B11208b07792B88169a49995A35809J64327G9828a4798B09341a2282k87291
$$ 211208 -207792 288169 -149995 135809 300136 79828 -14798 209341 -12282 -299573
12972b99573e3896A63444M306a48370g0383A36847J14843d2438E3667J78010G6379
$$ -299573 -53896 163444 167750 -148370 -70383 136847 251690 -42438 53667 231677 76379
12960A45470a10477A38040a43514C0646j2611M9952a39751A91407K50422a16285
$$ 145470 -110477 138040 -143514 30646 18035 67987 -139751 191407 441829 -116285
12949e2562l9805m8124q146C7602f9941I2205d0860A10410Q858L06P039R0453
$$ -52562 -92367 -140491 -148637 37602 -69941 92205 -40860 110410 119268 119574 126613 217066
12937B17066c9226F9374J51722F6867g9997A6331M3894K6025a13054B46830b9506
$$ 217066 -39226 69374 221096 66867 -79997 16331 60225 86250 -113054 246830 -29506
12925h2342A16191J37i7078L6850A5989a97927a674q5998p2141D5383J4749d8493
$$ -82342 116191 116328 -97078 -60228 15989 -197927 -1674 -87672 -159813 45383 60132 -48493
12912g6625D42443D6009K10780A2541g9510E5881a99991R3495N602H5894J39470
$$ -76625 442443 46009 256789 12541 -79510 55881 -199991 -106496 -100894 85894 225364
12901B25364A9718c3992A7614a4810C23358b8627B54779b0326B0928K40700H3663
$$ 225364 19718 -33992 17614 -14810 323358 -28627 254779 -20326 20928 261628 83663
12889G0968C3331b26146C62964L4663A30383b3284E3946K69429j35982C5559M6717
$$ 70968 33331 -226146 362964 397627 130383 -23284 53946 323375 187393 35559 82276
12878H2276J14342f3746B47776a26747B69159d2660o9508J4998j93927D1074i2172
$$ 82276 196618 -63746 247776 -126747 269159 -42660 -112168 -97170 -291097 41074 -92172
12866F7108Q497e9658j11686G1801G597a42813c5006B22510r1546N800M7688n3624
$$ 67108 75605 -59658 -171344 71801 7597 -142813 -35006 222510 130964 136764 184452 130828
12854A30828R885N5503b99399B50483e4585B19309H4440a7407H9821d3464k6747
$$ 130828 140713 196216 -299399 250483 -54585 219309 84440 -17407 89821 -43464 -70211
12843g0211K266C42870p0994a9994G7634j4482N926k3888J16208B9916Q7677m782
$$ -70211 -67945 342870 271876 -19994 77634 63152 69078 45190 161398 29916 117593 112811
12831A12811J04814r6652M6866a72973I691J38382b33388N9732a335B76898r1948
$$ 112811 217625 120973 167839 -172973 9691 148073 -233388 -173656 -1335 276898 184950
12820A84950b02923A80938g5971A38223O04a6273E1208a52860A88365a8797B02663
$$ 184950 -202923 180938 -75971 138223 138827 -16273 51208 -152860 188365 -18797 202663
12808a3192k07718d2223I1926J1968K15110D2742a21714e4977o2424O393b4245
$$ -13192 -220910 -42223 91926 103894 319004 42742 -121714 -54977 -117401 -111008 -24245
12796A1884N3827A3751a47704F6423J54680l2134o966a5077B57637C0837J71628
$$ 11884 65711 13751 -147704 66423 221103 188969 182003 -15077 257637 30837 202465
12785B02465p0830g3992C29021j22545c7110C2270K31120a83828c5333B35742
$$ 202465 131635 -73992 329021 206476 -37110 32270 263390 -183828 -35333 235742
12774A89604a52580E0796d6478M085A81920b38679C12288l4829a95429B45643
$$ 189604 -152580 50796 -46478 -42393 181920 -238679 312288 277459 -195429 245643
12763b91207J02938a0488F7872K5858K36923c0514g911j76509A33452c49506d5057
$$ -291207 -188269 -10488 67872 93730 330653 -30514 -7911 -184420 133452 -349506 -45057
12751b239l4250e778A23168Q778c0869B19205q0062j0677Q8277J36804B7394a56156
$$ -2239 -36489 -5778 123168 131946 -30869 219205 139143 128466 216743 353547 27394 -156156
12738F0505b85526Q1904o118m3644f2856F4348L9231j2321a23270B8969J82046
$$ 60505 -285526 -203622 -209740 -253384 -62856 64348 103579 91258 -123270 28969 211015
12727B11015M2715F1302d294A69479D3003f3909B59095a8763B15637p4781E8017
$$ 211015 253730 61302 -4294 169479 43003 -63909 259095 -18763 215637 140856 58017
12715B74148c58821a14139B9943J00525F0367J01553d4587B97114c32877b6252
$$ 274148 -358821 -114139 29943 130468 60367 161920 -44587 297114 -332877 -26252
12704C5287j4720a57783A97351F6404M78939B4177a02721C36274A22022j9249
$$ 35287 20567 -157783 197351 66404 545343 24177 -102721 336274 122022 102773
12694A02773a76482b3389k16376O9462A25919j0699m2672B648c59477B34547O7582
$$ 102773 -176482 -23389 -239765 -170303 125919 115220 72548 2648 -359477 234547 302129
12683C02129b15559j9974A21739K1147E125K67800a9865q5473A64653E0239K12593
$$ 302129 -215559 -235533 121739 142886 5125 272925 -19865 -105338 164653 50239 262832
12672B62832d1244B13953p4633a76114A5958J83944n5593a1115C2666J70132j0540
$$ 262832 -41244 213953 139320 -176114 15958 199902 144309 -11115 32666 202798 192258
12661A92258p6733k6786J39634j0521J06447j38523b25180C63912c6718A27685
$$ 192258 115525 88739 228373 217852 324299 185776 -225180 363912 -36718 127685
12650F8079Q6220a4186j67201F699N15627C9849K28415p7641r4895a26102B10380
$$ 68079 154299 -14186 -181387 6699 522326 39849 268264 190623 95728 -126102 210380
12638A28151J46829H0314P141J33371a36573a4364j6715C18732j53680J69798
$$ 128151 274980 80314 87455 220826 -136573 -14364 -31079 318732 165052 334850
12628C34850a08114D19566j47070a72546C75350j72611B2920K48295A19134Q4269
$$ 334850 -108114 419566 272496 -172546 375350 202739 22920 271215 119134 203403
12618B03403r6427J16017c43530A28654L5026K78560g1530r677j00613D113M7189
$$ 203403 106976 222993 -343530 128654 163680 442240 -71530 -81207 -181820 4113 51302
12607E1302J93551j07240a00139b8518A35155N1323o1792l3096a47891B57138
$$ 51302 244853 137613 -100139 -28518 135155 186478 124686 91590 -147891 257138
12596A59333L4076h9084B26966a37661C66646r0442K30633A52534a3334k14626
$$ 159333 193409 -89084 226966 -137661 366646 276204 506837 152534 -13334 -227960
12586b27960A14348e0482H9363b67666D1502J28279e02504H2930a89710h3414
$$ -227960 114348 -50482 89363 -267666 41502 169781 -502504 82930 -189710 -83414
12575a2846C7351R3607m9653P761c28000C91539c33275i6310A86631b13167b8275
$$ -12846 37351 130958 81305 89066 -328000 391539 -333275 -96310 186631 -213167 -28275
12563E346b90487e0124C58236e7342A16123g3253j1767B99854q4572I5436b08110
$$ 5346 -290487 -50124 358236 -57342 116123 -73253 -85020 299854 215282 95436 -208110
12551c502o8944D8000G193K13227H5303b50515a12604L9534A23793O7847a01206
$$ -3502 -72446 48000 7193 220420 85303 -250515 -112604 -73070 123793 191640 -101206
12539a09064d9942q4169F5987A6267b88668Q1845P6322d0266r3486E5144N26416
$$ -109064 -49942 -134111 65987 16267 -288668 -206823 -130501 -40266 -133752 55144 581560
12528E81560f2555C97501j04003a3382o0246L1504J3244C35338A30663M1197K0284
$$ 581560 -62555 397501 293498 -13382 -73628 -42124 -28880 335338 130663 171860 192144
12517A92144O2121j8765r5757J2784h8059l28507A48916E7819J42256d41583a2705
$$ 192144 254265 235500 139743 152527 -88059 -416566 148916 57819 200075 -441583 -12705
12505G7965c6652q2433h223C6574M10615a82134B39066A3246f8810D713e0400
$$ 77965 -36652 -119085 -8223 36574 447189 -182134 239066 13246 -68810 4713 -50400
12493B55963m3215a71004e5193K3277B08926e1601k36545a38137C71200A07508
$$ 255963 212748 -171004 -55193 -31916 208926 -51601 -288146 -138137 371200 107508
12482D0211j5296j0449Q6510a1994E9361J81497E8218j4812J10700A3875L6444
$$ 40211 24915 14466 100976 -11994 59361 240858 58218 43406 154106 13875 50319
12471E0319Q8536B6270J55238R0059a93657e6785A71306M9338Q8007a26701A25832
$$ 50319 138855 26270 181508 271567 -193657 -56785 171306 220644 308651 -126701 125832
12459a88241A52678b26768B4407d08809a04955B65736F3914g6881H2563C4384
$$ -188241 152678 -226768 24407 -408809 -104955 265736 63914 -76881 82563 34384
12448A23581k1553A7592K287L2395f3916K2171j06739A2639J76554G2005e4250
$$ 123581 102028 17592 19879 52274 -63916 -41745 -148484 12639 189193 72005 -54250
12436E5633K65681j06728a08875N0098A30623d8620j53087l3654A77571K63872
$$ 55633 321314 214586 -108875 -58777 130623 -48620 -201707 -235361 177571 441443
12426D41443b46241D2528b10209A00782i7604D9684J01292Q256a55658a6428G924
$$ 441443 -246241 42528 -210209 100782 -97604 49684 150976 159232 -155658 -16428 7924
12414B74748A19083c28599D8455b75958A35316a6918A7597H350f3830A38982Q7083
$$ 274748 119083 -328599 48455 -275958 135316 -16918 17597 8350 -63830 138982 226065
12403B26065k2756d5003A44202J95093H5870L0159c0205j0418J4992B6359a1837
$$ 226065 203309 -45003 144202 339295 85870 116029 -30205 -40623 -25631 26359 -11837
12391B0196J32473b49532A04960b1601A76829c6129B03800c22408A07643l566
$$ 20196 152669 -249532 104960 -21601 176829 -36129 203800 -322408 107643 104077
12381A04077a62291M9296o4571K170B4585h7738q9609G7361N2b14972A37138P7348
$$ 104077 -162291 -112995 -177566 -175396 24585 -87738 -177347 77361 77413 -214972 137138 214486
12369B14486N2636a56241A17081L48683D7463b02529E4065a84787B74357d0076
$$ 214486 267122 -156241 117081 465764 47463 -202529 54065 -184787 274357 -40076
12358A34889c67203e2201J3951B7703i8274G3657K30365b93915f9931B17058f9333
$$ 134889 -367203 -52201 -38250 27703 -98274 73657 304022 -293915 -69931 217058 -69333
12346a79199A0594J36730a59669e9472B3383J26482b52174B30722H621a1513A75623
$$ -179199 10594 147324 -159669 -59472 23383 149865 -252174 230722 8621 -11513 175623
12334A71985b5715n0402C20321D7638A6352E991a30159j37348J00141J4781j5218
$$ 171985 -25715 -76117 320321 47638 16352 5991 -130159 -267507 -167366 -152585 -167803
12323a67803M4151k4268j77589F0901A2698J98138b2768I2553d03328a10978j0932
$$ -167803 -123652 -147920 -325509 60901 12698 210836 -22768 92553 -403328 -110978 -121910
12312a21910C7328c6279B0212h1791N842A16970b0302A54727c289D15503A6834
$$ -121910 37328 -36279 20212 -81791 -75949 116970 -20302 154727 -3289 415503 16834
12300a16689B55682c2197H5249k6028b8857q9501H0803c0718D5826a66328H8317
$$ -116689 255682 -32197 85249 59221 -28857 -118358 80803 -30718 45826 -166328 88317
12288E7520c8165D1391a37876f2520K0229J9618k48475D1581a21021A44867e8481
$$ 57520 -38165 41391 -137876 -62520 -42291 -22673 -271148 41581 -121021 144867 -58481
12276D6447a3171A47815d8404E0323c1637k67565d6040l3698A63663G8678a5833
$$ 46447 -13171 147815 -48404 50323 -31637 -299202 -46040 -79738 163663 78678 -15833
12264a72101C5842J94139j07669K67416A06310c31831e9655a0649B60030a21924
$$ -172101 35842 229981 122312 389728 106310 -331831 -59655 -10649 260030 -121924
12253E2172a25934A29678B1582m576d3475A69446E5506J906O577b99478A87637
$$ 52172 -125934 129678 21582 17006 -43475 169446 55506 57412 63989 -299478 187637
12241B31574C7898K25046g0790K68j43009L8291d9630A4092J1528a53568C55816
$$ 231574 37898 262944 -70790 -70522 -213531 -175240 -49630 14092 25620 -153568 355816
12229C01934n2424M4067i4568D25629j21174J11128A58246G4108M0982J47277
$$ 301934 249510 293577 -94568 425629 304455 415583 158246 74108 115090 262367
12219B62367j12168d9734C73630p8878N4710a27623E38657I1507Q6981A6593L81099
$$ 262367 150199 -49734 373630 294752 349462 -127623 538657 91507 178488 16593 397692
12208C97692E8890A2518Q6216d4092j72997B48948i3673k0085B40523J92J28832
$$ 397692 58890 12518 98734 -44092 -217089 248948 -93673 -113758 240523 240715 369547
12197C69547j47512L1481k5887R1910K4931j55974N7592p182A0974J01252a9957
$$ 369547 222035 253516 227629 319539 344470 188496 246088 238906 10974 112226 -19957
12185A45242n5358h250l3646C60132r3708C182J05369a87723B12287p7547l1050
$$ 145242 89884 -8250 -41896 360132 266424 3182 108551 -187723 212287 134740 103690
12174A03690R1938m5700b6282B86398b4148o0880C08813q0273d5616B60314A27476
$$ 103690 195628 149928 -26282 286398 -24148 -85028 308813 228540 -45616 260314 127476
12162C06762j1925j4804j29381J33758a56339A62989n667e8788A09398m7764b5186
$$ 306762 294837 280033 150652 284410 -156339 162989 157322 -58788 109398 61634 -25186
12150e1074r813B308J65777j7760m4854O67l7061K3627a372B828L77b98749a10251
$$ -51074 -60887 2308 168085 150325 105471 106138 69077 92704 -1372 2828 3205 -298749 -110251
12136C64751b98330E6459a85577I7638c1086j17425G8291a32713p8594g5879l50634
$$ 364751 -298330 56459 -185577 97638 -31086 -148511 78291 -132713 -211307 -75879 -426513
12125d26513a22911D1322J27969c2428B96241C8711c6778A4683J53038P2934J4530
$$ -426513 -122911 41322 169291 -32428 296241 38711 -36778 14683 167721 240655 255185
12114B55185b94568g2566k68788A36534F0948e2768H4836b57163g8062B24529
$$ 255185 -294568 -72566 -341354 136534 60948 -52768 84836 -257163 -78062 224529
12103i0599A38863G741L86712b9042k88145f0307B34063i9717A17311h5881C125
$$ -90599 138863 7741 394453 -29042 -317187 -60307 234063 -99717 117311 -85881 3125
12091b1317j95304B80892a59735C29715b76157R1705j26050A71216J23061b74268
$$ -21317 -216621 280892 -159735 329715 -276157 -184452 -310502 171216 294277 -274268
12080b94194A25629j8534J80998b0985H9821k9598B4461c55442I1463a75997P6169
$$ -294194 125629 107095 288093 -20985 89821 60223 24461 -355442 91463 -175997 -99828
12069i9828K3962D876M6619j2003i576j63192B29813m4610a2049B17513L62554
$$ -99828 -75866 4876 51495 39492 -9576 -172768 229813 185203 -12049 217513 580067
12058E80067K52332k11242a37656B56396f1799A01209a19799A79144p5431a09373
$$ 580067 832399 621157 -137656 256396 -61799 101209 -119799 179144 103713 -109373
12047A30749d366k06281F3144c49922F4697K29655a6810L540j12469k67479H6983
$$ 130749 -4366 -210647 63144 -349922 64697 294352 -16810 -13270 -125739 -393218 86983
12035B43148i9811b1423C1532a10897d4056I8267D0778j7323Q1719b21945C20159
$$ 243148 -99811 -21423 31532 -110897 -44056 98267 40778 23455 105174 -221945 320159
12023i961j03669B5321a762B22142J22805A33178A8709J98438o5684a4039n7457
$$ -9961 -113630 25321 -1762 222142 344947 133178 18709 217147 151463 -14039 -71496
12012g1496A22887G11K36921a46223e1172D53988j99800a66280b5590R802p7837
$$ -71496 122887 711 237632 -146223 -51172 453988 254188 -166280 -25590 -15788 -93625
12001i3625K3407A8531K03263f8090j84713J25577A02541c02921h0002j19847
$$ -93625 -70218 18531 221794 -68090 -252803 -127226 102541 -302921 -80002 -199849
11991a99849k9832a12065K2751B535h8840J5874k97796B79505d3801j37765a9616
$$ -199849 -229681 -112065 -89314 2535 -88840 -72966 -370762 279505 -43801 -181566 -19616
11979b02910B9370i3423j96455C3596P1663K1642a21212c9312G8214j0139a94299
$$ -202910 29370 -93423 -289878 33596 105259 126901 -121212 -39312 78214 68075 -194299
11967B34282b50829N4563L1401B02482G5784c21076a18450B86691a47082n7271
$$ 234282 -250829 -196266 -164865 202482 75784 -321076 -118450 286691 -147082 -204353
11957b04353J0945A42447a19000C18250a54730F3402K3414b57038i0241l6222
$$ -204353 -193408 142447 -119000 318250 -154730 63402 86816 -257038 -90241 -126463
11947a26463e1921A85206d9394l4014A31362Q4935M40513b45063B19872N3085
$$ -126463 -51921 185206 -49394 -83408 131362 216297 656810 -245063 219872 272957
11937B72957j29675D6912J61908i8258D72504E8838a9279F091J72659h2735B1421
$$ 272957 143282 46912 208820 -98258 472504 58838 -19279 6091 178750 -82735 21421
11925e5260j02024M2190C5206J05063g3635c2950A7264K08483C1972b26440d1160
$$ -55260 -157284 -115094 35206 140269 -73635 -32950 17264 225747 31972 -226440 -41160
11913B16622l3863C0093P7863b01539i8486a3052B04201j1336r4093k4005i723
$$ 216622 182759 30093 107956 -201539 -98486 -13052 204201 192865 98772 74767 -9723
11901D4802c52438b3916k3165p65E8099j865J14198f2108K7105H3146J20214c97449
$$ 44802 -352438 -23916 -47081 -47846 58099 56234 170432 -62108 -35003 83146 203360 -397449
11888A30195b01393A00795a82307A6471N5788J31809i0074j55445l30461d6306
$$ 130195 -201393 100795 -182307 16471 72259 204068 -90074 -245519 -575980 -46306
11877a11246o5782h4510j60169G1795b76421B58107a11236l6152B53961h4828
$$ -111246 -177028 -84510 -244679 71795 -276421 258107 -111236 -147388 253961 -84828
11866B76014a27351A99540m7575C8631b39650k60442h7363j61081I8943e5202
$$ 276014 -127351 199540 151965 38631 -239650 -500092 -87363 -248444 98943 -55202
11855I866K47526b25836Q5192C4775J94947m4288B1402J5726j1247b94513A75080
$$ 9866 257392 -225836 -140644 34775 229722 185434 21402 37128 25881 -294513 175080
11843i7671I0792K6019D7601L1895b3221k70060l7762J03048i7735A66044D3216
$$ -97671 90792 116811 47601 79496 -23221 -293281 -331043 -227995 -97735 166044 43216
11831D902c2384j11197d0944r761j65346A28239b05247m425p3141J09655A29092
$$ 4902 -32384 -143581 -40944 -50705 -216051 128239 -205247 -209672 -282813 -173158 129092
11819h5413k79697B41743A8366a24342q4371M0882B62146f8522p0127B09922a58486
$$ -85413 -365110 241743 18366 -124342 -208713 -167831 262146 -68522 -138649 209922 -158486
11807e5880D76885A90083c86537B57692b15524d960j1155f797l12225J53086K4786
$$ -55880 476885 190083 -386537 257692 -215524 -4960 -16115 -6797 -319022 -165936 -141150
11796a41150m9832j45517A24360b4329E0192d6677C4738a12788r2967J2376r357
$$ -141150 -190982 -336499 124360 -24329 50192 -46677 34738 -112788 -205755 -193379 -202736
11785b02736i6821A46254C3440i690k8022j5703B2632a61925C0629e0745j95202
$$ -202736 -96821 146254 33440 -9690 -37712 -53415 22632 -161925 30629 -50745 -245947
11774b45947A67134P3848D7922J55629I7288Q7597K0666g8457E2879D180Q9149
$$ -245947 167134 240982 47922 203551 97288 184885 205551 -78457 52879 4180 93329
11763I3329k2459L0028a39787k3315A9771J55925q2821a20152e7895B44129i0054
$$ 93329 70870 100898 -139787 -163102 19771 175696 92875 -120152 -57895 244129 -90054
11751d5030G5042j8254b79382c223n3777A4043b26766B43530E665c1275A84037
$$ -45030 75042 56788 -279382 -3223 -57000 14043 -226766 243530 5665 -31275 184037
11739d3861l3699D8576j8439h6794m2187j02815b4727j06262M8956p7469q627
$$ -43861 -77560 48576 30137 -86794 -128981 -231796 -24727 -130989 -82033 -159502 -168129
11728a68129m2963L5866B71950b44469C51595d2931n5065D1964d25195b10063
$$ -168129 -211092 -175226 271950 -244469 351595 -42931 -97996 41964 -425195 -210063
11717c1257C824b35346i2448j35166M22c8053k16597A06810b05536R8592C9798
$$ -31257 3824 -235346 -92448 -227614 -227192 -38053 -254650 106810 -205536 -106944 39798
11705A66521b0283j49218C6256g1382R074b2305A14788f5735j96614q5166a72724
$$ 166521 -20283 -169501 36256 -71382 -62308 -22305 114788 -65735 -262349 -347515 -172724
11693b48364I0045R5460b5477j33132p831E586K3022O6357J95610a0640A43206
$$ -248364 90045 185505 -25477 -158609 -166440 5586 28608 94965 290575 -10640 143206
11681a78510F8328E392J56278a39857F3579i3466B55548b14053K5668A79471b6403
$$ -178510 68328 5392 161670 -139857 63579 -93466 255548 -214053 -188385 179471 -26403
11669a59377H4691A4214g8081F3052a97832E20924B11166Q2299a24957j98121
$$ -159377 84691 14214 -78081 63052 -197832 520924 211166 293465 -124957 -323078
11659c23078B5725A1096O6056H491a25714j45209D4380h5895d30j4865J159A26236
$$ -323078 25725 11096 77152 8491 -125714 -270923 44380 -85895 -430 -15295 -14136 126236
11646A41659i4347r1443B147a66572J8412I8249J34503c21070A657b94616A73439
$$ 141659 -94347 -185790 2147 -166572 -148160 98249 232752 -321070 1657 -294616 173439
11634a41718o058d1659j23677I5718c05742b4704B94181c7500B39861L2963F6082
$$ -141718 -147776 -41659 -165336 95718 -305742 -24704 294181 -37500 239861 272824 66082
11622i7299j90863B8005R1509d63244E4360J67144E1588a64815A8627a53041F061
$$ -97299 -288162 28005 119514 -463244 54360 221504 51588 -164815 18627 -153041 6061
11610H3257J60834a17811I224b80944C24501f7429B04264b30304G2673b29736
$$ 83257 244091 -117811 9224 -280944 324501 -67429 204264 -230304 72673 -229736
11599a94423g0620H6798K6521o853a65286j10033A90857b53582P1144Q7481B58746
$$ -194423 -70620 86798 113319 106466 -165286 -275319 190857 -253582 -182438 -94957 258746
11587A8683b31115B85820c4185g467p4798j39176H2661f8880p2455A4566J52458
$$ 18683 -231115 285820 -34185 -7467 -82265 -221441 82661 -68880 -141335 14566 167024
11576A67024D3191L6336a35712A26182K17644A29603m5327a0762F4664b74086
$$ 167024 43191 79527 -135712 126182 343826 129603 84276 -10762 64664 -274086
11565a25318C49850j69492a24600l6663I6952e2361D1674a90106j889E341a99947
$$ -125318 349850 180358 -124600 -161263 96952 -52361 41674 -190106 -191995 5341 -199947
11553A63536b24686b6364F4459J66557b29697K1463B50779a92836f1291l0075
$$ 163536 -224686 -26364 64459 231016 -229697 -208234 250779 -192836 -61291 -91366
11543i1366D9676k3240a3353C61024h9301B34637c75940B50138L5683C3999J96143
$$ -91366 49676 26436 -13353 361024 -89301 234637 -375940 250138 285821 33999 230142
11532B30142j0499a25756F8887j3962N4808a93577f2794A47284J33469a68891
$$ 230142 219643 -125756 68887 54925 109733 -193577 -62794 147284 280753 -168891
11521a41417f8539K330F0938M0172C6475A515Q6138L75814r7297l540o222C4465
$$ -141417 -68539 -66209 60938 101110 36475 1515 87653 463467 366170 362630 356408 34465
11508C94787m5370R3476B18033B9309h9674J601C899g8808C9150K26823J33355
$$ 394787 349417 442893 218033 29309 -89674 -88073 3899 -78808 39150 265973 399328
11497C99328c71876C57137a6542E9797J12223m357p7947l9626a71632f1841E28391
$$ 399328 -371876 357137 -16542 59797 172020 167663 89716 50090 -171632 -61841 528391
11485B13973g3923A97444o1431a72238B91358C7772a6207A0459J39567B0548K94334
$$ 213973 -73923 197444 136013 -172238 291358 37772 -16207 10459 150026 20548 314882
11474C14882I2232C8056L74981c15592C4795L21994A02659b8391A17682j171d7003
$$ 314882 92232 38056 413037 -315592 34795 356789 102659 -28391 117682 116511 -47003
11462C08263g6110A64182L97988a984H3089d9706o1199A84368k5813D0788K29076
$$ 308263 -76110 164182 562170 -1984 83089 -49706 -110905 184368 158555 40788 269864
11451B69864O1865p3693l1476i5595H1253b1236A84967A5612a50837B29965d3894
$$ 269864 331729 258036 226560 -95595 81253 -21236 184967 15612 -150837 229965 -43894
11439B66444d3667Q073n4783A92008a67749j23153H8657b85510A14300c06994
$$ 266444 -43667 -35594 -90377 192008 -167749 -290902 88657 -285510 114300 -306994
11428A75183a42280f1234n7392H7316N0623k4377J66360I3305d43928G9838M6025
$$ 175183 -142280 -61234 -118626 87316 137939 113562 279922 93305 -443928 79838 125863
11417A25863i9267A64714j7716d1882k64585f1892K9903j27898m0164i2570r9787
$$ 125863 -99267 164714 146998 -41882 -306467 -61892 -31989 -159887 -200051 -92570 -192357
11406a92357A97140g7373R033E593L55175e2103B12115I8579J44898D6034b33579
$$ -192357 197140 -77373 -68340 5593 360768 -52103 212115 98579 243477 46034 -233579
11394i0945b1633k91720J09500J4528O0356j93320A93873m1524k4191k2904J69232
$$ -90945 -21633 -313353 -203853 -189325 -128969 -322289 193873 152349 128158 105254 274486
11383B74486b54599C557c26864e8601j74609J05633i549B58594o2432b01178B5222
$$ 274486 -254599 3557 -326864 -58601 -233210 -127577 -9549 258594 196162 -201178 25222
11371a06223c0783A27473M6081N2927F690M8043J13022M0036a54906B36317j03881
$$ -106223 -30783 127473 173554 226481 6690 54733 167755 207791 -154906 236317 132436
11360A32436i3916j85045C1313b51919A03349J92257d9670A21652a31542B65698
$$ 132436 -93916 -278961 31313 -251919 103349 295606 -49670 121652 -131542 265698
11349d30808I4877b39607j9174m6536J11465k5505a08240M2203C24686e9861b2216
$$ -430808 94877 -239607 -258781 -305317 -193852 -219357 -108240 -66037 324686 -59861 -22216
11337a64598G1473g6761D8936c98840J58038f6919B61191a17911D21875a95202
$$ -164598 71473 -76761 48936 -398840 -240802 -66919 261191 -117911 421875 -195202
11326b15796j27736d3109A63901C8827K10072B484K06205l7797J03541A33241
$$ -215796 -343532 -43109 163901 38827 248899 2484 208689 170892 274433 133241
11315i4311A21933D9225J55043L4212b50804n0093B5332O9551C7617J01542b04577
$$ -94311 121933 49225 204268 238480 -250804 -300897 25332 94883 37617 139159 -204577
11303h1758j12205B20571b11431i9755Q026b2777j53126A3721L938N0257J48582
$$ -81758 -193963 220571 -211431 -99755 -91729 -22777 -175903 13721 17659 67916 216498
11292B16498a47060A14580i3432a6853m0838n0094A26295a82292e3384D7429b9388
$$ 216498 -147060 114580 -93432 -16853 -57691 -107785 126295 -182292 -53384 47429 -29388
11280A45676J73939b14663A63910b08945h680l99929C65481a40169b5713d42p219
$$ 145676 319615 -214663 163910 -208945 -8680 -408609 365481 -140169 -25713 -442 -7661
11269g661j6877r3770I8278D185a7953d324A66773b48679b4191E128b62083a24740
$$ -7661 -24538 -118308 98278 4185 -17953 -4324 166773 -248679 -24191 5128 -262083 -124740
11256f7197D38716j44951C9881L1378O4490d615A62569D7736m992K09823a49124
$$ -67197 438716 293765 39881 71259 135749 -4615 162569 47736 42744 252567 -149124
11244c03304b9573E0269N5536b32459A10159a63221K1324E9170g9888A214c65085
$$ -303304 -29573 50269 105805 -232459 110159 -163221 -141897 59170 -79888 1214 -365085
11232b37292A92873b82348N1944k5882j03137J59546c1345j33156A28470b11711
$$ -237292 192873 -282348 -230404 -256286 -359423 -199877 -31345 -164501 128470 -211711
11221a47720p0888A86903N4971a0776j14313E8107a13225A38777J318a3943a593
$$ -147720 -218608 186903 241874 -10776 -125089 58107 -113225 138777 140095 -13943 -1593
11209E647K92482b21188J08427M9205J6077j43629d0232j52037A05365b39294
$$ 5647 298129 -221188 -112761 -63556 -47479 -191108 -40232 -192269 105365 -239294
11198B1333I233a49837C8371d509j73130a4040A48822B1258a95791R1086j85247
$$ 21333 9233 -149837 38371 -4509 -177639 -14040 148822 21258 -195791 -104705 -289952
11187b89952K0974M4573a08622D582J06028e5061l24617a02793A59308b77697
$$ -289952 -268978 -224405 -108622 4582 110610 -55061 -379678 -102793 159308 -277697
11176a65760l7496g2504J1047E4772K3994c5908B74190i7081B23168b27621I7289
$$ -165760 -203256 -72504 -61457 54772 78766 -35908 274190 -97081 223168 -227621 97289
11164e5296B03431F3903a49896o504B08251c65985B33460H7572K8854f6731A57251
$$ -55296 203431 63903 -149896 -156400 208251 -365985 233460 87572 116426 -66731 157251
11152H9477l7067f2706j28556I874a12561k4105G7494a45635B7133a6377k06202
$$ 89477 52410 -62706 -191262 9874 -112561 -136666 77494 -145635 27133 -16377 -222579
11141b22579Q293q854A69619a38022O1609A83155p7814b44484A45781G372R7725
$$ -222579 -214286 -223140 169619 -138022 -76413 183155 105341 -244484 145781 7372 105097
11130A05097J49116A14133C3087R9384a69571j07469B88654A714i7530E4414G412
$$ 105097 254213 114133 33087 132471 -169571 -277040 288654 1714 -97530 54414 7412
11118G7718A4504K72428r9981I3295J94804d4161A76572j7438n4110b1648E14353
$$ 77718 14504 286932 186951 93295 288099 -44161 176572 159134 105024 -21648 514353
11106B66043R630J3086a03856l2453e439r0840A64704h2065B39244H6520N7106
$$ 266043 275673 288759 -103856 -136309 -5439 -96279 164704 -82065 239244 86520 143626
11095A43626E3019N2560N4227b95853h442B24558N9246j24239G6196d1631m4324
$$ 143626 53019 105579 159806 -295853 -8442 224558 283804 159565 76196 -41631 -85955
11084h5955D34890j95822k4227D7841N12191j16500l7713A00779O071J97556J63803
$$ -85955 434890 239068 214841 47841 560032 443532 405819 100779 106850 304406 468209
11073D68209k05645r2344J22302J30522f4792D09988M6755A88994J27596f2632
$$ 468209 262564 170220 292522 423044 -64792 409988 456743 188994 316590 -62632
11062C85288K37139k61649A75116J43160O8382L30998l05668J94164B10828N23695
$$ 385288 622427 360778 175116 318276 386658 717656 411988 606152 210828 734523
11052G34523k01994J11093J45284j99604J93993k22426j60025M38860k27999j26606
$$ 734523 532529 643622 788906 589302 783295 560869 400844 839704 611705 485099
11042D85099J6299O11592C56210K90413K0112l5257J03588A85506L68967L8886
$$ 485099 501398 1112990 356210 646623 666735 631478 735066 185506 554473 593359
11032E93359Q1894j95793M9521L19028q2898l18409J93715m7348j89453l8083
$$ 593359 675253 479460 528981 848009 765111 446702 640417 593069 403616 365533
11022C65533m3120Q9002L68971C89634R0462k14833Q0368J88500j49966j71732
$$ 365533 322413 411415 780386 389634 480096 265263 345631 534131 384165 212433
11012B12433q208K22207J55676J21943k63813k07799K62965J21246j31720K21447
$$ 212433 204225 426432 582108 704051 440238 232439 495404 616650 484930 706377
11002G06377p4423J66225r0331k0127k24691J24996k66810K5156o312M11288A75060
$$ 706377 631954 798179 707848 687721 463030 588026 321216 346372 340060 751348 175060
10990H47247l70041K93003L6553o9136K00673K38157m54068L44222R4459J6889
$$ 847247 477206 770209 806762 737626 938299 1176456 722388 1066610 1161069 1177958
10980A177958J67988l69457L71547J33247m2278J70983M86091P9793K29297J05884
$$ 1177958 1345946 976489 1348036 1481283 1439005 1609988 2096079 2175872 2405169 2511053
10970B511053k66601J55882r6026J29537k92303n52860j42416j86539k85906R4800
$$ 2511053 2244452 2400334 2304308 2433845 2141542 1588682 1446266 1259727 973821 1068621
10960A068621k29766J26943k60154L56231j93921J18143j4638j93297l38980K83513
$$ 1068621 838855 965798 705644 1061875 867954 986097 971459 778162 439182 722695
10950G22695B87736L0132j25383J34430G6296K22548I532J65755j1204E1050K55716
$$ 722695 287736 317868 192485 326915 76296 298844 9532 175287 164083 51050 306766
10939C06766M6589q2377m4708m178H9190M5734L1493E0764K04307b1033A83934
$$ 306766 353355 270978 226270 222092 89190 134924 166417 50764 255071 -21033 183934
10927A8962g5679m8615A24260a00402G0560G373K9758K12749C3635N21071I3263
$$ 18962 -75679 -124294 124260 -100402 70560 7373 37131 249880 33635 554706 93263
10915b27726B89733b77582b4136G6621C3281b11068a02872L1063A50503G3117
$$ -227726 289733 -277582 -24136 76621 33281 -211068 -102872 -71809 150503 73117
10904a24141E5220b94965e0876A97097a02564H8740K8735b93521R4783h1131c4053
$$ -124141 55220 -294965 -50876 197097 -102564 88740 117475 -293521 -198738 -81131 -34053
10892A98011a55194L0773C4881h2927F2633Q1419C9886i3485j12518K1485j45058
$$ 198011 -155194 -124421 34881 -82927 62633 144052 39886 -93485 -206003 -184518 -329576
10881c29576E0769J4787n669J82681b85455q1986a33739r7274g451D0639A1087
$$ -329576 50769 65556 59887 242568 -285455 -367441 -133739 -231013 -7451 40639 11087
10869g2986l4060d4838C6550b42017A50138j1562i2423B36159H6420N2327K54029
$$ -72986 -107046 -44838 36550 -242017 150138 138576 -92423 236159 86420 138747 392776
10858C92776g2078j50624A47813K3692d11611A18948l6683K9204c09235a04264
$$ 392776 -72078 -222702 147813 171505 -411611 118948 82265 111469 -309235 -104264
10847b20974j3041B95376c8084B11961b10773I9483a19124B53601p2361L0797
$$ -220974 -234015 295376 -38084 211961 -210773 99483 -119124 253601 181240 212037
10837B12037A4836b5760A26465O41f7313A40105d4176p382r9136K4805A25927
$$ 212037 14836 -25760 126465 127106 -67313 140105 -44176 -51558 -150694 -125889 125927
10825A9612d4368j02046c1180p9623p9616F9921c5936j83616e4694k86300H3588
$$ 19612 -44368 -146414 -31180 -110803 -190419 69921 -35936 -219552 -54694 -340994 83588
10813C8335K08625I7553j2053m0961p909C674a01543a4136C34996A07207e6514
$$ 38335 246960 97553 85500 44539 36630 3674 -101543 -14136 334996 107207 -56514
10801b97208l73183B00441k1889b07052B61856J1367B532d89504a62842i926D017
$$ -297208 -670391 200441 178552 -207052 261856 273223 2532 -489504 -162842 -9926 4017
10789A53398c52726A03479k2959J00445b09804R2723B69564H9666b09602b0791
$$ 153398 -352726 103479 80520 180965 -209804 -117081 269564 89666 -209602 -20791
10778b19845O8864b6503A85102G5072K5815a96923R6209l2038C1885b90308C69909
$$ -219845 -150981 -26503 185102 75072 100887 -196923 -100714 -132752 31885 -290308 369909
10766a29699b0091A16257E4438d7840m0062l2376K3068A85560f1598j02519j29880
$$ -129699 -20091 116257 54438 -47840 -87902 -120278 -97210 185560 -61598 -164117 -293997
10755b93997J43804B62503a40588M0284B16382e4848H8709C7384J78035d0018
$$ -293997 -150193 262503 -140588 -100304 216382 -54848 88709 37384 215419 -40018
10744b42591R4687p825j66149i1248k15966O8156Q4841B19909i0069A00434L1200
$$ -242591 -147904 -155729 -321878 -91248 -307214 -239058 -154217 219909 -90069 100434 131634
10733A31634A0964L4334f9155p6510k01393H4838M455b70390B32210I2066a4375
$$ 131634 10964 45298 -69155 -145665 -347058 84838 89293 -270390 232210 92066 -14375
10721A36126a81591D3163d30518H6092b33429j36605a27690K1836A29925a03561
$$ 136126 -181591 43163 -430518 86092 -233429 -370034 -127690 -105854 129925 -103561
10710a6821j11724O2175B57802c42285a11672p3058j00270e2037n84900i641q5113
$$ -16821 -128545 -66370 257802 -342285 -111672 -184730 -285000 -52037 -636937 -9641 -94754
10699i4754A05072i0219K1372B48938a49171f8970j17805G0872j3340A4378c31529
$$ -94754 105072 -90219 -68847 248938 -149171 -68970 -186775 70872 57532 14378 -331529
10687a15309j30532J08234n4058g8577L031F689J70847o3623C9033b26115A64475
$$ -115309 -245841 -137607 -191665 -78577 -75546 6689 177536 113913 39033 -226115 164475
10675G6293a14541A03270M4241F9452E096J36899n9439K0233l1639J18242n1957
$$ 76293 -114541 103270 147511 69452 5096 141995 82556 102789 71150 189392 137435
10664A37435e2244a9518l39833a57626e1660F4845a66843L6191K839E0195e4734
$$ 137435 -52244 -19518 -359351 -157626 -51660 64845 -166843 -130652 -127813 50195 -54734
10652d7389l12928A69995B7764g710l13718R5615a5451A62094c04439a06307k15352
$$ -47389 -360317 169995 27764 -7710 -321428 -225813 -15451 162094 -304439 -106307 -321659
10641c21659a31034A61337g7739A37956b99999b9505j46471G6654b70445a11870
$$ -321659 -131034 161337 -77739 137956 -299999 -29505 -175976 76654 -270445 -111870
10630f7921o860J2417p5014r2087K8042R0921k5770B91542j43293J43951c02452
$$ -67921 -74781 -62364 -137378 -229465 -201423 -110502 -136272 291542 148249 292200 -302452
10618b17942d5807o1419a7795k37089H9734b33887R6002A44706E6821b41303C62477
$$ -217942 -45807 -107226 -17795 -254884 89734 -233887 -137885 144706 56821 -241303 362477
10606d0631B29182A05922g6159j9413A44943b42914J326A89739I4481P1972G7230
$$ -40631 229182 105922 -76159 -95572 144943 -242914 -241588 189739 94481 166453 77230
10594a30255M271j56391A26254b89960A130M3749a01483m4829m526k19403a10941
$$ -130255 -125984 -282375 126254 -289960 1130 44879 -101483 -146312 -150838 -370241 -110941
10582b04104B71765b581l41863I6312a83500r4808a0896B36551d2303o839F5166
$$ -204104 271765 -2581 -344444 96312 -183500 -278308 -10896 236551 -42303 -49142 65166
10570A9888Q8266M21064a25095B37405a42428p0695D16413F6194a12950a3529
$$ 19888 108154 529218 -125095 237405 -142428 -213123 416413 66194 -112950 -13529
10559c1160j49282q3021A45525b44824E8343k4384N4855K58480a73665P8860j11444
$$ -31160 -180442 -263463 145525 -244824 58343 33959 88814 347294 -173665 -94805 -206249
10548b06249F6265r596a76520A99206c35991B14282l8283h9764J7574m6927p8108
$$ -206249 66265 56669 -176520 199206 -335991 214282 175999 -89764 -72190 -119117 -197225
10537a97225A07975D6277O7421C7476d8305A84448n4069C686b18523B13938C8502
$$ -197225 107975 46277 113698 37476 -48305 184448 130379 3686 -218523 213938 38502
10525b53635A83056L2122H9542a49665F1204c44359J05203J12634G5057k4561
$$ -253635 183056 215178 89542 -149665 61204 -344359 -239156 -126522 75057 50496
10515E0496J74459N0471b58447b5748o0215k90942J80479b6450A4259a11715K0275
$$ 50496 224955 275426 -258447 -25748 -85963 -376905 -196426 -26450 14259 -111715 -91440
10504i1440k59217b5232j94884e6088F403a82723f754C45448e0126E1688i8722
$$ -91440 -350657 -25232 -220116 -56088 6403 -182723 -6754 345448 -50126 51688 -98722
10492g0793m9442K7929B36785J04954E9687a52147J6608A01037k8438J3137i4670
$$ -70793 -120235 -92306 236785 341739 59687 -152147 -135539 101037 72599 85736 -94670
10480A41491j7923j4568a44822b0782B02669b31241A68323k2773a33516R730j5335
$$ 141491 123568 109000 -144822 -20782 202669 -231241 168323 145550 -133516 -123786 -139121
10469a39121A20190A6626c28560A38013C450R6701b3006j25849f7694j89476i1336
$$ -139121 120190 16626 -328560 138013 3450 100151 -23006 -148855 -67694 -257170 -91336
10457c75129g6013B28652a39807B29202i4588h577E2597b10638A31455a50772
$$ -375129 -76013 228652 -139807 229202 -94588 -8577 52597 -210638 131455 -150772
10446f7478k77722a47163A22500a91001o0396J04625H0796b2732B14623J12878
$$ -67478 -345200 -147163 122500 -191001 -251397 -146772 80796 -22732 214623 327501
10436C27501b6615H8773N9205b09512P0725e6411I7240a7266A71086E1887k0289
$$ 327501 -26615 88773 147978 -209512 -138787 -56411 97240 -17266 171086 51887 31598
10425C1598c37850A21080o355g8425j5832n527o9957C9893a59686J1321B5819
$$ 31598 -337850 121080 114725 -78425 -94257 -99784 -169741 39893 -159686 -148365 25819
10413b67475D3868b32559L2898Q9233j32871C0797c1288q0670K5923G4325a77197
$$ -267475 43868 -232559 -199661 -110428 -243299 30797 -31288 -111958 -86035 74325 -177197
10401b06392h7973A82537F3842b01440A90249K00676F413o3J91878Q745J75946
$$ -206392 -87973 182537 63842 -201440 190249 390925 6413 6350 198228 206973 382919
10390C82919A58522a97707h7403A41857b8814j74137e9749C50212a5634p273J0515
$$ 382919 158522 -197707 -87403 141857 -28814 -202951 -59749 350212 -15634 -22907 -12392
10379a2392j38476C4026K7183K07925p9684K3153p0022L6162H1707L49885j51898
$$ -12392 -150868 34026 61209 269134 189450 212603 142581 178743 81707 431592 279694
10368B79694J38258B4633O14691q3060j45182c0429D25615j78292n7236l9960
$$ 279694 417952 24633 639324 556264 411082 -30429 425615 247323 190087 150127
10358A50127a8230B09618a77094C97758d4978C32414L25723j89519K74852j74602
$$ 150127 -18230 209618 -177094 397758 -44978 332414 658137 468618 743470 568868
10348E68868A98593J82046j09575A04016K69886j27692n5417J93684j2091a77696
$$ 568868 198593 380639 271064 104016 373902 246210 190793 384477 372386 -177696
10337A54935n842L40155a70430E6844c58555D28041A31682J4346k4984h8197j5419
$$ 154935 149093 489248 -170430 56844 -358555 428041 131682 146028 121044 -88197 -103616
10326a03616A68534L21186A39219K14994f240A90971j1982f3056A07293R5996
$$ -103616 168534 489720 139219 354213 -6240 190971 178989 -63056 107293 203289
10316B03289a36683E11059A42403e5211l72342a40804l7449A66224E5264J28389
$$ 203289 -136683 511059 142403 -55211 -427553 -140804 -178253 166224 55264 183653
10306A83653g0235G0623J05787f3690C08921H9414j2510b42592j011C8580J97377
$$ 183653 -70235 70623 176410 -63690 308921 89414 76904 -242592 -243603 38580 235957
10295B35957c27713h015A09271J2715a20212e7605j47194p0933n8067e6297m2031
$$ 235957 -327713 -8015 109271 121986 -120212 -57605 -204799 -275732 -333799 -56297 -98328
10284i8328J7252A2234a74467A07264b15451e8711N516b1603C85361j58965a25495
$$ -98328 -81076 12234 -174467 107264 -215451 -58711 -53195 -21603 385361 226396 -125495
10272B6156J9188b6960k52429I7578A4030M12069b3472j45428e4698H7015l0000
$$ 26156 45344 -26960 -279389 97578 14030 426099 -23472 -168900 -54698 87015 57015
10261E7015O1427e704D8301B747J63601f5885A9771c994C03142a48948q0563i5395
$$ 57015 118442 -5704 48301 2747 166348 -65885 19771 -3994 303142 -148948 -229511 -95395
10248a33697j064K1710C64861r1929D5356K821b73416A77330c9209k75496c5352
$$ -133697 -134761 -113051 364861 272932 45356 48177 -273416 177330 -39209 -314705 -35352
10236A06964f9646p4441m72k62433J76698A19856K05495G2924N1275n3244a71726
$$ 106964 -69646 -144087 -144559 -406992 -230294 119856 325351 72924 124199 70955 -171726
10224F8910P8369b907j20859n4585F8042B1710a87017C7868J59262e1432k9972
$$ 68910 147279 -2907 -123766 -178351 68042 21710 -187017 37868 197130 -51432 -81404
10213h1404A99032r3479d8134H9159a90988k9740r985B4630d4310p7430k2012
$$ -81404 199032 105553 -48134 89159 -190988 -220728 -230713 24630 -44310 -121740 -143752
10202a43752k1038B7670b9745l68208C06110a63487L7018k41333i9300l82860
$$ -143752 -164790 27670 -29745 -397953 306110 -163487 -126469 -367802 -99300 -482160
10192d82160J93960F6802a36639D3841R7844j6917Q0272B3385D081h9620j24993
$$ -482160 -288200 66802 -136639 43841 141685 124768 205040 23385 4081 -89620 -214613
10181b14613J01408n6459K8299j56471A25422d27035E1948b27127h7556l1515
$$ -214613 -113205 -169664 -141365 -297836 125422 -427035 51948 -227127 -87556 -119071
10171a19071m7822c5609B49722a08214I5020N7981B2677b33810d6106C6516J48117
$$ -119071 -166893 -35609 249722 -108214 95020 153001 22677 -233810 -46106 36516 184633
10160A84633B9332P0690O5985b21292c8132A50581N1135G6765b33973A33036e63651
$$ 184633 29332 100022 166007 -221292 -38132 150581 201716 76765 -233973 133036 -563651
10148d9238j16551E2628d1795m0550B04850C3363J66335a50398P2863A49749h1328
$$ -49238 -165789 52628 -41795 -82345 204850 33363 199698 -150398 -77535 149749 -81328
10136A94354b33994A42363D8066A6951e3086A15592a2034m31042K08855q712K2698
$$ 194354 -233994 142363 48066 16951 -53086 115592 -12034 -443076 -234221 -242933 -220235
10125b20235k24302J35783R7894B48354a06700J3194A7225Q9040g1407B37924
$$ -220235 -444537 -308754 -210860 248354 -106700 -93506 17225 106265 -71407 237924
10114A66084a97325N4085p287B4088c28881A07819a91254B55566j3788b83738
$$ 166084 -197325 -143240 -150527 24088 -328881 107819 -191254 255566 241778 -283738
10103a84617b3923m54024b08134a6086A70855a78442h7915l1476K7939j72722
$$ -184617 -23923 -477947 -208134 -16086 170855 -178442 -87915 -119391 -91452 -264174
10093b64174J12929k75146a53298L1254B36926a62547O3871j24688G7369a19627
$$ -264174 -151245 -426391 -153298 -122044 236926 -162547 -98676 -223364 77369 -119627
10082b41724M6269h4467B74543f9053f294E54109a53948l7555h078r6455A42586
$$ -241724 -195455 -84467 274543 -69053 -6294 554109 -153948 -191503 -8078 -104533 142586
10070e39237d2691E354b70826A96842a86469j05841B56430i5777p6926A3374a79876
$$ -539237 -42691 5354 -270826 196842 -186469 -292310 256430 -95777 -172703 13374 -179876
10058c21315a37343A47030a49905g076p0678j03427B49605b11479e6517A60323
$$ -321315 -137343 147030 -149905 -7076 -77754 -181181 249605 -211479 -56517 160323
10047b51576D9435J25702b49128J23551c4180C72368h1411C8168a22797j49278
$$ -251576 49435 175137 -249128 -125577 -34180 372368 -81411 38168 -122797 -272075
10037b72075d4525A89502j5472A9988b68696m2668A31617g7758k2667j08922A95926
$$ -272075 -44525 189502 174030 19988 -268696 -311364 131617 -77758 -100425 -209347 195926
10025A68421J4376c58266b0274j38918c9861k06971I2793K1004a59732r8312R8413
$$ 168421 182797 -358266 -20274 -159192 -39861 -246832 92793 113797 -159732 -258044 -159631
10014a59631G4111d9855j11081j88310f7347J8276A21270a90931B38354H0620
$$ -159631 74111 -49855 -160936 -349246 -67347 -49071 121270 -190931 238354 80620
10003b2087k13619D44740a01298K6970o4922A22611e9841A21086a20874p4588
$$ -22087 -235706 444740 -101298 -74328 -139250 122611 -59841 121086 -120874 -195462
9993a95462d670A07693J60330a180k08142M1436e1867B2259a36310a6988j16634
$$ -195462 -4670 107693 268023 -1180 -209322 -167886 -51867 22259 -136310 -16988 -133622
9982a33622A21584E4162J45128c06622q2809J0015I6870K48175i3258B8403d5806
$$ -133622 121584 54162 199290 -306622 -389431 -379416 96870 345045 -93258 28403 -45806
9970F3798i1541A2669J44761h3851k00044A71730o2432A052M28402b27449l1907
$$ 63798 -91541 12669 157430 -83851 -283895 171730 109298 1052 429454 -227449 -259356
9959b59356p7493M1903B06438a42281e1544k81179O9538N8429l3375A73850G4604
$$ -259356 -336849 -294946 206438 -142281 -51544 -332723 -263185 -204756 -238131 173850 74604
9947A10650f2055j50349M5749C6632a57997C6085b0860A36989a32993b00k21041
$$ 110650 -62055 -212404 -166655 36632 -157997 36085 -20860 136989 -132993 -200 -221241
9936b21241F6846a51850I1802h4515k39251O7777j5990h7255k82722b4849A12060
$$ -221241 66846 -151850 91802 -84515 -323766 -255989 -271979 -87255 -369977 -24849 112060
9924e9429B6912c34659e5791j5473j7819A5891d9354k46548B4928b50276h7312
$$ -59429 26912 -334659 -55791 -71264 -89083 15891 -49354 -295902 24928 -250276 -87312
9912b21027b4106k78807B55123b87961e0999M20j52601Q6605H2349e9361j80620
$$ -221027 -24106 -302913 255123 -287961 -50999 -50579 -203180 -116575 82349 -59361 -239981
9901b39981j09366a14553a5543l44816C1361c13008D16860a24506e9752l8658
$$ -239981 -349347 -114553 -15543 -360359 31361 -313008 416860 -124506 -59752 -98410
9891i8410j3683A14137i325j71083h8173K007J2764b524D195J04636L01774e16711
$$ -98410 -112093 114137 -9325 -180408 -88173 -86166 -73402 -2524 4195 108831 410605 -516711
9878b37824G1503a55746r0928B9398c33228h8912I7432e4586B94122c99198a40178
$$ -237824 71503 -155746 -246674 29398 -333228 -88912 97432 -54586 294122 -399198 -140178
9866e6906p9224E1622a72546G9425A5258J12414c04380a51180j8881C5631J73160
$$ -56906 -136130 51622 -172546 79425 15258 127672 -304380 -151180 -170061 35631 208791
9855B08791c374A46459K8757a30905j48573A9462a6830C58729b57500Q6396g8237
$$ 208791 -3374 146459 175216 -130905 -279478 19462 -16830 358729 -257500 -171104 -78237
9843F8520a26194j05056a12217G7543M8517e2748l16155J15851G1354J55169a13098
$$ 68520 -126194 -231250 -112217 77543 126060 -52748 -368903 -253052 71354 226523 -113098
9831a74760C1934N9301a96989L9052I2605B0099J11947g400k14837B1745a02174
$$ -174760 31934 91235 -196989 -157937 92605 20099 132046 -7400 -222237 21745 -102174
9819B14340I3809a52146B75100I191P4249C1262b59602a05498j74816i8977G1508
$$ 214340 93809 -152146 275100 9191 83440 31262 -259602 -105498 -280314 -98977 71508
9807a01270E2467b72679g6067E02159a44983p7526L3996G1282N9351J25983E1466
$$ -101270 52467 -272679 -76067 502159 -144983 -222509 -188513 71282 130633 256616 51466
9795d4392D5334Q5989j687b2915A3699o340b17397l9783E9695j3817J777b48478
$$ -44392 45334 131323 129636 -22915 13699 7359 -217397 -257180 59695 45878 47655 -248478
9782d7490l1437q3014M7680A37052a06476K2122I7869k2150e7889C43092a80764
$$ -47490 -78927 -161941 -114261 137052 -106476 -84354 97869 75719 -57889 343092 -180764
9770B6050g9930C43315b43130M9612b4845K740k87822a09289m1685d0735a7760
$$ 26050 -79930 343315 -243130 -193518 -24845 -22105 -309927 -109289 -150974 -40735 -17760
9758G5998d8669j07539H3974a90481F2179c28577N4171g4466B26564b43901B068
$$ 75998 -48669 -156208 83974 -190481 62179 -328577 -274406 -74466 226564 -243901 2068
9746c02675A21539A0634a69463h119j41291j91351A01284l6624c39903J42048
$$ -302675 121539 10634 -169463 -8119 -149410 -340761 101284 64660 -339903 -197855
9736a97855j64425J46623h599A85782a41618F3709c5241C03004f7138p4404B12107
$$ -197855 -362280 -215657 -8599 185782 -141618 63709 -35241 303004 -67138 -141542 212107
9724g1516q0638F8783f1710a6293a440m6862k45153C5937a77993A48414h2165
$$ -71516 -152154 68783 -61710 -16293 -1440 -48302 -293455 35937 -177993 148414 -82165
9712H0019a32828o1918l0166M9515g9548D6832g9552j83303j31618M5191J63685
$$ 80019 -132828 -194746 -224912 -175397 -79548 46832 -79552 -262855 -394473 -349282 -185597
9701a85597g8482m7430K0551E9321c01116F5890K7023D5477J3375j1962e2380
$$ -185597 -78482 -125912 -105361 59321 -301116 65890 92913 45477 58852 46890 -52380
9689b10374A47992i4482i176p7272j46938B69747P1133c46496A8744K88368b57670
$$ -210374 147992 -94482 -9176 -86448 -233386 269747 340880 -346496 18744 307112 -257670
9677a43011l2092f4744b5931A34980b72293j20035J14274J5709B84173A37639
$$ -143011 -175103 -64744 -25931 134980 -272293 -392328 -278054 -262345 284173 137639
9666b94676F8359c33044J58817j87130h3418K3433A78613D2553a25504A95284
$$ -294676 68359 -333044 -174227 -361357 -83418 -59985 178613 42553 -125504 195284
9655e29543a18662j04212N9240H4216C8327a4623k66366h7597J3297l0479B03712
$$ -529543 -118662 -222874 -163634 84216 38327 -14623 -280989 -87597 -74300 -104779 203712
9643E7842j6664a49201A20470a54390N9870b6288D07628a53689B90631a64652
$$ 57842 41178 -149201 120470 -154390 -94520 -26288 407628 -153689 290631 -164652
9632a48350j40524B90097j5989F1056K17427j03419J64474b6300q4208j7907M6795
$$ -148350 -288874 290097 274108 61056 278483 175064 339538 -26300 -110508 -128415 -81620
9621h1620A50700l8117f1484j4194A11503m1883J73448e10467E4350K14507j15483
$$ -81620 150700 112583 -61484 -75678 111503 69620 243068 -510467 54350 268857 153374
9610A53374k778J10801p6036J72199c8315I4306b5944n1816a8444G0374K08101
$$ 153374 150596 261397 185361 357560 -38315 94306 -25944 -77760 -18444 70374 278475
9599B78475i8562A28136a10319m6450A09302c6878G5234g2605B31959E5620f1669
$$ 278475 -98562 128136 -110319 -156769 109302 -36878 75234 -72605 231959 55620 -61669
9587C6344R0765D3214b67005c7959j14775E56b82145a18801j36717J01513a2145
$$ 36344 127109 43214 -267005 -37959 -152734 556 -282145 -118801 -255518 -154005 -12145
9575a90334a6955l3080j39470m8009K9374M0631A43536c4719H8852J62161f1889
$$ -190334 -16955 -50035 -189505 -237514 -208140 -167509 143536 -34719 88852 251013 -61889
9563a1562B36713b0201G6562P828a24537A6834J67482p2956J39981n9954r3390
$$ -11562 236713 -20201 76562 84390 -124537 16834 184316 111360 251341 191387 97997
9552I7997c04930a45824A4881e1105I2267c1026D4309b84602p340d667j51161
$$ 97997 -304930 -145824 14881 -51105 92267 -31026 44309 -284602 -291942 -4667 -155828
9541a55828M6108F4337b04861F6398b11597M0644B86152A22591c88192J68138
$$ -155828 -109720 64337 -204861 66398 -211597 -170953 286152 122591 -388192 -220054
9531b20054A07406a37285C3147d46760J60967b4588j39o852k61700B21968b41690
$$ -220054 107406 -137285 33147 -446760 -285793 -24588 -24727 -31579 -293279 221968 -241690
9519f093E8992h3738o5383A17416b24621F5958h8557p3821M6326A37428F7942
$$ -6093 58992 -83738 -149121 117416 -224621 65958 -88557 -162378 -116052 137428 67942
9507c9041a6561k79006J15655p9236b0395c224r2193D0928g5108A58928d36003
$$ -39041 -16561 -295567 -179912 -259148 -20395 -3224 -95417 40928 -75108 158928 -436003
9495G4218d6357A23227b78514l9948R7078n6606b4832F0580A0339b84241l9254
$$ 74218 -46357 123227 -278514 -318462 -221384 -277990 -24832 60580 10339 -284241 -323495
9484c23495I7500a94605j21123A80533L3877a58624j2499e7164m7579b4817p9180
$$ -323495 97500 -194605 -315728 180533 214410 -158624 -171123 -57164 -104743 -24817 -103997
9473a03997a498B74004c08620e131D760b17281R7963B53121b19354K7134k49030
$$ -103997 -1498 274004 -308620 -5131 4760 -217281 -119318 253121 -219354 -192220 -441250
9462d41250b1362j00634d9743d461H9590J27154A02324B5200a06561j67416J7242
$$ -441250 -21362 -121996 -49743 -4461 89590 216744 102324 25200 -106561 -273977 -256735
9451b56735A61379J56804a50984A80039c4182a6925B0967a44286r5626D6818c37860
$$ -256735 161379 318183 -150984 180039 -34182 -16925 20967 -144286 -239912 46818 -337860
9439e09714C56044b3763G1362B7209J44754b25146o8524E5925a20132J508N1152
$$ -509714 356044 -23763 71362 27209 171963 -225146 -293670 55925 -120132 -118624 -67472
9428f7472k73267d8472C25764j6258d26964f7832k3467k63161A81818e31594b52323
$$ -67472 -340739 -48472 325764 309506 -426964 -67832 -91299 -354460 181818 -531594 -252323
9416i1853j2827E1210a65694p1473E8721d9761j36086F6122i8013k16673M0115
$$ -91853 -104680 51210 -165694 -237167 58721 -49761 -185847 66122 -98013 -314686 -274571
9405b74571P2786A72306b27138a3533B83520D3949b86212P4105j00227D09714
$$ -274571 -201785 172306 -227138 -13533 283520 43949 -286212 -212107 -312334 409714
9394a97294j60841f9998C01375h9692B27143i7664B27858a16030b9811o1627A31425
$$ -197294 -358135 -69998 301375 -89692 227143 -97664 227858 -116030 -29811 -91438 131425
9382i1780b5263o9132o4483A37216J44314h3418K0050c414A91601i4096j37876
$$ -91780 -25263 -94395 -158878 137216 281530 -83418 -63368 -3414 191601 -94096 -231972
9371b31972C664K18448F1467K81292a82090J1667e6819g668j10216m9330k76639
$$ -231972 3664 222112 61467 342759 -182090 -170423 -56819 -7668 -117884 -167214 -443853
9360d43853a40730I9845h4278A74067b97595M0694c4209k50034E30744a44572
$$ -443853 -140730 99845 -84278 174067 -297595 -256901 -34209 -284243 530744 -144572
9349c26547J14812a9590d644A02747J57129b43381A6569J7851J0409e0028k3584
$$ -326547 -211735 -19590 -4644 102747 259876 -243381 16569 34420 44829 -50028 -73612
9338g3612A40660o4463b45812J2234A05970a11424a5663q5243d7077l31779A46250
$$ -73612 140660 76197 -245812 -233578 105970 -111424 -15663 -100906 -47077 -378856 146250
9326a20775I7274O1895o7356c1547A2544f8160q116B63562f6010D7172Q278O5895
$$ -120775 97274 159169 91813 -31547 12544 -68160 -76276 263562 -66010 47172 55450 121345
9314A21345b5048k05246b4033g172A06251c9634l11923m648f9626r7340o1479
$$ 121345 -25048 -230294 -24033 -7172 106251 -39634 -351557 -356205 -69626 -166966 -228445
9303b28445N6875B70325b53650c7229o8485j93336b3710B29388a28525L7600B58599
$$ -228445 -171570 270325 -253650 -37229 -105714 -299050 -23710 229388 -128525 -90925 258599
9291a87982D6902b03653B32234G987d6617k77046a24741A82960q1070J9941c8502
$$ -187982 46902 -203653 232234 7987 -46617 -323663 -124741 182960 101890 121831 -38502
9279B24391a52602b704p854A71878a78014D3027K96853a93100d6469A01011b38517
$$ 224391 -152602 -2704 -10558 171878 -178014 43027 339880 -193100 -46469 101011 -238517
9267b14967m9046A30571b55942C5134a60249j0582A0776J10880P6326c40190h9396
$$ -214967 -264013 130571 -255942 35134 -160249 -170831 10776 121656 197982 -340190 -89396
9255C9899g1036j4212H5267J696b6468g050B0091a24043A37462a2115j81131E86507
$$ 39899 -71036 -85248 85267 86963 -26468 -7050 20091 -124043 137462 -12115 -193246 586507
9242a27716G420b90559e1696r218B7478h7518p9960c545E7699J31912C7086J58598
$$ -127716 7420 -290559 -51696 -60914 27478 -87518 -167478 -3545 57699 189611 37086 195684
9230A95684d1278B13104l1421b20474A1082J09467E1792b12055P1917j12394e8008
$$ 195684 -41278 213104 181683 -220474 11082 120549 51792 -212055 -140138 -252532 -58008
9218D6398O677d808D8764c40924B30859d74924a06415B37621i782E7686b38330
$$ 46398 53075 -4808 48764 -340924 230859 -474924 -106415 237621 -9782 57686 -238330
9206e0214k584B49706m1827b25963c0616m7874r5237F0704f4722m55730E1927
$$ -50214 -52798 249706 207879 -225963 -30616 -78490 -173727 60704 -64722 -520452 51927
9194B50858b30123a2212j16936G625d2495k47088J36471E700b25274A18025N8176
$$ 250858 -230123 -12212 -129148 7625 -42495 -289583 -153112 5700 -225274 118025 176201
9183A76201a76865l1892B00922i1093h730E457R4379b05176H4438g9771B7981
$$ 176201 -176865 -208757 200922 -91093 -8730 5457 99836 -205176 84438 -79771 27981
9171c19223E7638b05321j25019C3099e5181A53437K2504E674P1410a74387d2839
$$ -319223 57638 -205321 -330340 33099 -55181 153437 175941 5674 77084 -174387 -42839
9159C11363b8875a2038l15447C847K20128c47327c6467c175j42062c1107p7776
$$ 311363 -28875 -12038 -327485 3847 223975 -347327 -36467 -3175 -145237 -31107 -108883
9148a08883c4562j80872j12300J03438L0936d2313n7190B9401e44113f6895C8547
$$ -108883 -34562 -215434 -327734 -224296 -193360 -42313 -99503 29401 -544113 -66895 38547
9136a94521i4488l1353b9976j68984E2951a1955m59177C13484b8268k57416J34468
$$ -194521 -94488 -125841 -29976 -198960 52951 -11955 -471132 313484 -28268 -285684 -151216
9125a51216M8754e097j5402A22941P1512A193a40185m4064j59471A12647Q8217
$$ -151216 -102462 -5097 -20499 122941 194453 1193 -140185 -184249 -343720 112647 200864
9114B00864a29331j1817j0041e2961H1562a37980j46531A6298c76096d2967r6668
$$ 200864 -129331 -141148 -151189 -52961 81562 -137980 -284511 16298 -376096 -42967 -139635
9103a39635k04528J03930b7167C7860P4701k3453J59124Q5913b53833f0177G5585
$$ -139635 -344163 -240233 -27167 37860 112561 89108 248232 334145 -253833 -60177 75585
9091e6728l4462j48369M7759L9389j08493c3258q5875k02125N9157A22476J21759
$$ -56728 -91190 -239559 -191800 -152411 -260904 -33258 -119133 -321258 -262101 122476 244235
9080B44235h6731k16638k3781J54389L5866K5773D1891L785J3102N3242J47936
$$ 244235 -86731 -303369 -327150 -172761 -136895 -111122 41891 45676 58778 112020 259956
9069B59956a598A21189K63941E8563L31143B9132c16895A88299a69777a9259k28668
$$ 259956 -1598 121189 385130 58563 389706 29132 -316895 188299 -169777 -19259 -247927
9058b47927B48622B1544L7199a85073B30286i5709b0453A48282A65c25521Q7987
$$ -247927 248622 21544 58743 -185073 230286 -95709 -20453 148282 165 -325521 -237534
9047b37534k0197a15171b3331I9860N7273D0716a27771d778o8626G3105e12348
$$ -237534 -257731 -115171 -23331 99860 157133 40716 -127771 -4778 -73404 73105 -512348
9035b23258J863n1728M6659l4055B30622n6643h2555D1235J73063G8771d51002
$$ -223258 -221395 -273123 -226464 -260519 230622 173979 -82555 41235 214298 78771 -451002
9023A06258b19849d4643q7468d7692k33901C71210c49234B56082c0702k10059
$$ 106258 -219849 -44643 -132111 -47692 -281593 371210 -349234 256082 -30702 -240761
9013b40761c7512H5046Q89a57110D6025a95365A70945F3063N8373b80664c054
$$ -240761 -37512 85046 85935 -157110 46025 -195365 170945 63063 121436 -280664 -3054
9001a87063l0223A79844B7387c5659l82092C3970L91111a48303n3319P2723M2284
$$ -187063 -217286 179844 27387 -35659 -417751 33970 425081 -148303 -201622 -128899 -86615
8990h6615c0325A17946a35497j22265J28816m2849b9092A00553k1943o604J98772
$$ -86615 -30325 117946 -135497 -257762 -128946 -171795 -29092 100553 78610 72006 270778
8979B70778E5830a66427A14715b6895j04294B66868A03577c8579j2147A04149
$$ 270778 55830 -166427 114715 -26895 -131189 266868 103577 -38579 -50726 104149
8968B885b50969d3533n9419j50170A41559g8384B2725b30745C46779a10944N5216
$$ 2885 -250969 -43533 -102952 -253122 141559 -78384 22725 -230745 346779 -110944 -55728
8957e5728A65516H454c69145B28165b95432a05976I2636d9420A6445K05164i6921
$$ -55728 165516 8454 -369145 228165 -295432 -105976 92636 -49420 16445 221609 -96921
8945a22642M6028j59252A11225N9031f151p4414I8579e09956b31488A95597i8368
$$ -122642 -76614 -235866 111225 170256 -6151 -80565 98579 -509956 -231488 195597 -98368
8933C15178h1374B48909M1433d01572A75365m9430J20817M2546R2753Q45011K183350
$$ 315178 -81374 248909 290342 -401572 175365 125935 246752 289298 382051 1227062 3410412
8922C410412L548871R388061F940952B618354E62324B16445a03990B32172a29827
$$ 3410412 6959283 16347344 6940952 2618354 562324 216445 -103990 232172 -129827
8912A78872a4483A38713b1497O357E13648j97392c386j27794c4402E2465M2000
$$ 178872 -14483 138713 -21497 -15140 513648 316256 -3386 -131180 -34402 52465 94465
8901I4465Q0156p8204f638A80956e0048j78613i4728M6282l14574J52507C8715
$$ 94465 174621 96417 -6638 180956 -50048 -228661 -94728 -48446 -363020 -210513 38715
8889B16613a60086I3485b32499A65779b98948B75984j18991h7311j0410j24640
$$ 216613 -160086 93485 -232499 165779 -298948 275984 156993 -87311 -97721 -222361
8879b22361O8580j52326A9965a59542B75787D6536b06436K5853N0254H2062G050
$$ -222361 -153781 -306107 19965 -159542 275787 46536 -206436 -180583 -130329 82062 7050
$$ [...]
##END NTUPLES=NMR SPECTRUM
##END=
