
##TITLE=UV1276_M13_1250-1169_90_7414773_4LIeapw943
##JCAMPDX= 6.0         $$ Bruker NMR JCAMP-DX V2.0
##DATA TYPE= NMR SPECTRUM
##DATA CLASS= NTUPLES
##ORIGIN= BRUKER
##OWNER= Administrator
$$ 1.72 TOPSPIN		Version 2.1
$$ 2013-01-25 22:07:45.113 -0500  Administrator@X
$$ Compression mode = diff/dup
##.OBSERVE FREQUENCY= 400.02188249412
##.OBSERVE NUCLEUS= ^1H
##.ACQUISITION MODE= SIMULTANEOUS (DQD)
##.ACQUISITION SCHEME= undefined
##.AVERAGES= 64
##.DIGITISER RES= 22
##SPECTROMETER/DATA SYSTEM= spect
##.PULSE SEQUENCE= noesygpps1d.comp
##.SOLVENT NAME= COFFEE_meoh
##.SHIFT REFERENCE= INTERNAL, COFFEE_meoh, 1, 14.96122
##AUDIT TRAIL= $$ (NUMBER, WHEN, WHO, WHERE, PROCESS, VERSION, WHAT)
$$ ##TITLE= Audit trail, TOPSPIN		Version 2.1
$$ ##JCAMPDX= 5.01
$$ ##ORIGIN= Bruker BioSpin GmbH
$$ ##OWNER= Administrator
$$ $$ E:\/data/COFFEE/nmr/UV1276_M13_1250-1169_90_7414773_4LIeapw943/12/pdata/1/auditp.txt
$$ ##AUDIT TRAIL=  $$ (NUMBER, WHEN, WHO, WHERE, PROCESS, VERSION, WHAT)
(   1,<2013-01-25 22:07:39.316 -0500>,<Administrator>,<X>,<go>,<TOPSPIN 2.1>,
      <created by zg
	started at 2013-01-25 21:56:09.253 -0500,
	POWCHK enabled, PULCHK disabled,
       configuration hash MD5:
       86 BA 57 50 F2 9D 5C 9B 26 00 A9 28 5F 66 2E 89
       data hash MD5: 64K
       C8 C8 B2 65 05 E8 43 57 6B 00 13 FC 36 81 70 82>)
(   2,<2013-01-25 22:07:42.394 -0500>,<Administrator>,<X>,<proc1d>,<TOPSPIN 2.1>,
      <Start of raw data processing
       efp LB = 0.3 FT_mod = 6 PKNL = 1 PHC0 = 0 PHC1 = 0 SI = 128K 
       data hash MD5: 128K
       68 06 8C 70 EF 81 14 58 A3 69 8A B8 A2 4D A1 30>)
(   3,<2013-01-25 22:07:43.425 -0500>,<Administrator>,<X>,<proc1d>,<TOPSPIN 2.1>,
      <pk PHC0 = -79.02466 PHC1 = 0 
       data hash MD5: 128K
       EF 55 97 8A DD F9 53 8C 4B 32 75 20 6B 1D 6D B1>)
(   4,<2013-01-25 22:07:44.066 -0500>,<Administrator>,<X>,<proc1d>,<TOPSPIN 2.1>,
      <abs ABSG = 1 
       data hash MD5: 128K
       E5 C4 E8 A8 BD D3 B7 21 C8 B7 01 A0 B0 3C 79 FE>)
(   5,<2013-01-25 22:07:44.238 -0500>,<Administrator>,<X>,<proc1d>,<TOPSPIN 2.1>,
      <abs ABSG = 2 
       data hash MD5: 128K
       F8 87 15 45 33 6A A2 F3 6D 72 3B 6E 09 7E 1F 4A>)
(   6,<2013-01-25 22:07:44.425 -0500>,<Administrator>,<X>,<proc1d>,<TOPSPIN 2.1>,
      <abs ABSG = 3 
       data hash MD5: 128K
       69 52 42 53 0F 52 18 51 34 21 5D 13 2D F4 FC DF>)
(   7,<2013-01-25 22:07:44.613 -0500>,<Administrator>,<X>,<proc1d>,<TOPSPIN 2.1>,
      <abs ABSG = 4 
       data hash MD5: 128K
       32 01 B6 36 1D E8 C1 6B 13 D3 FF C0 69 64 52 DA>)
(   8,<2013-01-25 22:07:44.785 -0500>,<Administrator>,<X>,<proc1d>,<TOPSPIN 2.1>,
      <abs ABSG = 5 
       data hash MD5: 128K
       CB 1E 14 C3 BE 45 D6 D1 20 A7 5E 24 7F C7 06 09>)
$$ ##END=
$$ 
$$ $$ hash MD5
$$ $$ E1 0B B1 2A 84 BA F6 71 E4 4C 46 0B 6D 5F C0 18
##$RELAX= 
##$RELAX= 
##$RELAX= 
##$RELAX= 
##$RELAX= 
##$RELAX= 
##$RELAX= 
##$RELAX= 
$$ Bruker specific parameters
$$ --------------------------
##$DU= <E:\>
##$EXPNO= 12
$$ [...]
##$TP07= 0
##$TPNAME0= <>
##$TPNAME1= <>
##$TPNAME2= <>
##$TPNAME3= <>
##$TPNAME4= <>
##$TPNAME5= <>
##$TPNAME6= <>
##$TPNAME7= <>
##$TPOAL= (0..7)
0.5 0.5 0.5 0.5 0.5 0.5 0.5 0.5
##$TPOFFS= (0..7)
0 0 0 0 0 0 0 0
##$TUNHIN= 0
##$TUNHOUT= 0
##$TUNXOUT= 0
##$USERA1= <user>
##$USERA2= <user>
##$USERA3= <user>
##$USERA4= <user>
##$USERA5= <user>
##$V9= 5
##$VALIST= <valist>
##$VCLIST= <CCCCCCCCCCCCCCC>
##$VD= 0
##$VDLIST= <DDDDDDDDDDDDDDD>
##$VPLIST= <PPPPPPPPPPPPPPP>
##$VTLIST= <TTTTTTTTTTTTTTT>
##$WBST= 2048
##$WBSW= 25
##$XGAIN= (0..3)
0 0 0 0
##$XL= 0
##$YL= 0
##$YMAX_a= 5904516
##$YMIN_a= -12009388
##$ZGOPTNS= <>
##$ZL1= 120
##$ZL2= 120
##$ZL3= 120
##$ZL4= 120
##$ABSF1= 14.96122
##$ABSF2= -5.596962
##$ABSG= 5
##$ABSL= 3
##$ALPHA= 0
##$AQORDER= 0
##$ASSFAC= 0
##$ASSFACI= 0
##$ASSFACX= 0
##$ASSWID= 0
##$AUNMP= <proc_prof1d_extract.lims>
##$AXLEFT= 0
##$AXNAME= <>
##$AXNUC= <1H>
##$AXRIGHT= 0
##$AXTYPE= 0
##$AXUNIT= <>
##$AZFE= 0.1
##$AZFW= 0.1
##$BCFW= 0
##$BC_mod= 0
##$BYTORDP= 0
##$COROFFS= 0
##$CY= 15
##$DATMOD= 1
##$DC= 0
##$DFILT= <>
##$DTYPP= 0
##$F1P= 0
##$F2P= 0
##$FCOR= 0.5
##$FTSIZE= 131072
##$FT_mod= 6
##$GAMMA= 0
##$GB= 0
##$INTBC= 1
##$INTSCL= 1
##$ISEN= 128
##$LB= 0.3
##$LEV0= 0
##$LPBIN= 0
##$MAXI= 10000
##$MC2= 0
##$MEAN= 0
##$ME_mod= 0
##$MI= 0
##$NCOEF= 0
##$NC_proc= -2
##$NLEV= 6
##$NOISF1= 0
##$NOISF2= 0
##$NSP= 0
##$NTH_PI= 0
##$NZP= 0
##$OFFSET= 14.96122
##$PC= 1
##$PHC0= -79.02466
##$PHC1= 0
##$PH_mod= 1
##$PKNL= yes
##$PPARMOD= 0
##$PPDIAG= 0
##$PPIPTYP= 0
##$PPMPNUM= 2147483647
##$PPRESOL= 1
##$PSCAL= 4
##$PSIGN= 0
##$PYNMP= <proc.py>
##$REVERSE= no
##$SF= 400.020009548013
##$SI= 131072
##$SIGF1= 0
##$SIGF2= 0
##$SINO= 400
##$SIOLD= 131072
##$SPECTYP= <>
##$SREGLST= <1H.CDCl3>
##$SSB= 0
##$STSI= 131072
##$STSR= 0
##$SW_p= 8223.68421052631
##$SYMM= 0
##$S_DEV= 0
##$TDeff= 65536
##$TDoff= 0
##$TI= <>
##$TILT= no
##$TM1= 0
##$TM2= 0
##$TOPLEV= 0
##$USERP1= <user>
##$USERP2= <user>
##$USERP3= <user>
##$USERP4= <user>
##$USERP5= <user>
##$WDW= 1
##$XDIM= 131072
##$YMAX_p= 386630438
##$YMIN_p= -11582
##$CURPLOT= <Network HP LaserJet P1505>
##$CURPRIN= <$Network HP LaserJet P1505>
##$DFORMAT= <normdp>
##$LAYOUT= <+/1D_H.xwp>
##$LFORMAT= <normlp>
##$PFORMAT= <normpl>
##$SURQMSG= 1
$$ End of Bruker specific parameters
$$ ---------------------------------
##NTUPLES= NMR SPECTRUM
##VAR_NAME=  FREQUENCY,     SPECTRUM/REAL,   SPECTRUM/IMAG
##SYMBOL=    X,             R,               I
##VAR_TYPE=  INDEPENDENT,   DEPENDENT,       DEPENDENT
##VAR_FORM=  AFFN,          ASDF,            ASDF
##VAR_DIM=   131072,        131072,          131072
##UNITS=     HZ,            ARBITRARY UNITS, ARBITRARY UNITS
##FACTOR=    0.0627417313425164, 1,          1
##FIRST=     8223.62146879497, 1591,         -55616
##LAST=      0,             3142,            -55860
##MIN=       0,             -11582,          0
##MAX=       8223.62146879497, 386630438,    0
$$ Real data points
##PAGE= N=1
##DATA TABLE= (X++(R..R)), XYDATA
$$ [...]
63888E81016j7096j6525j5644j3974j1987j0598r880q946p410o097n782n918n365
63875D45794l830j861J89K222L772M445M873O258Q765J1317J3203J4835J6663
63862E26645J8329J9580K1015K3129K5399K7170K8864L1198L3675L4941L4515
63851H24460L3200L1826L0553K9380K8308K6785K3911J9659J5141J1262P677L591
63839A085753j021n560r761j3913j8263k2647k6621k9709l1614l2418l2513l2227
63827H29486l1753l1386l1453l1832l1928l1357l0344k9272k8147k6775k5115
63816E00124k3244k1205j9178j7420j5866j4160j2356j1115j0730j0439r334p611
63804C27466o277n771n576n190m728m450m316m246m381m680m671l998k987k336
$$ y = [581016, 563920, 547395, 531751, 517777, 505790, 495192, 485312, 476366, 468956, 462859, 457077, 451159, 445794, 441964, 440103, 440292, 442514, 446286, 450731, 455604, 461862, 470627, 481944, 495147, 509982, 526645, 544974, 564554, 585569, 608698, 634097, 661267, 690131, 721329, 755004, 789945, 824460, 857660, 889486, 920039, 949419, 977727, 1004512, 1028423, 1048082, 1063223, 1074485, 1082162, 1085753, 1084732, 1079172, 1069411, 1055498, 1037235, 1014588, 987967, 958258, 926644, 894226, 861713, 829486, 797733, 766347, 734894, 703062, 671134, 639777, 609433, 580161, 552014, 525239, 500124, 476880, 455675, 436497, 419077, 403211, 389051, 376695, 365580, 354850, 344411, 335077, 327466, 321189, 315418, 309842, 304652, 299924, 295474, 291158, 286912, 282531, 277851, 273180, 269182, 266195, 263859]
63790B63859k317k585k745k762k777k722k409j928j742k121k617k386j175K14
63776B33787O62j15j354k076j960j334o15pL31K19k08l97K6N96M11o55j605j540
63758B24166p71k21j47q3J27J05j96k24L38J009J157P27J37j34K65J237J942J504
63740B30938K92k40N85J730J901J210O49N47N32O24J283K423L317L502L201K846
63724B55340K816L483M779N817N692M765M348N016N957O117N304L906K303R44
63710C16587K88K01j66j375k952m006m289m188l959l496k758j982j433j150r86
63695B84336p11j38P34J632K181K189J842J644K015K796L303L058K347J789J541
63680C10558J275Q21M06K34K89N65J081J555J496R28N95J178K448L512L754L315
$$ y = [263859, 261542, 258957, 256212, 253450, 250673, 247951, 245542, 243614, 241872, 239751, 237134, 234748, 233573, 233787, 234449, 234334, 232980, 230904, 228944, 227610, 226995, 226988, 227319, 227538, 227330, 226933, 226959, 227555, 227966, 227311, 225706, 224166, 223395, 223174, 223027, 222944, 223071, 223176, 222980, 222756, 223094, 224103, 225260, 225987, 226124, 225990, 226255, 227492, 229434, 230938, 231230, 230990, 231575, 233305, 235206, 236416, 237065, 237612, 238144, 238768, 240051, 242474, 245791, 249293, 252494, 255340, 258156, 261639, 266418, 272235, 277927, 282692, 287040, 292056, 298013, 304130, 309434, 313340, 315643, 316587, 316875, 317076, 316910, 315535, 312583, 308577, 304288, 300100, 296141, 292645, 289887, 287905, 286472, 285322, 284336, 283625, 283487, 284221, 285853, 288034, 290223, 292065, 293709, 295724, 298520, 301823, 304881, 307228, 309017, 310558, 311833, 312654, 313060, 313294, 313583, 314148, 315229, 316784, 318280, 319208, 319803, 320981, 323429, 326941, 330695, 334010]
63664C34010K766K575K874L475L918L580K069l00k549l856m297m528m855n051
63650C29831n059n176n343m932l747k556k040j792j114k22K53N17J290K419L037
63635C05366L020L098L416L258K571K482L622N016N542N556O071P011P446P275
63621C70750P509Q795J0611J2162J3438J4928J6698J8193J8984J9435K0451K2551
63609E54505K5322K7962L0104L1855L3232L4018L4147L3568L1856K8469K3602
63598H88640J8088J2358O234j4n210q451j0154j1383j2609j3689j4603j5546j6586
63585H17075j7827j9564k1732k3484k4017k3517k2724k1776k0288j8294j6324
63574E87528j4445j2139r314o706m862l350j507M60J820K556L530N256P103Q093
$$ y = [334010, 336776, 339351, 342225, 345700, 349618, 353198, 355267, 354967, 352418, 348562, 344265, 339737, 334882, 329831, 324772, 319596, 314253, 309321, 305574, 303018, 300978, 299186, 298072, 297850, 298103, 298620, 299910, 302329, 305366, 308386, 311484, 314900, 318158, 320729, 323211, 326833, 331849, 337391, 342947, 349018, 356029, 363475, 370750, 378259, 387054, 397665, 409827, 423265, 438193, 454891, 473084, 492068, 511503, 531954, 554505, 579827, 607789, 637893, 669748, 702980, 736998, 771145, 804713, 836569, 865038, 888640, 906728, 919086, 925320, 925306, 920096, 911645, 901491, 890108, 877499, 863810, 849207, 833661, 817075, 799248, 779684, 757952, 734468, 710451, 686934, 664210, 642434, 622146, 603852, 587528, 573083, 560944, 551630, 544924, 540062, 536712, 535205, 535665, 537485, 540041, 543571, 548827, 555930, 564023]
63560E64023Q161Q107Q466R035R601J0409J1612J2853J4009J5769J8723K2203
63548G12971K5020K7187K9838L3386L6871L9515M1708M3645M3807L9905L1193
63537A105046J9263O855l690j1209j5863j8509j9710j9473j8077j6462j5440j5007
63525I77724j4973j5748j7842k1009k4508k7892l0875l2844l3269l2471l1216
63514F95077k9709k7616k4987k2403k0209j8240j6337j4593j3025j1525j0174
63503D86259r136q271p312o368n772n461n013m304l657l315l226l360l787m339
63489D12938m572m174l227k072j145p39o59l26M93J374J946K491L303L959L960
63474D13550L758M175M975M938L540J598J05q19j499j997k352k955m118n517o440
$$ y = [564023, 572184, 580291, 588757, 597792, 607393, 617802, 629414, 642267, 656276, 672045, 690768, 712971, 737991, 765178, 795016, 828402, 865273, 904788, 946496, 990141, 1033948, 1073853, 1105046, 1124309, 1131164, 1127474, 1116265, 1100402, 1081893, 1062183, 1042710, 1024633, 1008171, 992731, 977724, 962751, 947003, 929161, 908152, 883644, 855752, 824877, 792033, 758764, 726293, 695077, 665368, 637752, 612765, 590362, 570153, 551913, 535576, 520983, 507958, 496433, 486259, 477123, 468852, 461540, 455172, 449400, 443939, 438926, 434622, 430965, 427650, 424424, 421064, 417277, 412938, 408366, 404192, 400965, 398893, 397748, 397009, 396350, 396024, 396517, 397891, 399837, 402328, 405631, 409590, 413550, 417308, 421483, 426458, 431396, 434936, 436534, 436639, 435820, 434321, 432324, 429972, 427017, 422899, 417382, 410942]
63459D10942o434n601m465l674l534l737l609k808j560l99J81N1k79J00J554L411
63443C80139M842N951P453R487J1410J2765J3788J5011J6895J9707K3215K6638
63431E47301K9520L2356L5418L7305L5816L0545K3510J7026J1933Q193O035N729
63419H20687P045R737J3893J9265K4840K9672L3578L6443L7526L6193L2748K7825
63407A129452K1464J3651N379j827p302j1429j4544j6461j7264j7745j8727k0313
63395A044334k2115k4001k6274k9113l2054l4204l5030l4711l3549l1463k8457
63384G13363k5225k2541k0222j7491j4401j1857j0050p972m971j815M99K041L290
63371E82648M117M403M946O570Q787J0567J2028J4141J6995J9613K1550K3358
$$ y = [410942, 404508, 398907, 394442, 390768, 387234, 383497, 379888, 377080, 375520, 375121, 375302, 375353, 375074, 375174, 376728, 380139, 384981, 390932, 398385, 407872, 419282, 432047, 445835, 460846, 477741, 497448, 520663, 547301, 576821, 609177, 644595, 681900, 717716, 748261, 771771, 788797, 800730, 808923, 814958, 820687, 827732, 837469, 851362, 870627, 895467, 925139, 958717, 995160, 1032686, 1068879, 1101627, 1129452, 1150916, 1164567, 1169946, 1168119, 1160817, 1149388, 1134844, 1118383, 1101119, 1083374, 1064647, 1044334, 1022219, 998218, 971944, 942831, 910777, 876573, 841543, 806832, 773283, 741820, 713363, 688138, 665597, 645375, 627884, 613483, 601626, 591576, 583604, 578633, 576818, 577317, 579358, 582648, 586765, 591168, 596114, 602684, 611471, 622038, 634066, 648207, 665202, 684815, 706365, 729723]
63359G29723K5323K6976K8263L0030L2665L5229L6632L6996L7052L6756L5317
63348A090962L2218K7429K0922J2866M325l047q351j2072j5139j7679j9092j9196
63336A094146j8890j9487k1501k4283k6870k8918l0697l2350l3503l3591l2359
63325G91697k9932k6647k2980j9490j6558j4072j1453q169m296o06J865K296K12
63312F41867m386j0640j6715k0732k2067k1482j9931j7762j5211j2947j1482j0465
63300D58047r265q033p461p588p670p288o880o862o910o537n912n581n636n608
63286C60816n088m148l179k567k402k439k361k194k195k290j970j050j27J25j30
63271C28801j91Q7M3p73j887k435k132j412q43o28o00m74j63L3k81j044j662j668
$$ y = [729723, 755046, 782022, 810285, 840315, 872980, 908209, 944841, 981837, 1018889, 1055645, 1090962, 1123180, 1150609, 1171531, 1184397, 1188722, 1185675, 1177324, 1165252, 1150113, 1132434, 1113342, 1094146, 1075256, 1055769, 1034268, 1009985, 983115, 954197, 923500, 891150, 857647, 824056, 791697, 761765, 735118, 712138, 692648, 676090, 662018, 650565, 642396, 638100, 637494, 639359, 641655, 641867, 637481, 626841, 610126, 589394, 567327, 545845, 525914, 508152, 492941, 479994, 468512, 458047, 448782, 440749, 433288, 425700, 418030, 410742, 403862, 397000, 390090, 383553, 377641, 372060, 366424, 360816, 355728, 351580, 348401, 345834, 343432, 340993, 338632, 336438, 334243, 331953, 329983, 328933, 328806, 328931, 328801, 328610, 328697, 328740, 327967, 326080, 323645, 321513, 320101, 319258, 318630, 318030, 317556, 317393, 317426, 317145, 316101, 314439, 312771]
63253C12771j185n59J39Q36J036L49o31p59J18Q41N34j43K2J039J809J740J350
63236C19307J220J220J101J162J724K446K721K591K676L246L895M144M004L756
63222C55213L497L162K809K604K617K802L148L636M006L877L256K664K552K740
63208C98583K791K722K832K935K432J272K21k18m68j028j518j309o30j98m8L90
63192D08761J160J737K139L087M779O350P079P342P932R006J0283J1655J3067
63179D94377J4111J4472J4419J4359J4143J3401J2331J1566J1375J1518J1688
63168F37760J1647J1059R757Q141O742N453L730J553m24j926l636o308r676j2690
63154F61182j4691j5898j6837j7637j8080j8052j7687j7091j6135j4669j2864
$$ y = [312771, 311586, 311027, 311166, 312002, 313038, 313387, 312756, 311997, 312115, 312956, 313490, 313347, 313369, 314408, 316217, 317957, 319307, 320527, 321747, 322848, 324010, 325734, 328180, 330901, 333492, 336168, 339414, 343309, 347453, 351457, 355213, 358710, 361872, 364681, 367285, 369902, 372704, 375852, 379488, 383494, 387371, 390627, 393291, 395843, 398583, 401374, 404096, 406928, 409863, 412295, 413567, 413788, 413570, 413102, 412074, 410556, 409247, 408617, 408419, 408371, 408761, 409921, 411658, 413797, 416884, 421663, 428013, 435092, 442434, 450366, 459372, 469655, 481310, 494377, 508488, 522960, 537379, 551738, 565881, 579282, 591613, 603179, 614554, 626072, 637760, 649407, 660466, 670223, 678364, 685106, 690559, 694289, 695842, 695418, 693492, 689856, 683548, 673872, 661182, 646491, 630593, 613756, 596119, 578039, 559987, 542300, 525209, 509074, 494405, 481541]
63143D81541j1180r994r229q431p157n405l703k703k514k495j865n74O06Q74L01
63128D18072j62L95J853L144L499L416L952N171O012N867N445N520N675N197M554
63113D77610M778N682O067N646N415N841O050N467M976N489O318O109M843L837
63099E54128L950M728N308N404N305N399N800O227O354O345O741P557P985P386
63085F38617O099M873L798K409N24j514l249m419n040n496o261p219p666p386
63071F08070p214q000r383j0139r539p884o001m657m207m306m124l172j698j46
63057E27600J287K365K762K806L446M985O511P267P823R003J0399J0980J0725
63044F07959J0557J0993J1848J2858J3679J3610J2435J1192J1038J1615J1680
$$ y = [481541, 470361, 460367, 451138, 442707, 435550, 430145, 426442, 423739, 421225, 418730, 416865, 416291, 416897, 417771, 418072, 417910, 418305, 420158, 423302, 426801, 430217, 434169, 439340, 445352, 451219, 456664, 462184, 467859, 473056, 477610, 482388, 488070, 494137, 499783, 505198, 511039, 517089, 522556, 527532, 533021, 539339, 545448, 550291, 554128, 558078, 562806, 568114, 573518, 578823, 584222, 590022, 596249, 602603, 608948, 615689, 623246, 631231, 638617, 644716, 649589, 653387, 655796, 656320, 654806, 651557, 647138, 642098, 636602, 630341, 623122, 615456, 608070, 600856, 592856, 583473, 573334, 563795, 555911, 549910, 545253, 541046, 536740, 532616, 529444, 527746, 527600, 528887, 531252, 534014, 536820, 540266, 545251, 551762, 559029, 566852, 575855, 586254, 597234, 607959, 618516, 629509, 641357, 654215, 667894, 681504, 693939, 705131, 716169, 727784, 739464]
63033G39464J0977J0271R774Q981P937P251O712N386L326J730J006M9k014m578
63019H06272o726q415r877j0797j0978j0926j1077j1065j0451r464q432p091n003
63006F85970k221R12M053O739Q629J0162J2155J4554J6492J7816J9420K1535K2964
62993H39180K2797K1763K1044K0735K0442K0400K0872K1206K0683J9642J8717
62982A067481J7543J5407J2594R876P097L515p66m954q970j3407j8178k2355k5425
62969A039458k7679k9316l0199l0514l0679l0458k9163k6906k4743k3302k2149
62958G34350k0771j9309j7998j6688j5314j4261j3826j3784j3776j3646j3251
62947E61726j2533j1911j1985j2569j2659j1732j0401r461q824p955o891o240
$$ y = [739464, 750441, 760712, 770486, 779467, 787404, 794655, 801367, 806753, 810079, 811809, 812815, 812864, 810850, 806272, 799546, 791131, 781254, 770457, 759479, 748553, 737476, 726411, 715960, 706496, 698064, 690973, 685970, 683749, 684661, 688714, 695453, 704082, 714244, 726399, 740953, 757445, 775261, 794681, 816216, 839180, 861977, 883740, 904784, 925519, 945961, 966361, 987233, 1008439, 1029122, 1048764, 1067481, 1085024, 1100431, 1113025, 1122901, 1129998, 1133513, 1132747, 1127793, 1118823, 1105416, 1087238, 1064883, 1039458, 1011779, 982463, 952264, 921750, 891071, 860613, 831450, 804544, 779801, 756499, 734350, 713579, 694270, 676272, 659584, 644270, 630009, 616183, 602399, 588623, 574977, 561726, 549193, 537282, 525297, 512728, 500069, 488337, 477936, 468475, 459651, 451696, 444805, 438565]
62935D38565o258o460o137n117m035l760m353m775m106k821k176k376k289j314
62921C82588m26p06j663j959j331p01o39p01l97R1M48P13R18P87L34J97Q47J681
62903C80081J644O86K8O85K261L549M075M480N397O530P183P274P364P774Q189
62888D47200Q187P796P261O531N337L665J962Q31N44P57O05o33k761m684n511
62873D77087n513n724o566p378p385o725o182o173o442o593o515o208n655m986
62859C89042m512m359m341m254m107l833l189k191j405j367j802j879j183j87
62845C50433L84K46l81j150j793k166k221j927j237k56N93Q16L09m82r22o92J2
62828C39566N84N02j27n73l12L25O15M10K31M37Q06J001J058J177J368J477J390
$$ y = [438565, 432307, 425847, 419710, 414593, 410558, 406798, 402445, 397670, 393564, 390743, 388567, 386191, 383902, 382588, 382162, 381456, 379793, 377834, 376503, 375802, 375163, 374462, 374065, 374156, 374604, 375317, 376235, 377022, 377356, 377553, 378400, 380081, 381725, 382411, 382439, 383124, 385385, 388934, 393009, 397489, 402886, 409416, 416599, 423873, 431237, 439011, 447200, 455387, 463183, 470444, 476975, 482312, 485977, 487939, 488770, 489314, 490071, 490676, 490043, 487282, 482598, 477087, 471574, 465850, 459284, 451906, 444521, 437796, 431614, 425441, 418999, 412406, 405891, 399683, 394028, 389042, 384530, 380171, 375830, 371576, 367469, 363636, 360447, 358256, 356851, 355484, 353682, 351803, 350620, 350433, 350817, 351063, 350682, 349532, 347739, 345573, 343352, 341425, 340188, 339932, 340525, 341341, 341650, 341168, 340246, 339554, 339566, 340150, 340652, 340525, 339952, 339640, 339965, 340580, 340990, 341221, 341658, 342464, 343465, 344523, 345700, 347068, 348545, 349935]
62811C49935J084O69M06M49N76M99L39M67Q36J012Q71Q03J013J158J012R48J396
62794C63473K102K405K090J553J260J331J585J773J768J737K054K961M391O055
62780C96538P598Q709R347R788J0244J0545J0540J0591J1207J2194J2829J2818
62768E22948J2435J1710J0247Q101O063M704L788K846J641j88l077o541r083r837
62754E55757r634r819j0606j1419j2137j2976j3615j3481j2686j1797j0888r662
62742D17037q365p567p213o690n848n131m725m424m263m424m480l671k093p24
62728C47419m2N02J306J763J200jp46m18P74K198L226L506L257L150L641M533
62712C75268N283N595N643N914O883Q592J0596J2428J4080J5711J7150J8150J8984
$$ y = [349935, 351019, 351688, 352094, 352543, 353119, 353618, 353957, 354424, 355260, 356272, 357143, 357946, 358959, 360117, 361129, 362077, 363473, 365575, 367980, 370070, 371623, 372883, 374214, 375799, 377572, 379340, 381077, 383131, 386092, 390483, 396538, 404136, 412845, 422192, 431980, 442224, 452769, 463309, 473900, 485107, 497301, 510130, 522948, 535383, 547093, 557340, 565441, 571504, 576208, 579996, 582842, 584483, 584295, 581218, 574677, 565594, 555757, 546123, 536304, 525698, 514279, 502142, 489166, 475551, 462070, 449384, 437587, 426699, 417037, 408672, 401105, 393892, 387202, 381354, 376223, 371498, 367074, 362811, 358387, 353907, 350236, 348143, 347419, 347377, 347879, 349185, 350948, 352148, 352147, 351401, 350983, 351757, 353955, 357181, 360687, 363944, 367094, 370735, 375268, 380551, 386146, 391789, 397703, 404586, 413178, 423774, 436202, 450282, 465993, 483143, 501293, 520277]
62699E20277K0225K1981K3865K5710K7730K9904L1862L3557L5420L7596L9500
62688H47627M0391M0028L8556L6159L3008K9148K4282J8017J0549K716m713j1511
62676A104257j7705k3319k8454l3122l6934l9356m0436m0725m0458l9379l7508
62665G26861l5394l3393l1350k9180k7122k5104k2704k0053j7959j6597j5004
62654D53001j2567j0174q958q523p653o250n372n454n733n614n455n596n618n083
62640C54951m289l657k939j710l55K70%l91k44J69J61l66q29q10o48r22j597j986
62622C34808j663j048q85j331j803j705j052l46n3k49o83j107j460j744j740j196
62606C16743k54M81N96L76L78P16J074J335J693K072J986J280O70J076K541M231
$$ y = [520277, 540502, 562483, 586348, 612058, 639788, 669692, 701554, 735111, 770531, 808127, 847627, 888018, 928046, 966602, 1002761, 1035769, 1064917, 1089199, 1107216, 1117765, 1120481, 1115768, 1104257, 1086552, 1063233, 1034779, 1001657, 964723, 925367, 884931, 844206, 803748, 764369, 726861, 691467, 658074, 626724, 597544, 570422, 545318, 522614, 502561, 484602, 468005, 453001, 440434, 430260, 421302, 412779, 405126, 398876, 393504, 388050, 382317, 376703, 371248, 365652, 360034, 354951, 350662, 347005, 344066, 342356, 342001, 342271, 342271, 341880, 341636, 341805, 341966, 341600, 340771, 339961, 339313, 338391, 336794, 334808, 333145, 332097, 331212, 329881, 328078, 326373, 325321, 324975, 324922, 324673, 323990, 322883, 321423, 319679, 317939, 316743, 316489, 316970, 317566, 317942, 318320, 319036, 320110, 321445, 323138, 325210, 327196, 328476, 329146, 330222, 332763, 336994]
62590C36994N437O106O353N988M982L986L798M363M798M513L766K970J965M24
62576C96443j299k400k670k857l782n259o203n757m282l038k895l458l748l505
62562C45290l376l728l912l181j844r50r19j134q73k19J50k45j174j842j595o12
62546C19836J91K11j74k03K70Q32J325J965K649K827K264J460J068J185J408J365
62530C38479J044P64Q86J430K005K340K682L437M606N918P255Q524R307R309R063
62515D07049R530J0965J2745J4356J5880J7434J8822K0035K1443K3130K4543K5118
62503F21050K4883K4155K3002K1203J8511J4900J0858P349M864K634m32m017o523
62490G62437p128o674o088n097l227j070N58K021M227O982R138J0295J1248J2633
$$ y = [336994, 342431, 348537, 354890, 360878, 365860, 369846, 373644, 378007, 382805, 387318, 391084, 394054, 396019, 396443, 395144, 392744, 390074, 387217, 383435, 378176, 371973, 366216, 361934, 358896, 356001, 352543, 348795, 345290, 341914, 338186, 334274, 331093, 329249, 328299, 327380, 326246, 325373, 325154, 325304, 325059, 323885, 322043, 320448, 319836, 320027, 320238, 320064, 319861, 320131, 320963, 322288, 324253, 326902, 329729, 331993, 333453, 334521, 335706, 337114, 338479, 339523, 340287, 341173, 342603, 344608, 346948, 349630, 353067, 357673, 363591, 370846, 379370, 388677, 397986, 407049, 416579, 427544, 440289, 454645, 470525, 487959, 506781, 526816, 548259, 571389, 595932, 621050, 645933, 670088, 693090, 714293, 732804, 747704, 758562, 765911, 770775, 773409, 772977, 768960, 762437, 755309, 748635, 742547, 737450, 734223, 733153, 733711, 735732, 739959, 746941, 756079, 766374, 777622, 790255]
62476G90255J3993J4376J3199J0391O361K032j670m654p711j1544j6089k0758
62464G88181k4990k8358l0574l1605l1620l0745k9051k6780k4351k2074k0061
62453D87972j8364j6940j5476j3569j1146q571o297m591l575l229l233l004k089
62440C77888n07J246K596L294L569L772L945L789L145K292J634J220P09k74j761
62425D06557l323m305m387l945l681l882m254m456m430m158l518k606j823j411
62411C56378j129o66o4L93N13K11m81j266j677j489q84j32N20P22L34o1L85J552
62393C53159K333K168J908K576L927M976N379N507N549N404N260N483O041O727
62379D16397P696R086J0289J0505R999R948J0926J2263J3090J3297J3236J3224
$$ y = [790255, 804248, 818624, 831823, 842214, 848575, 850607, 848937, 844283, 836572, 825028, 808939, 788181, 763191, 734833, 704259, 672654, 641034, 610289, 581238, 554458, 530107, 508033, 487972, 469608, 452668, 437192, 423623, 412477, 403906, 397609, 393018, 389443, 386214, 382981, 379977, 377888, 377381, 378627, 381223, 384517, 388086, 391858, 395803, 399592, 402737, 405029, 406663, 407883, 408592, 408318, 406557, 403234, 398929, 394542, 390597, 386916, 383034, 378780, 374324, 369894, 365736, 362218, 359612, 357789, 356378, 355249, 354583, 354519, 354912, 355425, 355636, 355155, 353889, 352212, 350723, 349839, 349707, 350227, 350949, 351283, 351222, 351607, 353159, 355492, 357660, 359568, 362144, 366071, 371047, 376426, 381933, 387482, 392886, 398146, 403629, 409670, 416397, 424093, 433179, 443468, 453973, 463972, 473920, 484846, 497109, 510199, 523496, 536732, 549956]
62367E49956J3671J5074J7381J9770K1601K3296K5844K9536L3678L7597M1559
62356H28963M6401N2267N7982O2034O4018O4751O4841O3658O0105N3959M5983
62345A464962L6935K7069J6596O068l796j2446j9674k5725l1196l6515m1520m5636
62333A335122m8284m9092m8109m6047m3940m2167m0235l7849l5567l3800l1885
62322H78147k9069k6028k4203k3818k3664k2933k2170k2058k2302k2205k1522
62311F18175k0279j8422j6227j4482j3620j2999j1633r388p085n598n114n095
62299D78233m686l399j626k52K81L16L44N20Q54J432K156K724L054L340L519L193
62283D90003K421J965K318K964L126K899K998L659M430M912N172N398N693O232
$$ y = [549956, 563627, 578701, 596082, 615852, 637453, 660749, 686593, 716129, 749807, 787404, 828963, 875364, 927631, 985613, 1047647, 1111665, 1176416, 1241257, 1304915, 1365020, 1418979, 1464962, 1501897, 1528966, 1545562, 1551630, 1547834, 1535388, 1515714, 1489989, 1458793, 1422278, 1380758, 1335122, 1286838, 1237746, 1189637, 1143590, 1099650, 1057483, 1017248, 979399, 943832, 910032, 878147, 849078, 823050, 798847, 775029, 751365, 728432, 706262, 684204, 661902, 639697, 618175, 597896, 579474, 563247, 548765, 535145, 522146, 510513, 501125, 494040, 488442, 483328, 478233, 473547, 470148, 468522, 468270, 468551, 468867, 469211, 469731, 470585, 472017, 474173, 476897, 479951, 483291, 486810, 490003, 492424, 494389, 496707, 499671, 502797, 505696, 508694, 512353, 516783, 521695, 526867, 532265, 537958, 544190]
62269E44190P255Q751J0469J2247J4149J6230J8490K1052K4152K7827L1856L6110
62257G72778M0700M5723N0984N6078O0587O4081O6189O6807O6104O4034N9910
62246A413975N2883M2963L1357J9565Q384k094j1909k1045k9638l7724m4855n0481
62234A371381n4757n8316o1092o2093o0739n7735n4129n0135m5646m1287l7913
62223G87539l5229l2001k7769k3467k0132j7728j5631j3629j1936j0669r740r040
62211E60568q375p495o466n774n754o126o328o125n590m756l624k503j888j836
62197D87928j707q07P91K295L118L482L987M858N968P278Q742R903J0293J0327
62183E56456J0967J2285J3112J2597J1396J0702J0757J1004J1158J1264J1164
$$ y = [544190, 551445, 560196, 570665, 582912, 597061, 613291, 631781, 652833, 676985, 704812, 736668, 772778, 813478, 859201, 910185, 966263, 1026850, 1090931, 1157120, 1223927, 1290031, 1354065, 1413975, 1466858, 1509821, 1541178, 1560743, 1569127, 1567033, 1555124, 1534079, 1504441, 1466717, 1421862, 1371381, 1316624, 1258308, 1197216, 1135123, 1074384, 1016649, 962520, 912385, 866739, 825452, 787539, 752310, 720309, 692540, 669073, 648941, 631213, 615582, 601953, 590017, 579348, 569608, 560568, 552193, 544698, 538232, 532458, 526704, 520578, 514250, 508125, 502535, 497779, 494155, 491652, 489764, 487928, 486221, 485414, 486205, 488500, 491618, 495100, 499087, 503945, 509913, 517191, 525933, 535836, 546129, 556456, 567423, 579708, 592820, 605417, 616813, 627515, 638272, 649276, 660434, 671698, 682862]
62172F82862J0791J0750J1741J3629J5890J8646K2407K6990L1682L6287M1040
62161I22715M5521M8691N0026M9717M7755M3830L8112L1142K2921J3304L363m972
62149A312125j1032j6012k1019k5764k9691l3141l6468l9025l9963l9320l7547
62138I83143l4664l0694k6308k2169j8224j4362j1165r214q117p077n947n001
62126G90201m152l224k547k533k962l417m046n064n903n748m729l729l034j991
62112G37122p6K324M386N720O723Q130J0085J1477J0679P334K939o56k850m006
62098G99331m230l312j547P4M92q85l841p159r288r708r192q339o634l619j30
62083G32013K667M841P278J0122J2839J5333J7895K0228K1786K2980K4829K7393
$$ y = [682862, 693653, 704403, 716144, 729773, 745663, 764309, 786716, 813706, 845388, 881675, 922715, 968236, 1016927, 1066953, 1116670, 1164425, 1208255, 1246367, 1277509, 1300430, 1313734, 1317097, 1312125, 1301093, 1285081, 1264062, 1238298, 1208607, 1175466, 1138998, 1099973, 1060010, 1020690, 983143, 948479, 917785, 891477, 869308, 851084, 836722, 825557, 816343, 808226, 801149, 795202, 790201, 786049, 782825, 780278, 777745, 774783, 771366, 767320, 762256, 756353, 750605, 745876, 742147, 739113, 737122, 737046, 739370, 743756, 749476, 756199, 764329, 774414, 785891, 796570, 803904, 806843, 806187, 803337, 799331, 795101, 791789, 790242, 790316, 790808, 789923, 786082, 778923, 769635, 759927, 750735, 742396, 735762, 732143, 732013, 734680, 739521, 746799, 756921, 769760, 785093, 802988, 823216, 845002, 867982, 892811, 920204]
62071I20204K9651L1059L2072L3005L3515L3509L3508L3730L3699L3295L3238
62060A280485L3996L4891L4770L3108K9974K5472J9696J2956N683j627q365j4079
62048A486960j8979k3649k8239l2372l5836l8795m1254m2963m3978m4607m4699
62037A091589m3728m1769l9644l7735l5402l2069k8221k4835k2315k0425j8853
62026G46593j7297j5413j3199j1143r685q766q181p979q140q296q182q080q370
62013F13862q895r124q816q124p284o395n464m434l303k242j383m71Q51K383L467
61998E54628L906M222M778N195M954M065K754R97j032k550k908k619k967m538
61984E68885o629q132q680q799r207j0026j0653j0431r446q460p940p522o607
$$ y = [920204, 949855, 980914, 1012986, 1045991, 1079506, 1113015, 1146523, 1180253, 1213952, 1247247, 1280485, 1314481, 1349372, 1384142, 1417250, 1447224, 1472696, 1492392, 1505348, 1511031, 1509404, 1501039, 1486960, 1467981, 1444332, 1416093, 1383721, 1347885, 1309090, 1267836, 1224873, 1180895, 1136288, 1091589, 1047861, 1006092, 966448, 928713, 893311, 861242, 833021, 808186, 785871, 765446, 746593, 729296, 713883, 700684, 689541, 679856, 671090, 662909, 654930, 646790, 638494, 630312, 622232, 613862, 604967, 595843, 587027, 578903, 571619, 565224, 559760, 555326, 552023, 549781, 548398, 547927, 548778, 551161, 554628, 558534, 562756, 567534, 572729, 577683, 581748, 584502, 585499, 584467, 581917, 579009, 576390, 573423, 568885, 562256, 554124, 545444, 536645, 527438, 517412, 506759, 496328, 486882, 478422, 470482, 462960, 456353]
61971D56353n227l958l151k610j975j174m68j72l09n10l53J80P80J341K071L039
61955D43857L928M439M628M688M717M880N432O320P146P744Q487R726J1261J2738
61941E39991J4184J5764J7275J8445J9447K0657K2055K3369K4650K6099K7300
61930G69236K7327K5771K3294K0811J8566J6188J3412J0403P461M692J941j036
61918I38066m410q037j1344j3512j4029j3150j1637r844p288l427J269N628R160
61905H57445J2465J5972J8947K0363K0195J9118J7189J3830R092M044m90m830
61893A003340r632j4666j8969k1940k3728k4651k4783k4197k3244k2388k1808
61882G73334k1226k0148j8375j6375j4965j4455j4267j3644j2501j1292j0155
$$ y = [456353, 451126, 447168, 444017, 441407, 439432, 438258, 437790, 437618, 437309, 436799, 436446, 436626, 437406, 438747, 440818, 443857, 447785, 452224, 456852, 461540, 466257, 471137, 476569, 482889, 490035, 497779, 506266, 515992, 527253, 539991, 554175, 569939, 587214, 605659, 625106, 645763, 667818, 691187, 715837, 741936, 769236, 796563, 822334, 845628, 866439, 885005, 901193, 914605, 925008, 932469, 937161, 939102, 938066, 933656, 925619, 914275, 900763, 886734, 873584, 861947, 852103, 844815, 841388, 842657, 848285, 857445, 869910, 885882, 904829, 925192, 945387, 964505, 981694, 995524, 1004616, 1008660, 1008170, 1003340, 993708, 979042, 960073, 938133, 914405, 889754, 864971, 840774, 817530, 795142, 773334, 752108, 731960, 713585, 697210, 682245, 667790, 653523, 639879, 627378, 616086, 605931]
61871F05931q748p004n441m414l418j681P33K852L861L986M235N468P675R997
61857F14032J1603J2730J4661J8218K2555K6051K8331L0572L3636L6831L9032
61846H88252M0278M1418M2550M2815M1624L9303L6364L2771K8140K2224J5147
61835A270886P519L95n401j0029j4190j7835j9802j9023j5657j0780n356J21N378
61822A166226J0175J4328J7551J9388J9482J7745J4174Q716J591o507j4760k2602
61810A245507k9515l4906l8532m0917m2781m4100m4188m2765m0492l8280l6342
61799H12689l4215l1512k8327k5030k1910j9104j6615j4377j2375j0760r696r055
61787E79713q438p675p084o964o946o287m856l451k936l366m088m492m319l583
$$ y = [605931, 597183, 590179, 584738, 580324, 576906, 575225, 575958, 578810, 582671, 586657, 590892, 596360, 604035, 614032, 625635, 638365, 653026, 671244, 693799, 719850, 748181, 778753, 812389, 849220, 888252, 928530, 969948, 1012498, 1055313, 1096937, 1136240, 1172604, 1205375, 1233515, 1255739, 1270886, 1278405, 1278800, 1273399, 1263370, 1249180, 1231345, 1211543, 1192520, 1176863, 1166083, 1160727, 1160848, 1166226, 1176401, 1190729, 1208280, 1227668, 1247150, 1264895, 1279069, 1287785, 1289376, 1282869, 1268109, 1245507, 1215992, 1181086, 1142554, 1101637, 1058856, 1014756, 970568, 927803, 887311, 849031, 812689, 778474, 746962, 718635, 693605, 671695, 652591, 635976, 621599, 609224, 598464, 588768, 579713, 571275, 563600, 556516, 549552, 542606, 536319, 531463, 528012, 525076, 521710, 517622, 513130, 508811, 505228]
61773E05228k548j695j389j520j680j608j307q49k70M14J221K093K714K746K400
61758E03950K408L100L896M133L948L867L846L474K894K704K936K916K293J539
61744E47904J203J239J287J139P27J32k32N9P88J288J383J592K185K663K631K523
61728E68511K970L864M560M726M518M171L861L793M005M198M006L388K572J760
61714F20903J073N83K64L0j31l18r18k207l752m780n226n810o758p259o621n341
61698E73732m394l966l619l299l359l707l775l376k984k957l023k780k397k443
61684E27653l120l831l710k631j514j345k061k712k744k427j989j158R2J039J136
61669E00678Q09P05O28O9n63k71J035K230K327J502O19L38Q21J866K967L597L588
$$ y = [505228, 502680, 500985, 499596, 498076, 496396, 494788, 493481, 492632, 492362, 492776, 493997, 496090, 498804, 501550, 503950, 506358, 509458, 513354, 517487, 521435, 525302, 529148, 532622, 535516, 538220, 541156, 544072, 546365, 547904, 549107, 550346, 551633, 552772, 553499, 553631, 553399, 553458, 554246, 555534, 556917, 558509, 560694, 563357, 565988, 568511, 571481, 575345, 579905, 584631, 589149, 593320, 597181, 600974, 604979, 609177, 613183, 616571, 619143, 620903, 621976, 622559, 622823, 622853, 622722, 622404, 621486, 619279, 615527, 610747, 605521, 599711, 592953, 585694, 579073, 573732, 569338, 565372, 561753, 558454, 555095, 551388, 547613, 544237, 541253, 538296, 535273, 532493, 530096, 527653, 524533, 520702, 516992, 514361, 512847, 511502, 509441, 506729, 503985, 501558, 499569, 498411, 498503, 499542, 500678, 501487, 502192, 502820, 502889, 502326, 502055, 503090, 505320, 507647, 509149, 509768, 510106, 510927, 512793, 515760, 519357, 522945]
61652E22945L141K545K128K260K958L592L503K900K602K919L361L523L627L900
61638E65904L968L366K257J236N29j79j200k428l552m440n205n938o544o847o754
61623E34173o186n062l574k385k138k666l086k802k040j198k62P58J303Q12m90
61608E05157j934l269m599n680o066n926o012o633p252p277o782o207n732n201
61594D26587m382l241k150j828k660m048m897m735m048l413k871k343k059k276
61580C81636k860l450l748l525k679j602j086j514k365k842k760k465k152j710
61566C46878j167q43r22j133j031m68K61P20P30M98L31K30l0m38n54LR78J659
61548C45702J632J150P49N86L94o4o22q88o74k25Q3K13N91J602K968L818L586
$$ y = [522945, 526086, 528631, 530759, 533019, 535977, 539569, 543072, 545972, 548574, 551493, 554854, 558377, 562004, 565904, 569872, 573238, 575495, 576731, 577260, 577081, 575881, 573453, 569901, 565461, 560256, 554318, 547774, 540927, 534173, 527987, 522925, 519351, 516966, 514828, 512162, 509076, 506274, 504234, 503036, 502774, 503532, 504835, 505647, 505157, 503223, 499954, 495355, 489675, 483609, 477683, 471671, 465038, 457786, 450509, 443727, 437520, 431788, 426587, 422205, 418964, 416814, 414986, 412326, 408278, 403381, 398646, 394598, 391185, 388314, 385971, 383912, 381636, 378776, 375326, 371578, 368053, 365374, 363772, 362686, 361172, 358807, 355965, 353205, 350740, 348588, 346878, 345711, 344868, 343946, 342813, 341782, 341314, 341575, 342295, 343025, 343523, 343854, 344084, 344054, 343616, 343062, 343065, 344043, 345702, 347334, 348484, 349233, 349819, 350213, 350149, 349527, 348639, 347965, 347740, 347823, 348036, 348627, 350229, 353197, 357015, 360601]
61531C60601K719K204K356K472J845O98k06o03q91j421k179l046l903m443m373
61516C51830l875l389k901j986o63M07P48N48J10n71j380j859j783j473j132m94
61500C32137M33R28M50n33j217j490j628j517r94m84m75n84j10P14J016O69L74
61483C27689L47Pp44r39J48J795K597K060R36J80K1M4j46m57n87m95m09l07R5
61464C31835O96R12N27J20J33J62k43o52n11k18m36q18n51J30K20l75p48n20k30
61445C29433k1O56J713K142J639J209J589K204K400K570L185L720L597L313L622
61430C62971M188M106L278K339J665J310J494K259K946K894K369K094K210K485
61416C98608L056M006M578L874K240R17L68j45j193k390l087l116k698k249k408
$$ y = [360601, 363320, 365524, 367880, 370352, 372197, 372895, 372689, 372086, 371195, 369774, 367595, 364549, 360646, 356203, 351830, 347955, 344566, 341665, 339679, 339016, 339423, 340171, 340719, 340829, 340258, 338878, 337019, 335236, 333763, 332631, 332137, 332570, 333498, 333948, 333415, 332198, 330708, 329080, 327563, 326569, 326085, 325610, 325026, 324916, 325630, 326646, 327315, 327689, 328036, 328043, 327299, 326360, 326508, 328303, 330900, 332960, 333896, 334076, 334097, 334141, 333995, 333538, 332951, 332456, 332047, 331740, 331835, 332531, 333443, 333970, 334090, 334223, 334385, 334142, 333490, 332979, 332761, 332325, 331507, 330956, 331086, 331306, 330931, 330183, 329663, 329433, 329412, 330068, 331781, 333923, 335562, 336771, 338360, 340564, 342964, 345534, 348719, 352439, 356036, 359349, 362971, 367159, 371265, 374543, 376882, 378547, 379857, 381351, 383610, 386556, 389450, 391819, 393913, 396123, 398608, 401664, 405670, 410248, 414122, 416362, 417279, 417647, 417502, 416309, 413919, 410832, 407716, 405018, 402769, 400361]
61401D00361l462m588m434k805j076o57j491k491k880k660k199j825j655j441
61387C66697p65L17J104J034N06M75J225J938J728P83J76N34J288J475R54L81
61371C79850K04J96J28K21O66J217J631K090K705L054K762K221K073K188J959
61356D03165J499J748L220N283O925P777Q123Q346Q728R410J0260J0954J1421
61343D96859J1900J2443J2614J2023J0896R776Q768P499N775L944K483J479O86
61330E97145o5p41j388k270l581n081o244o726o548n917n021m100l432l147l125
61315E39759l185l177k896k121r05L36J195J661K038K630L582M824O058O912P334
61300E64045P720Q509R694J0779J1166J0451Q611N994L087K75k206m184n646o797
$$ y = [400361, 396899, 392311, 387877, 385072, 383996, 383339, 381848, 379357, 376477, 373817, 371618, 369793, 368138, 366697, 365932, 366249, 367353, 368387, 368893, 369368, 370593, 372531, 374259, 375042, 375218, 375752, 377040, 378515, 379469, 379850, 380054, 380250, 380378, 380599, 381265, 382482, 384113, 386203, 388908, 391962, 394724, 396945, 399018, 401206, 403165, 404664, 406412, 409632, 414915, 421840, 429617, 437740, 446086, 454814, 464224, 474484, 485438, 496859, 508759, 521202, 533816, 545839, 556735, 566511, 575279, 582778, 588553, 592497, 594980, 596459, 597145, 597080, 596339, 594951, 592681, 589100, 584019, 577775, 571049, 564501, 558584, 553563, 549463, 546031, 542884, 539759, 536574, 533397, 530501, 528380, 527475, 527811, 529006, 530667, 532705, 535335, 538917, 543741, 549799, 556711, 564045, 571765, 580274, 589968, 600747, 611913, 622364, 630975, 636969, 640056, 640331, 638125, 633941, 628295, 621498]
61286F21498p688p951p319o359o019o311o142m728k621q31L81J347K146K639L048
61271E75090L719M521N108N606O408P398Q064Q357Q752R404R910J0001R928J0016
61257F82282J0366J1101J2312J3655J4482J4632J4504J4203J3174J1061Q274N314
61245H25360K126j318m327o221p409q846j0495j1256j0646r670r454r659q993
61232G29192p055m892l690l548l761l824l715l469k967k118r53M79K063L419M044
61217F99205L744K855J903J157O14L20N00J265K218K553J811M65n16p29o67q31
61201G15867r33l17J144L011M853O479P776Q849J0278J2613J5582J8254K0006
61188H23462K0988K1573K1864K1693K0750J8746J5938J3392J1992J1316J0137
$$ y = [621498, 613810, 605859, 598540, 592181, 586162, 579851, 573709, 568981, 566360, 565529, 565910, 567257, 569403, 572042, 575090, 578809, 583330, 588438, 594044, 600452, 607850, 615914, 624271, 633023, 642427, 652337, 662338, 672266, 682282, 692648, 703749, 716061, 729716, 744198, 758830, 773334, 787537, 800711, 811772, 820046, 825360, 827486, 826168, 821841, 815620, 808211, 799365, 788870, 777614, 766968, 757298, 747844, 738185, 729192, 722137, 717245, 713555, 710007, 706246, 702422, 698707, 695238, 692271, 690153, 689200, 689679, 691742, 695161, 699205, 702949, 705804, 707707, 708864, 709478, 709798, 710298, 711563, 713781, 716334, 718145, 718610, 718094, 717365, 716698, 715867, 714934, 714617, 715761, 718772, 723625, 730104, 737880, 746729, 757007, 769620, 785202, 803456, 823462, 844450, 866023, 887887, 909580, 930330, 949076, 965014, 978406, 990398, 1001714, 1011851]
61177A011851Q198O551N967N889N353M150K543N60j772m005n724p051q301r500
61163A014709j0658j2092j3988j6045j7908j9494k0615k0820k0064j8908j7644
61152H26473j5926j3741j1889j0766r486p129m273k231j287o44K15J162K003K398
61138G54879J483j214m666p180q300q861r286q979p496n213k600J96K815M714
61124G00292O082P852J0431J3113J5121J6532J7864J9325K0833K2304K3615K4707
61112H98071K5806K7075K8041K8004K7079K6107K5492K4786K3608K2112K0332
61101A176513J7912J4922J2206J0388R006P078M129K88m150q801j3163j6930k0236
61088A189162k3329k6174k8428k9718k9898k9335k8726k8339k7591k5815k3237
$$ y = [1011851, 1020049, 1026600, 1032567, 1038456, 1043809, 1047959, 1050502, 1051062, 1049290, 1045285, 1039561, 1032510, 1024209, 1014709, 1004051, 991959, 977971, 961926, 944018, 924524, 903909, 883089, 863025, 844117, 826473, 810547, 796806, 784917, 774151, 764665, 757536, 753263, 751032, 749745, 749101, 749316, 750478, 752481, 754879, 756362, 755148, 750482, 743302, 735002, 726141, 716855, 707876, 700380, 695167, 692567, 692763, 695578, 700292, 706374, 714226, 724657, 737770, 752891, 769423, 787287, 806612, 827445, 849749, 873364, 898071, 923877, 950952, 978993, 1006997, 1034076, 1060183, 1085675, 1110461, 1134069, 1156181, 1176513, 1194425, 1209347, 1221553, 1231941, 1240947, 1248025, 1252154, 1252442, 1248292, 1239491, 1226328, 1209398, 1189162, 1165833, 1139659, 1111231, 1081513, 1051615, 1022280, 993554, 965215, 937624, 911809, 888572]
61077H88572k0647j8387j6339j4743j4087j4111j3714j2138r668p056m839l299
61065G39544k497k157j950j791j454l10J755L606M075L670L910N124O256O861
61051G64642P724R179J0309J0474J0461J1343J3169J5412J7778K0011K1798K3397
61039I35697K5473K7854K9442K9826K9915L0498L1290L1974L2903L4075L4667
61028A273614L4503L4787L6421L8583M0084M1117M2665M5069M8185N2008N6154
61017A743190N9579O1806O3553O5410O7189O9507P4550Q3810R6267J10271J25932
61006B621064J44089J64362J86311K11704K43826K85707L40841M14248N10157
60997E122309O29311P70596R34005J119471J324399J545789J783507K038418K310320
$$ y = [888572, 867925, 849538, 833199, 818456, 804369, 790258, 776544, 764406, 754738, 747682, 742843, 739544, 737047, 734890, 732940, 731149, 729695, 729385, 731140, 734746, 738821, 742491, 746401, 751525, 757781, 764642, 772366, 781545, 791854, 802328, 812789, 824132, 837301, 852713, 870491, 890502, 912300, 935697, 961170, 989024, 1018466, 1048292, 1078207, 1108705, 1139995, 1171969, 1204872, 1238947, 1273614, 1308117, 1342904, 1379325, 1417908, 1457992, 1499109, 1541774, 1586843, 1635028, 1687036, 1743190, 1802769, 1864575, 1928128, 1993538, 2060727, 2130234, 2204784, 2288594, 2384861, 2495132, 2621064, 2765153, 2929515, 3115826, 3327530, 3571356, 3857063, 4197904, 4612152, 5122309, 5751620, 6522216, 7456221, 8575692, 9900091, 11445880, 13229387, 15267805, 17578125]
60988A7578125K600747K905444L179511L303680L117442K534751J651093P22684
60980C7593477J4548l47543l95617k33097K8673K52649K57351j09366q44531j751495
60970C4465049k552355l055073l230324l161352k950626k669863k361080k050046
60962A2434330j752063j475997j229267j017754q41643o95625n74226m74747l95352
60953C977656l33181k85006k47663k17542j91572j68941j50282j35020j21117
60944B127332j07481r4890q4218p5361o8361o4056o2758o3288o3966o3830o2611
60933A316512o0354n7434n4290n0814m6687m2342l8768l6161l3667l0718k7794
60922H37483k5481k3519k1349j8986j6919j5440j4468j3648j2521j0880r099p680
$$ y = [17578125, 20178872, 23084316, 26263827, 29567507, 32684949, 35219700, 36870793, 37593477, 37608025, 37260482, 36864865, 36631768, 36660441, 36913090, 37170441, 37061075, 36216544, 34465049, 31912694, 28857621, 25627297, 22465945, 19515319, 16845456, 14484376, 12434330, 10682267, 9206270, 7977003, 6959249, 6117606, 5421981, 4847755, 4373008, 3977656, 3644475, 3359469, 3111806, 2894264, 2702692, 2533751, 2383469, 2248449, 2127332, 2019851, 1924961, 1840743, 1765382, 1697021, 1632965, 1570207, 1506919, 1442953, 1379123, 1316512, 1256158, 1198724, 1144434, 1093620, 1046933, 1004591, 965823, 929662, 895995, 865277, 837483, 812002, 788483, 767134, 748148, 731229, 715789, 701321, 687673, 675152, 664272, 655173, 647493]
60910F47493o513n038l189j586o59j70K95Q55J547K388L031K938K190J539J349
60895F46470J031j23j948l742n111o087o685o910p018p347p895q372q608q673
60881E68982q688q729q864r078r220r147q903q593q157p409o291n040m093l806
60867D62964m090m324l730k048J65J966K826L047L385M232N237N882O194O562
60853D88268O943O847O308O119O713P289O833N613M914N366O274O611O011M737
60839E74846L224J883P39p73l108n601o863o419n274m578m421m389m535n058n522
60824E24151n308m706m719n696o822p166o753o301o235o285o016n470n109n189
60810D42376n383n262m932m833m904m496l337k035j332j216j235j265j398j364
$$ y = [647493, 640980, 635942, 632753, 631167, 630508, 630338, 630633, 631488, 633035, 635423, 638454, 641392, 643582, 645121, 646470, 647501, 647378, 645430, 641688, 636577, 630490, 623805, 616895, 609877, 602530, 594635, 586263, 577655, 568982, 560294, 551565, 542701, 533623, 524403, 515256, 506353, 497760, 489603, 482194, 475903, 470863, 466770, 462964, 458874, 454550, 450820, 448772, 448937, 450903, 453729, 456776, 460161, 464393, 469630, 475512, 481706, 488268, 495211, 502058, 508366, 514485, 521198, 528487, 535320, 540933, 545847, 551213, 557487, 564098, 570109, 574846, 578070, 579953, 580692, 579919, 576811, 571210, 564347, 557928, 552654, 548076, 543655, 539266, 534731, 529673, 524151, 518843, 514137, 509418, 503722, 496900, 489734, 482981, 476680, 470445, 464160, 458144, 452674, 447565, 442376, 436993, 431731, 426799, 421966, 417062, 412566, 409229, 407194, 405862, 404646, 403411, 402146, 400748, 399384]
60796C99384p73J42P27Q35R67J398J794J921K108K634L162L286L291L814M908
60781D29598N869O054N540M934M787N144N550N521N129M975N441O163O503O326
60767E07534O015N811N613N348N135M980M751M555M735N242N440M844L782K942
60753E76727K584K506K584K771K775K263J445R12R04J167J624K497L562L946L211
60738F11478K140J868K507L291L867M673O036P612R022J0427J2099J3814J5100
60725G03934J5934J6717J7653J8475J8807J8623J8265J8064J7961J7409J5755
60714H97597J2864R286N786K702j79l251o639j0051j2969j5138j6807j8372j9772
60701H25057k0516k0476k0224k0340k0645k0554j9977j9345j8857j8270j7549
$$ y = [399384, 398611, 398753, 399480, 400315, 401282, 402680, 404474, 406395, 408503, 411137, 414299, 417585, 420876, 424690, 429598, 435467, 441521, 447061, 451995, 456782, 461926, 467476, 472997, 478126, 483101, 488542, 494705, 501208, 507534, 513549, 519360, 524973, 530321, 535456, 540436, 545187, 549742, 554477, 559719, 565159, 570003, 573785, 576727, 579311, 581817, 584401, 587172, 589947, 592210, 593655, 594567, 595471, 596638, 598262, 600759, 604321, 608267, 611478, 613618, 615486, 617993, 621284, 625151, 629824, 635860, 643472, 652494, 662921, 675020, 688834, 703934, 719868, 736585, 754238, 772713, 791520, 810143, 828408, 846472, 864433, 881842, 897597, 910461, 919747, 925533, 928235, 928056, 924805, 918166, 908115, 895146, 880008, 863201, 844829, 825057, 804541, 784065, 763841, 743501, 722856, 702302, 682325, 662980, 644123, 625853, 608304]
60690F08304j7095j6970j6497j5119j3303j1959j1143j0017q146o161m895m412
60678D72587m274m287m461m458l742k305p98J74N56N27J33n71j256j555j474j366
60662D43430j574k189l014l617l557k744j593o58j99j20j63J8P01J757K661L034
60646D32173L091L213L326L176L054L548M485M760L701K033J027R64J106R81R91
60631D71629J592K475K938K795K494K400K313J810Q73n1n98r42j547k528l487
60616D82166m053m330m635m911m754l974k929k175j936k012k120k188k276k284
60602D37589j936j149l46j10m58q06p41n68p50j112j126p46m60m69m71l95o44
60585D25302j246j368k84J451K611K864L033L714M410M394L828L485L728M347
$$ y = [608304, 591209, 574239, 557742, 542623, 529320, 517361, 506218, 496201, 488055, 481894, 476999, 472587, 468313, 464026, 459565, 455107, 451365, 449060, 448262, 448436, 448992, 449519, 449652, 449081, 447825, 446270, 444796, 443430, 441856, 439667, 436653, 433036, 429479, 426735, 425142, 424484, 424285, 424165, 424002, 424020, 424721, 426478, 429139, 432173, 435264, 438477, 441803, 444979, 448033, 451581, 456066, 460826, 464527, 466560, 467587, 468551, 469657, 470638, 471629, 473221, 475696, 478634, 481429, 483923, 486323, 488636, 490446, 491319, 491268, 490670, 489728, 488181, 485653, 482166, 478113, 473783, 469148, 464237, 459483, 455509, 452580, 450405, 448469, 446457, 444337, 442149, 439873, 437589, 435653, 434504, 434158, 434048, 433590, 432784, 432043, 431475, 430725, 429613, 428487, 427741, 427281, 426812, 426341, 425946, 425302, 424056, 422688, 422404, 423855, 426466, 429330, 432363, 436077, 440487, 444881, 448709, 452194, 455922, 460269]
60571D60269N181O302P601Q769R896J1540J3976J6743J9251K1472K3667K5732
60559F30399K7374K8583K9266K8477K4952J8699J1331M382k042q325j3724j6790
60547G62582j7234j6345j5288j3828j1095o984k233K492P016J1449J5942K0547
60535G37021K5001K8836L1877L4405L6418L7040L5132L0455K3820J6204Q137J2
60523A044358p475j3392j7035j8277j7734j6403j4967j3459j1746j0193r365r182
60511H85130q797p509n446l189j034J118L376N640P724R601J1564J4226J8203
60498I30607K3702L0462L8052M6177N4699O3596P2863Q2263R1107R8540J04066
60487A636134J07512J08327J05298R7346Q4527O8002M8981K7985N210j8675m2324
$$ y = [460269, 465450, 471752, 479353, 488122, 498018, 509558, 523534, 540277, 559528, 581000, 604667, 630399, 657773, 686356, 715622, 744099, 769051, 787750, 799081, 803463, 801421, 793096, 779372, 762582, 745348, 729003, 713715, 699887, 688792, 681808, 679575, 682067, 689083, 700532, 716474, 737021, 762022, 790858, 822735, 857140, 893558, 930598, 965730, 996185, 1020005, 1036209, 1044346, 1044358, 1036883, 1023491, 1006456, 988179, 970445, 954042, 939075, 925616, 913870, 903677, 894312, 885130, 876333, 868824, 863378, 860189, 859155, 860273, 863649, 869289, 877013, 886614, 898178, 912404, 930607, 954309, 984771, 1022823, 1069000, 1123699, 1187295, 1260158, 1342421, 1433528, 1532068, 1636134, 1743646, 1851973, 1957271, 2054617, 2139144, 2207146, 2256127, 2284112, 2289322, 2270647, 2228323]
60476B228323o4297q3556r9374j10976j17749j19823j18100j13501j06412r7142
60466A197393q6642p6325o7166n9294n2440m6450m1212l6481l2029k7851k4109
60455F47394k0904j8204j5928j4082j2744j1877j1105r970q525p399o992o867
60443E02797o352n448m637l974l098k113j692k033k418k121j202m7J232K447K898
60428D74239K041L69r72j407j338j426j979k916l949m686m864m539l904l043k112
60413D39514j475j310j197n51M96J107P83L5j83M20J191J348Q72M42N35Q44P79
60396D43650K76k44o13j032j411j181o8J353K285K572K592K562K338J764R10Q4
60380D55837k69M6N07K26q89j818j620n92K60N46O71R33J148J146J080J167J465
$$ y = [2228323, 2164026, 2080470, 1981096, 1870120, 1752371, 1632548, 1514448, 1400947, 1294535, 1197393, 1110751, 1034426, 967260, 907966, 855526, 809076, 767864, 731383, 699354, 671503, 647394, 626490, 608286, 592358, 578276, 565532, 553655, 542550, 532580, 524055, 516656, 509664, 502797, 496445, 490997, 486360, 482386, 479288, 477175, 475483, 473450, 471032, 468911, 467709, 467662, 468894, 471341, 474239, 476280, 476649, 475677, 474270, 472932, 471506, 469527, 466611, 462662, 457976, 453112, 448573, 444669, 441626, 439514, 438039, 436729, 435532, 434981, 435477, 436584, 437367, 437402, 437219, 437639, 438830, 440178, 441050, 441492, 442027, 442871, 443650, 443926, 443682, 443069, 442037, 440626, 439445, 439377, 440730, 443015, 445587, 448179, 450741, 453079, 454843, 455753, 455837, 455568, 455614, 456121, 456347, 455458, 453640, 452020, 451428, 451688, 452234, 452905, 453838, 454986, 456132, 457212, 458379, 459844]
60363D59844J906K233K085J412O64K72K01K95O49J195J397R99O19Q98J404J276
60347D77349O88O83J586K621L163L417L620L480K833K099J706J580J537J578J580
60332E09520J262P07L05jo86j659k040j386m66k55p23j099r11l07L31P20Q86J302
60314E05500K409L947N232O123O998P784P991P978Q969J1288J3628J5015J6390
60301F19252J9220K3344K7490L1229L4883L7761L8059L4729K8319J9875R999o63
60289I23497j1070k0328k7948l3311l5684l5189l3023l0287k7074k3097j8737
60278F27749j4925j2295j0820j0107r727r402r066q742q318p658o837o083n430
60265E08339m699l781k757j729q44l47l27m78m83m85p68j061p34K86J260J479
$$ y = [459844, 461750, 463983, 466068, 467480, 468144, 468416, 468617, 468912, 469561, 470756, 472153, 473152, 473771, 474669, 476073, 477349, 478037, 478720, 480306, 482927, 486090, 489507, 493127, 496607, 499440, 501539, 503245, 504825, 506362, 507940, 509520, 510782, 511489, 511794, 511793, 511107, 509448, 507408, 506022, 505556, 505301, 504578, 503479, 502568, 502261, 502592, 503312, 504198, 505500, 507909, 511856, 517088, 523211, 530209, 537993, 545984, 553962, 562931, 574219, 587847, 602862, 619252, 638472, 661816, 689306, 720535, 755418, 793179, 831238, 865967, 894286, 914161, 924160, 923497, 912427, 892099, 864151, 830840, 795156, 759967, 726944, 696657, 669583, 646486, 627749, 612824, 600529, 589709, 579602, 569875, 560473, 551407, 542665, 534347, 526689, 519852, 513769, 508339, 503640, 499859, 497102, 495373, 494529, 494182, 493855, 493377, 492894, 492409, 491641, 490580, 489846, 490132, 491392, 492871]
60249D92871R32J20m81o10k98J02L07M74R13J427J531J246J124J335J360Q76L21
60232E03550K42N09O75P14R49J492K141K740L256L634L827L811L458K606J469
60217E35073O63N61R07J306J734K247K590K589K622L146L897M161L713K963K276
60202E70448J697J421J762K525K936K562J836J304Q56J70m99o61m87o70j390k108
60186E81702k470k772l178l245k683k046j928j938j313l99m57j760k962k829j815
60171E49907j074o58K56J623K288J662O03J76K77J42l35n63k46K79O92J071J546
60154E57646K008K393K892L673M519N023N034M794M622M600M586M458M276M150
60140F14674M083L978L836L786L858L898L874M126N029O373P312P110N814M108
$$ y = [492871, 493803, 493923, 493442, 492832, 492534, 492636, 492943, 493417, 494330, 495757, 497288, 498534, 499658, 500993, 502353, 503229, 503550, 503792, 504301, 504976, 505690, 506639, 508131, 510272, 513012, 516268, 519902, 523729, 527540, 530998, 533604, 535073, 535736, 536297, 537204, 538510, 540244, 542491, 545081, 547670, 550292, 553438, 557335, 561496, 565209, 568172, 570448, 572145, 573566, 575328, 577853, 580789, 583351, 585187, 586491, 587347, 587517, 587018, 586357, 585870, 585200, 583810, 581702, 579232, 576460, 573282, 570037, 567354, 565308, 563380, 561442, 560129, 559730, 559273, 557513, 554551, 551722, 549907, 548833, 548175, 548431, 550054, 552342, 554004, 554607, 554783, 555060, 555202, 554867, 554304, 554058, 554337, 555029, 556100, 557646, 559654, 562047, 564939, 568612, 573131, 578154, 583188, 587982, 592604, 597204, 601790, 606248, 610524, 614674, 618757, 622735, 626571, 630357, 634215, 638113, 641987, 646113, 651142, 657515, 664827, 671937, 677751, 681859]
60126F81859K605J461M36q44k647m804o576p145o383m963l611k511j596j012r16
60111F43353r84o39K58J327K273L061L476L101K082J393J827K944L500K820J324
60096F71116j73j158j474j205q26j026j974k891k726j269O08J909K395K521K739
60081F66566L180L835M635N237N085L931K082J7k025l849n056n511n781o596p861
60066F57889q750q776q203p434o579n849n633n824n670m823m033m260n366o324
60052E70365o438n859n047m325l914l860l842l394k398j113J20J007J348J282
60038E33932J369K010K914L412L163K259R83k11p25m03J06M4n29j046j448k197
60022E43633l405m607n468o111o618o824o682o340n819n074m396m103l866l050
$$ y = [681859, 684464, 685925, 686361, 685517, 682870, 678066, 671490, 664345, 657962, 652999, 649388, 646877, 645281, 644269, 643353, 642369, 641730, 641988, 643315, 645588, 648649, 652125, 655226, 657308, 658701, 660528, 663472, 666972, 669792, 671116, 670943, 669785, 668311, 667106, 666280, 665254, 663280, 660389, 657663, 656394, 657002, 658911, 661306, 663827, 666566, 669746, 673581, 678216, 683453, 688538, 692469, 694551, 694568, 692543, 688694, 683638, 678127, 672346, 665750, 657889, 649139, 640363, 632160, 624726, 618147, 612298, 606665, 600841, 595171, 590348, 586315, 582055, 576689, 570365, 563927, 558068, 553021, 548696, 544782, 540922, 537080, 533686, 531288, 530175, 530295, 531302, 532650, 533932, 535301, 537311, 540225, 543637, 546800, 549059, 550042, 549831, 549106, 548703, 548809, 548853, 548324, 547278, 545830, 543633, 540228, 535621, 530153, 524042, 517424, 510600, 503918, 497578, 491759, 486685, 482289, 478186, 474320, 471270]
60008D71270j828j133j234j188j83J292K256K623L037L677M051L874L525L463
59994D93502L728M063M292M389M364M224M013L855L863L908L589K709J683J166
59980E43348J278J484J310P34j25j273k522l372l513l267l257l731m347m495l826
59965E14426k624j621j238j069m86M80J335J954K518K724K053R73P57J681K388
59950E24251J846Q89R42J879K401K123J880K072J966R40n54j744k460k889k986
59935E30556k649k131j785j643j533j404j293j194j158j331j624j611j016k01
59921E09983J41k00o77n77J55Q72R65N48L48Q66J821K486K433J901J515J700K310
59904E26590K750K570J980J599J691J906J888J805K095K864L896M911N586N554
$$ y = [471270, 469442, 468309, 467075, 465887, 465704, 466996, 469252, 471875, 474912, 478589, 482640, 486514, 490039, 493502, 497230, 501293, 505585, 509974, 514338, 518562, 522575, 526430, 530293, 534201, 537790, 540499, 542182, 543348, 544626, 546110, 547420, 548154, 548029, 546756, 544234, 540862, 537349, 534082, 530825, 527094, 522747, 518252, 514426, 511802, 510181, 508943, 507874, 507388, 507868, 509203, 511157, 513675, 516399, 518452, 519425, 520182, 521863, 524251, 526097, 526986, 527928, 529807, 532208, 534331, 536211, 538283, 540249, 541189, 540635, 538891, 536431, 533542, 530556, 527907, 525776, 523991, 522348, 520815, 519411, 518118, 516924, 515766, 514435, 512811, 511200, 510184, 509983, 510124, 509924, 509247, 508670, 508825, 509697, 510662, 511210, 511558, 512424, 514245, 516731, 519164, 521065, 522580, 524280, 526590, 529340, 531910, 533890, 535489, 537180, 539086, 540974, 542779, 544874, 547738, 551634, 556545, 562131, 567685]
59890E67685M799L954L748M205M692M736M403L910L291K601K119K162K803L805
59876F18913M702N003M525L597K714J963R88m64k204l812m975n597n806n883o061
59861F07603o252o204n823n188m300l117j841p94j6P47J560K196K628L213M074
59846E88486M731M804M770N535P235R066J0323J1185J2263J3698J4975J5365J4304
59833G16740J1618P749L779Q23o55q91l58M62R22K85j809n127r151j3366j7179
59818F93842j9877k0965k0491j8952j6979j5107j3493j1814r756p696o388n834
59806E26490n091l666k449k454l150l050j861q99j160k021k303j881j537j699
59792D93269k034k112j893j606j438j422j446j433j482j679j802j556j152j235
$$ y = [567685, 572484, 576438, 580186, 584391, 589083, 593819, 598222, 602132, 605423, 608024, 610143, 612305, 615108, 618913, 623615, 628618, 633143, 636740, 639454, 641417, 642405, 641941, 639737, 635925, 630950, 625353, 619547, 613664, 607603, 601351, 595147, 589324, 584136, 579836, 576719, 574878, 574084, 574068, 574815, 576375, 578571, 581199, 584412, 588486, 593217, 598021, 602791, 608326, 615561, 624627, 634950, 646135, 658398, 672096, 687071, 702436, 716740, 728358, 736107, 739886, 740709, 740054, 739163, 738805, 739267, 740189, 740474, 738665, 733538, 724387, 711021, 693842, 673965, 653000, 632509, 613557, 596578, 581471, 567978, 556164, 546408, 538712, 532324, 526490, 521399, 517733, 515284, 512830, 509680, 506630, 504769, 503870, 502710, 500689, 498386, 496505, 494968, 493269, 491235, 489123, 487230, 485624, 484186, 482764, 481318, 479885, 478403, 476724, 474922, 473366, 472214, 470979]
59778D70979k089l257m064m208l766k987k186j527q07J76J064J311J075J018J181
59763D51913Q92R8k61L05R98J065J060J835K961L374L105L121L670M003L783L598
59747D85520L835L998L575K816K231J878J543J149P23L46K41N74R78P87j44j183
59731E08867j697j644j364j089q53n83j78K62L48j10p28j081j392k006k403j662
59715D92687m1R52M81m82n59K55R97J311J628K043K022J453J135J751K810L137
59699E11580K358J398J361K225L023L201L228L626L937L339K029J148J256J579
59685E45288J144M2q77j152j037q77p24n29l32k20k71n19q78j155j257j315j528
59668E33803j954k516l066l468l751m109m517m475l517j978p29j6Q07K085L067
$$ y = [470979, 468890, 465633, 461569, 457361, 453595, 450608, 448422, 446895, 446088, 446264, 447328, 448639, 449714, 450732, 451913, 452805, 452903, 452642, 452947, 453945, 455010, 456070, 457905, 460866, 464240, 467345, 470466, 474136, 478139, 481922, 485520, 489355, 493353, 496928, 499744, 501975, 503853, 505396, 506545, 507268, 507614, 507855, 508429, 509407, 510194, 510050, 508867, 507170, 505526, 504162, 503073, 502220, 501637, 501459, 501721, 502069, 501959, 501231, 500150, 498758, 496752, 494349, 492687, 492646, 493598, 494079, 493597, 493038, 493293, 494290, 495601, 497229, 499272, 501294, 502747, 503882, 505633, 508443, 511580, 513938, 515336, 516697, 518922, 521945, 525146, 528374, 532000, 535937, 539276, 541305, 542453, 543709, 545288, 546432, 546474, 545597, 544445, 543408, 542531, 541807, 541278, 540946, 540726, 540455, 539936, 539058, 537903, 536646, 535331, 533803, 531849, 529333, 526267, 522799, 519048, 514939, 510422, 505947, 502430, 500452, 499723, 499707, 500514, 502599, 505666]
59653E05666K877J869J207J300J463J143P77J055J804K114J372j19j449j876j412
59638E17791p44n33p75j023j167j576k299k586j732j57Q65O46k82r80j095p97
59622E03556k54M20R73J222J302J371J269Q28K60j80p29j691k657k821k101j218
59606D99550o28p7N74R27P83N40M11N6n39n97K78J192J144N15L32N52K42p37j498
59587E03020j595j547j662j449o33J25J12m87j050j346j490j513j483j655k134
59572D85213k670l042l338l546l320k440j267m59l60p65j042n62O36J680J808
59557D66526J390J392J878J961J315P60Q99J197J044Q67J315K038K257K123K450
59542D89412L367M204M711N455O894Q743J0555J2261J4019J5894J7709J8606J6942
$$ y = [505666, 508543, 510412, 511619, 512919, 514382, 515525, 516302, 517357, 519161, 521275, 522647, 522528, 521079, 519203, 517791, 517047, 516514, 515739, 514716, 513549, 511973, 509674, 507088, 505356, 505199, 506064, 506710, 506428, 505448, 504353, 503556, 503302, 503722, 504695, 505917, 507219, 508590, 509859, 510687, 510947, 510767, 510038, 508347, 505690, 502869, 500768, 499550, 498922, 498845, 499419, 500346, 501129, 501669, 502080, 502136, 501597, 501000, 501278, 502470, 503614, 504129, 504461, 505013, 505255, 504518, 503020, 501425, 499878, 498216, 496767, 496134, 496259, 496371, 495884, 494834, 493488, 491998, 490485, 489002, 487347, 485213, 482543, 479501, 476163, 472617, 469297, 466857, 465590, 465131, 464771, 464006, 462964, 462402, 463038, 464718, 466526, 467916, 469308, 471186, 473147, 474462, 475222, 476121, 477318, 478362, 479229, 480544, 482582, 484839, 486962, 489412, 492779, 496983, 501694, 507149, 514043, 522786, 533341, 545602, 559621, 575515, 593224, 611830, 628772]
59529F28772J1548L595l535o913o476m419k675j506k89J255K862M169M843M574
59515F35805L357J778N06m54j662l381n244o917q546j0185j1238j1077r973q810
59501E63959q007p339o650o124n789n427n018m639l907k360n11L57j07p72o56
59486E07010k57m79r60n75Q08K178K844L073L259L359L336L443L756L961L906
59471E38662L898M192M539M437L600K135N71k90n5P08J023Q05J039K464M574O343
59455E78645P467Q388R425J0449J1357J2195J2823J2903J2461J2050J2106J2357
59443G12626J2088J0791Q288M543k11n163r216j1784j3095j3665j3734j3352j2688
59430F55428j1945j1114j0116r043q009o828n148k843j19K692N299P533R514J1578
$$ y = [628772, 640320, 643915, 640380, 633467, 626991, 622572, 619897, 618391, 618102, 619357, 622219, 626388, 631231, 635805, 639162, 640940, 641446, 640992, 639330, 635949, 630705, 623788, 615242, 605057, 593819, 582742, 572769, 563959, 555952, 548613, 541963, 535839, 530050, 524623, 519605, 514966, 511059, 508699, 508188, 508545, 508438, 507666, 507010, 506753, 506274, 505314, 504739, 505547, 507725, 510569, 513642, 516901, 520260, 523596, 527039, 530795, 534756, 538662, 542560, 546752, 551291, 555728, 559328, 561463, 562034, 561744, 561689, 562397, 563420, 564225, 565264, 567728, 572302, 578645, 586112, 594500, 603925, 614374, 625731, 637926, 650749, 663652, 676113, 688163, 700269, 712626, 724714, 735505, 743793, 748336, 748125, 742962, 733746, 721962, 708867, 695202, 681468, 668116, 655428, 643483, 632369, 622253, 613210, 605201, 598373, 593225, 590382, 590263, 592955, 598254, 605787, 615301, 626879]
59416F26879J3773J5666J6942J7894J8882J9665J9903K0076K0769K1020J8434
59405H29903J1643K061p282j4195j8107j9252j8055j5206j1456p194k762O96J264
59392G32058k322r308j7068k2711k4843k4058k1958j9675j7391j4974j2619j0640
59380E34491q986p392n818m451l345k312j179M1J187J993K208J844J330J228J743
59365E12582K579L239L386L018K445K157K575L686M875N326M986M876O027Q092
59351E69849R696J0338J1135J3157J5789J7577J8141J8294J8626J9069J9604K0292
59339G61567K0586J9818J8420J7424J6580J4304J0012N233J688o48k837n362q108
59326H68677j1024j3750j5336j5358j4766j4648j4729j4062j2659j1356j0469
$$ y = [626879, 640652, 656318, 673260, 691154, 710036, 729701, 749604, 769680, 790449, 811469, 829903, 841546, 843607, 836325, 822130, 804023, 784771, 766716, 751510, 740054, 732860, 730098, 730794, 732058, 729736, 720428, 703360, 680649, 655806, 631748, 609790, 590115, 572724, 557750, 545131, 534491, 525505, 518113, 512295, 507844, 504499, 502187, 501008, 501049, 502236, 504229, 506437, 508281, 509611, 510839, 512582, 515161, 518400, 521786, 524804, 527249, 529406, 531981, 535667, 540542, 545868, 550854, 555730, 561757, 569849, 579545, 589883, 601018, 614175, 629964, 647541, 665682, 683976, 702602, 721671, 741275, 761567, 782153, 801971, 820391, 837815, 854395, 868699, 878711, 883944, 885632, 884984, 882147, 876785, 868677, 857653, 843903, 828567, 813209, 798443, 783795, 769066, 755004, 742345, 730989, 720520]
59315G20520r658q948q729q838q565p633o483n557m882m267l453k276j108o60
59301F39463q91p62K71J340J656K047L708O122P834Q880J0666J3538J6309J8406
59287G28587K0659K3410K5423K5399K3141J8485J0719M12r435j5650j7838j7835
59275H15477j6801j4298j0025n017p07K368M566O380P970R178R736R604R032Q182
59261H35645O811M598J586j879n501r065j2246j4709j6306j7076j7141j6738j6161
59248G21818j5486j4528j3237j1894j0740r582q067o229m547l359k381q97J448
59235F22319M026N617N655M908M627N104N551N275M413L350K056M01j327k694
59221F69281l779n043o647q231r373r991j0239j0232r925r207q016o451m858l742
$$ y = [720520, 710862, 701914, 693185, 684347, 675782, 668149, 661666, 656109, 651227, 646960, 643507, 641231, 640123, 639463, 638572, 637810, 638081, 639421, 641077, 643124, 646832, 652954, 660788, 669668, 680334, 693872, 710181, 728587, 749246, 772656, 798079, 823478, 846619, 865104, 875823, 876235, 866800, 851150, 833312, 815477, 798676, 784378, 774353, 769336, 768629, 770997, 775563, 781943, 789913, 799091, 808827, 818431, 827463, 835645, 842456, 847054, 848640, 846761, 841260, 832195, 819949, 805240, 788934, 771858, 754717, 737979, 721818, 706332, 691804, 678567, 666673, 655933, 646351, 638284, 632055, 627508, 624149, 621768, 620871, 622319, 626345, 631962, 637617, 642525, 647152, 652256, 657807, 663082, 667495, 670845, 672901, 673302, 671975, 669281, 665502, 660459, 653812, 645581, 636208, 626217, 615978, 605746, 595821, 586614, 578598, 572147, 567289, 563547]
59207E63547l458l870m395m507m161l589k804j662l35O95J242J599J899J893J642
59192E43736J871L062M633N659O010O140O108N696N298N667O651P115O446N403
59178F19495N074N569O173O330O035N537N184N304N939O751P388P813Q161Q443
59164G09196Q558Q498Q458Q707R286R691R114P291M945L019J552k21k691n247
59150G80156p000p823q451r654j1358j2595j2408j0916r207q095p458o897o474
59137F61820o269n806m703l459k799k486j657k36R68J518J834K350K976L599M366
59122F52016N313O297P456R040J0808J2264J3508J4988J6376J6672J5697J4505
59110G94940J3860J3223J1773R748Q017O909O016M822L021O74j576k868l081l075
$$ y = [563547, 560089, 556219, 551824, 547317, 543156, 539567, 536763, 535101, 534766, 535461, 536703, 538302, 540201, 542094, 543736, 545607, 548669, 553302, 558961, 564971, 571111, 577219, 582915, 588213, 593880, 600531, 607646, 614092, 619495, 624569, 630138, 636311, 642641, 648676, 654213, 659397, 664701, 670640, 677391, 684779, 692592, 700753, 709196, 717754, 726252, 734710, 743417, 752703, 762394, 771508, 778799, 783744, 786763, 788315, 788094, 785403, 780156, 773156, 765333, 756882, 747228, 735870, 723275, 710867, 699951, 690744, 682649, 675191, 668294, 661820, 655551, 649745, 645042, 641583, 638784, 636298, 634641, 634405, 635373, 636891, 638725, 641075, 644051, 647650, 652016, 657329, 663626, 671082, 680122, 690930, 703194, 716702, 731690, 748066, 764738, 780435, 794940, 808800, 822023, 833796, 843544, 851561, 858470, 864486, 869308, 872329, 873003, 871427, 868559, 865478, 862403]
59096H62403l689m848n920o497o556o313o168o388o609o176n142m344m291m614
59082G84848m988n783p346r209j0604j1398j1922j2301j2400j2185j1698j0906
59070F64108r850q713p584o502n774n731o029n796m690l306k280j643j232j100
59056E93878j135j020q79j347k517l481l416k594j876j737k137k748k964k292
59042E63735j112l69j86L18J446K148J646Q42J148K546L811M259M282M459M942
59027E93915N618O223O521O794P716R280J0506J0732J0604J1028J1770J1937J1316
59014G13960J0276Q822O667M052J590m47k027k847k740k209j809j323k85J090
59000G32770K324L619N360P033P720P473P154P000O446N333M236L440K552J328
$$ y = [862403, 858714, 853866, 847946, 841449, 834893, 828580, 822412, 816024, 809415, 803239, 798097, 793753, 789462, 784848, 779860, 774077, 766731, 757522, 746918, 735520, 723598, 711297, 698897, 686712, 675014, 664108, 654258, 645545, 637961, 631459, 625685, 619954, 613925, 608129, 603439, 600133, 597853, 596210, 594978, 593878, 592743, 591723, 590844, 589497, 586980, 583499, 580083, 577489, 575613, 573876, 571739, 568991, 566027, 563735, 562623, 562254, 562068, 562386, 563832, 565980, 567626, 568468, 569616, 572162, 575973, 580232, 584514, 588973, 593915, 599533, 605756, 612277, 619071, 626787, 636067, 646573, 657305, 667909, 678937, 690707, 702644, 713960, 724236, 733058, 739725, 743777, 745367, 744920, 742893, 740046, 737306, 735097, 733288, 731965, 731680, 732770, 735094, 738713, 744073, 751106, 758826, 766299, 773453, 780453, 786899, 792232, 796468, 799908, 802460, 803788]
58986H03788M8j175k760m955p370r371j0547j0747j0133r168q134o773m875k948
58972G14880j600m75J358M024O616Q430R632J0652J1596J2455J3292J4035J4532
58959H19427J4792J4762J3894J1572P961L899k5l747p252j0430j3319j5854j7466
58946H18214j7640j6828j6051j5661j5210j4455j3667j2804j1336r121o803n018
58934F63620l830l118k900l026l110l059l206l716m314m729m909m760m155l354
58920F11434k894k852k711k080j135k19N20J051J405J808K403K914L033L092L714
58905F19483M850N892O772Q178J0397J2664J4047J4516J4734J5181J5803J6310
58893G58827J6593J6967J7953J9623K1300K2391K3264K4725K6795K8621K9484
$$ y = [803788, 803836, 802661, 799901, 794946, 787576, 778205, 767658, 756911, 746778, 737610, 729476, 722703, 717828, 714880, 713280, 712805, 714163, 718187, 724803, 733233, 742865, 753517, 765113, 777568, 790860, 804895, 819427, 834219, 848981, 862875, 874447, 882408, 886307, 886282, 882535, 875283, 864853, 851534, 835680, 818214, 800574, 783746, 767695, 752034, 736824, 722369, 708702, 695898, 684562, 675441, 668638, 663620, 659790, 656672, 653772, 650746, 647636, 644577, 641371, 637655, 633341, 628612, 623703, 618943, 614788, 611434, 608540, 605688, 602977, 600897, 599762, 599543, 600063, 601114, 602519, 604327, 606730, 609644, 612677, 615769, 619483, 624333, 630225, 636997, 645175, 655572, 668236, 682283, 696799, 711533, 726714, 742517, 758827, 775420, 792387, 810340, 829963, 851263, 873654, 896918, 921643, 948438, 977059, 1006543]
58882A006543K9210K7652K4697K0799J6678J2305P069J194m026p875j1205j5106
58870A107935j9269k2420k3914k4159k3768k2984k1838k0309j8325j6030j4052
58859H80867j3150j3544j4711j5841j6410j6431j6272j6205j6138j5791j5046
58848G11328j3903j2389j0722r398q650q061p157o296o310p198p860p405o195
58835E99784n251n025n116m951m358l563k850k303j804j348j198j561k125k176
58821E56155j260K98J613K029J757J711K450L461L839L550L360L558L570L101
58807E89192K716K757K621J788P93K80j40j168k549l502l907m014l572k409j350
58792E77536j317j886k028j850k098k308j195J081K806L164L208L879M666M849
$$ y = [1006543, 1035753, 1063405, 1088102, 1108901, 1125579, 1137884, 1144953, 1146147, 1142121, 1134246, 1123041, 1107935, 1088666, 1066246, 1042332, 1018173, 994405, 971421, 949583, 929274, 910949, 894919, 880867, 867717, 854173, 839462, 823621, 807211, 790780, 774508, 758303, 742165, 726374, 711328, 697425, 685036, 674314, 664916, 656266, 648205, 641048, 634752, 628442, 621244, 613384, 605979, 599784, 594533, 589508, 584392, 579441, 575083, 571520, 568670, 566367, 564563, 563215, 562017, 560456, 558331, 556155, 554895, 555193, 556806, 558835, 560592, 562303, 564753, 568214, 572053, 575603, 578963, 582521, 586091, 589192, 591908, 594665, 597286, 599074, 599867, 600147, 600007, 598839, 596290, 592788, 588881, 584867, 581295, 578886, 577536, 576219, 574333, 572305, 570455, 568357, 566049, 564854, 565935, 568741, 571905, 575113, 578992, 583658, 588507]
58778E88507M716M723M635M259M010L991L509K172N89p13k077l728m998n367n356
58763E98872n566n604m914l935l423l180k452j237k18L46Q74J688K611L304L600
58748E80766L633L885M761N968O721O786O812P306P999Q527R084R826J0327J0241
58734F82642J0006J0218J0713J0847J0416R711Q991Q405Q168Q330Q582Q576Q275
58721H03880P768P131O681O869P618Q202Q140P819P860Q302Q690Q625P966O720
58707I12271N030K914J16l429p081j0077j2569j5287j8215k0570k2106k3409k4548
58694G63040k4658k3373k1603k0213j8903j7183j5455j4215j2973j1006q687p030
58682E67741o303n937n513n132m918m849m868m748m062k630p55J199K962L985
$$ y = [588507, 593223, 597946, 602581, 606840, 610850, 614841, 618350, 620522, 621111, 620398, 618321, 614593, 609595, 604228, 598872, 593306, 587702, 582788, 578853, 575430, 572250, 569798, 568561, 568343, 568689, 569563, 571251, 573862, 577166, 580766, 584399, 588284, 593045, 599013, 605734, 612520, 619332, 626638, 634637, 643164, 652248, 662074, 672401, 682642, 692648, 702866, 713579, 724426, 734842, 744553, 753544, 761949, 770117, 778447, 787029, 795605, 803880, 811648, 818779, 825460, 832329, 839947, 848149, 856289, 864108, 871968, 880270, 888960, 897585, 905551, 912271, 917301, 920215, 920331, 916902, 909821, 899744, 887175, 871888, 853673, 833103, 810997, 787588, 763040, 738382, 715009, 693406, 673193, 654290, 637107, 621652, 607437, 594464, 583458, 574771, 567741, 561438, 555501, 549988, 544856, 539938, 535089, 530221, 525473, 521411, 518781, 518026, 519225, 522187, 526172]
58668E26172L674K523K178L824O939J0100J2317J3155J2470J0771R170Q086O595
58655F27974L783K27k637m158m718m861m977n370n890n818m855l829l667m127
58641E77077m270l840l290k762j953q83N7P86J636K660L361L191K103O09o19j333
58625E72530j928k688l066k396j152l72K47K230N705Q376Q332O770O497Q441J1018
58610F18544J2559J2804J2119J0627Q459N982L447Q86j571l731n567p014p732
58597F59812p544o894o371o032n625n118m511l494j880j08J269K359L681N388
58583F24932P167Q743J0063J1137J1973J2477J2301J1215R670Q467P770P100O419
58570G49434O316O910P585Q145R255J1260J3572J5739J8021K0316K1654K1567
$$ y = [526172, 529846, 532369, 534547, 538371, 545310, 555410, 567727, 580882, 593352, 604123, 613293, 621379, 627974, 631757, 631984, 629347, 625189, 620471, 615610, 610633, 605263, 599373, 593555, 588700, 584871, 581204, 577077, 572807, 568967, 565677, 562915, 560962, 560079, 560136, 560922, 562558, 565218, 568579, 571770, 573873, 574482, 573863, 572530, 570602, 567914, 564848, 562452, 561300, 560928, 561175, 563405, 569110, 577486, 585818, 592588, 599085, 607526, 618544, 631103, 643907, 656026, 666653, 675112, 681094, 684541, 685427, 683856, 680125, 674558, 667544, 659812, 652268, 645374, 639003, 632971, 627346, 622228, 617717, 614223, 612343, 612235, 613504, 615863, 619544, 624932, 632099, 640842, 650905, 662042, 674015, 686492, 698793, 710008, 719678, 728145, 735915, 743015, 749434, 755750, 762660, 770245, 778390, 787645, 798905, 812477, 828216, 846237, 866553, 888207, 909774]
58558I09774K0846K0081J8585J5786J2464R512O497K834o23k717l954n771q315
58545I94999j0482j1816j2876j3871j4290j4010j3629j3601j3890j4446j5309
58534H46779j6216j6773j6783j6078j4428j2146j0142q824p593n991m465l331
58522G14009j989r8J490K083K443L506M681M814M074L504L317L064K935L402M015
58507G55250L997L643L753L982L187J268o73j828k307k462k694l594n262o686
58493G49574o822n946n072m528m032l608l341k824j814q26j55Q44K484L827M288
58478G22049N020P100R430J0229R678R170Q716P257M987L200K030M23j810l695
58464G93784m827n716o437o575o299o060n478m029k359j297j89J997M471N564
$$ y = [909774, 930620, 950701, 969286, 985072, 997536, 1007048, 1013545, 1016379, 1015756, 1013039, 1009085, 1003314, 994999, 984517, 972701, 959825, 945954, 931664, 917654, 904025, 890424, 876534, 862088, 846779, 830563, 813790, 797007, 780929, 766501, 754355, 744213, 735389, 727796, 721805, 717340, 714009, 712020, 711922, 713412, 715495, 717938, 721444, 726125, 730939, 735013, 738517, 741834, 744898, 747833, 751235, 755250, 759247, 762890, 766643, 770625, 773812, 775080, 774407, 772579, 770272, 767810, 765116, 761522, 756260, 749574, 742752, 736806, 731734, 727206, 723174, 719566, 716225, 713401, 711587, 710761, 710606, 711450, 713934, 717761, 722049, 727069, 734169, 743599, 753828, 763506, 772676, 781392, 788649, 793636, 796836, 798866, 799289, 797479, 793784, 788957, 783241, 776804, 770229, 763930, 757870, 752392, 748363, 746004, 744707, 744518, 746515, 750986, 756550]
58450G56550N367N317N531M807L086J588N32j060l142m417m502m285l954k750
58436G58668q64M51J003J888L307M186M184M224M664M838M755N313O561P578Q309
58421H19065R573J1085J1465J0486R257P945N551K365L14K09O87N48O3n88k119
58406H85906m485o305o764o523o193n577m953n123n723n300l603j969r58K81J764
58391H24475K029O07r14j247j033j171j301r34m75k37K15J020J675K155K956L810
58375H31630L917L568L851M723N230N549O576P665P343O266O714Q783J0117R889
58361I21821J0037J1579J2821J2473J1706J1702J1688J0919J0182R873Q892O807
58349A050500M941M071L275K226K207L586M714M671M780O012P349Q094R327J1505
$$ y = [756550, 761917, 767234, 772765, 777572, 780658, 782246, 782778, 781718, 778576, 774159, 769657, 765372, 761418, 758668, 757804, 758255, 759258, 761146, 764453, 768639, 772823, 777047, 781711, 786549, 791304, 796617, 803178, 810756, 819065, 828638, 839723, 851188, 861674, 870931, 878876, 884427, 886792, 887106, 887315, 888002, 888550, 888613, 888025, 885906, 881421, 875116, 868352, 861829, 855636, 850059, 845106, 839983, 834260, 828960, 825357, 823388, 822430, 822711, 824475, 826504, 827111, 826197, 824950, 823917, 822746, 821445, 820511, 820036, 819799, 820014, 821034, 822709, 824864, 827820, 831630, 835547, 839115, 842966, 847689, 852919, 858468, 865044, 872709, 880052, 886318, 893032, 901815, 911932, 921821, 931858, 943437, 956258, 968731, 980437, 992139, 1003827, 1014746, 1024928, 1034801, 1043693, 1050500, 1055441, 1059512, 1062787, 1065013, 1067220, 1070806, 1075520, 1080191, 1084971, 1090983, 1098332, 1106426, 1115753, 1127258]
58335A127258J3130J3406J3837J5386J6434J5454J3619J2822J2990J3086J2968
58324A280390J2607J1317R233P789P430O744N076L878M271N376O243P228Q349
58311A375931Q681Q511R626J2200J4036J4037J3739J4204J4343J3749J4060J5854
58299A528971J7202J7041J6965J7914J8252J7028J6050J6649J7437J7296J7575
58288A718380J9191K0662K1097K1976K3917K5016K4589K5080K7760L0075K9949
58277A987692K9298L0428L2333L3487L5001L7887M0341M0879M1256M3341M6004
58266B397947M7879N0092N3450N6098N6799N7469N9721O2173O3689O5713O8729
58255C039759P0355O9643O9313P0956P2339P2278P3502P7416Q1016Q2622Q5663
$$ y = [1127258, 1140388, 1153794, 1167631, 1183017, 1199451, 1214905, 1228524, 1241346, 1254336, 1267422, 1280390, 1292997, 1304314, 1313547, 1321336, 1328766, 1335510, 1340586, 1344464, 1348735, 1354111, 1360354, 1367582, 1375931, 1384612, 1393123, 1402749, 1414949, 1428985, 1443022, 1456761, 1470965, 1485308, 1499057, 1513117, 1528971, 1546173, 1563214, 1580179, 1598093, 1616345, 1633373, 1649423, 1666072, 1683509, 1700805, 1718380, 1737571, 1758233, 1779330, 1801306, 1825223, 1850239, 1874828, 1899908, 1927668, 1957743, 1987692, 2016990, 2047418, 2079751, 2113238, 2148239, 2186126, 2226467, 2267346, 2308602, 2351943, 2397947, 2445826, 2495918, 2549368, 2605466, 2662265, 2719734, 2779455, 2841628, 2905317, 2971030, 3039759, 3110114, 3179757, 3249070, 3320026, 3392365, 3464643, 3538145, 3615561, 3696577, 3779199, 3864862]
58244C864862R2739J00888J06940J12657J20273J27987J34355J42129J53042J63849
58234E119721J72194J81171J93383K06061K16974K29298K45564K62744K78734
58225G105844K97331L21193L46668L71369L99745M34925M72634N10020N52526
58216A0812255O04758O62905P23969P93810Q77610R71596J073371J191186J333553
58207A9045013J499723J690766J919802K201289K542490K957669L478285M137033
58199C9472070M955609N959896P186923Q656745J0354441J2260992J4384570J6737383
58191A19968629J9295144K1994501K4741021K7388921K9723853L1441704L2024012
58184C06577785L0569178K5949337J7531230O002908o559458j7646121k5534342
$$ y = [3864862, 3957601, 4058489, 4165429, 4278086, 4398359, 4526346, 4660701, 4802830, 4955872, 5119721, 5291915, 5473086, 5666469, 5872530, 6089504, 6318802, 6564366, 6827110, 7105844, 7403175, 7724368, 8071036, 8442405, 8842150, 9277075, 9749709, 10259729, 10812255, 11417013, 12079918, 12803887, 13597697, 14475307, 15446903, 16520274, 17711460, 19045013, 20544736, 22235502, 24155304, 26356593, 28899083, 31856752, 35335037, 39472070, 44427679, 50387575, 57574498, 66231243, 76585684, 88846676, 103231246, 119968629, 139263773, 161258274, 185999295, 213388216, 243112069, 274553773, 306577785, 337146963, 363096300, 380627530, 386630438, 380070980, 362424859, 336890517]
58177C36890517k9815916l1055024l0141793k7870574k4820846k1387757j7847330
58170A53951277j4401130j1199094q403740o291016n217538n348875o383695p637147
58162H9069042q471575q648890q298263p653099o879218o071657n288638m556077
58154C3201625l882068l283154k778316k363083k014675j719778j476779j276750
58146A4407022j104566r56560q38090p45780o68408o02553n51811n13012m77490
58137G948752m43662m15205l89291l59217l26363k97654k73293k48055k22304
58128D973708k00924j83551j66414j51808j45475j46067j46675j45217j44350
58119C543227j43027j37431j28925j22279j16998j08776r8292r0388q5416p9522
$$ y = [336890517, 307074601, 276019577, 245877784, 218007210, 193186364, 171798607, 153951277, 139550147, 128351053, 119947313, 113656297, 108438759, 103089884, 96706189, 89069042, 80597467, 71948577, 63650314, 55997215, 49117997, 43046340, 37757702, 33201625, 29319557, 26036403, 23258087, 20895004, 18880329, 17160551, 15683772, 14407022, 13302456, 12345896, 11507806, 10762026, 10093618, 9491065, 8939254, 8426242, 7948752, 7505090, 7089885, 6700594, 6341377, 6015014, 5717360, 5444067, 5196012, 4973708, 4772784, 4589233, 4422819, 4271011, 4125536, 3979469, 3832794, 3687577, 3543227, 3400200, 3262769, 3133844, 3011565, 2894567, 2785791, 2687499, 2597111, 2511695, 2432173]
58109B432173p2707o8776o7630o5167o0741n7787n6994n5400n2310n0006m8665
58098A775990m6212m3081m1684m1515l9938l7228l5741l4931l2359k8751k6833
58087A367717k6036k3621k0213j8917j9649j9544j8452j8824k0697k1740k1793
58076A138231k2522k3240k2011k0094k0282k1486k0242j7007j5564j6420j6326
58065I23037j4451j3543j4348j4119j1708r444q820q580p978p990q459p879o738
58052G88980p249r238j0003q881q170q887r334q638q140q392q195p398p453q486
58038F70516q884q316q086q152p096n405n380p138q181p613p435q707r761r420
58024E60942q906r249r488q778p849p299o563n517n058n301n190m453m007m044
$$ y = [2432173, 2359466, 2290690, 2223060, 2157893, 2097152, 2039365, 1982371, 1926971, 1874661, 1824655, 1775990, 1729778, 1686697, 1645013, 1603498, 1563560, 1526332, 1490591, 1455660, 1423301, 1394550, 1367717, 1341681, 1318060, 1297847, 1278930, 1259281, 1239737, 1221285, 1202461, 1181764, 1160024, 1138231, 1115709, 1092469, 1070458, 1050364, 1030082, 1008596, 988354, 971347, 955783, 939363, 923037, 908586, 895043, 880695, 866576, 854868, 845424, 836604, 828024, 820046, 812056, 803597, 795718, 788980, 781731, 772493, 762490, 753609, 745439, 736552, 727218, 718580, 710440, 702048, 693853, 686455, 679002, 670516, 661632, 653316, 645230, 637078, 629982, 624577, 619197, 612059, 603878, 596265, 588830, 580123, 570362, 560942, 552036, 542787, 533299, 524521, 516672, 509373, 502810, 497293, 492235, 486934, 481744, 477291, 473284, 469240]
58010D69240l729k997k607k348j426m51p58j852k046j457j595k120j126J128K020
57995D47876O65p95p78k65l02k46M04Q65Q05J057J744J831J183R92J481J406L83
57978D58306m34n14o19q79m86K21k25j673k083o96Q69J332J280J262P99L7O9P94
57960D57360P21l31p52j02r3j587l129l574l874m914n863n974n999o412o223m874
57944D04380l491k959k498j382l31N1N08J635K729L241L835M909N718N966O600
57929D28911Q026R187R373R258R198Q345O505N020M555L861K015Q4q59j660l465
57914D98354n672p060p719q361q916r085r233r595r622r132q890r122q847p669
57900C79431o733o867p243p106p237q269r017q104o069m426l559k998k668k558
$$ y = [469240, 465511, 462514, 459907, 457559, 456133, 455682, 454924, 453072, 451026, 449569, 447974, 445854, 444728, 445856, 447876, 448541, 447746, 446968, 446703, 446401, 446155, 446559, 447424, 448229, 449286, 451030, 452861, 454044, 455036, 456517, 457923, 458306, 457872, 457358, 456739, 455860, 455374, 455595, 455370, 453697, 451614, 450918, 451787, 453119, 454399, 455661, 456460, 456497, 456566, 457360, 458081, 457750, 456998, 456896, 456803, 455216, 452087, 448513, 444639, 439725, 433862, 427888, 421889, 415477, 409254, 404380, 400889, 397930, 395432, 394050, 393719, 393770, 394278, 395913, 398642, 401883, 405718, 410627, 416345, 422311, 428911, 436937, 446124, 455497, 464755, 473953, 482298, 488803, 493823, 498378, 502239, 504254, 504338, 503479, 501819, 498354, 492682, 485622, 477903, 469542, 460626, 451541, 442308, 432713, 423091, 413959, 405069, 395947, 387100, 379431, 372698, 365831, 358588, 351482, 344245, 335976, 326959, 318855, 312786, 308360, 304801, 301803, 299135, 296577]
57886B96577k006o62O61J182J333J751K179K312K656L403L592K620J487J229J229
57871C19543L69j110k269l060l845m177l478k370j957k263k442k098j442o29J52
57856B88924N53P29J476L032M563N461O226P293Q128Q298Q324Q526Q222P059N983
57841C72797N756N608M603L194K178J157n04k178k900l082l720m642m968m756
57827C68543m781n082n062m691m401m142l568k813k141j266MJ085J475J606J867
57812C36633J639M69o46n30K52K24p39j472j479j361j469j568j840k874m436n370
57796C15433n001l870k928k621k809l007k684j832j068q63r52r82j169j760k355
57781B81532k363j826j162n13J15N31P09R36J242J324J411K336M079N201M571
$$ y = [296577, 294571, 293909, 294570, 295752, 297085, 298836, 301015, 303327, 305983, 309386, 312978, 315598, 317085, 318314, 319543, 319912, 318802, 316533, 313473, 309628, 305451, 301973, 299603, 297646, 295383, 292941, 290843, 289401, 288772, 288924, 289477, 290206, 291682, 294714, 299277, 304738, 310964, 318257, 326385, 334683, 343007, 351533, 359755, 366814, 372797, 378553, 384161, 388764, 391958, 394136, 395293, 394789, 392611, 389711, 386629, 382909, 378267, 373299, 368543, 363762, 358680, 353618, 348927, 344526, 340384, 336816, 334003, 331862, 330596, 330600, 331685, 333160, 334766, 336633, 338272, 338741, 338095, 337565, 337817, 338041, 337302, 335830, 334351, 332990, 331521, 329953, 328113, 325239, 320803, 315433, 310432, 306562, 303634, 301013, 298204, 295197, 292513, 290681, 289613, 288750, 287798, 286816, 285647, 283887, 281532, 279169, 277343, 276181, 275668, 275783, 276314, 277023, 277959, 279201, 280525, 281936, 284272, 288351, 293552, 298123]
57766B98123K907J750J601J934K273K271J383n01k550l907m669n232n466n313
57752B84604n398o068o547o015m897m109l720l298k941k893k782k251j717j590
57738B30378j459j051j101k062k826k188q36l64q67j126q02p76j362j767j460
57723B10331q08j86M53J023J229J157J124J052P29L95L39K41j91m15J22P90N60
57706B17945m33j239j631k056k331j788o96j81o30j226j272j026r84j155j265
57691B00032r76l9J359K475K825K783K821K708K154J647J787K368L052M365O914
57676B36275J0240J3535J6994K1277K6199L1229L6739M3308N0266N6425O1785
57665F04272O6995P1181P1757O6244N3100L1621L257k6842n1786o7443p4163p4367
$$ y = [298123, 301030, 302780, 304381, 306315, 308588, 310859, 312242, 311741, 309191, 305284, 300615, 295383, 289917, 284604, 279206, 273138, 266591, 260576, 255679, 251570, 247850, 244552, 241611, 238718, 235936, 233685, 231968, 230378, 228919, 227868, 226767, 224705, 221879, 219691, 218855, 218491, 217624, 216498, 215696, 214920, 213558, 211791, 210331, 209523, 209337, 209790, 210813, 212042, 213199, 214323, 215375, 216104, 216499, 216838, 217079, 216888, 216473, 216595, 217385, 217945, 217512, 216273, 214642, 212586, 210255, 208467, 207771, 207590, 206960, 205734, 204462, 203436, 202452, 201297, 200032, 199056, 199017, 200376, 202851, 205676, 208459, 211280, 213988, 216142, 217789, 219576, 221944, 224996, 229361, 236275, 246515, 260050, 277044, 298321, 324520, 355749, 392488, 435796, 486062, 542487, 604272, 671267, 742448, 814205, 880449, 933549, 965170, 968427, 941585, 889799, 822356, 748193, 673826]
57653F73826p0212o3660n6609m9789m2716l5386k8909k3931j9768j5802j2518
57642B54526j0405q832o937m898l494k952k797k482j766q42k38j94k33J35N15
57627B09106K01n68r59q92j003j321j247q76j045j834k297j955j419j178r33n00
57611A91280l02m65m88k02j29m46n86l19j89m52n14k6L66L0o47q68m85LK7p34
57591A84854k083l211l436l068k868k877k602k211k341k747k491j553r61j067
57577A51338j067o34n25j079j500j355j343j827j973j319r14j700k826k872j896
57562A28508j020o49l22Q9K02l3k90m43n39m42p3K55L26M28P97J131J150J138
57544A30213J421J785J922J891J640P52o67j516r10N61J513J369O45P5O6O84J466
$$ y = [673826, 603614, 539954, 483345, 433556, 390840, 355454, 326545, 302614, 282846, 267044, 254526, 244121, 235289, 228352, 223454, 219960, 217008, 214211, 211729, 209963, 209121, 208883, 208689, 208456, 208591, 209106, 209307, 208739, 207780, 206888, 205885, 204564, 203317, 202441, 201396, 199562, 197265, 195310, 193891, 192713, 191780, 191280, 190978, 190513, 190025, 189823, 189694, 189248, 188662, 188343, 188154, 187702, 187188, 187162, 187528, 187558, 186911, 186043, 185558, 185561, 185588, 184854, 182771, 179560, 176124, 173056, 170188, 167311, 164709, 162498, 160157, 157410, 154919, 153366, 152405, 151338, 150271, 149637, 149112, 148033, 146533, 145178, 143835, 142008, 140035, 138716, 137802, 136102, 133276, 130404, 128508, 127488, 126839, 126517, 126606, 126808, 126775, 126485, 126042, 125503, 125061, 124988, 125243, 125569, 125997, 126794, 127925, 129075, 130213, 131634, 133419, 135341, 137232, 138872, 139624, 138957, 137441, 136531, 137092, 138605, 139974, 140619, 140694, 140760, 141444, 142910]
57527A42910J566O59n44j168j210j152j055o54j27Ql41p25p42l20M00J108J366
57510A39979J052O23O41J064J277P68l44j358j572r97l94l54n37l04K02K03n46
57493A39403j511k221k598k490j790j036r56j261r50M2N78J07m88l75Qo0l68l56
57475A23678j67k53n39p47r70j335j632j808k146k503k180j135m06n50o61K29
57459A06875J597K290K186J863J327K80q22j236j090r28m82Q19K326K529J130
57444A18664m67j015p59m55r7P19J649J744O65o83j092m16K74Q6n51n50K53R13
57426A18882P65K04j52k19m9N07J252J499J046O04O70P15J65n14n85k70k82o26
57408A23612p60o10n03l60R8N31L02m22p09j16P75J146Q06J80j19K13Q68J144
$$ y = [142910, 144476, 145135, 144591, 143423, 142213, 141061, 140006, 139352, 139225, 139233, 138892, 138167, 137425, 137105, 137505, 138613, 139979, 141031, 141654, 142295, 143359, 144636, 145404, 145060, 143702, 142130, 141133, 140739, 140385, 139848, 139544, 139746, 139949, 139403, 137892, 135671, 133073, 130583, 128793, 127757, 126801, 125540, 124590, 124632, 125210, 125317, 124829, 124454, 124462, 124402, 124034, 123678, 123511, 123258, 122719, 121972, 121002, 119667, 118035, 116227, 114081, 111578, 109398, 108263, 107857, 107307, 106646, 106875, 108472, 110762, 112948, 114811, 116138, 116418, 115596, 114360, 113270, 112342, 111860, 112679, 115005, 117534, 118664, 118197, 117182, 116423, 115968, 115871, 116590, 118239, 119983, 120648, 119965, 118873, 118457, 118731, 118817, 118266, 117716, 117969, 118882, 119647, 119851, 119699, 119480, 119431, 119938, 121190, 122689, 123735, 124339, 125009, 125724, 125889, 125375, 124790, 124520, 124238, 123612, 122852, 122242, 121739, 121379, 121477, 122008, 122310, 121888, 121179, 121063, 121838, 122984, 123790, 123970, 123851, 124064, 124932, 126076]
57390A26076P83L28M12R30J240R52K73j97J39J278K252J984P36J2O03J515J383
57373A40699K59p36r50o28k38q1l23p57q25l38K10L42J24k80r27j565j619j150
57355A31217r27r90k95J413K569J837J87m83L9N25N08N75P61L68o07j262j137
57338A34298o20L6R07J611J494P53K59J97m1n37n79NL85No18p75n23k86j93j74
57318A35604k73n17p92r64q50k55N81R15M15j52J05R03J224P99K26j45m98p84
57300A35542p16n34p99j326j239k52Q72J301R16N7q43j337j346j419j971k524
57284A24382k382j806j593j776j759j522j544j577q03P14J896K211K313K821L535
57269A23110M124M554M582L888L025L156M400N474N496N070N022N036M378L195
$$ y = [126076, 126859, 127187, 127599, 128529, 129769, 130721, 130994, 130797, 130936, 132214, 134466, 136450, 137186, 137198, 137801, 139316, 140699, 140958, 140222, 139272, 138644, 138406, 138325, 138002, 137245, 136420, 136082, 136292, 136634, 136758, 136478, 135551, 133986, 132367, 131217, 130290, 129300, 129005, 130418, 132987, 134824, 135011, 134528, 134567, 135092, 135600, 136175, 136936, 137304, 136697, 135435, 134298, 133678, 133714, 134621, 136232, 137726, 138479, 138738, 138935, 138894, 138357, 137778, 137783, 138168, 138173, 137555, 136780, 136257, 135971, 135778, 135604, 135331, 134814, 134022, 133058, 132208, 131953, 132534, 133449, 133864, 133712, 133817, 134720, 135944, 136743, 136969, 136824, 136326, 135542, 134826, 134292, 133493, 132167, 130928, 130676, 131548, 132849, 133765, 133822, 132979, 131642, 130296, 128877, 126906, 124382, 122000, 120194, 118601, 116825, 115066, 113544, 112000, 110423, 109620, 110334, 112230, 114441, 116754, 119575, 123110, 127234, 131788, 136370, 140258, 143283, 146439, 150839, 156313, 161809, 166879, 171901, 176937, 181315, 184510]
57255A84510K224J747J498J274J076R33R91J372J761J561P36J2o6K10L02J96K91
57238B00628P66J394J752J584J130R81J353J767J859J997K518K876K506K002K323
57223B27436L108L097K084J073N88K62J86J083K708L692L576L471L991M007K591
57208B62953Q74O24J873L173L687L743L816M012M337M649M505L787L166L392M343
57193C12934N283N772N899N880N886N971N921N566N348N995P378Q381Q302P726
57179D02242P576P963Q474Q936R364R670R949J0593J1743J3079J4431J5972J7592
57166E47584J8837J9889K1685K4556K7518K9492L0436L0717L0231K9000K7808
57155H37753K7350K7272K6875K6260K5940K5889K5788K5819K6396K7388K8356
$$ y = [184510, 186734, 188481, 189979, 191253, 192329, 193262, 194253, 195625, 197386, 198947, 199683, 199695, 199629, 199839, 200141, 200337, 200628, 201394, 202788, 204540, 206124, 207254, 208235, 209588, 211355, 213214, 215211, 217729, 220605, 223111, 225113, 227436, 230544, 233641, 235725, 236798, 237386, 237648, 237834, 238917, 241625, 245317, 248893, 252364, 256355, 260362, 262953, 263827, 264451, 266324, 269497, 273184, 276927, 280743, 284755, 289092, 293741, 298246, 302033, 305199, 308591, 312934, 318217, 323989, 329888, 335768, 341654, 347625, 353546, 359112, 364460, 370455, 377833, 386214, 394516, 402242, 409818, 417781, 426255, 435191, 444555, 454225, 464174, 474767, 486510, 499589, 514020, 529992, 547584, 566421, 586310, 607995, 632551, 660069, 689561, 719997, 750714, 780945, 809945, 837753, 865103, 892375, 919250, 945510, 971450, 997339, 1023127, 1048946, 1075342, 1102730, 1131086]
57144A131086K9260L0336L1535L2643L3684L4784L5977L7527L9798M2489M4605
57133A523724M5800M7005M9052N1418N3191N4550N6340N8670O1008O3389O6494
57122B130641P0645P5540Q0926Q6852R3253R9847J06426J12932J19482J26588
57112C103132J34942J44664J55291J66917J80689J97690K18007K41614K69528
57103D812474L03507L45171L96358M59925N39553O39005P61965R11773J090357
57094A0260088J297557J531448J788320K061938K344202K627588K906148L173489
57086B7990778L421247L640446L822509L957699M034854M044635L978803L819713
57078E8710684L531028L068246K408598J575394O34559l32142j254480k086164
$$ y = [1131086, 1160346, 1190682, 1222217, 1254860, 1288544, 1323328, 1359305, 1396832, 1436630, 1479119, 1523724, 1569524, 1616529, 1665581, 1716999, 1770190, 1824740, 1881080, 1939750, 2000758, 2064147, 2130641, 2201286, 2276826, 2357752, 2444604, 2537857, 2637704, 2744130, 2857062, 2976544, 3103132, 3238074, 3382738, 3538029, 3704946, 3885635, 4083325, 4301332, 4542946, 4812474, 5115981, 5461152, 5857510, 6317435, 6856988, 7495993, 8257958, 9169731, 10260088, 11557645, 13089093, 14877413, 16939351, 19283553, 21911141, 24817289, 27990778, 31412025, 35052471, 38874980, 42832679, 46867533, 50912168, 54890971, 58710684, 62241712, 65309958, 67718556, 69293950, 69928509, 69596367, 68341887, 66255723]
57070F6255723k803231l396218l861655m196399m397235m464753m407272m241433
57062C4487527l989800l677440l328913k966057k606888k265436j951824j672047
57054A2029122j427915j217940j039105q88177p61726o55814n66703m92032m30449
57045D549261l79919l37268k99836k66805k38105k12825j89663j68421j49871
57036B306548j34176j20443j07856r6450q6545p8036p0421o3094n5613m7996m0583
57025A405335l3355k5546j6281n202P798K2852L9708N7662P6438R6506J18256
57014A744171J41821J67484J93011K08220J95224J40385M8840n4766j42036j97511
57004B444843k21920k24115k13078j95220j74420j52545j30684j10318r2811p8244
$$ y = [66255723, 63452492, 60056274, 56194619, 51998220, 47600985, 43136232, 38728960, 34487527, 30497727, 26820287, 23491374, 20525317, 17918429, 15652993, 13701169, 12029122, 10601207, 9383267, 8344162, 7455985, 6694259, 6038445, 5471742, 4979710, 4549261, 4169342, 3832074, 3532238, 3265433, 3027328, 2814503, 2624840, 2456419, 2306548, 2172372, 2051929, 1944073, 1847623, 1761078, 1683042, 1612621, 1549527, 1493914, 1445918, 1405335, 1371980, 1346434, 1330153, 1324951, 1332749, 1355601, 1395309, 1452971, 1529409, 1625915, 1744171, 1885992, 2053476, 2246487, 2454707, 2649931, 2790316, 2839156, 2784390, 2642354, 2444843, 2222923, 1998808, 1785730, 1590510, 1416090, 1263545, 1132861, 1022543, 929732, 851488]
56994H51488o5764n4957m5930l8282l1098k4144j8206j3885j0782q137n753l872
56982E30678k589j848j884l163n834r414j3112j6258j8376j9154j8663j7444j5968
56969C86971j4069j1304p939m881k521l03K222M701O904R493J2933J6263J8027
56956D16497J8083J7310J5733J2260O416p80p914j4108j8676k0998k1269k0511
56944C82043j9261j7021j3426r214n414k220O57L199N276P276R824J3096J6764
56931C71579K0297K2923K3703K2097J8172J1991L451o689j6204k2729k5750k6624
56919C96217k6686k5956k3877k0685j7475j5027j3120j1122q988p217n971m805
56907B15288l493k540k410k689k551j815r24j33O89J553K360L266M411N427N965
$$ y = [851488, 785724, 730767, 684837, 646555, 615457, 591313, 573107, 559222, 548440, 540303, 534550, 530678, 528089, 526241, 524357, 521194, 515360, 505946, 492834, 476576, 458200, 439046, 420383, 402939, 386971, 372902, 361598, 353659, 348778, 346257, 345954, 348176, 352877, 359781, 369274, 382207, 398470, 416497, 434580, 451890, 467623, 479883, 486299, 485519, 477605, 463497, 444821, 423823, 402554, 382043, 362782, 345761, 332335, 323121, 317707, 315487, 316144, 319343, 324619, 331895, 341719, 354815, 371579, 391876, 414799, 438502, 460599, 478771, 490762, 494213, 487524, 471320, 448591, 422841, 396217, 369531, 343575, 319698, 299013, 281538, 266511, 253391, 242269, 233281, 226064, 220093, 215288, 211795, 209255, 206845, 204156, 201605, 199790, 198866, 198733, 199422, 200975, 203335, 206601, 211012, 216439, 222404]
56892B22404O569Q147J0562J2677J3953J5031J6399J7429J7252J5727J3043R101
56880C78294M002j378o008r513j1941j3108j2787j1148q567n234j430K179N152
56867C08513Q000J1723J6635K1978K6751L0644L4134L7761M1298M3504M2836L8312
56855F62089K9786J7707L281j1279k3332l1153l4563l4293l1236k6301k0408j4124
56843D86174p487l22P346J5280K3152L0724L8131M5757N3502O0443O5640O8755
56831H87095O9024O4001N0720K8764J682k4915m6303o0171o6675o7645o5201o0475
56819G09901n3741m5424l6204k6362j6012o048K315R180J6032K3712L1415L8071
56807F46835M3500M7444M8505M4938L5882K1452K769j7307l4678m6576n3179n6010
$$ y = [222404, 228973, 237120, 247682, 260359, 274312, 289343, 305742, 323171, 340423, 356150, 369193, 378294, 382296, 380918, 374910, 365397, 353456, 340348, 327561, 316413, 307846, 302612, 301182, 303361, 308513, 316513, 328236, 344871, 366849, 393600, 424244, 458378, 496139, 537437, 580941, 623777, 662089, 691875, 709582, 712863, 701584, 678252, 647099, 612536, 578243, 547007, 520706, 500298, 486174, 478687, 478365, 485711, 500991, 524143, 554867, 592998, 638755, 692257, 752700, 818340, 887095, 956119, 1020120, 1070840, 1099604, 1101286, 1076371, 1030068, 969897, 903222, 835577, 770376, 709901, 656160, 610736, 574532, 548170, 532158, 526110, 528425, 537605, 553637, 577349, 608764, 646835, 690335, 737779, 786284, 831222, 867104, 888556, 891325, 874018, 839340, 792764, 739585, 683575]
56795F83575n5657n2148m6469m0138l3639k6641j9495j3105p427j493M849J0391
56783D02603J4157J6607J8847K1207K2951K2787J9406J2121J614j0041k0387k7886
56771D93986l2410l4656l5094l3589l0271k6424k3630k1945j9827j6399j2873
56760B06868j0994j0730j0484r163p093n114l739l132l164l338l186k748k272
56747A31711j739j154r59j499k250k283j430m22L1j91p88j247j036j65O24P11
56731A17914M23M49P15O40K42J54N47P64L28l49m79K11J235J765J338M22O8O86
56713A27073J425J263L18m45o19o52q67r78o32P7Q34J356J434J099P11N15K04
56696A32116n58j394j599j161p39o06l50K81Q07O54j10q92j175q30j15N28Q87
$$ y = [683575, 627918, 575770, 529301, 489163, 455524, 428883, 409388, 396283, 388856, 387363, 392212, 402603, 416760, 433367, 452214, 473421, 496372, 519159, 538565, 550686, 552300, 542259, 521872, 493986, 461576, 426920, 391826, 358237, 327966, 301542, 277912, 255967, 236140, 219741, 206868, 195874, 185144, 174660, 165497, 158404, 153290, 149551, 146419, 143255, 139917, 136731, 133983, 131711, 129972, 128818, 127859, 126360, 124110, 121827, 120397, 119975, 120006, 119815, 119027, 117780, 116744, 116579, 117203, 117914, 118337, 118786, 119501, 120141, 120383, 120537, 121084, 121848, 122176, 121827, 121348, 121559, 122794, 124559, 125897, 126319, 126387, 127073, 128498, 129761, 130079, 129634, 129015, 128363, 127496, 126518, 125886, 125963, 126797, 128153, 129587, 130686, 131397, 131912, 132116, 131558, 130164, 128565, 127404, 126665, 126059, 125709, 125990, 126797, 127451, 127341, 126449, 125274, 124444, 124329, 124857, 125744]
56679A25744J094J222R68J35p95j076o82k98l78o38n73l9P00J229J206P30M03
56662A28952P02J259J301P55M66J102K259K914K527J466N18J97M92J089J685K049
56646A49733J996J523R71P80J047J498J862K026J890J505J294J632K299K766K977
56631A75799L115K850J692J58n24j30K62K0k33o9j48p83r92j41O68J97r09j276
56613A79556j091j472k174j858m67N89O44M63M58qj069j672j219n95p84j460j751
56596A66090j582j428j365j097n24J33N57M42j95o84l24O24J154Q52L24J58K02
56579A63337J73J69L73P34J230J814K032J408K97l04JP38J584K720L862M095L241
56562A87504K538L184M826O209O807P073P448P846P973P655O820N558M132K831
$$ y = [125744, 126838, 128060, 129028, 129163, 128368, 127292, 126610, 126312, 125934, 125296, 124723, 124684, 125384, 126613, 127819, 128549, 128952, 129654, 130913, 132214, 132969, 133435, 134537, 136796, 139710, 142237, 143703, 144221, 144418, 144910, 145999, 147684, 149733, 151729, 153252, 154223, 155003, 156050, 157548, 159410, 161436, 163326, 164831, 166125, 167757, 170056, 172822, 175799, 178914, 181764, 183456, 183614, 183090, 182960, 183222, 183242, 183009, 182940, 182792, 182009, 181017, 180876, 181544, 181741, 180832, 179556, 178465, 176993, 174819, 172961, 172494, 173083, 173727, 174190, 174648, 174640, 173571, 171899, 170680, 170085, 169301, 167841, 166090, 164508, 163080, 161715, 160618, 160094, 160227, 160784, 161226, 161031, 160347, 160023, 160647, 161801, 162653, 162977, 163135, 163337, 163510, 163679, 164052, 164786, 166016, 167830, 169862, 171270, 171567, 171263, 171264, 172002, 173586, 176306, 180168, 184263, 187504, 190042, 193226, 198052, 204261, 211068, 218141, 225589, 233435, 241408, 249063, 255883, 261441, 265573, 268404]
56548B68404J836J246J024R20O81L64J62O2rM4J16l77j735l180l640l223k957
56531B59738l133k977k250j941k806m103m526l818k747k016j824k189k957l621
56517B18830l574k687j445n95o37j387k087k140j708j311j056p47n66r27j676
56502A96287k101j859j285p39k37J74L17K77M08P79J135J364J437J099K70l45
56486A96981J0Q20P50m41j412j062P7P36M61k20n89k75N21J078Q66L22L54J032
56468B00009J511J325R34Q10Q00O84N75N08L59L10O98J203J083L90N5M77J008
56451B12739J145J262J723K197K302K112J622P06j17R5J157J632Q26j65j92L01
56435B29345L28R0L97J053J016l0j255j753j383o88l84o79r21l06Q92J551J269
$$ y = [268404, 270240, 271486, 272510, 273430, 274111, 274475, 274637, 274699, 274690, 274734, 274850, 274473, 272738, 269558, 265918, 262695, 259738, 256605, 253628, 251378, 249437, 246631, 242528, 238002, 234184, 231437, 229421, 227597, 225408, 222451, 218830, 215256, 212569, 211124, 210529, 209892, 208505, 206418, 204278, 202570, 201259, 200203, 199456, 198890, 197963, 196287, 194186, 192327, 191042, 190303, 190066, 190240, 190557, 190834, 191242, 192021, 193156, 194520, 195957, 197056, 197326, 196981, 196991, 197811, 198561, 198120, 196708, 195646, 195723, 196459, 196920, 196700, 196111, 195836, 196357, 197435, 198301, 198623, 198977, 200009, 201520, 202845, 203779, 204589, 205389, 206073, 206648, 207156, 207515, 207825, 208523, 209726, 210809, 211199, 211254, 211731, 212739, 213884, 215146, 216869, 219066, 221368, 223480, 225102, 225808, 225691, 225786, 226943, 228575, 229401, 229236, 229044, 229345, 229673, 229763, 230160, 231213, 232229, 232199, 230944, 229191, 227808, 227120, 226736, 226057, 225136, 224830, 225722, 227273, 228542]
56418B28542Q43Q56P87J22o06o26j9N98Q87O94l1p27m62P07J506J211O50P18R31
56399B36581M25m97r01o02m3N04P51J65j089j705q39N58J150J197J825K886L050
56382B43416J836K20p45q72l47O19J597K146K337K522K728K766K670K453J811
56367B65157O82k44k80K97O90O06L06L5P9P81J901K388J618L00n10p63r77j095
56349B70971o89Q3O86J033J321J409J117P47O01M34O8r8J99M92M94Q15J813K631
56331B84127K500K188K832L995M346L767L290L264L106K706K594K719K457J887
56317C25778J766K110K071J393Q62J002J391J506J365J128Q10O38R44J540J844
56302C46148J685J403J227J158J342J908K503K628K301J848J355P98M06K61Rl59
$$ y = [228542, 229385, 230241, 231028, 231150, 230544, 229918, 229899, 230497, 231384, 232078, 232047, 231320, 230858, 231565, 233071, 234282, 234932, 235650, 236581, 237006, 236509, 235608, 235006, 234963, 235467, 236218, 236383, 235294, 233589, 232750, 233308, 234458, 235655, 237480, 240366, 243416, 245252, 245472, 244727, 243855, 243508, 244127, 245724, 247870, 250207, 252729, 255457, 258223, 260893, 263346, 265157, 265839, 265595, 265315, 265612, 266302, 266908, 267214, 267249, 267328, 268109, 270010, 272398, 274016, 274316, 273806, 273043, 272066, 270971, 270282, 270365, 271051, 272084, 273405, 274814, 275931, 276678, 277279, 277713, 277781, 277683, 277882, 278374, 278868, 279683, 281496, 284127, 286627, 288815, 291647, 295642, 299988, 303755, 307045, 310309, 313415, 316121, 318715, 321434, 323891, 325778, 327544, 329654, 331725, 333118, 333980, 334982, 336373, 337879, 339244, 340372, 341182, 341820, 342764, 344304, 346148, 347833, 349236, 350463, 351621, 352963, 354871, 357374, 360002, 362303, 364151, 365506, 366304, 366710, 366971, 366980, 366621]
56286C66621o9J355L089M027M184M236M315M306M647N562O118N425M262M141N089
56271D27308N832N880N910O227O454O714P564Q650Q936Q501Q706J0241J2277J3966
56257E43166J5561J7587J9911K2179K4420K6906K9998L4156L9397M4772M9157
56246H67210N2533N5736N9172O2589O5791O8567P0144O9830O7998O5449O1999
56235A567018N6823M9879M1755L2369K1262R103k467j2636k1921l0833l9137m6468
56223A624747n2557n6829n8941n9593n9792n9512n8191n6167n4221n1971m8344
56212A008629m3549l9086l5741l3033l0597k8607k6726k4228k1288j8806j6931
56201F90037j5128j3585j2909j2519j1142q971p444o705n323k952j240j308k170
$$ y = [366621, 366552, 367907, 370996, 375023, 379207, 383443, 387758, 392064, 396711, 402273, 408391, 413816, 418078, 422219, 427308, 433140, 439020, 444930, 451157, 457611, 464325, 471889, 480539, 489475, 497976, 506682, 516923, 529200, 543166, 558727, 576314, 596225, 618404, 642824, 669730, 699728, 733884, 773281, 818053, 867210, 919743, 975479, 1034651, 1097240, 1163031, 1231598, 1301742, 1371572, 1439570, 1505019, 1567018, 1623841, 1673720, 1715475, 1747844, 1769106, 1778209, 1775742, 1763106, 1741185, 1710352, 1671215, 1624747, 1572190, 1515361, 1456420, 1396827, 1337035, 1277523, 1219332, 1163165, 1108944, 1056973, 1008629, 965080, 925994, 890253, 857220, 826623, 798016, 771290, 747062, 725774, 706968, 690037, 674909, 661324, 648415, 635896, 624754, 615783, 608339, 601634, 596311, 593359, 592119, 590811, 588641]
56188E88641k595k820l381l698k947j411QQ18R77P13O34J213J951K004J568J464
56172E83139J576J091K01m6M42Q34J205K410M029M519L776L448M200M814M685
56157F20323N003O503Q120R012R963J1539J2709J2677J2487J3357J4830J5972
56145G52495J7152J9178K1810K4443K7420L1465L6483M1931M7670N3796O0385
56134A134228O7877P6850Q6962R7026J06296J14447J20114J20976J15903J05870
56124B146549R2651P8062O4526N4305M7503M2293L7340L2228K5572J5390K196
56113B638615j0556k0186k6978l2098l5970l9996m7155n8934p3271q7023r8658
56102B107790j07232j10981j08948j02588r4001q3898p2602o1416n1446m2479
$$ y = [588641, 586046, 583226, 579845, 576147, 573200, 571789, 571797, 572615, 573592, 574305, 574939, 576152, 578103, 580107, 581675, 583139, 584715, 585806, 586007, 585961, 586403, 587237, 588442, 590852, 594881, 599400, 603176, 606624, 610824, 615638, 620323, 625326, 631829, 639949, 648961, 658924, 670463, 683172, 695849, 708336, 721693, 736523, 752495, 769647, 788825, 810635, 835078, 862498, 893963, 930446, 972377, 1020047, 1073843, 1134228, 1202105, 1278955, 1365917, 1462943, 1569239, 1683686, 1803800, 1924776, 2040679, 2146549, 2239200, 2317262, 2381788, 2436093, 2483596, 2525889, 2563229, 2595457, 2621029, 2636419, 2638615, 2628059, 2607873, 2580895, 2548797, 2512827, 2472831, 2425676, 2366742, 2293471, 2206448, 2107790, 2000558, 1889577, 1780629, 1678041, 1584040, 1500142, 1427540, 1366124, 1314678, 1272199]
56092A272199l4357k7949k3440j9350j4679j0469p776n737l192o05J136K352L513
56079A131646M075L844L977N182O436O884P371Q624R659R583R435J0566J2629
56066A229911J4625J6504J8318J9381J9576K0034K1153K1708K1014K0152J9853
56055A442229J9216J7810J6866J6927J6630J5309J4540J5441J6787J7405J8091
56044A627251J9454K0391K0465K1208K3200K4663K4818K5717K8527L1110L1722
56033A898526L2061L3916L5908L6495L7187L9511M1730M1996M2041M4168M7123
56022B330662M8581M9293N1131N3325N4365N5429N8246O1681O3951O6158P0032
56011B962854P4373P7318P9926Q3952Q8404R1881R5810J01684J07670J11803J15875
$$ y = [1272199, 1237842, 1209893, 1186453, 1167103, 1152424, 1141955, 1134179, 1128442, 1125250, 1124645, 1125781, 1128133, 1131646, 1135721, 1139565, 1143542, 1148724, 1155160, 1162044, 1169415, 1178039, 1187698, 1197281, 1206716, 1217282, 1229911, 1244536, 1261040, 1279358, 1298739, 1318315, 1338349, 1359502, 1381210, 1402224, 1422376, 1442229, 1461445, 1479255, 1496121, 1513048, 1529678, 1544987, 1559527, 1574968, 1591755, 1609160, 1627251, 1646705, 1667096, 1687561, 1708769, 1731969, 1756632, 1781450, 1807167, 1835694, 1866804, 1898526, 1930587, 1964503, 2000411, 2036906, 2074093, 2113604, 2155334, 2197330, 2239371, 2283539, 2330662, 2379243, 2428536, 2479667, 2532992, 2587357, 2642786, 2701032, 2762713, 2826664, 2892822, 2962854, 3037227, 3114545, 3194471, 3278423, 3366827, 3458708, 3554518, 3656202, 3763872, 3875675, 3991550]
56000C991550J22289J29772J36276J43167J52384J62409J71383J81032J93110
55991E383372K05346K15675K26886K41960K58599K73785K89974L10890L34950
55982G741437L59073L85274M17037M52891M90244N31652N80536O34849O92290
55973A2285283P57305Q35382R25138J024201J137859J273338J431315J612848
55965B1282669J829091K094302K416273K805889L289897L902118M669215N617173
55957D7906627O779565Q179124R808199J1647421J3696786J5966873J8444186
55950A32428781K1080708K3798454K6470136K8894149L0778259L1655265L0726054
55943C25831806K6907398J9389549Q469262m124084j5909434k4880837l0290779
$$ y = [3991550, 4113839, 4243611, 4379887, 4523054, 4675438, 4837847, 5009230, 5190262, 5383372, 5588718, 5804393, 6031279, 6273239, 6531838, 6805623, 7095597, 7406487, 7741437, 8100510, 8485784, 8902821, 9355712, 9845956, 10377608, 10958144, 11592993, 12285283, 13042588, 13877970, 14803108, 15827309, 16965168, 18238506, 19669821, 21282669, 23111760, 25206062, 27622335, 30428224, 33718121, 37620239, 42289454, 47906627, 54686192, 62865316, 72673515, 84320936, 98017722, 113984595, 132428781, 153509489, 177307943, 203778079, 232672228, 263450487, 295105752, 325831806, 352739204, 372128753, 380598015, 376473931, 360564497, 335683660, 305392881]
55936C05392881l2517995l2420729l0818302k8324086k5367998k2247603j9176570
55929A14519598j6317168j3774172j1579234r711886q140450o835288n758586
55922D2402814m867684m130394l524327l024826k606804k255456j963166j718429
55914A8311728j508113j327112j175325j047605r35847q37927p55535o85698o22899
55905I415667n66853n19958m79496m40353m03186l72114l46240l20920k95733
55896E670814k73904k55160k36118k16757j99990j85572j70519j54881j41342
55887C836571j29678j17056j03230r0354p8154o4251m8827l4240k0441n288J0894
55876C155946K5336L6943M6208N1327M8600L6882J8269n438l3607o4362r4413
$$ y = [305392881, 272874886, 240454157, 209635855, 181311769, 155943771, 133696168, 114519598, 98202430, 84428258, 72849024, 63137138, 54996688, 48161400, 42402814, 37535130, 33404736, 29880409, 26855583, 24248779, 21993323, 20030157, 18311728, 16803615, 15476503, 14301178, 13253573, 12317726, 11479799, 10724264, 10038566, 9415667, 8848814, 8328856, 7849360, 7409007, 7005821, 6633707, 6287467, 5966547, 5670814, 5396910, 5141750, 4905632, 4688875, 4488885, 4303313, 4132794, 3977913, 3836571, 3706893, 3589837, 3486607, 3396253, 3318099, 3253848, 3205021, 3170781, 3150340, 3145052, 3155946, 3181282, 3218225, 3264433, 3315760, 3364360, 3401242, 3419511, 3414073, 3380466, 3316104, 3221691]
55865C221691j21253j43102j57570j63192j61595j55560j45973j33061j19032
55856A921353j06394r5000q3769p3875o6911o1435n4985m8346m4096m1949l9348
55845A205245l5929l3540l2280l0327k7636k6133k6091k5618k3959k2293k1082
55834I00357j9476j7554j6433j6017j5135j3903j3448j3423j2394j0595r743j0117
55822G32119j0423j0438j1173j2427j2746j2056j1758j2042j1526r864q363p687
55810F01616p070o127n376m769l659k392j878j557P2K824M813N338N626O434O894
55795F00789O281N000L393J176j468l705n356p040q936j0633j2065j3256j3410
55782E40770j1789r232p366o696o938q436j1265j3633j3482j1424r814r161p835
$$ y = [3221691, 3100438, 2957336, 2799766, 2636574, 2474979, 2319419, 2173446, 2040385, 1921353, 1814959, 1719959, 1636190, 1562315, 1495404, 1433969, 1378984, 1330638, 1286542, 1244593, 1205245, 1169316, 1135776, 1103496, 1073169, 1045533, 1019400, 993309, 967691, 943732, 921439, 900357, 880881, 863327, 846894, 830877, 815742, 801839, 788391, 774968, 762574, 751979, 742236, 732119, 721696, 711258, 700085, 687658, 674912, 662856, 651098, 639056, 627530, 617666, 609303, 601616, 594546, 588419, 583043, 578274, 574615, 572223, 570345, 568788, 568860, 571684, 576497, 581835, 587461, 593895, 600789, 607070, 612070, 615463, 616639, 615171, 611466, 606110, 599070, 590134, 579501, 567436, 554180, 540770, 528981, 519749, 512383, 505687, 498749, 490313, 479048, 465415, 451933, 440509, 430695, 421534, 413699]
55769D13699n250k726r37J031L396M754M148K197m45l788p079q671q193p239p156
55754C77741p593p862q159q711r062q914q539q003p105o303o377o918o616n265
55740B72314m111l893l976l721l218k405r56N77J028L60k37k69m89j248j900k208
55724B45648k816l842m453m292l983l892l743l669m074m273l029p89M51Q3k42
55709B03085O70J832K062J881K208K685K520J807Q95m46k174l408l686l804m440
55694B01687n020m858m392m310m302l783k990k446k023j415r59j077j495j615
55680A61002j208k95J059K358K854K478J893J317K60j243k199k041j496j440j724
55665A61575j721j272n62J86N14J19l23L55K108L537L792L489L366L337L364L968
$$ y = [413699, 408449, 405723, 404786, 405817, 409213, 413967, 418115, 420312, 419867, 416079, 409000, 400329, 392136, 384897, 377741, 370148, 362286, 354127, 345416, 336354, 327440, 318901, 310898, 303793, 297490, 291113, 284195, 277579, 272314, 268203, 264310, 260334, 256613, 253395, 250990, 250034, 250611, 251639, 251999, 251762, 251493, 251004, 249756, 247856, 245648, 242832, 238990, 234537, 230245, 226262, 222370, 218627, 214958, 210884, 206611, 203582, 202793, 203244, 203327, 203085, 203755, 205587, 207649, 209530, 211738, 214423, 216943, 218750, 219645, 219199, 217025, 213617, 209931, 206127, 201687, 196667, 191809, 187417, 183107, 178805, 175022, 172032, 169586, 167563, 166148, 165189, 164112, 162617, 161002, 159794, 159499, 160558, 162916, 165770, 168248, 170141, 171458, 171718, 170475, 168276, 166235, 164739, 163299, 161575, 159854, 158582, 158020, 158206, 158720, 158839, 158516, 158871, 160979, 164516, 168308, 171797, 175163, 178500, 181864, 185832]
55649A85832N102N760N395M596L730K267K30j192j438j671k923m407m973n048
55635A91260n622o359o294n647n411n654n612n108m524l817k775j899j789k016
55621A28733j775j277j322j790j845j420j307j736k079j948j593j184o07m5R9
55606A08904j28l63o63j264j776j526o85j01m5rJ63o2q09j357j190o84l31M2O89
55587I8805J120N92p66j973k299j914j397r44l34N31J307J489Q61l17j430j749
55571I1582r17N40J506J409Q82Q55J231J152L87k81k32K10M71N39O53P44N90K81
55553A01602K4j91m59p17q75r65r91q78o04k16K85P47O99r9j057j308q03k48q
55534I3938J36J83j85p42o94O1N95L13k09k56q2k87p48q92n74r3L02M49K38o7
$$ y = [185832, 190934, 196694, 202089, 206685, 210415, 212682, 212912, 211720, 210282, 208611, 205688, 201281, 196308, 191260, 185638, 179279, 172985, 167338, 161927, 156273, 150661, 145553, 141029, 137212, 134437, 132538, 130749, 128733, 126958, 125681, 124359, 122569, 120724, 119304, 117997, 116261, 114182, 112234, 110641, 109457, 108850, 108805, 108904, 108776, 108413, 107750, 106486, 104710, 103184, 102499, 102398, 102353, 102344, 102507, 102445, 101636, 100279, 99089, 98405, 98074, 98116, 98805, 99925, 100517, 99751, 97778, 95479, 93565, 92168, 91224, 90890, 91421, 92728, 94217, 95078, 94761, 93331, 91582, 90665, 91205, 92711, 94120, 95002, 95857, 97088, 98240, 98627, 98346, 98114, 98324, 98795, 99334, 99987, 100731, 101321, 101602, 101626, 101435, 100976, 100259, 99384, 98419, 97428, 96550, 95946, 95730, 96015, 96762, 97461, 97362, 96305, 94997, 94194, 93946, 93938, 94074, 94257, 94072, 93330, 92636, 92697, 93292, 93605, 93396, 93140, 93058, 92771, 92023, 91131, 90557, 90464, 90766, 91215, 91453, 91386]
55514I1386J03Q37J396J122K34n81r38q66o18o40j195j819j761j060m82k94m3
55497H4781K42j97j337j874j011K26L94m81j394j846j834j093L79J554J356J75
55481G8040n59j80P24J382J500J073L57n7J67O06O78M53K82O8l67o32l48J7k67
55462H2937r62j158o08R1N24P99R40P49L02K0J36N63J106J404R40k45j195j050
55444H5293k15J83k60r55j291j185p83k97K2K07O23J216J212K44q00q84l07p7
55426H1946k13R7R02J294Q95L72L13N01N82N71M58J63N1O47J575J719P22m24p20
55407I1451l79j62k32j88P6J78j61p08r18n05J88M62J2q17j575k122k178j180
55389H1242P34K139J672j81j553j412m28L22N42M51K23O2J46K82R5k78l15L3K67
$$ y = [91386, 91489, 92326, 93722, 94844, 95078, 94497, 93559, 92693, 92075, 91435, 90240, 88421, 86660, 85600, 85118, 84824, 84781, 85023, 84826, 83489, 81615, 80604, 80830, 81224, 80743, 79349, 77503, 75669, 74576, 74955, 76509, 77865, 78040, 77481, 77301, 78025, 79407, 80907, 81980, 82337, 82280, 82447, 83053, 83731, 84184, 84466, 84534, 84167, 83535, 83187, 83204, 82937, 81975, 80817, 80209, 80300, 80824, 81623, 82563, 83312, 83614, 83634, 83770, 84333, 85439, 86843, 87783, 87538, 86343, 85293, 85078, 85261, 85001, 84046, 82755, 81570, 80787, 80490, 80512, 80719, 81342, 82558, 83770, 84014, 83214, 82330, 82023, 81946, 81733, 81830, 82732, 84026, 84921, 85293, 85606, 86107, 86689, 87260, 87718, 87881, 87932, 88579, 90154, 91873, 92595, 92171, 91451, 91072, 90910, 90678, 90490, 90566, 90744, 90583, 89875, 88957, 88452, 88640, 89102, 89114, 88297, 86722, 84600, 82422, 81242, 81976, 84115, 85787, 85606, 84053, 82641, 82213, 82535, 83077, 83528, 83751, 83813, 83959, 84241, 84336, 84058, 83743, 83776, 84043]
55370H4043K83N88J334J908J816J312P62L5r74j785j835j257o24k59j73m24r88
55353H3762j444j202j92R71J603J664J675J930J953J073m67j529j384n20K05O83
55337H8781J219J633J496J003P57P38L46n05j167j190q58o12n97q29j223j342
55321H7650p62J85O76M43J9j98l57n10l31K55P98R54Q31M73k33r48r17m3P27O37
55301H9349J07k6L11N82N84N37M77J59m60j017j070m41N89J354J347Q20N41P61
55283I4504Q76L82k85l37K48P36O63L57L29N27M71n6p62j248j412j263o69K70
55265I3331P66K2j504k232j330K36J056J000Q23P08K92k54l79k28l86o45k08P20
55247I1788R06K0o08J12J393J675N93q86j792j849j267m84Q1M00P22R77P34kn96
$$ y = [84043, 84326, 84914, 86248, 88156, 89972, 91284, 92046, 92081, 91107, 89322, 87487, 86230, 85606, 85347, 85174, 84750, 83762, 82318, 81116, 80924, 81895, 83498, 85162, 86837, 88767, 90720, 91793, 91326, 89797, 88413, 87893, 88098, 88781, 90000, 91633, 93129, 94132, 94889, 95627, 95973, 95468, 94301, 93111, 92253, 91641, 91044, 90215, 88992, 87650, 86888, 87073, 87749, 88192, 88211, 88013, 87656, 87146, 86815, 87070, 87868, 88822, 89653, 90126, 89893, 88945, 88028, 87985, 88712, 89349, 89456, 89430, 89741, 90323, 90907, 91444, 91921, 92080, 91620, 90603, 89533, 89092, 89681, 91035, 92382, 93202, 93743, 94504, 95380, 95762, 95477, 95140, 95388, 96124, 96787, 97144, 97473, 98000, 98471, 98415, 97653, 96405, 94993, 93730, 93061, 93331, 94097, 94119, 92615, 90383, 89053, 89289, 90345, 91345, 92168, 92876, 93168, 92914, 92535, 92307, 91921, 91276, 91068, 91788, 92694, 92714, 92106, 92218, 93611, 95286, 95879, 94993, 93201, 91352, 90085, 89601, 89682, 90082, 90804, 91781, 92515, 92513, 91917]
55228I1917o17l16L7N78J186J222N15l7M41J512J946J216j03j074j135l65N14
55211I7437P22L19Q6L09L93P5J13J012J829J318j97j211j016l16O6R1Jj79m28
55192A00424o21p78r54q82k85N02Q16N57K44J36r3o41j135j142o46J31R29J307
55174I7869P95m98j769k269j901r80K14J368J999J809J098N15M55Q63J489K051
55158A03108K221J787R91M12L25L30j41j009j590j454q87l51P5M22M13j31p14
55141A03807o10J44P86Q30M65q1q02j461j517q95j96J79N14J030J251O83l01q94
55123A02932q29m98k95l64p02j071j061o01j53k7J11N98J088J090Q20Q64J200
55106A03102J305J051Q00P24O50N99P77J029R58O64O67J006J059N12j15k37J0
$$ y = [91917, 91300, 90984, 91021, 91599, 92785, 94007, 94522, 94485, 94926, 96438, 98384, 99600, 99497, 98423, 97288, 96923, 97437, 98159, 98478, 98564, 98873, 99266, 99341, 99454, 100466, 102295, 103613, 103416, 102205, 101189, 100873, 100939, 101030, 101031, 100852, 100424, 99803, 99025, 98071, 97189, 96904, 97406, 98222, 98779, 99023, 99159, 99066, 98425, 97290, 96148, 95502, 95633, 96562, 97869, 98664, 98166, 96397, 94128, 92227, 91247, 91461, 92829, 94828, 96637, 97735, 98250, 98705, 99568, 101057, 103108, 105329, 107116, 108107, 108519, 108844, 109174, 109033, 108024, 106434, 104980, 104093, 103742, 103817, 104239, 104652, 104521, 103807, 103197, 103341, 104127, 104957, 105422, 105341, 104539, 103078, 101561, 100666, 100470, 100649, 101163, 102193, 103444, 104127, 103826, 102932, 102103, 101605, 101310, 100946, 100244, 99173, 98112, 97511, 97358, 97331, 97442, 98040, 99128, 100218, 101038, 101902, 103102, 104407, 105458, 106258, 106982, 107632, 108231, 109008, 110037, 110995, 111659, 112326, 113332, 114391, 114903, 114788, 114551, 114561]
55089A14561J67K10M00O59O39K79q5k69m82r08j272j120n05q7l27q60r62n92m59
55070A08987r58j532j427o92M8M99Q51J159J150P26J66k73n76p37o29k82mNj00
55051A06381r6n5k05n48p80o31j57L11M74L36J22J3j5n5o7J02N38J080J373J183
55031A09304P05L88L02K9o04r61l68P32J144M57m27o06k44OM5J60K69l0p73j441
55011A08087j404l86J218K327K021O89k13Q2P14N84j15m62k93q5J70Q02J395J108
54993A16239J16m15k8M15K13j17J13N54L87l91j067j244j079o99NR53J727J904
54975A17586J384M32m14o31j50N24Q24O92N33O67R47R42M15l87r62j090r45o79
54957A19688r2R19J840J944J218N01N25J134J632J609J224P96L38l95j386k037
$$ y = [114561, 114728, 114938, 115338, 115997, 116636, 116915, 116830, 116561, 116079, 115171, 113899, 112779, 112274, 112187, 111860, 111000, 110038, 109446, 108987, 108029, 106497, 105070, 104378, 104426, 104925, 105776, 106935, 108085, 108811, 108977, 108704, 108128, 107391, 106762, 106480, 106476, 106481, 106381, 106285, 106230, 106025, 105477, 104697, 104066, 103909, 104220, 104694, 105030, 105152, 105165, 105150, 105095, 105028, 105130, 105668, 106748, 108121, 109304, 110009, 110397, 110699, 110728, 110124, 109163, 108795, 109527, 110671, 111128, 110701, 110095, 109851, 109857, 109902, 110062, 110331, 110301, 109528, 108087, 106683, 106297, 107515, 109842, 111863, 112552, 112339, 112421, 113135, 113719, 113604, 113142, 112849, 112764, 112934, 113736, 115131, 116239, 116355, 115940, 115912, 116327, 116540, 116423, 116536, 117090, 117477, 117086, 116019, 114775, 113696, 112997, 113002, 113955, 115682, 117586, 118970, 119402, 118988, 118357, 118207, 118731, 119555, 120247, 120780, 121447, 122394, 123336, 123751, 123364, 122402, 121312, 120367, 119688, 119596, 120515, 122355, 124299, 125517, 126018, 126543, 127677, 129309, 130918, 132142, 132938, 133276, 132881, 131495, 129458]
54941A29458j635l23P34N33o20j490j287k33J030K035K470K209J569J175J341
54926A36966J884K546L236L761L879L820M303N664P294Q265Q345Q079P956P775
54912B13773O872M794J812j263l753n583p013q155q893r105q656p383n473l662
54898A58312k632k299k192k280k776l240k807j457l08k03o88p85k03O80J527K178
54882A40827K506K646L068L977M975N684O327P211Q054Q354Q090P519O596N179
54868B21013L489J746l30k961n474o901p241p361p648p682p264o810o460n729
54854A54387m505l567l456l555l007k010j429j481j597j368r05l76O5or34k168
54838A24088k539j581j19P08O11J03k78l33j23J28J69m3l22m83m00R7R68J593
$$ y = [129458, 127823, 127500, 128234, 128767, 128147, 126657, 125370, 125137, 126167, 128202, 130672, 132881, 134450, 135625, 136966, 138850, 141396, 144632, 148393, 152272, 156092, 160395, 166059, 173353, 181618, 189963, 198042, 205998, 213773, 220645, 225439, 227251, 225988, 222235, 216652, 209639, 201484, 192591, 183486, 174830, 167447, 161974, 158312, 155680, 153381, 151189, 148909, 146133, 142893, 140086, 138629, 138321, 138118, 137430, 136645, 136442, 137122, 138649, 140827, 143333, 145979, 149047, 153024, 157999, 163683, 170010, 177221, 185275, 193629, 201719, 209238, 215834, 221013, 224502, 226248, 225918, 222957, 217483, 210582, 203341, 195980, 188332, 180650, 173386, 166576, 160116, 154387, 149882, 146315, 142859, 139304, 136297, 134287, 132858, 131377, 129780, 128412, 127507, 127131, 127196, 127190, 126256, 124088, 121549, 119968, 119849, 120557, 121168, 121271, 120993, 120660, 120537, 120665, 120834, 120791, 120469, 119986, 119586, 119683, 120651, 122244]
54820A22244J259K16l85L5O97O20k7m34n17p89j161r17K1Q10Q92O95O99N93o2
54801A24489q99j094l95O44J338J383R28M68M57P84Q03J24q38j329j086m22K62
54784A25617Q00J224J617J928J887J339O33L50N58Q24J026J600K675L581L731
54769A49390L463L476L902M462N221O439P872Q827Q891Q133O786N153L628K273
54755B27916N93j706l989n386o011o792q007q803q337o829n220m208l855l699
54741A55667l176k142j089n83n43m13NL91N11N62P75J128J553K084K714L386M104
54724A64934M779N107M927M653M877N619O391O900P170O994N927L942J585p04
54710B33101l001n390p454q562q512p752o988o581o257n574m652m063l829l259
$$ y = [122244, 123503, 123719, 123334, 123369, 124066, 124686, 124659, 124225, 123708, 122919, 121758, 120841, 120862, 121672, 122564, 123259, 123958, 124551, 124489, 123590, 122496, 122101, 122745, 124083, 125466, 126394, 126862, 127319, 128103, 128906, 129030, 128192, 126863, 125777, 125355, 125617, 126417, 127641, 129258, 131186, 133073, 134412, 135045, 135395, 135953, 136777, 137803, 139403, 142078, 145659, 149390, 152853, 156329, 160231, 164693, 169914, 176353, 184225, 193052, 201943, 210076, 216862, 222015, 225643, 227916, 228509, 226803, 222814, 217428, 211417, 204625, 196618, 187815, 179478, 172649, 167429, 163221, 159366, 155667, 152491, 150349, 149260, 148677, 148134, 147721, 147726, 148117, 148628, 149190, 149965, 151093, 152646, 154730, 157444, 160830, 164934, 169713, 174820, 179747, 184400, 189277, 194896, 201287, 208187, 215357, 222351, 228278, 232220, 233805, 233101, 230100, 224710, 217256, 208694, 200182, 192430, 185442, 178861, 172604, 167030, 162378, 158315, 154486, 151227]
54696A51227k084j128j089j383j083m15k43m38j47N48N99k66j082j210j080j015
54680A39711o39M8K17m96j279j421j281j283r93j22N19J33o81q04k51N0j91l81
54662A30856j14L63O38M40l23j211j323m12N30N14k8m7L59J39q64j478r02J54
54644A27291N31J56p2M07J154J334P41L1r9J88J88k62n56l81k64o27r56n71K67
54625A28500P61O99M86L27J21k3O6R2l28r13r93n05j9J90L82O78Q78R86J329J881
54605A34595K109J685R09K30k18m30k77K65Q65J075P35J57j68r5n1m89j111j135
54587A38651m53J03k7l48k42L3M1J42Q82J778J858J107M00P4l26r21j120o45K2
54568A41009L98N10M89L72L68O47Q12L70k73k19M46O55Ro31o26n12q82j274r49
$$ y = [151227, 149143, 148015, 146926, 145543, 144460, 144045, 143802, 143364, 143217, 143765, 144364, 144098, 143016, 141806, 140726, 139711, 139072, 139120, 139337, 138841, 137562, 136141, 134860, 133577, 132584, 132462, 132981, 133114, 132433, 131629, 131378, 131428, 131237, 130856, 130742, 131105, 131743, 132183, 131860, 130649, 129326, 128914, 129444, 129958, 129930, 129883, 130242, 130381, 129517, 128039, 127137, 127291, 127822, 127978, 127906, 128313, 129467, 130801, 131542, 131573, 131474, 131662, 131850, 131588, 131032, 130651, 130387, 129760, 128804, 128233, 128500, 129261, 129960, 130446, 130773, 130894, 130871, 130937, 131029, 130701, 129788, 128795, 128290, 128271, 128461, 128843, 129521, 130399, 131385, 132714, 134595, 136704, 138389, 139298, 139528, 139310, 138880, 138603, 138868, 139733, 140808, 141543, 141700, 141532, 141437, 141386, 140897, 139786, 138651, 138198, 138301, 138274, 137926, 137684, 137717, 137758, 137900, 138782, 140560, 142418, 143525, 143925, 143999, 143673, 142752, 141632, 140987, 141009, 141407, 141917, 142406, 142778, 143146, 143793, 144605, 144975, 144702, 144483, 144929, 145584, 145593, 144962, 144336, 143824, 142942, 141668, 140719]
54549A40719r1N46O70M90K00M1M12J307K049K124J820J621J449J066O84N64M73
54532A56144K38L79J317K378K436J471N82M79P32O74K78j65n98j045j266r41j76
54515A62917N05O24J82l88p15r10j350k035k391j935r16j34j41q02j451j402n42
54498A49116M92Q94N92K89N05R37R90N76J1n28j003j174p67R7R69J566J859J841
54480A57262J526J157J059J261J476J434J079N91L56P45J615K215J913R34R7p5
54464A74645L81J256K272K811K223P13n48o57n4O9o57j357j116j76M45K70j87
54447A80333k80n7j9l66q37j145j192j008p19n48n55n03k53j21m47r93j227j073
54429A68990q61o23j39L32J75m87o81M7R14J062P58P56J069J148R23P79P45M46
$$ y = [140719, 140628, 141174, 141844, 142334, 142534, 142575, 142987, 144294, 146343, 148467, 150287, 151908, 153357, 154423, 155107, 155671, 156144, 156382, 156761, 158078, 160456, 162892, 164363, 164945, 165424, 166156, 166830, 167108, 166943, 166345, 165300, 164034, 163093, 162917, 163422, 164046, 164228, 163840, 163125, 162215, 160865, 158830, 156439, 154504, 153588, 153454, 153313, 152511, 151060, 149658, 149116, 149608, 150502, 151094, 151383, 151888, 152825, 153815, 154391, 154402, 153874, 152871, 151697, 150930, 151027, 151996, 153562, 155421, 157262, 158788, 159945, 161004, 162265, 163741, 165175, 166254, 166845, 167201, 167946, 169561, 171776, 173689, 174623, 174720, 174645, 175026, 176282, 178554, 181365, 183588, 184301, 183753, 183096, 183042, 183111, 182454, 181097, 179981, 179805, 180250, 180520, 180333, 180053, 179996, 179977, 179611, 178774, 177629, 176437, 175429, 174710, 174162, 173607, 173104, 172851, 172730, 172283, 171290, 170063, 168990, 168129, 167506, 167367, 167699, 167874, 167387, 166706, 166753, 167667, 168729, 169487, 170243, 171312, 172460, 173383, 174162, 174907, 175353]
54411A75353j65p46j196j692k145k138j486m20P59J756K169J827J193Q54O98K00
54395A74821n15o94j24M77N49M47O84J008Q40K32j78o0K82M09K79J95L34M16p6
54376A79326j185k115k007j030k31j71l09qM27K46n45j150j054n59j91%K91P24
54358A70459R41O07p4m01P5R49J290P09k50q99j208j523j822j727j194o51m33
54341A64848m01k34J29M36L95o1o23p76l51J87K24k57p10p64n43k12K95R39J314
54322A63835J076M49L4J75P67J446J825J673J205J031J549K400K786K281J142
54307A83674l5p23p06l08k41q39j518j484r40q59j493j908j415o52n91j029r93
54290A67940l47Nm60j157j342j023o14k79m8r0l94n42k26K69M82M15L37K49j6
$$ y = [175353, 175188, 174442, 173246, 171554, 169409, 167271, 165785, 165365, 166124, 167880, 170049, 171876, 173069, 173923, 174621, 174821, 174306, 173612, 173488, 173965, 174514, 174961, 175645, 176653, 177493, 177725, 177547, 177487, 177769, 178178, 178457, 178652, 178986, 179402, 179326, 178141, 176026, 174019, 172989, 172758, 172587, 172278, 172270, 172697, 172943, 172398, 171248, 170194, 169635, 169444, 169444, 169735, 170459, 171400, 172007, 171933, 171532, 171607, 172556, 173846, 174555, 174305, 173406, 172198, 170675, 168853, 167126, 165932, 165281, 164848, 164447, 164213, 164342, 164778, 165173, 165112, 164489, 163713, 163362, 163549, 163773, 163516, 162806, 162042, 161499, 161287, 161582, 162521, 163835, 164911, 165360, 165394, 165569, 166336, 167782, 169607, 171280, 172485, 173516, 175065, 177465, 180251, 182532, 183674, 183639, 182916, 182210, 181902, 181661, 180822, 179304, 177820, 176880, 176021, 174528, 172620, 171205, 170553, 169962, 168933, 167940, 167593, 167598, 167138, 165981, 164639, 163616, 163002, 162723, 162675, 162585, 162191, 161649, 161423, 161692, 162174, 162589, 162926, 163175, 163159]
54271A63159l19l32m0K44L16K23N3q0m8K5l42j286k045j674l36Q52J278J460J960
54252A63068K364J946Q13k47p75r51j050j129j166j095o73J67R13Q76J02n83n61
54235A62019j35l4n24j206j492j116l62J32j9m42m06K26Q09Q51O54O95P88M47
54217A60885j98m69q9M30M49j53j023j660j615q24J29M93J68k81m81o23q01n83
54199A53754L00J261J436P40o5k93J01P08J105J062O67K06k32q19j523j831j331
54182A55246l83K64L61K97L82N12N27M55K98j8l89n46l70K9N60J112J375J032
54164A60744J99o91j340j588j132Q8J278J320K00q07p23n8O1o33j452j736j371
54147A52359o01J48M25J47k67m78o44r44r93l15P81J425J217O13K79M26P75Q33
$$ y = [163159, 162840, 162508, 162468, 162712, 163028, 163251, 163304, 163224, 163176, 163201, 162859, 161573, 159528, 157854, 157518, 158370, 159648, 161108, 163068, 165432, 167378, 168191, 167944, 167169, 166218, 165168, 164039, 162873, 161778, 161105, 161272, 162185, 163061, 163163, 162580, 162019, 161884, 161850, 161326, 160120, 158628, 157512, 157150, 157282, 157263, 156821, 156415, 156641, 157450, 158301, 158955, 159650, 160438, 160885, 160687, 160218, 160129, 160559, 161008, 160855, 159832, 158172, 156557, 155733, 155862, 156355, 156523, 156242, 155761, 155138, 154337, 153754, 154054, 155315, 156751, 157491, 157426, 157133, 157234, 157942, 159047, 160109, 160776, 160982, 160750, 159931, 158408, 156577, 155246, 154863, 155127, 155488, 155785, 156167, 156679, 157206, 157661, 157959, 157941, 157552, 157006, 156636, 156665, 157225, 158337, 159712, 160744, 160943, 160252, 158912, 157324, 156192, 156280, 157558, 158878, 159078, 158271, 157548, 157490, 157551, 156918, 155466, 153730, 152359, 151758, 151906, 152331, 152478, 152211, 151733, 151089, 150145, 149152, 148837, 149618, 151043, 152260, 152873, 153152, 153578, 154353, 155186]
54129A55186K97n51r17l54O07J059Q31N12M37L23q9n14n71k56J93N99P70M88j57
54110A57893o24m49K55R35J170R87P46Q12J177J425J185O41L29M64P49Q75Q23
54093A69393N63r1j048j700j583r97o17n77m04J24N52M01o7j38L68Q14O19J08
54075A65720J38Q78J458J067O0m18J77J296K106K290J881Q24p51k098k297j220
54059A71111J77P75L17m64o74r2P07J007O73K55L36R30J553J791J662J429J252
54042A82745J113J017J111J502J983K149J890J678K134L298M524N147N045M566
54028B19902M086L848L929M133M018L412K767K654K933K875K220J666J981K927
54014B63351L502L096K002Q74N5m94j013j822l030m197m535l796k660k012k003
$$ y = [155186, 155483, 154932, 154015, 153661, 154268, 155327, 156158, 156670, 157107, 157430, 157341, 156827, 156256, 156000, 156193, 156792, 157562, 158050, 157893, 157269, 156820, 157075, 158010, 159180, 160167, 160913, 161725, 162902, 164327, 165512, 166153, 166482, 166946, 167695, 168570, 169393, 169956, 169865, 168817, 167117, 165534, 164537, 163920, 163343, 162939, 163063, 163615, 164016, 163949, 163811, 164179, 164993, 165612, 165720, 165858, 166736, 168194, 169261, 169321, 168903, 169080, 170376, 172482, 174772, 176653, 177477, 176726, 174628, 172331, 171111, 171288, 172063, 172380, 171916, 171242, 171150, 171857, 172864, 173537, 173792, 174128, 175058, 176611, 178402, 180064, 181493, 182745, 183858, 184875, 185986, 187488, 189471, 191620, 193510, 195188, 197322, 200620, 205144, 210291, 215336, 219902, 223988, 227836, 231765, 235898, 239916, 243328, 246095, 248749, 251682, 254557, 256777, 258443, 260424, 263351, 266853, 269949, 271951, 272825, 272880, 272386, 271373, 269551, 266521, 262324, 257789, 253993, 251333, 249321, 247318]
53999B47318k174k232k284k300j911r13L50J392K135K847L748M874O217P737R198
53984B74002J0280J0801J0836J0514R722P985M751l0n470j0091j2812j3622j3285
53971B83581j2509j1533j0333q904p327n743m400l581l329l298l003k296j474
53958B05851q95n48j40M93J206J749J984J832J291N66N2l9J22L27O83J361K137
53941B18032K529K408K165K252K715L235L433L150K607K245K287K529K680K685
53927B54952K477J800P35Q1N64J733K383K092J661J896K653L309L525L238K634
53912B85733K471L640N823P323O907N360M447M754N394N478M945M053K962J947
53898C51237J310Q89K01p72j449j458j129j032j342j824k165k288k484l206m502
$$ y = [247318, 245144, 242912, 240628, 238328, 236417, 235504, 235854, 237246, 239381, 242228, 245976, 250850, 257067, 264804, 274002, 284282, 295083, 305919, 316433, 326155, 334140, 338891, 338861, 333391, 323300, 310488, 296866, 283581, 271072, 259539, 249206, 240302, 232975, 227232, 222832, 219251, 215922, 212624, 209621, 207325, 205851, 204956, 204408, 204268, 204761, 205967, 207716, 209700, 211532, 212823, 213389, 213441, 213402, 213524, 213851, 214534, 215895, 218032, 220561, 222969, 225134, 227386, 230101, 233336, 236769, 239919, 242526, 244771, 247058, 249587, 252267, 254952, 257429, 259229, 259964, 260045, 260609, 262342, 264725, 266817, 268478, 270374, 273027, 276336, 279861, 283099, 285733, 288204, 291844, 297667, 304990, 311897, 317257, 321704, 326458, 331852, 337330, 342275, 346328, 349290, 351237, 352547, 353436, 353637, 352865, 351416, 349958, 348829, 347797, 346455, 344631, 342466, 340178, 337694, 334488, 329986]
53883C29986n774o409o400o070n493m698m136m239m653m540l715k851k453k311
53869B66244k076j811j714j763j843j968k177k495k965l432l397k592j591j257
53855B35163j639k013j992j891j852j515q53n14q75j410j449j098q26o75l98R
53839B16172M29R03J364J447J013N36N39Q81J030P57K38k32k54M12J304J476Q16
53822B28831N59J734L645M787M942N249O340P546Q172Q476Q839Q756P391M702
53808C09969J445j671m309o242p290p547p365o948o148m734k844j057Q1O67J387
53793B57394K702M179M905M529L598K892K711K889L212L598M028M399M522M262
53779C09820L730L190K686J874N37r83k155l032m181n734p058p519p297o969o699
$$ y = [329986, 324212, 317803, 311403, 305333, 299840, 295142, 291006, 286767, 282114, 277574, 273859, 271008, 268555, 266244, 264168, 262357, 260643, 258880, 257037, 255069, 252892, 250397, 247432, 244000, 240603, 238011, 236420, 235163, 233524, 231511, 229519, 227628, 225776, 224261, 223408, 222894, 222019, 220609, 219160, 218062, 217236, 216561, 216163, 216172, 216601, 217504, 218868, 220315, 221328, 221864, 222403, 223284, 224314, 225071, 225309, 225077, 224823, 225235, 226539, 228015, 228831, 229390, 231124, 234769, 239556, 244498, 249747, 256087, 263633, 271805, 280281, 289120, 297876, 305267, 309969, 311414, 309743, 305434, 299192, 291902, 284355, 276990, 270042, 263894, 259160, 256316, 255259, 255340, 256007, 257394, 260096, 264275, 269180, 273709, 277307, 280199, 282910, 285799, 289011, 292609, 296637, 301036, 305558, 309820, 313550, 316740, 319426, 321300, 321837, 320854, 318699, 315667, 311486, 305752, 298694, 291175, 283878, 276909, 270210]
53764B70210o142n140m016l156k592k174j917j991k448l097l673m072m333m445
53750B21014m259l654k759j920j396j106p28q4O61J156J270J183J121J060Q82
53735B12441P06Q44J333J766J765J472J295J286J112N98Jl91n86o25l10M23J063
53718B24193R33N2q31j198j268j328j079q5J342K369K660K610K541K322J942J825
53702B37000K126K258J704R11P73J403K056K168J906J661J562J590J697J673J301
53687B61789P88O31R37J285J286R71N09j0l45j52N06J082J139O98j35j320k390
53670B67269k461j226M11J232R40J41n16p39m47R9K41m65j619k402k459k001j217
53653B54781k05O63R06N05j69r46j848k506k269j042M81J599K154K200J722R54
$$ y = [270210, 264068, 258928, 254912, 251756, 249164, 246990, 245073, 243082, 240634, 237537, 233864, 229792, 225459, 221014, 216755, 213101, 210342, 208422, 207026, 205920, 205192, 205108, 205769, 206925, 208195, 209378, 210499, 211559, 212441, 213147, 213991, 215324, 217090, 218855, 220327, 221622, 222908, 224020, 224618, 224619, 224228, 223642, 223017, 222707, 223130, 224193, 225126, 225178, 224347, 223149, 221881, 220553, 219474, 219389, 220731, 223100, 225760, 228370, 230911, 233233, 235175, 237000, 239126, 241384, 243088, 243999, 244772, 246175, 248231, 250399, 252305, 253966, 255528, 257118, 258815, 260488, 261789, 262577, 263208, 264145, 265430, 266716, 267687, 268196, 268186, 267841, 267689, 268195, 269277, 270416, 271114, 270979, 269659, 267269, 264808, 263582, 263993, 265225, 266165, 266306, 265790, 265051, 264604, 264703, 264944, 264479, 262860, 260458, 257999, 255998, 254781, 254576, 255239, 256145, 256650, 256481, 255535, 253687, 251181, 248912, 247870, 248351, 249950, 252104, 254304, 256026, 256980]
53637B56980M15K56L9m77q06m67J68L98K97N42J266J782J629J192J064J280J564
53620B67122J875K279K581K614K684L188L850L910L152K294K096K546L128L524
53606C06843L679L517L015K427K028J776J487J153P86K49l44l78N33J727K074
53591C30572J353L67k74o97j009r17n14n74j485k510k769k379j957j484o47J07
53575C15183j21j228j937j395k33L47ko72j068j162j148r95n20K16P66P12J43
53558C06886m33o64n38p6P32J545J755J305R61J364K149K449J972J137M64L68
53542C21376J208K833M275M647M260M174M744N369N698O177P166Q295R098R672
53528C98992J0262J0731J0840J0683J0431J0006R379Q866Q843R373J0328J1567
$$ y = [256980, 257395, 257651, 257690, 257213, 256407, 255940, 256108, 256506, 256803, 257345, 258611, 260393, 262022, 263214, 264278, 265558, 267122, 268997, 271276, 273857, 276471, 279155, 282343, 286193, 290103, 293255, 295549, 297645, 300191, 303319, 306843, 310522, 314039, 317054, 319481, 321509, 323285, 324772, 325925, 326711, 326960, 326616, 326238, 326771, 328498, 330572, 331925, 332292, 332018, 331321, 330312, 329395, 328881, 328307, 326822, 324312, 321543, 319164, 317207, 315723, 315076, 315183, 315062, 313834, 311897, 310502, 310269, 310616, 310614, 309942, 308874, 307712, 306564, 305569, 305049, 305265, 306031, 306743, 306886, 306453, 305789, 305251, 305175, 305907, 307452, 309207, 310512, 311473, 312837, 314986, 317435, 319407, 320544, 321008, 321376, 322584, 325417, 329692, 334339, 338599, 342773, 347517, 352886, 358584, 364761, 371927, 380222, 389320, 398992, 409254, 419985, 430825, 441508, 451939, 461945, 471324, 480190, 489033, 498406, 508734, 520301]
53516E20301J2786J3590J4001J4552J5628J7039J8491J9996K1500K2584K3113
53505G13581K3678K4795K5932K6029K4906K3470K2526K2034K1614K1186K0782
53494I70533K0266J9592J9107J9232J9971K0922K1604K1616K0734J9193J7749
53483A190519J7136J7394J7866J7868J7231J6233J5236J4494J4048J3625J2681
53472A364331J0754P848M469J279j226k922m109n413p384j0073j2960j5372j7014
53459A312208j8146j9245k0418k1205k1156k0664k0765k1857k3005k3074k2303
53448A080370k1999k2682k3363k2954k1685k0611k0237k0182j9819j8706j6704
53437H51428j4189j1930j0308q900p203n410l930k554q31J010K346L229M344N881
$$ y = [520301, 533087, 546677, 560678, 575230, 590858, 607897, 626388, 646384, 667884, 690468, 713581, 737259, 762054, 787986, 814015, 838921, 862391, 884917, 906951, 928565, 949751, 970533, 990799, 1010391, 1029498, 1048730, 1068701, 1089623, 1111227, 1132843, 1153577, 1172770, 1190519, 1207655, 1225049, 1242915, 1260783, 1278014, 1294247, 1309483, 1323977, 1338025, 1351650, 1364331, 1375085, 1382933, 1387402, 1388681, 1387455, 1384533, 1380424, 1375011, 1367627, 1357554, 1344594, 1329222, 1312208, 1294062, 1274817, 1254399, 1233194, 1212038, 1191374, 1170609, 1148752, 1125747, 1102673, 1080370, 1058371, 1035689, 1012326, 989372, 967687, 947076, 926839, 906657, 886838, 868132, 851428, 837239, 825309, 815001, 806101, 798898, 793488, 789558, 787004, 786173, 787183, 789529, 792758, 797102, 802983]
53423H02983P245Q106Q976J0445J2442J4549J6589J8557K0330K1749K2800K3646
53411I88417K4667K6342K8677L0876L2126L2710L3718L5609L7755L9503M0968
53400A351368M2510M4157M5963M8272N1075N3581N4937N5120N4812N4690N5089
53389A911574N5900N6531N6361N5526N4780N4338N3464N1539M8951M6349M3651
53378B488964M0381L6593L2665K8543K3965J9296J5254J1777P827K593l492r236
53366B695130j3958j8135k2906k8923l5733m2335m8224n3498n8006o1086o2442
53355B249884o2798o3171o3867o4462o4421o3348o1151n8399n6099n4595n3139
53344A584434n1142m9245m8432m8450m8099m6863m5254m3616m1579l8912l6053
$$ y = [802983, 810228, 818334, 827310, 837755, 850197, 864746, 881335, 899892, 920222, 941971, 964771, 988417, 1013084, 1039426, 1068103, 1098979, 1131105, 1163815, 1197533, 1233142, 1270897, 1310400, 1351368, 1393878, 1438035, 1483998, 1532270, 1583345, 1636926, 1691863, 1746983, 1801795, 1856485, 1911574, 1967474, 2024005, 2080366, 2135892, 2190672, 2245010, 2298474, 2350013, 2398964, 2445313, 2488964, 2529345, 2565938, 2598603, 2627146, 2651111, 2670407, 2685661, 2697438, 2705265, 2707858, 2704366, 2695130, 2681172, 2663037, 2640131, 2611208, 2575475, 2533140, 2484916, 2431418, 2373412, 2312326, 2249884, 2187086, 2123915, 2060048, 1995586, 1931165, 1867817, 1806666, 1748267, 1692168, 1637573, 1584434, 1533292, 1484047, 1435615, 1387165, 1339066, 1292203, 1246949, 1203333, 1161754, 1122842, 1086789]
53333A086789l3485l1163k8873k6597k4289k1774j9143j6762j4731j2759j0781
53322H46432r161q045o994n611m131l019k257j427k91J075K560M155N806P368
53308H26460Q733R866J0775J1496J2132J2898J4003J5420J6747J7620J8366J9846
53296I94362K2355K5020K6749K7509K8096K8854K9373K9439K9546L0085L0610
53285A301998L0345K9071K7241K5350K3503K1490J9114J6420J3648J0853P800
53274A526833M430J170j581m082o814r612j1841j3467j5173j7298j9354k0923
53262A412288k2332k4095k6130k8009k9512l0587l1183l1555l2258l3445l4545
53251A088637l5035l5064l4871l4201l2915l1688l1208l1051l0233k8720k7430
$$ y = [1086789, 1053304, 1022141, 993268, 966671, 942382, 920608, 901465, 884703, 869972, 857213, 846432, 837271, 829226, 822232, 816621, 812490, 809471, 807214, 805787, 805496, 806571, 809131, 813286, 819092, 826460, 835193, 845059, 855834, 867330, 879462, 892360, 906363, 921783, 938530, 956150, 974516, 994362, 1016717, 1041737, 1068486, 1095995, 1124091, 1152945, 1182318, 1211757, 1241303, 1271388, 1301998, 1332343, 1361414, 1388655, 1414005, 1437508, 1458998, 1478112, 1494532, 1508180, 1519033, 1526833, 1531263, 1532433, 1530852, 1526770, 1519956, 1510344, 1498503, 1485036, 1469863, 1452565, 1433211, 1412288, 1389956, 1365861, 1339731, 1311722, 1282210, 1251623, 1220440, 1188885, 1156627, 1123182, 1088637, 1053602, 1018538, 983667, 949466, 916551, 884863, 853655, 822604, 792371, 763651, 736221]
53240G36221k6734k6028k4939k3973k3464k2792k1322j9533j8358j7779j6887
53229D94412j5284j3663j2815j2616j2238j1083r247p291n753m862m550m685n193
53216C75132n875o344o310n914n518n270n056m786m409l729k688j827j934k973
53202C12499l874l808l193k913k966k632j803j247j419j769j615j062o91p54j157
53187B81596j799k497k836k609k112j720j411j127j165j696k174j976j384j217
53173B55873j543j592r99m00m39q76j071q83o44n46m96l48j8M74Q92R81Q49Q77
53155B50091J048Q30k3r70j378j361j471j791j846j344n67mO5l42r35j234r17
53138B37851j78M63O93N76L36J53J31K10J11l63r89j334j281j095r98r04o61k75
$$ y = [736221, 709487, 683459, 658520, 634547, 611083, 588291, 566969, 547436, 529078, 511299, 494412, 479128, 465465, 452650, 440034, 427796, 416713, 407466, 400175, 394422, 389560, 385010, 380325, 375132, 369257, 362913, 356603, 350689, 345171, 339901, 334845, 330059, 325650, 321921, 319233, 317406, 315472, 312499, 308625, 304817, 301624, 298711, 295745, 293113, 291310, 290063, 288644, 286875, 285260, 284198, 283507, 282753, 281596, 279797, 277300, 274464, 271855, 269743, 268023, 266612, 265485, 264320, 262624, 260450, 258474, 257090, 255873, 254330, 252738, 251739, 251339, 250900, 250024, 248953, 248070, 247426, 246880, 246384, 246036, 246018, 246492, 247384, 248365, 249214, 250091, 251139, 251969, 251946, 250976, 249598, 248237, 246766, 244975, 243129, 241785, 241218, 241214, 241279, 240937, 240002, 238768, 237851, 237673, 238136, 238829, 239405, 239741, 239894, 240025, 240235, 240346, 239983, 238994, 237660, 236379, 235284, 234286, 233382, 232721, 232446]
53120B32446J52N65Q97J074J097J042R55Q25O58M02j20r39j632j680j220j101
53104B33421j841k864l051k027m71P60J352J351P94j82j060j247o65J84P60Q74
53088B26088O03R7m25p02o61n59p35j209j610j518q96j98K9k49m67j36M92P21
53070B18665L84O1K56P07Q38N32J13k90p89j316j527j279q79p71j113j631j756
53053B10205r89N14J834K121J475P17L81L72N07P84R54N24m89j246j032j46N44
53036B17030O61M33M2n87j371j940k057j859j587j365j258j310j408j292q34k28
53020B01070J32m2o16j002o29L36R84O63j41l53L83J387J902J860J438N75o64
53003B07283j543j298j74O62M66l21p76n94j19K96N51N27J32l70m47O7O89Q77
$$ y = [232446, 232598, 233163, 234060, 235134, 236231, 237273, 238228, 239053, 239711, 240113, 239993, 239054, 237422, 235742, 234522, 233421, 231580, 228716, 225665, 223638, 223167, 223927, 225279, 226630, 227424, 227242, 226182, 224935, 224270, 224454, 225214, 226088, 226691, 226788, 226363, 225661, 225000, 224441, 223706, 222497, 220887, 219369, 218473, 218275, 218304, 218055, 217588, 217452, 217944, 218665, 219049, 219110, 219366, 220073, 220911, 221443, 221556, 221266, 220477, 219161, 217634, 216355, 215476, 214705, 213592, 211961, 210205, 209216, 209730, 211564, 213685, 215160, 215877, 216258, 216630, 217137, 217921, 218875, 219399, 218910, 217664, 216632, 216486, 217030, 217691, 218124, 218166, 217579, 216208, 214268, 212211, 210352, 208765, 207400, 206142, 204832, 203424, 202132, 201298, 201070, 201202, 201160, 200544, 199542, 198913, 199249, 200233, 200896, 200755, 200402, 200785, 202172, 204074, 205934, 207372, 207947, 207283, 205740, 204442, 204268, 204930, 205396, 205075, 204299, 203705, 203586, 203882, 204433, 204960, 205092, 204722, 204275, 204342, 205031, 205908]
52985B05908O62M69M98M97J62m76j039j105n60K37P31O89L83J37o6l16l26L21
52967B06806J487K409K421J573M67k86l65J45Q35J257J283J047N90j44r91j500
52951B17034j505j368j483j702j582j099p15p55r71q92m69j60l26o97o96k99k05
52934B02110q72j694j671p88j05l24q42o49L14J170J235N65m02j235j497r65N
52917A94355O56N54m5o36r44q98m53L03R90J200Q66K67k90p05r78j040p18M4R28
52898A93456J350R95L02J18P60J546J535O43k38k82L74R33R36O51M97M55K09l50
52880B03890r90j434j542j318r17o59p64j009r06l13L94P84Q53Q72R63J084J240
52863B00228J364J110J71j033j386k12J780L084K970K171J842K148K293J647M10
$$ y = [205908, 206570, 207039, 207537, 208034, 208196, 207720, 206681, 205576, 205016, 205253, 205984, 206673, 207056, 207193, 207127, 206811, 206485, 206806, 208293, 210702, 213123, 214696, 215163, 214877, 214512, 214657, 215492, 216749, 218032, 219079, 219669, 219525, 218534, 217034, 215529, 214161, 212678, 210976, 209394, 208295, 207580, 206825, 205854, 204962, 204493, 204333, 204007, 203310, 202614, 202315, 202110, 201238, 199544, 197873, 197085, 196980, 196656, 195814, 195165, 195479, 196649, 197884, 198449, 198047, 196812, 195315, 194350, 194355, 195011, 195565, 195520, 194884, 193940, 193042, 192589, 192892, 193882, 195082, 195948, 196215, 195925, 195220, 194242, 193202, 192484, 192528, 193456, 194806, 195801, 196103, 196221, 196981, 198527, 200062, 200705, 200467, 200185, 200559, 201492, 202428, 203079, 203576, 204031, 204240, 203890, 202900, 201466, 199924, 198606, 197689, 197030, 196266, 195257, 194351, 194038, 194432, 195216, 196069, 196941, 197904, 198988, 200228, 201592, 202702, 202873, 201840, 200454, 200242, 202022, 205106, 208076, 210247, 212089, 214237, 216530, 218177, 218587]
52848B18587q65j831k271k030j443j381k279l311l206j851m70q7m46p00o19o16
52832A95181r05j166j000l70M04Q81Q46N67N76J052J583J721J563J485J497J316
52816B05231R42P54Q97J014Q13N42O37J067J461J760K297L124L615L081J625l7
52800B28823j429k616l601l973l488k612k044j928j961k003k161k339k264k037
52786A94367k101k576l006k911k228j154j1O64M87j01q1Q59J771J639P03J8L5
52769A86374K82L06K68M84Q89J160J075O70K08L5K37M66L27r2l04q7K15J39l96
52750A92256j038j331r92j08Q84J479J524J301J209J323J384J139O84L40K32J39
52734B00425j52m87n37k39K03O36R84J077Q74P94J315K220K764K649K264J778
$$ y = [218587, 217722, 215891, 213620, 211590, 210147, 208766, 206487, 203176, 199970, 198119, 197649, 197562, 197116, 196416, 195797, 195181, 194276, 193110, 192110, 191740, 192144, 193025, 193871, 194438, 195014, 196066, 197649, 199370, 200933, 202418, 203915, 205231, 206173, 206927, 207824, 208838, 209651, 210193, 210830, 211897, 213358, 215118, 217415, 220539, 224154, 227235, 228860, 228823, 227394, 224778, 221177, 217204, 213716, 211104, 209060, 207132, 205171, 203168, 201007, 198668, 196404, 194367, 192266, 189690, 186684, 183773, 181545, 180391, 180380, 181044, 181531, 181430, 181349, 182208, 183979, 185618, 186321, 186339, 186374, 186656, 186962, 187230, 187714, 188603, 189763, 190838, 191508, 191716, 191751, 191988, 192454, 192781, 192689, 192385, 192298, 192513, 192652, 192256, 191218, 189887, 188895, 188787, 189671, 191150, 192674, 193975, 195184, 196507, 197891, 199030, 199714, 200054, 200286, 200425, 200273, 199786, 199249, 199010, 199213, 199849, 200833, 201910, 202784, 203578, 204893, 207113, 209877, 212526, 214790, 216568]
52718B16568P15j112k871l584l320k909k738k509k008j394p54k6N30M00m71j405
52702A93112j748j514j152q68m70J79P63P45Q1n04k39P05J395J366J151J284J446
52685A95732J104N44M92R63J245R45L66j45n76q58p11n3P82J379J545J262P22
52668B04738K88J33l3m02n62p5O29P58M90Q22J971K794K265Q34k30k61N01J561
52650B16221K519L137L533M061M633M466K940N01j756l167l784l847l523l069
52636B22865k709k377j887j313r29p68o32m24j04N79J804L150L775L361K413J477
52620B28281N12o23j560j877j887k265k931l024k181j191q90j053r55n67m31n94
52604B06764n88l70l94o24m19L06P59N26L07P47J345J313Q70P46Q89O60Rm78n09
$$ y = [216568, 217283, 216171, 213300, 209716, 206396, 203487, 200749, 198240, 196232, 194838, 194084, 194058, 194588, 194988, 194517, 193112, 191364, 189850, 188698, 187830, 187360, 187539, 188302, 189047, 189128, 188624, 188385, 189090, 190485, 191851, 193002, 194286, 195732, 196836, 197380, 197872, 198835, 200080, 201025, 201391, 201246, 200670, 199812, 199101, 199048, 199830, 201209, 202754, 204016, 204738, 205026, 205159, 205126, 204724, 204162, 204087, 204716, 205474, 205964, 206786, 208757, 211551, 213816, 214650, 214420, 214159, 214660, 216221, 218740, 221877, 225410, 229471, 234104, 238570, 241510, 242011, 240255, 237088, 233304, 229457, 225934, 222865, 220156, 217779, 215892, 214579, 213650, 212882, 212250, 211826, 211722, 212301, 214105, 217255, 221030, 224391, 226804, 228281, 228793, 228170, 226610, 224733, 222846, 220581, 217650, 214626, 212445, 211254, 210364, 209311, 208356, 207789, 207358, 206764, 206176, 205806, 205412, 204788, 204369, 204675, 205434, 205960, 206267, 207014, 208359, 209672, 210542, 211288, 212177, 212837, 212846, 212368, 211859]
52585B11859k26L64J216J704J215K36j42K26M96L31L62R31J471J524J419J474
52569B24460J346P04j56q58j444j941k077j800j452j103m87J53O7o77q89K0R88
52552B14854Q37K4k05K72N72L82K18K99K75J53M57J386K434L032K897J879J54
52535B29920j429j928j398q33r29j417j670j433q45k11J77L43P10J456J896J200
52519B23609l50j421j202k29N19P73Q61J035J356J939K741L262K934J861Q36N47
52503B39071Q87J171R11K41l80p03p87p79q44j141j569j624r51l8J90m07q93m73
52485B31882M86J099J099R13R21J148J428J437Q38j78q07n35K03O74Q15J033J396
52468B43852J663J843K078K133J691R30K82j87m97j89J031K292K135K40k169l704
$$ y = [211859, 211633, 211997, 213213, 214917, 216132, 216368, 216226, 216452, 216948, 217279, 217641, 218572, 220043, 221567, 222986, 224460, 225806, 226510, 226354, 225496, 224052, 222111, 220034, 218234, 216782, 215679, 215192, 215345, 215412, 214735, 213846, 213866, 214854, 215691, 215715, 215510, 215782, 216354, 216736, 216954, 217253, 217528, 217681, 218138, 219524, 221958, 224990, 227887, 229766, 229920, 228491, 226563, 225165, 224332, 223403, 221986, 220316, 218883, 218038, 217827, 218004, 218347, 219057, 220513, 222409, 223609, 223259, 221838, 220636, 220407, 220926, 221699, 222560, 223595, 224951, 226890, 229631, 232893, 235827, 237688, 238524, 239071, 239958, 241129, 242040, 242281, 241901, 241198, 240411, 239632, 238788, 237647, 236078, 234454, 233503, 233465, 233655, 233248, 232355, 231882, 232368, 233467, 234566, 235479, 236400, 237548, 238976, 240413, 241251, 241073, 240266, 239731, 239934, 240608, 241423, 242456, 243852, 245515, 247358, 249436, 251569, 253260, 254190, 254472, 254285, 253788, 253599, 254630, 256922, 259057, 259297, 257128, 253424]
52452B53424l943l199k067j297j328j723j756j522j659j981j525k10P47N87N2
52437B32600k3n9p07j402j130j48L17j57q22j095j235j523j676j435j064r10q94
52420B18637o88j56N65J194J473J409J303J375J436J266J130J461K172K707K833
52405B38117K885L214L779M415N088N757O362O942P481P478O193L526K89k573
52391B98953m693n986o294n751n062m767m471l414j735m41j73o04j110j387j235
52376B51830m62O35J317J388J566K369L172L093K381K001K149K097J491Q45N84
52361B76456M24J6n43j131j827k404k275j342k52N61J316J997J896P98k55l15
52345B73120j8n85j810k283j477l95J5K9L63J112J904K508K916L210L555L945
$$ y = [253424, 249481, 246282, 244215, 242918, 241590, 239867, 238111, 236589, 234930, 232949, 231424, 231214, 231961, 232548, 232600, 232577, 232518, 231811, 230409, 229279, 229131, 229448, 229291, 228469, 227374, 226139, 224616, 222940, 221505, 220441, 219531, 218637, 217949, 217793, 218358, 219552, 221025, 222434, 223737, 225112, 226548, 227814, 228944, 230405, 232577, 235284, 238117, 241002, 244216, 247995, 252410, 257498, 263255, 269617, 276559, 284040, 291518, 297711, 301237, 301526, 298953, 294260, 288274, 281980, 276229, 271167, 266400, 261929, 258515, 256780, 256339, 256166, 255562, 254452, 253065, 251830, 251368, 252003, 253320, 254708, 256274, 258643, 261815, 264908, 267289, 269290, 271439, 273536, 275027, 275872, 276456, 276880, 276896, 276353, 275222, 273395, 270991, 268716, 267374, 267122, 267683, 268999, 270996, 272892, 273690, 273435, 273120, 273102, 272517, 270707, 268424, 266947, 266552, 266567, 266596, 266959, 268071, 269975, 272483, 275399, 278609, 282164, 286109]
52329B86109M003L519L084L548M802N828O038N867N869O035O229O510O685O216
52315C60342N057L958L564L712L996M370M741M643L894L135L035L355L379K952
52301D14133K546K559L110M211N526O282N961M999M249L864L258K099Q14P3O4
52286D63748L83L59l58j315j543o22P68J643J847J925K162K302K140J857J668
52271D76964J579J601J838K281K719K991L102L080K950K832K879L083L255L231
52257E14385L020K827K946L481M072M151L736L591M311N416N833N171M185L817
52243E70942M135M325L626K192J018R10J651K378K704K996L468L663L233K695
52229F09936K774L323L631L573L676M097M308M037L817M183M801M871M110L020
$$ y = [286109, 290112, 293631, 296715, 300263, 305065, 310893, 316931, 322798, 328667, 334702, 340931, 347441, 354126, 360342, 365399, 369357, 372921, 376633, 380629, 384999, 389740, 394383, 398277, 401412, 404447, 407802, 411181, 414133, 416679, 419238, 422348, 426559, 432085, 438367, 444328, 449327, 453576, 457440, 460698, 462797, 463611, 463684, 463748, 464131, 464490, 464132, 462817, 461274, 460652, 461420, 463063, 464910, 466835, 468997, 471299, 473439, 475296, 476964, 478543, 480144, 481982, 484263, 486982, 489973, 493075, 496155, 499105, 501937, 504816, 507899, 511154, 514385, 517405, 520232, 523178, 526659, 530731, 534882, 538618, 542209, 546520, 551936, 557769, 562940, 567125, 570942, 575077, 579402, 583028, 585220, 586238, 587148, 588799, 591177, 593881, 596877, 600345, 604008, 607241, 609936, 612710, 616033, 619664, 623237, 626913, 631010, 635318, 639355, 643172, 647355, 652156, 657027, 661137, 664157]
52215F64157K375K680L894N293N818N026L747L392M396N672N914N143M472M452
52201G26431M351L430K242J948K625L189L043K883L472M429M861M662M449M406
52187G76421M039L070J983J408J305J006J9j283j964j667j306k120m050n649n914
52172G65298n429n207n110m263k669j421j299j933k456k390j754q55j11K98O54
52157G31353J247J837J945J574J142Q31N65M81Q07J305J530J608K070K890L439
52142G54624L506L520L566L035J684K87l65n40j048k111l245l856l535k179k74
52127G53069J289K143K847L970N255O241P168Q520J0040J1030J1433J1738J1822
52114H46565J0858Q640O174M535L693K920J890Q28r6q63j213p84K44J117J405
$$ y = [664157, 666532, 669212, 673106, 678399, 684217, 689243, 692990, 696382, 700778, 706450, 712364, 717507, 721979, 726431, 730782, 734212, 736454, 738402, 741027, 744216, 747259, 750142, 753614, 758043, 762904, 767566, 772015, 776421, 780460, 783530, 785513, 786921, 788226, 789232, 789251, 787968, 786004, 784337, 783031, 780911, 776861, 771212, 765298, 759869, 754662, 749552, 745289, 742620, 741199, 739900, 737967, 735511, 733121, 731367, 730512, 730401, 730699, 731353, 732600, 734437, 736382, 737956, 739098, 739929, 740494, 740975, 741782, 743087, 744617, 746225, 748295, 751185, 754624, 758130, 761650, 765216, 768251, 769935, 770222, 769857, 769317, 768269, 766158, 762913, 759057, 755522, 753343, 753069, 754358, 756501, 759348, 763318, 768573, 774814, 781982, 790502, 800542, 811572, 823005, 834743, 846565, 857423, 866063, 872237, 876772, 880465, 883385, 885275, 886103, 886007, 885144, 883931, 883147, 883391, 884508, 885913]
52099H85913J610K540M220N854O769O999O821O185M949L410K061Q97n81k559m562
52084I30526o016o797o994o521n333l818k500j489n23L92Q25M73l51r43q69k64
52068H89798L98P81Q67Q03O39L26m4j70K30J074J921K313K150J725J385J235J150
52051I06581J015P89L96j84p67j182j728k992m908o419o513n381m107l454l348
52036H67798l412l292k570j092M97J204R23O17J047J889K405K395K102J695J370
52021H73576J505K141K663K579K351K816L972M926N029M478L862L528L530L709
52007I20665L689L061J734j45k492n295q369j1404j4212j6639j8332j9025j9039
51994H14197j9059j9234j8928j7601j5656j4088j3430j3340j3172j2720j2236
$$ y = [885913, 887523, 890063, 894283, 900137, 906906, 913905, 920726, 926911, 931860, 935270, 937331, 938228, 937647, 935088, 930526, 924510, 917713, 910719, 904198, 898865, 895047, 892547, 891058, 890535, 890927, 891752, 892225, 891874, 890931, 890062, 889798, 890196, 890977, 891844, 892647, 893286, 893612, 893568, 893398, 893628, 894702, 896623, 898936, 901086, 902811, 904196, 905431, 906581, 907596, 908385, 908781, 908597, 907830, 906648, 904920, 901928, 897020, 890601, 884088, 878707, 874600, 871146, 867798, 864386, 861094, 858524, 857432, 857929, 859133, 860056, 860673, 861720, 863609, 866014, 868409, 870511, 872206, 873576, 875081, 877222, 879885, 882464, 884815, 887631, 891603, 896529, 901558, 906036, 909898, 913426, 916956, 920665, 924354, 927415, 929149, 929004, 926512, 921217, 912848, 901444, 887232, 870593, 852261, 833236, 814197, 795138, 775904, 756976, 739375, 723719, 709631, 696201, 682861, 669689, 656969, 644733]
51983F44733j1876j1408j0585r613q928q662q585q658r177j0134j0869j0701r630
51970E15907q116o392m429k383n50J053K648M302N919P484Q949R935J0061R507
$$ y = [644733, 632857, 621449, 610864, 601251, 592323, 583661, 575076, 566418, 557241, 547107, 536238, 525537, 515907, 507791, 501399, 496970, 494587, 494037, 495090, 497738, 502040, 507959, 515443, 524392, 534327, 544388, 553895]
$$ [...]
##END NTUPLES=NMR SPECTRUM
##END=
