
##TITLE=UV1277_M1_1242-1388_5_7534755_alWyTzJXhH
##JCAMPDX= 6.0         $$ Bruker NMR JCAMP-DX V2.0
##DATA TYPE= NMR SPECTRUM
##DATA CLASS= NTUPLES
##ORIGIN= BRUKER
##OWNER= Administrator
$$ 1.72 TOPSPIN		Version 2.1
$$ 2013-02-21 23:02:12.709 -0500  Administrator@X
$$ Compression mode = diff/dup
##.OBSERVE FREQUENCY= 400.02188249412
##.OBSERVE NUCLEUS= ^1H
##.ACQUISITION MODE= SIMULTANEOUS (DQD)
##.ACQUISITION SCHEME= undefined
##.AVERAGES= 8
##.DIGITISER RES= 22
##SPECTROMETER/DATA SYSTEM= spect
##.PULSE SEQUENCE= zg30
##.SOLVENT NAME= COFFEE_meoh
##.SHIFT REFERENCE= INTERNAL, COFFEE_meoh, 1, 14.98509
##AUDIT TRAIL= $$ (NUMBER, WHEN, WHO, WHERE, PROCESS, VERSION, WHAT)
$$ ##TITLE= Audit trail, TOPSPIN		Version 2.1
$$ ##JCAMPDX= 5.01
$$ ##ORIGIN= Bruker BioSpin GmbH
$$ ##OWNER= Administrator
$$ $$ E:\/data/COFFEE/nmr/UV1277_M1_1242-1388_5_7534755_alWyTzJXhH/10/pdata/1/auditp.txt
$$ ##AUDIT TRAIL=  $$ (NUMBER, WHEN, WHO, WHERE, PROCESS, VERSION, WHAT)
(   1,<2013-02-21 23:02:04.459 -0500>,<Administrator>,<X>,<go>,<TOPSPIN 2.1>,
      <created by zg
	started at 2013-02-21 23:00:57.944 -0500,
	POWCHK enabled, PULCHK disabled,
       configuration hash MD5:
       86 BA 57 50 F2 9D 5C 9B 26 00 A9 28 5F 66 2E 89
       data hash MD5: 64K
       05 EB C9 B9 10 F6 63 D4 B4 D1 23 6A CF 21 DB AC>)
(   2,<2013-02-21 23:02:07.553 -0500>,<Administrator>,<X>,<proc1d>,<TOPSPIN 2.1>,
      <Start of raw data processing
       efp LB = 0 FT_mod = 6 PKNL = 1 PHC0 = 0 PHC1 = 0 SI = 32K 
       data hash MD5: 32K
       37 59 BD 9D 78 26 79 15 CA 4D 8C 31 E7 A1 AE 9A>)
(   3,<2013-02-21 23:02:08.037 -0500>,<Administrator>,<X>,<proc1d>,<TOPSPIN 2.1>,
      <pk PHC0 = 69.69177 PHC1 = 0 
       data hash MD5: 32K
       1B DD 92 B0 D5 F9 40 E1 DC AF B0 4C 01 1D 11 24>)
(   4,<2013-02-21 23:02:08.319 -0500>,<Administrator>,<X>,<proc1d>,<TOPSPIN 2.1>,
      <abs ABSG = 1 
       data hash MD5: 32K
       C9 46 AF 46 EC C5 7D 96 0D 8F 81 70 2D 5F 59 5B>)
(   5,<2013-02-21 23:02:08.459 -0500>,<Administrator>,<X>,<proc1d>,<TOPSPIN 2.1>,
      <abs ABSG = 2 
       data hash MD5: 32K
       BE 43 F8 AB FE EC 7F 40 D5 5A 11 9E 9E FE 8B F7>)
(   6,<2013-02-21 23:02:08.615 -0500>,<Administrator>,<X>,<proc1d>,<TOPSPIN 2.1>,
      <abs ABSG = 3 
       data hash MD5: 32K
       E1 C7 86 5A 98 2C A8 49 17 74 7B F2 B0 D9 A4 01>)
(   7,<2013-02-21 23:02:08.787 -0500>,<Administrator>,<X>,<proc1d>,<TOPSPIN 2.1>,
      <abs ABSG = 4 
       data hash MD5: 32K
       10 8F 5F D6 E3 73 57 D0 60 58 BB F9 10 36 A3 1B>)
(   8,<2013-02-21 23:02:08.944 -0500>,<Administrator>,<X>,<proc1d>,<TOPSPIN 2.1>,
      <abs ABSG = 5 
       data hash MD5: 32K
       F4 1F A1 99 D3 FA 54 82 20 DE E0 04 90 BF A9 B5>)
$$ ##END=
$$ 
$$ $$ hash MD5
$$ $$ 85 9E 94 1E E5 90 FB 16 31 F8 A9 06 69 64 CC 75
##$RELAX= 
##$RELAX= 
##$RELAX= 
##$RELAX= 
##$RELAX= 
##$RELAX= 
##$RELAX= 
$$ Bruker specific parameters
$$ --------------------------
##$DU= <E:\>
##$EXPNO= 10
$$ [...]
150 150 150 150 150 150 150 150
##$TP07= 0
##$TPNAME0= <>
##$TPNAME1= <>
##$TPNAME2= <>
##$TPNAME3= <>
##$TPNAME4= <>
##$TPNAME5= <>
##$TPNAME6= <>
##$TPNAME7= <>
##$TPOAL= (0..7)
0.5 0.5 0.5 0.5 0.5 0.5 0.5 0.5
##$TPOFFS= (0..7)
0 0 0 0 0 0 0 0
##$TUNHIN= 0
##$TUNHOUT= 0
##$TUNXOUT= 0
##$USERA1= <user>
##$USERA2= <user>
##$USERA3= <user>
##$USERA4= <user>
##$USERA5= <user>
##$V9= 5
##$VALIST= <valist>
##$VCLIST= <CCCCCCCCCCCCCCC>
##$VD= 0
##$VDLIST= <DDDDDDDDDDDDDDD>
##$VPLIST= <PPPPPPPPPPPPPPP>
##$VTLIST= <TTTTTTTTTTTTTTT>
##$WBST= 1024
##$WBSW= 4
##$XGAIN= (0..3)
0 0 0 0
##$XL= 0
##$YL= 0
##$YMAX_a= 523259
##$YMIN_a= -522570
##$ZGOPTNS= <>
##$ZL1= 120
##$ZL2= 120
##$ZL3= 120
##$ZL4= 120
##$ABSF1= 14.98509
##$ABSF2= -5.573092
##$ABSG= 5
##$ABSL= 3
##$ALPHA= 0
##$AQORDER= 0
##$ASSFAC= 0
##$ASSFACI= 0
##$ASSFACX= 0
##$ASSWID= 0
##$AUNMP= <proc_prof1d_extract_pilot.lims>
##$AXLEFT= 0
##$AXNAME= <>
##$AXNUC= <1H>
##$AXRIGHT= 0
##$AXTYPE= 0
##$AXUNIT= <>
##$AZFE= 0.1
##$AZFW= 0.1
##$BCFW= 0
##$BC_mod= 0
##$BYTORDP= 0
##$COROFFS= 0
##$CY= 15
##$DATMOD= 1
##$DC= 0
##$DFILT= <>
##$DTYPP= 0
##$F1P= 0
##$F2P= 0
##$FCOR= 0.5
##$FTSIZE= 32768
##$FT_mod= 6
##$GAMMA= 0
##$GB= 0
##$INTBC= 1
##$INTSCL= 1
##$ISEN= 128
##$LB= 0
##$LEV0= 0
##$LPBIN= 0
##$MAXI= 10000
##$MC2= 0
##$MEAN= 0
##$ME_mod= 0
##$MI= 0
##$NCOEF= 0
##$NC_proc= -8
##$NLEV= 6
##$NOISF1= 0
##$NOISF2= 0
##$NSP= 0
##$NTH_PI= 0
##$NZP= 0
##$OFFSET= 14.98509
##$PC= 1
##$PHC0= 69.69177
##$PHC1= 0
##$PH_mod= 1
##$PKNL= yes
##$PPARMOD= 0
##$PPDIAG= 0
##$PPIPTYP= 0
##$PPMPNUM= 2147483647
##$PPRESOL= 1
##$PSCAL= 4
##$PSIGN= 0
##$PYNMP= <proc.py>
##$REVERSE= no
##$SF= 400.02
##$SI= 32768
##$SIGF1= 0
##$SIGF2= 0
##$SINO= 400
##$SIOLD= 32768
##$SPECTYP= <>
##$SREGLST= <1H.CDCl3>
##$SSB= 0
##$STSI= 32768
##$STSR= 0
##$SW_p= 8223.68421052631
##$SYMM= 0
##$S_DEV= 0
##$TDeff= 65536
##$TDoff= 0
##$TI= <>
##$TILT= no
##$TM1= 0
##$TM2= 0
##$TOPLEV= 0
##$USERP1= <user>
##$USERP2= <user>
##$USERP3= <user>
##$USERP4= <user>
##$USERP5= <user>
##$WDW= 1
##$XDIM= 32768
##$YMAX_p= 460124627
##$YMIN_p= -684165
##$CURPLOT= <Network HP LaserJet P1505>
##$CURPRIN= <$Network HP LaserJet P1505>
##$DFORMAT= <normdp>
##$LAYOUT= <+/1D_H.xwp>
##$LFORMAT= <normlp>
##$PFORMAT= <normpl>
##$SURQMSG= 1
$$ End of Bruker specific parameters
$$ ---------------------------------
##NTUPLES= NMR SPECTRUM
##VAR_NAME=  FREQUENCY,     SPECTRUM/REAL,   SPECTRUM/IMAG
##SYMBOL=    X,             R,               I
##VAR_TYPE=  INDEPENDENT,   DEPENDENT,       DEPENDENT
##VAR_FORM=  AFFN,          ASDF,            ASDF
##VAR_DIM=   32768,         32768,           32768
##UNITS=     HZ,            ARBITRARY UNITS, ARBITRARY UNITS
##FACTOR=    0.250966925370066, 1,           1
##FIRST=     8223.43324360094, 77970,        -124614
##LAST=      0,             104371,          -204950
##MIN=       0,             -684165,         0
##MAX=       8223.43324360094, 460124627,    0
$$ Real data points
##PAGE= N=1
##DATA TABLE= (X++(R..R)), XYDATA
$$ [...]
23870 -146472 -163769 -306513 154045 140891 -348076 85873 -119953 246590 307752 -127067
23859 146845 -86539 -250093 -441903 105872 -94994 -314640 -45111 -242128 -171571 -94379
23849 -94379 -16350 203182 144318 64243 -166311 93962 -73061 -42623 14031 97547 -254784
23837 182550 -61014 134432 35246 188626 -434 165033 -234313 17017 80336 143579 198112
23826 198112 -110303 165244 115604 -254123 -36140 3532 -64145 -27908 51687 -10860 -160299
23815 -160299 -198634 -12493 50951 -327567 120513 92422 -82815 104614 48632 109292 -52310
23803 -297892 245212 -193565 95721 -190830 -381547 -319943 46729 22551 314786 -20592
23792 -321769 371568 171698 85358 109151 34471 79102 -222303 67066 24160 63777 131635
23781 131635 47293 -84752 -23327 66151 -305009 158312 -70355 -166987 75448 94101 109645
23770 109645 15493 8446 37779 -42591 -311968 -24625 234668 12014 421419 -79557 65277
23758 113044 -184810 216964 289892 -108418 102481 272323 57856 368694 191463 377046
23748 377046 33986 -470107 -23289 -151462 -16368 -308363 42492 -69490 -121260 200677 18347
23736 -365091 -62925 50799 -116919 133628 12324 -182199 110219 11333 52565 -277349
23725 84398 9283 31561 109906 131072 -78109 -72319 33434 285437 3145 129732 47510 -132165
23712 -370919 17322 32523 329647 39612 118173 -57611 -9290 140985 -411058 -16918 -128406
23701 -128406 -4583 69217 -79208 -211293 -81105 -55498 2071 33752 167027 38591 79107
23690 79107 -15792 -75642 114477 89064 -74503 -324404 94478 -95289 -166513 -5212 102279
23678 -120048 65175 211384 269227 120586 128628 -287442 1930 -183880 29199 -209136 103691
23666 -171975 78545 157056 -242713 83056 102652 -137473 -89480 -87633 -185236 45854 -167281
23654 -144663 24824 -69910 -111135 106652 -21308 -114076 -111685 40394 59852 -111837 -61141
23643 -61141 -35297 121082 -86524 115225 -183107 182999 74686 -83696 -213183 -200872 -211855
23632 -211855 126482 52756 122946 -184242 218120 452093 -463434 49068 -98467 313052
23621 -263073 -52790 44032 -186011 209437 343859 116595 143271 -491675 141069 19451
23610 41953 -170984 117427 196559 -183879 -278090 131460 76114 -66760 -281082 2317 35236
23599 35236 -301289 -259729 75987 -21656 182546 15224 124307 -55979 128993 134110 -15408
23587 301338 200352 -79679 174644 -24944 125520 375323 40681 262534 -183164 16209
23576 -40684 -526216 216053 158163 77779 -101282 -104907 -56504 70456 458258 38563 190823
23565 190823 85314 -57343 31680 -74031 227912 305908 17398 -164178 340318 149009 258855
23554 258855 130335 20273 -169960 47912 -139624 -239606 176554 -121214 -287014 -178260
23544 -178260 -252239 -421726 -125158 172408 -5795 -31904 327586 37444 -136851 -447613
23534 -447613 147906 -25596 -125731 -68368 153744 128335 -29721 3329 -200303 -266762 -134036
23523 -134036 -51904 -220236 134754 -43180 -370211 -319554 -306580 109337 107748 -179626 44875
23511 -548539 -138469 113855 -114558 -38947 139569 282919 -218246 238030 234908 -38128
23500 3475 304428 368775 -3346 -183971 -34852 2456 217665 250028 4472 116745 -30440 -145242
23488 -145242 -72177 205114 9292 23809 344272 -39869 -91692 142640 -2485 96821 -128866
23476 162019 -116786 -83477 44747 -225428 154911 92281 57002 25754 142939 -135652
23465 -9382 -114552 -329427 6727 104393 131758 378159 28270 -80393 328809 -347794 -198344
23454 -198344 145160 9651 33186 -289799 -222093 -100876 226258 79879 -269416 223690
23443 86975 223216 -116024 -70221 -136886 10243 -73340 327884 -194400 203803 408 -88501
23431 16488 60983 -225360 -307446 -47297 -99669 -75785 142823 -98212 -22388 127811 -357328
23419 413923 107124 358537 59146 -68383 -8146 -200306 85226 -128572 191591 -77211 -159414
23408 -159414 1621 -163931 243022 -186993 11394 378849 -449 53443 -144768 -61337 180190
23396 -48688 175968 181131 -112612 60663 -52270 -94541 225032 -136282 25989 116993 -66852
23384 -450652 -170835 -53017 -19656 -37690 -261788 29849 61994 13563 -98332 288817 -98681
23372 106373 -135528 -69904 -257719 12285 -7 38725 55350 -217124 -4652 203419 58645 150208
23360 150208 -188362 -96184 -208426 191680 61029 32999 -271024 -290361 -322846 -71759 -293035
23349 -293035 26402 -123800 -179866 -9812 -81182 30617 32917 196651 -415940 -245983 -159836
23338 -159836 -210826 -80722 -142302 60204 48413 117620 120598 -161304 -74144 -80597 -125592 -61785
23325 229728 -61656 75055 32280 140295 289455 -159452 -36310 98051 35599 -147781 140650
23313 122638 53124 78474 45393 -426625 -127565 289964 -257434 218543 121648 -186820
23302 -60071 -1469 44105 158356 -74584 -202868 48365 390976 106921 -106719 -99350 175156
23290 -322083 162405 -58658 315320 170969 -84765 -284513 173125 239602 -44061 -222947
23280 -222947 -129187 -12785 -110172 170423 14492 91126 -138751 -77920 27722 177456 -296668
23268 36449 130684 -318983 5514 -203715 183953 -533182 164569 -8079 -32619 68196 79055
23257 79055 178540 -2997 10866 76481 -314378 49260 299136 96809 149909 78147 -125661
23245 16167 215100 -260680 -176385 -113810 -272653 112765 -41772 -195746 -139172 150909
23234 -122302 -44998 402166 75081 -116898 -1952 -114725 72205 85745 -74059 60391 -65080
23222 -49842 190626 -36017 -41653 -385592 60507 -278075 41934 105071 -14089 -79406 -189211
23211 -189211 6119 234562 257267 20007 193749 65915 111202 293679 -316038 -94394 -35161
23199 -232053 -192282 -40821 56011 19747 183390 67442 -192588 -152289 279361 -34628 39957
23187 -131171 65715 142534 -4339 -38652 108715 -2812 74860 -79647 -117561 -192564 171672
23175 -14374 19187 159300 -74652 97648 -146453 194034 -141043 -243347 -156263 191517
23164 -374936 -76786 -1183 -206743 164329 -171796 262141 4575 -194389 -166084 283486 -226640
23152 -141013 44863 171425 441972 83203 -170018 195302 -94278 -24335 -109482 -9220 83638
23140 -2811 -118573 232603 -73644 330623 -33345 8223 -165249 275311 -249631 87688 16431
23128 -85813 -109426 -18824 11657 208107 74585 -452858 -180351 211302 -34241 -5967 79587
23116 37763 8257 204158 187119 65502 -9007 101268 4450 57161 -40225 76299 245122 -119261
23103 -138594 19905 97481 51974 -156033 -22839 -53093 25501 243438 140778 -1912 -252960
23092 -252960 197790 -35798 -112261 -104521 45575 -222294 166659 12368 -83366 -21407 -65809
23081 -65809 56393 -138201 -142285 -242212 153260 -58687 106261 -251543 326632 -153147 239320
23069 -399554 -140495 246981 -132804 -137961 -206743 -112665 220494 -14197 -140218 54885 73022
23058 73022 283904 125362 -144971 -78226 -24066 -205530 36769 -572 -48015 -108358 172599
23046 374118 -18048 215683 -203702 -115726 76035 162410 -260576 80614 -6219 209715 9131
23034 -51043 -76336 -88978 -84932 -445900 -120055 328156 -179299 22699 119363 186015 -408212
23022 185662 135465 4260 -216984 -210596 6221 -15934 164405 34418 19061 -224320 -26322
23010 200688 5732 138673 -27181 -220385 189963 111582 -129942 85327 -228228 -264766 123865
22998 -124713 44085 -228376 83918 -324417 -13012 210037 -110313 311067 -165061 14890
22987 -195214 55172 -140057 -533655 -167413 40787 -79544 -51975 -131140 128741 -238822
22976 -130813 126682 -406050 -152244 78277 206674 135158 -398862 -285631 -32289 -21094
22966 -21094 -492708 44666 -142862 358889 73466 -180003 -47761 79209 125808 76488 -119502
22954 92109 205561 -12463 52178 62989 -194525 227732 -108406 71812 -85196 88037 17469
22942 179243 -84458 -44922 -139874 160680 -64605 96463 177868 -95176 131837 62885 166983
22931 166983 -124922 146492 -84229 -129794 112035 3433 21630 -288038 164795 92967 45047
22919 -31971 -43658 82259 47421 177392 43329 -116901 -156324 -25375 -78375 256636 -53228
22907 -51834 -69979 125859 234575 -144921 314054 55672 312365 143032 62820 -42769
22896 126796 -69797 -364918 -183868 -355765 -198876 13380 -267824 -2821 -181313 -28464
22885 -56845 -225776 -99960 332528 157962 -49269 19627 -136502 -173341 374252 -150106
22874 -12186 -304983 -67707 -576902 -110976 -30382 -93835 -261617 326848 204377 -151527
22863 23618 79445 -206692 -327012 94884 -45486 -79281 88077 198331 -70588 199708 152813
22852 152813 -163914 -271285 -305735 -144883 -327559 238120 -139264 -239959 139978 -62564
22841 -29915 493 53575 -209595 -62793 28363 82588 102970 -46056 5057 76173 -106758 -27165
22828 -10520 23390 -130870 -296257 252172 23143 24551 90696 56324 -132468 14615 203781
22817 203781 174176 -131265 -4102 -73000 53796 171387 -494338 184247 -107015 55744 107409
22806 107409 -27252 32296 168842 164062 -85381 13590 -8936 121459 317209 -218681 -35629
22794 19407 188276 -152865 83224 38570 -22244 -58883 -70150 -84371 234057 92070 139456
22783 139456 -289422 255104 -179023 -6959 -63143 -292465 -36522 189828 114831 -225425
22772 -59730 -83421 -51723 119294 289818 -151335 -72529 -199059 -131438 129254 -28093 161706
22760 351796 -12575 -170458 -46373 -97702 -37775 -4231 50943 -248984 66235 173510 -298747
22748 -73494 16095 8646 -71625 -113409 -212098 -90317 18029 17930 -107421 -78385 93110 -230377
22735 105277 -72579 -119970 191498 -246423 215340 -86439 -199270 146883 -403352 -43570
22724 171393 80139 -102773 14778 -292338 211987 53340 66721 -96446 -113495 -22539 411649
22712 -142632 -390426 31820 263465 49743 62086 -351414 -83432 29858 -220505 -165713 41199
22700 -319787 -73158 -86985 -163238 -186099 -231425 -45038 107439 143289 45990 64203 101894
22689 101894 -79565 11868 -163140 22342 -104201 49215 68480 42499 -60796 278073 48431
22677 -81787 -45431 -243607 -219987 -133404 -33893 -13068 -12827 180791 158039 113895 -213385
22665 156467 -134812 -69101 -41223 -144917 20545 43535 -339698 40455 -270639 9616 295844
22654 295844 17993 -223311 251948 200782 -87154 105166 172915 -237061 34171 -293236
22643 107058 -195941 -171174 -199887 -66499 223602 -267139 -296119 -376550 -387931 161707 -64427
22631 -103561 230229 -241931 -120079 -328155 -78811 115942 53397 -153359 -28521 -50091
22621 -50091 60 57603 -54191 -144644 20275 -144421 -77007 -50184 -143316 103980 -72082 -104989
22609 -104989 100995 -118940 -78461 -108340 51378 101805 6333 -303769 -123566 -12479 -52774
22598 -52774 25427 -193267 -325334 2889 -228536 348534 -44608 -198455 93643 -372001 176575
22586 -18374 -86116 -152472 -160493 59335 -363863 191663 -55011 -133056 116536 -277567 -82494
22574 -219503 -607147 -254133 166090 153716 -25899 123811 -155193 163145 -39214 63833
22563 -261119 -315829 172399 -86425 -21898 80130 53022 -67186 -219461 -18032 -243548 -43889
22551 97270 41011 -138508 213823 3397 -59856 5596 -84698 -177175 -50638 -174115 -189541
22540 -189541 -208289 96710 -159297 78282 205515 -296595 112372 -245957 -133740 52640
22529 251176 47467 -35963 179287 350698 254635 -247779 -136723 -86580 -228002 229176
22518 -262620 116001 42118 107204 146729 -62269 -90301 -178224 -135089 -163270 -84330 8064
22506 93405 16320 -165339 179202 -24265 39616 -109154 -76825 -198545 -217033 -80489 -81050
22495 -81050 -156867 179580 -116259 45124 -111208 157331 -97350 18905 200560 -305988
22484 -56301 225288 9685 -98983 -90502 46070 -146092 -58882 227835 12294 8016 63262 -112738
22471 -142663 -204376 59063 243277 -199406 -101266 -184359 -134399 -88158 -352756 -161783 12836
22459 -43609 460778 233605 176533 88118 -24475 -57274 -98606 -46158 -256505 232890 107562
22447 333988 -38771 -214193 202539 -121752 -264245 -166547 -188280 245929 183139 -96054
22436 31083 45767 -5321 -300246 -178277 -128633 247009 147666 -82343 -238944 55251 -187849
22424 132008 130333 215879 -145662 152062 78986 -94445 -164485 47793 211707 401086 446641
22413 446641 17099 27702 -86889 -44174 -294443 124401 168270 126418 -144945 -53890 -55073
22402 -55073 -75552 57 -93561 260700 159405 266788 122940 -33452 27496 -39467 89729
22390 -184419 24915 6263 66096 -372319 203713 24185 -387643 -135901 -231368 -48244 -108081
22379 -108081 64378 -104973 4588 -207563 26063 -15722 -147293 -201620 143766 -4061 -293604
22368 -293604 87377 24649 69876 -74803 -348083 110256 -160081 -170581 14156 119359 -38092
22356 39950 60528 31763 -92643 -125676 -288625 -160102 142555 -21249 -227738 -159433 239514
22344 -31248 -132187 -371750 -294745 130964 348619 99448 2746 161939 21126 -112276 -38907
22332 6219 -26057 -144569 -175198 113404 -14927 344723 -183595 -179283 -99766 34504 167219
22321 167219 -67828 221737 -82881 -100147 -71327 326915 45346 -204016 -176109 -92129 -52724
22310 -52724 99337 -262778 118660 17768 -137876 -4255 -95223 -222176 20612 -377937 250062
22298 163081 -71157 15342 -179122 -87992 142924 -144950 4738 286284 49010 -51534 172299
22286 69013 38986 -64586 -168135 -135257 -158983 -77012 36405 -86807 8573 -82228 -189596
22275 -189596 257245 -41819 -366210 -425324 -219855 -484039 -330133 -11373 -338821 67910
22264 64114 -80153 -279087 38905 19917 -175340 -50884 173446 160884 -38184 -33671 -28116
22253 -28116 -333687 -107726 -108302 88155 -27553 -231063 -42259 11187 75804 151167 -123350
22241 13589 13220 232512 -103425 176688 -495387 123718 -127404 -39407 -37438 -21937 -20867
22230 -20867 221630 94151 -189348 -120794 -64348 194678 63838 -46153 -89844 -42349 22505
22218 -88874 -221955 -44939 137256 118819 132688 -25841 260457 114254 -20194 -257080 -76330
22206 -14936 -102151 324845 -290198 22105 -209399 -54511 -17200 83090 -78641 -91599 -20569
22194 -249779 -131596 -231205 -79814 -49333 45931 23653 58335 82605 -150882 179943 -48776
22182 171000 141086 292244 176221 -259890 41563 169616 93648 -55740 151697 128158
22172 128158 36054 9390 -335268 -61973 -234127 22193 -313308 220780 77183 80732 -102669
22160 -313724 -301744 -181357 167760 100301 -69571 378713 -41120 -177674 393138 -256298
22149 17979 9571 -66664 305111 -136671 -180161 -168402 -20085 24017 -14949 120922 -361819
22137 -132095 237537 21530 191935 -38299 28348 105020 -358197 20099 127909 55894 -128368
22125 131888 -231694 -397649 76610 178767 377763 -75570 -227699 -63208 23501 31592 -206261
22113 162069 44671 -254389 -103489 102871 -89887 101100 -149627 -35462 -187036 -60438
22102 119596 -46250 -90958 17532 -329223 -119536 -41484 71773 -37808 22743 -242952 -81696
22090 24472 34925 43579 -161681 -409863 87127 42932 93893 299611 -42436 -294860 36229
22078 432947 -17825 -19435 -24390 209210 -19709 -216034 -94344 -209395 -173703 -366724 -63026
22066 -98843 -146119 124258 12783 -253013 152063 -72954 118664 -36902 117892 -67282 -39154
22055 -39154 163647 -196535 166912 106938 -209798 -131607 -277789 -201608 -59798 -299540
22045 -299540 -225786 -94894 160147 390095 -134643 -173974 76637 60276 14094 -56583 -56679
22034 -56679 158539 50839 -8809 221166 -206188 -126748 163455 58649 -89171 156133 -75082
22022 176027 -281255 160268 182343 -226847 -34465 -256116 150268 -6834 71121 -13037 64969
22010 100774 -84137 -306972 123597 -14091 120126 10799 -356603 10398 116047 14199
21999 -198174 -212277 103321 287419 -11807 -75258 -120302 -267718 -461012 -19099 99553 -13614
21987 -220582 -69360 -31635 -146245 219873 253283 -452233 -193368 -296486 36781 -227923
21976 -49520 8110 -215106 2927 -232371 104891 98545 -80993 -5552 -12153 8047 -286751 -245096
21964 -245096 -79962 71495 23920 -73987 -78064 204650 242001 46912 238113 73909 273366
21953 273366 -146335 -79441 223599 179615 -76052 70134 -30093 -41492 178525 -57893 -65236
21942 -65236 87044 -34082 -314145 41805 -165878 281324 309106 6433 -40975 -224348 -119471
21931 -119471 244046 -230984 323176 -102597 -48875 -186885 27107 -65898 -294601 254423
21920 -40758 -180019 2983 -81764 -8061 -94631 -72823 -184751 -144062 -150308 66759 56221 -137808
21907 209358 118635 -45728 -150912 -221278 -143911 181654 -202490 -92071 80586 286929 -179830
21895 320853 88794 115758 -14688 435147 317373 141737 -52029 -133278 -62084 89368 -349143
21883 -436645 111395 -212083 82623 67424 304148 145408 86420 -218505 76413 -44466
21872 -302710 -51613 -17627 -103135 238251 73230 -171202 109022 -146884 363876 -63859
21861 101007 181102 -45698 -90966 -73932 147232 -442640 113837 -6787 -94658 -139878 -85531
21850 -85531 -18052 35756 180940 -56239 -262152 31919 249593 93563 2288 -285942 -43180
21838 -256425 -65871 233768 80920 -78391 -183670 315662 -143200 -21867 -151330 193554
21827 -51095 -218852 14351 -311590 -224 243695 -42895 -313000 -120787 -378582 -244561 131468
21815 -52016 10675 277043 -132291 82872 51910 -156185 -18186 79052 129093 -264097 31702
21803 287028 -52397 -437751 -90223 -131291 -152595 -47702 311738 -65285 47835 -94513 242537
21791 -284391 250142 -162953 -25407 58914 -144681 126764 22424 -116285 -206765 -196801 26695
21779 -236829 -527093 196259 -94876 70385 65255 89074 176757 -128601 55252 -205039 71073
21767 -82495 -215469 -75683 59212 -9318 66386 -90876 42767 93145 39182 -434211 68878
21755 22285 32932 -25804 -252741 -72232 -43182 -21255 -207266 71515 -125179 202769 66711
21743 -53211 -254859 -111433 229006 -88867 14310 366159 -128628 -189991 -91047 -150319 29700
21731 -91879 -5020 245359 -162087 -21051 -116407 56842 -93569 -329476 -95757 -61899 -105613
21720 -105613 30856 -242657 49953 247150 -247688 -129638 -11946 224636 -95252 257580
21709 -476576 65407 -23805 205719 109585 149392 168279 34914 -474440 -206624 -524836 166381
21697 92481 85860 -71578 195703 -160536 -141260 169003 -184788 134329 -93347 -242742 -68339
21685 -48295 -122147 208111 303436 290826 -119354 66192 -252539 -24476 -114678 -196229 -504092
21674 -504092 -7899 63916 -122158 53359 -336326 347877 137933 220649 -143510 213001
21663 -147260 318026 -483289 196755 113819 150912 18343 -136308 -204649 -229620 -91046 -156498
21652 -156498 -103450 -460451 -68843 -35596 91248 12177 148820 74743 101615 -94700 142814
21640 37627 -223028 -78293 -208414 -68602 47955 20131 23985 -363600 -144793 -359614 14954
21628 739 53777 29899 -28884 -15345 43193 -60648 83201 4935 145757 105394 -293872 242595
21615 55990 26443 -22451 3416 -190497 -264517 -109117 146770 -123010 -24016 -234274 -79326
21603 -246822 13487 -148480 17153 308878 -221442 -189895 -164143 47063 77445 24742 -50001
21591 198785 -200295 402827 -202899 -141829 -79982 275340 -28853 -112231 -66796 -97520 103566
21579 -142420 306540 -136598 -108767 297653 217700 -210964 -137703 -198422 290693 -171963
21568 -198113 -58418 -18026 -418315 -143362 -196551 -175758 -45515 -39374 87447 29077 -161269
21556 -5321 -120059 9820 346525 -10860 76229 84378 -324400 -106326 -225897 -82308 -104689
21545 -104689 -94446 -109460 -81050 147124 153044 187230 -176627 -55791 76357 -403389 -275624
21534 -275624 152613 128058 45950 -222115 105933 201114 -25089 189 -66776 -26931 170175
21522 -59781 -410031 85453 30148 -37040 -121101 -95271 133249 -313348 -317465 -67178 -225873
21511 -225873 -283167 243949 -93282 -204229 -206653 233454 -57410 244509 84335 -91336 -79492
21500 -79492 -94170 -178246 -266467 119860 -163293 -207853 -245854 -294114 -42905 67808 58552
21489 58552 81431 -59865 -93071 -76117 89398 -269105 -41767 -348223 -15918 -35948 25418
21477 104132 82044 164304 22706 -92694 258911 -281122 284450 2807 -97735 -137452 16376
21465 246443 -302075 108635 -86110 115357 -244137 31750 35485 94118 119716 -23282 -28219
21454 -28219 178463 44422 -342710 -341074 38668 119568 17897 -251721 -184419 -16603 31194
21442 -65773 34150 158574 68121 370417 209759 22286 450737 375087 -125547 275609
21431 174911 -246239 -105033 117723 53094 141563 -239970 -206703 -389353 230209 22596
21420 10544 -231528 -34372 -110873 -28623 -185969 82392 -27550 -2269 121186 -225847 126375
21408 -110291 -41281 -96235 -81442 -379341 -108278 286696 -392870 -113233 38067 -48632
21397 152428 -126431 -134215 -46438 70170 253156 -383936 -96263 67685 162854 -44994 97376
21385 330560 -179709 -45396 -312381 297022 -178293 52701 229887 36378 184070 -114213
21374 -336628 212632 37609 188086 -226491 -93778 77415 141961 67774 -99753 177420 101470
21363 101470 -53923 -128844 -61860 -6705 -177955 -115182 -190340 340351 -235924 -340546 -153516
21351 -149587 -113233 -96711 204984 130487 532021 32210 134503 209223 -96968 -59523 -349484
21340 -349484 59453 25973 -155066 28627 227045 -526981 -144341 -11992 -51325 -178897
21330 -178897 -179721 172841 111398 -296691 -390375 -91407 -142956 -74499 144062 104441 92803
21319 92803 14650 -87567 -362305 128018 40663 -44326 -59852 74920 -292429 -43230 -229517
21308 -229517 -323554 -140941 199047 69507 -37250 245978 -153243 -74869 227026 -117429
21297 -87845 64527 75486 73100 -134516 -1766 140270 -103765 -333214 -204452 -13938 340456
21285 -88191 66726 -38343 -241944 116856 -65188 -126846 -223107 -83356 70668 -56022 -2597
21273 10138 116866 -251683 17932 -109926 -17071 33242 25912 -108861 -114683 -270603 -97489
21261 346236 542392 -123943 36126 156 118324 -24709 195894 -179435 -41677 -117073 -140559
21250 -140559 -48703 -45183 90206 -108762 -93455 73182 31483 -165724 54621 -9547 -119004
21239 -119004 -179397 -77851 -22268 20735 125237 19056 393090 -166402 540018 -284249
21228 269996 -168029 -22653 -25412 -201007 -97767 35631 -191042 -184234 -177749 -100045 92346
21216 -423072 -93609 -155759 207321 60333 148972 -174277 -54362 108036 61837 100261 -137496
21204 -244665 -186526 209783 136662 -180584 -108229 -105155 -109823 6872 -155763 -167305 87395
21192 29694 -78570 65677 174091 -386981 -150753 -23738 126356 -101382 -2551 -158665 -94484
21181 -94484 -234361 -412636 -410833 65463 12386 -173595 518608 -44715 -145697 -233446 -101586
21169 20349 -123890 -6323 -390106 -62180 -47133 28488 -113126 84972 -200259 -19352 -176596
21158 -176596 121475 178624 217875 -75129 -314668 -30637 -220034 275069 -12573 -129169
21148 -129169 253650 -132875 -152932 434077 -224181 -344623 168451 137528 -10796 -290974
21138 -290974 -62171 282559 -295977 -169166 48595 -56821 -167382 -118848 -157513 172352
21127 -315828 -173904 148405 90897 -222701 -33094 54039 -24606 172692 -116513 98849
21116 -202243 -158518 -14480 -21560 76509 272742 14670 222958 -93693 -417017 -353860 -26657
21104 -363025 -207366 -228905 123356 106414 -71628 -304249 -35158 -221580 237025 -250120
21093 -92091 -16993 -389432 73425 -289235 35862 144008 -37387 -81185 106715 -132396 -119810
21082 -119810 -90903 -145992 -131259 -90971 -5774 -162523 -70782 57640 60504 -6916 -277570 -261663
21070 -261663 69951 137105 -210158 372740 -30678 -70213 -283474 169030 -25498 -41086 7218
21058 -467029 -66630 -355472 -46968 -35847 464266 287071 223046 -41079 -39493 208457 -500366
21046 -90279 325260 160650 -147157 -194523 133955 -148016 -4964 -13076 -126628 -381938 179199
21034 -69442 40806 36916 -217994 61741 113855 91127 -101332 121058 -3990 145758 86535
21023 86535 82115 103609 -450867 -111373 -469759 147689 70963 175904 27780 26204 -45906
21011 116655 -26325 -29744 440 -93863 -243594 -10669 47639 -204446 -196164 -24524 -170470 -276487
20999 -276487 -70517 -73514 -294278 70951 59134 -58384 176823 -160475 -42095 -544299 -70771
20987 141510 31075 59473 38848 -59393 191440 -67131 -236539 382 -453932 104351 149684
20976 149684 122366 -280168 -45031 36144 -326017 -163342 -213126 -189502 -115895 -375149 -25555
20964 -159894 115159 -95474 2045 -12381 -84870 -159089 -495667 203680 7818 185391 -155302
20952 -132860 209276 -195952 238097 297501 -242539 -112718 -158085 2888 212069 -441386
20941 -232706 -56844 150482 -145518 -120561 -25127 206969 -4979 -134751 -346704 -119999
20930 139063 -271613 86215 -420537 -62957 -81182 -17817 198891 75501 -52867 -163167 102422
20918 48223 -25837 118588 -152454 -119160 159038 -297273 -21576 239541 91353 -345605
20907 85864 -291258 -106480 -160387 -32197 -114337 -260416 -251733 148723 137772 -109310 -285290
20896 -285290 25821 -25486 -110053 -3296 80797 5517 -102011 -56603 -162053 -16215 177901
20884 -288900 -88665 99767 -123240 55846 -168258 -43269 -89028 -206550 -226003 89156 -29327
20872 267041 -34441 -186345 -201487 -224504 -132045 91575 -199089 15312 -365784 152570 10864
20860 -148498 -131206 34774 2546 79397 -286768 -193454 -261586 -40515 -186609 -44410 -7120
20848 64351 -126598 -23232 -143071 92255 -94596 32501 -152713 42300 -143435 64572 -63935
20836 -58211 -286248 -210766 207592 -68692 -192537 99026 151394 -180718 62273 225874 -395705
20824 -224043 18532 -80635 -89849 58077 -95812 -178163 -456285 -180963 -274407 -171155 -63996
20812 -37237 -147429 -9265 62410 -64466 185278 107023 260805 -177841 135848 93905 35521
20800 -28715 -63951 -22277 -42076 -30788 -160243 234699 48127 61895 -368846 27387 11441
20788 -174727 -134062 -137346 -114398 223769 140254 94248 -262392 -234482 32388 83061 -214301
20776 -29760 303464 -25800 166691 -84831 24298 341356 -31668 9305 56562 -241295 -44432
20764 148220 33298 172908 -240900 -175909 68058 112556 307743 -139352 406488 -196093
20753 -174969 -311611 -32078 -392859 -117717 -183177 11892 -24411 115050 -70586 -49533 -232162
20742 -232162 184716 195288 24632 -8138 72509 291023 72107 561993 -177751 -30670 -198755
20731 -198755 -200630 -214956 280832 -240319 -7238 223340 230977 101672 -460819 310756 -139803
20719 -178486 -59837 237815 23274 50139 277008 142328 44058 -113091 3093 -275897 -143760
20708 -143760 177983 -262131 166535 -217435 -177094 79186 55375 -60739 -21044 -83434 3392
20696 -182157 -158962 222693 7329 -12055 6471 -1327 -2579 221134 210193 -295469 47177 -253111
20683 21283 60390 100801 151089 33780 -110701 -254273 -242181 -245651 -108326 97996 -232053
20671 -258717 38174 -37737 -132735 112424 -363803 55245 -195144 -236053 -113570 -170980 117535
20659 -157361 -43527 -428545 -485843 201768 45880 -224378 340855 -304844 -111104 53762
20648 -126223 -57782 1751 -108926 -130546 -199291 78693 -175748 -60747 -26219 -21620 115262
20636 -173669 -408698 29283 138798 -78476 -3216 -63567 -71637 389075 -121246 -136074 -261329
20625 -261329 143583 -324664 -166671 94069 -42780 -265464 -89695 -111171 -31059 54113 -64746
20613 109340 -138808 -149246 128872 -103955 -395147 -138055 -95052 -253631 -266148 81579
20602 -194861 146395 -247291 -53959 -18533 -131172 82204 -88863 -126780 22740 -41976 -302652
20591 -302652 273293 -88310 -54776 -60525 -51196 295781 -102711 -504 312191 7883 -77758 406856
20578 -53884 -97345 239073 -64199 22875 -52786 -119494 -82133 -270687 -29176 -133245 122950
20566 172554 -197291 -71269 -266823 -120981 -197355 360202 65037 53891 -195183 128649
20555 55022 69179 -210032 199194 161061 -98792 94586 578478 -231851 -143982 211452 10811
20543 -171658 -304071 56676 -84191 51712 189855 74956 -162616 5421 -26491 -88755 -67363
20532 -67363 43271 -265151 142286 -144552 141078 -299398 -438326 -117098 -121126 -208668
20522 -208668 -63106 78617 -69350 -99883 -135590 55479 -203037 -81101 -247527 134693 -146636
20510 81438 79204 -76307 109839 19407 -197660 -29228 -340315 41087 -108935 300530 -6948
20498 183074 -18902 99421 -94413 102727 -216639 58465 -9999 -152437 260929 101971 -48530
20486 100688 -131771 121774 -497041 -4902 -341340 -55854 -320537 29791 -313071 -87248
20475 36425 -394726 9135 -113619 -204776 -195493 268951 -96903 -50791 -323608 -287783 45669
20463 -72782 98022 52013 -2344 -39366 381010 -40746 317553 61611 131417 -268518 -222444
20452 -222444 258326 40106 -23865 40573 -151917 -177809 283896 -198513 -207173 -213829 -9434
20440 -67176 27470 14728 97903 101035 -237933 -81128 -6747 -20109 -33528 292534 -85118 -87649
20428 -87649 156574 -151611 172022 246830 -159480 -10768 -252273 157302 105220 -153407
20417 26405 132117 222356 -393712 -147453 110247 -49043 109597 -64879 -70249 156455 62388
20405 -4877 128930 41638 -99966 -26247 -131577 -33875 -60635 82342 69981 -81837 -141526
20394 -141526 -64505 123701 -102110 -26720 -264093 -152303 -105150 179612 60617 129058
20384 129058 48655 22960 -35916 116792 179889 -77172 -142662 -50836 -194882 153020 2159
20372 -160075 235486 -101748 -64219 88201 15134 140099 -168317 -151230 -374396 14522
20361 -40350 -390765 151737 -246201 -203995 -191566 -182881 249124 -381981 -1325 25726 -30064
20349 -42467 589 79796 -201435 -110264 149323 548 -141150 -214349 -387937 -73347 -33177 -9489
20336 13375 -80062 40257 14049 -261832 137417 118661 67785 -93560 -139338 68116 94026
20325 94026 -14162 28843 -5292 -81393 -120420 172162 23398 98845 -419873 -113465 -142037
20314 -142037 -65503 -88 -56651 95365 -161787 -192163 -280535 55713 15458 -61537 -119715 -114552
20302 -114552 15902 -36623 -343708 134229 202704 -261031 94313 -134992 -122129 -21253 -143562
20291 -143562 21226 -202427 -287732 -244538 124870 -157533 -83767 68727 66753 -242683 -291846
20280 -291846 47179 112834 -57644 -157201 -97465 -220428 -277703 -119456 33188 -71833 -148316
20269 -148316 -37766 -377993 -204139 -39772 -247293 77203 134461 199328 53523 -96688 -65926
20258 -65926 -2720 -41712 17915 161161 -91243 -235649 4775 -175755 -180629 -145237 97311 53471
20246 53471 -32203 -28805 197606 -41639 -164392 -64830 114933 133843 -35650 142326 94993
20235 94993 -115131 348153 59691 -75074 112586 -41233 -150570 -314556 -155762 100136
20224 51367 -120076 71846 -137370 22644 18546 -315172 -404983 -318613 -59498 -202785 3211
20212 -524915 74208 -19331 -241674 103210 123055 -310458 -73403 137605 -120305 -311123
20202 -311123 21437 -93999 318883 -41398 151407 -140368 -247960 -262358 84359 -241477
20191 22806 105488 -46570 150009 -235464 -434106 -249197 -100328 -442668 124712 182859
20181 182859 -33701 174967 -137652 -66916 -90148 -265220 113286 48642 -37551 -53884 -134270
20170 -134270 -27611 98604 -149548 68044 27039 -112570 -94471 -94256 -94200 -222025 -421093 -33863
20157 160362 115232 -183407 -80379 107260 -52683 -290717 -191052 -256938 18536 -93690 178193
20145 -15165 13066 -222431 32288 30163 15778 -20835 240869 113133 184678 -218402 -3071
20133 203051 -166265 143433 148773 172744 104486 -5367 -203148 238608 -99431 -107001 -41167
20121 88566 -123401 -84331 -274231 -130853 -321540 124992 -417089 -45412 168851 11141
20110 -50859 -140398 -53846 29924 79597 49224 25890 -92282 -95279 52045 116573 -217190 -43372
20097 -21879 -146576 47070 56027 -129852 -114315 182140 -52509 109327 -60345 376739 -33386
20085 -153058 -4666 -257188 -396535 -73356 16320 16230 -353136 113595 -7400 -68351 8395 -92893
20072 -127275 348493 141851 -141854 -9651 207008 -237311 -207423 -112816 -4231 -410142 -170383
20060 -66619 -16682 83565 91211 24848 -366830 -49267 -115937 -197237 330346 -346097 128509
20048 56112 255283 73027 106523 -432558 -123382 -54156 -21711 -273268 -32834 -86863 -568973
20037 -568973 130173 -99764 92610 38592 35640 89589 -30049 142534 -206434 76863 -18942
20025 -23145 -182075 27472 44148 -190763 -272817 -305263 -99748 -108995 -241836 145686 -198134
20013 -112821 -154657 -295744 -253144 252908 -372323 -101878 -320059 -460478 -55091 -160365
20003 -160365 204270 -283004 -85390 -187986 102353 -136702 -170202 80274 -71138 -83363
19993 -83363 41762 -337811 -40682 -281375 335311 85714 94490 54950 169204 -272001 181405
19981 483113 -159562 -96892 -129009 -76172 -39071 128251 18987 8875 154408 -48005 -345484
19970 -345484 -144555 -22211 -237172 179717 5548 113748 -320734 -216779 5703 100109 -189732
19958 -45633 108264 288167 313721 67815 -103035 -233124 -120671 -146730 -106431 -356474
19948 -356474 -468942 -136759 -16408 146870 56622 -242 281450 36143 203828 -348709 -217734
19937 -217734 -27986 -68884 -391855 60927 53722 2907 -245658 131896 -46695 183183 378052
19926 378052 -296127 439313 -321154 -81811 139282 3784 -215371 86412 4580 347796 -585426
19914 10028 17411 -186197 -391656 -289143 81609 52459 49637 -34719 -193772 76932 -80998
19902 280424 -427212 -190290 171436 153578 -84176 -292192 146765 114292 -130619 -15121
19891 -233272 -229614 99473 146760 78703 -193668 72962 -142708 10584 134307 -298025 -62441
19879 -7633 -142487 174971 106729 -32944 -5845 179016 -17533 -98509 -108405 -314048 -72942
19867 164573 144960 -59832 -195484 -189829 16546 -15190 -120361 -506007 290674 27230 -238461
19855 -75087 -141202 220545 -109463 76558 -262433 -76050 -52589 32423 -5383 -205520 337018
19843 -47048 110780 -50636 -139740 122740 -163785 -107069 32737 55421 43374 -115530 176559
19831 -2523 -32767 11487 -120751 -199370 11148 200728 145938 -80562 83600 117302 123670 -425954
19818 49431 200248 -13122 -295422 100822 -115415 392529 -30894 140074 -149135 -289589
19808 -289589 -126127 -128155 74289 -188628 -155935 20321 5479 81244 306006 63065 -81440
19796 123729 -210302 -441314 62269 -34044 81136 11044 199281 181597 -240224 -203608 -46290
19784 -85008 65380 31048 -499 177278 -397583 -24208 10658 -62337 57053 -25651 -359050
19773 -359050 -21160 -181732 -157573 -101477 -278725 -229223 -67984 -73693 -255923 -260860 353817
19761 -96581 -7983 -105725 -168048 -91365 -81161 200325 58972 -8422 -122708 -310978 -28399
19749 -88257 13317 -137608 -85871 -97770 -12485 298431 -456486 -127281 355784 -146074
19738 24202 2405 -75017 -155180 230132 47824 -46493 -98635 -30602 -12719 -17217 -191616 35474
19725 102747 223195 -398904 103786 -138044 -181017 -229036 232338 -58030 -205409 271487
19714 -21941 -286536 -109854 -163696 48511 -151184 64678 12209 -123287 -15795 -197541 120034
19702 17266 -33699 14157 44899 -170733 -132363 -179868 -72353 -22310 4269 -3747 -227480 -129906
19690 -129906 -158013 110663 88280 84797 82885 77178 -117703 -96697 -246402 -180941 -50810
19678 -61525 -142642 -116846 -75678 -36080 -114157 -3322 -165424 -113141 163319 -57106 90891
19666 -252920 -165705 -252600 81010 -262506 -397141 20605 -201619 34330 152855 131281 -364785
19654 -312093 -37162 184951 -203872 7558 9792 -172586 -59736 -43093 -26795 -289540 -47281
19642 -120555 9650 -51320 -398877 -179374 -86529 -199757 136915 -145346 15756 247664
19632 247664 -36987 195830 74251 -24188 -79248 -203306 61013 277040 22516 -153448 -10544
19620 134978 27929 29331 107158 59201 -246938 -138870 202130 -127827 -316064 7996 -269310
19608 -47305 -304134 -118230 -107964 -81813 -182950 -62425 -191583 132122 -171576 -44677
19597 136644 138945 -281598 -150310 -282936 -12512 -100039 -270989 141027 -41898 -175793
19587 -175793 -50404 -9106 -34728 11289 -165629 -244103 -315720 -405936 -472693 -247773 -16188
19575 -71379 -23027 -513251 97232 133414 -29764 220466 65675 -7924 -54771 133850 184255
19564 184255 -80873 -291471 142725 100726 25094 203327 107036 -176490 273999 132812
19553 -43327 -108708 -173311 -149799 7655 -55168 -130201 55158 -267145 -11796 -207446 -46511
19541 322935 96424 50434 48274 -131681 -284597 -130191 2524 -249880 53534 129387 -91636
19529 -35309 120982 -20821 67686 171987 -107509 -8231 -178122 104995 -399464 207485
19518 -25636 128355 -20098 -135609 127224 -136828 150721 -113290 -91332 -171255 -187355
19508 -187355 -39354 135886 -37614 -121866 -124443 52309 -28231 -101544 -310891 15899 -407372
19496 -549 -274656 -438309 -53759 -93059 -230047 -429800 280316 -178633 64112 -331068 -294611
19485 -294611 -41609 -106259 -216255 -251052 12372 6726 84942 -297669 -416208 -107731 95502
19473 -106736 380259 263799 -3344 -251242 233705 216888 -236218 -44814 -86679 -2663 -65640
19462 -65640 51575 -461 -85884 -228550 -196058 -105881 -270336 -108826 -251849 -86072 -42952
19450 5927 39509 -310272 -177051 -43972 -46397 66012 26159 -262891 -208997 -189618 -559291
19439 -559291 -45154 -80425 -81921 257742 -239262 -188929 -333672 -30946 -313737 65751 -293963
19427 -60814 211539 -104085 -194847 -59423 48697 195753 75334 157168 -6543 62694 -99054
19415 181474 -75071 -267202 -14866 -394441 70982 -323381 -50040 -151193 -148178 -147162 113822
19403 202068 -84021 -117512 -133681 63806 -185485 37257 217440 203201 -193356 339350 -207674
19391 4815 -43566 -313479 211396 -304408 -159933 22187 -65659 -531336 129752 179481 57692
19379 -210303 -298185 -179853 61796 -13027 28247 -159936 89838 -118057 -74636 -83952 -116174
19368 -116174 93386 -68013 -9111 -192751 90430 69812 61022 16641 -138589 -383334 81894
19356 -301250 -111023 -233731 -236649 -261456 34413 218230 -38596 -180314 317987 -70920 -426412
19345 -426412 307631 -34208 111792 268966 188613 -390092 242230 81207 17753 -201871
19334 -133418 64057 45982 -366319 16721 107553 71618 -52357 19423 -33868 30984 92373
19323 92373 -267743 86584 288332 266692 -215729 -113868 -178566 -45615 -244756 247759
19312 -315383 -225299 20576 -266232 108748 -324005 -228231 155841 -154421 -263490 18144
19301 69082 -14231 187148 -131632 -70939 -216890 113111 -234458 28781 -291513 -64642
19290 -40354 255079 -231390 105569 -185949 -155568 -7649 -103618 -54085 -234600 -211780 -85115
19278 -15368 -192184 -8299 -109173 109217 -15642 -188890 111452 31435 104917 -222844 95108
19266 -4222 -173 124298 -200657 -10010 -72501 124838 52450 -262286 61376 -156120 -193041
19255 -193041 -323364 -412010 -148434 -354954 -109087 -46979 137704 -76973 40324 -146331
19244 4174 -194342 -171582 -133157 12482 -19760 -175629 104090 -103105 -189412 -186272 -157301
19233 -157301 -61375 -107346 -122007 157344 320660 -198272 -118566 186150 -71585 -242031
19223 -242031 -240975 -162988 -54759 -155434 332171 -83863 313686 8562 -214807 70906 -77330
19211 -603048 -14394 -19566 -10313 156098 154550 -64003 -164937 -198198 -158674 62033 -309347
19199 -267995 77100 -229704 -98317 -254643 25634 -152465 -39815 172404 29729 243016
19189 243016 10041 24839 -122533 58631 -146414 201633 154692 -239164 -399132 -85563
19178 -73 106784 -156299 -457556 19316 -320879 -58251 -155246 -81676 103385 -396036 213229
19166 -128861 162789 25007 -182850 -274121 -105393 291553 -227108 -180253 -301625 -233115
19156 -233115 129894 134150 -177183 98529 81521 35332 133709 -386055 -333542 -112605 -108938
19145 -108938 -409250 -192751 87382 62494 -171139 64634 -266005 -32725 -164084 19845
19134 178598 -74749 -195355 -70165 -67669 -62282 42161 -36769 -89856 120066 239105 -37522
19122 -188107 -126650 -23239 -415601 -11888 -339326 -294722 43339 -70143 376293 -10525 -17544
19111 -17544 88745 -190638 -25735 -25657 -297168 16680 -96388 -344100 -166734 -52483 8986 -85442
19098 -42939 174274 -383706 202920 264999 -56766 -145019 -233168 -155826 -1219 -199075 -170037
19087 -170037 212734 70790 -280973 1654 -187512 -277963 -9512 -107782 -186527 255603 -84953
19075 154363 -43749 -220209 -45296 -215493 -359105 -103474 18166 266409 -2167 -208398
19065 -208398 -85297 -325507 215512 -134950 -24677 -115413 83375 -112439 -198155 -278961 -16245
19053 -118464 104638 -74542 -232858 74034 -101713 -252176 -98367 37736 223202 64490
19042 -218363 155909 -167297 21322 8822 -80691 -637 61608 184452 -61663 -214193 -6338
19030 95327 20931 134220 286689 170573 193506 176952 -17378 49471 209693 -23714 -310157
19019 -310157 366114 174764 218451 -15381 -333961 -175802 27590 -31507 -21564 142437 -168512
19007 148028 78144 594746 -49442 -135547 -140116 -144866 -77737 339471 17114 -462279 -233329
18996 -233329 -17283 229182 -144594 -264340 -94105 -214165 -341239 -43295 171956 -153603
18985 -299382 83561 63675 -216286 -241597 40323 -54509 -22345 1197 -293966 -12934 116750
18973 8935 -114523 307048 155989 -45391 -175094 -334023 -119002 -323003 -141091 300212
18962 -2009 255779 -149293 255186 54569 -56075 -73609 -107792 23199 -198462 19135 14908
18951 14908 190242 137741 297346 -426148 232566 -168028 -173887 147529 -117171 5866 -216573
18939 -224337 217578 -208368 -124333 114615 82180 -131832 -7737 -17383 -388417 -16887 25393
18927 -100984 -247572 33426 78958 92035 -42990 -61665 115685 -45670 -43950 -106204 5993
18915 12797 145460 244158 -298330 -422034 -157525 69602 -62675 -91315 185815 37053 -351120
18903 133575 -201143 35634 -41040 77521 -137219 -250538 -195740 29888 -20785 -131924 -298908
18892 -298908 -155839 105392 -5984 347855 134077 64855 -7532 40249 -137368 -128338 -157875
18881 -157875 -316750 -44002 44761 -289349 -229046 12636 -131418 117605 -90418 -214385
18871 -214385 -180224 185700 -262718 -201464 -366019 -278297 -193319 -202065 195443 -155094 -109530
18860 -109530 319633 -148059 32302 16866 -194434 -25417 -47711 111585 -102806 33249
18849 182365 161281 140557 93740 168743 -24837 -59007 78808 -111590 -234361 -78944 -40151
18838 -40151 -35421 -69999 -5283 -181885 -24177 11526 -242331 64709 35596 -186558 -85062
18826 69906 -335216 83965 120187 -206385 58755 -227125 -348127 -55904 200637 103142 2431
18814 96253 73212 -185956 289274 49333 -197037 193351 189240 -15529 -33832 129786 -20518
18802 -183094 201800 -208936 -78772 -74838 152869 -13817 -424297 -355100 143118 196868 -54288
18790 -260681 114172 -207367 -6228 -121119 -419431 43892 321048 -157175 -37602 -79478
18780 -79478 71579 -161988 -115457 -148073 -119625 124765 -279979 64628 226480 -239273 -26935
18768 145083 -452334 -224308 -132625 -151562 -131852 45955 -298279 113361 -197756 -111449
18758 -111449 15018 245301 172317 202407 97318 133730 155900 -395596 288670 -149692 -87282
18747 -87282 -437272 -8236 213840 -47969 -212632 158187 -351 -24983 -98677 -11606 -61808
18736 -61808 103316 -42701 153202 -311069 66918 140824 -137662 173742 -140496 97576
18725 -48407 -104193 124096 99663 -258815 -333591 -190289 -127303 45512 -319637 86597 -56844
18713 55259 150835 -93472 -280434 376824 -102683 -51170 114587 -19610 88204 -97382 -180354
18702 -180354 -172459 44953 115679 218895 56264 -6369 -115920 -105834 174374 225377 -103458
18690 -126960 -187901 -75052 -285693 -270432 -149256 -10961 126244 -296326 -168318 -165305 -350381
18679 -350381 -267002 153429 233586 -161483 146606 -28713 -574253 181607 -152816 -21507
18668 110346 52435 -109287 -77924 -213355 -183744 57065 179856 -18144 -331639 45074 -152412
18656 234744 -184463 221292 -142646 30197 125059 -220054 133752 -175484 -118010 -190508
18646 -190508 -232299 -64881 -34697 -185753 81890 109966 -6882 -76690 21333 164944 -65657
18634 -197710 -45185 -140988 117260 -203931 -29306 18546 -247015 -89035 -83977 -203802 -204753
18623 -204753 -276875 -21422 143689 27428 158535 225963 -119151 195922 -24830 -204261
18613 -204261 4874 17 149004 -32102 154681 -199741 -377421 225458 -106577 227512 -17959
18601 -255206 211406 -240220 128187 -72539 68774 18118 -42429 -34309 -50893 -224443 -15180
18589 8073 -29637 -87222 -181330 -155677 -110597 -305614 -179198 -302509 147181 -108428 13117
18577 -329176 -9785 52566 -231827 -18839 227738 -13429 88461 -371707 -63429 -129056 -177108
18566 -177108 -404359 -10506 168388 -251155 -107078 -84470 -168242 -159504 -19351 -225759 -357382
18555 -357382 -347223 55841 3916 -34315 -199428 113978 229847 -281103 74325 -114312 123343
18543 50340 51893 -120856 -283852 -58342 -289098 74797 -192505 35780 20069 85663 -205875
18531 -490064 -22494 -272847 91844 -336408 -169007 -226312 -3742 -249802 -160983 159133 -240167
18519 115995 126655 -147176 -157995 106406 179523 -160057 237371 77108 49300 132963 175142
18508 175142 244532 -26302 15369 330 145638 134784 151659 139803 -134397 96759 -349358
18496 -247555 -258481 -117295 -299482 47941 -285175 -87788 -511422 -196023 14618 -164997
18485 -255937 -233221 214075 -35071 -220824 -102002 92071 -13845 -116318 4332 -161241 207296
18473 -6723 -276065 -113824 -314739 -67689 93750 119124 41981 29669 -84536 -242994 -230355
18462 -230355 -2646 -319903 -116507 40856 -254159 -116881 -108110 -228040 126324 -149738
18451 -24495 -48751 -22974 297510 -129970 -115342 122616 -216636 -204065 348997 -75424 72971
18439 206657 -169522 -16432 -129023 -130716 -5671 -92718 5384 46202 126135 -8582 -240120 54287
18426 -188800 41015 -58547 29393 -55579 -45707 221474 -158380 -248110 -80829 -186095 -42284
18414 -190106 -303794 91939 174445 -121406 -39752 54189 -151461 -39401 1495 6397 143344
18403 143344 -441528 -7030 165085 -125055 40046 -127457 -185383 -33754 77687 -22411 -188550
18392 -188550 -79258 161947 -2502 36930 -28456 -102924 347262 -102965 -157043 -100703 -171558
18381 -171558 83731 -60986 -18993 -79841 56853 324818 64298 -137299 58535 -74546 -229601
18370 -229601 -67086 -17355 -135354 166460 -491594 -14761 317116 -170009 -89864 229245
18359 -215982 -171427 -15613 -93938 -155889 91436 -275050 -96644 -34154 -27729 -207624 88598
18347 206293 -125973 -125560 229625 163018 -9837 -97568 131013 -115827 230060 -43471 -146629
18336 -146629 -302062 -49402 -127768 -138031 -305132 -207417 -141454 -76686 -325039 -202674 210928
18324 179902 -59630 275426 -96350 256080 -161062 64057 -123200 -70639 108051 -32241
18313 -4804 10332 232508 -174705 161969 122772 26103 59394 451433 160047 122252 36659
18301 109572 181724 -296841 48023 91916 -83803 -68516 -309731 76618 -230391 -102433 -239438
18290 -239438 -328350 -80059 34619 243466 -237126 -273139 38667 -26462 129304 215907 -188980
18278 250041 -351747 -159051 -120594 94723 -61076 -159293 153473 -123552 103638 -192006
18267 -408081 423 -85174 -361144 241675 -375537 -308912 -42643 -244626 -145605 -126512 -18151
18255 52237 -309458 5342 -75354 -63453 96494 -53570 45594 -231846 129128 -152284 -162564
18244 -162564 -42386 -47453 332136 -67678 36633 -99414 -48489 -54383 -134156 -130055 92369 -5523
18231 36367 -148431 138169 -329694 -65636 -360876 -15688 -281348 -297693 68797 -129623
18220 341301 265326 34541 -140992 -62844 -163001 -222025 24105 -164169 -16702 -175855 161751
18208 5069 33180 150825 -34183 -148205 22018 -193954 65005 -349284 46135 -49251 -314987
18197 -314987 127734 -227078 118537 -74987 -288750 106741 -60305 -203191 204061 -106040
18186 179886 -42411 -144621 -123163 -19532 -43335 -261548 61551 104032 78097 79818 -210817
18174 -181507 173609 134297 75742 219511 -224777 275986 96437 -103458 294333 -25281
18163 88242 102402 -88723 -153128 -45646 -180187 165783 -160378 -256264 40011 -129497 8006
18151 -58691 -303618 -104818 -107091 176918 47723 24063 -32383 -271325 304585 60068 18790
18139 -155314 -8333 -381673 -253383 -48677 -252473 -173322 -197568 -222771 -306660 50378 -105083
18127 10336 -152970 207754 -166318 24206 -87110 36411 -207808 -59438 341098 -115013
18116 -8160 48858 90816 -89005 -44437 -314518 21719 148649 300874 -409685 -164245 17049
18104 -253138 -13201 133559 -245137 154446 -170241 9116 -163004 -77967 182119 -34169
18093 143146 116897 55999 104510 -84423 -65989 80869 283693 227573 -46279 42748 83927
18082 83927 -557360 -332801 294300 50343 -144831 75743 -80446 15158 -333224 81233 147102
18071 147102 34666 153085 214306 44520 194896 7266 -85161 41626 14977 -163845 -206161
18060 -206161 -31746 239038 8557 172274 -58287 109195 348428 -76336 167459 200390 -4002
18048 28574 -41838 -131270 72898 -44147 5055 25317 -204635 -41441 -385208 -42058 -188297
18037 -188297 -12101 -122668 -109753 -244538 53644 -168798 124940 -180192 179516 332953
18027 332953 -194804 158617 61245 -44280 40642 -38837 -21989 -197441 20364 -89949 125057
18015 -143547 51453 158292 -224696 5266 380222 164423 -121508 360621 148834 -38697
18004 -265775 -50423 -19575 39935 -128962 36740 268985 -241154 -254019 133845 37390 -196979
17992 -205589 -54536 -169870 -48810 -399104 -40381 -135566 140347 -151155 18210 21651 -44411
17980 160517 -76657 109569 -225055 17612 -21991 -87363 -124551 -373241 -175879 192086
17969 -50659 -137525 -155037 -231350 -62894 33721 -60154 -325443 626733 76372 -74984 63275
17957 -256735 -155106 126594 59920 11408 -256725 -232161 293620 352797 178077 8314 58945
17946 58945 -77232 164855 300057 69242 -82073 -21123 15192 -145625 -124221 -267088 -157028
17935 -157028 92924 232152 -32166 -192313 254225 -234831 -162259 -272528 -39488 166036
17924 107765 318552 -34718 66511 -68409 21659 143822 100602 48013 43604 -188249 -333063
17913 -333063 -193800 143108 109174 152316 -16250 172040 93668 175403 90778 46866 -211726
17901 -77382 -293341 40540 205897 36230 -102249 -223588 39806 -143149 36305 55570 -75394
17889 -129112 -105251 -117458 76115 270171 -320656 268004 -57875 -295 -323340 54445 26694
17877 -115519 -150923 -165558 -122479 178424 147680 64995 -371720 39071 137284 253471 -65478
17865 -255753 -101434 -94220 -166805 73312 179853 402592 -152223 274200 43541 283048
17855 283048 -256252 293190 143337 -184108 -98528 -66463 173663 117078 -77683 19713
17844 -284379 -195073 -148634 47380 220533 -344492 159306 -140424 -51381 -94817 81383 -84106
17832 11833 -128270 -232995 -301541 -103948 -115794 274532 -292026 -130199 30741 116773
17822 116773 -183428 -107308 -274124 91774 -155377 128424 -110938 134583 87692 -118294
17811 -64298 -148461 -28499 213823 171911 108089 63613 73600 -57972 -13200 -48129 110091
17799 -6467 -116888 -279273 -51081 156809 -189873 205489 -19093 126468 60510 25229 -41823
17787 -86096 -53483 -4634 -71627 -113080 -39547 -90913 189238 59348 300763 -144149 -127428
17776 -127428 -97990 238927 105548 -59713 -298769 -120174 39116 247109 212383 -71722
17765 219733 149280 234575 298544 -475 -47844 49182 -140114 -197899 20509 111262 -205120
17753 -14748 72181 -64956 40735 -148377 103615 93392 -128671 -144163 -689 -74023 -95460
17742 -95460 1340 213382 28812 -34285 90986 127334 -39858 37004 7354 208313 -112126
17730 124438 113213 -158843 177279 -55018 21793 -149348 250867 46129 -187720 48765
17719 57213 104596 -196884 17996 -98925 12081 -68182 146838 58826 -179721 -123275 14029
17707 191461 170616 51176 -87299 358041 -269051 169678 -86598 -181532 255880 88044 275227
17696 275227 -100068 -389419 -360535 -176851 37832 -237441 -282204 311819 65931 133519
17686 133519 -240787 235576 -184112 114213 44588 377278 -17617 54722 -126229 99066
17675 158141 352631 188259 232868 -70966 105299 -38408 -58244 18774 -421014 25820 89391
17664 89391 94428 311394 1585 -260372 44064 -40797 168315 21639 185833 7468 -276106
17652 -98081 56251 15294 25865 -366014 -17074 113972 -268937 203594 147790 153692 -291954
17640 -61114 114027 76664 37487 -62079 200424 42590 152304 -131003 -317888 160379
17629 -116923 283337 453747 21262 243622 177542 37586 -203668 -167592 80489 121927 208288
17618 208288 75540 -314846 45640 13490 277897 148455 -186463 148237 222746 1126 282060
17607 282060 -85759 -51782 150147 13372 -324206 -97183 286370 67850 266523 -254308
17596 148663 -122152 -134777 83039 51440 176252 -87889 -15093 65906 -28855 46996 -234063
17584 107429 185808 93452 -99250 -291395 -57562 -256457 49812 -46276 19326 -148526 -3324
17572 90231 23904 120714 -87158 -116880 188927 -122911 -44885 -64485 160791 339190 216038
17561 216038 28104 -15880 -110590 -136188 83715 -283482 69329 -19511 40455 313659 212717
17550 212717 -139439 106363 235438 -64179 -194865 -140196 73080 -40030 96023 -21808 253477
17538 71700 -98861 98813 -424796 -33300 150108 149217 -171249 -72425 249700 -53180 -37795
17527 -37795 199774 -30738 -368367 72790 27325 55966 -96868 96446 -82940 -17074 151745
17515 -150254 189818 -44937 45255 245688 -32072 -28878 -104127 -66409 192452 245554 -258867
17503 -764 165858 304856 -164422 421170 318704 211096 252002 166506 279116 362460 101652
17491 172209 198571 188794 474604 189728 -15925 381988 95455 161600 127241 5507 289896
17480 289896 315127 248590 118456 189343 448910 340021 203156 199999 -252157 -103855
17469 217154 271141 -20957 437274 9128 -74901 -36236 56235 72738 3166 -61330 3800 32572
17457 32572 134254 -172311 4063 92656 120596 374361 157005 1681 89148 225653 408087
17446 408087 116197 -7270 410379 -131335 215156 91082 290048 468530 21368 96304
17436 96304 41066 40466 398193 227429 417198 160190 249447 240800 -3510 422366 211406
17425 211406 302054 141418 536422 91483 215548 429990 128063 373815 267574 537628
17415 537628 455469 187477 111160 262014 199688 130333 91621 108442 95323 -36957 655652
17403 -12717 184958 264081 163389 147336 138739 214359 -75437 -63360 -87022 148891 386516
17392 386516 120886 98678 259965 64454 -8850 14803 315104 -89006 40869 -256946 -173484
17381 -173484 263400 186963 -72910 384564 131863 256537 73980 -68981 -78056 79440 -182845
17369 156443 294038 326045 234505 23867 89361 -99110 6457 349422 267232 336806 468493
17358 468493 268464 73986 50309 93652 13717 -15276 -201747 -26796 272141 77371 -33168
17346 181580 262393 108312 493296 182444 15991 182280 -74155 262440 140652 -125454
17335 249336 -86042 287939 -76282 125909 111497 -160488 56984 -2468 36568 197061 193832
17324 193832 108273 -7227 112145 177507 -308879 191823 22132 195132 -116709 154858
17313 352129 332501 447684 -85653 474472 202265 154111 283484 -5950 -43918 299348 -20116
17301 110127 131153 371143 -295491 179250 76855 -43104 67875 42405 354414 142835
17290 292727 249111 10313 292343 17238 526805 470624 290694 297555 71679 81817 32534
17278 48302 -2427 -37030 240205 10436 416490 153955 294671 62366 323490 77294 258518
17267 258518 487770 214793 -46578 148397 329428 167013 145729 166719 109846 -108298
17256 470570 -111963 -41808 226187 128175 137961 347480 301958 31180 140828 68974 460551
17245 460551 568401 -283530 198847 366720 70448 90342 -29380 9937 357249 408642 417633
17234 417633 275170 273281 186460 58376 542326 61578 410638 344293 179048 9864 144699
17223 144699 -241277 230231 148341 171130 510135 145476 104365 477205 -36244 262232
17212 205819 202841 346829 158663 593212 143630 372087 516348 -34895 136174 308032
17202 308032 326097 107375 512544 297948 318787 152160 523001 65204 70834 435996
17192 435996 198373 226623 327634 528452 124899 367641 294958 189390 3312 290834
17182 290834 588750 451663 259407 168344 50043 194764 191163 250042 601005 482637
17172 482637 187139 24419 190001 354332 45184 198187 436471 452008 165537 167900
17162 167900 331488 98054 363408 589194 532065 113703 556841 168469 145841 46676
17151 45251 369568 603264 629762 298224 298444 385293 517005 260379 331595 298031 675401
17140 675401 385714 478953 230887 355023 238672 577901 359402 427931 636253 368840
17130 368840 267131 241274 74639 209254 309305 469471 433659 239338 176298 236888
17120 236888 -192557 558888 227832 225643 594421 190595 446172 599849 43176 281698
17110 281698 238988 391658 469223 88800 342358 230145 440920 249312 422459 366867
17100 366867 499782 432345 69388 371534 527559 121516 690174 539491 423044 405156
17090 405156 195725 580804 235500 3943 215955 320878 545229 568752 42241 392394
17080 392394 669871 110993 92432 661380 364008 408551 434049 702323 468112 246488
17070 246488 522640 254411 219122 277832 309028 679472 210051 320792 491554 201343
17059 402242 250020 327816 544781 552517 185090 314747 492827 276004 437729 606946
17049 606946 404805 653174 556123 386056 574358 551140 384212 402449 486381 523604
17039 523604 318364 719209 577802 369893 471932 536954 617727 718531 618736 706252
17029 706252 565909 710532 381552 922837 778992 726258 681932 719727 533699 685263
17019 685263 160117 793039 286335 775686 364409 487269 677927 470149 659650 847226
17009 847226 549393 665019 987835 958220 874178 702254 591394 771644 858984 789613
16999 789613 1114763 495561 909954 527435 755601 984225 493579 588903 729450 785463
16989 785463 648995 714746 613780 570855 747625 823266 848628 733507 612417 977227
16979 977227 893467 661408 628114 801299 988299 922874 926708 669588 792474 463104
16969 463104 711965 937195 1037666 1030521 895884 798594 1060723 876686 1002835 1033766
16959 1033766 922530 852083 1034731 1035607 1128937 948481 905016 1022946 1284216 1111972
16949 1111972 872449 876597 1120762 1000723 1032237 1061031 896940 1452235 1057793 811226
16939 811226 878826 849335 707513 842820 1243501 1109215 1035108 1024295 1032449 1021971 1222575
16928 1222575 1133051 1010526 1325810 1451646 1190496 1088315 1507085 1527257 1016099 1440448
16918 1440448 1014782 1644969 1319765 1560809 1434217 1357959 1279594 1498901 1295355 1425608
16908 1425608 1565377 1496924 1762850 1675738 1571185 1521579 1433825 1431376 1618816 1636233 1792372
16897 1792372 1569983 2241769 1627024 1950339 1804617 1751847 1632255 2109920 2023450 1850682
16887 1850682 2257183 1884154 2258647 1813506 2218512 1952639 2216652 1969081 2548349
16878 2548349 2274540 2017062 2400608 2165749 2366355 2325028 2262280 2355229 2480370 2501452
16868 2501452 2259463 2558712 2670060 3167702 2238592 2607721 2842920 2970662 2489862
16859 2489862 2773651 2822340 2645859 2602997 2987970 3173796 2989952 2980784 2909803 3170298
16849 3170298 3246488 3315158 3553331 3102896 3474234 3437725 3536222 3426305 3237230 3777468
16839 3777468 3698776 3773098 4018308 4179195 4042099 3991473 4278412 4058136 4452932 4297776
16829 4297776 4694806 4381812 4677957 4620132 4602408 4717389 4553737 5341592 4961054 5526718
16819 5526718 5499555 5776397 5431228 5790812 5997078 5841543 5849622 5947475 6126506 6261077
16809 6261077 6314165 6602590 7038364 7121963 6955078 7188886 7373636 7437677 7875471 7793446
16799 7793446 8373012 8647346 8597977 8619464 8876444 9224874 9577176 9671440 9687672 10418372
16789 10418372 10385594 10939634 11096013 11433212 11578818 11948596 12373510 12672757 13069613
16780 13069613 13527690 13776539 14424111 14797035 15234050 15836629 16300884 16940883 17215178
16771 17215178 17954105 18686710 19057073 20150465 20862370 21440304 22452778 23357675 24176012
16762 24176012 25351672 26027201 27407234 28475218 29852755 31104287 32375155 33944157
16754 33944157 35422180 37396107 39023062 40965143 43108484 45399107 48044311 50017869
16746 50017869 52714500 55755849 58945914 62099244 65666183 69657370 73408066 77995563
16738 77995563 82621167 87673809 92549116 98440365 104291089 110351444 116886755 123626341
16730 123626341 130470397 137169439 144256193 151137589 157673686 163655334 169308990 173967601
16722 173967601 177753714 180651679 182710802 182995548 182770880 180895700 177717175 174088768
16714 174088768 169164314 163544172 157591603 151310170 144335546 137357281 130397334 123474116
16706 123474116 116823735 110826178 103922683 98147069 92595128 87223140 82493239 77558934
16698 77558934 72943436 69240708 65133688 61792503 58072988 54996727 52409740 49673275
16690 49673275 47232944 44671809 42404320 40450301 38798631 36470758 35313476 33210775
16682 33210775 32047534 30383636 29220058 27755175 26879051 25697929 24466155 23382583
16674 23382583 22855955 21937864 21318390 20386280 19594140 18544255 18534584 17566886 16633492
16665 16633492 16475413 15837066 15256166 14472253 14217469 13765134 13363571 13010095 12667545
16656 12667545 11958293 11983947 11844818 11014263 10838652 10605408 10287344 9962770 9580289
16647 9580289 9442135 9340501 8991804 8620714 8594540 8234872 8096684 8063535 7524191 7462249
16637 7462249 7094280 6916486 6894262 6809497 6796539 6774926 6174770 6049333 6045359 6033398 5721338
16626 5721338 5722680 5702224 5506329 5043047 5251768 5206801 4736668 5009708 4975718 4666092
16616 4666092 4867474 4358957 4596567 3924254 4224542 4131596 4046906 3929274 3818627 3894665
16606 3894665 3762488 3684033 3803835 3374051 3175798 3503706 3258809 3501737 3090062 3176765
16596 3176765 3004385 3102849 3078379 3161461 2982231 3005272 3063865 2923078 2855469 2635588
16586 2635588 2827036 2746527 2557895 2644834 2472667 2555935 2370162 2568783 2613969 2522030
16576 2522030 2319988 2346224 2334806 2238975 2103922 2082557 2197451 2172568 2363008 1737849
16566 1737849 2158136 1793776 1835886 1843694 1851380 1855200 1960786 1941120 1861427 1450456 2004851
16555 2004851 1846664 1686288 1615513 1706430 1607494 1791217 1822498 1405714 1641744 1649233
16545 1649233 1497511 1477040 1316955 1772239 1562808 1434497 1738165 1294404 1091007 1314360
16535 1314360 1293123 1465748 1433148 905148 1399447 1410023 1095060 1664942 1103445 1191927
16525 1191927 1358055 1453666 1166381 1030439 1221357 915855 1160836 1195754 1064153 813333
16515 813333 876545 869649 1302267 1216693 1084213 1101991 911288 1344767 1097978 796661
16505 796661 889993 888201 1053150 872964 694983 1184890 868517 1041279 860357 672357
16495 672357 795073 1010931 987518 1062697 669913 813575 705463 584879 1152019 931828
16485 931828 915883 769470 862728 847977 581812 821279 1042485 702394 940854 977300
16475 977300 796970 480262 815468 1134151 705198 902373 629891 845063 569059 573338
16465 573338 549562 656949 579226 408274 556541 625846 570969 606788 705672 626287 745643
16454 745643 461292 700678 555925 714705 610718 790580 625730 514893 551339 489664
16444 489664 887095 956399 577758 623267 373119 539508 861534 517876 456290 579846
16434 579846 599942 602798 752995 681797 222388 499460 677443 500598 365574 479619
16424 479619 618443 182095 430288 -43036 592712 408693 652842 206765 616272 299939
16413 492752 846070 242454 488871 438585 373696 418858 656710 597146 612894 344665
16403 344665 407436 511296 522008 383981 475740 546407 275092 482099 287554 532006
16393 532006 235169 794801 691872 381609 407161 298722 260966 449732 633130 173420
16382 53038 346955 699468 542693 408002 423583 776755 412070 218438 422221 550609
16372 550609 494139 113762 135583 127475 171386 137967 473594 254079 443385 268335 239642
16361 239642 235207 415174 302843 402570 193383 301615 22644 553335 -320021 186986
16350 366074 338287 237232 -15176 165211 -137029 404072 105899 299815 226541 138504
16340 138504 123033 304766 119620 239253 278524 375828 179484 308691 311651 -41119 482260
16328 63690 379931 -66211 66765 494001 184406 112710 60557 251942 192860 196200 180959
16317 180959 15831 233636 279285 164580 29485 -266841 367213 131242 50943 450257
16307 450257 -131144 612365 275341 71635 401621 317827 538476 134310 195475 236400
16297 236400 374628 316538 32199 394545 330442 193299 207769 277615 5542 243923 41798
16285 535364 110126 83417 323537 125372 124091 282001 -122472 -106892 283263 290635 189277
16274 189277 301543 -91511 247979 191 454940 366104 304786 14674 167906 289373 126758
16262 418085 389332 214490 316175 -31321 -197010 243030 -379005 212669 307671 -116758
16251 105811 205613 -122476 173826 231478 393568 -14275 42048 -6223 222911 255745 -33092
16239 -295391 -158332 211518 78487 30781 132566 408020 -30649 110621 -66271 -252126
16229 -252126 189901 99035 230522 48242 154423 351586 188936 92204 141062 69315
16218 -114333 -14524 196174 442288 156484 106651 122233 406468 90303 26537 68547 -196193
16206 38278 398704 997 262356 226136 223863 205218 161873 177075 64742 270597 58415 178303
16194 178303 6889 56330 -648 65508 -230646 24193 -279115 226921 80828 52314 -35266
16182 -45797 -71340 173362 72376 128102 66161 -25238 -329949 -300868 -11100 68392 233917
16171 233917 -107037 191085 -2544 -96570 303916 78242 168636 -79301 68617 -11245 76499
16159 -90355 271909 315120 -153956 -120551 364369 61703 50039 -191999 125799 21145 512078
16148 512078 -81251 -126570 -83454 5677 361947 -12383 99597 -8437 46123 -60627 -16250 325887
16135 225841 -15474 -84717 -150951 33729 301890 206373 9328 -154791 -49668 243864 304558
16124 304558 64209 -89205 -116095 -116496 -185423 -413871 19773 -282823 197339 -239571 -175231
16113 -175231 -109784 -22654 87618 -157866 136093 -54527 -24071 -107584 -213572 156285 -63637
16101 156884 566035 253965 160446 114951 -80175 157884 -111467 53093 -205556 117771
16090 -246582 32268 -135262 237452 24984 68667 196198 154573 -46974 58173 34426 102276
16079 102276 196558 -52819 332383 -138578 -197529 19743 -153423 205400 14471 134243
16069 134243 157382 1192 91888 -69644 237807 40140 21393 -186817 -70097 29235 73881
16058 73881 -450449 -164952 -20877 -366592 -134861 156247 207410 -408335 -177691 -22706
16047 -206829 -59474 -108113 -123057 25761 -49939 -1687 1822 -88624 17142 -202786 286430
16035 -234017 144600 122902 155112 -383341 -47123 155702 182352 79206 -103664 -122555 57773
16023 148929 41938 137001 -61414 93707 -59104 13483 -170444 -132421 79367 -177234 -103973
16012 -103973 57965 -244788 -141201 -3715 27425 -234828 -42040 17875 -103893 -198231 -328392
16001 -328392 -169159 -93199 15681 -169458 -187269 31222 72630 -174226 140784 389238
15991 389238 -22526 113639 3108 -207824 -115148 17918 -23705 74958 22506 88159 311888
15980 311888 207425 190257 46464 321414 155591 -383930 -253916 -243387 -439140 278310
15969 356649 38438 147649 -41236 -33284 -163220 -247415 14953 -53205 214722 167099 30211
15957 -198895 -229714 -2163 43883 -24577 -210565 8905 -225083 -143490 214923 72734 -161788
15945 -121610 -32646 -66279 -63322 -263575 -26863 -234451 -114350 144631 49456 365751 116128
15933 -309606 328004 122090 -126969 194578 -74698 2434 30234 -152134 65945 51050 -52596
15921 143981 -519214 325608 -31429 41460 -296226 104387 232522 222983 -110097 356529
15910 -127606 -108417 -36291 -6859 -32894 -91618 16467 -118670 -229530 -167611 -349642 -148562
15898 -122407 -34331 148378 -16205 58186 -80965 -171634 328056 41845 -97684 -174638 -151327
15887 -151327 -89901 -238460 -61566 250418 -172217 125137 -11341 -55413 -202777 -61047
15876 71376 -268418 -32281 76837 -34224 250667 207059 212862 -118802 -150350 21551 75113
15865 75113 33629 -91354 94218 120968 -99363 -11167 -310466 67997 -159002 -101022 -6654
15853 -55190 215681 -7327 37354 400787 56141 -42469 -101351 150488 36963 -52061 102900
15841 453489 -276465 -180156 299230 -280053 181496 -81812 -10576 15727 -229526 -595 -87479
15830 -87479 -42496 -285800 -3920 -265653 -11390 39370 -15157 -120823 -72267 -161661 -224695
15819 -224695 -163484 -33940 -162892 64695 73919 20328 31097 291691 87166 98092 147347
15808 147347 90865 34505 14543 54687 101011 -21647 -21561 97371 -81537 70619 -43913 -134897
15796 -134897 -285514 -114288 87554 -69292 -118578 -255709 -11592 49522 80276 -143008 -181168
15785 -181168 -172050 -268446 -53106 -70356 -75896 107419 -221938 -42485 -129592 207431 149103
15774 149103 -39419 -260075 -218961 19594 -91870 1101 -79936 120577 -99828 -175704 25541
15762 -47183 -120957 -84971 40318 130629 53048 -131676 -70348 93536 24280 -79626 -104086
15751 -104086 -87403 -185032 -142502 -265655 -67304 149068 -376785 -65881 -8617 -70583 -11808
15739 -283887 -311382 -139888 -104245 -93718 -281308 -285228 104676 204490 31251 -187150 68421
15727 153788 -239091 162500 136244 186073 -468341 -142681 -38054 -99929 128996 39225
15716 -59174 68708 34597 -194645 -6035 -249580 373945 -103930 -64739 -256995 -230947 -133423
15705 -133423 -129030 -149878 -135754 155812 -233159 -218194 -18589 -73368 203837 -66825 23970
15693 -25020 394917 26822 122150 406336 311898 46931 -217141 -134788 -23271 189526 161758
15682 161758 -163442 -132801 109816 -100022 40039 -150392 20475 -374716 522780 39902
15671 -61091 256537 -164014 364602 89822 -36411 155457 -179076 -5459 -343443 -62244 -70179
15660 -70179 19393 87015 -130378 67434 -128840 25829 -281039 -37188 143492 169262 129468
15649 129468 -8054 -54588 -185357 31657 -31293 84027 44358 194503 -93751 -172686 -121343
15638 -121343 -30099 -60716 -46904 59950 -123210 41810 174685 89078 -110011 -2216 51149
15626 -89106 230638 -101716 352229 52637 147841 -300277 -23965 25442 -108614 169218
15615 -110429 -148974 -92617 80852 214096 -71581 -245066 -181964 40464 -76880 -150852 190911
15603 -187538 -124573 230263 -165363 -161002 190243 -351300 -35596 -345887 -162629 -71287
15592 -18670 -147384 254900 42301 135361 18921 76219 -25347 211285 -95380 -104321 -135577
15581 -135577 -96143 -53614 -54990 209459 103134 -434949 164 367507 -207103 248325 9000
15569 -60460 -164851 8800 -115500 -126916 43457 -155900 97028 -200370 122729 -143705 -338333
15558 -338333 -59376 -18986 -42676 125077 -231636 -283484 2079 -357910 -90877 -73251 58161
15546 130959 -334633 140372 71352 -77722 -185295 -173876 -324977 -111668 -60517 85536
15535 -290842 367986 386429 -285067 -315571 147590 202449 29021 -119406 87878 39478 -22607
15523 -63866 17457 52855 -144526 -119650 160076 207357 121237 147906 309006 192776 -316120
15511 -192737 -122133 351001 101168 -48758 18858 1712 41121 -108330 -155187 299327 110102
15499 70881 -154890 323499 -24671 122148 87930 36302 -123356 -134247 51089 -183187 143762
15487 -9575 216106 131639 -76578 78142 273060 -31959 125778 72185 124927 75911 -196318
15475 256210 45652 23071 270563 -183557 -190651 -60085 -30695 40194 -20410 273766 1041
15463 369908 -42666 -96048 -197356 -203761 54582 -101066 -355994 -80374 -11709 318055 -24321
15451 -2018 -201020 -68896 57675 -122485 -45993 217206 60182 122957 -209270 -464327 -70682
15439 -110584 -130696 -30587 50698 -91971 -60079 -172698 -246702 38944 -103269 265101 -110897
15427 -84436 -188829 -14988 64156 -249109 -233751 -105541 -11434 -192298 -103306 -174457 -185243
15416 -185243 88694 -106729 -101629 50848 -3949 80046 -149905 -105919 21872 -236758 261716
15404 -66402 109083 4696 125653 -83807 -228959 -60736 -112543 -382652 -27844 -96358 -204883
15393 -204883 172589 -2951 -294149 -80286 -209995 297989 52952 38773 106297 171195 78187
15381 -71531 16940 -9366 121118 -252077 106713 82970 22734 -161338 -14086 100114 -127586
15369 -21332 25125 -78218 -303305 -47132 -206439 118699 -80014 -65870 -45898 -190784 -394786
15358 -394786 236057 41740 -37772 -178589 -156441 86326 199570 234561 -62988 123914 -187
15346 -46612 -171378 166184 116781 51938 -209086 118629 -18588 131797 -23309 -225532
15336 -225532 236675 -113713 334075 -9927 -58573 88653 156350 53320 235592 11631 13863
15325 13863 -244744 15075 -2755 -130746 -140911 -32330 86238 48702 251251 -148571 104213
15313 113758 280580 123379 202622 113355 -178333 -68735 -16708 -270748 254716 204679
15303 204679 94453 -99195 116059 415562 -267911 4308 64915 -36864 -271130 125464 146252
15292 146252 101791 134813 43000 -159250 -40483 178025 62574 -104047 -321581 287482
15281 194302 77533 19854 184332 -206264 -300448 -167638 143398 12529 82707 -84715 -31096
15269 67795 42654 50341 -99738 362073 194282 31566 199887 65070 -23690 -181441 101374
15257 -34958 97158 47036 -80704 393143 -131604 19204 39056 -21371 370829 563796 1293203
15246 1293203 1443226 1387359 1371056 923336 682101 65506 246807 34367 -83363 125174
15235 86151 345316 60815 29787 16667 142371 -68473 -55625 -17498 338485 199227 178627
15224 178627 98678 -32744 85978 30589 255278 107456 242129 187695 186146 143751 323806
15213 323806 -118410 50691 -95397 -282821 -217199 261783 -72362 44553 62541 -286635 -22903
15201 84167 298477 -223601 -231134 140844 340003 -23062 -19863 -81454 67709 72377 222412
15190 222412 79891 26247 -43889 13873 112199 -189732 32099 -160525 199765 168669 319859
15179 319859 72957 -162874 186872 380056 -31679 -221808 150857 4842 115793 -218066
15168 -4149 348459 -176155 -27980 190191 -1248 102136 26591 -190386 3556 44565 -35849
15156 223936 117864 258501 398083 132027 -328690 -59359 183656 172451 -247921 -29140
15145 -7976 196480 -29527 98364 149714 -76260 -45165 32338 -11176 140507 137661 156444 99323
15133 99323 -123393 -43943 308739 280907 244850 134313 -1866 303469 38762 140904 5385
15121 305204 108456 241374 418032 336805 264947 404478 -10277 207188 -142409 -214263
15111 -214263 301357 51278 145001 -50147 84983 -149643 -252730 64264 143489 14282 133492
15100 133492 -188395 137476 54844 190993 391360 75795 172254 239354 2492 150202 29434
15088 -178011 280694 -52473 8852 127008 161404 14865 331268 60406 207647 462994 197178
15076 234042 281066 81611 402731 299758 162975 368100 254188 321073 45934 -56930
15065 333825 103222 -125608 205767 -124362 137119 566355 350348 68502 166189 113574
15055 113574 216935 60073 -5751 260170 171882 327917 -310351 97421 336653 175992
15045 175992 -1638 162649 327945 108185 -8121 255001 128279 178083 25942 146205 -18512
15033 313172 484894 -97609 83230 185903 155160 244443 148558 -113858 40741 260650 248086
15022 248086 130928 -117268 124522 266343 279884 374650 47282 201773 -133511 401145
15011 217702 -44423 108370 49294 135574 -97133 182583 177514 225737 -185824 356956 -218934
14999 439090 19198 295559 37555 242542 142566 -28866 334740 96781 201725 144897 67549
14987 618362 59160 -174821 6393 311148 290159 141938 63058 104682 66081 -48181 254078
14975 207393 221835 -122209 191909 168962 343633 533862 478699 -43842 326897 475305
14965 475305 72690 462137 324035 241668 198388 433825 162648 168200 327237 466062
14955 466062 442220 193052 520446 30027 416608 19273 467014 507525 326890 405188
14945 405188 78743 -20647 -1349 293227 276339 174068 131679 87443 400616 390114 138994
14933 313665 200182 564333 256052 236444 333152 145450 147704 120201 23178 331194 428245
14922 428245 141471 261260 642105 218822 122498 328297 133857 -149717 19482 69762
14912 69762 464790 342790 344423 338148 180171 309647 177987 370784 74375 383207 -42579
14900 454007 286483 347808 327152 119191 567833 380592 471264 236463 -52284 171738
14889 412696 74513 148312 595027 314825 306034 287417 488062 -335232 249559 433060
14879 433060 250460 462724 177194 488328 150682 515790 44021 608207 507306 474780
14869 474780 667655 251718 167678 140373 431278 244178 163214 440617 384132 303001
14859 303001 68704 256081 741742 555748 300258 251794 97285 303733 362836 262078
14849 262078 577173 619832 510341 349365 311300 617973 491043 432326 391159 298224
14839 298224 553941 288248 460920 646218 303876 342297 223830 344529 526039 517427
14829 517427 70513 496031 393224 90827 453491 107000 571876 255974 480654 643563
14819 643563 64744 74407 544915 481178 668259 503541 287882 413220 213009 344205
14809 344205 354949 396330 400636 442796 468134 453009 402882 438716 468994 448440 489814 361695
14797 361695 643339 734799 346111 406347 426059 349126 478609 360437 595897 642753
14787 642753 671805 784240 427190 299422 471644 276774 285092 596723 371846 377109
14777 377109 667823 563164 458023 209475 602165 732350 662106 416947 469087 935051
14767 935051 539017 332889 797749 444438 503161 650581 319249 778267 294607 563115
14757 563115 521145 477293 590358 679046 511804 569182 653248 588021 828282 545502 768516
14746 768516 340367 626662 677841 494465 831817 559910 252717 477155 656694 635997
14736 635997 495102 715458 826344 702079 812108 705196 379505 874239 723660 601102
14726 601102 523841 750155 501985 495755 521165 851406 771534 848351 691385 756165 700051
14715 700051 491307 670440 695423 856861 862201 638170 432764 867782 852957 568799
14705 568799 781542 696594 1002376 869657 893047 768137 605770 922697 744566 480684
14695 480684 559764 735158 908774 775687 981790 964375 970089 376274 756237 714141
14685 714141 552650 848157 795007 1023460 1247246 1064413 887415 813049 586078 791378
14675 791378 863169 675777 962616 630706 933180 852003 1013750 786303 1249106 875615
14665 875615 1156331 1031257 1085306 1180624 974220 434816 1174709 981897 1192880 952984
14655 952984 850313 1254785 913885 1084546 1140062 999215 910325 984055 993665 824937
14645 824937 965445 1071246 962494 1119650 1076364 1004200 1133100 1281356 1034672 952974
14635 952974 1168453 1062048 1175383 1267880 937116 1397505 1409994 1606460 1489090 1526023
14625 1526023 1333536 1261975 1400695 1474377 1231192 1177646 1009029 1344031 1388303 1420723
14615 1420723 1347844 1290551 1359253 1465588 1339069 1280055 1571305 1628681 1548809 1536132 1533759
14604 1533759 1491718 1155882 1744612 1629369 1607012 1872453 1388240 1658596 1672906 1485720
14594 1485720 1691758 1448896 1262025 1567494 1671992 1637706 1403400 1900615 1528476 1791730
14584 1791730 1813010 1555284 1486730 1581569 1734006 1651429 1973162 1940255 1855341 1560258
14574 1560258 1724788 2207922 1792462 2051250 2056218 2086933 2364827 2217319 2186153 2269024
14564 2269024 2157959 2445149 2178305 2507428 2421461 2370602 2227184 2819151 2672816 2813083
14554 2813083 3113873 3290521 3479050 3951753 4733895 6962066 10988629 19918207 35740114
14545 35740114 42590358 23601801 11369144 5788114 2942238 2339033 1855046 1946440
14537 1946440 1767308 1852989 2040382 1871795 1801837 2160934 1800799 2120243 1822962 2246333
14527 2246333 2263187 2020608 1929963 2448729 2211539 2257147 2124026 2237352 1974477 1896951
14517 1896951 2293344 2277232 2141398 2133024 2360426 2092486 2813241 2409951 2155264 2249827
14507 2249827 2411577 2802184 2591762 2652502 2806374 3067935 2630622 2854385 2994033 2679128
14497 2679128 3021398 3106309 3141486 3099241 3214488 3060122 2890517 3175647 3219429 3401989
14487 3401989 3326270 3423325 3599573 3457058 3309164 3345392 3266304 3763673 3405371 3559535
14477 3559535 3488894 3755051 3718838 3552116 3559537 3808497 3656910 3948013 3516220 4161874
14467 4161874 3957693 4106031 4441716 3921950 3873218 4485683 4191415 4349885 4204617 4480812
14457 4480812 4622542 4407338 4496707 4464002 4867331 4779694 5096243 4729463 5113387 5405699
14447 5405699 4854167 5370094 5217367 5128790 5284856 5244264 5430963 5566090 5230937 5957257
14437 5957257 5491280 5706252 5748023 5887948 6175498 6223875 6422260 6328016 6431365 6567083
14427 6567083 6861112 6572343 6863489 6884227 6872681 7166428 7160172 7140116 7234928 7725433
14417 7725433 7463401 7487713 8284052 8016794 7933988 7897147 8020176 8531000 8495418 8626098
14407 8626098 8904755 8992590 8807089 8879994 9390952 9560033 9211188 9619850 9731439 10055492
14397 10055492 10081185 10147898 10562615 10535415 10811654 11205265 11251487 11472222 11252621 11678499
14387 11678499 11887101 12239823 12459681 12668480 12778412 13168649 13112329 13712531 13832874
14378 13832874 13881863 14573670 14569110 14708169 15369731 15128603 15767540 16005000 16319479 16546069
14368 16546069 16614054 17364594 17901127 18117659 18332771 18417673 18808822 19568515 20322758 20408354
14358 20408354 20668886 21249607 21981680 22193615 22635299 23397634 23981965 24301706 25282367
14349 25282367 25764366 26484984 26905002 27835106 28197383 29435116 29874201 30661002 31412194
14340 31412194 32294228 33487036 34090636 35184412 35863688 37091862 38394563 39292215 40477946
14331 40477946 41801645 43052196 44341987 45818508 47309988 49028472 50379389 52273004
14323 52273004 53875547 55732222 57597161 59490866 61997714 64166002 66548039 69277840
14315 69277840 71606834 74567056 77701698 80596949 83920654 87438754 91516974 95239240
14307 95239240 99599328 103639940 108793763 113642435 119058375 124530361 130489167 137048633
14299 137048633 143628475 150656773 158892111 166945042 175756571 184848527 194847887 205174805
14291 205174805 216012386 227696814 240210038 253107419 266972533 281141129 295962905
14284 295962905 311010259 326736564 342665931 358573088 374520191 390379359 405494775
14277 405494775 420060759 433218344 444546568 453770807 459125681 460124627 459257604 458983403
14269 458983403 457083653 454794825 453675400 448924151 439457754 427737742 414010070 399307660
14261 399307660 383803489 368037595 351493576 335333319 319541459 303878688 288818944
14254 288818944 274427530 261318724 247806646 235379864 222965949 211392314 200841261
14247 200841261 190750160 180977515 172097880 163736809 155904680 148217751 141568435 134492381
14239 134492381 128333844 123021579 117504021 112144078 107401375 102762519 98213869 94154618
14231 94154618 91116089 87540953 83649581 79966083 77245755 74129257 71385366 68709189
14223 68709189 66316515 63817537 61724889 59589796 57438678 55520855 53490851 52059502
14215 52059502 50242828 48642223 47653181 46013555 44403496 43074130 41772590 40717418
14207 40717418 39858494 39133564 37424187 36075882 35108560 34419775 33641874 32864625 31897272
14198 31897272 30915328 29932485 29364593 28532280 27964775 27273971 26376142 25603592 25059755
14189 25059755 24461983 23910636 23123645 22861854 22458526 21830285 21794480 21048053 20443418
14180 20443418 20295091 19901689 19201113 18577919 18335334 17919882 17772533 17388894 17306008
14171 17306008 16624309 16079311 16318324 15920110 15217776 14859210 14940864 14176927 14029515
14162 14029515 14033346 13878180 13717895 13218708 13086841 12668457 12755485 12035469 12180958 12193786
14152 12193786 11825864 11762140 11376348 10906396 11050288 10851949 10688680 10507765 10050384
14143 10050384 10046083 9739984 9532094 9528575 9758543 9200020 9338167 9218437 8857719 8743608
14133 8743608 8671007 8565867 8271751 8504405 8273685 7990521 8056802 8072458 7746577 7742975
14123 7742975 7462147 7515901 7076485 7386875 7074580 7124637 6953310 7041048 7088689 6646509
14113 6646509 6468582 6671582 6306846 6506532 5929211 6237083 6236878 5964392 5947452 5890113
14103 5890113 5786309 5844052 6023795 5706985 5774506 5433844 5662726 5099823 5309339 5617612
14093 5617612 5397581 5220208 4983139 5055658 5346022 5136168 4833168 5044564 4899613 4672050
14083 4672050 4622825 4519449 4766487 4623457 4465875 4342522 4346400 4127439 4580096 4410285
14073 4410285 4340230 4380118 4172176 4036204 4144945 4024140 4124168 3788830 4125273 3729698
14063 3729698 3886776 3766376 4023705 3927800 3679075 3621186 3701008 3535058 3680947 3287949
14053 3287949 3519219 3647916 3432254 3505607 3199672 2910641 3388953 3435414 3105843 3169098
14043 3169098 3231046 2914162 3092183 2969935 2855106 3238069 3228063 3066733 2728532 3145421
14033 3145421 3140283 2916938 2904847 3084144 2766071 2852712 2755722 2827823 2358657 2506234
14023 2506234 2632527 2706460 2399848 2459182 2890576 2561491 2560114 2171576 2464375 2230963
14013 2230963 2393177 2595061 2276438 2413938 2064423 2070253 1961403 2324167 1965039 2108458
14003 2108458 1990647 2176993 2024157 1992506 2060659 1815174 1894815 1939706 1752384 1994218
13993 1994218 2369244 1708389 1843904 2312579 3495521 6219750 13579108 29321627 43460160
13984 43460160 28666400 14584086 7805997 5452750 4086808 3866795 3270588 3051278
13976 3051278 2680520 2891321 2784878 2487091 2614952 2185876 2079182 2308775 2411116
13967 2411116 1971840 2178686 2051890 2092947 2037897 2182184 2231461 2059359 2103977 2253936
13957 2253936 1906224 2074434 1647249 1817826 2149123 1954329 1906299 1867322 1927997 1948667
13947 1948667 2044382 1989580 1528490 1557905 1917259 1550376 1399678 1530742 1602798 1578146
13937 1578146 1469920 1636766 1883886 1475923 1740450 1429011 1518588 1630344 1376143 1738323
13927 1738323 1418130 1608366 1419542 1430173 1071929 1744998 1500637 1464509 1563078 1424808
13917 1424808 1546532 1198422 1366524 1432449 1387093 1320820 1134503 1447862 1505642 1482897
13907 1482897 1149295 856235 1296903 1462890 1526668 1518633 1467113 1488659 1527610 1340015
13897 1340015 1410375 1085456 1254464 1173715 1031443 1410846 1189371 1136759 1059093 920144
13887 920144 1277189 1170521 837150 1074750 1163410 1120084 1155644 1150254 1209030 1209073 1130473
13876 1130473 779450 1056834 1013575 1091520 1365959 814790 826377 1172886 1118032 874511
13866 874511 1070129 908496 1221023 966022 868918 1152731 882131 1192794 1138215 829103
13856 829103 1257091 1296771 794429 1098055 1039249 1088529 770662 820800 740499 629065
13846 629065 1118554 1084974 865988 1157205 604446 1109913 841160 966569 1434389 956791
13836 956791 1103466 664306 972707 1115145 682270 867443 884498 562617 1113626 1010023
13826 1010023 869685 1037761 745850 793307 1146302 958499 640938 608269 589497 626514
13816 626514 1012248 610039 700117 1048690 612913 518562 503497 561526 847679 1025371
13806 1025371 837756 1002380 880757 739166 795195 623730 390680 598585 718654 442286
13796 442286 594029 397208 416914 742609 888338 798766 889155 721370 717794 550851
13786 550851 567879 759667 617760 614124 497551 570532 563715 521013 745808 665943 797037
13775 797037 561537 959839 654770 636247 773648 569599 344698 706058 510671 716795
13765 716795 389841 604899 590323 445316 748054 697059 682857 95011 373836 464691
13755 464691 625294 526760 286900 514778 278599 611957 589260 571614 552101 716374
13745 716374 489685 543014 681030 737397 637879 496878 452297 732040 875242 230008
13734 713054 530324 923988 565421 700144 461497 430129 779728 563881 314952 751095
13724 751095 90510 579514 506718 517868 680910 536349 598406 807531 636146 564713
13714 564713 284208 507037 515165 713667 785917 344482 805650 426227 231657 931993
13704 931993 720572 639003 431253 886251 373279 713121 486990 269569 435329 773525
13694 773525 716757 344124 728843 563213 740282 378643 220749 424370 578435 574850
13684 574850 577553 380045 620599 444798 535838 169895 769367 328246 741728 557614
13674 557614 563629 231601 484760 345763 140623 619934 455236 445123 287879 477409
13664 477409 568433 452237 373492 602762 107624 501628 343032 701312 472515 336293
13654 336293 401543 677664 628615 608615 -24189 43162 567930 551573 158507 264216 633065
13643 633065 575444 649553 325579 272791 264365 208152 333202 204176 701526 473301 676468
13632 676468 60024 420716 172709 439679 567746 508817 482475 382083 372647 354134 381529
13621 381529 396288 456923 322149 359761 529066 -46850 595216 16258 415118 403283 205489
13610 205489 222306 476151 473914 306897 284839 245157 492847 521586 243968 202221 704293
13599 704293 399936 774285 682590 486662 518260 467362 439853 610899 479264 679097
13589 679097 500001 284400 168515 224365 239273 254053 214661 310464 -192210 258568
13578 164844 498330 527486 450016 144172 104326 110403 158030 307942 192002 40870 325702
13567 325702 322653 60526 413477 329647 312936 211212 372640 376025 164625 313235 205873
13556 205873 371810 -62850 358739 63563 268881 256182 648637 132272 399923 377992
13546 377992 140893 352416 323811 336249 181132 261530 445963 233085 331335 125072
13535 188339 258448 427871 -150526 199827 434552 150925 258052 152304 263921 169471
13525 169471 316164 212188 221881 144752 72621 16885 24592 84182 590741 62445 343942
13514 343942 282122 224494 476111 327316 261807 74581 138317 -5350 274799 -106442 3899
13502 287801 380706 538496 452470 247093 210766 135989 113152 25670 243813 152072 -4848
13490 263566 344399 157064 485883 695519 95801 248754 518510 66090 253691 251492
13480 251492 393214 149588 245233 377615 447911 291874 343268 12152 53448 132637 -91826
13468 183945 -9686 292096 107718 374195 151732 382805 30667 336539 152614 469523
13458 469523 232324 261663 263299 448945 175636 167395 -34811 172568 5630 178396 426419
13447 426419 181407 363844 11053 608580 120408 379405 -154696 404884 50453 431626
13437 431626 -21541 51090 415204 169476 148171 47514 477696 39461 275648 232020 65425
13425 456722 286399 343115 208657 205931 176034 -173578 91947 256634 416904 227025
13415 227025 206729 189967 201496 60571 298697 -117655 205420 342334 435921 283249
13405 283249 233755 71981 376479 215553 89939 -228073 546846 49091 113140 256789
13395 256789 268770 231490 -5588 -27213 -14461 162307 146889 430527 -73410 238764 146654
13384 146654 219532 -149882 349980 129637 236153 -135093 -20984 256068 206646 105961
13374 105961 392138 197679 230559 15128 392352 -60236 307098 -26334 172509 409294
13364 409294 244114 116308 305439 298620 265566 179074 244654 -37096 -10938 123699 -311227
13352 245628 287977 260542 -100334 199824 350105 56324 320317 211228 591322 590304
13342 590304 43454 425483 516721 229893 60650 289166 277233 92338 96326 357513 230035
13331 230035 514404 322274 265833 28364 82544 301104 239033 481262 155359 70588
13320 22502 511158 258944 270077 270024 81941 293322 169078 -102211 198542 145019 118069
13309 118069 529300 -40627 318334 190228 203733 139692 -91579 100863 275387 -102210
13298 -54384 -78540 87111 19045 311604 -174517 -286298 193007 212331 -167810 57925 260883
13287 260883 -137113 148505 356786 322710 266165 155769 349290 -45645 525180 134546
13276 305161 -36874 -19742 183155 169705 -44620 188601 -149711 90850 216182 110469
13266 110469 306075 12026 119340 251624 -136653 -446730 326224 84614 -126108 253324
13255 142362 157014 65170 194881 85740 13705 320329 439046 -134559 280119 146081
13245 146081 3177 202877 -39583 105128 18334 -5991 -20500 303187 68202 127115 -246841
13233 -24677 308940 475573 118079 68317 202857 141401 10618 198304 359056 122188
13222 48235 83577 268816 130704 152589 221947 282077 -211456 437449 363734 108947 -23919
13210 94518 189114 -19616 268222 66496 -80144 -152347 153712 131440 312632 151909 146620
13199 146620 25079 -88785 255986 121341 101070 5563 344761 -145832 -97418 80355 68001
13188 68001 282645 -139050 -111073 53698 295585 113419 51265 36075 -71051 -134178 91308
13176 -206491 81579 -187659 283266 52775 -277652 28198 -197196 142221 84318 130049
13166 130049 113813 184019 -142379 303850 -60516 115554 -54722 100604 588540 -187464
13155 64695 221169 43627 170992 -25246 334726 197004 -181874 -34268 -136356 27050
13144 -77034 21992 321953 -101836 125526 -193936 138577 337951 144323 207630 50349
13133 -109071 87642 237115 -173319 -23970 436110 163157 75405 260428 -37352 -51853
13123 -51853 240202 457745 110366 -123921 146960 -123389 364477 -412564 -52404 -172461
13113 -172461 116382 -149965 27556 -128717 260478 324654 281173 163227 52196 124147
13103 124147 -107628 228475 -75422 -330568 52056 70171 77213 197891 251152 364447 -74679
13091 2942 76502 18109 83166 155234 17782 -21156 -63649 139199 16444 54732 323732
13080 323732 -58296 -17247 37283 -43434 -118565 464427 16362 -167030 -312194 -64986 165346
13068 166025 -53788 30430 130942 -2573 -52503 173026 -3168 23505 -130300 155070 277485
13057 277485 -160 97744 208187 -36947 -107040 187629 132370 64839 -114673 204773 193898
13046 193898 -133133 22052 77485 145029 34929 201051 394 -76574 137830 41307 219482
13035 219482 -58090 138858 114695 -298274 70053 38781 319853 254632 -78486 -57051 11646
13023 -91834 -100861 -117327 46583 365816 37418 73074 308578 30741 111529 169349 232755
13012 232755 158782 227836 18545 26825 286806 242229 -9359 243248 506034 123064 -37990
13000 62971 362628 241283 -48996 -122379 -282382 163469 -61124 -52621 232885 81316 264686
12989 264686 146907 28135 216226 61873 1327 85876 79042 73014 -136028 170161 -87051
12977 47520 40380 141477 123133 -318398 69877 225733 -181671 152088 183549 -124415 -28601
12965 81228 -241052 174725 99786 -66291 -381600 -63720 212574 190057 -42407 -172193 11843
12953 104699 394920 83538 -60137 -8458 -89319 -26449 -42775 117782 101198 10350 187720
12942 187720 104587 76480 -223529 -78128 200033 149021 -43665 67386 281579 288263 128635
12930 259150 64447 118450 -88492 167828 247798 43729 -3042 292283 349110 195062 -40312
12918 89338 200968 29216 -95983 -209405 195994 330522 -36588 24697 127614 -32532 -186983
12907 -186983 -14829 -293476 -326091 -10034 187544 17257 -76204 -155937 -157111 86659 -71454
12895 -191560 8064 177899 -58283 -9180 113013 40340 389373 202226 218007 74296 78638
12884 78638 -219640 207515 291558 105718 58561 95652 -88811 -29186 22173 -108679 237128
12872 36511 238661 380040 134140 268445 -170002 179616 -5369 288298 -30700 -79131
12862 -79131 172297 308403 90746 -49041 -113029 111204 -57514 -123954 -38610 68522 -168366
12850 100019 -112174 139509 -124497 212279 249595 4526 -277381 34477 19063 126263
12840 126263 55551 160374 46206 109438 172940 -159629 165310 120120 -2433 -150435 202595
12828 255653 120342 15697 -141145 65428 335845 400022 -31764 -28282 105316 290742 -88300
12816 40196 -171739 -99983 -12510 112574 289831 123720 -8708 -150018 -45910 273950 47290
12804 95727 -107434 -63610 185260 123361 -187871 -219853 252876 74697 -117728 -81922 1351
12792 -331411 59500 279370 114446 118618 -138783 62620 -434483 57704 -84831 -61367 -261922
12781 -261922 122999 -31373 2461 27416 67276 292282 -211712 -88523 -63768 1740 -80312
12769 -158462 322379 216293 -190401 196382 -22085 -432550 -144632 250769 -268075 -314146
12759 -314146 -45141 -44426 -221718 -125169 151210 102099 199278 28831 120702 463928 -50748
12747 292614 311922 -19866 72188 1917 387322 -53250 21658 32164 118404 87915 29948
12735 215307 275899 -322179 -426456 68277 230837 271765 266955 -193486 155902 237810 -190114
12723 2990 97367 -144354 4889 179298 -220564 -108369 -45876 306977 122201 134897 29310
12711 252416 -192459 235632 382217 205618 555576 97908 521690 37378 233662 425802
12701 425802 6174 -267605 226815 395406 166400 256779 279094 53276 39908 177876 -131219
12689 96714 -135326 -47199 26865 -31024 -92981 -35307 370351 -72900 357925 92370 -49878
12677 62478 217750 97460 234911 289291 41285 167589 191332 223326 307985 -154895 49719
12665 109263 254160 -131037 34753 -24917 142848 -14844 306646 151822 -14328 -97861
12655 -97861 237577 138352 327150 -43910 200083 358906 198065 333579 -60828 -36507
12645 -36507 82104 44920 140029 302272 -131941 7941 -13369 -89710 -49396 -22201 277784
12633 -100002 -118427 -155477 -129689 22120 229560 126515 406927 208941 -215585 35729
12622 -11602 -89592 -51363 74856 404920 -214308 -58470 -84841 297410 -226588 -184008 -128080
12611 -128080 -481768 200687 14041 -47096 8537 -286011 134432 -47046 -26104 255790 -238068
12599 -8197 83685 234965 8558 206381 -19863 139155 -134427 -198780 -295634 -101943 -262856
12588 -262856 160968 42845 -82611 -116237 376096 -204736 -15003 -52015 64258 176590 462308
12577 462308 246502 231923 103153 -96085 -35215 287174 -38924 -170702 -97788 376533
12566 -60771 76730 -127357 95513 147291 -201471 262247 423701 230688 99314 -120296
12555 134400 -60050 -114188 -23190 155922 -9011 -45899 313353 5341 -53654 210192 219340
12544 219340 217893 -219231 -21642 -52431 -492859 138155 -308504 53817 -97516 121290 35821
12532 99228 -205172 -104713 -46480 113603 58543 85694 238536 -142226 176329 -77896
12521 142693 -35160 199973 183695 61442 323660 -48383 194150 47810 -1526 155462 236090
12510 236090 -190919 140132 -131779 -58962 -20520 -52921 29325 -160730 -89980 128146
12499 -176627 -54541 303875 -215845 -56820 69604 -236296 -234638 468588 -49681 83921 87637
12488 87637 -216257 45945 126038 -31049 -350710 510935 152484 113224 352753 -103319
12477 -127238 -329961 -115838 378757 -116105 -138338 -265115 146527 135218 -350733 166717
12466 -75584 -157236 184445 -170308 123941 19970 173710 154926 -108255 245651 -99977
12455 88886 133582 -52280 -47212 -24668 -265010 -27880 33094 -149489 243879 -97848 -12746
12443 219395 -71158 -228635 -102438 -212228 147677 239994 -116324 -66454 -512639 22957
12432 68791 -3944 -40484 142942 -255167 135858 103641 225549 62195 -58964 -230540 -127147
12421 -127147 243940 -86022 -106873 13080 114188 17704 103979 68270 82228 65054 117885
12410 117885 244019 -418437 107622 -8178 39619 -47356 36021 182041 -60868 -240208 171242
12398 -80555 159802 68165 182286 -338758 -102005 -196603 -219574 -117343 -466336 -323307
12388 -323307 -66948 255668 109982 -193021 -19839 278870 -194816 101264 -323094 155256
12377 112342 -388704 87020 -119695 231399 -44124 -26753 222078 -21060 108519 -199537
12366 36478 -143305 -203317 -70691 -144056 -146190 -145056 696 5930 -37202 225123 72539 70523
12354 70523 71328 81894 -60401 -180180 -59077 -135910 -40645 -86434 -88632 -209580 127798 342024
12342 342024 -137249 -58847 167787 148315 246841 -49190 99640 231516 325563 -214603 -10795
12330 -60430 37955 -318293 305547 31915 243779 191318 318709 181244 36315 -107382
12319 95964 -315141 -61811 -79252 126636 -296217 -18226 79946 227989 117142 -113167
12308 58882 285172 -43673 9851 169834 109253 -181509 48482 -274754 -130895 122586 93739
12297 93739 -6050 186165 199644 -91551 88406 121595 -24201 72570 -14686 140131 -85728
12285 85974 42646 -164362 161262 58057 -128279 12867 280344 -8616 -331367 111432 140246
12274 140246 398421 331847 304483 5789 -65978 27494 254678 -55548 45337 241174 106380
12262 66680 81481 -107839 126271 -6422 -41004 147635 -192318 243174 196329 266439 -43802
12250 183895 201499 27184 -26693 189030 256133 180069 -37846 313095 -75390 126754 -200878
12238 140023 169113 -337248 479264 121283 274968 362351 180984 242627 196848 66126
12227 256483 471991 98011 340827 134077 248223 418724 326976 220053 390588 253899
12217 253899 216871 139505 329145 389281 65642 407179 78955 5798 115673 -61365 -20375
12205 216655 208270 262998 76212 122634 8477 401291 85842 274981 413085 144488 211660
12194 211660 358729 200506 156307 -223142 290410 65331 -111968 375479 343572 149194
12183 -176833 -39486 -28153 269092 212149 331825 135531 233830 -65003 -202096 259033
12172 40868 216322 -164329 -2532 79846 246223 32393 67302 -243222 -19443 112254 94297
12161 94297 116255 -66497 -122215 132778 -259846 127202 -82714 -19753 -44815 283797 355110
12150 355110 56509 42007 83050 -80304 -139486 -139996 133982 132811 100278 -9060 414823 -193325
12137 -18651 -231340 261599 -334454 -97308 170765 53605 -51407 389479 -285032 -252311
12127 -252311 296557 249482 107872 -256373 -176303 -144942 53273 118177 -17811 72939 273313
12116 273313 39131 28109 57993 -204954 -108042 8124 -11016 146699 58450 -58159 133470
12104 83793 -34858 99351 64577 -132656 -420862 -175909 -121979 168603 -249573 121009
12093 31845 -93105 34886 157685 115727 -279888 -133845 -59107 -60343 -28461 -49126 221927
12081 18695 136754 -103354 -113687 -181167 -70018 17443 93147 66688 183127 54019 109311
12070 109311 -106169 62324 113541 143095 308883 -184250 -155008 -10109 -247266 -53820 164385
12058 -78614 266469 192780 489900 1222654 1840737 473981 401352 342643 176809 119226
12048 119226 -199318 89843 228158 -8937 -95683 96043 -77670 -381647 -234637 9938 73978
12037 73978 171163 -115711 -72431 449373 -230533 151956 -168613 221188 42964 -209081
12026 59215 21917 -62089 -52831 -39747 83535 -56599 48571 289326 138625 -301517 94032
12014 -214716 93135 171289 -63904 -201648 -109161 -29799 -257456 316908 305038 -68920 -6352
12002 -306134 -269596 132923 120904 174691 -277092 -119010 -323073 81370 -155938 40121
11991 -170873 -116758 -253782 -84762 -281884 111661 -2606 318284 -112129 -91688 -285218
11981 -285218 44833 127437 -83193 86029 70471 429620 -189620 -66740 98855 -99329 -86378
11970 -86378 -44579 -297344 22963 -81970 -193810 -258596 -220610 -239338 56403 -110661 110954
11958 -293290 -5478 -293242 -33093 -43289 90372 195914 152174 -86576 74204 -38812 62198
11946 -246845 67845 24872 334437 239135 -232722 -100555 48243 59165 -292995 -16243 48742
11934 -54230 -436072 373118 137838 -61894 -1321 65550 -270865 145568 161520 -260665 -195552
11923 -195552 145788 95863 -143184 -78430 236200 -165171 34516 -51085 204277 239094
11913 239094 192217 94084 -65786 380876 258426 233131 -236888 60185 16958 90702 81757
11902 81757 -232804 20374 408323 17865 103176 39809 -205597 -431712 45352 3247 -189965
11890 86363 73086 53044 -72444 -158741 -168976 130816 -324709 -56559 -107242 -190501 228608
11878 -97606 -148274 -124619 5646 -133622 -416509 50019 214569 -208785 129323 235657 -2727
11866 -115103 -10541 178093 39824 72449 -351105 -46701 -157222 -117959 -270074 159009
11855 87022 21522 139596 -320131 184174 -43289 83707 -52840 -386070 -49307 -133461 -135918
11844 -135918 320532 -159641 -245152 -293311 -180139 -27458 -241427 233491 -196792 -67250
11833 -150216 170156 251190 38002 -379052 -175958 11148 57544 -179215 -59613 94546 -145555
11821 -26426 -10284 -134194 204288 128999 105217 202817 66858 157560 4792 -174463 88802
11809 44944 63458 -178075 75838 263747 285826 290777 -463604 -39028 -291796 -84971 -54672
11798 -54672 96690 -25252 -41364 -57920 351058 -25508 255915 -118108 -288137 -26566 -194963
11787 -194963 280564 -89449 373794 -133242 -130142 -51493 -20981 254215 -131444 -9762 -94735
11776 -94735 45776 -196811 81368 -148242 -319665 -257623 -289248 204026 -113818 -259614
11766 -259614 -86780 -82712 61199 22877 38357 -131250 -19721 289136 63362 121618 -90416
11754 114989 -16596 84698 -52697 -335528 115261 -91318 132626 -334825 201080 -61923
11743 -210907 -55622 -132308 221038 -409690 -227027 -57054 -153568 14549 418227 -50041 246545
11731 86228 -121254 -78086 10831 -300009 121781 98263 107757 -161922 142199 109760 211313
11720 211313 -136535 -333167 -8907 192357 73927 -51835 254410 87195 -5644 -138335 73302
11708 58666 129738 -69988 231925 -97744 51281 -7594 -6850 -76419 47973 82263 84267 232203
11696 232203 242808 199875 52698 122734 235036 -56707 -155650 -89637 128119 -92689 -52139
11685 -52139 356121 159303 103037 200082 47012 446526 426922 187693 188236 103110 66224
11674 66224 -310473 -167165 138030 -84460 -97494 9079 185838 -7659 -256080 -84352 72308
11662 51685 493603 9721 191773 74190 106405 -74032 316034 44034 339085 -109108 -68502
11651 -68502 247955 9208 279966 133633 105009 412653 -48195 246128 170615 219319 106256
11639 -223337 -5282 66161 334761 -162057 208552 33592 12166 -246632 339144 -63528 73223
11627 130217 186870 237003 -56762 -40880 190648 230363 284911 -202496 55545 213366 207541
11616 207541 -85139 136422 94854 285817 -162357 291044 299359 -6587 78395 -12024 -72058
11605 -72058 353683 178996 -95131 -89911 -60414 -245554 89287 -383800 160285 -104830 57415
11593 13618 188751 -446265 -227413 -50714 8580 262060 214078 -20455 313989 -309773 463799
11581 -257321 11345 22572 -11812 -273801 101417 127348 -93478 279477 330685 -49961 -267949
11570 -267949 -2424 189286 -185119 318564 -76920 77977 7549 -14565 182195 -187718 -5951
11558 -15517 409838 5240 -58940 135116 -247875 181859 -67685 -32982 -125579 -133704 -20191
11546 -182126 -130056 173464 60004 159082 155811 162328 20146 -206628 187931 -53088 111686
11534 212850 -169677 14173 243469 151804 353950 -100080 132265 311844 -238426 278237
11523 4994 233876 275868 -175206 113189 138981 44720 -54721 361000 -80337 200410 172921
11512 172921 148049 214070 122080 432935 543773 205598 49076 -87946 -168040 171906 33046
11500 77334 -62249 439257 -59053 252520 -51734 133443 6232 89620 295361 32193 219968
11489 219968 103433 288748 396013 116554 -98567 235821 -36684 3165 218210 -104084
11478 438303 -27257 236889 -47542 -149991 53857 245153 -6023 -457126 384318 40805 116194
11467 116194 322068 -132377 158737 178038 -47055 75421 239286 315475 123739 12921
11456 -278451 113560 33117 154173 272635 300665 197949 388534 207754 85072 239584
11446 239584 103173 245004 243650 324445 -141924 -34822 91328 127788 202422 124044 115133
11435 115133 175244 168811 -40656 -46906 8837 140347 43865 -47033 33426 -60933 148954 137717
11423 137717 -195979 155968 -124027 60155 8597 179485 -224028 109770 5012 153551
11413 153551 -17681 179393 104010 183300 -244211 69259 -171294 181305 126319 -73314 127273
11401 356837 -60524 -90362 152614 -269393 -79148 -78666 61813 113682 297487 31437 86992
11390 86992 -461855 194336 24578 -151502 157751 236581 -85524 -94057 146066 -131714 312921
11378 43212 55710 -108001 46068 -36272 93924 -110287 93357 104311 146498 -448163 -189392
11366 5970 -15729 -27622 -374437 -205776 -20160 -111892 85662 227401 137685 151288 -101392
11354 -229193 -93517 -75375 109964 161831 -97169 -319826 78404 76096 181017 -117947 1376
11342 -111552 11586 -67782 87404 194745 -77042 7344 119770 -234364 -21439 -98236 -231024
11331 -231024 25658 -22029 48973 -137981 -15424 158155 189211 -129242 -223243 -122871 -141965
11320 -141965 192891 134355 143848 77872 193788 -49032 33374 76842 292058 -142680 -83525
11309 -83525 181134 -70278 81928 -10516 5190 153651 191301 4939 192918 135973 77550
11298 77550 73613 309616 190351 191881 11084 -329428 -81122 -166665 67671 -64501 1348 -276934
11285 54953 -405953 -169566 -253136 230878 96104 -50511 7608 7346 -410197 27067 -94123
11273 -97454 211259 -236400 178164 -11908 -87891 -8109 95475 14469 137614 -303098 -8693
11261 69421 -238352 -177118 -161064 -241861 16599 -269300 -282537 -58398 -221904 61394 22307
11249 -65202 -261098 5429 77119 9934 100234 -221714 -1119 3153 -123181 -111241 -77711 -147385
11237 -147385 -109358 -267683 -197055 15511 -30021 564273 57221 -338855 -398540 -87690 -162796
11226 -162796 -101235 -81307 43012 -42006 -145132 113824 -76392 -190715 231120 108499
11215 -5074 -3156 -132653 32490 3664 175582 -149698 202408 323266 30757 -95117 84582
11203 431306 -204106 -82477 -436850 -158575 -146975 78625 421803 40821 220797 -185443
11192 -202317 11950 58002 223497 -109274 -29224 -358429 -122714 141283 -114630 -126157
11182 -126157 -40532 -11846 -6311 -575737 -36437 -119952 -67816 -31374 -127336 79939 47608
11171 47608 -39515 134037 -239644 -15119 -270553 142258 -30899 -67068 -74124 -82194 161214
11159 -451896 -84118 59215 -211746 240498 -120180 -109361 52228 277705 -106899 126560
11148 113896 -119684 -268097 44369 -151255 -5277 123775 -29643 220982 -157596 158665
11137 -68026 175276 -39546 54092 -33702 -114708 84989 -207179 322732 310143 -301025 91434
11125 -295338 61622 -178831 94604 -323081 111647 170818 -211329 95730 95234 161931 13476
11113 -27648 -117086 303742 -18436 82132 31714 -33373 185291 258626 380535 -30015 46393
11101 135021 230613 156416 166536 312354 274166 47601 579579 210061 304333 -18579 277023
11089 -20885 192554 221027 116721 396817 184466 223372 282307 -108260 150510 115288
11079 115288 355407 178654 294319 381008 370719 437005 115060 139647 276066 207347
11069 207347 184677 474206 376924 365156 385034 398155 319431 940318 404328 571776 368204
11058 368204 588018 675237 529412 464145 720123 668266 488730 680304 711593 611198
11048 611198 684454 868753 768429 845462 717202 611112 747790 851062 937249 829206
11038 829206 606517 913184 726873 995849 865897 744356 1045154 920304 783492 537756
11028 537756 796180 750769 335928 695405 613017 783613 702300 879285 804819 877407
11018 877407 600468 695513 672074 341368 913753 581848 596773 830598 555838 598940
11008 598940 648612 740657 729223 572316 608561 697465 766167 696450 928488 431006 456885
10997 456885 725630 661006 599895 492884 587869 738584 520084 730945 735629 749863 896441
10986 896441 1028121 1038437 1042623 944997 1392155 1164951 1112149 1456049 1431953 1676348 1571252
10975 1571252 1921810 2354541 2829175 2943889 2817037 3126275 3194574 3340021 2844009 2877763
10965 2877763 2503423 2477412 1814172 2384774 2095242 2037008 1818176 1971781 1998945 2174729
10955 2174729 1740330 1793495 1651279 1451179 1301595 1088230 1141589 964533 666496 603378
10945 603378 690617 317176 404092 289471 212853 43576 -326846 104227 479760 128135
10934 150644 194158 244234 310090 133565 136727 127710 -164343 -100376 240594 -133314 -154817
10923 -154817 193878 193978 232591 119203 98964 -194582 -350730 150261 35009 169625 -83130
10911 186874 -176136 223006 365248 -281081 99246 58920 -131053 7559 135732 -107883
10900 180839 -217948 25012 -33755 194913 -184252 -1593 386805 -315013 -111654 -188912
10890 -188912 -49605 -119492 190010 108668 120884 213633 20564 -292098 -317870 -52034 -106858
10879 -106858 -76436 -36040 53491 164988 63648 -10935 185446 564494 234905 -206281
10868 10666 259216 301136 -83537 309999 -83375 43405 259022 114980 115929 -84374 91581
10856 -17878 -129293 113756 -263521 -19169 -12514 229737 28764 221975 -73903 -352904 -27810
10844 13529 -261329 84652 383742 -102393 112388 -118072 -52387 103910 -247361 -148553
10834 -148553 -51451 390341 112041 -66638 -46485 -85544 -56795 -135698 66819 15099 98970
10823 98970 -35522 -65907 30585 -54125 -16273 -128421 -83121 -100868 63002 -331098 233026
10811 -301372 224721 -78605 -141417 -27163 -148015 -263132 -168135 35756 -193871 24964 53661
10800 53661 -383 -33710 62668 31714 -20834 22438 58825 -133288 133000 -66648 141527
10788 -13804 -68626 254535 228170 122676 -71607 167779 -42637 75116 172490 30312 22523
10777 22523 240001 150985 -25904 -105579 -20884 10431 -120615 -21335 -260256 -86088 24875
10765 -248918 -34681 -14974 -109232 -251399 315740 -274801 83999 17641 121631 6217 -189351
10753 68773 169267 -39118 -411974 -68771 -237613 -145975 -131234 359363 46505 132406 114946
10742 114946 61173 -128710 137708 363701 187301 -87648 20089 74179 -236922 -41903
10731 220810 -11082 -326085 133379 -95336 73199 157343 34191 -127175 51781 178158 20688
10719 214134 33880 212086 -235205 73014 56797 -148320 41036 -19240 -58865 -107085 -106267
10708 -106267 45455 -30585 -32156 -214884 -186853 16568 30738 -143475 -249816 -80811 14337
10696 -47652 -164681 -165200 -32023 -357298 -149494 -64293 113165 -209066 27811 -322013 -95557
10684 -18421 198065 -144759 -60182 -193487 -332892 122583 240327 30486 62477 45426
10674 45426 -136708 -401134 -444685 -207558 -95403 -142571 65765 -279378 108528 61145 299433
10663 299433 48584 117260 -246511 -323947 29793 84716 -48242 -45045 53976 -9987 42200 196585
10651 196585 -31922 -1264 -419666 256807 45487 -103683 58631 -102691 63546 -123246 21540
10639 -84714 -86792 129409 -78577 -143687 -174286 -47872 149789 162530 -333187 1432 51150
10628 51150 8129 150240 149338 -283790 392110 276377 159691 177208 207513 -138558 -176159
10617 -176159 -302249 -126090 16355 -41466 68895 263620 -39614 -118658 56820 -270903 195404
10605 28444 -215050 -15928 -104374 114749 -181020 -250666 252564 -27674 -1069 -238544 -75327
10593 -5725 -64581 -427561 -40086 -210438 -23192 -214260 66604 192657 -33404 5922 45464
10582 45464 -424078 123994 162640 141282 54524 -94721 -45062 -194480 79477 55527 -143938
10570 -111704 -316895 -174328 -124341 7065 -60799 -392753 -246067 14038 -122744 27509 116567
10559 116567 -263347 12943 99594 202123 -94268 -178111 -138149 181880 93103 -14888 105852
10547 85461 -154077 66391 -42206 13752 37401 -101602 26577 28746 -94679 -243895 -30978
10535 76096 7776 78308 -21778 295546 111858 -79402 -193190 71267 225843 17353 -262977
10523 -13534 15173 238637 -175703 -121341 -312855 22635 -224003 -192981 -16096 -265132 213092
10511 59404 -8107 121757 -161594 -152502 -106631 316386 89045 -480909 -257469 -117399 -451486
10500 -451486 64060 -4528 -64983 -40393 -139271 -35730 -245930 -22195 -79081 -283086 -235839
10489 -235839 61239 -220435 -143674 -80808 -274798 293088 4483 90631 304736 356593 261513
10478 261513 374073 406821 106891 -161390 92899 115462 -308475 77779 293612 181275
10468 181275 -240750 -24490 89608 41428 85266 -154068 209104 228238 -39567 -152369 -7650
10456 113421 122990 -213692 -48627 -32493 221695 35126 167579 -35258 -124813 195483 1879
10444 37081 97078 -189083 170132 74323 -173413 70615 242855 9746 62528 37672 8605
10432 -57280 -157555 250232 -307498 -151281 -230131 171157 -237780 -113655 -47749 -117316
10422 -117316 9478 100108 164929 -324000 337427 987 -51091 254146 163799 134054 31009
10410 -157682 -176923 116020 -282905 185242 -37640 145977 162242 -303812 110847 173039
10400 173039 -32643 -149997 108305 -317890 38857 33556 397628 63132 -188714 292642
10389 106811 -177186 112359 -26229 -315443 231528 192913 118871 107467 118879 603086
10379 603086 260334 290457 241688 334197 80218 298028 340724 414553 53154 246884 507145
10368 507145 809081 231467 542944 475584 488617 535977 459519 -29675 273929 187561 330287
10357 330287 29093 224604 111345 83762 233218 456920 363272 600998 711498 137718
10346 189801 776762 313853 144629 561455 435448 368641 127349 -95723 94939 134857
10336 134857 457551 378125 119256 -14702 219741 -115105 57176 -69464 230603 326774
10326 326774 65617 -74901 78508 158123 441246 21235 19538 95565 -7018 259512 151383
10315 151383 -95066 191397 -34036 106908 456261 -288021 139318 2131 -101440 121207
10304 -139790 -116623 29110 221762 -175682 -64303 193889 242722 106421 414642 -26885
10293 132834 94206 -266 26450 -179518 -198434 310059 109677 -91161 145435 -262644 81925
10281 30823 -17917 -172172 8367 -50520 -84627 -138013 253799 234792 -74068 194284 125076
10270 125076 -179943 -341453 49104 -13079 61831 -67788 75781 -141299 144126 422333
10260 422333 196175 -65638 541704 209183 333258 622047 30341 262908 67651 60741
10250 60741 386436 233207 -27627 26408 238780 113652 -151202 -335066 -39636 -268450
10240 -268450 -150269 285282 60247 -105512 -65849 -122899 -392343 190130 -60899 -280459
10230 -280459 -264602 119687 12417 -265945 -360210 -278726 139163 -268355 -29876 -272030
10220 -272030 197057 26975 -40776 -40673 -288350 227668 10584 283 160908 -293550 -104991
10208 -315476 74129 197833 56193 -2532 -211709 129112 -241591 -70314 -207135 -8007 140830
10196 -457150 -95639 -65052 -312753 86681 -250478 -77097 -373996 -154334 -97713 -52145 -144015
10185 -144015 195868 -287563 -133749 420646 -2710 -184989 -117375 208743 -35512 -235039
10175 -235039 10338 -219073 -121523 -109969 152235 215377 -159746 -126504 72925 -173767 -95410
10164 -95410 -95158 21092 -5762 80439 -188846 -55910 -210177 -260679 -124508 74823 -165371
10152 58412 -196416 -423457 59586 -330898 -116875 18178 -212517 -1825 -130577 -68115 -208097
10141 -208097 -109150 -150026 -44197 -104908 -24286 119761 77460 -207488 -98764 5723 -159002
10129 22647 253606 112305 97716 -306289 5562 -153183 13691 156176 -329870 -153552
10118 -175882 -97331 71011 127668 -367595 -100381 14605 -318602 -139947 273565 -132973
10107 17141 -175868 89083 -62473 -221140 -2246 144172 -157475 37177 -15951 215737 255562
10096 255562 -201385 -127159 92621 -32173 26143 227998 -217149 -96645 -96608 150618 -209021
10084 -420523 -4611 -107554 72881 -77171 103249 -342492 -87002 -138701 -116685 -57539 -63272
10073 -63272 54218 68963 12081 -141686 73837 -10189 -97022 -68148 -191592 -27426 259416
10061 201432 -35507 1946 -265537 44247 77452 -214860 160334 -279148 257332 12987 -125493
10049 -18370 -27783 -196011 -117455 -432790 23232 3257 -34072 153348 -58813 -229950 -39616
10037 -28825 169629 -70033 20086 99009 -318284 -95592 -96087 172396 -135345 -211729 -251670
10026 -251670 56777 -90123 13381 203091 -350010 -52807 -84943 -196262 -86872 411495 93384
10014 -149592 -74158 -14257 184119 -158052 28132 169004 -215173 -11893 -73942 -82537 -45044
10003 -45044 -6439 172568 223852 -142918 262919 195744 -25013 -342546 -243907 -129161 -222729
9992 -222729 102528 -51173 -157552 69809 -402836 223210 -77940 -41553 98871 -301140 143549
9980 467304 -330625 -40614 189627 -18256 -19307 16660 -224840 -41550 -225884 111378 247580
9969 247580 -156394 -324341 29850 111791 55737 -5347 42628 175812 -446986 -107219 -168546
9958 -168546 -68744 233446 -40862 -310812 169523 -230183 -20488 -75529 -80151 36468 78013
9947 78013 80894 -4971 -114807 -205678 -86652 -148419 -120831 -476063 143211 245367 133975
9936 133975 109628 -68476 184711 -96063 -118505 -83318 -122966 -30127 43787 -35178 39602
9924 -482627 89935 -297296 -105239 89330 30739 -143894 -113316 16615 62372 -66402 27395
9912 -441167 71765 -74271 -161599 250055 99673 -191210 -116628 -157159 105214 -76126 -194646
9901 -194646 180897 -356201 47191 -321084 63263 89383 -7495 196643 -269502 -193497 -448293
9890 -448293 86032 -282683 246619 -91660 217009 -251215 147772 -76722 255809 -313355
9879 -282061 -60314 88771 -6598 -265655 78115 171814 -99545 -317826 -49129 -385448 308423
9867 280569 -128771 -128105 161137 -424370 -93970 85813 -225746 -200651 132481 -35326 -13010
9855 -259132 34199 30694 -533200 -459017 -40010 158623 -421643 -155309 328160 -183646 169836
9843 -104832 -67688 171138 -277741 41723 -257613 92166 -244079 -124545 23115 -167481
9832 -128261 -21677 165242 -34219 118251 -133182 38618 -458605 -235592 -267257 -181727 214336
9820 124881 15853 -212475 94731 87960 -203934 -104219 -314969 337651 -160469 125727 -171222
9808 -57471 -358570 -399066 34901 -255269 28520 149142 -73205 -12331 196889 -127306 -224840
9797 -224840 170420 -244708 -23059 -197232 124083 90960 34953 -145082 32413 8973 179053
9786 179053 -61196 181104 -168783 127233 -305061 -1903 244202 -138742 95008 -197039
9775 -163831 -111921 -313721 27677 -351499 -71697 -48884 -165878 -83167 206159 -20882 64269
9763 111752 99280 52444 32144 49088 13376 -243262 -131285 -160029 35602 -175387 -41157
9751 7519 111310 -80257 -536350 139218 -30708 -328010 -283492 146709 83884 -100136 -145595
9740 -145595 -116749 -146526 -22228 -202262 -15137 171292 163067 -354629 -199070 -74325 -85058
9729 -85058 -230044 -101394 274457 -125228 -175108 11379 -234766 131290 -267171 -417875
9719 -417875 281520 194776 -144395 -109178 58246 370314 199605 32356 -46727 -392220 -178433
9707 -75054 34181 -7317 -395724 -130175 -67726 -140466 -251868 62986 -53304 77363 31772
9695 -158437 -108858 373137 17208 280119 -219795 -105222 37631 -168946 -87021 193083
9684 142687 -107613 -238963 257354 -116195 -133013 -77660 -268613 253726 -151938 -355349
9674 -355349 31060 -123391 27119 116021 103957 239354 67233 -73754 -143095 -44053 -60423
9663 -60423 -261653 10964 -337015 56782 -144533 -116294 -218611 378603 -154125 -144273 164868
9651 -287160 129250 -377592 -329303 -287517 119469 284089 -166261 233385 5504 -43824 13410
9639 162607 74751 -242336 -187173 -216694 -421388 96718 -44714 333614 -121714 84785 -311208
9627 139537 -71119 -30122 -232521 -235729 -80040 41176 -119505 -238076 359346 -295801 -71126
9615 -37060 68240 331754 196730 -172159 13864 -48785 388745 193780 -179149 168052
9604 51535 -49923 -131508 30034 292914 -175215 61256 -323874 -156135 -186621 -137805 42407
9592 -273255 230333 104843 664 30060 -228737 -197592 -203483 -243335 -148073 -263392 -78458
9580 29760 154902 135582 -341846 -67155 -83180 -47077 43068 145730 -348177 43612 59371
9569 59371 -303319 -238779 -28404 5167 -8286 176209 -302917 162527 -323208 128955 -29236
9557 44496 -263389 -157861 -164721 -2822 -369282 -161232 -165717 -70061 -66114 -147457 32447 -99787
9544 24249 -220743 -183759 -399925 -76335 -126544 -39954 274164 -59867 -324234 -365908 -288302
9533 -288302 142490 -323331 10181 -147654 -41060 -10392 89770 201279 -123421 -8022 -147487
9522 -147487 7378 110382 -4132 280633 -420264 -267422 73140 -221988 141068 -230917 -268777
9511 -268777 244885 -84612 42651 65416 -145080 291842 57539 27493 -196456 29437 -6335
9499 -41163 -132631 -164152 193297 -165027 -1710 -259768 65306 -391589 -248939 -155085 -271648
9488 -271648 37911 -152665 -308862 38082 -66641 -172266 -114299 89966 153100 -10260 -215186
9477 -215186 251504 -13245 -148921 -296227 -396290 -79730 -110943 -75273 -97235 -134012 -207568
9466 -207568 -266246 50033 82018 -163148 132125 6236 -202223 123896 111246 -183695 -179481
9455 -179481 -119671 59607 -33323 -286977 -3552 2302 -121254 56141 -40572 -189784 44627
9443 -155459 -189306 -166884 -111219 125174 58898 -154512 -293811 -19724 84899 43408 67336
9432 67336 -192375 301972 -22532 -495817 178735 82937 -114954 414926 -111615 -199270
9422 -199270 -304408 -214906 -243760 -312666 -132145 -352237 -63579 -82602 -584799 134568 -193728
9410 -240039 -301231 -51561 148607 113978 55938 -164265 -684165 834 56993 -32652 -341979
9399 -341979 123632 -121897 -137994 -14104 39989 -48022 50559 95907 -37393 -28217 -64049
9388 -64049 865 -33323 -180918 40415 59104 84335 294176 49978 -24126 -524051 -248741
9376 450915 -543470 -41454 38631 92646 -407758 34947 -10677 -50865 -60664 -94374 -14806
9364 -106223 -235581 48273 -18783 10568 152275 9007 285804 -112365 -165663 287126 -6344
9352 -89167 -309382 -154224 -333188 -226937 63629 115459 -133192 -18506 -274886 313864
9341 149367 102799 109568 -42226 176222 -299603 -260863 -28491 -148044 60114 -68635 387973
9329 82076 71281 156297 264196 189469 104470 -230254 -228403 107137 80015 62321 -66773
9317 140564 -45765 -143100 -42706 120555 378650 -43954 62150 52225 356539 -119581 -224442
9306 -224442 201055 -166890 41917 -50963 -100878 248739 -211894 -56422 248408 154556 -61402
9294 -14066 -60489 259963 -149371 -80483 39870 -47550 -117604 -9076 79586 -220396 -254428
9283 -254428 49995 -90139 -291199 117816 69544 -80408 -269241 -34764 -254656 109138 -102794
9271 -81193 59762 -174141 351578 1568 -293530 -161788 132076 -43757 -213445 -306366 -182742
9260 -182742 -118467 -35304 59076 -2534 -184137 -246227 -70353 -25630 -247295 -6629 -168531
9249 -168531 206232 -271378 -151704 -33113 -137133 81914 -164760 -827 -492284 300730 -258533
9237 25143 -89271 -205085 -139187 -37102 -378184 180154 7028 264335 -113032 -36486 -256646
9226 -256646 170365 -21197 -156088 -206392 -300342 5345 305085 72385 -272906 -79813 -89204
9215 -89204 152966 40816 238379 156548 -79939 222489 -92583 -42084 -220992 -110559 9255
9203 228834 78755 55060 -226439 41852 -189666 2804 51457 36140 87536 -59585 214662
9191 -45065 -97891 200127 -103310 77522 -5575 -113073 -148200 -75593 39842 -267124 -82195
9179 169289 -158320 -247796 -111602 135466 159782 -57251 -134358 -123512 -66033 -8154 -277200
9168 -277200 -166703 326792 -147571 73265 -3955 -216251 124222 -279662 133636 -336069
9157 -199027 -110127 -118568 -199918 4977 -216727 -326108 -72740 -455921 60771 -343322 -291366
9146 -291366 -232790 64347 -100904 -81010 -298611 -126090 -372694 99331 143365 -71719 67684
9134 -143630 -171067 28410 273933 -265737 137482 -193994 60379 -151816 20253 446 15664
9123 15664 646 -33748 -97197 59017 -262068 -253270 -142569 -87192 39449 -226828 -196355 -356437
9111 -356437 -104569 38698 188711 -131550 -244898 -68450 -48229 107884 102897 -129458 40061
9099 -251992 273079 -205848 -216177 36079 32173 -75987 -89807 -276052 -173018 -110143 -116495
9088 -116495 218660 185298 -328127 -110888 -66265 -21602 -333024 -75894 196618 56289 -53815
9076 -134420 -143833 98574 63624 -203917 -439705 -213292 -262580 -14208 -91902 -272953 -141348
9065 -141348 174664 -158762 63890 650 -258865 -102507 -192988 -451609 -125201 -138267 267176
9053 140484 57387 -189430 165179 -63703 207578 14879 -281980 -114657 -351468 175436
9042 252484 27033 -28056 3657 75506 149919 277861 -103669 -297405 -93796 -351730 348874
9030 -150269 -231520 -36480 237102 184678 111351 -182465 -249988 158567 273457 -234257 -113259
9018 7211 165967 -115015 190244 116295 234808 119135 264627 -73033 174694 -61755 1631
9006 -93676 -314680 -73444 -258756 -53561 144593 -128100 -63237 -301490 -70877 -219688 -187672
8995 -187672 -77593 197029 -425557 -156163 -57552 -117671 -53025 -238080 114285 -133704
8984 -122695 30170 -280255 25889 199441 33554 2109 -8761 85524 -196830 -344054 -190469
8973 -190469 190387 63730 -67038 -80206 28255 -394939 -227741 -237072 60953 -259287 67927
8961 -80206 47342 -64954 33104 269727 -392470 -70841 -13535 68946 -76176 24814 -148349
8949 14450 -230236 22836 -148698 -77302 8171 2778 -237890 -72410 323111 -61058 152151
8937 -193495 26505 79559 275596 520712 155750 -416074 -85779 -177770 222332 -46329 152564
8925 -115519 295855 1079158 2227822 6362467 12008437 4896244 1365609 504531 276249
8916 276249 48480 -58319 16928 -151656 216389 -110511 160410 254950 209388 479793 -21111
8904 98294 -154392 137766 -71984 -317149 17961 -95488 -199387 -26332 -41990 -19518 -25109
8893 -25109 -510522 14062 -110110 30499 111065 147579 -52256 -105106 -122412 -35131 -159997
8882 -159997 -23307 -122308 -181326 -365331 -252537 -88024 305905 -270175 305771 217671 91297
8870 19678 -194121 -87061 72322 144138 -174247 -195866 -16573 236379 158062 -201635 -282402
8859 -282402 4682 197859 -124298 -318014 69854 -262923 161937 -327108 -265977 26714 -103587
8847 681 -13106 11422 57748 33982 -203061 -41162 23770 -99555 -167019 -212584 -206248 -90555
8834 -34103 -127154 -99548 34731 -410356 -317037 -132496 62932 -8995 171778 -6623 -29333 -183463
8822 -183463 -19853 31579 -100569 -199061 77668 -105560 -30138 49815 298147 74853 -79437
8810 -100446 12627 -7373 -43229 69576 95856 -72693 98292 43444 -185802 226088 -90583
8798 106353 6550 -115166 -200744 -6319 -62531 112254 -182171 50486 -130655 247253 -275936
8786 12781 -77112 -44898 68476 -159448 -127240 -218033 -97217 7686 -373180 -51943 -230525
8775 -230525 98630 -170751 233109 -239278 -27832 42472 71551 -173005 -132958 -49899 -4858
8763 164036 -217528 -164956 -22625 -316649 -205615 -452340 76019 21557 -97468 190292 30614
8751 -26482 -97694 -209605 -114958 -205429 274526 -8115 59135 99326 -146063 -59911 -93222
8740 -93222 32753 -273583 85570 105806 207028 76638 63516 -77405 62215 62256 -45797 -232282
8728 -232282 -37461 -27746 -306517 58023 -55581 18261 -156655 53528 -76295 66693 -225470
8716 141544 -132766 65277 -103410 -138106 -66472 -380412 115962 -133047 66824 -168519
8705 -77813 -123896 29629 -186455 -339545 -231945 -290620 -1967 58042 178785 -106044 -57197
8694 -57197 303171 -201116 175478 -234362 -98164 8396 -220119 89762 -35201 -231875 276584
8682 41213 -96469 -183402 -591 -72270 101047 -152368 93093 -88775 -20682 -23591 -27378 -327236
8670 -327236 -155124 -435915 -348948 -108871 -410562 255180 1581 197343 -258126 80151
8659 -147284 295973 232424 -325036 -122667 2504 3126 16842 -105498 92154 102782 -261674
8647 -111395 -389068 101025 49297 -78302 -13282 140338 369557 -115539 48293 -239034
8636 -214325 155985 -215368 194815 -41493 -504937 19618 279777 -336986 268767 -155450
8625 -36037 -92307 106087 -187490 202638 89961 31085 175525 -229029 -252605 -175963 -38365
8613 -367434 66687 92327 -62986 -10781 63048 -382291 -34151 167081 -150769 45531 -35883
8601 -74737 -303519 -163641 190552 5102 -76688 60422 -235773 -66464 -246573 -21828 -149605
8590 -149605 237035 -132904 -6112 -158957 -185422 -48976 -132442 -336284 93071 -26252 171887
8578 65191 -197843 104358 -313647 77302 -111268 160594 366988 -21031 -265738 -165658
8568 -165658 94960 -103558 47131 69275 36031 -281004 -94357 263781 -42364 6915 -325403
8556 155039 -237138 -65778 -51072 -64048 -134219 166345 299992 29817 -203666 127363 -462230
8544 191984 -242105 159159 492561 -224612 14072 22195 -16959 102099 -22996 248362 72559
8532 89083 142336 112461 -223776 209462 6480 -246222 -115077 -78151 -327813 -147374 -357170
8521 -357170 -174456 62183 -298929 287177 -57494 -37717 -31891 20043 -76073 -7576 -335989
8510 -335989 -185198 -232672 -167019 236854 67059 76988 -197614 -169447 -127316 133096 120961
8499 120961 175452 -70181 -56116 -64348 -157407 222979 59345 -218092 -40080 -20877 -30541 -20876
8487 -20876 -33674 -5474 -42910 -36650 -358795 -172727 -111334 -107991 -197640 -144588 126592 130636
8475 130636 -59027 90455 -87110 -106783 62537 -83703 -51286 -343225 -40060 -228682 -155961
8464 -155961 -107868 -66224 142866 -156693 -9487 -44657 -29916 -33509 -30091 -263111 89182 123177
8452 123177 87177 -110112 63953 -51220 -85430 -23199 -8715 -148650 152284 -291746 -204983
8441 -204983 -322767 -140502 29552 -130290 -114698 97064 -175725 -5237 80053 -189957 -180335
8430 -180335 257788 -80597 -382349 108994 272984 84124 146455 -323479 202895 -204421
8419 -169248 -231689 -289345 -67651 164030 -91583 13055 19191 358381 -73540 95115 -301968
8407 -160930 -61038 177193 -142142 -204350 -100494 -113891 -6129 -58439 116199 -215552 -119763
8396 -119763 -141711 -22407 -234681 -127531 -92389 -17012 170860 -107763 -216798 152181
8385 -106616 158590 -94795 -241385 57476 141714 145870 -47627 67171 233642 -108894 127222
8373 14392 221803 -31627 87872 -251532 97676 33248 -147253 75393 -51274 161957 27654
8361 -151394 -280514 -171662 -58471 -113591 -140301 79435 6969 -241990 15165 68109 47625
8350 47625 -207329 -456529 -30891 -162203 -557 23464 17432 -116092 -97967 133475 -251375
8338 105256 -167 219096 -126507 -2638 321213 -203543 -238288 -103644 -307607 43240 -24294
8326 -178914 -66738 -185451 115505 304482 -133826 448138 -271102 -72868 -274341 -225412
8316 -225412 152167 -128701 -129297 -463204 -359120 -131487 230558 -79260 -212162 -119545 -161541
8305 -161541 -477119 211175 166835 58233 -264258 192015 78347 -180260 68988 190023
8295 190023 137038 -12240 138435 -35986 148723 -238283 -277017 44262 147604 -64681 -18502
8283 -39408 -64586 -102141 320440 52190 -60588 45086 158529 263771 -23360 162029 -236400
8271 -33635 -260428 -236457 -122714 -74490 -193482 -102926 265235 -76362 -38365 49593 -395254
8259 -25726 -238421 42066 -7753 -286631 113794 -113571 -118930 -195365 -394569 -321292 20092
8247 247469 -112848 73308 -14439 77535 -154745 -172623 -132375 -49727 -202233 -202454 -34001
8235 342443 225502 -281514 -261440 145977 -401687 -202712 9451 -253424 -87389 94804 80919
8224 80919 49302 -94987 -48118 -244443 -255500 -65235 121840 218858 145703 134432 92722
8213 92722 99198 -163328 -325808 155293 -201599 33318 33169 -43594 -3526 -125123 187719
8201 75920 -62998 -15024 -230356 49100 16436 71240 18010 -111463 -164697 37505 -97983
8189 157336 267905 -341915 -225079 -140448 -140317 130559 -125387 -145650 371686 217074 -99440
8177 -255322 -99581 -110654 -449723 -31739 -310094 358833 132576 -194238 -80932 77960 122920
8166 122920 341335 8143 -272480 97301 -205925 7212 254786 -189532 282706 78305 371734
8155 371734 -15490 -173654 179200 -167999 -3102 -352019 230314 99223 -105975 -123812 -73384
8144 -73384 -322446 -83257 176161 -2220 72778 -1008 61803 69446 82069 192774 77798 -206297
8131 45750 -294833 -153950 323007 -38642 43517 -292391 -204179 28068 -113185 57 -223352
8119 -209876 -145731 -81949 -64996 69150 -32879 -104942 -293785 -85400 131078 -237214 182291
8107 -394080 -92051 14519 -269186 -85825 -109527 -148451 -392323 205605 20000 3440 92533
8096 92533 -144352 -158837 18489 127870 -177269 60520 29846 -55098 123646 -37323 181662
8084 71201 46608 6088 229616 -90972 30239 -131009 126034 42394 123855 28468 -150880
8072 60568 154185 -246072 111420 303004 -160416 -48936 90709 61931 -323337 73054 240130
8061 240130 275003 -216263 -119479 127173 -189227 3467 35173 -36181 -139581 -6747 -61449
8050 -61449 -113907 -33055 27155 95899 -151370 -207088 -37200 -185339 -373132 79544 -219329
8038 -289568 -383787 -165749 -213018 -50670 -261608 167419 164794 -31215 72663 -289847 102389
8026 -316237 -90844 316496 113112 -64243 -253310 86853 -49475 -173961 170151 -65239 30279
8014 -218383 189049 107810 127205 -252615 -325913 114962 -120869 180189 -181660 280535
8003 100578 -49951 281738 -9695 -214953 110514 -47659 246431 -170447 -424673 -74755 -110989
7992 -110989 -225802 -189518 -39923 -637 -29051 56202 -303328 -69815 -252357 -367532 -227563
7981 -227563 -825 -107383 176115 570108 -58277 -23992 -28802 -110618 150655 -30199 30800
7969 3048 103306 -391031 38585 -81886 -4365 -115506 -37978 -11817 4654 -10720 -155504 96303
7956 -106739 141268 351763 -230721 -95900 -16710 65950 -371135 -223697 381136 120510
7945 95576 -262127 -167850 11016 -137533 -343708 127298 115365 -12095 -167594 -357470 -185078
7934 -185078 131919 -358056 -32820 12680 82224 -9951 -227063 -135218 -178717 -178979 -98474 -121770
7922 -121770 105948 -219417 310686 9359 -217290 -5052 114666 -208849 -136873 -72268 -392698
7911 -392698 339228 -70312 -239702 67105 338602 94462 353278 -268327 278280 -230620
7900 63182 -34208 130995 130561 110327 168515 -215 -64072 -230864 -18026 -205923 -313025 -173639
7888 -173639 -47692 -197087 241418 -339196 20592 133281 -83236 169584 -76320 -374085
7878 -374085 229111 200028 -258832 168708 155029 -135142 -311232 -46483 -54182 -15255 -300796
7867 -300796 41079 115191 187181 178239 -137286 87295 -230600 -164317 16039 80100 -11153
7855 -112153 61222 -600208 -196067 180098 -154464 -274116 117726 -78813 40810 -36822
7844 -163804 172048 -66748 -148828 -70416 3120 -127222 -84469 125096 -270206 73370 -60520
7832 329070 -214267 192917 232875 188582 170558 10588 152013 -139547 49969 -199714 -102287
7821 -102287 -243899 -99373 -174727 11808 -55741 58040 -287344 -42725 -18839 -155331 99954
7809 354546 -271989 -311315 -274013 1453 -99797 70032 -56152 20046 14468 -162024 97570 82569
7797 82569 -35958 -194 -144065 276099 -318830 -152975 22494 108705 232774 41596 -267125
7785 110350 -71389 169171 153124 -83127 84772 -115446 -119562 -547691 -283454 165323 -73847
7773 -37779 -141761 -85462 23546 118550 -214641 -157972 -205836 132654 -108520 -165067 -16157
7761 112814 125664 66472 95957 -80127 -227525 101578 -45839 56684 -310336 37552 -96789
7749 68535 -347341 -16110 33056 -450247 -53901 -60785 203625 -356956 13113 -124730 36593
7737 -159396 23799 -108024 -179623 133761 167179 -52832 -153855 248525 51886 -760 -251270
7726 -251270 73818 10742 -326615 6901 -80685 -39223 115350 54322 -150463 7823 33193
7715 33193 -262576 -199460 123696 78371 -13095 -349367 -39905 195957 -139668 -130219 31758
7703 11955 -250763 248200 50635 119968 -121217 -82854 -244545 -315753 -7792 112456 -87207
7691 33456 7547 -100605 271636 -15745 -102087 -186123 42211 -7558 101258 -36981 -108211 -238629
7679 -238629 -20679 46600 39328 278197 -179845 -165146 -70313 -44593 -377097 6216 -31818
7667 202631 -294949 228035 -326919 141773 173085 -327388 -57459 -136682 -22019 -72677 31574
7655 -158732 -104156 182711 76764 211958 331581 -68551 -235725 -177652 -16990 88427 -106714
7643 -231728 7089 -229464 449650 27963 89963 45551 -175755 116036 133611 -66922 -119180
7632 -119180 -79251 -77938 -139746 -460997 51820 129561 -180422 307000 -178341 37673 70610
7621 70610 53974 20935 -150423 173522 21941 82090 74917 -144869 -104740 223476 -22807
7609 -102741 -368993 -32832 -77039 -103930 138430 -118304 -141555 -93471 -154758 83633 268507
7598 268507 -66566 1708 187672 141285 -13530 -173631 -103501 68261 -5307 14075 299496
7587 299496 180112 -284654 65822 -411179 -436662 -53056 11892 -156 -36132 199313 -76462
7575 -188074 -39463 -180575 252021 114647 172 -78504 127252 -207835 48757 -116626 -46997
7563 -118339 -364793 96075 17663 -108189 162231 -70217 -11377 -240190 127997 -73091 178510
7551 -118951 226657 377518 -27221 -58661 97860 -173677 63413 -103824 -339436 99745 -120201
7539 152461 150544 -52143 -172814 -108956 -44496 -163013 -211291 -11657 -131805 104843 73781
7528 73781 -33180 -51521 -197536 -38551 -136809 -177724 -398099 -85980 -175074 201292 -130950
7516 -184688 -141385 192239 62485 155578 -29076 -144815 -145390 -234794 130572 -210074 -217479
7505 -217479 -209377 -13588 12477 47623 -70363 45941 66469 103612 -50826 -74100 141374 -70079
7492 11040 -13102 -60731 -137846 52668 -239283 -69087 -87960 -153739 -380675 -42430 138445
7480 -96025 -245107 -39973 -75158 -220460 255936 347152 -148979 -154890 114493 -19025 -97207
7469 -97207 -111114 184210 286589 -162996 -299914 117693 31142 -59127 444262 -24209 83978
7457 -150547 -57907 -76848 68631 -64987 129332 -33641 -133164 180409 -467866 79303 -221392
7445 -17836 -22414 2151 11496 -151542 -114157 300041 -43794 -323624 131603 152311 -204152
7433 -19990 51128 -90740 250042 84868 -136716 69205 -68526 341446 285130 390785 -12453
7421 -177816 -109035 -27985 -381668 -153311 292102 264681 6943 -345786 -6889 -238825 363740
7409 122707 -15662 -443657 -260897 9714 196263 200852 -111041 -162075 221634 -168553 -153290
7398 -153290 217504 146687 -191355 16345 43733 -72698 -375127 -276055 -94801 53963 -87619
7386 -104437 -128057 -245746 -123159 -49006 33896 -11285 375937 117240 -84313 -25070 -170581
7375 -170581 48821 -135540 -353823 -16588 -384296 -120361 4706 360233 -13326 -131612 -219313
7364 -219313 104753 -176067 35392 197306 -158437 98566 -20848 -9552 58641 -242082 47761
7352 -289351 -310406 260162 107147 56260 -6209 231600 97179 373741 -118793 -95402 -74091
7341 -74091 -247741 232361 51300 -130619 -100156 29277 34910 -61577 102492 131677 -120344
7329 168057 -163238 -132404 -8726 35958 -217293 -267671 -164234 3623 159047 302897 101950
7317 222458 147304 -30678 357316 70246 -52135 -134171 31643 -274543 -382907 -69098 -17008
7305 -138022 -60854 -133237 -157406 -202790 -62693 40545 203278 -89743 19746 304425 -90639
7293 1751 -27447 -84412 -422043 -79811 -214355 -80080 -120444 171965 -267410 -227846 -43281
7281 -414529 -72071 207550 -361667 239781 -168543 -250183 30099 -89222 -144220 -186538 77969
7269 -24796 -118226 -323604 -174532 -105761 181374 -164520 -23129 98049 -231738 170609 102763
7258 102763 70116 16112 -27681 2798 172590 31272 -23770 -82887 -162793 11147 -7213 -201540
7246 -201540 -246392 64808 43283 261491 -381907 -137245 117340 -88529 72569 143516 176424
7235 176424 -96578 -14812 15460 14402 -25987 -12710 148979 -80563 -116630 -28355 20652 112338
7223 112338 171257 96081 24682 240394 -192186 -236054 -22710 -464454 -215911 -27052 612
7211 -64706 -1801 15204 -194147 -147393 125691 78404 166230 291442 143696 -259916 111262
7199 220343 -148506 202327 53205 40064 201032 -391501 53130 -206890 64018 -127490
7188 -103676 -14457 216248 -51024 221261 30217 155337 9300 349932 -99897 -356543 169694
7176 -171872 51728 -55467 198776 -66539 -197723 76042 45739 -166308 -419744 78209 346555
7165 346555 193336 97637 93833 124618 143399 71757 -10478 163057 102074 -41403 136633
7153 202151 16796 -3807 -11847 84226 40780 11179 185146 113682 -125763 -169335 98908 52240
7141 52240 99085 29898 -158289 -101325 65645 -2628 -146208 -133090 115485 28549 -143076
7129 10456 -303758 -6358 213831 -99748 -53958 155094 -39940 66668 207853 -88234 -57632
7118 -57632 -135797 -16115 -308862 106218 -250606 513469 336327 102212 -123401 122932
7107 -153219 -406051 122514 151044 -331962 61992 59651 -114015 80289 30617 112852 112742
7096 112742 221365 -200955 -139986 -129807 -192008 47482 -429174 89586 454058 -123207 79785
7084 57353 -183016 201108 -154400 -298119 59088 -223477 -145 273817 -2641 -94179 -225900
7073 -225900 -347929 -341951 -83229 124934 128793 -338551 -16317 110216 -50719 -118629 100190
7061 198676 32021 -70662 -137532 127655 -70409 -21491 9518 22607 172199 -148067 7333
7049 86761 -47463 55765 -348905 250825 92738 -386488 76644 -162328 103216 76627 154115
7038 154115 -432344 -88906 -255974 -104346 233100 -204657 -195569 -2041 -42619 -186456 93380
7026 258271 -45093 38645 153379 -367683 -355270 -53978 80930 85693 -48984 -118489 198684
7014 -15658 138989 -130745 -371025 -32144 148039 11736 201681 -83307 52826 17351 -66042
7002 -209268 97743 306291 -423818 -116380 34068 249140 -101666 -217875 85012 209371
6992 209371 -79526 65513 -98048 284448 12970 94084 -228180 -56539 -184836 -152801 -95583
6981 -95583 -206933 -461202 73192 -118349 232285 -255227 -32586 228862 -69494 -39802 -275546
6970 -275546 -145327 7467 -300175 -44757 288550 -215123 137907 348594 -97200 -178645 -219380
6959 -219380 99646 71321 243093 -46638 -173033 81517 -371030 222535 -75566 -84621 -114818
6948 -114818 24257 70198 95640 -35294 -235832 -180145 -322550 10742 140638 -292671 167614
6936 -185922 -109918 106012 98743 48517 -153561 34517 10703 -199735 -78966 9139 -181202
6924 404696 -60182 -406715 -95291 317066 75209 67874 39038 -546183 -144917 -158888 -281596
6913 -281596 293774 195073 9924 -41658 -66467 134239 -128724 129238 43422 35228 106847
6902 106847 -182218 196011 -324817 6938 -175027 -48492 -244185 53107 137385 -29591 170764
6890 -220558 34098 61569 -7519 -47232 -65868 -169821 -627 465153 -227491 50034 -70418 -200753
6878 -200753 -294365 -153308 47538 -21185 -191959 338030 -324749 36046 302669 -28277 -155006
6867 -155006 7301 -95121 -159852 -38017 260036 316805 323964 -33189 168634 133918 55600 180474
6855 180474 -13698 105283 -192719 -217528 -28611 -117086 131951 -490 67286 -91953 -123854
6844 -123854 -9228 -145819 -19151 -244029 20428 75239 7540 -80505 -176354 -35887 290715
6832 -343271 -63745 -36477 -29417 -66464 129834 -49466 15999 21819 -125147 57023 171687
6821 171687 -361447 385387 -134025 -139952 -40371 -423027 365445 -158430 -38182 -40299 -231801
6810 -231801 41906 335643 23335 150523 -13991 -174225 -301326 -116290 119072 110683 39927
6798 -97673 -53436 153717 -27132 -275446 -34543 -45609 28443 152997 -308282 -78913 -61108
6787 -61108 82524 -23362 1138 65429 55192 -169344 122801 -120115 154687 152095 -351847
6775 250504 386875 -13549 65594 -86775 -126830 -94718 -58714 -226084 468101 -172529 -259120
6764 -259120 -73912 126456 -17721 -97999 -22586 -177220 -137501 365542 -184442 208606 209015
6753 209015 82893 256638 52753 -47349 125757 160062 36421 75459 -447422 -53110 -271500
6742 -271500 116855 -147439 -214565 -93313 -205931 -179441 133199 -181586 28450 21159 224330
6731 224330 -193159 -234891 168860 -120303 30640 35479 -228698 -229233 236125 205982 26823
6719 -312637 93504 386347 -10972 105000 -357214 -110410 361914 -163667 122913 53967
6708 -310526 132637 -130339 3958 166957 39410 256382 -82976 526 15780 -129552 86744
6696 76639 -82001 78716 204258 -182742 -168933 -112743 -117518 -189601 -190362 -7380 -127858 -21978
6683 -7433 -98454 -119869 -35356 -95166 -1551 -13269 -28502 -74924 200832 179586 15865 -161847
6670 -147753 -89676 25993 272766 -39219 -164431 -11502 -180977 -185190 209749 -204363 -206210
6659 -206210 25273 332147 -251394 112256 120115 131469 -169521 144974 -241422 -143917 -45769
6647 -347906 -74735 -113107 -226044 68957 -157256 47247 -214791 22724 -200447 -52936 310069
6635 -122944 -80629 146715 151171 75095 -271596 -30747 -71298 -148160 -227065 2378 195341
6624 195341 -37516 -56617 -400904 55124 -34833 -318979 -288485 -124605 129564 261062 -488247
6612 9736 155097 505362 -169606 294181 -5060 -9261 -103052 28746 131805 -421518 141212
6600 4311 168176 167083 235389 -28877 -35173 -83929 -79889 -120768 5199 42160 -115797 -131821
6588 -131821 -126790 -89839 -225975 -10526 -158036 44738 -283475 136723 234470 -154414 -239039
6577 -239039 409355 160615 -80444 -6495 94924 -67201 -275087 143875 -107460 -136413 -234154
6566 -234154 -53290 -142993 -87792 -206259 -5868 -116669 128174 206237 -373240 -110127 -124118
6555 -124118 94146 -71885 -13863 -98389 -252029 198904 178966 65093 57330 114697 -42496
6543 118531 64333 305980 46301 283024 -46038 -87614 -236844 -241180 -178173 -66730 -147912
6532 -147912 156107 35563 240299 183757 -152884 131583 -184225 95525 9425 -89939 -255338
6521 -255338 -87657 69408 64714 36089 4603 -3221 -438129 -387715 -156317 96917 -84047 316353
6508 102490 -39775 178832 -50878 35181 269491 -182702 -77795 61248 -134687 190465 -18036
6496 14638 -57640 -17812 209219 -15305 24228 102384 39892 35655 -87332 -64739 -122766 -46457
6483 -65909 -95030 -139518 -276511 118680 -146986 104025 122518 41244 -11681 29867 -288644
6471 67287 60625 50712 52092 211179 -128786 93786 -102866 -173731 311329 -5619 112989 -52447
6458 19946 117019 -140812 14467 -322535 -72839 -44402 376269 -30743 110610 -79714 -139686
6447 -139686 15661 -5975 -3950 -123611 -61457 63524 -3178 47846 -16691 187785 -3691 -242516
6435 -242516 -120846 103629 -335512 -66219 -26766 50238 29327 -1233 -56705 -130413 65433
6423 -440953 189343 -128851 23280 181296 -60477 -173768 442728 222343 -32833 -13432
6412 -161736 -141876 -228271 -311694 -208897 -397648 432954 -315888 85934 202765 223569 -134917
6400 -56844 -171128 82127 61376 330642 236439 -4387 -59815 192998 -89347 -9637 36498 130675
6388 130675 -335628 212913 187170 -346185 -106326 83346 63341 -126723 -387105 93940
6377 -140211 -46077 -158385 -201453 99735 429748 184584 -217546 -10053 -94806 48989 73895
6366 73895 -60438 339170 193400 72683 -145772 15518 -151656 35688 51806 -226751 -122814
6355 -122814 -110413 304638 -271121 -160833 -105659 36248 80702 176767 -105080 -32919 19493
6343 -203813 6066 12521 -85006 -95466 -173667 229961 -108268 67082 -185027 55868 141872
6332 141872 -305803 -22059 -144462 -18870 -36360 -5998 58900 -191861 -107942 215351 -14962
6320 103060 -437781 13239 103664 272734 104756 -78729 98472 215009 108935 -184043
6309 -115356 296695 51166 65677 -95404 -52637 -66616 30559 -120494 285737 -258600 162924
6297 -76450 -47184 -49450 110 -5559 27955 -201047 215203 190417 -218883 75551 490966 47541
6284 -13131 60795 224599 -76603 170544 -27234 -316513 -236340 12836 127181 -167628 -20888
6272 194734 18050 -55729 -725 3115 -314814 130714 -83058 -139930 47656 3151 -22689 -223647
6260 -223647 40009 -45494 -33549 -430989 -203145 -174903 87093 31891 -219753 -100447 -80281
6249 -80281 146189 238449 -127861 -119270 -250017 29474 -154490 10710 -56037 -282823 39702
6237 -271825 -227512 234770 12777 220621 92815 -131028 57836 70842 317443 -43982 -46758
6226 -46758 -188279 -154644 -173532 -85899 -228890 -163011 232678 -218175 -251602 15522 -53410
6214 -146294 -231292 143289 -108095 31706 -6877 559028 -217599 242736 -211729 -91392 -11358
6202 -95823 146253 -143027 -55131 457133 290542 121112 164489 140254 -68054 -5917 -39663
6191 -39663 -261760 -154198 92190 158106 124985 -134091 -174692 82462 71741 -88462 -82206
6180 -82206 -72150 -155770 -81918 47291 -158228 90513 288763 -152177 -30327 -165830 222857
6168 -205535 -26722 -197490 -63823 -117085 -150484 -36821 144572 -9523 -123102 93971 -40802
6156 23355 -138452 54951 409659 -15749 250903 -115979 35859 96008 45799 -516289 121679
6144 -271850 388958 -175191 65134 209642 252994 -3204 -7223 209494 245470 201770 66148
6132 261684 84108 19685 70776 46718 165683 206182 72504 -15046 -157257 395392 27161
6120 244865 110346 -87549 28854 -136608 351556 22470 -235433 -39431 -15900 -190663 -301119
6109 -301119 -258118 -183668 82912 665756 166199 48661 101478 -185464 318656 121294 43223
6097 4033 -23822 -91396 180997 125195 183343 115763 -118109 57687 -303518 -92584 -19932
6085 -152727 -400522 -142929 -51770 -238374 225401 -97314 -149785 47758 -112592 48606 -5691
6073 83313 -216073 79816 -51147 -65385 -31059 -85213 -78707 225235 310027 -2812 -5937 25767
6060 -394679 325528 -67762 -227388 -119658 -79671 51996 -281130 130947 -180211 -170185
6050 -170185 -344630 -113343 -233789 293278 14703 -136453 150731 37846 -102941 -2991
6039 30025 98119 222952 -12042 -150773 -39002 246615 58384 -137174 192352 10833 73349
6028 73349 366565 -32252 53303 -172203 -367664 -252142 152405 -114396 -70971 -186719
6018 -186719 16576 49490 -97589 305796 4391 258669 215496 -196378 102312 145933 -162287
6006 -83256 126054 -241483 -211562 -84883 154453 -295555 -163722 -272967 255114 -175395
5995 151879 -50232 127948 6688 58067 12109 199635 23631 -3005 127840 107086 -54421
5983 -51527 -120340 -215824 -173208 -69678 -134560 31222 -100961 -157916 -13800 53485 -158360
5971 379045 22565 152653 -113954 57745 230569 -381033 -180674 -90670 -312890 -59165
5960 60867 162945 -146427 -219679 113716 -38516 139236 17621 150975 -75383 -90733 -75512
5949 -75512 -52952 55760 25885 -207672 -323724 -315158 -325258 -73869 9013 176700 210023 224873
5937 224873 -282469 98413 16225 -55831 -64594 90276 -58590 -81619 -16741 -46046 27329 -161932
5924 3398 -253609 21498 -208837 -167590 -54658 111959 -47965 53429 216416 -103759 203135
5912 -29847 52066 -54990 -56549 -248802 125027 -158833 -55083 41102 -120034 31351 138993
5901 138993 147581 224646 332904 -247316 256304 -213402 168244 -75765 -152089 126820 -313616
5889 214523 164280 76913 -18635 -380357 -264081 44705 -306468 104772 66395 -19033 -131900
5878 -131900 409540 -139917 -155236 -65380 159431 49370 -98605 -158180 -101114 406697 36023
5866 189776 76691 -88065 49956 -164362 -79267 -154495 77025 79989 -164785 8653 173968
5855 173968 131549 -30125 99094 175169 108502 -315923 -152404 -265658 312864 -22381 -65624
5844 -65624 147384 42383 -145984 423637 -102667 -233469 143425 -33149 -240188 -142814
5834 -142814 -111085 43525 -285892 -89215 -103007 113479 -37179 -53941 -210450 -22384 120574
5822 15931 -234471 -44368 -50328 -72540 148790 324682 -47609 114557 -411637 140254 245536
5811 245536 -152956 48710 33109 71181 -18628 123812 177845 -33769 273688 -292453 75004
5799 570090 -88586 216818 -101589 98018 -229594 113419 -30598 -207365 -183639 -44539 5882
5787 -30537 124155 -10681 -46477 -214112 255341 243555 86657 -35681 132190 -240781 100672
5775 -237209 -176725 79072 194100 -105779 98723 -146025 -2022 36578 180325 -226154 95778
5763 -361918 -354897 -165763 196546 190758 -46514 -274458 -184563 -420897 -259000 -108976 -29854
5751 148156 -255538 133350 249907 53414 -160482 -233073 -235053 -20536 -7165 -58978 -118572
5740 -118572 -341698 199295 -243398 -17244 257154 -52365 98135 -398350 39164 -304627
5729 59325 -89854 163793 -29237 73011 95134 -149628 -175888 -56932 -354802 299225 139170
5717 -97727 -110140 182634 -47116 -48709 130970 18469 87257 -108319 76825 100134 269265
5706 269265 -37707 -53346 -16248 307386 71799 2797 15839 280596 24764 -57632 -84516
5695 -84516 81891 42582 67667 319 -17502 170461 2927 -133537 -997 107481 92218 174726
5683 174726 -63067 96326 -280556 -123860 -178856 -55281 -64412 -91671 51230 -155227 -96741
5672 -96741 66311 237463 -215550 -257766 -83766 115023 152405 33305 130277 -143991 29931
5660 -120914 200121 58404 222272 -61977 -139187 -84882 51551 -107164 136898 -184856 134770
5648 132812 -769 -41822 -263610 -83790 58369 -36154 188435 6683 -164499 -31118 -69092 -54687
5636 -54687 221437 136546 94131 91865 -278127 -161947 -228274 -42914 -233558 -245119 -147815
5625 -147815 34700 91852 185410 -225832 -351629 -99508 186018 77643 21103 -282824 65071
5613 -226746 50358 91616 347657 -19958 6861 -94192 -175414 -219653 -224972 130127 -4782 -88847
5601 -88847 362085 -809 -121524 151969 -125090 -190319 227972 132842 81749 177264 -397266
5589 86656 -96162 -68746 -314707 129387 -248357 23735 65921 34962 -312774 10350 170190
5578 170190 20378 301675 105155 48844 -206038 -7816 -169376 -29382 -25533 82467 -3902
5566 -136065 118954 141777 -42863 271987 -125339 -11083 118776 42593 36411 -82920 -127856
5555 -127856 190944 -27723 399558 82056 113704 -129805 -212210 166117 -310127 -246455 -141360
5544 -141360 -267730 -69037 -40563 67891 73654 -290409 14629 -65020 296259 193730 38983
5532 -139873 -40603 160896 -51606 -298691 -165872 30470 280494 87487 31958 78048 -346706
5520 -157892 9885 339916 287187 18942 79219 215285 -311892 62572 171373 -1437 223434
5508 -16932 -177160 44662 -402274 -158463 254484 -313278 173873 -93532 -12001 256207
5497 -280288 21611 -22208 159167 -226058 -112779 228024 -64040 30715 -43501 187846 -66091
5485 50765 -348817 -59355 -74745 -178080 -160172 -294010 172401 21910 15153 -50453 -26594
5474 -26594 -69727 219306 94842 72562 -11101 294573 249880 293113 -99132 165430 -37067
5462 -141498 -85885 -22832 32428 75184 -70180 175592 54644 154695 -28569 -146834 148677
5450 -367373 -243566 -254829 -54396 57075 45818 -5345 219983 80466 159517 -188488 1528
5438 -168828 -105341 151539 -391609 164254 -131284 -204898 9144 159943 107256 5046 205858
5427 205858 90070 92797 -77581 380768 -15227 -79236 -103319 122076 -57157 -116441 87240
5415 -230709 1598 -58259 -230803 -146099 213033 153073 84871 144918 -30800 398109 -219442
5403 392378 -38245 -266018 -150617 393020 -134744 11296 -648 139239 57026 213491 170644
5392 170644 -410529 -160358 -130160 171263 6682 -104160 77283 113232 -196945 140968 -284835
5380 130202 99824 84243 75729 -99619 -272063 -99905 -54173 -96451 -27410 -204211 151626
5368 44160 167556 36190 90957 -203774 3213 243679 122280 -36520 -220439 133034 154001
5357 154001 22280 -73657 -122659 74612 142953 263360 97941 12813 -7650 -386120 -116719
5345 11457 136340 -44974 136181 114353 -61005 14539 58397 -73145 239884 20798 35576
5334 35576 -45854 -273123 111578 237772 -224559 -379884 359326 -229675 29628 -95540
5323 -51390 -134844 -31371 -64265 219712 -288909 -4765 -163749 1252 37701 216610 319757
5312 319757 60041 77554 304101 -114265 -109996 217742 170439 -68836 -155388 76016 152582
5301 152582 -297831 -294817 -22879 -111359 1854 138953 31592 769 -61364 -218892 39774 -173910
5288 -152554 -69845 -9069 -53235 185604 -62898 -63008 28384 106002 190249 -155024 155735 -21233
5275 -50698 -144070 -148526 161533 -170606 -273612 -266926 11837 24498 46778 -301202 -203896
5264 -203896 -71469 -321484 287539 82476 -39490 537 -24262 211995 -18883 -220110 58813
5252 173457 53037 -107721 -29973 62991 -85562 -133982 47020 50626 -184399 176743 77978
5240 -133238 221148 -234464 190851 4686 127410 -178431 29486 -180397 -175222 -171465 151857
5228 45665 289973 354123 -152980 -240861 55348 -243210 251414 268080 50026 -55228 -316786
5217 -316786 57083 73333 206041 -166199 -265743 131460 27171 -6906 -179824 58539 51620
5206 51620 -327782 123397 -20853 -131285 55408 -185908 60767 -352804 -345770 -245418 -42885
5194 73638 70008 57406 -41461 115508 -338672 -199979 408512 413763 -141558 -335860 -59265
5182 187492 -114283 -11206 -109824 23301 21881 208283 171591 -20789 266780 281994 220784
5171 220784 23616 -144091 65114 42570 -506087 -18127 -53485 -280820 -47245 126889 275023
5160 275023 89327 -79301 -169294 -98065 -74110 -63942 8805 197002 -88728 -60314 -169510
5149 -169510 43040 -125159 -145448 117137 229444 18471 120358 50272 172580 -46310 19156
5137 241978 43624 196174 -154751 -110578 -121887 180136 268781 -237030 58884 90131 2787
5125 257038 154877 -98648 -63888 -64448 92126 2623 170528 71200 332515 21871 291294
5114 291294 -1858 87809 -306875 65550 -135137 -137226 99181 126422 213012 -132063 21136
5102 172905 -45713 170390 -87494 -206589 -44441 -233100 25140 -175940 -221502 95857 32263
5090 14376 6056 -38169 -251196 -171791 -141811 -70024 145249 67201 125219 18642 -22549 -301342
5078 -301342 8688 -37673 100561 -217114 -125902 238670 -286350 -8699 -90358 21216 250555
5067 250555 -62841 -55140 137244 37990 23534 128133 228393 175369 12813 183498 -74784
5055 91894 -57806 -125889 174938 85574 -10118 -6451 -3324 10142 269700 112788 479016
5044 479016 -4389 -56140 -261167 65968 -24243 90651 255352 63288 -190557 31755 109641
5033 109641 56776 -66741 -394704 -7794 42464 219456 -85871 -373252 108773 -177706 -2968
5021 -89585 66864 -154343 -283209 452669 -170559 -1400 47594 -55195 -221907 78369 197075
5010 197075 -360531 -159505 -70227 129346 207793 110785 278927 -176962 -545491 116024
4999 99583 -84196 18104 276491 182092 126183 61991 186609 96670 196444 -200648 -182751
4988 -182751 104761 -185463 157434 298025 1023 226014 -78636 -36389 -356521 123562
4977 -189109 231592 -158033 189825 -100968 -30931 -61731 -52478 87242 -85208 172166 282121
4966 282121 -199789 -101353 -66064 56168 -336285 133448 146733 40273 -89221 -127528 -4540
4954 -38109 -211432 -171798 -89615 -12734 -8674 -113853 -116543 -52629 -110120 186681 119435 175026
4942 175026 11091 -191932 1883 -19235 -96676 -165078 -142901 128475 184523 129877 112694
4931 112694 26612 106092 26842 188080 -291521 345697 -85623 -84668 -65508 -260104 -42354
4919 -39850 116568 82289 -214171 156513 -47053 162695 63019 141799 -79706 -5825 -27475
4908 -27475 295782 341502 -106694 -82240 129657 4207 -206210 -126149 169517 -308911 -43065
4896 166546 86609 370089 -57775 200558 36529 -186695 153673 78962 -238461 -224833 94834
4884 -36982 -167228 -208899 -97364 -290109 -2518 -135908 -314036 287941 160550 -27701 75500
4872 30065 53892 -292160 -91739 10781 -204655 344318 98713 121270 -212139 182266 -57463
4860 224375 -60723 -265739 -331920 34813 40562 -2064 -72313 94502 -258657 -44140 -219836
4849 -219836 -190330 88210 70497 243213 351210 -212489 -168958 276473 -88439 145585 -71167
4837 -252331 -42151 131577 173757 205783 80287 331321 -975 250871 -114778 108865 56278
4826 56278 33928 134936 -179630 -39004 18086 -302159 -60378 42775 255177 -95255 196017
4814 -130305 314582 -37053 -160386 232246 -73877 47166 -535593 -49345 -54324 -19555 -66587
4803 -66587 -264681 83349 295975 229787 -400051 -75077 -111579 177207 324281 191303 66632
4791 59850 -47770 13941 31571 -85571 60204 52819 127888 -89520 201975 211764 -4952 25783
4778 296655 71136 -113817 55491 -154411 308658 -311256 -367990 -61742 -64924 154035 168720
4767 168720 -52137 189473 83300 10429 70036 -332907 172501 -140423 -117741 -53094 -45533
4756 -45533 47590 -338940 -44674 -219033 66090 -279926 -12589 -248321 27565 -49650 112538
4744 94776 79629 -236381 -199625 74470 324139 154083 -286233 -257489 -65397 138219 -207058
4732 63771 -18371 35484 53868 -456037 -165749 -168487 40342 -224107 251863 -141323 -138554
4721 -138554 -153898 98034 304167 44200 -224737 -357928 105476 132773 -38387 159280 -64564
4709 297976 -74458 101332 -219964 -158091 -104174 -113275 -193633 -108643 -191328 -173402 189279
4697 58731 182045 254955 -75003 110647 -94860 148708 5895 -84519 -75258 -37127 -226852
4686 -226852 -198595 254597 11438 -21078 149947 -34863 484217 -88480 -41762 -157557 -163944
4675 -163944 180611 333808 103252 -44677 135739 192843 108302 -95269 71549 -60881 264238
4663 91287 -262606 3457 59490 167665 333570 -38808 40230 209180 162894 195351 -210004
4651 -53163 -47196 -23252 -108776 -70473 248200 109510 51800 -158749 -198125 -270540 88416
4639 49443 -242866 -226818 -32680 78372 183078 29639 181115 -168252 -205729 175841 21840
4627 109674 207622 -66062 -113759 217583 -253516 451429 -260999 187576 298792 23328
4616 42957 122396 166554 -6188 8059 80446 494648 6321 84318 -90329 -12199 -19142 304961
4603 -295382 33451 43018 31268 -141387 -223450 219698 -3672 -270376 273195 -110977 29655
4591 102116 60287 52976 -116071 223019 -228519 -205666 69134 439593 84975 65799 -39228
4579 153067 -390064 -93084 -129662 -122478 -103469 -132847 -101760 9769 12399 -115731 68456 136626
4567 136626 267581 187045 46744 -53370 -16540 10503 156212 89590 -307260 -103435 68577
4555 -57943 115224 -239411 -92069 120900 9220 -72622 86060 184952 12503 -6709 174671
4543 146934 -55240 167220 319542 196900 -130794 168042 -241788 -107061 -83600 109323
$$ [...]
##END NTUPLES=NMR SPECTRUM
##END=
