
##TITLE=UV1277_M1_1242-1388_5_7534755_alWyTzJXhH
##JCAMPDX= 6.0         $$ Bruker NMR JCAMP-DX V2.0
##DATA TYPE= NMR SPECTRUM
##DATA CLASS= NTUPLES
##ORIGIN= BRUKER
##OWNER= Administrator
$$ 1.72 TOPSPIN		Version 2.1
$$ 2013-02-21 23:15:15.994 -0500  Administrator@X
$$ Compression mode = diff/dup
##.OBSERVE FREQUENCY= 400.02188249412
##.OBSERVE NUCLEUS= ^1H
##.ACQUISITION MODE= SIMULTANEOUS (DQD)
##.ACQUISITION SCHEME= undefined
##.AVERAGES= 64
##.DIGITISER RES= 22
##SPECTROMETER/DATA SYSTEM= spect
##.PULSE SEQUENCE= noesygpps1d.comp
##.SOLVENT NAME= COFFEE_meoh
##.SHIFT REFERENCE= INTERNAL, COFFEE_meoh, 1, 14.96113
##AUDIT TRAIL= $$ (NUMBER, WHEN, WHO, WHERE, PROCESS, VERSION, WHAT)
$$ ##TITLE= Audit trail, TOPSPIN		Version 2.1
$$ ##JCAMPDX= 5.01
$$ ##ORIGIN= Bruker BioSpin GmbH
$$ ##OWNER= Administrator
$$ $$ E:\/data/COFFEE/nmr/UV1277_M1_1242-1388_5_7534755_alWyTzJXhH/12/pdata/1/auditp.txt
$$ ##AUDIT TRAIL=  $$ (NUMBER, WHEN, WHO, WHERE, PROCESS, VERSION, WHAT)
(   1,<2013-02-21 23:15:09.916 -0500>,<Administrator>,<X>,<go>,<TOPSPIN 2.1>,
      <created by zg
	started at 2013-02-21 23:03:39.865 -0500,
	POWCHK enabled, PULCHK disabled,
       configuration hash MD5:
       86 BA 57 50 F2 9D 5C 9B 26 00 A9 28 5F 66 2E 89
       data hash MD5: 64K
       7C 00 D6 67 28 1D BC 30 4D A6 C6 C1 A1 90 E6 D8>)
(   2,<2013-02-21 23:15:13.150 -0500>,<Administrator>,<X>,<proc1d>,<TOPSPIN 2.1>,
      <Start of raw data processing
       efp LB = 0.3 FT_mod = 6 PKNL = 1 PHC0 = 0 PHC1 = 0 SI = 128K 
       data hash MD5: 128K
       A0 CD 84 F7 11 27 A0 90 98 24 92 2A FD 2D D3 95>)
(   3,<2013-02-21 23:15:14.291 -0500>,<Administrator>,<X>,<proc1d>,<TOPSPIN 2.1>,
      <pk PHC0 = 252.0044 PHC1 = 0 
       data hash MD5: 128K
       F4 3B 25 33 28 6C 7D 35 41 F3 39 44 6E D9 8A A7>)
(   4,<2013-02-21 23:15:14.931 -0500>,<Administrator>,<X>,<proc1d>,<TOPSPIN 2.1>,
      <abs ABSG = 1 
       data hash MD5: 128K
       90 3E 5F 20 A6 8D 82 93 87 19 1C D2 3F 57 78 02>)
(   5,<2013-02-21 23:15:15.119 -0500>,<Administrator>,<X>,<proc1d>,<TOPSPIN 2.1>,
      <abs ABSG = 2 
       data hash MD5: 128K
       D1 E6 75 A3 07 5A 74 60 56 5E E6 1B 76 6C 77 ED>)
(   6,<2013-02-21 23:15:15.322 -0500>,<Administrator>,<X>,<proc1d>,<TOPSPIN 2.1>,
      <abs ABSG = 3 
       data hash MD5: 128K
       CF E4 D4 41 19 DD 07 5C 18 2A 55 D0 5D 49 05 C1>)
(   7,<2013-02-21 23:15:15.478 -0500>,<Administrator>,<X>,<proc1d>,<TOPSPIN 2.1>,
      <abs ABSG = 4 
       data hash MD5: 128K
       2C F5 69 2C E1 6D E2 A6 B3 02 34 05 2A 2D CC 34>)
(   8,<2013-02-21 23:15:15.635 -0500>,<Administrator>,<X>,<proc1d>,<TOPSPIN 2.1>,
      <abs ABSG = 5 
       data hash MD5: 128K
       DE EB C1 34 7F 34 A8 9A 5D 5A 35 27 92 1E CF B9>)
$$ ##END=
$$ 
$$ $$ hash MD5
$$ $$ 08 E2 E7 B0 55 9D 6D 52 3A 51 B8 49 13 C7 FB 80
##$RELAX= 
##$RELAX= 
##$RELAX= 
##$RELAX= 
##$RELAX= 
##$RELAX= 
##$RELAX= 
##$RELAX= 
$$ Bruker specific parameters
$$ --------------------------
##$DU= <E:\>
##$EXPNO= 12
$$ [...]
150 150 150 150 150 150 150 150
##$TP07= 0
##$TPNAME0= <>
##$TPNAME1= <>
##$TPNAME2= <>
##$TPNAME3= <>
##$TPNAME4= <>
##$TPNAME5= <>
##$TPNAME6= <>
##$TPNAME7= <>
##$TPOAL= (0..7)
0.5 0.5 0.5 0.5 0.5 0.5 0.5 0.5
##$TPOFFS= (0..7)
0 0 0 0 0 0 0 0
##$TUNHIN= 0
##$TUNHOUT= 0
##$TUNXOUT= 0
##$USERA1= <user>
##$USERA2= <user>
##$USERA3= <user>
##$USERA4= <user>
##$USERA5= <user>
##$V9= 5
##$VALIST= <valist>
##$VCLIST= <CCCCCCCCCCCCCCC>
##$VD= 0
##$VDLIST= <DDDDDDDDDDDDDDD>
##$VPLIST= <PPPPPPPPPPPPPPP>
##$VTLIST= <TTTTTTTTTTTTTTT>
##$WBST= 1024
##$WBSW= 4
##$XGAIN= (0..3)
0 0 0 0
##$XL= 0
##$YL= 0
##$YMAX_a= 6094892
##$YMIN_a= -11214470
##$ZGOPTNS= <>
##$ZL1= 120
##$ZL2= 120
##$ZL3= 120
##$ZL4= 120
##$ABSF1= 14.96113
##$ABSF2= -5.597052
##$ABSG= 5
##$ABSL= 3
##$ALPHA= 0
##$AQORDER= 0
##$ASSFAC= 0
##$ASSFACI= 0
##$ASSFACX= 0
##$ASSWID= 0
##$AUNMP= <proc_prof1d_extract.lims>
##$AXLEFT= 0
##$AXNAME= <>
##$AXNUC= <1H>
##$AXRIGHT= 0
##$AXTYPE= 0
##$AXUNIT= <>
##$AZFE= 0.1
##$AZFW= 0.1
##$BCFW= 0
##$BC_mod= 0
##$BYTORDP= 0
##$COROFFS= 0
##$CY= 15
##$DATMOD= 1
##$DC= 0
##$DFILT= <>
##$DTYPP= 0
##$F1P= 0
##$F2P= 0
##$FCOR= 0.5
##$FTSIZE= 131072
##$FT_mod= 6
##$GAMMA= 0
##$GB= 0
##$INTBC= 1
##$INTSCL= 1
##$ISEN= 128
##$LB= 0.3
##$LEV0= 0
##$LPBIN= 0
##$MAXI= 10000
##$MC2= 0
##$MEAN= 0
##$ME_mod= 0
##$MI= 0
##$NCOEF= 0
##$NC_proc= -2
##$NLEV= 6
##$NOISF1= 0
##$NOISF2= 0
##$NSP= 0
##$NTH_PI= 0
##$NZP= 0
##$OFFSET= 14.96113
##$PC= 1
##$PHC0= 252.0044
##$PHC1= 0
##$PH_mod= 1
##$PKNL= yes
##$PPARMOD= 0
##$PPDIAG= 0
##$PPIPTYP= 0
##$PPMPNUM= 2147483647
##$PPRESOL= 1
##$PSCAL= 4
##$PSIGN= 0
##$PYNMP= <proc.py>
##$REVERSE= no
##$SF= 400.020009583305
##$SI= 131072
##$SIGF1= 0
##$SIGF2= 0
##$SINO= 400
##$SIOLD= 131072
##$SPECTYP= <>
##$SREGLST= <1H.CDCl3>
##$SSB= 0
##$STSI= 131072
##$STSR= 0
##$SW_p= 8223.68421052631
##$SYMM= 0
##$S_DEV= 0
##$TDeff= 65536
##$TDoff= 0
##$TI= <>
##$TILT= no
##$TM1= 0
##$TM2= 0
##$TOPLEV= 0
##$USERP1= <user>
##$USERP2= <user>
##$USERP3= <user>
##$USERP4= <user>
##$USERP5= <user>
##$WDW= 1
##$XDIM= 131072
##$YMAX_p= 380597755
##$YMIN_p= -11132
##$CURPLOT= <Network HP LaserJet P1505>
##$CURPRIN= <$Network HP LaserJet P1505>
##$DFORMAT= <normdp>
##$LAYOUT= <+/1D_H.xwp>
##$LFORMAT= <normlp>
##$PFORMAT= <normpl>
##$SURQMSG= 1
$$ End of Bruker specific parameters
$$ ---------------------------------
##NTUPLES= NMR SPECTRUM
##VAR_NAME=  FREQUENCY,     SPECTRUM/REAL,   SPECTRUM/IMAG
##SYMBOL=    X,             R,               I
##VAR_TYPE=  INDEPENDENT,   DEPENDENT,       DEPENDENT
##VAR_FORM=  AFFN,          ASDF,            ASDF
##VAR_DIM=   131072,        131072,          131072
##UNITS=     HZ,            ARBITRARY UNITS, ARBITRARY UNITS
##FACTOR=    0.0627417313425164, 1,          1
##FIRST=     8223.62146879497, -663,         -65631
##LAST=      0,             1590,            -66207
##MIN=       0,             -11132,          0
##MAX=       8223.62146879497, 380597755,    0
$$ Real data points
##PAGE= N=1
##DATA TABLE= (X++(R..R)), XYDATA
$$ [...]
$$ plain form
63842 1646245 1627350 1601400 1568887 1530515 1487027 1439227 1388131 1334846 1280147 1224323 1167701
63831 1167701 1111189 1055978 1002697 951195 901235 853136 807654 765526 727217 692752 661593
63820 661593 632951 606482 582507 561366 542789 526176 511334 498590 488152 479590 471958 464360
63808 464360 456387 448074 439444 430166 419857 408696 397475 386888 376999 367539 358470 350022 342345
63795 342345 335440 329366 324185 319676 315319 310729 305984 301427 297203 293111 288954 284925 281457 278671
63781 278671 276137 273372 270450 267882 265972 264530 263201 261796 260275 258711 257376 256608 256437 256489 256323
63766 256323 255770 254957 254213 253941 254225 254556 254274 253408 252644 252343 252032 251176 250012 249168 248728 248217 247397 246603
63748 246603 246238 246278 246420 246498 246629 247029 247747 248619 249573 250945 253242 256485 259999 263032 265353 267181 268872
$$ packed form
63842A646245j8895k5950l2513l8372m3488m7800n1096n3285n4699n5824n6622
63831A167701n6512n5211n3281n1502m9960m8099m5482m2128l8309l4465l1159
63820F61593k8642k6469k3975k1141j8577j6613j4842j2744j0438q562p632p598
63808D64360p973q313q630r278j0309j1161j1221j0587r889r460r069q448p677
63795C42345o905o074n181m509m357m590m745m557m224m092m157m029l468k786
63781B78671k534k765k922k568j910j442j329j405j521j564j335p68j71N2j66
63766B56323n53q13p44k72K84L31k82q66p64l01l11q56j164q44m40n11q20p94
63748B46603l65M0J42P8J31M00P18Q72R54J372K297L243L514L033K321J828J691
$$ plain form
63731 268872 270911 273819 277600 281440 284407 286423 288291 290854 294443 299032 304472 310485 316739 323014
63717 323014 329226 335347 341418 347402 352756 356459 357911 357647 356701 355338 352989 349420 345352 341716 338785
63702 338785 336295 333953 331524 328826 326070 323933 322915 322758 322814 322833 323065 323810 325256 327684 331265 335517
63686 335517 339376 342106 343938 345520 346938 347670 347516 347093 347172 347818 348559 349196 349932 350714 351067 350896 350989 352223
63668 352223 354568 357335 360273 363761 367930 372128 375493 377680 378781 378875 377945 376026 373185 369479 365140
63653 365140 360644 356395 352388 348275 343694 338494 332875 327494 323231 320592 319370 318971 319005 319438 320340
63638 320340 321726 323611 326033 329003 332468 336347 340579 345268 350718 357047 363659 369450 373876 377633
63624 377633 381909 387078 392535 397810 403350 409982 418036 427352 437879 449724 462673 476194 490163
$$ packed form
63731B68872K039K908L781L840K967K016J868K563L589M589N440O013O254O275
63717C23014O212O121O071N984N354L703J452k64r46j363k349l569m068l636k931
63702C38785k490k342k429k698k756k137j018j57N6J9K32P45J446K428L581M252
63686C35517L859K730J832J582J418P32j54m23P9O46P41O37P36P82L53j71R3J234
63668C52223K345K767K938L488M169M198L365K187J101R4r30j919k841l706m339
63653C65140m496m249m007m113m581n200n619n381m263k639j222l99L4M33R02
63638C20340J386J885K422K970L465L879M232M689N450O329O612N791M426L757
63624C77633M276N169N457N275N540O632Q054R316J0527J1845J2949J3521J3969
$$ plain form
63611 490163 505268 522332 541406 561827 583107 605396 629047 654067 680149 706827 733324
63600 733324 758484 781274 801181 817739 829879 836389 837219 833879 828316 821699 814485 807162 800362
63587 800362 794268 788280 781295 772190 760211 745207 727534 707678 686108 663641 641593 621165
63575 621165 602711 585922 570631 557086 545475 535712 527801 522030 518526 516901 516581 517290 518992
63562 518992 521533 524583 527915 531550 535671 540524 546341 553262 561367 570849 582105 595549 611344
63549 611344 629309 649078 670549 694386 722022 754736 792614 834525 878993 924448 968357
63538 968357 1006737 1035497 1052570 1058645 1056005 1047082 1034041 1019018 1004074 990677 979253 969293
63526 969293 959986 950778 941223 930348 916575 898641 876470 850899 822782 792734 761542 730231
$$ packed form
63611D90163J5105J7064J9074K0421K1280K2289K3651K5020K6082K6678K6497
63600G33324K5160K2790J9907J6558J2140O510Q30l340n563o617p214p323o800
63587H00362o094n988o985r105j1979j5004j7673j9856k1570k2467k2048k0428
63575F21165j8454j6789j5291j3545j1611r763p911n771l504j625l20P09J702
63562E18992K541L050L332L635M121M853N817O921Q105R482J1256J3444J5795
63549F11344J7965J9769K1471K3837K7636L2714L7878M1911M4468M5455M3909
63538I68357L8380K8760J7073O075k640q923j3041j5023j4944j3397j1424r960
63526I69293r307r208r555j0875j3773j7934k2171k5571k8117l0048l1192l1311
$$ plain form
63514 730231 699637 670254 642505 616693 592637 569854 548293 528510 510925 495371 481514
63503 481514 469278 458533 448833 439915 432134 425926 421009 416545 411981 407398 403149 399456 396318 393540
63489 393540 390946 388643 386841 385324 383523 381453 380095 380332 381886 383893 386202 389347 393466 398110
63475 398110 403148 408975 415573 422098 427751 432435 436176 438509 439004 438037 436542 435150 433844 432244 429882
63460 429882 426432 421991 417100 412327 408013 404472 402072 400834 400300 400091 400383 401523 403411 405611 407984
63445 407984 410939 415113 420871 428016 435932 444280 453593 464818 478240 493409 510358 530286 554582
63432 554582 583700 617368 655201 696123 737435 775368 806754 829864 844092 849855 848879 843724
63420 843724 836591 828981 822492 819175 820760 827935 840569 858115 879566 903599 929094 955103 980144
$$ packed form
63514G30231l0594k9383k7749k5812k4056k2783k1561j9783j7585j5554j3857
63503D81514j2236j0745r700q918p781o208m917m464m564m583m249l693l138k778
63489C93540k594k303j802j517j801k070j358K37J554K007K309L145M119M644
63475C98110N038N827O598O525N653M684L741K333M95r67j495j392j306j600k362
63460D29882l450m441m891m773m314l541k400j238n34k09K92J140J888K200K373
63445D07984K955M174N758P145P916Q348R313J1225J3422J5169J6949J9928K4296
63432E54582K9118L3668L7833M0922M1312L7933L1386K3110J4228N763r76n155
63420H43724p133p610o489l317J585P175J2634J7546K1451K4033K5495K6009K5041
$$ plain form
63407 980144 1002153 1019616 1032268 1040287 1043384 1041394 1035389 1027367 1018783 1009866 1000289 989875 978521
63394 978521 965878 951299 933883 912650 887148 857998 826522 793729 760087 726352 694074
63383 694074 664773 638781 615253 593319 573020 555201 540689 529527 520891 513753 507815 503728
63371 503728 502295 503568 506897 511755 518164 526263 535818 546427 558079 571219 586287 603378 622389
63358 622389 643302 666294 691692 719838 750814 784173 819025 854488 889988 924957 958301
63347 958301 988374 1013527 1032665 1045424 1052071 1053405 1050588 1044819 1037140 1028537 1020027 1012254 1004812
63334 1004812 996214 984807 969833 951515 930262 906090 878973 849548 819266 789789 762297
63323 762297 737271 714860 695433 679732 668413 661490 658460 658868 662083 666102 667084 661099 646762
$$ packed form
63407I80144K2009J7463J2652Q019L097j990o005q022q584q917r577j0414j1354
63394I78521j2643j4579j7416k1233k5502k9150l1476l2793l3642l3735l2278
63383F94074k9301k5992k3528k1934k0299j7819j4512j1162q636p138n938m087
63371E03728j433J273L329M858O409Q099R555J0609J1652J3140J5068J7091J9011
63358F22389K0913K2992K5398K8146L0976L3359L4852L5463L5500L4969L3344
63347I58301L0073K5153J9138J2759O647J334k817n769p679q603q510p773p442
63334A004812q598j1407j4974j8318k1253k4172k7117k9425l0282k9477k7492
63323G62297k5026k2411j9427j5701j1319o923l030M08L215M019R82n985j4337
$$ plain form
63310 646762 625896 601587 576049 550407 525622 502694 482044 463430 446696 432201 420316
63299 420316 410792 402887 395977 389819 384337 379463 375215 371721 368912 366298 363276 359756 356246 353285
63285 353285 350922 348858 346823 344613 342095 339526 337612 336767 336458 335889 335214 335360 336556 337888 338642 339273
63269 339273 340360 341288 340954 339495 338388 338773 340434 342541 344715 347020 349450 351903 354448 357329 360723
63254 360723 364537 368418 372022 375435 379223 383809 388940 394052 398993 403993 409067 414033 419229 425640
63240 425640 433992 444001 454766 465661 476737 488499 501531 516132 532129 549157 567110 586129
63228 586129 606160 626896 648221 670413 693678 717721 741901 765628 788543 810585 832045
63217 832045 853350 874691 896024 917423 939023 960511 981049 999897 1016777 1031421 1043153
$$ packed form
63310F46762k0866k4309k5538k5642k4785k2928k0650j8614j6734j4495j1885
63299D20316r524p905o910o158n482m874m248l494k809k614l022l520l510k961
63285C53285k363k064k035k210k518k569j914q45l09n69o75J46J196J332P54O31
63269C39273J087R28l34j459j107L85J661K107K174K305K430K453K545K881L394
63254C60723L814L881L604L413L788M586N131N112M941N000N074M966N196O411
63240D25640Q352J0009J0765J0895J1076J1762J3032J4601J5997J7028J7953J9019
63228E86129K0031K0736K1325K2192K3265K4043K4180K3727K2915K2042K1460
63217H32045K1305K1341K1333K1399K1600K1488K0538J8848J6880J4644J1732
$$ plain form
63206 1043153 1051208 1055078 1054217 1047819 1035442 1017684 995784 970684 942977 913617 884033 855395
63194 855395 828212 802850 780057 760664 745008 732961 724407 719436 718122 720410 726307 735963 749388
63181 749388 766142 785488 806879 830129 855063 881190 907908 934894 962075 989277 1016172
63170 1016172 1042564 1068360 1093201 1116430 1137626 1156890 1174294 1189144 1200132 1206182 1206960 1202466
63158 1202466 1192413 1176218 1153631 1125237 1092239 1055844 1016937 976265 934625 892810 851616
63147 851616 812068 775257 741593 710467 681171 654035 630142 609939 592707 577545 564240
63136 564240 552856 543037 534225 526332 519666 514328 510024 506441 503452 500996 499023 497639 497131 497730
63122 497730 499310 501300 503005 504253 505635 507816 510641 513299 515360 517162 519062 520955 522851 525310
$$ packed form
63206A043153Q055L870q61o398j2377j7758k1900k5100k7707k9360k9584k8638
63194H55395k7183k5362k2793j9393j5656j2047q554m971j314K288N897R656J3425
63181G49388J6754J9346K1391K3250K4934K6127K6718K6986K7181K7202K6895
63170A016172K6392K5796K4841K3229K1196J9264J7404J4850J0988O050P78m494
63158A202466j0053j6195k2587k8394l2998l6395l8907m0672m1640m1815m1194
63147H51616l9548l6811l3664l1126k9296k7136k3893k0203j7232j5162j3305
63136E64240j1384r819q812p893o666n338m304l583k989k456j973j384n08N99
63122D97730J580J990J705J248J382K181K825K658K061J802J900J893J896K459
$$ plain form
63108 525310 528666 532205 534810 536283 537391 538703 540016 541006 541840 542881 544103 545101 545486 545193 544564 544263
63092 544263 544960 546941 550014 553666 557286 560432 563111 565657 568142 570100 571093 571341 571393 571341 570906 570325
63076 570325 570611 572637 576269 580630 585001 589266 593675 598496 603927 610124 617253 625515 635136 646306
63062 646306 659055 673199 688517 705048 723111 742900 764239 787070 812035 840050 871178
63051 871178 904492 939310 976122 1015888 1058909 1104786 1153018 1203038 1254017 1305473 1357954
63040 1357954 1412330 1468371 1524699 1580250 1635140 1689891 1744519 1798695 1852247 1904944 1956087
63029 1956087 2004768 2050341 2092241 2129453 2160442 2183590 2197500 2200968 2192961 2172871 2140929 2098359
63017 2098359 2046932 1988267 1923757 1855318 1785753 1717792 1652843 1591281 1533949 1482759 1439614
$$ packed form
63108E25310L356L539K605J473J108J312J313R90Q34J041J222R98L85k93o29l01
63092E44263O97J981L073L652L620L146K679K546K485J958R93K48N2n2m35n81
63076E70325K86K026L632M361M371M265M409M821N431O197P129Q262R621J1170
63062F46306J2749J4144J5318J6531J8063J9789K1339K2831K4965K8015L1128
63051H71178L3314L4818L6812L9766M3021M5877M8232N0020N0979N1456N2481
63040A357954N4376N6041N6328N5551N4890N4751N4628N4176N3552N2697N1143
63029A956087M8681M5573M1900L7212L0989K3148J3910L468q007k0090l1942m2570
63017B098359n1427n8665o4510o8439o9565o7961o4949o1562n7332n1190m3145
$$ plain form
63006 1439614 1405256 1379459 1361869 1352251 1350230 1355248 1366783 1384413 1407803 1436726 1470883 1509537
62994 1509537 1551503 1595604 1641025 1687218 1733800 1780630 1827667 1874601 1920891 1966262 2010721
62983 2010721 2053808 2094120 2129789 2159174 2180898 2193693 2196656 2189480 2172104 2144279 2105750 2056725
62971 2056725 1997975 1930755 1856919 1778834 1698710 1617986 1537576 1458551 1382295 1310069 1242678
62960 1242678 1180478 1123476 1071447 1024117 981217 942344 907006 874858 845601 818522 792578
62949 792578 767276 743163 721065 701029 682313 664115 645989 627869 610205 593881 579448
62938 579448 566538 554422 542971 532624 523611 515771 509004 503221 497886 492314 486577 481480 477406
62925 477406 473761 469862 465855 462319 459390 456767 454367 452500 451382 450747 450037 448907 447606 446833 447042
$$ packed form
63006A439614l4358k5797j7590r618k021N018J1535J7630K3390K8923L4157L8654
62994A509537M1966M4101M5421M6193M6582M6830M7037M6934M6290M5371M4459
62983B010721M3087M0312L5669K9385K1724J2795K963p176j7376k7825l8529m9025
62971B056725n8750o7220p3836p8085q0124q0724q0410p9025p6256p2226o7391
62960A242678o2200n7002n2029m7330m2900l8873l5338l2148k9257k7079k5944
62949G92578k5302k4113k2098k0036j8716j8198j8126j8120j7664j6324j4433
62938E79448j2910j2116j1451j0347r013p840o767n783n335n572n737n097m074
62925D77406l645l899m007l536k929k623k400j867j118o35p10j130j301p73K09
$$ plain form
62910 447042 447945 448870 449533 450075 450438 450320 449941 450193 451545 453145 453588 452427 450520 448984 448201 447749 446964
62893 446964 445548 443890 442764 442487 442535 442278 441874 442025 442933 443974 444450 444263 443781 443480 443849 445202 447207
62876 447207 448868 449285 448386 446795 445221 444117 443650 443599 443356 442296 440156 436974 432922 428429 424212 420697
62860 420697 417522 414057 410469 407780 406759 407195 408414 410013 411728 413078 413757 414164 414961 416161 417133
62845 417133 417491 417461 417273 416817 416186 416052 417029 418876 420702 421848 422286 422330 422311 422465 422775 422905 422508 421693 421056
62826 421056 421295 422885 425914 429998 434449 438828 443239 447755 451769 454457 455904 457169 459016 461119
62812 461119 462925 464770 467491 471195 475128 478795 482508 486645 491021 495436 500406 506785 514809 523948
62798 523948 533593 543408 553120 562633 572557 584008 597409 611828 626035 640049 655206 672850
$$ packed form
62910D47042R03R25O63N42L63j18l79K52J352J600M43j161j907j536p83m52p85
62893D46964j416j658j126k77M8k57m04J51R08J041M76j87m82l01L69J353K005
62876D47207J661M17q99j591j574j104m67n1k43j060k140l182m052m493m217l515
62860D20697l175l465l588k689j021M36J219J599J715J350O79M07P97J200R72
62845D17133L58l0j88m56o31j34R77J847J826J146M38M4j9J54L10J30l97q15o37
62826D21056K39J590L029M084M451M379M411M516M014K688J447J265J847K103
62812D61119J806J845K721L704L933L667L713M137M376M415M970O379Q024R139
62798E23948R645R815R712R513R924J1451J3401J4419J4207J4014J5157J7644
$$ plain form
62786 672850 693496 717195 744081 774363 808347 846778 890698 940467 995268 1054092 1117009
62775 1117009 1184887 1257989 1335410 1415976 1499102 1584443 1671002 1756847 1839480 1916271 1984804
62764 1984804 2043195 2090142 2124601 2145520 2152029 2143772 2120941 2084174 2034629 1974041 1904421 1827663
62752 1827663 1745572 1660222 1573968 1488939 1406540 1327461 1252049 1180593 1113425 1050952 993618
62741 993618 941692 894986 852821 814341 778974 746699 718017 693595 673676 657541 643629
62730 643629 630507 617843 606349 596730 588943 582513 577186 572962 569739 567414 566289 566934 569521 573554
62716 573554 578469 584265 591397 600216 610686 622585 635878 650935 668380 688667 711811 737657
62704 737657 766356 798356 834054 873753 917928 967093 1021242 1079811 1142387 1209161 1280484
$$ packed form
62786F72850K0646K3699K6886L0282L3984L8431M3920M9769N4801N8824O2917
62775A117009O7878P3102P7421Q0566Q3126Q5341Q6559Q5845Q2633P6791O8533
62764A984804N8391M6947L4459K0919O509q257k2831l6767m9545o0588o9620p6758
62752A827663q2091q5350q6254q5029q2399p9079p5412p1456o7168o2473n7334
62741I93618n1926m6706m2165l8480l5367l2275k8682k4422j9919j6135j3912
62730F43629j3122j2664j1494r619p787o430n327m224l223k325j125O45K587M033
62716E73554M915N796P132Q819J0470J1899J3293J5057J7445K0287K3144K5846
62704G37657K8699L2000L5698L9699M4175M9165N4149N8569O2576O6774P1323
$$ plain form
62693 1280484 1356354 1436620 1521256 1609853 1701015 1792598 1882358 1967976 2046727 2115776 2172858
62682 2172858 2216317 2244677 2256809 2252540 2232433 2196928 2146398 2082258 2007272 1924336 1835519
62671 1835519 1742667 1648148 1554208 1462088 1372653 1287550 1208689 1136578 1070144 1008461 951819
62660 951819 900737 854789 813073 775347 741947 712888 687650 665660 646342 628783 612009
62649 612009 595818 580813 567445 555384 544058 533389 523689 515057 507261 500132 493812 488575 484558
62636 484558 481668 479648 478203 477098 476135 475120 474019 473083 472561 472235 471521 470127 468242 465889 462586
62621 462586 458176 453679 450581 449239 448670 448067 447801 448516 449913 451158 452171 453715 456266 459549 463341
62606 463341 467996 473846 480641 488098 496593 506730 518379 530798 543763 558064 574680 593846
$$ packed form
62693A280484P5870Q0266Q4636Q8597R1162R1583Q9760Q5618P8751O9049N7082
62682B172858M3459K8360J2132m269k0107l5505n0530o4140p4986q2936q8817
62671A835519r2852r4519r3940r2120q9435q5103p8861p2111o6434o1683n6642
62660I51819n1082m5948m1716l7726l3400k9059k5238k1990j9318j7559j6774
62649F12009j6191j5005j3368j2061j1326j0669r700q632p796p129o320n237m017
62636D84558k890k020j445j105r63j015j101r36n22l26p14j394j885k353l303
62621D62586m410m497l098j342n69o03k66P15J397J245J013J544K551L283L792
62606D63341M655N850O795P457Q495J0137J1649J2419J2965J4301J6616J9166
$$ plain form
62594 593846 615262 638953 665564 695819 729860 767097 806526 847219 888624 930368 971692
62583 971692 1011241 1047611 1080013 1108057 1130852 1146702 1154007 1152319 1142285 1124779 1100516 1070462
62571 1070462 1036059 998753 959546 919248 878895 839550 801808 765848 731863 700100 670496
62560 670496 642804 617224 594493 575046 558397 543703 530778 520119 511941 505510 499555 493171
62548 493171 486302 479548 473606 468832 465199 462621 461111 460538 460409 460204 459917 460045 461017 462792 465002 467297
62532 467297 469542 471887 474652 477960 481496 484927 488589 493385 499880 507869 517118 528135 541705 557864
62518 557864 575922 595592 617600 642861 671419 702620 736216 772894 813526 858164 905947
62507 905947 955856 1007268 1059755 1112542 1164369 1213728 1259123 1299183 1332745 1358893 1376876
$$ packed form
62594E93846K1416K3691K6611L0255L4041L7237L9429M0693M1405M1744M1324
62583I71692L9549L6370L2402K8044K2795J5850P305j688j0034j7506k4263l0054
62571A070462l4403l7306l9207m0298m0353l9345l7742l5960l3985l1763k9604
62560F70496k7692k5580k2731j9447j6649j4694j2925j0659q178o431n955o384
62548D93171o869o754n942m774l633k578j510n73j29k05k87J28R72J775K210K295
62532D67297K245K345K765L308L536L431L662M796O495P989R249J1017J3570J6159
62518E57864J8058J9670K2008K5261K8558L1201L3596L6678M0632M4638M7783
62507I05947M9909N1412N2487N2787N1827M9359M5395M0060L3562K6148J7983
$$ plain form
62496 1376876 1386137 1386637 1379089 1364677 1344583 1320083 1293018 1265643 1239778 1216441 1196468 1181059
62484 1181059 1171197 1166708 1166420 1169307 1175196 1184359 1196724 1211535 1227382 1242364 1254448 1262035 1264396
62471 1264396 1261611 1254001 1241344 1222488 1195978 1161403 1120150 1074624 1026788 977615 927695 877824
62459 877824 828890 781658 736950 695716 658593 625494 595941 569741 547155 528390 513070
62448 513070 500307 489296 479862 472347 466872 462808 459176 455550 452388 450429 449946 450629 451945 453465
62434 453465 454931 456174 456995 457171 456645 455649 454460 453072 451279 448984 446197 442841 438951 434999 431553
62419 431553 428585 425607 422586 420059 418033 415471 411573 407073 403472 401152 399127 396664 394295 392858
62405 392858 392227 391493 390114 388379 386918 386140 386127 386743 387749 388939 390237 391745 393789 396854 401200 406493
$$ packed form
62496A376876R261N00p548j4412k0094k4500k7065k7375k5865k3337j9973j5409
62484A181059r862m489k88K887N889R163J2365J4811J5847J4982J2084P587K361
62471A264396k785p610j2657j8856k6510l4575m1253m5526m7836m9173m9920m9871
62459H77824m8934m7232m4708m1234l7123l3099k9553k6200k2586j8765j5320
62448E13070j2763j1011r434p515n475m064l632l626l162j959m83O83J316J520
62434D53465J466J243Q21J76n26r96j189j388j793k295k787l356l890l952l446
62419D31553k968k978l021k527k026k562l898m500l601k320k025k463k369j437
62405C92858o31p34j379j735j461p78j3O16J006J190J298J508K044L065M346N293
$$ plain form
62389 406493 412004 417249 422145 426473 429664 431564 433180 436059 440866 446920 453224 459525 466102 472930
62375 472930 479594 485993 492658 500124 508222 516262 523783 530924 538155 545942 554757 565158 577586 592124
62361 592124 608590 626887 647220 670066 696006 725564 759025 796360 837332 881623 928774
62350 928774 978016 1028323 1078620 1127812 1174520 1217002 1253624 1283484 1306456 1322567 1331515 1332926
62338 1332926 1326952 1314379 1296113 1272808 1245075 1213760 1179767 1143723 1106095 1067525 1028689
62327 1028689 989893 951291 913647 878430 846715 818144 791330 765222 739808 715613 692909
62316 692909 671482 650927 631024 611993 594417 578717 564682 551677 539363 528018 518077 509618
62304 509618 502460 496551 491961 488509 485716 483208 481056 479549 478648 477841 476665 475415 475131 476688 479838
$$ packed form
62389D06493N511N245M896M328L191J900J616K879M807O054O304O301O577O828
62375D72930O664O399O665P466Q098Q040P521P141P231P787Q815J0401J2428J4538
62361E92124J6466J8297K0333K2846K5940K9558L3461L7335M0972M4291M7151
62350I28774M9242N0307N0297M9192M6708M2482L6622K9860K2972J6111Q948J411
62338A332926n974j2573j8266k3305k7733l1315l3993l6044l7628l8570l8836
62327A028689l8796l8602l7644l5217l1715k8571k6814k6108k5414k4195k2704
62316F92909k1427k0555j9903j9031j7576j5700j4035j3005j2314j1345r941q459
62304E09618p158n909m590l452k793k508k152j507r01q07j176j250k84J557L150
$$ plain form
62289 479838 483255 485601 486513 486591 486586 486755 486916 486974 487271 488433 490827 494099 497225 499184 499769 499813 500476 502182
62271 502182 504305 506066 507635 510106 514335 520167 527036 535081 545266 558493 574962 594381 616432
62258 616432 640941 668021 698266 732469 770829 812745 857674 905873 957696 1012277 1067490
62247 1067490 1121253 1172226 1218990 1259306 1290953 1313132 1326460 1331649 1328800 1317976 1299734 1274696
62235 1274696 1243113 1205412 1162927 1117526 1070519 1022299 973123 923882 875986 830776 789107
62224 789107 751256 717044 686192 658700 634765 614298 596713 581305 567724 555919 545766
62213 545766 536891 528831 521256 514113 507588 501856 496791 492041 487502 483566 480755 479144 478308 477780 477495
62198 477495 477773 478967 481124 483976 487317 491357 496540 502960 510154 517611 525282 533392 541875 550342
$$ packed form
62289D79838L417K346R12P8nJ69J61N8K97J162K394L272L126J959N85M4O63J706
62271E02182K123J761J569K471M229N832O869Q045J0185J3227J6469J9419K2051
62258F16432K4509K7080L0245L4203L8360M1916M4929M8199N1823N4581N5213
62247A067490N3763N0973M6764M0316L1647K2179J3328N189k849j0824j8242k5038
62235A274696l1583l7701m2485m5401m7007m8220m9176m9241m7896m5210m1669
62224G89107l7851l4212l0852k7492k3935k0467j7585j5408j3581j1805j0153
62213E45766q875q060p575p143o525n732n065m750m539l936k811j611q36n28k85
62198D77495K78J194K157K852L341M040N183O420P194P457P671Q110Q483Q467
$$ plain form
62184 550342 558620 567104 576398 586652 597309 607491 616625 624714 631997 638484 644031 648788 653194
62171 653194 657350 660878 663844 667649 674424 685467 700666 719481 741997 768722 799660 833996
62159 833996 870517 908077 945765 982872 1018601 1051548 1079680 1101323 1116287 1125672 1130442 1130471
62147 1130471 1125159 1114522 1099245 1079847 1056400 1029095 998726 966434 933357 900680 869644
62136 869644 841143 815510 792958 774053 759372 748838 741796 737766 736797 739029 744207 751754 761183
62123 761183 772448 786059 802791 823033 846310 871473 897216 922379 946224 968863 991078
62112 991078 1013100 1033683 1050966 1064065 1073047 1077552 1076646 1070397 1060606 1049307 1037352 1025048 1013298
62099 1013298 1003063 994180 985752 977467 969723 962771 956680 952090 950086 951151 954896 960730 968146 976417
$$ packed form
62184E50342Q278Q484R294J0254J0657J0182R134Q089P283O487N547M757M406
62171F53194M156L528K966L805O775J1043J5199J8815K2516K6725L0938L4336
62159H33996L6521L7560L7688L7107L5729L2947K8132K1643J4964R385M770K9
62147A130471n312j0637j5277j9398k3447k7305l0369l2292l3077l2677l1036
62136H69644k8501k5633k2552j8905j4681j0534p042m030r69K232N178P547R429
62123G61183J1265J3611J6732K0242K3277K5163K5743K5163K3845K2639K2215
62112I91078K2022K0583J7283J3099Q982M505r06o249r791j1299j1955j2304j1750
62099A013298j0235q883q428q285p744o952o091m590k004J065L745N834P416Q271
$$ plain form
62085 976417 984905 993791 1003753 1014824 1026390 1038467 1052068 1067843 1085223 1103461 1122839 1144113
62073 1144113 1167203 1191138 1215095 1238920 1262723 1286401 1309415 1330693 1348966 1363700 1375696
62062 1375696 1386464 1397054 1407765 1418801 1430659 1443655 1457381 1470951 1483762 1495794 1507067
62051 1507067 1517009 1524684 1529594 1531868 1531409 1527352 1518763 1505524 1487879 1465348 1436929 1402434 1362930
62038 1362930 1319631 1273084 1223752 1172747 1121523 1071245 1022828 977095 934428 894637 857642
62027 857642 823952 794098 767957 745020 724931 707262 691174 675978 661826 649183 637718
62016 637718 626371 614615 603053 592612 583552 575459 567868 560678 554135 548627 544466 541827 540913
62003 540913 542065 545560 551272 558564 566489 574163 581185 587705 593890 599358 603437 605934 607188 607290
$$ packed form
62085I76417Q488Q886R962J1071J1566J2077J3601J5775J7380J8238J9378K1274
62073A144113K3090K3935K3957K3825K3803K3678K3014K1278J8273J4734J1996
62062A375696J0768J0590J0711J1036J1858J2996J3726J3570J2811J2032J1273
62051A507067R942P675M910K274m59m057q589j3239j7645k2531k8419l4495l9504
62038A362930m3299m6547m9332n1005n1224n0278m8417m5733m2667l9791l6995
62027H57642l3690k9854k6141k2937k0089j7669j6088j5196j4152j2643j1465
62016F37718j1347j1756j1562j0441r060q093p591p190o543n508m161k639r14
62003E40913J152L495N712P292P925P674P022O520O185N468M079K497J254J02
$$ plain form
61989 607290 605829 602588 597838 591630 583512 573586 563203 553661 544534 534243 522228 509744 498440
61976 498440 489017 481425 475501 470852 466619 462012 457007 452224 448170 444764 441568 438325 435254 432699
61962 432699 430548 428339 426192 425202 426323 429000 431572 433047 433923 435206 437219 439687 442433 445573 449334
61947 449334 454026 460059 467704 476950 487756 500283 514740 531134 549283 568932 589783 611660
61935 611660 634743 659362 685337 711682 737180 761205 783898 805720 826947 847372 866199
61924 866199 882251 894598 903175 908742 912081 913178 911278 905820 897239 886751 875548 864507 854530
61911 854530 846554 841034 837985 837815 841559 849695 861184 874412 888787 904577 921298 937268 950893
61898 950893 961548 968875 972033 970319 963985 953836 940373 923869 905047 885009 864512 843663
$$ packed form
61989F07290j461l241m750o208q118r926j0383r542r127j0291j2015j2484j1304
61976D98440r423p592n924m649m233m607n005m783m054l406l196l243l071k555
61962D32699k151k209k147r90J121K677K572J475Q76J283K013K468K746L140L761
61947D49334M692O033P645R246J0806J2527J4457J6394J8149J9649K0851K1877
61935F11660K3083K4619K5975K6345K5498K4025K2693K1822K1227K0425J8827
61924H66199J6052J2347Q577N567L339J097j900n458q581j0488j1203j1041r977
61911H54530p976n520l049j70L744Q136J1489J3228J4375J5790J6721J5970J3625
61898I50893J0655P327L158j714o334j0149j3463j6504j8822k0038k0497k0849
$$ plain form
61886 843663 822366 800761 779312 758702 739619 722408 706915 692747 679578 667059 654657
61875 654657 641911 628846 615869 603274 591083 579501 569325 561588 556604 553481 550926 548651
61863 548651 547774 549597 554270 560978 569179 579083 591015 604968 621012 639578 660971 685023 711546
61850 711546 740800 773111 808244 845526 884404 924523 965377 1006216 1046304 1084978 1121435
61839 1121435 1154576 1183065 1205610 1221473 1230811 1234262 1232136 1224448 1212030 1197171 1182549 1169643
61827 1169643 1158642 1149759 1144007 1142527 1145613 1152698 1162960 1175501 1189015 1201696 1211759 1218011
61815 1218011 1219836 1216675 1207812 1192775 1171748 1145344 1114127 1078673 1040013 999623 958922 919044
61803 919044 881007 845587 812875 782474 754405 729386 707969 689818 674214 660812 649378
$$ packed form
61886H43663k1297k1605k1449k0610j9083j7211j5493j4168j3169j2519j2402
61875F54657j2746j3065j2977j2595j2191j1582j0176p737m984l123k555k275
61863E48651q77J823M673O708Q201R904J1932J3953J6044J8566K1393K4052K6523
61850G11546K9254L2311L5133L7282L8878M0119M0854M0839M0088L8674L6457
61839A121435L3141K8489K2545J5863R338L451k126p688j2418j4859j4622j2906
61827A169643j1001q883n752j480L086P085J0262J2541J3514J2681J0063O252
61815A218011J825l161q863j5037k1027k6404l1217l5454l8660m0390m0701l9878
61803I19044l8037l5420l2712l0401k8069k5019k1417j8151j5604j3402j1434
$$ plain form
61792 649378 639242 629709 620921 613583 607795 602678 597286 591427 585514 580104 575736 572719 570776 569131
61778 569131 567198 564999 562743 560305 557366 553921 550323 546910 543831 541253 539575 539220 540117 541401 541887
61763 541887 541089 539787 539385 540747 543786 547977 552783 557571 561639 564761 567439 570261 573135 575501 577175
61748 577175 578540 579812 580535 580119 578641 576755 574895 572952 570806 568768 567206 566015 564845 563764 563236
61733 563236 563337 563440 563007 562432 562688 564192 566370 568471 570511 573204 577074 581885 587029 592256 597750
61718 597750 603511 609042 613906 618393 623200 628483 633599 637840 641022 643263 644615 645167 645141 644522 642952
61703 642952 640356 637361 634629 632022 628976 625550 622445 619966 617613 614852 611721 608440 604974 601356
61689 601356 597999 595195 592591 589583 586043 582260 578388 574426 570590 567167 563958 560388 556319 552341
$$ packed form
61792F49378j0136r533q788p338n788n117n392n859n913n410m368l017j943j645
61778E69131j933k199k256k438k939l445l598l413l079k578j678l55Q97J284M86
61763E41887p98j302m02J362L039M191M806M788M068L122K678K822K874K366J674
61748E77175J365J272P23m16j478j886j860j943k146k038j562j191j170j081n28
61733E63236J01J03m33n75K56J504K178K101K040K693L870M811N144N227N494
61718E97750N761N531M864M487M807N283N116M241L182K241J352N52k6o19j570
61703F42952k596k995k732k607l046l426l105k479k353k761l131l281l466l618
61689F01356l357k804k604l008l540l783l872l962l836l423l209l570m069l978
$$ plain form
61675 552341 549040 546342 543867 541588 539741 538257 536683 534691 532436 530429 529218 529029 529397 529265 527946
61660 527946 526007 524769 524761 525200 525241 525196 525945 527527 529082 530067 530826 531837 533072 534394 536038 538333 541292
61643 541292 544795 548814 553067 556789 559350 560941 562278 563725 565094 566094 566502 565972 564207 561450 558374
61628 558374 555340 552095 548388 544512 540974 537882 535001 532297 530131 528829 528301 528183 528291 528795 529903
61613 529903 531438 532856 533661 533620 532499 529869 525492 519810 513690 507540 500964 493465 485338 477574 470927
61598 470927 465279 459984 454656 449403 444446 439791 435416 431440 427842 424180 420037 415683 411862 408816
61584 408816 405926 402530 398663 394718 390812 386945 383401 380426 377708 374816 372038 370123 369086 367924
61570 367924 365784 362904 360124 357961 356511 355811 355727 355687 355115 354178 353713 354262 355364 355931 355315 353992 353223
$$ packed form
61675E52341l301k698k475k279j847j484j574j992k255k007j211j89L68j32j319
61660E27946j939j238qM39M1m5P49J582J555R85P59J011J235J322J644K295K959
61643E41292L503M019M253L722K561J591J337J447J369J000M08n30j765k757l076
61628E58374l034l245l707l876l538l092k881k704k166j302n28j18J08N04J108
61613E29903J535J418Q05m1j121k630m377n682o120o150o576p499q127p764o647
61598D70927n648n295n328n253m957m655m375l976l598l662m143m354l821l046
61584D08816k890l396l867l945l906l867l544k975k718k892k778j915j037j162
61570C67924k140k880k780k163j450p00q4m0n72r37m65N49J102N67o16j323p69
$$ plain form
61553 353223 353928 355832 357778 358850 359044 358860 358674 358689 359198 360402 362044 363617 364942 366269 367739 369064
61537 369064 369926 370490 371357 373047 375658 378889 382290 385467 388216 390459 392064 392713 392063 390089 387217
61522 387217 384011 380724 377255 373554 369911 366715 364100 362013 360530 359741 359298 358456 356814 354796 353143
61507 353143 352078 351277 350473 349682 348811 347501 345589 343449 341637 340415 339832 340063 341213 342812 343977 344236
61491 344236 343914 343520 343014 342032 340633 339429 338910 338955 339131 339235 339380 339690 340108 340447 340560 340528 340734 341558 342947
61472 342947 344392 345471 346270 347142 348251 349508 350767 351818 352331 352138 351492 350753 349896 348755 347662 347331
61456 347331 347915 348645 348750 348419 348461 349241 350354 351224 351624 351640 351546 351801 352815 354530 356439 358119 359553 360848
61438 360848 361972 363038 364604 367317 371224 375695 380038 383973 387546 390833 393846 396505 398584 399866
$$ packed form
61553C53223P05J904J946J072J94j84j86J5N09J204J642J573J325J327J470J325
61537C69064Q62N64Q67J690K611L231L401L177K749K243J605O49o50j974k872
61522C87217l206l287l469l701l643l196k615k087j483p89m43q42j642k018j653
61507C53143j065q01q04p91q71j310j912k140j812j222n83K31J150J599J165K59
61491C44236l22l94n06r82j399j204n19M5J76J04J45L10M18L39J13l2K06Q24J389
61472C42947J445J079P99Q72J109J257J259J051N13j93o46p39q57j141j093l31
61456C47331N84P30J05l31M2P80J113Q70M00J6r4K55J014J715J909J680J434J295
61438C60848J124J066J566K713L907M471M343L935L573L287L013K659K079J282
$$ plain form
61424 399866 400513 401128 402206 403625 404847 405598 406191 407238 409210 412147 415519 418323 419633 419250 417732
61409 417732 415735 413495 410984 408272 405536 402784 399839 396555 392962 389248 385761 382941 381073 379990
61395 379990 379140 377983 376335 374355 372300 370359 368720 367640 367305 367568 368007 368382 368879 369718 370659 371211
61379 371211 371299 371407 372018 373219 374850 376637 378073 378702 378789 379308 380872 383028 385001 386810 389091 392008
61363 392008 394915 397089 398356 399042 399811 401529 404725 409021 413505 417833 422524 428031 434041 440050 446289
61348 446289 453654 462853 473871 486086 498601 510600 521704 532016 541691 550533 558116 564193 568811
61335 568811 572195 574698 576738 578451 579391 578883 576757 573508 569627 565035 559464 553271 547473 542799 539019
61320 539019 535464 532020 529178 527141 525404 523479 521671 520820 521494 523681 527024 530931 534647 537738 540574
$$ packed form
61424C99866O47O15J078J419J222P51N93J047J972K937L372K804J310l83j518
61409D17732j997k240k511k712k736k752k945l284l593l714l487k820j868j083
61395C79990q50j157j648j980k055j941j639j080l35K63M39L75M97Q39R41N52
61379C71211Q8J08O11J201J631J787J436O29Q7N19J564K156J973J809K281K917
61363C92008K907K174J267O86P69J718L196M296M484M328M691N507O010O009O239
61348D46289P365R199J1018J2215J2515J1999J1104J0312R675Q842P583O077M618
61335E68811L384K503K040J713R40n08k126l249l881m592n571o193n798m674l780
61320E39019l555l444k842k037j737j925j808q51O74K187L343L907L716L091K836
$$ plain form
61305 540574 544067 548956 555609 564212 574569 585723 596385 605938 614584 622290 628157 631151 631092 628512
61291 628512 623875 617417 609657 601538 593921 587052 580579 574046 567455 561436 556732 553472 551083 548983
61277 548983 547136 545874 545431 545845 547109 549260 552472 557094 563308 570646 578170 585375 592627 600501 609015
61262 609015 617783 626619 635621 644946 654891 665978 678534 692322 706894 722028 737354 751773
61250 751773 763963 773423 780445 785025 786507 784601 780127 774327 767776 760362 751972 742731 732834 722733
61236 722733 713389 705742 699650 693804 687114 680017 674051 670125 667610 665328 663126 661965 662581 664605
61222 664605 667304 670698 675310 680961 686463 690737 693725 695934 697476 698125 698139 698436 699719 701792 703997
61207 703997 706083 708278 710550 712250 712752 712335 712189 713521 716809 721887 728529 736812 747034 759515
$$ packed form
61305E40574L493M889O653Q603J0357J1154J0662R553Q646P706N867K994n9k580
61291F28512m637o458p760q119p617o869o473o533o591o019m704l260k389k100
61277E48983j847j262m43M14J264K151L212M622O214P338P524P205P252P874Q514
61262F09015Q768Q836R002R325R945J1087J2556J3788J4572J5134J5326J4419
61250G51773J2190R460P022M580J482j906m474n800o551p414q390r241r897j0101
61236G22733r344p647o092n846o690p097n966l926k515k282k202j161O16K024
61222F64605K699L394M612N651N502M274K988K209J542O49J4K97J283K073K205
61207G03997K086K195K272J700N02m17j46J332L288N078O642Q283J0222J2481
$$ plain form
61193 759515 774500 792079 812071 834016 857355 881631 906462 931260 955047 976657 995197
61182 995197 1010327 1022184 1031197 1037982 1043222 1047366 1050407 1051971 1051597 1048988 1044207 1037740 1030131 1021413
61168 1021413 1011135 999148 986027 972305 957579 941040 922836 904203 886119 868416 850526
61157 850526 832569 815283 799304 784922 772218 761040 751090 742404 735474 730576 727330 725349 724885
61144 724885 726241 728858 731622 733802 734977 734271 730736 724686 717774 711299 705074 698350 691332 685276
61130 685276 681529 680853 683267 688029 694092 701111 709889 721506 736241 753612 773104 794263 816447
61117 816447 839246 863190 889365 918158 948833 980427 1012479 1044728 1076655 1107759 1137795
61106 1137795 1166331 1192436 1215411 1235565 1253644 1269509 1282091 1290775 1296169 1299013 1298768 1293906
$$ packed form
61193G59515J4985J7579J9992K1945K3339K4276K4831K4798K3787K1610J8540
61182I95197J5130J1857R013O785N240M144L041J564l74k609m781o467p609q718
61168A021413j0278j1987j3121j3722j4726j6539j8204j8633j8084j7703j7890
61157H50526j7957j7286j5979j4382j2704j1178r950q686o930m898l246j981m64
61144G24885J356K617K764K180J175p06l535o050o912o475o225o724p018o056
61130F85276l747o76K414M762O063P019Q778J1617J4735J7371J9492K1159K2184
61117H16447K2799K3944K6175K8793L0675L1594L2052L2249L1927L1104L0036
61106A137795K8536K6105K2975K0154J8079J5865J2582Q684N394K844k45m862
$$ plain form
61094 1293906 1283451 1267712 1247514 1223355 1195576 1164902 1132275 1098336 1063407 1027982 992881
61083 992881 958881 926455 895909 867467 841106 816570 793762 772939 754335 737747 722764
61072 722764 709319 697762 688365 680970 675145 670443 666496 663044 660071 657818 656575 656550 657938 660868
61058 660868 665069 669785 674402 679151 684877 691959 699774 707540 715587 725353 737949 753005 769212
61045 769212 785851 803419 822739 843934 866561 890438 915783 942556 970144 997839 1025341
61034 1025341 1052638 1079803 1107101 1134986 1163634 1192699 1221799 1250971 1280281 1309348 1337840
61023 1337840 1366315 1395969 1427493 1460688 1495172 1530877 1567859 1606397 1647599 1693349 1745315
61012 1745315 1804496 1872041 1949938 2040584 2146299 2269867 2415268 2587647 2793123 3038930
$$ packed form
61094A293906j0455j5739k0198k4159k7779l0674l2627l3939l4929l5425l5101
61083I92881l4000l2426l0546k8442k6361k4536k2808k0823j8604j6588j4983
61072G22764j3445j1557r397p395n825m702l947l452k973k253j243k5J388K930
61058F60868M201M716M617M749N726P082P815P766Q047R766J2596J5056J6207
61045G69212J6639J7568J9320K1195K2627K3877K5345K6773K7588K7695K7502
61034A025341K7297K7165K7298K7885K8648K9065K9100K9172K9310K9067K8492
61023A337840K8475K9654L1524L3195L4484L5705L6982L8538M1202M5750N1966
61012A745315N9181O7545P7897R0646J05715J23568J45401J72379K05476K45807
$$ plain form
61002 3038930 3333115 3683851 4100226 4594604 5183541 5885735 6719902 7704454 8856032
60993 8856032 10185558 11696574 13386106 15234333 17173428 19059111 20690952 21893875
60985 21893875 22606801 22904497 22939145 22861717 22783522 22773089 22843666 22922629 22849196 22437730
60975 22437730 21574684 20274091 18653046 16860772 15022509 13225212 11528063 9972579
60967 9972579 8585377 7378880 6352722 5495310 4786872 4204903 3728920 3341136 3024833
60958 3024833 2764399 2547091 2363588 2206703 2070504 1950627 1844333 1749725 1665220 1589684
60948 1589684 1522365 1462395 1408608 1359823 1314948 1272850 1232491 1193112 1153991 1114355 1074039
60937 1074039 1033965 995343 958474 922869 888328 855258 824086 795067 768642 745211 724433
$$ packed form
61002C038930K94185L50736M16375M94378N88937P02194Q34167R84552J151578
60993H856032J329526J511016J689532J848227J939095J885683J631841J202923
60985B1893875P12926K97696L4648p7428p8195j0433P0577P8963p3433m11466
60975B2437730q63046j300593j621045j792274j838263j797297j697149j555484
60967I972579j387202j206497j026158q57412p08438n81969m75983l87784l16303
60958C024833k60434k17308j83503j56885j36199j19877j06294r4608q4505p5536
60948A589684o7319n9970n3787m8785m4875m2098m0359l9379l9121l9636m0316
60937A074039m0074l8622l6869l5605l4541l3070l1172k9019k6425k3431k0778
$$ plain form
60926 724433 705402 687648 671374 656642 643042 630343 618804 608582 599437 591285 584423 578903
60914 578903 574223 569994 566368 563468 560964 558682 557092 556638 556969 557461 558137 559446 561276 562918 564046
60899 564046 565166 566847 568871 570380 570671 569686 567827 565490 562829 559899 556829 553739 550567 547187 543674
60884 543674 540270 537079 533975 530749 527143 522790 517502 511652 505922 500622 495532 490449 485462 480605
60870 480605 475715 470877 466607 463270 460751 459028 458656 460130 462911 465628 467275 467947 468545 470128 473499
60855 473499 478847 485523 492385 498651 504353 509894 515330 520282 524537 528473 532736 537608 542906 548436
60841 548436 554135 559592 563828 565957 565954 564404 561701 557998 553835 550103 547153 544446 541381 538061 534929
60826 534929 532090 529389 526886 524792 523072 521476 519864 518198 516348 514170 511750 509275 506727 503888
$$ packed form
60926G24433j9031j7754j6274j4732j3600j2699j1539j0222r145q152o862n520
60914E78903m680m229l626k900k504k282j590m54L31M92O76J309J830J642J128
60899E64046J120J681K024J509K91r85j859k337k661k930l070l090l172l380l513
60884E43674l404l191l104l226l606m353n288n850n730n300n090n083m987m857
60870D80605m890m838m270l337k519j723l72J474K781K717J647O72N98J583L371
60855D73499N348O676O862O266N702N541N436M952M255L936M263M872N298N530
60841E48436N699N457M236K129lj550k703l703m163l732k950k707l065l320l132
60826E34929k839k701k503k094j720j596j612j666j850k178k420k475k548k839
$$ plain form
60812 503888 500536 496457 491439 485545 479319 473371 467794 462247 456663 451550 447521 444706 442785 441425
60798 441425 440515 440024 439806 439637 439385 439048 438595 437880 436796 435444 434067 432932 432369 432749 434173 436266 438587
60781 438587 441175 444408 448282 452173 455426 458017 460587 463969 468561 473868 478680 482071 484302 486464
60767 486464 489373 493211 498093 504201 511173 518068 524375 530500 536771 542519 546765 549529 551813 554442
60753 554442 557465 560565 563469 565943 567894 569518 570989 571943 571717 570187 568104 566416 565471 564899 564055
60738 564055 562458 559972 556715 552855 548515 543895 539361 535292 531924 529329 527389 525733 524041 522535
60724 522535 521971 522911 525237 528504 532544 537437 543139 549397 555888 562271 568411 574822 582530 592127 603124
60709 603124 614601 626144 637783 649395 660854 672587 685266 698884 712752 726487 740349
$$ packed form
60812E03888l352m079n018n894o226n948n577n547n584n113m029k815j921j360
60798D41425r10m91k18j69k52l37m53p15j084j352j377j135n63L80J424K093K321
60781D38587K588L233L874L891L253K591K570L382M592N307M812L391K231K162
60767D86464K909L838M882O108O972O895O307O125O271N748M246K764K284K629
60753E54442L023L100K904K474J951J624J471R54k26j530k083j688r45n72q44
60738E64055j597k486l257l860m340m620m534m069l368k595j940j656j692j506
60724E22535n64R40K326L267M040M893N702O258O491O383O140O411P708R597J0997
60709F03124J1477J1543J1639J1612J1459J1733J2679J3618J3868J3735J3862
$$ plain form
60698 740349 754372 767787 779741 790292 800310 810553 820987 830826 839072 845263 849926 854080
60686 854080 858077 861068 861866 860206 856959 853131 848930 843898 837719 830642 823044 814872 805722 795382
60672 795382 784001 771794 759002 746224 734300 723503 713196 702630 691823 681294 671251
60661 671251 661526 652085 642961 633801 624097 613948 604058 594901 586432 578723 572300 567473 563826 560725
60647 560725 558041 556010 554644 553634 552682 551655 550500 549218 547809 546104 543794 540827 537625 534742
60633 534742 532448 530731 529521 528723 528264 528288 529081 530589 532244 533589 534885 536667 538819 540512 541074 540547
60617 540547 539307 537573 535443 533037 530290 526841 522501 517689 513115 509048 505240 501562 498402 496264
60603 496264 495125 494287 492828 490241 486885 483771 481641 480152 478254 475496 472599 470492 469135 467698
$$ packed form
60698G40349J4023J3415J1954J0551J0018J0243J0434R839Q246O191M663M154
60686H54080L997K991P98j660l247l828m201n032o179p077p598q172r150j0340
60672G95382j1381j2207j2792j2778j1924j0797j0307j0566j0807j0529j0043
60661F71251r725r441r124r160r704j0149r890r157q469p709o423m827l647l101
60647E60725k684k031j366j010r52j027j155j282j409j705k310k967l202k883
60633E34742k294j717j210p98m59K4P93J508J655J345J296J782K152J693N62n27
60617E40547j240j734k130k406k747l449m340m812m574m067l808l678l160k138
60603D96264j139q38j459k587l356l114k130j489j898k758k897k107j357j437
$$ plain form
60589 467698 465677 463367 461330 459827 458780 457962 457217 456729 456940 457872 458774 458957 458784 459136 460015 460531 460416
60572 460416 460627 462070 464503 467254 470293 474009 478572 484278 491882 501639 512362 522471 531887 541986
60558 541986 553592 565800 576944 585969 592637 597015 599181 599085 596530 591617 585303 579104 574096 570560
60544 570560 568601 568591 570695 574370 578720 583250 588187 594264 602232 612317 624024 636583 649486 662307
60530 662307 674182 684008 691201 695734 697329 695240 689284 680720 671605 663336 656017 649114 642458 636644
60516 636644 632574 630630 630296 630666 631234 632057 633284 634884 636814 639110 641718 644518 647599 651270 655786
60501 655786 661330 668284 677240 688677 702927 720515 742253 768810 800322 836333 875905 917939
60489 917939 961727 1007073 1053400 1098809 1140548 1176388 1204998 1225050 1234846 1233187 1220000 1195785
$$ packed form
60589D67698k021k310k037j503j047q18p45m88K11R32R02J83j73L52Q79N16j15
60572D60416K11J443K433K751L039L716M563N706P604R757J0723J0109R416J0099
60558E41986J1606J2208J1144R025O668M378K166r6k555m913o314o199n008l536
60544E70560j959j0K104L675M350M530M937O077P968J0085J1707J2559J2903J2821
60530F62307J1875R826P193M533J595k089n956q564r115q269p319o903o656n814
60516F36644m070j944l34L70N68Q23J227J600J930K296K608K800L081L671M516
60501F55786N544O954Q956J1437J4250J7588K1738K6557L1512L6011L9572M2034
60489I17939M3788M5346M6327M5409M1739L5840K8610K0052R796j659j3187k4215
$$ plain form
60477 1195785 1161196 1117765 1068487 1016860 965346 915169 867285 822840 782604 746485 713883
60466 713883 684420 658238 635626 616366 599538 584245 570506 559071 550180 542894 535840 528289
60454 528289 520298 512248 504624 497933 492374 487753 483992 481426 480190 479662 479022 478141 477392 476745 475712
60439 475712 474186 472693 471573 470443 468799 466833 465281 464597 464529 464451 463921 462931 461743 460543 459289 457885
60423 457885 456377 454870 453371 451921 450845 450556 450938 451170 450509 449284 448855 450351 453530 457073 459931
60408 459931 462104 464102 466075 467783 469142 470347 471533 472638 473565 474189 474310 473976 473829 474686 476725 479403
60392 479403 482170 484802 487085 488760 490040 491676 494179 497339 500770 504484 508576 512721 516437 519554
60378 519554 522088 523945 525189 526358 528007 530037 531851 533095 533937 534746 535874 537565 539676 541484 542192
$$ packed form
60477A195785l4589m3431m9278n1627n1514n0177m7884m4445m0236l6119l2602
60466G13883k9463k6182k2612j9260j6828j5293j3739j1435q891p286p054p551
60454E28289p991q050p624o691n559m621l761k566j236n28o40q81p49o47j033
60439D75712j526j493j120j130j644j966j552o84o8p8n30r90j188j200j254j404
60423D57885j508j507j499j450j076k89L82K32o61j225m29J496L179L543K858
60408D59931K173J998J973J708J359J205J186J105R27O24J21l34j47Q57K039K678
60392D79403K767K632K283J675J280J636K503L160L431L714M092M145L716L117
60378E19554K534J857J244J169J649K030J814J244Q42Q09J128J691K111J808P08
$$ plain form
60363 542192 541700 540650 539716 539082 538569 538064 537820 538451 540461 543581 546747 549073 550805 553061 556688 561553
60347 561553 566803 571576 575601 579474 584276 590690 598500 607067 616002 625028 633496 640619 646146 650345
60333 650345 653280 654554 653836 651148 646511 639801 631287 621913 612632 603685 594890 586562 579659 574877
60319 574877 571856 569492 566938 564159 561557 559310 557258 555297 553650 552713 552792 554130 557032 561848 568779
60304 568779 577653 587848 598622 609820 622237 636981 654407 673784 693868 713328 730619 744147
60292 744147 753039 757429 757651 753490 744752 732329 718222 704518 692665 683447 677031 672894 670126
60279 670126 667971 665947 663462 659656 653750 645420 634906 622982 610742 599052 588049 577311 566555
60266 566555 556084 546590 538649 532373 527425 523335 519832 516774 513908 511088 508777 507778 508161 508872 508834
$$ packed form
60363E42192m92j050r34o34n13n05k44O31K010L120L166K326J732K256L627M865
60347E61553N250M773M025L873M802O414P810Q567Q935R026Q468P123N527M199
60333F50345K935J274p18k688m637o710q514r374r281q947q795q328o903m782
60319E74877l021k364k554k779k602k247k052j961j647r37P9J338K902M816O931
60304E68779Q874J0195J0774J1198J2417J4744J7426J9377K0084J9460J7291J3528
60292G44147Q892M390K22m161q738j2423j4107j3704j1853r218o416m137k768
60279F70126k155k024k485l806n906q330j0514j1924j2240j1690j1003j0738j0756
60266E66555j0471r494p941o276m948m090l503l058k866k820k311r99L83P11l8
$$ plain form
60251 508834 508073 507244 506486 505482 504391 503881 504161 504736 505256 505882 506583 506783 506128 505139 504590 504623 505003 505967
60233 505967 508315 512546 518168 523904 528558 531870 534655 537976 542039 546069 549321 551927 554562 557604
60219 557604 560906 564200 567399 570579 573967 577896 582516 587545 592542 597451 602670 608564 615077 621885
60205 621885 628764 635682 642589 649219 655098 659769 663056 665237 666925 668700 670725 672650 673915 674197
60191 674197 673621 672583 671416 670158 668579 666416 663676 660708 657876 655072 651720 647432 642630 638341
60177 638341 635250 633036 630717 627672 624289 621548 620029 619402 618861 617885 616525 615181 614323 614257 614845 615498
60161 615498 615683 615462 615355 615777 616841 618507 620512 622278 623418 624338 625762 627581 628840 629094 629094 629765 631093
60144 631093 632619 634496 637320 641196 645658 650434 655688 661501 667628 673822 680037 686326 692794 699554
$$ packed form
60251E08834p61q29p58j004j091n10K80N75N20O26P01K00o55r89n49L3L80R64
60233E05967K348M231N622N736M654L312K785L321M063M030L252K606K635L042
60219E57604L302L294L199L180L388L929M620N029M997M909N219N894O513O808
60205F21885O879O918O907O630N879M671L287K181J688J775K025J925J265K82
60191F74197n76j038j167j258j579k163k740k968k832k804l352m288m802m289
60177F38341l091k214k319l045l383k741j519o27n41r76j360j344q58o6N88O53
60161F15498J85k21j07M22J064J666K005J766J140R20J424J819J259K54%O71J328
60144F31093J526J877K824L876M462M776N254N813O127O194O215O289O468O760
$$ plain form
60130 699554 706432 712859 718388 723127 727306 730654 732592 732861 731511 728531 724109 719107 714625 711089
60116 711089 708251 705974 704406 703385 702386 701179 699966 698765 697291 695647 694476 694041 693630 692255 689646
60101 689646 686260 682657 679138 675778 672533 669478 667093 666056 666644 668578 671461 675065 679125 683321
60087 683321 687697 692758 698936 706209 714361 723224 732429 741303 749321 756357 762288 766641 768980 769362
60073 769362 768081 765198 760636 754524 747081 738270 727957 716432 704465 692829 681922 671791 662287
60060 662287 653123 644027 635027 626599 619427 613848 609475 605456 601278 597297 594342 592785 592121 591468 590395
60045 590395 589302 589096 590487 593483 597553 602201 607210 612336 617217 621839 626729 632182 637506 641453
60031 641453 643308 643160 641338 638119 633902 629071 623590 617188 609986 602471 594838 586860 578515 570224
$$ packed form
60130F99554O878O427N529M739M179L348J938K69j350k980m422n002m482l536
60116G11089k838k277j568j021r99j207j213j201j474j644j171m35m11j375k609
60101F89646l386l603l519l360l245l055k385j037N88J934K883L604M060M196
60087F83321M376N061O178P273Q152Q863R205Q874Q018P036N931M353K339L82
60073G69362j281k883m562o112p443q811j0313j1525j1967j1636j0907j0131r504
60060F62287r164r096r000q428p172n579m373m019m178l981k955j557o64o53j073
60045E90395j093k06J391K996M070M648N009N126M881M622M890N453N324L947
60031F41453J855j48j822l219m217m831n481o402p202p515p633p978q345q291
$$ plain form
60017 570224 562328 554785 547574 540957 535177 530289 526425 523767 522095 520768 519393 518167 517432 517266 517608
60002 517608 518310 518980 519307 519757 521383 524598 528582 532191 535020 537302 539325 541382 543899 547125 550961
59987 550961 555387 560654 566638 572468 577272 581023 584175 586780 588509 589322 589517 589142 587832 585285 581643
59972 581643 577397 573053 568825 564506 559869 555331 551931 550378 550366 551119 552280 553898 555848 557807 559735
59957 559735 561973 564752 567845 570685 572648 573350 572862 571660 570270 569028 568095 567417 566589 565133 563084
59942 563084 561005 559294 557786 556120 554089 551460 547983 543880 539834 536186 532591 528857 525559 523261
59928 523261 521577 519682 517523 515844 515190 515449 516336 517758 519657 521884 524252 526545 528606 530639 533172
59913 533172 536452 540191 544159 548584 553535 558406 562640 566592 570978 575739 580121 583696 586580 588804
$$ packed form
60017E70224p896p543p211o617n780m888l864k658j672j327j375j226p35j66L42
60002E17608P02O70L27M50J626L215L984L609K829K282K023K057K517L226L836
59987E50961M426N267N984N830M804L751L152K605J729Q13J95l75j310k547l642
59972E81643m246m344m228m319m637m538l400j553j2P53J161J618J950J959J928
59957E59735K238K779L093K840J963P02m88j202j390j242r33o78q28j456k049
59942E63084k079j711j508j666k031k629l477m103m046l648l595l734l298k298
59928E23261j684j895k159j679o54K59Q87J422J899K227K368K293K061K033K533
59913E33172L280L739L968M425M951M871M234L952M386M761M382L575K884K224
$$ plain form
59899 588804 590214 590934 591276 591243 590854 590813 591991 594152 596113 597369 598757 601196 604598 608545 613297 619457
59883 619457 626994 635217 643466 651386 658759 665570 672076 678463 684528 689938 694578 698326 700711 701229
59869 701229 699932 697336 693798 689350 684192 678903 673873 668758 662844 655994 648964 642666 637299 632415
59855 632415 627715 623385 619716 616772 614667 613743 614166 615564 617436 619759 622848 626787 631382 636611 642667
59840 642667 649549 656879 664066 670287 674516 676137 675683 674525 673691 673358 673531 674512 676268 677762 677574 675149
59824 675149 670951 665444 658450 649697 639570 628902 618162 607295 596387 586075 577031 569329 562677
59811 562677 557037 552553 548968 545681 542519 539926 538164 536830 535488 534338 533775 533678 533647 533631 533723 533508 532335
59794 532335 530240 528005 526145 524371 522267 520056 518323 517228 516327 515196 514059 513674 514502 516060 517337
$$ packed form
59899E88804J410P20L42l3l89m1J178K161J961J256J388K439L402L947M752O160
59883F19457P537Q223Q249P920P373O811O506O387O065N410M640L748K385N18
59869G01229j297k596l538m448n158n289n030n115n914o850p030o298n367m884
59855F32415m700m330l669k944k105r24M23J398J872K323L089L939M595N229O056
59840F42667O882P330P187O221M229J621m54j158q34l33J73R81J756J494j88k425
59824F75149m198n507o994q753j0127j0668j0740j0867j0908j0312r044p702o652
59811E62677n640m484l585l287l162k593j762j334j342j150n63r7l1j6R2k15j173
59794E32335k095k235j860j774k104k211j733j095r01j131j137l85Q28J558J277
$$ plain form
59779 517337 517940 518410 519163 519581 518779 517001 515509 515064 515253 515507 516087 517559 519808 522185 524484 527153
59763 527153 530474 534013 537185 540084 543400 547543 552225 556982 561762 566677 571485 575895 580296 585575
59749 585575 592016 598865 605204 610797 615814 620321 624440 628507 632468 635500 636906 637146 637400 638245 639353
59734 639353 640324 641178 642061 643042 644202 645472 646422 646747 646872 647468 648414 648891 648605 648276 648699 649829 651079
59717 651079 652094 652957 653964 655442 657595 660387 663651 667211 670724 673685 676037 678570 682147 686593
59703 686593 690924 694615 697997 701400 704681 707772 710988 714474 717931 721179 724411 727518 729762 730641
59689 730641 730665 730714 730900 730514 728918 726084 722368 718203 714028 710256 707138 704609 702243 699493 696152 692518
59673 692518 688971 685589 682439 679835 677706 674959 670331 663948 657292 651449 646156 640866 635906 632051
$$ packed form
59779E17337O03M70P53M18q02j778j492m45J89K54N80J472K249K377K299K669
59763E27153L321L539L172K899L316M143M682M757M780M915M808M410M401N279
59749E85575O441O849O339N593N017M507M119M067L961L032J406K40K54Q45J108
59734F39353R71Q54Q83R81J160J270R50L25J25N96R46M77k86l29M23J130J250
59717F51079J015Q63J007J478K153K792L264L560L513K961K352K533L577M446
59703F86593M331L691L382L403L281L091L216L486L457L248L232L107K244Q79
59689G30641K4M9J86l86j596k834l716m165m175l772l118k529k366k750l341l634
59673F92518l547l382l150k604k129k747m628o383o656n843n293n290m960l855
$$ plain form
59659 632051 629508 627943 627037 626510 625969 625370 625345 626543 628744 631074 632927 634311 635453 636483 637388 637956
59643 637956 637782 636522 634044 630287 625286 619528 613837 608585 603353 597746 592188 587446 583709 580744
59629 580744 578746 578267 579192 580356 580519 579451 577818 576210 574548 572429 569869 567527 566137 565798 565942
59614 565942 565928 565447 564421 562883 561078 559409 558075 556980 556165 556071 557106 559091 561305 563039 564013 564384
59598 564384 564492 564531 564433 564148 563936 564125 564662 565230 565796 566594 567530 568075 568035 568014 568740 570176 571544 572039 571327
59579 571327 569533 567057 564299 561386 558176 554545 550519 546233 542039 538577 536268 534643 532668 529930
59565 529930 527116 525132 524148 523788 523798 524160 524822 525693 526745 527883 528845 529420 529586 529437 529248 529639 531265
59548 531265 534167 537748 541515 545489 549864 554782 560551 567524 575549 584120 593307 603931 616543 630937
$$ packed form
59659F32051k543j565r06n27n41n99k5J198K201K330J853J384J142J030R05N68
59643F37956j74j260k478l757n001n758n691n252n232n607n558m742l737k965
59629E80744j998m79R25J164J63j068j633j608j662k119k560k342j390l39J44
59614E65942j4m81j026j538j805j669j334j095q15r4J035J985K214J734R74L71
59598E64384J08L9r8k85k12J89N37N68N66P98R36N45m0k1P26J436J368M95p12
59579E71327j794k476k758k913l210l631m026m286m194l462k309j625j975k738
59565E29930k814j984r84l60J0L62O62Q71J052J138R62N75J66j49j89L91J626
59548E31265K902L581L767L974M375M918N769O973Q025Q571R187J0624J2612J4394
$$ plain form
59534 630937 647036 665358 685768 706291 723973 736811 744460 747678 747960 747377 747769 749823 753220
59521 753220 757452 762074 766525 770363 773575 776105 777206 775764 771149 763352 752650 739696 725657
59508 725657 711553 697559 683543 669977 657590 646346 635642 625486 616528 608873 601805 595037
59496 595037 589353 585506 583106 581208 579537 578558 578556 579210 580056 581019 582342 584084 585732 586557 586567 586939 589100
59479 589100 593368 598932 605099 612018 619941 628417 636697 644669 652898 661773 670924 679415 686220 690595
59465 690595 692364 692096 690890 689788 689328 689707 691245 694511 699908 707361 716646 727936 741638 757634
59451 757634 774992 792606 809877 826640 842771 858176 872960 887196 900403 911376 918508 920314
59439 920314 915918 905351 889485 869729 847822 825673 804837 785907 768664 752916 738912 726890
$$ packed form
59534F30937J6099J8322K0410K0523J7682J2838P649L218K82n83L92K054L397
59521G53220M232M622M451L838L212K530J101j442m615p797j0702j2954j4039
59508G25657j4104j3994j4016j3566j2387j1244j0704j0156q958p655p068o768
59496E95037n684l847k400j898j671r79kO54Q46R63J323J742J648Q25J0L72K161
59479E89100M268N564O167O919P923Q476Q280P972Q229Q875R151Q491O805M375
59465F90595J769k68j206j102m60L79J538L266N397P453R285J1290J3702J5996
59451G57634J7358J7614J7271J6763J6131J5405J4784J4236J3207J0973P132J806
59439I20314m396j0567j5866j9756k1907k2149k0836j8930j7243j5748j4004j2022
$$ plain form
59427 726890 716738 708336 701827 697348 694933 694926 697947 704090 712677 723249 736158 751567 768456 785510
59413 785510 802642 820679 839717 858808 877309 895346 912364 925820 932089 928705 915848 896241
59401 896241 873892 852409 833776 818475 806689 799104 796302 797380 799334 798055 790413 775872 756372
59388 756372 734647 712647 691260 670943 652157 635325 620744 608513 598462 590310 584031 579797
59376 579797 577411 576139 575331 574901 574922 575187 575632 576785 579210 582684 586390 589788 592835 595637 598434 601782
59360 601782 606214 611731 618080 625408 634156 644434 656015 668940 683634 700373 718989 739025
59348 739025 759912 781157 802752 825207 848769 872777 896207 918594 939911 959784 977341
59337 977341 991610 1001592 1006328 1005660 1000721 992850 982181 968034 950460 930505 909074 886645 864192
$$ packed form
59427G26890j0152q402o509m479k415pL021O143Q587J0572J2909J5409J6889J7054
59413G85510J7132J8037J9038J9091J8501J8037J7018J3456O269l384j2857j9607
59401H96241k2349k1483j8633j5301j1786p585k802J078J954j279p642j4541j9500
59388G56372k1725k2000k1387k0317j8786j6832j4581j2231j0051q152o279m234
59376E79797k386j272q08m30K1K65M45J153K425L474L706L398L047K802K797L348
59360F01782M432N517O349P328Q748J0278J1581J2925J4694J6739J8616K0036
59348G39025K0887K1245K1595K2455K3562K4008K3430K2387K1317J9873J7557
59337I77341J4269R982M736o68m939p871j0669j4147j7574j9955k1431k2429k2453
$$ plain form
59324 864192 843161 824046 805932 788075 771229 756764 744988 734967 725673 716730 708264 700553
59312 700553 693831 688224 683817 680649 678405 676284 673690 671038 669356 669042 669581 670620 672626 676169 681122
59297 681122 687071 694165 703093 714369 727884 743009 758855 774373 788181 798370 803002 801442
59285 801442 795181 786834 778269 770026 762337 755943 751768 750403 752120 756930 764478 774288 786206 800171
59271 800171 815597 831607 847909 864690 881500 897003 910211 921261 930508 937388 940756 939977
59259 939977 935234 927096 916169 903004 887994 871438 853818 835771 817757 800027 783000 767316
59247 767316 753510 741957 733038 726819 722588 719396 717213 716976 719321 723874 729856 736693 743783 750435
59233 750435 756416 761940 766771 770000 771105 770548 768818 765525 760019 752344 742895 731675 718614 704367
$$ packed form
59324H64192k1031j9115j8114j7857j6846j4465j1776j0021r294q943q466p711
59312G00553o722n607m407l168k244k121k594k652j682l14N39J039K006L543M953
59297F81122N949P094Q928J1276J3515J5125J5846J5518J3808J0189M632j560
59285H01442o261q347q565q243p689o394m175j365J717M810P548R810J1918J3965
59271H00171J5426J6010J6302J6781J6810J5503J3208J1050R247O880L368p79
59259I39977m743q138j0927j3165j5010j6556j7620j8047j8014j7730j7027j5684
59247G67316j3806j1553q919o219m231l192k183k37K345M553N982O837P090O652
59233G50435N981N524M831L229J105n57j730l293n506p675r449j1220j3061j4247
$$ plain form
59219 704367 690085 676495 663754 651999 641468 632046 623217 614675 606815 600518 596374 594015 592349
59206 592349 590669 589303 588762 588595 588007 587466 588585 592002 596345 599866 602264 604308 606524 609127 612575
59191 612575 617120 622095 626520 630334 634373 639310 645230 652006 659363 666652 673260 679365 685782 692970
59177 692970 700533 707725 714177 720173 726444 733593 741561 749843 758289 767298 777068 787194 797377 807948
59163 807948 819095 830044 839668 847652 854387 859875 863433 864447 862829 858694 852041 842870 831385
59150 831385 818102 803925 789897 776517 763501 750521 737971 726592 716518 707132 697852 688731
59138 688731 680368 673476 668432 664996 662572 660889 660163 660454 661266 662143 663320 665399 668659 673046 678562
59123 678562 685180 692594 700558 709383 719669 731558 744555 757981 771396 784730 798261 812347
$$ packed form
59219G04367j4282j3590j2741j1755j0531r422q829q542p860o297m144k359j666
59206E92349j680j366n41j67n88n41J119L417M343L521K398K044K216K603L448
59191F12575M545M975M425L814M039M937N920O776P357P289O608O105O417P188
59177F92970P563P192O452N996O271P149P968Q282Q446R009R770J0126J0183J0571
59163H07948J1147J0949R624P984O735N488L558J014j618m135o653r171j1485
59150H31385j3283j4177j4028j3380j3016j2980j2550j1379j0074r386r280r121
59138F88731q363o892n044l436k424j683p26K91Q12Q77J177K079L260M387N516
59123F78562O618P414P964Q825J0286J1889J2997J3426J3415J3334J3531J4086
$$ plain form
59111 812347 826949 841561 855702 869173 881741 892960 902604 910862 917861 923441 927721 931407 935031
59098 935031 938221 940144 940364 938895 935830 931457 926449 921404 916372 911182 905927 900708 895245 889237
59084 889237 882866 876492 870125 863627 857030 850089 841828 831257 818543 805069 792352 781114 771097
59071 771097 761400 751238 740790 731100 722923 716012 709756 703932 698397 692669 686466 680254 674608 669418
59057 669418 664298 659321 654696 650189 645585 641302 637737 634358 630370 626026 622407 620066 618692 617948
59043 617948 617721 617623 617189 616668 616840 617976 619698 621892 625003 629225 634043 638834 643450 648124 653255 659395
59027 659395 667025 676260 687003 699215 712687 726826 741193 756032 771753 788123 804449 820193
59015 820193 834735 846902 855610 860841 863263 863127 860429 856007 851433 847635 844432 841560 839438 838727
$$ packed form
59111H12347J4602J4612J4141J3471J2568J1219R644Q258O999N580M280L686L624
59098I35031L190J923K20j469l065m373n008n045n032n190n255n219n463o008
59084H89237o371o374o367o498o597o941q261j0571j2714j3474j2717j1238j0017
59071G71097r697j0162j0448r690q177o911o256n824n535n728o203o212n646n190
59057F69418n120m977m625m507m604m283l565l379l988m344l619k341j374p44
59043F17948k27r8m34n21J72J136J722K194L111M222M818M791M616M674N131O140
59027F59395P630R235J0743J2212J3472J4139J4367J4839J5721J6370J6326J5744
59015H20193J4542J2167Q708N231K422j36k698m422m574l798l203k872k122p11
$$ plain form
59001 838727 839780 842691 847341 853336 860322 868311 877131 885781 893028 898515 902547 904992 905287 903539
58987 903539 900663 897249 892986 887230 879485 869435 857340 844421 832022 820462 809537 799945 793026
58974 793026 789045 786997 786367 787865 792017 798238 805863 815032 825854 837662 849889 862927 877346
58961 877346 892822 908412 923321 936827 948047 956395 961781 963938 962195 956361 947155 935172 920204
58948 920204 902318 882923 863859 845801 828438 811837 796754 783749 772822 763954 757399 753332
58936 753332 751596 751801 753294 755094 756175 755872 753930 750419 745750 740485 734827 728520 721429 713900 706354
58921 706354 698924 691763 685287 679731 674842 670485 667237 665820 666097 667149 668306 669727 671926 675088
58907 675088 678961 683256 687994 693514 700126 707896 716912 727680 740835 756342 773227 790372 807497
$$ packed form
59001H38727J053K911M650N995O986P989Q820Q650P247N487M032K445K95j748
58987I03539k876l414m263n756p745j0050j2095j2919j2399j1560j0925r592o919
58974G93026l981k048o30J498M152O221P625R169J0822J1808J2227J3038J4419
58961H77346J5476J5590J4909J3506J1220Q348N386K157j743n834r206j1983j4968
58948I20204j7886j9395j9064j8058j7363j6601j5083j3005j0927q868o555m067
58936G53332j736K05J493J800J081l03j942l511m669n265n658o307p091p529p546
58921G06354p430p161o476n556m889m357l248j417K77J052J157J421K199L162
58907F75088L873M295M738N520O612P770R016J0768J3155J5507J6885J7145J7125
$$ plain form
58894 807497 825233 844291 864597 885287 905614 925778 946654 968761 992056 1016823 1043851
58883 1043851 1072977 1101979 1127935 1149463 1166818 1180101 1188541 1191621 1189750 1183398 1172431 1156751
58871 1156751 1136852 1113394 1086951 1058680 1030543 1004222 980170 958098 937920 919801 903705
58860 903705 889380 876537 864771 853550 842487 831355 819844 807804 795818 784908 775396 766564
58848 766564 757685 748869 740627 733099 726019 719026 711741 703958 695952 688252 681027 674140 667822 662626
58834 662626 658575 655024 651554 648355 645564 642936 640389 638189 636354 634584 632954 631891 631228 630215
58820 630215 628817 628006 628309 628966 629161 629155 629541 630224 630998 632319 634545 636930 638299 638375 637709 636667 635226
58803 635226 633447 631439 629152 626719 624696 623448 622714 622177 621930 621867 621314 619977 618673 618340 618833 619471
$$ packed form
58894H07497J7736J9058K0306K0690K0327K0164K0876K2107K3295K4767K7028
58883A043851K9126K9002K5956K1528J7355J3283Q440L080j871o352j0967j5680
58871A156751j9899k3458k6443k8271k8137k6321k4052k2072k0178j8119j6096
58860I03705j4325j2843j1766j1221j1063j1132j1511j2040j1986j0910r512q832
58848G66564q879q816q242p528p080o993p285p783q006p700p225o887o318n196
58834F62626m051l551l470l199k791k628k547k200j835j770j630j063o63j013
58820F30215j398q11L03O57J95oL86O83P74J321K226K385J369P6o66j042j441
58803F35226j779k008k287k433k023j248p34n37k47o3n53j337j304l33M93O38
$$ plain form
58787 619471 620187 621289 622588 623855 625782 629403 634669 640545 646450 652665 659309 665811 671559 676312
58773 676312 679834 681783 682137 681171 678854 674863 669374 663375 657937 653442 649623 646069 642551 639104 635935
58758 635935 633260 631236 630054 629858 630519 631735 633480 635980 639159 642501 645680 648897 652389 656103 660153
58743 660153 665028 670942 677472 684288 691787 700472 710122 720090 730057 740030 749954 759827 769931 780481
58729 780481 791349 802399 813608 824457 833808 840964 846398 850899 854523 857029 858793 860468 862115
58716 862115 863524 865135 867808 871795 876576 881543 886178 889817 891958 892725 892302 890031 884789 876306 865451
58701 865451 853116 839324 823544 805459 785318 763829 741818 719889 698531 678534 660881
58690 660881 645930 633115 621762 611813 603386 596131 589536 583505 578067 572778 566995 560586 554027
$$ packed form
58787F19471P16J102J299J267J927L621N266N876N905O215O644O502N748M753
58773F76312L522J949L54r66k317l991n489n999n438m495l819l554l518l447l169
58758F35935k675k024j182j96O61J216J745K500L179L342L179L217L492L714M050
58743F60153M875N914O530O816P499Q685R650R968R967R973R924R873J0104J0550
58729G80481J0868J1050J1209J0849R351P156N434M501L624K506J764J675J647
58716H62115J409J611K673L987M781M967M635L639K141P67m23k271n242q483j0855
58701H65451j2335j3792j5780j8085k0141k1489k2011k1929k1358j9997j7653
58690F60881j4951j2815j1353r949q427p255o595o031n438n289n783o409o559
$$ plain form
58677 554027 547968 542966 539254 536472 534063 532281 532305 534922 539584 545254 551612 558888 567129 576366 587069
58662 587069 599602 613368 627000 639205 649029 655880 659883 661851 662327 661024 657635 652672 646940
58649 646940 640707 634001 627157 620412 613496 606328 599617 594087 589651 586042 583661 582980 583655 585084 587320
58634 587320 590543 594166 597381 600118 602586 604343 604826 604303 603277 601411 598226 594509 591831 590806 590958
58619 590958 592121 594837 599349 605280 612378 620731 630230 640565 651682 663479 675095 685253 693247
58606 693247 699052 702745 704496 704784 703925 701692 698030 693631 689030 683806 677608 671345 666198 661963 657650
58591 657650 653346 650249 649136 650025 653095 658661 666379 675651 686688 699945 714647 729087 742450
58578 742450 755259 768129 781037 793670 805462 815557 823758 831201 839040 847007 854570 862890 873940
$$ packed form
58677E54027o059n002l712k782k409j782K4K617M662N670O358P276Q241R237J0703
58662E87069J2533J3766J3632J2205R824O851M003J968M76j303l389m963n732
58649F46940o233o706o844o745o916p168o711n530m436l609k381o81O75J429K236
58634E87320L223L623L215K737K468J757M83n23j026j866l185l717k678j025J52
58619E90958J163K716M512N931P098Q353R499J0335J1117J1797J1616J0158P994
58606F93247N805L693J751K88q59k233l662m399m601n224o198o263n147m235m313
58591F57650m304l097j113Q89L070N566P718R272J1037J3257J4702J4440J3363
58578G42450J2809J2870J2908J2633J1792J0095Q201P443P839P967P563Q320J1050
$$ plain form
58565 873940 888038 904052 921925 943045 967893 995078 1023057 1051209 1078771 1104264 1126513
58554 1126513 1145003 1158952 1167449 1170832 1170548 1167234 1160333 1149975 1137723 1124830 1111046 1095758
58542 1095758 1079058 1061116 1041740 1021143 1000047 978462 955512 931055 906348 882583 859881
58531 859881 838297 818620 801465 786636 774050 764290 757513 752756 749091 746650 745860 746400 747587
58518 747587 749178 751248 753721 756381 758895 760770 761924 763210 765524 768513 771097 773061 774960 776584
58504 776584 777037 776471 776197 776735 777097 776434 775017 773127 770346 766489 762081 757396 752267 747288 743887 742660
58488 742660 742841 743905 746422 750810 756554 763279 771357 780869 791282 802782 816622 833337 851704
58475 851704 870034 887307 902534 914409 922474 927360 929130 926519 918657 906525 892044 876755
$$ packed form
58565H73940J4098J6014J7873K1120K4848K7185K7979K8152K7562K5493K2249
58554A126513J8490J3949Q497L383k84l314o901j0358j2252j2893j3784j5288
58542A095758j6700j7942j9376k0597k1096k1585k2950k4457k4707k3765k2702
58531H59881k1584j9677j7155j4829j2586r760o777m757l665k441p90N40J187
58518G47587J591K070K473K660K514J875J154J286K314K989K584J964J899J624
58504G76584M53n66k74N38L62o63j417j890k781l857m408m685n129m979l401j227
58488G42660J81J064K517M388N744O725Q078R512J0413J1500J3840J6715J8367
58475H51704J8330J7273J5227J1875Q065M886J770k611p862j2132j4481j5289
$$ plain form
58463 876755 861847 848176 835560 823308 812110 804085 800323 799713 800959 804290 810190 817774 825616
58450 825616 833140 840185 846089 850067 851740 850741 846748 840398 833087 825460 817328 809278 802768 798096
58436 798096 794031 790148 787818 788039 790072 793194 797965 804648 812073 819448 827789 838269 850621 864298
58422 864298 879601 896225 912238 926022 938013 949152 958903 966088 970230 970747 966404 957216 945558
58409 945558 933730 921644 908344 894399 881076 868456 856213 845157 836190 828687 821647 815486
58397 815486 811072 807955 805321 803745 804243 806321 808598 810651 812676 814058 813867 812181 809624 806265 802228
58382 802228 798480 795717 793344 790790 788792 788130 788256 788594 790038 793691 799183 805733 813692 823485 834139
58367 834139 844520 855013 866449 878566 890995 904437 919139 933535 946257 958271 971111
$$ packed form
58463H76755j4908j3671j2616j2252j1198q025l762o10J246L331N900P584P842
58450H25616P524P045N904L978J673r99l993o350p311p627q132q050o510m672
58436G98096m065l883k330K21K033L122M771O683P425P375Q341J0480J2352J3677
58422H64298J5303J6624J6013J3784J1991J1139R751P185M142N17m343r188j1658
58409I45558j1828j2086j3300j3945j3323j2620j2243j1056q967p503p040o161
58397H15486m414l117k634j576M98K078K277K053K025J382j91j686k557l359m037
58382H02228l748k763k373k554j998o62J26L38J444L653N492O550P959R793J0654
58367H34139J0381J0493J1436J2117J2429J3442J4702J4396J2722J2014J2840
$$ plain form
58356 971111 984176 995741 1005501 1014010 1020648 1024349 1025576 1025604 1024632 1022493 1020321 1019538 1019958 1020732 1022288
58341 1022288 1025573 1030319 1036034 1043697 1054450 1067443 1080956 1094873 1110161 1126739 1143712 1160850
58329 1160850 1178017 1194054 1207906 1219904 1230320 1238006 1242247 1244567 1246713 1248246 1248176 1247502 1247904 1249291
58315 1249291 1250852 1253122 1256771 1260846 1264594 1269526 1277329 1287267 1298039 1310365 1325045 1340377 1354547
58302 1354547 1368860 1385409 1403114 1419396 1434246 1449245 1464026 1477311 1490213 1504893 1520969
58291 1520969 1536710 1552621 1570301 1588964 1606719 1624219 1643328 1663345 1682411 1701594 1723564
58280 1723564 1748132 1773032 1798211 1825325 1853886 1882105 1910803 1942363 1976466 2010927 2045948
58269 2045948 2083420 2122885 2162546 2203467 2248345 2296828 2346514 2397785 2453025 2511706 2570898
$$ packed form
58356I71111J3065J1565R760Q509O638L701J227K8r72k139k172p83M20P74J556
58341A022288L285M746N715P663J0753J2993J3513J3917J5288J6578J6973J7138
58329A160850J7167J6037J3852J1998J0416P686M241K320K146J533p0o74M02J387
58315A249291J561K270L649M075L748M932P803R938J0772J2326J4680J5332J4170
58302A354547J4313J6549J7705J6282J4850J4999J4781J3285J2902J4680J6076
58291A520969J5741J5911J7680J8663J7755J7500J9109K0017J9066J9183K1970
58280A723564K4568K4900K5179K7114K8561K8219K8698L1560L4103L4461L5021
58269B045948L7472L9465L9661M0921M4878M8483M9686N1271N5240N8681N9192
$$ plain form
58258 2570898 2629962 2690096 2750019 2806930 2861077 2914655 2967209 3017117 3066478 3119118 3174842
58247 3174842 3231297 3290388 3356740 3430657 3508802 3591102 3680673 3777662 3879771 3988196 4106301
58236 4106301 4233103 4365025 4503461 4653252 4814460 4983353 5160918 5352371 5558761
58227 5558761 5777446 6010401 6263279 6536591 6826956 7136771 7473277 7838555 8230691
58218 8230691 8654404 9119815 9631144 10188251 10799192 11478992 12236337 13075016 14008848
58209 14008848 15061308 16250959 17593827 19121863 20883703 22928696 25311590 28116798
58201 28116798 31458616 35454247 40215505 45865616 52539419 60371838 69527476 80254556
58193 80254556 92876267 107714702 125045277 145105474 168068010 193967902 222671007
$$ packed form
58258B570898N9064O0134N9923N6911N4147N3578N2554M9908M9361N2640N5724
58247C174842N6455N9091O6352P3917P8145Q2300Q9571R6989J02109J08425J18105
58236D106301J26802J31922J38436J49791J61208J68893J77565J91453K06390
58227E558761K18685K32955K52878K73312K90365L09815L36506L65278L92136
58218H230691M23713M65411N11329N57107O10941O79800P57345Q38679R33832
58209A4008848J052460J189651J342868J528036J761840K044993K382894K805208
58201B8116798L341818L995631M761258N650111O673803P832419R155638J0727080
58193H0254556J2621711J4838435J7330575K0060197K2962536K5899892K8703105
$$ plain form
58186 222671007 253788113 286252430 317654774 344110573 361351710 366591741 359749021
58179 359749021 343099444 319870685 293024286 264853548 237066771 210836836 186751091
58172 186751091 164882144 145041162 127044033 110824637 96386105 83696252 72637619
58165 72637619 63042794 54755866 47650253 41605041 36490540 32178946 28552241 25497332
58157 25497332 22908835 20702144 18814487 17191842 15784541 14555174 13478181 12528517
58149 12528517 11679726 10913837 10222498 9595971 9020104 8485792 7992104 7537606 7116775
58140 7116775 6726864 6369849 6045014 5746772 5471835 5221393 4994268 4784675 4588462
58131 4588462 4405022 4231605 4062749 3897310 3739648 3591918 3451184 3315677 3187553
$$ packed form
58186B22671007L1117106L2464317L1402344K6455799J7241137N240031o842720
58179C59749021j6649577k3228759k6846399k8170738k7786777k6229935k4085745
58172A86751091k1868947j9840982j7997129j6219396j4438532j2689853j1058633
58165G2637619r594825q286928p105613o045212n114501m311594l626705l054909
58157B5497332k588497k206691j887657j622645j407301j229367j076993r49664
58149A2528517q48791p65889o91339o26527n75867n34312m93688m54498m20831
58140G116775l89911l57015l24835k98242k74937k50442k27125k09593j96213
58131D588462j83440j73417j68856j65439j57662j47730j40734j35507j28124
$$ plain form
58122 3187553 3067480 2952590 2841978 2738556 2643364 2553410 2467045 2386207 2311498 2240301
58112 2240301 2171724 2108232 2050425 1995238 1941299 1891008 1845198 1800666 1755337 1711203 1669774
58101 1669774 1629126 1587954 1548307 1511686 1476344 1440866 1406797 1375471 1345756 1317076 1291117
58090 1291117 1268496 1247180 1226148 1207138 1190900 1175287 1159151 1144501 1132513 1120829 1107080
58079 1107080 1091956 1076504 1059645 1040739 1021610 1003507 984767 963886 942317 922019 902764
58068 902764 884071 867249 853179 840383 827529 815722 806229 798118 790174 783019 777359 772153 766461
58055 766461 761028 756171 750235 742154 733560 726278 719601 712031 703918 696356 689099 681581 674547 668833
58041 668833 663848 658845 654338 650797 647357 643186 638672 634057 628572 622159 616233 611327 605805 598376
$$ packed form
58122C187553j20073j14890j10612j03422r5192q9954q6365q0838p4709p1197
58112B240301o8577o3492n7807n5187n3939n0291m5810m4532m5329m4134m1429
58101A669774m0648m1172l9647l6621l5342l5478l4069l1326k9715k8680k5959
58090A291117k2621k1316k1032j9010j6238j5613j6136j4650j1988j1684j3749
58079A107080j5124j5452j6859j8906j9129j8103j8740k0881k1569k0298j9255
58068I02764j8693j6822j4070j2796j2854j1807r493q111p944p155n660n206n692
58055G66461n433m857n936q081q594p282o677p570q113p562p257p518p034n714
58041F68833m985n003m507l541l440m171m514m615n485o413n926m906n522p429
$$ plain form
58027 598376 590138 582678 575860 568957 562207 555743 548709 541022 534340 529719 525987 521901 518159 515699
58013 515699 513834 511804 510422 510329 510278 509078 507702 507577 508244 508716 509710 512403 516097 519207 521658 524506
57997 524506 528061 532109 537025 542948 548726 553307 557336 561840 566292 569516 571584 573228 574277 574283 573835
57982 573835 573686 573326 571829 569402 566741 563703 559956 556122 552909 549912 546453 542753 539146 535194 530791
57967 530791 526919 523948 520524 515711 510987 508277 507052 505256 502224 498823 495431 491745 488104 485142
57953 485142 482362 478660 474032 469490 465603 462325 459812 458134 456694 455137 454280 455084 457287 460148 463749
57938 463749 468424 473830 479844 487446 497331 508595 520211 532746 546937 561507 574298 584829
57926 584829 593835 600925 604804 605528 604587 602798 599744 595139 589073 581074 570579 558316 545734 533113
$$ packed form
58027E98376q238p460o818o903o750o464p034p687o682m621l732m086l742k460
58013E15699j865k030j382r3n1j200j376j25O67M72R94K693L694L110K451K848
57997E24506L555M048M916N923N778M581M029M504M452L224K068J644J049Om48
57982E73835j49l60j497k427k661l038l747l834l213k997l459l700l607l952m403
57967E30791l872k971l424m813m724k710j225j796l032l401l392l686l641k962
57953D85142k780l702m628m542l887l278k513j678j440j557q57Q04K203K861L601
57938D63749M675N406O014P602R885J1264J1616J2535J4191J4570J2791J0531
57926E84829R006P090L879P24r41j789l054m605o066p999j0495j2263j2582j2621
$$ plain form
57912 533113 519721 505741 492525 480930 470757 461841 454273 447583 441017 434726 429441 424954 420165
57899 420165 414641 408923 403269 397307 391006 384938 379512 374901 371556 369762 368843 367930 367382 368260 370511
57884 370511 372913 374810 376665 378808 380790 382266 383610 385386 387794 390621 393161 394446 394207 393283 392386
57869 392386 391070 388799 386356 385042 384962 385351 386112 387648 389549 390949 392092 394219 397912 402724 408312
57854 408312 414721 421609 428440 435345 442694 449977 456321 461904 467543 473051 477415 480568 483503 486472
57840 486472 488414 488412 486535 483133 478486 473336 468558 464044 458930 453064 447211 441822 436738 432141 428587
57825 428587 425972 423591 421355 419860 419271 419323 420392 423169 427178 430973 433999 436885 439764 441901 443420
57810 443420 445772 449692 453957 456919 458075 457435 454569 449316 442541 435205 427357 418804 410158 402356
$$ packed form
57912E33113j3392j3980j3216j1595j0173q916p568o690o566o291n285m487m789
57899D20165n524n718n654n962o301o068n426m611l345j794r19r13n48Q78K251
57884C70511K402J897J855K143J982J476J344J776K408K827K540J285k39r24q97
57869C92386j316k271k443j314q0L89P61J536J901J400J143K127L693M812N588
57854D08312O409O888O831O905P349P283O344N583N639N508M364L153K935K969
57840D86472J942kj877l402m647n150m778m514n114n866n853n389n084m597l554
57825D28587k615k381k236j495n89N2J069K777M009L795L026K886K879K137J519
57810D43420K352L920M265K962J156o40k866n253o775p336p848q553q646p802
$$ plain form
57796 402356 395560 389246 383119 377381 372289 367803 363570 359150 354477 350021 346240 343150 340866 340070
57782 340070 341128 343068 344428 344959 345591 346926 348790 351090 353967 357141 360297 364089 369509 376108 382103
57767 382103 386422 389482 391743 392787 392200 390142 386639 381377 374663 367603 360906 354419 348011 341894
57753 341894 335928 329814 324182 320184 317651 315043 311683 308686 307094 306491 306142 306093 306217 305413 302843 299088
57737 299088 295206 291562 288343 286171 285242 284715 283958 283514 283940 284535 284297 283490 283220 283994 285627 287998 290929
57720 290929 293684 295564 296796 298155 299898 301590 302628 302541 301211 299237 297546 296281 294683 292406 290119
57705 290119 288381 286789 284808 282621 280467 278042 275331 273247 272533 272729 273013 273425 274344 275388 275826 275599
57689 275599 275096 274401 273615 273410 274339 276007 277745 279695 282440 286074 290571 296699 305548 317409 331968
$$ packed form
57796D02356o796o314o127n738n092m486m233m420m673m456l781l090k284p96
57782C40070J058J940J360N31O32J335J864K300K877L174L156L792N420O599N995
57767C82103M319L060K261J044n87k058l503n262o714p060o697o487o408o117
57753C41894n966o114n632l998k533k608l360k997j592o03l49m9J24q04k570l755
57737B99088l882l644l219k172r29n27p57m44M26N95k38q07k70P74J633K371K931
57720B90929K755J880J232J359J743J692J038q7j330j974j691j265j598k277k287
57705B90119j738j592j981k187k154k425k711k084p14J96K84M12R19J044M38k27
57689B75599n03o95p86k05R29J668J738J950K745L634M497O128Q849J1861J4559
$$ plain form
57674 331968 349374 370237 394910 423736 457859 498771 546943 601653 662142 727984 797647
57663 797647 866691 927375 970323 987888 977615 943161 891721 830307 764068 696845 631990
57652 631990 572330 519769 475038 437682 406601 380968 360520 344855 332878 323229 314970 307706
57640 307706 301550 297109 294843 294073 293344 292079 291150 291305 291861 291631 290427 288916 287606 286725 286497 286747
57624 286747 286780 286431 286637 288110 289965 290641 289732 288029 286161 284259 282620 281592 280893 279919 278689 277631
57608 277631 276580 274854 272344 269755 267743 266413 265637 265205 264707 263764 262394 260758 258839 256793 255191
57593 255191 254314 253591 252440 251216 250529 250008 248738 246671 244596 242830 240919 238663 236461 234454 232146
57578 232146 229190 225920 222931 220560 218869 217656 216461 214920 213043 210871 208248 205411 203380 202972
$$ packed form
57674C31968J7406K0863K4673K8826L4123M0912M8172N4710O0489O5842O9663
57663G97647O9044O0684M2948J7565j0273l4454n1440o1414o6239o7223o4855
57652F31990n9660n2561m4731l7356l1081k5633k0448j5665j1977r649q259p264
57640C07706o156m441k266p70p29j265r29J55N56k30j204j511j310q81k28K50
57624B86747L3l49K06J473J855O76r09j703j868j902j639j028o99r74j230j058
57608B77631j051j726k510k589k012j330p76m32m98r43j370j636j919k046j602
57593B55191q77p23j151j224o87n21j270k067k075j766j911k256k202k007k308
57578B32146k956l270k989k371j691j213j195j541j877k172k623k837k031m08
$$ plain form
57564 202972 203682 204298 204385 204358 204330 203890 203002 202207 201781 201537 201508 201984 202650 202618 201716 201094 202032 204577 207718 210519
57544 210519 212720 214477 215890 216826 217136 217001 216899 217172 217897 219263 221558 224491 227022 228392 228968 229556
57528 229556 230308 230868 231188 231519 231870 232159 232650 233638 234941 236178 237212 237747 237094 235061 232568 230553 228807
57511 228807 226866 225447 225717 227474 229423 231068 232899 234701 235218 233934 231873 230105 228545 226781 225070
57496 225070 223829 222888 221886 220810 219671 218250 216601 215263 214567 214251 214075 214198 214619 214847 214571 214165
57480 214165 214114 214376 214658 214862 214897 214455 213412 212170 211246 210733 210397 210059 209677 209258 208858 208580 208487 208615 208946
57461 208946 209276 209401 209619 210687 212914 215719 218499 221332 224169 225932 225582 223793 222433 222369 222783 222708
57445 222708 222190 221709 221395 221199 221167 221281 221518 222071 222876 223132 222123 220441 219390 219253 219151 218649 218232 218051
$$ packed form
57564B02972P10O16Q7k7k8m40q88p95m26k44k9M76O66l2r02o22R38K545L141K801
57544B10519K201J757J413R36L10j35j02K73P25J366K295K933K531J370N76N88
57528B29556P52N60L20L31L51K89M91R88J303J237J034N35o53k033k493k015j746
57511B28807j941j419K70J757J949J645J831J802N17j284k061j768j560j764j711
57496B25070j241r41j002j076j139j421j649j338o96l16j76J23M21K28k76m06
57480B14165n1K62K82K04L5m42j043j242r24n13l36l38l82m19m00k78r3J28L31
57461B08946L30J25K18J068K227K805K780K833K837J763l50j789j360o4M14p5
57445B22708n18m81l14j96l2J14K37N53Q05K56j009j682j051j37j02n02m17j81
$$ plain form
57427 218051 217468 216318 215408 215270 215509 215890 216882 218379 219070 218084 216438 215809 216519 217616 218398 218844 218986
57410 218986 218784 218494 218379 218192 217514 216511 215906 216330 217941 220362 222685 223925 223888 223313 222950 222892 223013 223507
57392 223507 224574 226030 227645 229490 231569 233505 234941 235987 236959 238039 239352 240955 242612 244087
57378 244087 245757 248219 251062 252847 252822 251935 251564 251804 251682 250599 248893 247206 245824 244531 242861 240712
57362 240712 238858 238354 239271 240529 241220 241524 242049 242949 244149 245785 247854 249872 251415 252707 254245 256176
57346 256176 258313 260342 261824 262510 262933 264069 266097 268102 269320 270006 270641 271059 270915 270435 270051 269799
57330 269799 269604 269671 270088 270471 270501 270365 270296 270201 270105 270354 270932 271187 270705 269888 269246 268754 268351 268281 268435 268164 267424
57309 267424 267264 268371 269847 270348 269849 269397 269621 270360 271318 272229 272778 273149 274303 276908 280324 283309 285322
$$ packed form
57427B18051n83j150r10j38K39L81R92J497O91r86j646o29P10J097P82M46J42
57410B18986k02k90j15j87o78j003o05M24J611K421K323J240l7n75l63n8J21M94
57392B23507J067J456J615J845K079J936J436J046R72J080J313J603J657J475
57378B44087J670K462K843J785k5q87l71K40j22j083j706j687j382j293j670k149
57362B40712j854n04R17J258O91L04N25R00J200J636K069K018J543J292J538J931
57346B56176K137K029J482O86M23J136K028K005J218O86O35M18j44m80l84k52
57330B69799j95O7M17L83L0j36o9r5r6K49N78K55m82q17o42m92m03p0J54k71p40
57309B67424j60J107J476N01m99m52K24P39R58R11N49L71J154K605L416K985K013
$$ plain form
57292 285322 286496 286938 286865 286963 287647 288384 288582 288752 289835 291737 293577 295134 297051 299677 302599 305342
57276 305342 307830 310211 312821 316208 320585 325464 330355 335453 341046 346698 351764 356302 360668 364687
57262 364687 368141 371670 376081 380960 385002 387629 389357 390698 391729 392766 394417 396788 399435 402211
57248 402211 405422 409112 412935 416803 420860 424715 427471 428798 429377 430119 431431 433277 435454 437706 440015
57233 440015 442798 446417 450560 454601 458426 462360 466388 470063 473206 476189 479493 483353 487786 492590
57219 492590 497371 501838 505966 509700 512932 516046 519967 525206 531263 537413 543523 549627 555393 560719
57205 560719 566237 572439 578813 584672 590318 596520 603407 610820 619224 629124 639939 650542 660655
57192 660655 670641 680210 688546 695688 702776 710931 720657 732122 744986 758097 770332 781800 793453
$$ packed form
57292B85322J174M42p3R8O84P37J98J70J083J902J840J557J917K626K922K743
57276C05342K488K381K610L387M377M879M891N098N593N652N066M538M366M019
57262C64687L454L529M411M879M042K627J728J341J031J037J651K371K647K776
57248D02211L211L690L823L868M057L855K756J327N79P42J312J846K177K252K309
57233D40015K783L619M143M041L825L934M028L675L143K983L304L860M433M804
57219D92590M781M467M128L734L232L114L921N239O057O150O110O104N766N326
57205E60719N518O202O374N859N646O202O887P413Q404R900J0815J0603J0113
57192F60655R986R569Q336P142P088Q155R726J1465J2864J3111J2235J1468J1653
$$ plain form
57179 793453 805789 818770 832655 847763 863561 879116 894401 910157 926530 942888 958999
57168 958999 975327 992130 1009160 1026325 1043814 1061642 1079817 1098789 1118901 1139689 1160616
57157 1160616 1182106 1204830 1228360 1251779 1275299 1299888 1325469 1350878 1375698 1400833 1427157
57146 1427157 1454790 1483735 1514016 1545067 1576160 1607602 1640514 1675377 1711823 1749825 1789978
57135 1789978 1832592 1877574 1925162 1975697 2028766 2083627 2140437 2200093 2263143 2329904 2401069
57124 2401069 2476887 2556232 2637957 2722771 2812302 2906859 3005874 3110125 3221615 3341487 3470072
57113 3470072 3608864 3760605 3927581 4111742 4316261 4545054 4801046 5087151 5408953
57104 5408953 5774644 6193127 6674888 7234759 7891750 8666842 9583472 10669188 11953425
$$ packed form
57179G93453J2336J2981J3885J5108J5798J5555J5285J5756J6373J6358J6111
57168I58999J6328J6803J7030J7165J7489J7828J8175J8972K0112K0788K0927
57157A160616K1490K2724K3530K3419K3520K4589K5581K5409K4820K5135K6324
57146A427157K7633K8945L0281L1051L1093L1442L2912L4863L6446L8002M0153
57135A789978M2614M4982M7588N0535N3069N4861N6810N9656O3050O6761P1165
57124B401069P5818P9345Q1725Q4814Q9531R4557R9015J04251J11490J19872J28585
57113C470072J38792J51741J66976J84161K04519K28793K55992K86105L21802
57104E408953L65691M18483M81761N59871O56991P75092R16630J085716J284237
$$ plain form
57095 11953425 13463793 15227142 17272748 19630180 22324217 25374355 28795142 32588805
57087 32588805 36737119 41206413 45959223 50953623 56134045 61432686 66768274 72002976
57079 72002976 76870635 80966030 83857946 85260886 85129307 83617757 80974122 77455848
57071 77455848 73291127 68662883 63708013 58536896 53259372 47993901 42858085 37956948
57063 37956948 33376726 29179859 25401030 22049498 19116111 16578213 14402155 12548034
57055 12548034 10975778 9647536 8526926 7579790 6776539 6092477 5506437 5000814 4562352
57046 4562352 4180830 3846837 3551835 3289630 3055985 2846942 2658696 2488605 2334854
57037 2334854 2195304 2067814 1951358 1845717 1750317 1664305 1587340 1519333 1459914 1409101
$$ packed form
57095A1953425J510368J763349K045606K357432K694037L050138L420787L793663
57087C2588805M148314M469294M752810M994400N180422N298641N335588N234702
57079G2002976M867659M095395K891916J402940j31579j511550k643635l518274
57071G7455848m164721m628244m954870n171117n277524n265471n135816m901137
57063C7956948m580222m196867l778829l351532k933387k537898k176058j854121
57055A2548034j572256j328242j120610r47136q03251o84062n86040n05623m38462
57046D562352l81522l33993k95002k62205k33645k09043j88246j70091j53751
57037B334854j39550j27490j16456j05641r5400q6012p6965o8007n9419n0813
$$ plain form
57027 1409101 1367970 1337640 1318193 1309633 1313212 1330553 1361927 1406489 1462893 1526910 1587942 1630331
57015 1630331 1640603 1614252 1556138 1475474 1380796 1278288 1172814 1069160 971848 883963 806598
57004 806598 739591 682396 634067 593086 557952 527895 502627 481477 463143 446221 429792
56993 429792 413705 398518 384995 373443 363689 355696 349806 346300 345248 346969 352023 360295 370376
56980 370376 380036 386919 388801 384170 373287 358186 340998 322640 303483 284638 267684 253397
56968 253397 241572 232051 225274 221719 221281 223384 227521 233727 242640 254956 270715 289231 309630
56955 309630 330851 350885 366613 375084 374918 366420 350874 330180 306660 282419 258816 236799
56943 236799 217497 201988 190619 182985 178573 177217 179097 184636 194273 208031 225444 246134 270295
$$ packed form
57027A409101m1131l0330j9447q560L579J7341L1374M4562N6404O4017O1032M2389
57015A630331J0272k6351n8114q0664r4678j02508j05474j03654r7312q7885p7365
57004H06598o7007n7195m8329m0981l5134l0057k5268k1150j8334j6922j6429
56993D29792j6087j5187j3523j1552r754p993n890l506j052J721N054Q272J0081
56980C70376R660O883J882m631j0883j5101j7188j8358j9157j8845j6954j4287
56968B53397j1825r521o777l555m38K103M137O206Q913J2316J5759J8516K0399
56955C09630K1221K0034J5728Q471j66q498j5546k0694k3520k4241k3603k2017
56943B36799j9302j5509j1369p634m412j356J880N539R637J3758J7413K0690K4161
$$ plain form
56930 270295 298121 328593 358823 384515 401200 405782 397748 379184 353429 323481 291442 258937
56918 258937 227587 198928 173930 152633 134382 118657 105605 95497 87737 80948 74204 67777
56906 67777 62452 58512 55740 54035 53508 54030 55074 56131 57251 59142 62753 68558 76236 85163 95205
56891 95205 106803 120423 136290 154602 175512 198700 223284 248237 272447 294168 310892 320299
56879 320299 321443 315101 303332 288712 273468 258900 245617 234305 225941 221241 220396 223542 231071
56866 231071 243269 260012 281185 307092 338108 374146 414804 459801 508677 559542 607887
56855 607887 646883 669813 673433 659550 633195 599277 561086 521327 483182 449732 422915 403606
56843 403606 392305 389297 394541 407969 429847 460610 500551 549868 608660 676542 752356 834041
$$ packed form
56930B70295K7826L0472L0230K5692J6685M582q034j8564k5755k9948l2039l2505
56918B58937l1350k8659k4998k1297j8251j5725j3052j0108p760o789o744o427
56906F7777n325l940k772j705n27N22J044J057J120J891L611N805P678Q927J0042
56891I5205J1598J3620J5867J8312K0910K3188K4584K4953K4210K1721J6724R407
56879C20299J144o342j1769j4620j5244j4568j3283j1312q364m700q45L146P529
56866B31071J2198J6743K1173K5907L1016L6038M0658M4997M8876N0865M8345
56855F07887L8996K2930L620j3883k6355l3918l8191l9759l8145l3450k6817j9309
56843D03606j1301l008N244J3428K1878L0763L9941M9317N8792O7882P5814Q1685
$$ plain form
56831 834041 917780 996545 1060222 1098794 1106665 1084628 1038387 975558 903370 827680 752963 682779
56819 682779 620086 567027 524569 492722 471242 459997 458704 466658 483055 507541 540161 580776
56807 580776 628722 682913 741271 799003 847778 878263 884861 868174 832883 784051 725889 662716
56795 662716 599127 538800 484008 436356 397041 366185 342924 326650 317581 315778 320369 330184
56783 330184 344647 363575 386581 412999 441776 470694 495865 512633 517370 508837 488402 459187
56771 459187 424521 386891 348205 310563 275922 244956 217053 191763 169625 151277 136442
56760 136442 124290 114346 106533 100642 96186 92550 89078 85341 81507 78107 75277 72646 70126 68204
56746 68204 67198 66763 66488 66384 66403 65991 64706 62901 61276 60021 58846 57600 56443 55587 55231 55487 56109
$$ packed form
56831H34041Q3739P8765O3677L8572P871k2037m6241o2829p2188p5690p4717p0184
56819F82779o2693n3059m2458l1847k1480j1245j293P954J6397K4486L2620M0615
56807E80776M7946N4191N8358N7732M8775L0485O598j6687l5291m8832n8162o3173
56795F62716o3589o0327n4792m7652l9315l0856k3261j6274r069j803M591R815
56783C30184J4463J8928K3006K6418K8777K8918K5171J6768M737q533k0435k9215
56771D59187l4666l7630l8686l7642l4641l0966k7903k5290k2138j8348j4835
56760A36442j2152r944p813n891m456l636l472l737l834l400k830k631k520j922
56746F8204j006m35k75j04J9m12j285j805j625j255j175j246j157q56l56K56O22
$$ plain form
56729 56109 56477 56221 55665 55459 55976 57228 59068 61214 63332 65336 67377 69422 71177 72599 74149 76326
56713 76326 79154 82233 85019 87094 88561 90176 92575 95343 97425 98546 99539 101064 102772 104093 105188
56698 105188 106584 108301 109848 110830 111240 111428 111919 112906 113849 114010 113437 112889 112781 112895 113137 113707 114351 114383
56680 114383 113772 113316 113322 113104 112302 111689 111916 112331 111925 110761 109607 108703 107750 106619 105297 103562 101481
56663 101481 99798 99045 98715 98061 97318 97275 98002 98808 99235 99344 99174 98675 98061 97692 97750 98421 99999 102234
56645 102234 103965 104182 103287 102694 103328 104962 106709 107622 107145 105586 104046 103405 103588 104067 104585 104993 105027
56628 105027 104906 105596 107700 110513 112934 114896 117109 119796 122605 125509 128802 132280 135243 137335 138738
56613 138738 139602 139870 139654 139246 138845 138658 139033 139999 141005 141621 142128 142894 143582 143701 143528 143695 144119 144218 143961
$$ packed form
56729E6109L68k56n56k06N17J252J840K146K118K004K041K045J755J422J550K177
56713G6326K828L079K786K075J467J615K399K768K082J121R93J525J708J321J095
56698A05188J396J717J547R82M10J88M91R87R43J61n73n48j08J14K42N70O44L2
56680A14383o11m56Ok18q02o13K27M15m06j164j154r04r53j131j322j735k081
56663A01481j683p53l30o54p43m3P27Q06M27J09j70m99o14l69N8O71J578K235
56645A02234J731K17q95n93O34J634J747R13m77j559j540o41J83M79N18M08L4
56628A05027j21O90K104K813K421J962K213K687K809K904L293L478K963K092J403
56613A38738Q64K68k16m08m01j87L75R66J006O16N07P66O88J19j73J67M24R9k57
$$ plain form
56594 143961 143916 144299 144645 144430 143458 141815 140012 138946 139069 139791 140204 140105 139803 139365 138888 139096 140726 143405
56576 143405 145957 147732 148919 149795 150509 151533 153462 156317 159679 163466 167863 172619 177232 181901 187596
56561 187596 195088 204488 215764 229041 244225 260766 277851 294561 309933 323265 334328 343124
56549 343124 349846 355303 360710 366432 371418 374526 375914 376504 376672 376337 375710 374923 373291 370034 365536
56534 365536 360845 356111 350463 343355 335051 325877 315897 305372 294723 284135 273872 264715 257198
56521 257198 250670 244076 237495 231859 227289 222846 217941 212970 208380 204101 200086 196569 193501 190438
56507 190438 187121 183668 180251 177176 175025 173964 173118 171401 168785 165967 163175 160259 157617 155833
56493 155833 154541 152847 150809 149315 148525 147632 146281 145056 144451 144406 144998 146398 147973 148648 148419 148429 149235
$$ packed form
56594A43961m5L83L46k15r72j643j803j066J23P22M13r9l02m38m77K08J630K679
56576A43405K552J775J187Q76P14J024J929K855L362L787M397M756M613M669N695
56561A87596P492R400J1276J3277J5184J6541J7085J6710J5372J3332J1063Q796
56549C43124O722N457N407N722M986L108J388N90J68l35o27p87j632l257m498
56534C65536m691m734n648p108q304r174r980j0525j0649j0588j0263r157p517
56521B57198o528o594o581n636m570m443m905m971m590m279m015l517l068l063
56507A90438l317l453l417l075k151j061q46j717k616k818k792k916k642j784
56493A55833j292j694k038j494p90q93j351j225o05m5N92J400J575O75k29J0Q06
$$ plain form
56476 149235 150119 150505 150989 152437 154918 157905 160794 162937 164007 164572 165552 166944 167922 168281 168774 169848
56460 169848 171054 171979 172782 173534 173948 174126 174659 175684 176615 177024 176919 176114 174405 172587 172078 173133 174505
56443 174505 175272 175904 177033 178282 178991 179206 179208 178884 178180 177536 177309 177346 177519 178028 178786 179202 178996 178609 178506
56424 178506 178715 179308 180556 182271 183707 184475 184927 185419 185873 186281 186865 187509 187764 187622 187554 187678 187704 187793 188509
56405 188509 189742 190630 190831 190949 191466 192205 193054 194232 195573 196529 197138 198027 199260 200220 200823 201690 202843
56388 202843 203410 202998 202191 201372 200279 199159 199027 200211 201818 203230 204907 207112 209075 210215 211080 212262
56372 212262 213384 213918 214047 214011 213582 212964 213214 214955 217403 219352 220316 220215 218940 216933 215295 214581 214302
56355 214302 214152 214690 216149 217529 217736 216874 215821 215301 215817 217532 219650 220849 220894 220934 221814 223144 224487
$$ packed form
56476A49235Q84L86M84J448K481K987K889K143J070N65R80J392R78L59M93J074
56460A69848J206R25Q03P52M14J78N33J025R31M09j05q05j709j818n09J055J372
56443A74505P67O32J129J249P09K15Kl24p04o44k27L7J73N09P58M16k06l87j03
56424A78506K09N93J248J715J436P68M52M92M54M08N84O44K55j42o8J24K6Q9P16
56405A88509J233Q88K01J18N17P39Q49J178J341R56O09Q89J233R60O03Q67J153
56388B02843N67m12q07q19j093j120j32J184J607J412J677K205J963J140Q65J182
56372B12262J122N34J29l6m29o18K50J741K448J949R64j01j275k007j638p14k79
56355B14302j50N38J459J380K07q62j053n20N16J715K118J199M5M0Q80J330J343
$$ plain form
56338 224487 226178 228412 230720 233039 236019 239626 242778 245097 247634 251012 254273 256621 258868 261956
56324 261956 265352 268156 270605 273122 274969 275274 274544 273850 273303 272554 271987 272166 272792 273277 273653 273968 273730
56307 273730 272956 272801 273940 275283 275611 275600 276879 279857 283817 288359 293282 297678 300660 302633 304565
56292 304565 306389 307297 307254 307057 307256 308044 309793 312625 315810 318539 321016 323936 327362 330980 334967 339690
56276 339690 344930 350158 355202 360055 364546 368817 373480 378780 384309 390039 396715 404668 413291 422375
56262 422375 432809 445112 458437 471992 486435 502855 521423 542002 565023 590699 618405
56251 618405 647904 680247 716549 756867 801115 849852 903174 960027 1019649 1082352 1147889
56240 1147889 1214489 1280729 1346805 1412580 1475819 1533825 1585412 1629805 1665191 1690112 1704921
$$ packed form
56338B24487J691K234K308K319K980L607L152K319K537L378L261K348K247L088
56324B61956L396K804K449K517J847L05p30o94n47p49n67J79O26M85L76L15k38
56307B73730p74j55J139J343L28j1J279K978L960M542M923M396K982J973J932
56292C04565J824R08m3j97J99P88J749K832L185K729K477K920L426L618L987M723
56276C39690N240N228N044M853M491M271M663N300N529N730O676P953Q623R084
56262D22375J0434J2303J3325J3555J4443J6420J8568K0579K3021K5676K7706
56251F18405K9499L2343L6302M0318M4248M8737N3322N6853N9622O2703O5537
56240A147889O6600O6240O6076O5775O3239N8006N1587M4393L5386K4921J4809
$$ plain form
56229 1704921 1710069 1704341 1686693 1658606 1622685 1580154 1531653 1479183 1424997 1369533 1312527 1255165
56217 1255165 1198999 1143818 1088958 1035902 987134 942989 901835 862823 826270 791921 759179
56206 759179 728765 702012 678715 657503 637949 620421 604467 589365 575843 565184 556956 549528
56194 549528 542433 536388 531411 526836 522708 519310 515972 512244 509511 509239 510251 509976 507982 506040 505193
56179 505193 504985 505193 505963 506477 505749 504596 504794 506573 508936 511913 516182 520890 524284 526363 528675 531743
56163 531743 535010 539000 544992 552582 559955 566676 574004 582488 591479 600949 611501 622604 633133
56150 633133 643779 656789 673267 692725 715049 740656 768896 798757 831328 869322 914185
56139 914185 965757 1024575 1092155 1169136 1255562 1352915 1463295 1586265 1718517 1856392 1996261
$$ packed form
56229A704921N148n728j7648k8087l5921m2531m8501n2470n4186n5464n7006n7362
56217A255165n6166n5181n4860n3056m8768m4145m1154l9012l6553l4349l2742
56206G59179l0414k6753k3297k1212j9554j7528j5954j5102j3522j0659q228p428
56194E49528p095o045m977m575m128l398l338l728k733k72J012k75j994j942q47
56179E05193k08K08P70N14p28j153J98J779K363K977M269M708L394K079K312L068
56163E31743L267L990N992P590P373O721P328Q484Q991R470J0552J1103J0529
56150F33133J0646J3010J6478J9458K2324K5607K8240K9861L2571L7994M4863
56139I14185N1572N8818O7580P6981Q6426R7353J10380J22970J32252J37875J39869
$$ plain form
56128 1996261 2132641 2258965 2371092 2468410 2551723 2622351 2683078 2737077 2785081 2825075 2854524
56117 2854524 2871194 2872867 2859221 2833848 2801749 2764717 2721143 2669320 2607987 2534367 2445413
56106 2445413 2341450 2226044 2102547 1973705 1844224 1720151 1605252 1500647 1407633 1327659
56096 1327659 1259763 1201524 1152622 1114190 1084811 1060894 1041085 1026602 1016969 1009350 1002652 998482
56084 998482 997331 997446 998144 1000599 1004589 1008118 1011112 1015887 1023039 1030364 1036768 1043803 1052463 1061913 1072195
56069 1072195 1084688 1099008 1112878 1125886 1139943 1155481 1170797 1185755 1202185 1219915 1236352
56058 1236352 1250819 1265386 1280573 1294333 1306168 1318128 1330720 1342009 1351856 1362894 1376178
56047 1376178 1389977 1403834 1419531 1437058 1454086 1470518 1489106 1510523 1532477 1554686 1579809
$$ packed form
56128A996261J36380J26324J12127R7318Q3313P0628O0727N3999M8004L9994K9449
56117B854524J6670J673j3646k5373l2099l7032m3574n1823o1333p3620q8954
56106B445413j03963j15406j23497j28842j29481j24073j14899j04605r3014p9974
56096A327659o7896n8239m8902l8432k9379k3917j9809j4483r633p619o698m170
56084I98482j151J15O98K455L990L529K994M775P152P325O404P035Q660R450J0282
56069A072195J2493J4320J3870J3008J4057J5538J5316J4958J6430J7730J6437
56058A236352J4467J4567J5187J3760J1835J1960J2592J1289R847J1038J3284
56047A376178J3799J3857J5697J7527J7028J6432J8588K1417K1954K2209K5123
$$ plain form
56036 1579809 1608258 1637081 1665290 1695281 1727663 1759907 1791515 1825111 1860901 1895628 1928749
56025 1928749 1964013 2003171 2043806 2085126 2129777 2177876 2225517 2271629 2320254 2373555 2428766
56014 2428766 2484466 2543480 2606869 2671568 2736796 2806250 2881105 2957522 3034037 3114504 3200787
56003 3200787 3289779 3380894 3478997 3586262 3698596 3813812 3935760 4066698 4203484 4345211
55993 4345211 4496533 4659532 4830676 5009746 5202834 5412424 5633998 5866866 6118289
55984 6118289 6392134 6684104 6993547 7328939 7695982 8091839 8517380 8983013 9495899
55975 9495899 10054288 10661822 11334227 12084493 12916097 13839340 14879218 16058600 17391107
55966 17391107 18901865 20639075 22656317 25005790 27764343 31046637 34977893 39673478
$$ packed form
56036A579809K8449K8823K8209K9991L2382L2244L1608L3596L5790L4727L3121
56025A928749L5264L9158M0635M1320M4651M8099M7641M6112M8625N3301N5211
56014B428766N5700N9014O3389O4699O5228O9454P4855P6417P6515Q0467Q6283
56003C200787Q8992R1115R8103J07265J12334J15216J21948J30938J36786J41727
55993D345211J51322J62999J71144J79070J93088K09590K21574K32868K51423
55984F118289K73845K91970L09443L35392L67043L95857M25541M65633N12886
55975I495899N58389O07534O72405P50266Q31604R23243J039878J179382J332507
55966A7391107J510758J737210K017242K349473K758553L282294L931256M695585
$$ plain form
55958 39673478 45256897 51871306 59661947 68789283 79491720 92104251 106981968 124426227
55950 124426227 144687970 167962262 194312605 223625163 255578693 289318593 322736336
55943 322736336 352038692 372542491 380597755 375247125 358321081 333123860 302971805
55936 302971805 270510032 237720307 206098011 176741905 150384077 127400760 107823281
55929 107823281 91406469 77766226 66498793 57218684 49563117 43218442 37940443
55922 37940443 33533990 29827770 26681584 23997275 21700535 19720265 17995890 16488832
55914 16488832 15170397 14007441 12970604 12044870 11219690 10477608 9802384 9188398 8631933
55905 8631933 8121942 7648439 7211127 6810771 6440437 6093670 5772844 5480684 5211189
$$ packed form
55958C9673478N583419O614409P790641R127336J0702437J2612531J4877717J7444259
55950A24426227K0261743K3274292K6350343K9312558L1953530L3739900L3417743
55943C22736336K9302356K0503799Q055264n350630j6926044k5197221l0152055
55936C02971805l2461773l2789725l1622296k9356106k6357828k2983317j9577479
55929A07823281j6416812j3640243j1267433r280109p655567o344675n277999
55922C7940443m406453l706220l146186k684309k296740j980270j724375j507058
55914A6488832j318435j162956j036837r25734q25180p42082o75224o13986n56465
55905H631933n09991m73503m37312m00356l70334l46767l20826k92160k69495
$$ plain form
55896 5211189 4957322 4720374 4503462 4302636 4112524 3934452 3771096 3618878 3473167
55887 3473167 3335616 3209267 3091529 2978778 2872874 2776619 2687497 2602173 2522548 2451352
55877 2451352 2386245 2323954 2265498 2211488 2156943 2096942 2033444 1970835 1908751 1844959 1781296
55866 1781296 1720863 1662732 1605039 1550061 1500838 1455847 1412088 1370396 1332718 1297232 1261336
55855 1261336 1226629 1195979 1168274 1140841 1114484 1091344 1070173 1048370 1026466 1006079 985705
55844 985705 962970 939114 916960 896313 875355 854701 836067 818759 801278 784627 770401
55833 770401 757398 743682 730118 718426 707640 696066 684853 676083 669099 662090 655433 650073
55821 650073 644486 636768 628070 620555 613653 605611 597038 589485 582306 574380 567316 563393 561750 559994
$$ packed form
55896E211189k53867k36948k16912k00826j90112j78072j63356j52218j45711
55887C473167j37551j26349j17738j12751j05904r6255q9122q5324p9625p1196
55877B451352o5107o2291n8456n4010n4545o0001o3498o2609o2084o3792o3663
55866A781296o0433n8131n7693n4978m9223m4991m3759m1692l7678l5486l5896
55855A261336l4707l0650k7705k7433k6357k3140k1171k1803k1904k0387k0374
55844I85705k2735k3856k2154k0647k0958k0654j8634j7308j7481j6651j4226
55833G70401j3003j3716j3564j1692j0786j1574j1213q770o984p009o657n360
55821F50073n587p718q698p515o902q042q573p553p179p926p064l923j643j756
$$ plain form
55807 559994 558172 557847 558770 559930 562543 568427 576478 584182 591633 600734 611223 620663 627602 631880
55793 631880 632707 629492 623743 617292 609410 598371 584916 571355 558245 544905 532366 522806 516503
55780 516503 511891 507947 504043 498384 489426 478284 467348 457308 447949 440701 437461 437623 439013 441198
55766 441198 445118 450115 454093 456311 457481 457435 455172 450911 445833 440133 433426 426479 420318 414265 407109
55751 407109 399512 392889 386573 378574 368655 358313 348232 338182 328881 321456 315297 308834 302156
55738 302156 296666 292477 288425 284348 281083 278454 275449 272199 269716 267969 266191 264609 263738 262509
55724 262509 259388 254938 250978 247655 243709 239229 235571 232749 229562 226295 224699 225002 225414 225026 224944
55709 224944 226111 228102 230584 233942 237855 241006 242810 243932 244756 244779 243746 241965 239399 235851 231992
$$ packed form
55807E59994j822l25R23J160K613N884Q051P704P451R101J0489R440O939M278
55793F31880Q27l215n749o451p882j1039j3455j3561j3110j3340j2539r560o303
55780E16503m612l944l904n659q958j1142j0936j0040r359p248l240J62J390K185
55766D41198L920M997L978K218J170m6k263m261n078n700o707o947o161o053p156
55751D07109p597o623o316p999r919j0342j0081j0050r301p425o159o463o678
55738C02156n490m189m052m077l265k629l005l250k483j747j778j582q71j229
55724B62509l121m450l960l323l946m480l658k822l187l267j596L03M12l88q2
55709B24944J167J991K482L358L913L151J804J122Q24K3j033j781k566l548l859
$$ plain form
55694 231992 228736 225705 221882 217662 214595 213143 212314 211514 211159 211475 212242 213689 216133 218903 221150
55679 221150 223494 227231 232134 236797 240866 245055 249107 251766 252861 253493 254035 253750 252525 251171 249846
55664 249846 247974 245908 244853 244902 244961 244916 246061 248925 252406 255539 258561 261690 264366 266256 267741 268942
55648 268942 269492 269462 269270 268456 265876 261284 255441 248619 240460 231431 222882 215394 208428 201789 195990
55633 195990 190972 185926 180686 175992 172176 168926 166442 165376 165398 165265 164514 163777 163329 162812 162449 162882
55617 162882 163577 163056 161112 159228 158368 157808 156642 155003 153289 151487 149728 148368 147187 145670 144159
55602 144159 143401 142981 141751 139899 138777 138432 137198 134363 131384 129727 129144 128926 129212 129993 130269 129379
55586 129379 128081 127345 127020 126554 126034 125700 125295 124740 124615 125275 126258 127107 128007 129092 130001 130675 131802 133913
$$ packed form
55694B31992l256l031l823m220l067j452q29q00l55L16P67J447K444K770K247
55679B21150K344L737M903M663M069M189M052K659J095O32N42k85j225j354j325
55664B49846j872k066j055M9N9m5J145K864L481L133L022L129K676J890J485J201
55648B68942N50l0j92q14k580m592n843o822q159r029q549p488o966o639n799
55633A95990n018n046n240m694l816l250k484j066K2j33p51p37m48n17l63M33
55617A62882O95n21j944j884q60n60j166j639j714j802j759j360j181j517j511
55602A44159p58m20j230j852j122l45j234k835k979j657n83k18K86P81K76q90
55586A29379j298p36l25m66n20l34m05n55j25O60R83Q49R00J085R09O74J127K111
$$ plain form
55568 133913 136714 139656 142458 144743 146037 146494 146917 147780 148897 150089 151260 151830 151167 149692 148446
55553 148446 147508 146030 143990 142515 142106 141864 140928 139539 138222 137010 135920 135225 134897 134751 135243 136968
55537 136968 139247 140607 140945 141816 144203 147385 150415 153213 155671 157149 157631 158081 158903 159219 158314 156633
55521 156633 154748 152527 149947 147476 144994 141562 136999 132473 128838 125562 122035 118761 116459 115080
55507 115080 114425 114607 115191 115079 113974 112834 112150 111101 109169 107201 105887 104531 102481 100539 99710 99621
55491 99621 99447 99388 99894 100343 99885 98963 98687 99228 99991 100857 102098 103461 104357 104701 104753 104566 104282 104439 105210
55472 105210 105868 105739 105107 104460 103532 101994 100483 100019 100716 101817 102663 103021 102860 102431 102175 102167 102067 101867
55454 101867 101984 102366 102386 101995 101989 102693 103470 104068 105212 107068 108348 108069 107159 107195 108339 109564 110142 109842
$$ packed form
55568A33913K801K942K802K285J294M57M23Q63J117J192J171N70o63j475j246
55553A48446r38j478k040j475m09k42r36j389j317j212j090o95l28j46M92J725
55537A36968K279J360L38Q71K387L182L030K798K458J478M82M50Q22L16r05j681
55521A56633j885k221k580k471k482l432m563m526l635l276l527l274k302j379
55507A15080o55J82N84j12j105j140o84j049j932j968j314j356k050j942q29q9
55491I9621j74n9N06M49m58r22k76N41P63Q66J241J363Q96L44N2j87k84J57P71
55472A05210O58j29o32o47r28j538j511m64O97J101Q46L58j61m29k56qj00k00
55454A01867J17L82K0l91oP04P77N98J144J856J280k79r10L6J144J225N78l00
$$ plain form
55436 109842 108473 106410 105025 105444 107190 108843 109612 109597 109217 109088 109733 110660 110526 108985 107451 107161 107516
55419 107516 107371 106916 106973 107355 107387 107376 108136 109538 110835 111970 113240 114173 114035 113079 112079 111042 109648
55402 109648 108463 108279 108590 108168 106971 106053 105673 104967 103578 102264 101650 101520 101593 101926 102310 102208 101504 100559
55384 100559 99448 98053 96871 96746 97606 98359 98317 97914 97782 97910 98041 98284 98951 100131 101642 103095 104008
55367 104008 104167 103877 103605 103500 103508 103621 103679 103343 102684 102368 102755 103262 103153 102453 101491 100140 98325 96739 96137
55348 96137 96199 96003 95344 94753 94537 94674 95424 97074 99171 100818 101683 102031 101969 101463 100871 100636 100564 100140 99411
55329 99411 98811 98311 97566 96778 96569 97045 97701 98183 98445 98367 97983 97914 98699 99844 100338 100059 99808 99999 100213
55310 100213 100091 99868 99789 99653 99171 98317 97299 96515 96401 96909 97400 97501 97684 98419 99286 99757 100380 102080
$$ packed form
55436A09842j369k063j385M19J746J653P69j5l80j29O45R27j34j541j534k90L55
55419A07516j45m55N7L82L2j1P60J402J297J135J270R33j38r56j000j037j394
55402A09648j185j84L11m22j197r18l80p06j389j314o14j30P3L33L84j02p04r45
55384A00559j111j395j182j25Q60P53m2m03j32J28J31K43O67J180J511J453R13
55367A04008J59k90k72j05QJ13N8l36o59l16L87N07j09p00r62j351j815j586o02
55348I6137O2j96o59n91k16J37P50J650K097J647Q65L48o2n06n92k35p2m24p29
55329I9411o00n00p45p88k09M76O56M82K62p8l84o9P85J145M94k79k51J91K14
55310A00213j22k23p9j36m82q54j018p84j14N08M91J01J83P35Q67M71O23J700
$$ plain form
55292 102080 104458 105932 105687 104600 104036 104505 105631 106804 107589 107930 108077 108157 108038 107877 108219 109077 109497
55275 109497 108770 107534 106847 106715 106495 106208 106300 106478 106046 105220 104897 105177 105249 104773 104274 104162 104361 104872 105666
55256 105666 106090 105485 104406 104077 104657 105229 105523 106283 107680 108765 108994 109081 109790 110886 111852 112675 113344 113511
55238 113511 113162 112825 112615 111914 110486 109053 108141 107232 105747 104209 103660 104388 105816 107201 107985 107906 107298
55221 107298 106937 107166 107520 107508 107291 107287 107552 107949 108480 109129 109705 110158 110674 111215 111329 110714 109679 108856 108702
55202 108702 109264 110113 110509 110068 109276 108939 109207 109664 110166 110862 111435 111167 109955 108581 107801 107771 108409 109586
55184 109586 110830 111562 111820 112085 112298 111837 110602 109335 108655 108465 108526 108842 109315 109780 110545 112030 113689
55167 113689 114335 113864 113658 114777 116666 118176 118972 119285 119164 118757 118616 118969 119188 118718 118027 117990 118758 119833
$$ packed form
55292A02080K378J474k45j087n64M69J126J173P85L41J47Q0j19j61L42Q58M20
55275A09497p27j236o87j32k20k87R2J78m32q26l23K80P2m76m99j12J99N11P94
55256A05666M24o05j079l29N80N72K94P60J397J085K29Q7P09J096R66Q23O69J67
55238A13511l49l37k10p01j428j433r12r09j485j538n49P28J428J385P84p9o08
55221A07298l61K29L54j2k17mK65L97N31O49N76M53N16N41J14o15j035q23j54
55202A08702N62Q49L96m41p92l37K68M57N02O96N73k68j212j374p80l0O38J177
55184A09586J244P32K58K65K13m61j235j267o80j90O1L16M73M65P65J485J659
55167A13689O46m71k06J119J889J510P96L13j21m07j41L53K19m70o91l7P68J075
$$ plain form
55149 119833 120810 121502 121767 121753 121889 122128 121682 120060 117928 116372 115717 115629 115900 116413 116694 116272 115355 114616
55131 114616 114360 114339 114190 113675 112676 111422 110608 110899 112286 114073 115393 115741 115321 114971 115398 116387 117142 117378
55113 117378 117509 117717 117573 116910 116408 116831 118155 119772 121092 121712 121593 121413 122100 123649 125000 125519 125844
55096 125844 126760 127971 128742 129180 129971 131161 131987 131847 130860 129620 128843 129027 129990 130928 131232 131001 130459 129383
55078 129383 127575 125497 123888 123006 122698 122873 123470 124223 124891 125454 125786 125557 124862 124456 124842 125535 125755 125432
55060 125432 124965 124426 123705 123090 122945 123005 122672 121899 121186 120805 120622 120561 120744 121175 121783 122650 123801 124882 125436
55041 125436 125435 125165 124805 124490 124567 125337 126689 128301 129949 131250 131511 130423 128718 127515 127162 127207 127334 127673
55023 127673 128231 128602 128413 127667 126597 125500 124706 124376 124309 124184 123989 123988 124382 125155 126143 127067 127680 128024 128324
$$ packed form
55149A19833R77O92K65j4J36K39m46j622k132j556o55q8K71N13K81m22r17p39
55131A14616k56k1j49n15r99j254q14K91J387J787J320L48m20l50M27R89P55K36
55113A17378J31K08j44o63n02M23J324J617J320O20j19j80O87J549J351N19L25
55096A25844R16J211P71M38P91J190Q26j40r87j240p77J84R63R38L04k31n42j076
55078A29383j808k078j609q82l08J75N97P53O68N63L32k29o95m06L86O93K20l23
55060A25432m67n39p21o15j45O0l33p73p13l81j83o1J83M31O08Q67J151J081N54
55041A25436jk70l60l15P7P70J352J612J648J301K61j088j705j203l53M5J27L39
55023A27673N58L71j89p46j070j097p94l30o7j25j95jL94P73R88R24O13L44L00
$$ plain form
55004 128324 128526 128302 127670 127193 127303 127910 128908 130502 132550 134205 134862 135005 135475 136264 136757 136808 136791 136763 136435
54985 136435 135924 135783 136163 136526 136313 135464 134245 133019 132196 132045 132533 133529 134968 136545 137639 138047 138416
54968 138416 139380 140582 141222 141283 141381 141640 141634 141491 142020 143506 145170 146229 146819 147482 148300 148972 149340 149339 148746
54949 148746 147434 145811 144667 144531 145233 146058 146344 146004 145478 145156 144979 144715 144354 144026 143804 143918 144863 146875
54931 146875 149489 152062 154555 157310 160216 162763 164875 167172 170216 174033 178483 183674 189785 196757
54917 196757 204295 211920 218996 224932 229384 232107 232777 231249 227869 223162 217371 210642 203465 196408
54903 196408 189552 182726 176233 170774 166665 163672 161681 160831 160804 160646 159690 158272 157224 156922 157094 157263
54887 157263 157121 156740 156645 157552 159833 163319 167610 172394 177534 183108 189428 196722 204754 212930 220710
$$ packed form
55004A28324K02k24o32m77J10O07R98J594K048J655O57J43M70P89M93N1j7k8l28
54985A36435n11j41L80L63k13q49j219j226q23j51M88R96J439J577J094M08L69
54968A38416R64J202O40O1R8K59oj43N29J486J664J059N90O63Q18O72L68jn93
54949A48746j312j623j144j36P02Q25K86l40n26l22j77k64l61l28k22J14R45K012
54931A46875K614K573K493K755K906K547K112K297L044L817M450N191O111O972
54917A96757P538P625P076N936M452K723O70j528l380m707n791o729p177p057
54903A96408o856o826o493n459m109k993j991q50k7j58r56j418j048l02J72J69
54887A57263j42l81r5R07K281L486M291M784N140N574O320P294Q032Q176P780
$$ plain form
54872 220710 227599 232880 235874 236544 235405 232728 228278 222017 214638 207104 199873 192785 185513 178032
54858 178032 170822 164693 160144 156854 154058 151420 149180 147441 145814 143952 142001 140241 138632 137018
54844 137018 135494 134201 133045 131985 131406 131728 132673 133373 133342 133059 133384 134575 136117 137368 138109 138406 138287
54827 138287 137847 137467 137490 137621 137115 135790 134489 134145 134657 135121 134995 134516 134009 133328 132289 131281 131040 131807
54809 131807 132928 133454 133169 132918 133684 135372 136854 137307 137148 137347 138231 139406 140580 141799 142875 143243
54793 143243 142656 141720 141451 142416 144346 146459 148090 149134 149886 150466 150595 150090 149302 148771 148597 148529 148570 149136
54775 149136 150611 153020 156136 159644 163272 166986 171050 175750 181223 187642 195205 203589 211816 219184
54761 219184 226000 232745 238750 242528 243431 242177 239591 235662 230203 223700 216879 209868 202426 194813
$$ packed form
54872B20710O889N281K994O70j139k677m450o261p379p534p231p088p272p481
54858A78032p210o129m549l290k796k638k240j739j627j862j951j760j609j614
54844A37018j524j293j156j060n79L22R45P00l1k83L25J191J542J251P41K97j19
54827A38287m40l80K3J31n06j325j301l44N12M64j26m79n07o81j039j008k41P67
54809A31807J121N26k85k51P66J688J482M53j59J99Q84J175J174J219J076L68
54793A43243n87r36k69R65J930K113J631J044P52N80J29n05p88n31j74o8M1N66
54775A49136J475K409L116L508L628L714M064M700N473O419P563Q384Q227P368
54761B19184O816O745O005L778R03j254k586l929n459o503o821p011p442p613
$$ plain form
54747 194813 187820 181945 176985 172595 168917 166367 164932 163946 162755 161354 160170 159364 158796 158625 159290
54732 159290 160691 162012 162864 164035 166451 169827 173144 176227 179992 185184 191713 199196 207304 215366
54718 215366 222404 227854 231692 233741 233648 231743 229143 226475 223119 218210 211867 204960 198126 191584 185519
54703 185519 180049 175036 170424 166568 163838 162052 160739 159765 159281 159164 158899 158068 156735 155371 154538 154459
54687 154459 154736 154711 154284 154103 154719 155763 156290 155787 154522 153098 152005 151534 151731 152322 152887 153156 153114 152863
54669 152863 152529 152216 151974 151811 151708 151477 150692 149147 147422 146560 146864 147325 146666 144750 142578 141055 140293
54652 140293 140122 140669 142088 144004 145689 146742 147313 147639 147654 147228 146577 146130 146031 146039 145940 145775 145602 145313 144863
54633 144863 144451 144252 144181 144168 144445 145204 146061 146228 145322 143833 142751 142783 143805 144972 145442 145128 144602 144229
$$ packed form
54747A94813o993n875m960m390l678k550j435r86j191j401j184q06n68j71O65
54732A59290J401J321Q52J171K416L376L317L083L765N192O529P483Q108Q062
54718B15366P038N450L838K049r3j905k600k668l356m909o343o907o834o542o065
54703A85519n470n013m612l856k730j786j313r74m84j17k65q31j333j364q33p9
54687A54459K77k5m27j81O16J044N27n03j265j424j093m71J97N91N65K69m2k51
54669A52863l34l13k42j63j03k31p85j545j725q62L04M61o59j916k172j523p62
54652A40293j71N47J419J916J685J053N71L26J5m26o51m47r9Qr9j65j73k89m50
54633A44863m12j99p1j3K77P59Q57J67r06j489j082L2J022J167M70l14n26l73
$$ plain form
54615 144229 143782 143071 142490 142597 143474 144872 146616 148368 149365 149072 147908 146766 146003 145472 145248 145489 145728
54598 145728 145233 144236 143973 145221 147358 149137 149870 149697 149229 149144 149587 149843 149118 147698 146760 146981 148001
54581 148001 149286 150653 151739 151964 151498 151386 152102 152743 152360 151381 150879 151040 151251 151303 151514 151878 152010 151965
54563 151965 152233 152832 153151 152917 152749 153368 154671 155949 156789 157402 158025 158323 157600 155691 153366 151610 150616
54546 150616 149813 148828 147986 147789 148359 149574 151299 153230 154859 155921 156701 157711 159256 161349 163691 165617
54530 165617 166516 166499 166254 166135 165896 165492 165437 166038 166850 167407 167934 168779 169642 169965 169784 169584 169608 169847 170374 171117
54510 171117 171565 171324 170741 170431 170433 170360 170159 170020 169707 168686 166892 164843 163060 161913 161834 162956 164519 165398
54492 165398 165331 165036 165019 164932 164402 163802 163732 164117 164369 164260 164204 164655 165453 165899 165482 164541 164103 164880 166517 167968
$$ packed form
54615A44229m47p11n81J07Q77J398J744J752R97k93j164j142p63n31k24K41K39
54598A45728m95r97k63J248K137J779P33j73m68q5M43K56p25j420r38K21J020
54581A48001J285J367J086K25m66j12P16O41l83r79n02J61K11N2K11L64J32m5
54563A51965K68N99L19k34j68O19J303J278Q40O13O23K98p23j909k325j756r94
54546A50616q03r85q42j97N70J215J725J931J629J062P80J010J545K093K342J926
54530A65617Q99j7k45j19k39m04n5O01Q12N57N27Q45Q63L23j81k00K4K39N27P43
54510A71117M48k41n83l10Kp3k01j39l13j021j794k049j783j147p9J122J563Q79
54492A65398o7k95j7q7n30o00p0L85K52j09n6M51P98M46m17r41m38P77J637J451
$$ plain form
54472 167968 168586 168675 169065 170366 172489 174641 175828 175735 175091 174865 175127 175099 174435 173967 174799 176860 178857 179647
54454 179647 179244 178280 176907 174856 172451 170798 170573 171155 171491 171428 171476 171650 171464 171030 171035 171457 171336 170360 169672
54435 169672 170298 171503 171712 170647 169580 169625 170618 171708 172343 172515 172520 172605 172624 172115 170955 169702 168998 168923 169298
54416 169298 170263 171935 173830 175233 176015 176468 176568 176081 175312 175013 175453 176178 176748 177127 177261 176915 176147 175479
54398 175479 175333 175682 176381 177460 178901 180471 182027 183690 185480 186903 187183 186033 184201 183078 183450
54383 183450 184596 185019 184196 183122 182866 183201 183195 182677 182327 182574 183142 183561 183483 182614 181054 179649 179298 179875
54365 179875 180413 180388 180164 180188 180483 181028 181907 182813 183124 182843 182914 184134 186095 187582 187781 186853 185514 184347
54347 184347 183455 182640 181870 181417 181459 181793 182150 182467 182566 182017 180811 179736 179405 179310 178673 177899 178109 179316 180215
$$ packed form
54472A67968O18Q9L90J301K123K152J187r3o44k26K62k8o64m68Q32K061J997P90
54454A79647m03r64j373k051k405j653k25N82L36o3M8J74j86m34NM22j21r76o88
54435A69672O26J205K09j065j067M5R93J090O35J72NQ5J9n09j160j253p04p5L75
54416A69298R65J672J895J403P82M53J00m87p69k99M40P25N70L79J34l46p68o68
54398A75479j46L49O99J079J441J570J556J663J790J423K80j150j832j123L72
54383A83450J146M23q23j074k56L35on18l50K47N68M19p8q69j560j405l51N77
54365A79875N38k5k24K4K95N45Q79R06L11k81P1J220J961J487J99r28j339j167
54347A84347q92q15p70m53M2L34L57L17R9n49j206j075l31r5o37p74K10J207Q99
$$ plain form
54328 180215 179935 178972 178113 177494 177208 177792 179347 180863 181227 180499 179588 179080 178924 178894 178760 178290 177567 177122
54310 177122 177376 178176 179218 180605 182640 185271 188081 190598 192425 193406 193940 194821 196485 198671 200989
54295 200989 203324 205411 206559 206337 205216 204011 202916 201474 199314 196522 193486 190704 188624 187332
54281 187332 186499 185813 185265 184897 184623 184465 184572 184710 184169 182600 180639 179259 178754 178727 178814 178968 179180 179315
54263 179315 179192 178700 177997 177722 178629 180752 183216 185105 186161 186512 186285 185844 185785 186130 186031 184926 183496
54246 183496 182755 182560 181925 180613 179462 179152 179487 180044 180719 181341 181418 180708 179600 178599 177760 176860 175861 174930
54228 174930 174289 174194 174814 175966 177217 178356 179481 180446 180649 179695 178070 176771 176330 176464 176660 176772 176932
54211 176932 177124 177157 177021 176993 177176 177141 176373 175048 173977 173622 173554 173160 172569 172414 172801 173064 172682 172092 172314
$$ packed form
54328A80215k80r63q59o19k86N84J555J516L64p28r11n08j56l0j34m70p23m45
54310A77122K54Q00J042J387K035K631K810K517J827R81N34Q81J664K186K318
54295B00989K335K087J148k22j121j205j095j442k160k792l036k782k080j292
54281A87332q33o86n48l68k74j58J07J38n41j569j961j380n05k7Q7J54K12J35
54263A79315j23m92p03k75R07K123K464J889J056L51k27m41n9L45r9j105j430
54246A83496p41j95o35j312j151l10L35N57O75O22P7p10j108j001q39r00r99r31
54228A74930o41r5O20J152J251J139J125R65K03r54j625j299m41J34J96J12J60
54211A76932J92L3j36k8J83l5p68j325j071l55o8l94n91j55L87K63l82n90K22
$$ plain form
54192 172314 173850 176067 177680 177909 177254 177079 178236 180126 181243 180683 178963 177326 176417 175832 174921 173788
54176 173788 173271 173979 175641 177524 179187 180501 181216 181059 180320 179787 179847 180026 179626 178510 177000 175408 174017
54159 174017 173265 173507 174641 176218 177844 179305 180520 181617 182792 183887 184405 184287 184349 185388 187015 187978
54143 187978 187642 186586 185655 184985 184247 183374 182586 181908 181153 180369 179932 180061 180491 180858 181246 182035 183215 184247
54125 184247 184779 185163 185914 186922 187655 187986 188256 188604 188873 189298 190575 192910 195508 197391 198279 198453 198300
54108 198300 198416 199484 201384 202880 202883 201709 200449 199489 198465 197350 196557 196011 195126 193876 193050 193146 193722
54091 193722 194108 194018 193178 191182 188279 185715 184607 184895 185889 187354 189384 191551 193088 193865 194490 195340
54075 195340 196060 196219 195968 195769 195818 195996 196170 196314 196461 196750 197350 198173 198795 198867 198516 198131 197868 197627 197443
$$ packed form
54192A72314J536K217J613K29o55j75J157J890J117n60j720j637r09n85r11j133
54176A73788n17P08J662J883J663J314P15j57p39n33O0J79m00j116j510j592j391
54159A74017p52K42J134J577J626J461J215J097J175J095N18j18O2J039J627R63
54143A87978l36j056r31o70p38q73p88o78p55p84m37J29M30L67L88P89J180J032
54125A84247N32L84P51J008P33L31K70L48K69M25J277K335K598J883Q88J74j53
54108A98300J16J068J900J496Lj174j260r60j024j115p93n46q85j250q26R6N76
54091A93722L86r0q40j996k903k564j108K88R94J465K030K167J537P77O25Q50
54075A95340P20J59k51j99M9J78J74J44J47K89O00Q23O22P2l51l85k63k41j84
$$ plain form
54056 197443 197587 198199 199124 200306 201937 203936 205571 206164 206143 206822 208959 212006 215019 217834 220858 224035
54040 224035 226693 228507 230099 232466 236091 240811 246280 252263 258575 264998 271398 277776 284107 290160
54026 290160 295575 300171 304119 307750 311287 314769 318069 320810 322493 323027 323068 323405 323965 323830 322362 319901
54010 319901 317144 314297 311176 307725 303892 299313 293749 287776 282467 278299 274843 271578 268507 265747
53996 265747 262988 259837 256505 253709 251835 250478 248963 247162 245568 244567 243863 242855 241439 240129
53982 240129 239345 238918 238493 238134 238210 238831 239670 240311 240645 241035 242249 245067 249682 255533 261939 268799 276566
53965 276566 285734 296541 308991 322835 337600 352705 367282 379684 387669 389695 386007 378109
53953 378109 367431 354976 341895 329416 318038 307516 297944 290202 284905 281467 278762 276417 274899
$$ packed form
54056A97443J44O12R25J182J631J999J635N93k1O79K137L047L013K815L024L177
54040B24035K658J814J592K367L625M720N469N983O312O423O400O378O331O053
54026B90160N415M596L948L631L537L482L300K741J683N34M1L37N60j35j468k461
54010C19901k757k847l121l451l833m579n564n973n309m168l456l265l071k760
53996B65747k759l151l332k796j874j357j515j801j594j001p04j008j416j310
53982B40129p84m27m25l59P6O21Q39O41L34L90J214K818M615N851O406O860P767
53965B76566R168J0807J2450J3844J4765J5105J4577J2402P985K026l688p898
53953C78109j0678j2455j3081j2479j1378j0522r572p742n297l438k705k345j518
$$ plain form
53940 274899 274515 274945 275800 277191 279579 283258 288101 293674 299502 305294 310928 316213 320771 324354 327260
53925 327260 330256 333901 337967 341600 344140 345766 347407 350016 353922 358697 363550 367926 371907 376136
53911 376136 381260 387452 394414 401688 408819 415420 421349 426725 431456 434890 436387 436151 434995 433326
53897 433326 431040 428442 426325 424669 422150 417688 411844 405824 399672 392541 384370 376087 368131 359916
53883 359916 351051 342062 333494 325185 316990 309584 303871 299994 297418 295616 294177 292545 290231 287293
53869 287293 284314 281905 280262 278960 277178 274495 271567 269503 268388 266948 264080 260249 256866 254616
53855 254616 252935 250972 248537 246135 244435 243718 243598 243320 242463 241212 239839 238278 236477 234801 233652
53840 233652 232906 232251 231855 232131 232893 233318 232904 232043 231486 231588 232267 233348 234671 236005 237137 237983 238530
$$ packed form
53940B74899l84M30Q55J391K388L679M843N573N828N792N634N285M558L583K906
53925C27260K996L645M066L633K540J626J641K609L906M775M853M376L981M229
53911C76136N124O192O962P274P131O601N929N376M731L434J497k36j156j669
53897D33326k286k598k117j656k519m462n844o020o152p131q171q283p956q215
53883C59916q865q989q568q309q195p406n713l877k576j802j439j632k314k938
53869B87293k979k409j643j302j782k683k928k064j115j440k868l831l383k250
53855B54616j681j963k435k402j700p17j20k78q57j251j373j561j801j676j149
53840B33652p46o55l96K76P62M25m14q61n57J02O79J081J323J334J132Q46N47
$$ plain form
53823 238530 238779 238824 238873 239054 239321 239649 240212 241196 242522 243932 245346 246941 248821 250838 252886 255222 258194
53806 258194 261697 265169 268268 271334 275002 279544 284835 290847 297836 305987 315063 324571 334183 343956
53792 343956 354193 365123 376816 389432 403415 419146 436454 454889 474524 495722 517519
53781 517519 536636 548883 551695 545123 530882 511285 488899 465977 443554 421543 400049 380109
53769 380109 362835 348349 336033 325423 316336 308452 301295 294574 288188 282016 275979 270257 265198
53756 265198 261086 258076 256091 254660 253180 251569 250357 249900 249821 249497 248784 247951 247207 246660 246434 246464 246425
53739 246425 246273 246555 247742 249511 251227 252943 255347 258810 263035 267617 272373 277074 281407 285402 289551
53724 289551 294259 299428 304571 309068 312278 313778 313637 312224 309779 306414 302517 298753 295583 293055
$$ packed form
53823B38530K49M5M9J81K67L28N63R84J326J410J414J595J880K017K048K336K972
53806B58194L503L472L099L066L668M542N291O012O989Q151R076R508R612R773
53792C43956J0237J0930J1693J2616J3983J5731J7308J8435J9635K1198K1797
53781E17519J9117J2247K812o572j4241j9597k2386k2922k2423k2011k1494j9940
53769C80109j7274j4486j2316j0610r087p884p157o721o386o172o037n722n059
53756B65198m112l010j985j431j480j611j212m57p9l24p13q33p44n47k26L0l9
53739B46425j52K82J187J769J716J716K404L463M225M582M756M701M333L995M149
53724B89551M708N169N143M497L210J500j41j413k445l365l897l764l170k528
$$ plain form
53710 293055 291154 290014 289674 289900 290411 291139 292191 293717 295728 297794 299060 299003 298148 297644 298095 299275
53694 299275 300995 303550 307020 310718 313887 316584 319388 322437 325256 327375 328635 328956 328320 327100 326045
53679 326045 325682 325813 325683 324674 322916 321260 320506 320509 320313 319350 318226 317980 318773 319813 320445 320691 320638 320007
53661 320007 318731 317487 317052 317307 317369 316621 315181 313391 311372 309240 307372 306116 305451 305151 305170 305607 306360
53644 306360 307038 307284 307086 306773 306723 307059 307555 307888 307981 308021 308181 308520 309245 310794 313365 316483 319337 321600
53626 321600 323630 325818 328014 329774 331008 332131 333550 335187 336667 337960 339668 342490 346400 350582
53612 350582 354308 357626 361043 364747 368563 372519 376980 382092 387447 392478 396909 400651 403577 405742
53598 405742 407665 410024 413070 416460 419667 422355 424454 426072 427379 428445 429120 429117 428288 426795 425054
$$ packed form
53710B93055j901j140l40K26N11P28J052J526K011K066J266n7q55n04M51J180
53694B99275J720K555L470L698L169K697K804L049K819K119J260L21o36j220j055
53679C26045l63J31j30j009j758j656p54Lj96r63j124k46P93J040O32K46n3o31
53661C20007j276j244m35K55O2p48j440j790k019k132j868j256o65l00J9M37P53
53644C06360O78K46j98l13n0L36M96L33R3M0J60L39P25J549K571L118K854K263
53626C21600K030K188K196J760J234J123J419J637J480J293J708K822L910M182
53612C50582L726L318L417L704L816L956M461N112N355N031M431L742K926K165
53598D05742J923K359L046L390L207K688K099J618J307J066O75lq29j493j741
$$ plain form
53583 425054 423517 422426 421696 420983 419882 418137 415800 413240 410872 408722 406380 403557 400601 398189 396517
53568 396517 395128 393575 391960 390626 389610 388602 387373 386065 385163 385207 386341 388018 389319 389728 389494
53553 389494 389165 389022 389097 389405 389869 390163 390025 389677 389671 390357 391700 393593 396017 398873 401908 404990 408319
53536 408319 412239 416860 421913 426928 431579 436030 440966 447158 454860 463658 472989 482728 493109 504155
53522 504155 515558 527314 540173 554922 571276 588027 604461 621128 638900 657862 677779
53511 677779 699210 723190 749763 777637 805468 832890 860030 886755 912800 938110 962574
53500 962574 985874 1008040 1029789 1051779 1073870 1095587 1117010 1138598 1160376 1181943 1203296
53489 1203296 1225032 1247608 1270790 1293915 1316367 1337747 1357948 1377231 1396017 1414538 1432857
$$ packed form
53583D25054j537j091p30p13j101j745k337k560k368k150k342k823k956k412j672
53568C96517j389j553j615j334j016j008j229j308r02M4J134J677J301M09k34
53553C89494l29j43P5L08M64K94j38l48oO86J343J893K424K856L035L082L329
53536D08319L920M621N053N015M651M451M936O192P702Q798R331R739J0381J1046
53522E04155J1403J1756J2859J4749J6354J6751J6434J6667J7772J8962J9917
53511F77779K1431K3980K6573K7874K7831K7422K7140K6725K6045K5310K4464
53500I62574K3300K2166K1749K1990K2091K1717K1423K1588K1778K1567K1353
53489A203296K1736K2576K3182K3125K2452K1380K0201J9283J8786J8521J8319
$$ plain form
53478 1432857 1451113 1469488 1487934 1506207 1524127 1541544 1558101 1573281 1586713 1598172 1607335
53467 1607335 1613836 1617621 1618987 1618234 1615418 1610404 1602922 1592667 1579662 1564574 1548501 1532364 1516630
53454 1516630 1501362 1486216 1470385 1452967 1433523 1412161 1389202 1365054 1340370 1315916 1292155
53443 1292155 1269147 1246851 1225232 1204143 1183558 1164018 1146413 1131106 1117593 1105301 1094358
53432 1094358 1085273 1078086 1072268 1067330 1063180 1059895 1057537 1056333 1056760 1059221 1063674 1069759 1077277 1086442
53418 1086442 1097618 1110881 1125912 1142302 1159931 1179033 1199881 1222418 1246292 1271279 1297605
53407 1297605 1325652 1355363 1386272 1418214 1451598 1486716 1523263 1561132 1601334 1645245 1692943
53396 1692943 1743109 1794759 1848259 1904265 1962458 2021956 2082312 2143401 2204857 2266452 2328692
$$ packed form
53478A432857J8256J8375J8446J8273J7920J7417J6557J5180J3432J1459R163
53467A607335O501L785J366p53k816n014p482j0255j3005j5088j6073j6137j5734
53454A516630j5268j5146j5831j7418j9444k1362k2959k4148k4684k4454k3761
53443A292155k3008k2296k1619k1089k0585j9540j7605j5307j3513j2292j0943
53432A094358r085p187n818m938m150l285k358j204M27K461M453O085P518R165
53418A086442J1176J3263J5031J6390J7629J9102K0848K2537K3874K4987K6326
53407A297605K8047K9711L0909L1942L3384L5118L6547L7869M0202M3911M7698
53396A692943N0166N1650N3500N6006N8193N9498O0356O1089O1456O1595O2240
$$ plain form
53385 2328692 2392209 2456621 2520649 2583162 2643489 2700980 2755159 2806295 2855024 2901266 2944164
53374 2944164 2983102 3018045 3048814 3074915 3096388 3114072 3128568 3139551 3146456 3149111 3147107 3139074
53362 3139074 3123388 3099447 3067764 3029047 2983764 2932562 2876571 2817170 2755682 2693291 2630889
53351 2630889 2568862 2507183 2445897 2385553 2327130 2271465 2218641 2167862 2117953 2067947 2017348
53340 2017348 1966240 1915347 1865662 1817618 1770793 1724740 1679892 1637157 1596968 1559342 1524694
53329 1524694 1493702 1466274 1441432 1418451 1397348 1377961 1359372 1340807 1322505 1305067 1288446
53318 1288446 1272214 1256435 1241581 1227816 1215000 1203255 1192924 1184004 1176179 1169425 1164126 1160573
53306 1160573 1158709 1158399 1159548 1161920 1165187 1169313 1174654 1181679 1190787 1202323 1216433 1232816 1250896
$$ packed form
53385B328692O3517O4412O4028O2513O0327N7491N4179N1136M8729M6242M2898
53374B944164L8938L4943L0769K6101K1473J7684J4496J0983O905K655k004q033
53362C139074j5686k3941l1683l8717m5283n1202n5991n9401o1488o2391o2402
53351B630889o2027o1679o1286o0344n8423n5665n2824n0779m9909n0006n0599
53340B017348n1108n0893m9685m8044m6825m6053m4848m2735m0189l7626l4648
53329A524694l0992k7428k4842k2981k1103j9387j8589j8565j8302j7438j6621
53318A288446j6232j5779j4854j3765j2816j1745j0331q920p825o754n299l553
53306A160573j864l10J149K372L267M126N341P025R108J1536J4110J6383J8080
$$ plain form
53293 1250896 1270431 1291776 1315431 1341426 1369276 1398436 1428647 1459740 1491204 1522165 1551950
53282 1551950 1580569 1608404 1635394 1660734 1683472 1703274 1720593 1736184 1750399 1762735 1772106
53271 1772106 1777809 1780201 1780199 1778249 1774156 1767778 1759233 1748320 1734401 1717200 1697205 1674936 1650342
53258 1650342 1623377 1594735 1565394 1535654 1505151 1473612 1441140 1407945 1374336 1340919 1308263
53247 1308263 1276372 1244859 1213612 1182928 1153023 1123817 1095209 1067183 1039544 1011872 983893
53236 983893 955727 927753 900408 874093 849076 825470 803409 783130 764695 747802 732075
53225 732075 717387 703703 690797 678469 666832 656007 645611 634916 623458 611144 597944
53214 597944 583980 569873 556418 543772 531444 519183 507387 496381 485798 475194 464941
$$ packed form
53293A250896J9535K1345K3655K5995K7850K9160L0211L1093L1464L0961K9785
53282A551950K8619K7835K6990K5340K2738J9802J7319J5591J4215J2336R371
53271A772106N703K392kj950m093o378q545j0913j3919j7201j9995k2269k4594
53258A650342k6965k8642k9341k9740l0503l1539l2472l3195l3609l3417l2656
53247A308263l1891l1513l1247l0684k9905k9206k8608k8026k7639k7672k7979
53236I83893k8166k7974k7345k6315k5017k3606k2061k0279j8435j6893j5727
53225G32075j4688j3684j2906j2328j1637j0825j0396j0695j1458j2314j3200
53214E97944j3964j4107j3455j2646j2328j2261j1796j1006j0583j0604j0253
$$ plain form
53203 464941 455970 448628 442174 435514 428216 420690 413614 407345 401785 396557 391229 385522 379510 373629
53189 373629 368343 363758 359604 355636 351907 348626 345858 343418 340949 338103 334797 331369 328335 325979
53175 325979 324212 322756 321221 319187 316631 314261 312923 312547 312168 311220 310234 309965 310372 310977 311712 312728
53159 312728 313639 313737 312919 311790 310829 310035 309388 309067 309043 308917 308393 307679 307296 307715 309144 311319 313484 314890
53141 314890 315387 315289 314751 313631 311935 309977 308047 306327 305148 304908 305548 306454 307047 307248 307227 307016 306524
53124 306524 305790 305111 304923 305443 306278 306597 305999 305039 304553 304657 304891 305080 305391 305575 304950 303280 301020 298518
53106 298518 295663 292592 289984 288105 286209 283560 280605 278451 277440 276934 276383 275910 275787 275946 276206 276559
53090 276559 276890 276718 275593 273685 271761 270447 269689 269090 268650 268823 269668 270361 269981 268664 267498 267295 267924
$$ packed form
53203D64941q971p342o454o660p298p526p076o269n560n228n328n707o012n881
53189C73629n286m585m154l968l729l281k768k440k469k846l306l428l034k356
53175C25979j767j456j535k034k556k370j338l76l79r48r86k69M07O05P35J016
53159C12728R11R8q18j129r61p94o47l21k4j26n24p14l83M19J429K175K165J406
53141C14890M97r8n38j120j696j958j930j720j179k40O40R06N93K01k1k11m92
53124C06524p34o79j88N20Q35L19n98r60m86J04K34J89L11J84o25j670k260k502
53106B98518k855l071k608j879j896k649k955k154j011n06n51m73j23J59K60L53
53090B76559L31j72j125j908j924j314p58n99m40J73Q45O93l80j317j166k03O29
$$ plain form
53073 267924 268828 269650 270186 270324 270367 270966 272339 273884 274892 275274 275260 274782 273692 272316 271260 270773 270797 271397
53055 271397 272611 273905 274408 273838 272838 272275 272550 273621 275268 277145 278836 280121 281067 281841 282653 283876
53039 283876 285813 288120 289800 290109 289370 288575 288244 288068 287703 287455 287827 288620 289068 288939 288960 289787 290967 291443
53021 291443 290918 290138 289836 290016 290426 291081 291950 292618 292682 292194 291332 289986 288125 286335 285475 285904 287365 289399
53003 289399 291451 292868 293392 293541 293900 294139 293343 291348 289070 287394 286352 285638 285214 285080 284983 284883 285261
52986 285261 286489 288162 289572 290553 291439 292425 293506 294864 296688 298607 299878 300295 300484 301159 302456 304103
52970 304103 305858 307560 309079 310509 312158 314110 316009 317496 318672 319851 321017 321823 322064 321883 321557
52955 321557 321304 321242 321300 321164 320573 319644 318679 317686 316408 314852 313402 312271 311212 310020 308991 308485 308202
$$ packed form
53073B67924R04Q22N36J38M3N99J373J545J008L82j4m78j090j376j056m87K4O00
53055B71397J214J294N03n70j000n63K75J071J647J877J691J285R46P74Q12J223
53039B83876J937K307J680L09p39p95l31j76l65k48L72P93M48j29K1Q27J180M76
53021B91443n25p80l02J80M10O55Q69O68O4m88q62j346j861j790q60M29J461K034
53003B89399K052J417N24J49L59K39p96j995k278j676j042p14m24j34r7j00L78
52986B85261J228J673J410R81Q86R86J081J358J824J919J271M17J89O75J297J647
52970C04103J755J702J519J430J649J952J899J487J176J179J166Q06K41j81l26
52955C21557k53o2N8j36n91r29r65r93j278j556j450j131j059j192j029n06k83
$$ plain form
52938 308202 307359 305656 303684 302271 301652 301464 301310 301080 300719 299972 298586 296737 295008 293764 292695 291263
52922 291263 289591 288530 288670 289607 290435 290683 290450 289892 289125 288557 288726 289610 290485 290712 290377 289962 289688 289448
52904 289448 289215 289190 289560 290271 291010 291326 290872 289691 288187 286757 285557 284672 284362 284919 286317 288124 289734
52887 289734 290682 290882 290614 290228 289813 289241 288508 287792 287133 286331 285305 284323 283698 283441 283380 283464 283739 284203 284866
52868 284866 285773 286721 287235 287130 286964 287534 289010 290943 292978 295069 296951 298002 297973 297456 297243 297445 297662
52851 297662 297882 298668 300253 301813 301992 300147 296836 293078 289381 285660 281884 278412 275617 273453 271609
52836 271609 269857 268088 266151 263958 261718 259840 258594 258025 258078 258534 258895 258750 258326 258291 258832 259236 258709
52819 258709 257330 255839 254663 253657 252789 252528 253279 254749 256261 257513 258751 260246 261994 264014 266612
$$ packed form
52938C08202q43j703j972j413o19j88j54k30l61p47j386j849j729j244j069j432
52922B91263j672j061J40R37Q28K48k33n58p67n68J69Q84Q75K27l35m15k74k40
52904B89448k33k5L70P11P39L16m54j181j504j430j200q85l10N57J398J807J610
52887B89734R48K00k68l86m15n72p33p16o59q02j026r82o25k57o1Q4K75M64O63
52868B84866R07R48N14j05j66N70J476J933K035K091J882J051k9n17k13K02K17
52851B97662K20P86J585J560J79j845l311l758l697l721l776l472k795k164j844
52836B71609j752j769j937k193k240j878j246n69N3M56L61j45m24l5N41M04n27
52819B58709j379j491j176j006q68k61P51J470J512J252J238J495J748K020K598
$$ plain form
52804 266612 270016 273842 277108 278866 278780 277124 274389 271007 267408 264143 261708 260140 258939 257566 255998
52789 255998 254653 253817 253382 253144 253067 253122 253159 253184 253527 254396 255405 255941 255918 255764 255686 255431 254962 254891 255807 257378
52769 257378 258538 258599 257914 257390 257522 258038 258427 258653 259177 260281 261605 262585 263180 263823 264644 265198 265090 264530
52751 264530 264043 263890 264069 264549 265172 265523 265306 264818 264645 264919 265220 265251 265287 265790 266808 267951 268862 269610 270607
52732 270607 272116 273793 274798 274530 273232 271743 270700 270162 269950 270021 270396 270946 271469 271912 272350 272789 273154
52715 273154 273441 273724 273916 273658 272685 271332 270446 270566 271331 271922 272038 272113 272627 273598 274835 276233 277556 278363
52697 278363 278578 278836 279787 281227 282323 282539 281863 280367 278274 276492 276263 277884 280271 282119 283086 283493
52681 283493 283487 283113 282892 283508 284899 286292 287239 288156 289581 291373 292929 293910 294405 294615 294680 294720 294726 294495 293950
$$ packed form
52804B66612L404L826L266J758q6j656k735l382l599l265k435j568j201j373j568
52789B55998j345q36m35k38p7N5L7K5L43Q69J009N36k3j54p8k55m69p1R16J571
52769B57378J160O1o85n24J32N16L89K26N24J104J324R80N95O43Q21N54j08n60
52751B64530m87j53J79M80O23L51k17m88j73K74L01L1L6N03J018J143R11P48R97
52732B70607J509J677J005k68j298j489j043n38k12P1L75N50N23M43M38M39L65
52715B73154K87K83J92k58r73j353q86J20P65N91J16P5N14R71J237J398J323Q07
52697B78363K15K58R51J440J096K16o76j496k093j782k29J621K387J848R67M07
52681B83493ol74k21O16J391J393R47R17J425J792J556R81M95K10O5M0Ok31n45
$$ plain form
52662 293950 293511 293747 294606 295350 295441 295196 295330 296092 297196 298352 299428 300230 300699 301355 302926 305256 307013
52645 307013 306915 305001 302304 299614 296994 294361 291920 289969 288635 287945 287852 288136 288548 289121 290105 291546
52629 291546 293197 294854 296556 298397 300361 302368 304238 305632 306340 306622 306927 307262 307220 306655 305823 304786
52613 304786 303274 301396 299838 298919 298048 296753 295688 295745 296467 296417 295182 293951 293715 293844 293147 291702 290716
52596 290716 290839 291491 291882 291946 292059 292472 293394 295072 297295 299187 300119 300677 302106 304752 307648 309826 311431
52579 311431 313094 314716 315537 315291 314637 314391 314861 316038 317869 319957 321425 321556 320511 319110 318053 317556
52563 317556 317567 317891 318146 317888 316925 315400 313628 312021 311034 310920 311497 312316 313049 313526 313512 312772 311412 309935
52545 309935 308870 308479 308801 309723 310971 312269 313614 315179 316879 318244 318897 318907 318502 317611 315949 313519
$$ packed form
52662B93950m39K36Q59P44R1k45J34P62J104J156J076Q02M69O56J571K330J757
52645C07013r8j914k697k690k620k633k441j951j334o90r3K84M12N73R84J441
52629B91546J651J657J702J841J964K007J870J394P08K82L05L35m2n65q32j037
52613C04786j512j878j558r19q71j295j065N7P22n0j235j231k36J29o97j445r86
52596B90716J23O52L91O4J13M13R22J678K223J892R32N58J429K646K896K178J605
52579C11431J663J622Q21k46o54k46M70J177J831K088J468J31j045j401j057m97
52563C17556J1L24K55k58r63j525j772j607r87j14N77Q19P33M77j4p40j360j477
52545C09935j065l91L22R22J248J298J345J565J700J365O53J0m05q91j662k430
$$ plain form
52529 313519 310837 308645 307448 307281 307739 308267 308457 308219 307746 307410 307580 308289 309042 309188 308571 307698 307238 307557
52511 307557 308758 310867 313711 316930 320387 324358 328905 333092 335307 334533 331185 326620 322054 318007
52497 318007 314491 311422 308735 306265 303687 300799 297913 295801 295094 295755 297210 298822 300129 300850 301019
52482 301019 301102 301622 302627 303773 304870 306010 307100 307737 307806 307867 308576 309899 311276 312497 314021 316320
52466 316320 319211 322060 324540 326968 329843 333185 336490 339286 341520 343259 344215 343933 342365 339966 337140
52451 337140 333909 330294 326636 323241 319907 316188 312148 308596 306481 306115 306964 308076 308764 308943 308837
52436 308837 308447 307542 306202 304970 304228 303688 302886 301989 301621 301865 301931 301027 299312 297710 296921 296824 296855 296759 296825
52417 296825 297389 298335 299230 299907 300642 301743 303306 305475 308599 312806 317682 322736 328050 334122 341174
$$ packed form
52529C13519k682k192j197j67M58N28J90k38m73l36J70P09P53J46o17q73m60L19
52511C07557J201K109K844L219L457L971M547M187K215p74l348m565m566m047
52497C18007l516l069k687k470k578k888k886k112p07O61J455J612J307P21J69
52482C01019Q3N20J005J146J097J140J090O37O9O1P09J323J377J221J524K299
52466C16320K891K849K480K428K875L342L305K796K234J739R56k82j568k399k826
52451C37140l231l615l658l395l334l719m040l552k115l66Q49J112O88J79j06
52436C08837l90r05j340j232p42n40q02q97l68K44O6r04j715j602p89r7L1r6O6
52417B96825N64R46Q95O77P35J101J563K169L124M207M876N054N314O072P052
$$ plain form
52402 341174 349042 357688 367363 378037 388892 398547 405723 409719 410421 407955 402470 394506 385458 377052
52388 377052 369916 363156 355940 349118 344470 342556 342247 342413 343033 344265 345420 345664 345223 345158 346155 348166
52372 348166 350964 354488 358647 363217 367898 372241 375661 377857 379125 380011 380781 381371 381601 381185 379913
52357 379913 378155 376867 376624 376943 377064 377077 377660 378865 379944 380454 380808 381485 382341 383108 384124 385989 388715
52340 388715 391725 394725 398179 402676 408022 413266 417723 421791 426547 432660 439978 448211 457582 468576
52326 468576 481326 495525 510699 526241 541465 556088 570588 585654 601328 617098 632754
52315 632754 648677 665126 681738 698048 714253 731152 749403 768981 789355 810054 831028
52304 831028 852461 874307 896144 917547 938443 958935 978911 998002 1015778 1031843 1045820
$$ packed form
52402C41174P868Q646R675J0674J0855R655P176L996P02k466n485p964r048q406
52388C77052p136o760p216o822m648j914l09J66O20J232J155K44m41o5R97K011
52372C48166K798L524M159M570M681M343L420K196J268Q86P70N90K30m16j272
52357C79913j758j288k43L19J21J3N83J205J079N10L54O77Q56P67J016J865K726
52340C88715L010L000L454M497N346N244M457M068M756O113P318Q233R371J0994
52326D68576J2750J4199J5174J5542J5224J4623J4500J5066J5674J5770J5656
52315F32754J5923J6449J6612J6310J6205J6899J8251J9578K0374K0699K0974
52304H31028K1433K1846K1837K1403K0896K0492J9976J9091J7776J6065J3977
$$ plain form
52293 1045820 1057496 1066906 1074157 1079294 1082394 1083579 1082765 1079752 1074850 1069128 1063638 1058594 1053644 1048666
52279 1048666 1043812 1039018 1034042 1028919 1023863 1018863 1014010 1010085 1008093 1008143 1009505 1011905 1016020 1022357
52265 1022357 1030419 1039419 1049343 1060771 1073988 1088709 1104354 1120264 1135985 1151683 1167951 1184961
52253 1184961 1202170 1219197 1236436 1254224 1271781 1287665 1301193 1312764 1322879 1331410 1337929 1342238
52241 1342238 1344406 1344663 1343451 1341294 1338483 1335044 1331092 1326958 1322876 1318654 1313793 1307880 1300902 1293297
52227 1293297 1285700 1278528 1271761 1265176 1258709 1252522 1246797 1241572 1236764 1232301 1228307 1225179 1223280 1222496
52213 1222496 1222277 1222270 1222769 1224399 1227582 1232417 1238773 1246141 1253628 1260582 1267245 1274415 1282398 1290702 1298879
52198 1298879 1307234 1316325 1325991 1335350 1343857 1351978 1360625 1370073 1379680 1388614 1396590 1403847 1410550 1416369
$$ packed form
52293A045820J1676R410P251N137L100J185q14l013m902n722n490n044m950m978
52279A048666m854m794m976n123n056n000m853l925j992N0J362K400M115O337
52265A022357Q062R000R924J1428J3217J4721J5645J5910J5721J5698J6268J7010
52253A184961J7209J7027J7239J7788J7557J5884J3528J1571J0115Q531O519M309
52241A342238K168K57j212k157k811l439l952m134m082m222m861n913o978p605
52227A293297p597p172o767o585o467o187n725n225m808m463l994l128j899p84
52213A222496k19pM99J630L183M835O356P368P487O954O663P170P983Q304Q177
52198A298879Q355R091R666R359Q507Q121Q647R448R607Q934P976P257O703N819
$$ plain form
52184 1416369 1420554 1422393 1421680 1418782 1414129 1407742 1399520 1389990 1380278 1371052 1361952 1352445 1342877 1334111
52170 1334111 1326337 1318986 1311771 1305119 1299467 1294746 1290762 1287509 1284891 1282751 1281425 1281684 1283662 1286366
52156 1286366 1288722 1290706 1292899 1295260 1296960 1297335 1296511 1295148 1293942 1293315 1293253 1293463 1293866 1294818 1296615 1298949
52140 1298949 1301058 1302208 1301948 1300216 1297516 1294690 1292181 1289794 1287414 1285548 1284805 1285259 1286865 1290099 1295568
52125 1295568 1303219 1312607 1323767 1337115 1352546 1369278 1386731 1405051 1424722 1446079 1469117 1493309
52113 1493309 1517645 1541332 1564430 1587329 1609800 1631251 1651785 1672207 1692874 1713334 1733262
52102 1733262 1752949 1772585 1791851 1810642 1829431 1848287 1866135 1881680 1894642 1905416 1913825
52091 1913825 1918923 1919922 1916714 1909570 1898873 1885297 1869821 1853432 1836886 1820696 1805133 1790337
$$ packed form
52184A416369M185J839p13k898m653o387q222r530r712r226r100r507r568q766
52170A334111p774p351p215o652n652m721l984l253k618k140j326K59J978K704
52156A286366K356J984K193K361J700L75q24j363j206o27o2K10M03R52J797K334
52140A298949K109J150k60j732k700k826k509k387k380j866p43M54J606L234N469
52125A295568P651R388J1160J3348J5431J6732J7453J8320J9671K1357K3038K4192
52113A493309K4336K3687K3098K2899K2471K1451K0534K0422K0667K0460J9928
52102A733262J9687J9636J9266J8791J8789J8856J7848J5545J2962J0774Q409
52091A913825N098R99l208p144j0697j3576j5476j6389j6546j6190j5563j4796
$$ plain form
52079 1790337 1776548 1764118 1753138 1743352 1734637 1727290 1721602 1717439 1714643 1713514 1714437 1717242 1721496
52066 1721496 1727339 1735473 1746294 1759448 1774261 1790120 1806362 1822357 1838047 1854019 1870708 1887669
52054 1887669 1903888 1918642 1931841 1943634 1953929 1962269 1968108 1971181 1971638 1969757 1965532 1958667 1949017
$$ packed form
52079A790337j3789j2430j0980r786q715p347n688m163k796j129R23K805M254
52066A721496N843Q134J0821J3154J4813J5859J6242J5995J5690J5972J6689J6961
52054A887669J6219J4754J3199J1793J0295Q340N839L073M57j881m225o865r650
$$ [...]
##END NTUPLES=NMR SPECTRUM
##END=
