
##TITLE=UV1280_M1_1242-1388_30_7534315_PKF8gpDg69
##JCAMPDX= 6.0         $$ Bruker NMR JCAMP-DX V2.0
##DATA TYPE= NMR SPECTRUM
##DATA CLASS= NTUPLES
##ORIGIN= BRUKER
##OWNER= Administrator
$$ 1.72 TOPSPIN		Version 2.1
$$ 2013-02-22 02:15:31.166 -0500  Administrator@X
$$ Compression mode = diff/dup
##.OBSERVE FREQUENCY= 400.02188249412
##.OBSERVE NUCLEUS= ^1H
##.ACQUISITION MODE= SIMULTANEOUS (DQD)
##.ACQUISITION SCHEME= undefined
##.AVERAGES= 64
##.DIGITISER RES= 22
##SPECTROMETER/DATA SYSTEM= spect
##.PULSE SEQUENCE= noesygpps1d.comp
##.SOLVENT NAME= COFFEE_meoh
##.SHIFT REFERENCE= INTERNAL, COFFEE_meoh, 1, 14.96148
##AUDIT TRAIL= $$ (NUMBER, WHEN, WHO, WHERE, PROCESS, VERSION, WHAT)
$$ ##TITLE= Audit trail, TOPSPIN		Version 2.1
$$ ##JCAMPDX= 5.01
$$ ##ORIGIN= Bruker BioSpin GmbH
$$ ##OWNER= Administrator
$$ $$ E:\/data/COFFEE/nmr/UV1280_M1_1242-1388_30_7534315_PKF8gpDg69/12/pdata/1/auditp.txt
$$ ##AUDIT TRAIL=  $$ (NUMBER, WHEN, WHO, WHERE, PROCESS, VERSION, WHAT)
(   1,<2013-02-22 02:15:25.010 -0500>,<Administrator>,<X>,<go>,<TOPSPIN 2.1>,
      <created by zg
	started at 2013-02-22 02:03:54.544 -0500,
	POWCHK enabled, PULCHK disabled,
       configuration hash MD5:
       86 BA 57 50 F2 9D 5C 9B 26 00 A9 28 5F 66 2E 89
       data hash MD5: 64K
       A3 99 68 24 DB C7 E4 BC 46 72 D0 0E 9D 8C D4 6E>)
(   2,<2013-02-22 02:15:28.307 -0500>,<Administrator>,<X>,<proc1d>,<TOPSPIN 2.1>,
      <Start of raw data processing
       efp LB = 0.3 FT_mod = 6 PKNL = 1 PHC0 = 0 PHC1 = 0 SI = 128K 
       data hash MD5: 128K
       9C 92 24 FD EE 88 5D FA 16 9A 89 34 D0 32 86 06>)
(   3,<2013-02-22 02:15:29.447 -0500>,<Administrator>,<X>,<proc1d>,<TOPSPIN 2.1>,
      <pk PHC0 = 250.1038 PHC1 = 0 
       data hash MD5: 128K
       52 20 8F EB 8E D1 9E 88 22 1D BD AC 14 68 4B 8F>)
(   4,<2013-02-22 02:15:30.151 -0500>,<Administrator>,<X>,<proc1d>,<TOPSPIN 2.1>,
      <abs ABSG = 1 
       data hash MD5: 128K
       16 25 B5 80 A3 6C E8 98 5A 18 9A 51 26 C8 A2 34>)
(   5,<2013-02-22 02:15:30.354 -0500>,<Administrator>,<X>,<proc1d>,<TOPSPIN 2.1>,
      <abs ABSG = 2 
       data hash MD5: 128K
       05 3A DC E6 5E 0F 22 07 0E 08 14 E1 02 8D 49 A0>)
(   6,<2013-02-22 02:15:30.510 -0500>,<Administrator>,<X>,<proc1d>,<TOPSPIN 2.1>,
      <abs ABSG = 3 
       data hash MD5: 128K
       08 1E 95 9E E2 92 41 DE BC EC C3 E3 2E EC 9F 42>)
(   7,<2013-02-22 02:15:30.666 -0500>,<Administrator>,<X>,<proc1d>,<TOPSPIN 2.1>,
      <abs ABSG = 4 
       data hash MD5: 128K
       71 72 B4 EC 9E 5C 35 DF 65 B2 A4 3E D0 8F 56 E7>)
(   8,<2013-02-22 02:15:30.807 -0500>,<Administrator>,<X>,<proc1d>,<TOPSPIN 2.1>,
      <abs ABSG = 5 
       data hash MD5: 128K
       32 48 31 E3 E2 42 C5 83 8D 59 49 0A FD 0D 37 CF>)
$$ ##END=
$$ 
$$ $$ hash MD5
$$ $$ 9E 7C 97 96 21 9B 0E 28 B1 3F 35 1C 22 1C 8D 8F
##$RELAX= 
##$RELAX= 
##$RELAX= 
##$RELAX= 
##$RELAX= 
##$RELAX= 
##$RELAX= 
##$RELAX= 
$$ Bruker specific parameters
$$ --------------------------
##$DU= <E:\>
##$EXPNO= 12
$$ [...]
150 150 150 150 150 150 150 150
##$TP07= 0
##$TPNAME0= <>
##$TPNAME1= <>
##$TPNAME2= <>
##$TPNAME3= <>
##$TPNAME4= <>
##$TPNAME5= <>
##$TPNAME6= <>
##$TPNAME7= <>
##$TPOAL= (0..7)
0.5 0.5 0.5 0.5 0.5 0.5 0.5 0.5
##$TPOFFS= (0..7)
0 0 0 0 0 0 0 0
##$TUNHIN= 0
##$TUNHOUT= 0
##$TUNXOUT= 0
##$USERA1= <user>
##$USERA2= <user>
##$USERA3= <user>
##$USERA4= <user>
##$USERA5= <user>
##$V9= 5
##$VALIST= <valist>
##$VCLIST= <CCCCCCCCCCCCCCC>
##$VD= 0
##$VDLIST= <DDDDDDDDDDDDDDD>
##$VPLIST= <PPPPPPPPPPPPPPP>
##$VTLIST= <TTTTTTTTTTTTTTT>
##$WBST= 1024
##$WBSW= 4
##$XGAIN= (0..3)
0 0 0 0
##$XL= 0
##$YL= 0
##$YMAX_a= 6636767
##$YMIN_a= -12254266
##$ZGOPTNS= <>
##$ZL1= 120
##$ZL2= 120
##$ZL3= 120
##$ZL4= 120
##$ABSF1= 14.96148
##$ABSF2= -5.596702
##$ABSG= 5
##$ABSL= 3
##$ALPHA= 0
##$AQORDER= 0
##$ASSFAC= 0
##$ASSFACI= 0
##$ASSFACX= 0
##$ASSWID= 0
##$AUNMP= <proc_prof1d_extract.lims>
##$AXLEFT= 0
##$AXNAME= <>
##$AXNUC= <1H>
##$AXRIGHT= 0
##$AXTYPE= 0
##$AXUNIT= <>
##$AZFE= 0.1
##$AZFW= 0.1
##$BCFW= 0
##$BC_mod= 0
##$BYTORDP= 0
##$COROFFS= 0
##$CY= 15
##$DATMOD= 1
##$DC= 0
##$DFILT= <>
##$DTYPP= 0
##$F1P= 0
##$F2P= 0
##$FCOR= 0.5
##$FTSIZE= 131072
##$FT_mod= 6
##$GAMMA= 0
##$GB= 0
##$INTBC= 1
##$INTSCL= 1
##$ISEN= 128
##$LB= 0.3
##$LEV0= 0
##$LPBIN= 0
##$MAXI= 10000
##$MC2= 0
##$MEAN= 0
##$ME_mod= 0
##$MI= 0
##$NCOEF= 0
##$NC_proc= -2
##$NLEV= 6
##$NOISF1= 0
##$NOISF2= 0
##$NSP= 0
##$NTH_PI= 0
##$NZP= 0
##$OFFSET= 14.96148
##$PC= 1
##$PHC0= 250.1038
##$PHC1= 0
##$PH_mod= 1
##$PKNL= yes
##$PPARMOD= 0
##$PPDIAG= 0
##$PPIPTYP= 0
##$PPMPNUM= 2147483647
##$PPRESOL= 1
##$PSCAL= 4
##$PSIGN= 0
##$PYNMP= <proc.py>
##$REVERSE= no
##$SF= 400.020009444587
##$SI= 131072
##$SIGF1= 0
##$SIGF2= 0
##$SINO= 400
##$SIOLD= 131072
##$SPECTYP= <>
##$SREGLST= <1H.CDCl3>
##$SSB= 0
##$STSI= 131072
##$STSR= 0
##$SW_p= 8223.68421052631
##$SYMM= 0
##$S_DEV= 0
##$TDeff= 65536
##$TDoff= 0
##$TI= <>
##$TILT= no
##$TM1= 0
##$TM2= 0
##$TOPLEV= 0
##$USERP1= <user>
##$USERP2= <user>
##$USERP3= <user>
##$USERP4= <user>
##$USERP5= <user>
##$WDW= 1
##$XDIM= 131072
##$YMAX_p= 438119544
##$YMIN_p= -11490
##$CURPLOT= <Network HP LaserJet P1505>
##$CURPRIN= <$Network HP LaserJet P1505>
##$DFORMAT= <normdp>
##$LAYOUT= <+/1D_H.xwp>
##$LFORMAT= <normlp>
##$PFORMAT= <normpl>
##$SURQMSG= 1
$$ End of Bruker specific parameters
$$ ---------------------------------
##NTUPLES= NMR SPECTRUM
##VAR_NAME=  FREQUENCY,     SPECTRUM/REAL,   SPECTRUM/IMAG
##SYMBOL=    X,             R,               I
##VAR_TYPE=  INDEPENDENT,   DEPENDENT,       DEPENDENT
##VAR_FORM=  AFFN,          ASDF,            ASDF
##VAR_DIM=   131072,        131072,          131072
##UNITS=     HZ,            ARBITRARY UNITS, ARBITRARY UNITS
##FACTOR=    0.0627417313425164, 1,          1
##FIRST=     8223.62146879497, 829,          -69966
##LAST=      0,             2704,            -70506
##MIN=       0,             -11490,          0
##MAX=       8223.62146879497, 438119544,    0
$$ Real data points
##PAGE= N=1
##DATA TABLE= (X++(R..R)), XYDATA
$$ [...]
$$ plain form
63809 440076 430276 421376 412845 404502 396988 391182 387119 383832 380250 375941 371041 365913 360941 356183
63795 356183 351074 344903 337835 331072 325641 321357 317372 313448 310105 307621 305520 303248 300862 298761
63781 298761 297097 295791 294825 294057 292970 291108 288818 287109 286580 286806 286929 286554 285884 285198 284508 283646 282445
63764 282445 280856 279045 277309 275849 274689 273870 273488 273392 273088 272215 271027 270162 269903 269881 269475 268398 266933
63747 266933 265738 265381 265940 267062 268427 269988 271731 273502 275261 277306 279955 283143 286630 290407 294497
63732 294497 298437 301426 303136 304097 305156 306786 309027 311834 315213 319085 323225 327472 331921 336811
63718 336811 342162 347648 352962 358175 363439 368415 372410 375118 376750 377326 376356 373630 369827 365871 362023
63703 362023 358096 354260 351078 348924 347849 347772 348339 348843 348893 348931 349597 350883 352561 355040 358770 363001
$$ packed form
63809D40076r800q900q531q343p514n806m063l287l582m309m900n128m972m758
63795C56183n109o171p068o763n431m284l985l924l343k484k101k272k386k101
63781B98761j664j306r66p68j087j862k290j709n29K26J23l75o70o86o90q62j201
63764B82445j589j811j736j460j160q19l82r6l04q73j188q65k59k2m06j077j465
63747B66933j195l57N59J122J365J561J743J771J759K045K649L188L487L777M090
63732B94497L940K989J710R61J059J630K241K807L379L872M140M247M449M890
63718C36811N351N486N314N213N264M976L995K708J632N76r70k726l803l956l848
63703C62023l927l836l182k154j075p7N67N04N0L8O66J286J678K479L730M231
$$ plain form
63687 363001 366234 368055 369479 371233 372779 373506 373867 374646 375825 376917 377815 378617 379121 379216 379379 380091 381043
63670 381043 381594 381801 382419 384014 386572 389799 393323 396749 399923 402982 405799 407640 407774 406173 403193
63655 403193 398913 393344 387029 380818 375112 369803 364785 360007 355285 350641 346658 343869 341906 339986
63641 339986 338204 337611 338823 341266 344053 347048 350698 355250 360414 365564 370060 373649 376782 380297
63627 380297 384667 389731 395154 400784 406529 412372 418766 426596 436413 447841 459990 472298 484909
63614 484909 498439 513542 530487 548997 568623 589353 611608 635665 661479 689153 719031
63603 719031 750887 783357 814629 843446 868984 890008 904906 912783 914121 910212 902381 892003
63591 892003 880802 870488 861956 854958 848469 841143 831626 818992 803148 784660 764046 741447
$$ packed form
63687C63001L233J821J424J754J546P27L61P79J179J092Q98Q02N04R5J63P12R52
63670C81043N51K07O18J595K558L227L524L426L174L059K817J841J34j601k980
63655D03193m280n569o315o211n706n309n018m778m722m644l983k789j963j920
63641C39986j782n93J212K443K787K995L650M552N164N150M496L589L133L515
63627C80297M370N064N423N630N745N843O394P830R817J1428J2149J2308J2611
63614D84909J3530J5103J6945J8510J9626K0730K2255K4057K5814K7674K9878
63603G19031L1856L2470L1272K8817K5538K1024J4898P877J338l909p831j0378
63591H92003j1201j0314q532o998o489p326r517j2634j5844j8488k0614k2599
$$ plain form
63579 741447 717112 691894 666974 643236 621227 601554 584888 571472 560932 552693 546417 542036
63567 542036 539636 539368 541196 544638 548989 553859 559256 565140 571287 577685 584591 591986 599482 607101
63553 607101 615726 626311 639045 653825 671237 692315 717418 746106 778247 814634 856182 902862
63541 902862 953482 1005707 1055654 1097915 1127112 1140273 1138068 1124016 1102741 1078680 1055535 1035851
63529 1035851 1020569 1009110 1000281 993144 986864 979921 970036 955212 934724 908985 878873 845488
63517 845488 810233 774546 739450 705656 673974 645180 619420 596109 574649 555019 537493
63506 537493 521969 507849 494594 482211 471074 461294 452441 444015 436063 429058 423226 418360 414333
63493 414333 411318 409212 407239 404679 401793 399567 398586 398531 398819 399325 400359 402130 404381 406580 408562
$$ packed form
63579G41447k4335k5218k4920k3738k2009j9673j6666j3416j0540q239o276m381
63567E42036k400k68J828L442M351M870N397N884O147O398O906P395P496P619
63553F07101Q625J0585J2734J4780J7412K1078K5103K8688L2141L6387M1548M6680
63541I02862N0620N2225M9947M2261K9197J3161k205j4052k1275k4061k3145j9684
63529A035851j5282j1459q829p137o280o943r885j4824k0488k5739l0112l3385
63517H45488l5255l5687l5096l3794l1682k8794k5760k3311k1460j9630j7526
63506E37493j5524j4120j3255j2383j1137r780q853q426p952p005n832m866m027
63493D14333l015k106j973k560k886k226r81n5K88N06J034J771K251K199J982
$$ plain form
63478 408562 411021 415020 420814 427512 434186 440886 448004 454958 460388 463716 465812 467793 469703 470673
63464 470673 469964 467537 463881 459599 455055 450187 444826 439282 434358 430668 428169 426500 425524 425280 425619
63449 425619 426205 426901 427985 429935 433061 437423 443136 450607 460208 471595 483686 495618 507605 520647
63435 520647 535694 553554 575369 602538 635973 675639 720475 767957 813653 852175 879463
63424 879463 894370 898229 893555 883450 871552 861556 856315 857293 864693 878053 896969 921431 951245
63411 951245 985132 1020699 1055396 1087094 1113708 1133026 1143606 1145687 1140814 1130780 1117287 1102225
63399 1102225 1087433 1073890 1061487 1049661 1037877 1025232 1009946 989863 963878 932891 899115
63388 899115 864314 828886 792828 757151 723688 693536 666376 641597 619415 600394 584384
$$ packed form
63478D08562K459L999N794O698O674O700P118O954N430L328K096J981J910R70
63464D70673p09k427l656m282m544m868n361n544m924l690k499j669r76k44L39
63449D25619N86O96J084J950L126M362N713P471R601J1387J2091J1932J1987J3042
63435E20647J5047J7860K1815K7169L3435L9666M4836M7482M5696L8522K7288
63424H79463J4907L859m674j0105j1898r996n241R78P400J3360J8916K4462K9814
63411I51245L3887L5567L4697L1698K6614J9318J0580K081m873j0034j3493j5062
63399A102225j4792j3543j2403j1826j1784j2645j5286k0083k5985l0987l3776
63388H99115l4801l5428l6058l5677l3463l0152k7160k4779k2182j9021j6010
$$ plain form
63377 584384 570701 559164 550272 544318 540894 539393 539563 541352 544602 549160 555080 562557 571804 583146
63363 583146 596973 613369 631885 651970 673610 697350 723648 752422 783359 816501 852286
63352 852286 890941 931949 973989 1015218 1053569 1087106 1114350 1134316 1146302 1150072 1146428 1137302
63340 1137302 1124876 1110762 1096205 1082586 1070915 1060736 1050160 1037171 1020617 1000034 975265
63329 975265 946655 915200 882114 848493 815539 784629 756771 732279 711300 694347 681971
63318 681971 674247 671072 672626 678672 687043 693206 691917 679889 657420 627908 595824 564792 536997
63305 536997 513454 494169 478200 464360 452187 441850 433174 425493 418726 413721 410891 409121 406805
63292 406805 403527 399954 396500 393024 389632 386753 384330 381873 379478 377933 377373 376626 374462 371053 367641
$$ packed form
63377E84384j3683j1537q892n954l424j501J70J789L250M558N920P477R247J1342
63363E83146J3827J6396J8516K0085K1640K3740K6298K8774L0937L3142L5785
63352H52286L8655M1008M2040M1229L8351L3537K7244J9966J1986L770l644r126
63340A137302j2426j4114j4557j3619j1671j0179j0576j2989j6554k0583k4769
63329I75265k8610l1455l3086l3621l2954l0910k7858k4492k0979j6953j2376
63318F81971p724l175J554O046Q371O163j289j2028k2469k9512l2084l1032k7795
63305E36997k3543j9285j5969j3840j2173j0337q676p681o767n005k830j770k316
63292D06805l278l573l454l476l392k879k423k457k395j545n60p47k164l409l412
$$ plain form
63277 367641 365125 363476 362313 361503 361155 361332 361873 362479 363098 364202 366342 369342 372251 374248 375241 375454
63261 375454 374994 374270 374361 376169 379287 382361 384691 386918 389998 394087 398729 403606 408558 413249 417545
63246 417545 422117 427990 435288 442988 450200 457246 465056 473902 483295 492958 503287 514870 528107
63233 528107 543445 561371 581785 603726 626170 648995 672807 697959 723989 750020 775466
63222 775466 800327 824957 849590 874093 898253 922240 946518 971242 996096 1020962 1046346
63211 1046346 1072685 1099281 1124342 1146129 1163810 1177203 1186023 1189562 1187002 1177924 1162538 1141414
63199 1141414 1115069 1084007 1049237 1012488 975617 939897 906008 874544 846310 822216 803105
63188 803105 789418 780748 775891 773778 774388 778417 786238 797675 812691 831548 853919 878409 903544
$$ packed form
63277C67641k516j649j163q10l48J77N41O06O19J104K140L000K909J997R93K13
63261C75454m60p24R1J808L118L074K330K227L080M089M642M877M952M691M296
63246D17545M572N873P298P700P212P046P810Q846R393R663J0329J1583J3237
63233E28107J5338J7926K0414K1941K2444K2825K3812K5152K6030K6031K5446
63222G75466K4861K4630K4633K4503K4160K3987K4278K4724K4854K4866K5384
63211A046346K6339K6596K5061K1787J7681J3393Q820L539k560r078j5386k1124
63199A141414k6345l1062l4770l6749l6871l5720l3889l1464k8234k4094j9111
63188H03105j3687q670m857k113O10M029P821J1437J5016J8857K2371K4490K5135
$$ plain form
63175 903544 929037 955587 983472 1011830 1039415 1065666 1090785 1115105 1138742 1161710 1183864
63164 1183864 1204541 1222593 1237139 1248099 1255618 1259057 1257000 1248355 1233090 1211728 1184609 1152034
63152 1152034 1114855 1074386 1031744 987665 943031 899260 857918 819976 785468 753856 724749
63141 724749 698346 675107 655068 637659 622245 608601 596787 586822 578660 572205 567129 562930
63129 562930 559405 556836 555449 554996 555137 555902 557386 559318 561417 563916 567129 570723 574083 577246 580739
63114 580739 584514 587820 590359 592815 595865 599267 602318 604699 606422 607385 607555 607319 607160 607084 606712 605864
63098 605864 604791 603933 603699 604318 605655 607288 608970 610835 612966 615035 616683 618093 619811 622086 624677
63083 624677 627156 629046 629844 629401 628346 627681 627770 628062 628044 628200 629671 633036 637719 642707 647636 652965
$$ packed form
63175I03544K5493K6550K7885K8358K7585K6251K5119K4320K3637K2968K2154
63164A183864K0677J8052J4546J0960P519L439k057q645j5265k1362k7119l2575
63152A152034l7179m0469m2642m4079m4634m3771m1342l7942l4508l1612k9107
63141G24749k6403k3239k0039j7409j5414j3644j1814r965q162o455n076m199
63129E62930l525k569j387m53J41P65J484J932K099K499L213L594L360L163L493
63114E80739L775L306K539K456L050L402L051K381J723R63J70k36j59p6l72q48
63098F05864j073q58k34O19J337J633J682J865K131K069J648J410J718K275K591
63083F24677K479J890P98m43j055o65Q9K92j8J56J471L365M683M988M929N329
$$ plain form
63067 652965 659211 666392 674413 683682 694867 708075 722712 738365 755411 774448 795467 818043
63055 818043 842191 868571 897852 930258 965747 1004295 1045908 1090712 1139100 1191419 1247255
63044 1247255 1305370 1364638 1424878 1486459 1549264 1612406 1674871 1736127 1796135 1855062 1913096
63033 1913096 1970333 2026754 2082352 2137176 2191001 2243108 2292645 2339044 2381488 2417851 2444838
63022 2444838 2459601 2460972 2448913 2423391 2384454 2333067 2271129 2200719 2123862 2042925 1960488
63011 1960488 1878707 1799351 1724520 1656596 1597220 1546817 1505375 1473035 1449689 1434769 1427961
63000 1427961 1429599 1439755 1457461 1481397 1510888 1545490 1584043 1625055 1667861 1712548 1758802
62989 1758802 1805655 1852477 1899416 1946654 1993865 2040626 2086638 2131163 2172755 2209928 2241740
$$ packed form
63067F52965O246P181Q021R269J1185J3208J4637J5653J7046J9037K1019K2576
63055H18043K4148K6380K9281L2406L5489L8548M1613M4804M8388N2319N5836
63044A247255N8115N9268O0240O1581O2805O3142O2465O1256O0008N8927N8034
63033A913096N7237N6421N5598N4824N3825N2107M9537M6399M2444L6363K6987
63022B444838J4763J371j2059k5522l8937n1387o1938p0410p6857q0937q2437
63011A960488q1781p9356p4831o7924n9376n0403m1442l2340k3346j4920o808
63000A427961J638J0156J7706K3936K9491L4602L8553M1012M2806M4687M6254
62989A758802M6853M6822M6939M7238M7211M6761M6012M4525M1592L7173L1812
$$ plain form
62978 2241740 2267423 2285750 2295043 2293575 2279895 2253243 2213938 2163060 2101635 2030584 1951692 1868024
62966 1868024 1782752 1697764 1613779 1531578 1452573 1378240 1309420 1246242 1188442 1135606 1087290
62955 1087290 1043014 1002256 964596 929878 898066 868887 841873 816751 793472 771674 750571
62944 750571 729784 710010 692361 677015 662943 649057 635337 622642 611591 601833 592430 582819
62932 582819 573353 564951 558261 553194 549161 545634 542475 539818 537696 535787 533634 531095 528467 526089
62918 526089 523988 521977 519923 517777 515635 513976 513500 514349 515699 516588 516937 517239 517463 517004 515751 514417
62902 514417 513536 512749 511444 509635 507817 506315 505166 504353 503804 503290 502571 501523 500161 498768 497914 497780
62886 497780 497522 496032 493564 491809 491965 493435 494997 496525 498694 501512 504103 505805 506666 506907 506586
$$ packed form
62978B241740K5683J8327R293j468j3680k6652l9305n0878o1425p1051p8892q3668
62966A868024q5272q4988q3985q2201p9005p4333o8820o3178n7800n2836m8316
62955A087290m4276m0758l7660l4718l1812k9179k7014k5122k3279k1798k1103
62944G50571k0787j9774j7649j5346j4072j3886j3720j2695j1051r758r403r611
62932E82819r466q402o690n067m033l527l159k657k122j909k153k539k628k378
62918E26089k101k011k054k146k142j659m76Q49J350Q89L49L02K24m59j253j334
62902E14417q81p87j305j809j818j502j149q13n49n14p19j048j362j393q54j34
62886D97780k58j490k468j755J56J470J562J528K169K818K591J702Q61K41l21
$$ plain form
62871 506586 505806 504688 503107 500966 498650 496675 494945 492930 490504 488081 485945 484092 482730 482179 482100
62856 482100 481523 479946 477945 476450 475915 476380 477731 479426 480505 480438 479697 479105 478872 478727 478693 479100 479873
62839 479873 480348 479995 478987 477948 477320 477081 476869 476270 475163 473934 473262 473547 474562 475741 476824 478123
62823 478123 480159 483049 486338 489422 492089 494626 497453 500648 503770 506166 507614 508775 510846 514560
62809 514560 519553 524852 529918 535004 540530 546471 552470 558304 564029 569875 576283 583920 593239 603937
62795 603937 615187 626589 638566 651576 665324 679325 694088 710956 730630 752560 776223
62784 776223 802397 832548 867475 907317 952492 1003579 1060297 1121725 1187812 1259747 1338349
62773 1338349 1422819 1511640 1603998 1699626 1797733 1896815 1995124 2090498 2179878 2259797 2327449
$$ packed form
62871E06586p80j118j581k141k316j975j730k015k426k423k136j853j362n51p9
62856D82100n77j577k001j495n35M65J351J695J079o7p41n92k33j45l4M07P73
62839D79873M75l53j008j039o28k39k12n99j107j229o72K85J015J179J083J299
62823D78123K036K890L289L084K667K537K827L195L122K396J448J161K071L714
62809E14560M993N299N066N086N526N941N999N834N725N846O408P637R319J0698
62795F03937J1250J1402J1977J3010J3748J4001J4763J6868J9674K1930K3663
62784G76223K6174L0151L4927L9842M5175N1087N6718O1428O6087P1935P8602
62773A338349Q4470Q8821R2358R5628R8107R9082R8309R5374Q9380P9919O7652
$$ plain form
62762 2327449 2380953 2418827 2439779 2442999 2428191 2395526 2346108 2282308 2206953 2122156 2029492
62751 2029492 1931204 1830456 1730132 1631941 1536845 1445789 1359671 1279078 1204392 1135922 1073693
62740 1073693 1017363 966528 920888 880054 843482 810693 781324 755014 731618 711503 695068
62729 695068 681845 670546 660186 650750 642606 635869 630607 627102 625396 624919 625024 625601 626867 628903
62715 628903 631885 636395 642977 651573 661856 673895 687975 703957 721473 740697 762328 786788
62703 786788 814095 844709 879815 920324 966030 1016177 1070533 1129447 1193126 1261492 1334701
62692 1334701 1413216 1497154 1585894 1678419 1773574 1869635 1963961 2053528 2135676 2208004 2267766
62681 2267766 2312025 2338677 2347022 2337220 2309630 2264958 2204745 2131305 2047291 1955518 1858902 1760060
$$ packed form
62762B327449N3504L7874K0952L220j4808l2665m9418o3800p5355q4797r2664
62751B029492r8288j00748j00324r8191r5096r1056q6118q0593p4686o8470o2229
62740A073693n6330n0835m5640m0834l6572l2789k9369k6310k3396k0115j6435
62729F95068j3223j1299j0360r436q144o737n262l505j706m77J05N77J266K036
62715F28903K982M510O582Q596J0283J2039J4080J5982J7516J9224K1631K4460
62703G86788K7307L0614L5106M0509M5706N0147N4356N8914O3679O8366P3209
62692A334701P8515Q3938Q8740R2525R5155R6061R4326Q9567Q2148P2328N9762
62681B267766M4259K6652Q345r802k7590m4672o0213p3440q4014r1773r6616r8842
$$ plain form
62669 1760060 1660940 1563100 1468245 1378126 1293886 1215852 1144007 1078374 1018838 964967 916274
62658 916274 872501 833459 798659 767320 738818 713131 690696 671711 655592 641231 627760
62647 627760 614815 602162 589607 577491 566682 557607 549651 542063 535095 529593 525723 522897 520825
62634 520825 519703 519313 518877 518105 517539 517354 516577 514165 510320 506095 502116 498417 495256 493235 492555 492683
62618 492683 492942 493118 493408 494028 494923 495801 496535 497564 499575 502704 506442 510526 515364 521154 527140 532527
62602 532527 537921 545043 554991 567402 581383 596669 613656 632879 654808 679878 708444 740809
62590 740809 777231 817611 861176 906870 954085 1002658 1052035 1100898 1147693 1191073 1229599
62579 1229599 1261492 1285134 1299656 1304799 1300559 1287249 1265668 1236770 1201315 1160157 1114764 1067078
$$ packed form
62669A760060r9120r7840r4855r0119q4240p8034p1845o5633n9536n3871m8693
62658I16274m3773l9042l4800l1339k8502k5687k2435j8985j6119j4361j3471
62647F27760j2945j2653j2555j2116j0809r075p956p588o968n502l870k826k072
62634E20825j122l90m36p72n66j85p77k412l845m225l979l699l161k021o80J28
62618D92683K59J76K90O20Q95Q78P34J029K011L129L738M084M838N790N986N387
62602E32527N394P122R948J2411J3981J5286J6987J9223K1929K5070K8566L2365
62590G40809L6422M0380M3565M5694M7215M8573M9377M8863M6795M3380L8526
62579A229599L1893K3642J4522N143m240j3310k1581k8898l5455m1158m5393m7686
$$ plain form
62567 1067078 1018897 971592 926184 883228 842622 804027 767651 734324 704696 678641 655601
62556 655601 635236 617479 602172 588986 577621 567758 558802 550024 541162 532743 525619 520182 516160
62543 516160 513092 510778 509205 508227 507557 507149 507413 508857 511448 514387 516657 517811 518186 518380 518752 519501
62527 519501 520988 523604 527364 532108 538183 546482 557422 570261 584022 598923 616297 637040 660808
62514 660808 686948 715549 747148 781971 820162 862364 909181 960118 1013774 1069184 1126164
62503 1126164 1184055 1240910 1294425 1343144 1386181 1422212 1449605 1467423 1475744 1475105 1466286 1450679
62491 1450679 1430273 1407092 1382942 1359640 1338849 1321523 1307921 1298319 1293214 1292690 1296192 1303225
62479 1303225 1313702 1327005 1340960 1352313 1358230 1357315 1349649 1336355 1318753 1297180 1270452 1236776
$$ packed form
62567A067078m8181m7305m5408m2956m0606l8595l6376l3327k9628k6055k3040
62556F55601k0365j7757j5307j3186j1365r863q956q778q862q419p124n437m022
62543E16160l068k314j573r78o70m08K64J444K591K939K270J154L75J94L72P49
62527E19501J487K616L760M744O075Q299J0940J2839J3761J4901J7374K0743K3768
62514F60808K6140K8601L1599L4823L8191M2202M6817N0937N3656N5410N6980
62503A126164N7891N6855N3515M8719M3037L6031K7393J7818Q321o39q819j5607
62491A450679k0406k3181k4150k3302k0791j7326j3602r602n105n24L502P033
62479A303225J0477J3303J3955J1353N917r15p666j3294j7602k1573k6728l3676
$$ plain form
62467 1236776 1195337 1147032 1094037 1039037 984463 931709 880935 831952 785325 742266 703607
62456 703607 669351 639245 613165 590856 571786 555572 542164 531390 522695 515682 510594 507832
62444 507832 507068 507173 507098 506688 506606 507551 509561 512041 514456 516885 519817 523472 527468 531093 533706 534918
62428 534918 534641 533031 530292 526477 521556 515630 508952 501855 494786 488235 482335 476680 470865 465124
62414 465124 460112 456070 452612 449322 446173 443306 440816 438858 437544 436571 435291 433403 431320 429649
62400 429649 428542 427770 427285 427503 429005 431949 435672 439082 441723 444383 448244 453441 458941 463865 468473
62385 468473 473607 479645 486245 492815 499018 505026 511460 518796 526752 534570 541928 549157 556494 563718
62371 563718 570732 577887 585364 592770 599843 607165 615660 625682 637070 649880 664669 682255 703473
$$ packed form
62467A236776m1439m8305n2995n5000n4574n2754n0774m8983m6627m3059l8659
62456G03607l4256l0106k6080k2309j9070j6214j3408j0774q695p013n088k762
62444E07832p64J05p5m10q2R45K010K480K415K429K932L655L996L625K613J212
62428E34918k77j610k739l815m921n926o678p097p069o551n900n655n815n741
62414D65124n012m042l458l290l149k867k490j958j314r73j280j888k083j671
62400D29649j107p72m85K18J502K944L723L410K641K660L861N197N500M924M608
62385D68473N134O038O600O570O203O008O434P336P956P818P358P229P337P224
62371E63718P014P155P477P406P073P322Q495J0022J1388J2810J4789J7586K1218
$$ plain form
62358 703473 728886 758408 791567 828460 869984 916678 967790 1022033 1078748 1137603 1197506
62347 1197506 1256600 1313011 1364690 1408791 1442536 1465170 1478324 1484096 1483408 1476432 1463604 1445415
62335 1445415 1421683 1391935 1356495 1316649 1273750 1228639 1182082 1135370 1090082 1047213 1006758
62324 1006758 968244 931595 897246 865513 836151 808728 783007 758704 735178 711885 689081
62313 689081 667632 648151 630635 614891 600862 588446 577361 567364 558430 550659 544182 539098
62301 539098 535348 532689 530966 530214 530231 530394 530345 530649 532136 534713 537478 540004 542780 546201 549840 553074
62285 553074 555819 558282 560491 562516 564692 567119 569268 570578 571134 571305 571086 570411 569916 570645 572875 575791
62269 575791 578542 581273 584935 590411 598042 607754 619378 632850 648343 666269 687172 711549 739744
$$ packed form
62358G03473K5413K9522L3159L6893M1524M6694N1112N4243N6715N8855N9903
62347A197506N9094N6411N1679M4101L3745K2634J3154N772o88o976j2828j8189
62335A445415k3732k9748l5440l9846m2899m5111m6557m6712m5288m2869m0455
62324A006758l8514l6649l4349l1733k9362k7423k5721k4303k3526k3293k2804
62313F89081k1449j9481j7516j5744j4029j2416j1085r997q934p771o477n084
62301E39098l750k659j723p52J7J63m9L04J487K577K765K526K776L421L639L234
62285E53074K745K463K209K025K176K427K149J310N56J71k19o75m95P29K230K916
62269E75791K751K731L662N476P631R712J1624J3472J5493J7926K0903K4377K8195
$$ plain form
62256 739744 771966 808438 849479 895353 946019 1001122 1060182 1122518 1186836 1251007 1312379
62245 1312379 1368274 1416283 1454489 1481785 1497993 1503573 1499317 1486366 1466142 1439761 1407458 1368808
62233 1368808 1323621 1272516 1216803 1158201 1098739 1040538 985234 933588 885778 842060 802953
62222 802953 768760 739077 712953 689529 668440 649666 633198 618968 606861 596521 587193 578138
62210 578138 569356 561593 555385 550285 545361 540349 535990 533103 531701 531180 531132 531675 533065 535323 538282
62195 538282 541793 545804 550386 555769 562206 569737 578187 587459 597648 608761 620562 632901 646014
62182 646014 660132 674841 689184 702563 715273 728007 740947 753460 764600 773857 781555 788635
62170 788635 796128 804919 816022 830700 849905 873717 901751 934073 971296 1013750 1061045 1112377
$$ packed form
62256G39744L2222L6472M1041M5874N0666N5103N9060O2336O4318O4171O1372
62245A312379N5895M8009L8206K7296J6208N580m256j2951k0224k6381l2303l8650
62233A368808m5187n1105n5713n8602n9462n8201n5304n1646m7810m3718l9107
62222H02953l4193k9683k6124k3424k1089j8774j6468j4230j2107j0340r328r055
62210E78138q782p763o208n100m924n012m359k887j402n21m8N43J390K258K959
62195E38282L511M011M582N383O437P531Q450R272J0189J1113J1801J2339J3113
62182F46014J4118J4709J4343J3379J2710J2734J2940J2513J1140R257P698P080
62170G88635P493Q791J1103J4678J9205K3812K8034L2322L7223M2454M7295N1332
$$ plain form
62158 1112377 1166593 1221718 1275120 1324537 1368491 1405411 1433165 1450255 1457076 1455270 1446107 1430197
62146 1430197 1408364 1381751 1350923 1315689 1276031 1232685 1186775 1139560 1092713 1048097 1006884
62135 1006884 969296 935486 906198 882277 863901 850512 841132 834554 829709 826251 824561 824989 827406
62122 827406 831610 837709 845790 855587 866818 879483 893483 908247 923138 937993 952896 967602
62110 967602 981537 994177 1004974 1012954 1016792 1015478 1008981 998485 986119 974132 963979 956211
62098 956211 951180 949295 950259 952561 954496 955676 957041 959458 962923 967227 972703 979807 988269 997136
62084 997136 1005728 1014282 1023633 1034416 1046614 1059755 1073503 1088098 1104285 1122755 1143598 1166334
62072 1166334 1190483 1216000 1242909 1270500 1297187 1321427 1342720 1361583 1378724 1394525 1409237
$$ packed form
62158A112377N4216N5125N3402M9417M3954L6920K7754J7090O821j806r163j5910
62146A430197k1833k6613l0828l5234l9658m3346m5910m7215m6847m4616m1213
62135A006884l7588l3810k9288k3921j8376j3389r380o578m845l458j690M28K417
62122H27406M204O099Q081R797J1231J2665J4000J4764J4891J4855J4903J4706
62110I67602J3935J2640J0797P980L838j314o497j0496j2366j1987j0153p768
62098I56211n031j885R64K302J935J180J365K417L465M304N476P104Q462Q867
62084I97136Q592Q554R351J0783J2198J3141J3748J4595J6187J8470K0843K2736
62072A166334K4149K5517K6909K7591K6687K4240K1293J8863J7141J5801J4712
$$ plain form
62061 1409237 1423343 1437598 1452788 1469394 1487355 1506186 1525344 1544240 1561761 1576257 1586563
62050 1586563 1592821 1595825 1595776 1592227 1584963 1574000 1558679 1537704 1510398 1477185 1438612 1394806 1346423
62037 1346423 1295262 1243148 1190736 1138066 1085782 1035101 986993 942112 901120 864273 831015
62026 831015 800725 773641 750249 730144 712407 696863 683837 672733 662026 650953 640130
62015 640130 630077 620103 609339 598167 587853 579163 571972 565980 561214 557895 556168 555951 556979
62002 556979 559238 563341 569993 578839 588393 597425 605962 614547 623029 630643 636876 641638 644816 646298
61988 646298 646301 645067 642323 637553 630771 622476 612920 602069 590411 579175 569387 561059 553535 546258
61974 546258 538982 531718 524855 519067 514662 511134 507675 503995 500323 496831 493515 490613 488576 487405
$$ packed form
62061A409237J4106J4255J5190J6606J7961J8831J9158J8896J7521J4496J0306
62050A586563O258L004m9l549p264j0963j5321k0975k7306l3213l8573m3806m8383
62037A346423n1161n2114n2412n2670n2284n0681m8108m4881m0992l6847l3258
62026H31015l0290k7084k3392k0105j7737j5544j3026j1104j0707j1073j0823
62015F40130j0053r974j0764j1172j0314q690p191n992m766l319j727k17J028
62002E56979K259M103O652Q846R554R032Q537Q585Q482P614O233M762L178J482
61988F46298Lj234k744m770o782q295r556j0851j1658j1236r788q328p524p277
61974E46258p276p264o863n788m405l528l459l680l672l492l316k902k037j171
$$ plain form
61960 487405 486360 484695 482474 480412 479055 478467 478678 479976 482500 485786 489059 491981 494951 498680 503631
61945 503631 509865 517224 525581 535085 546295 559887 576049 594267 613895 634841 657423 681580
61933 681580 706591 731667 756498 780967 804566 826514 846466 864810 882086 898185 912084
61922 912084 922365 928164 929845 928678 925564 920136 911478 899769 886872 875130 865916 859486 855776
61909 855776 854904 857237 863516 874774 891518 912855 936841 961782 986802 1011124 1033308 1051585
61897 1051585 1064603 1071600 1072264 1066899 1056612 1042851 1026672 1008626 989202 968933 948067 926577
61885 926577 904724 883311 863059 843946 825520 807772 791215 775986 761376 746661 732111
61874 732111 718577 706144 693913 681446 669825 660728 654769 651265 649391 648840 649373 650523 652156
$$ packed form
61960D87405j045j665k221k062j357n88K11J298K524L286L273K922K970L729M951
61945E03631O234P359Q357R504J1210J3592J6162J8218J9628K0946K2582K4157
61933F81580K5011K5076K4831K4469K3599K1948J9952J8344J7276J6099J3899
61922I12084J0281N799J681j167l114n428q658j1709j2897j1742r214o430l710
61909H55776q72K333O279J1258J6744K1337K3986K4941K5020K4322K2184J8277
61897A051585J3018O997O64n365j0287j3761j6179j8046j9424k0269k0866k1490
61885I26577k1853k1413k0252j9113j8426j7748j6557j5229j4610j4715j4550
61874G32111j3534j2433j2231j2467j1621r097n959l504j874n51N33J150J633
$$ plain form
61861 652156 654880 659563 666694 676414 688830 703927 721429 741066 762936 787408 814785 845187
61849 845187 878561 914641 953019 993373 1035407 1078475 1121540 1163600 1203836 1241150 1274031
61838 1274031 1301249 1322379 1337287 1345450 1346338 1340284 1328429 1311915 1291754 1269556 1247819 1229166
61826 1229166 1215443 1207485 1205321 1208386 1215857 1227057 1241386 1257797 1274480 1289226 1300040 1305428
61814 1305428 1304411 1296387 1280928 1257744 1227076 1190195 1149234 1106323 1062868 1019626 977180 936129
61802 936129 897002 860265 826477 796307 770204 747948 728565 710947 694770 680668 669299
61791 669299 660338 652672 645585 639396 634792 631783 629509 626985 623905 620784 618431 617205 616711 616228 615411
61776 615411 614472 613712 613162 612828 613106 614692 617997 622745 628090 633102 637227 640537 643628 647172 651419
$$ packed form
61861F52156K724M683P131R720J2416J5097J7502J9637K1870K4472K7377L0402
61849H45187L3374L6080L8378M0354M2034M3068M3065M2060M0236L7314L2881
61838A274031K7218K1130J4908Q163Q88o054j1855j6514k0161k2198k1737j8653
61826A229166j3723p958k164L065P471J1200J4329J6411J6683J4746J0814N388
61814A305428j017q024j5459k3184l0668l6881m0961m2911m3455m3242m2446m1051
61802I36129l9127l6737l3788l0170k6103k2256j9383j7618j6177j4102j1369
61791F69299q961p666p087o189m604l009k274k524l080l121k353j226m94m83q17
61776F15411r39p60n50l34K78J586L305M748N345N012M125L310L091L544M247
$$ plain form
61761 651419 656098 660851 665656 670694 675849 680621 684708 688469 692538 696994 701083 703797 704615 703783 702136
61746 702136 700557 699261 697517 694365 689685 684353 679274 674592 669992 665419 661214 657774 655327 653864
61732 653864 653063 652441 651799 651407 651613 652491 653964 655958 658252 660526 662800 665469 668594 671603 674080 676433
61716 676433 679211 682135 684542 686498 688644 690961 692507 692543 691209 688890 685570 681132 675681 669228 661568
61701 661568 652914 644236 636493 629833 623929 618805 614813 611904 609395 606495 602843 598601 594301 590586
61687 590586 587805 585759 583874 581693 579175 576648 574490 572818 571405 569935 568292 566483 564441 562112
61673 562112 559662 557329 555071 552695 550286 548146 546253 544251 542088 540182 538640 536774 533865 530243
61659 530243 527089 525216 524371 523772 523003 522294 522085 522499 523293 524227 525329 526652 527990 529157 530501 532764
$$ packed form
61761F51419M679M753M805N038N155M772M087L761M069M456M089K714Q18q32j647
61746G02136j579j296j744l152m680n332n079m682m600m573m205l440k447j463
61732F53864q01o22o42l92K06Q78J473J994K294K274K274K669L125L009K477K353
61716F76433K778K924K407J956K146K317J546L6j334k319l320m438n451o453p660
61701F61568q654q678p743o660n904n124l992k909k509k900l652m242m300l715
61687E90586k781k046j885k181k518k527k158j672j413j470j643j809k042k329
61673E62112k450k333k258k376k409k140j893k002k163j906j542j866k909l622
61659E30243l154j873q45n99p69p09k09M14P94R34J102J323J338J167J344K263
$$ plain form
61643 532764 536355 541072 546568 552615 558697 563857 567376 569348 570259 570254 569180 567100 564314 561048 557514
61628 557514 554108 551061 547973 544226 539940 536091 533515 532102 531073 529753 527959 525928 524111 522862
61614 522862 522149 521635 521099 520616 520228 519611 518188 515425 510918 504407 496078 486865 478177 471019 465281 459914
61598 459914 453924 447250 440746 435337 431241 427919 424647 421023 417062 413009 409097 405455 402101 398996
61584 398996 396028 393054 390080 387394 385324 383728 381926 379341 376170 373225 371127 369813 368814 367791
61570 367791 366680 365521 364356 363285 362435 361814 361286 360753 360268 359874 359417 358750 358172 358389 359741 361586 362776
61553 362776 362866 362551 362744 363517 364241 364622 365103 366212 367854 369532 370955 372158 373170 373971 374727 375664 376632
61536 376632 377259 377799 379389 382937 387947 392961 397077 400493 403550 405965 407321 407697 407289 405722 402370
$$ packed form
61643E32764L591M717N496O047O082N160L519J972R11nj074k080k786l266l534
61628E57514l406l047l088l747m286l849k576j413j029j320j794k031j817j249
61614E22862p13n14n36m83l88o17j423k763m507o511q329r213q688p158n738n367
61598D59914n990o674o504n409m096l322l272l624l961m053l912l642l354l105
61584C98996k968k974k974k686k070j596j802k585l171k945k098j314r99j023
61570C67791j111j159j165j071q50o21n28n33m85l94m57o67n78K17J352J845J190
61553C62776R0l15J93P73P24L81M81J109J642J678J423J203J012Q01P56R37R68
61536C76632O27N40J590L548N010N014M116L416L057K415J356L76m08j567l352
$$ plain form
61521 402370 397272 391325 385620 380851 377176 374281 371665 369222 367475 366926 367291 367702 367487 366422 364542
61506 364542 362309 360755 360656 361470 361842 361304 360739 360890 361199 360669 359310 358047 357506 357548 357814 358141 358427 358549
61488 358549 358528 358581 358961 359831 361134 362420 363049 362808 362197 361843 361860 362030 362382 363186 364448 365793 366882 367719
61470 367719 368511 369406 370393 371291 371906 372278 372666 373167 373517 373456 373134 372895 372803 372666 372487 372607 373320 374474 375489
61451 375489 375758 375181 374400 374391 375638 377779 380076 382080 383770 385306 386852 388497 390171 391771 393436 395468
61435 395468 397886 400389 403003 406388 411099 416748 422230 426660 429828 432003 433694 435398 437165 438511
61421 438511 439162 439713 441088 443378 445695 447274 448310 449598 451569 453790 455231 455055 453314 450853 448452
61406 448452 446263 444206 442443 440999 439290 436746 433733 431101 428820 425895 421894 417850 415194 414283
$$ packed form
61521D02370n098n947n705m769l675k895k616k443j747n49L65M11k15j065j880
61506C64542k233j554r9Q14L72n38n65J51L09n30j359j263n41M2K66L27K86J22
61488C58549k1N3L80Q70J303J286O29k41o11l54J7J70L52Q04J262J345J089Q37
61470C67719P92Q95R87Q98O15L72L88N01L50o1l22k39r2j37j79J20P13J154J015
61451C75489K69n77p81rJ247K141K297K004J690J536J546J645J674J600J665K032
61435C95468K418K503K614L385M711N649N482M430L168K175J691J704J767J346
61421D38511O51N51J375K290K317J579J036J288J971K221J441j76j741k461k401
61406D48452k189k057j763j444j709k544l013k632k281k925m001m044k656r11
$$ plain form
61392 414283 414401 414782 415107 415254 415072 414459 413414 412084 410901 410466 411036 412205 413316 414119 414900 416106 417991
61375 417991 420563 423686 427172 430754 434050 436734 438925 441185 443867 446617 448900 450904 453325 456273
61361 456273 459010 461005 462701 464932 468049 471993 476780 482427 488729 495619 503544 512992 523815 535434
61347 535434 547605 560527 574228 588209 601635 613610 623409 630863 636494 640942 644312 646405 647439
61334 647439 648052 648569 648655 647755 645497 641660 636220 629544 622242 614698 607099 599970 594199 590234 587541
61319 587541 585145 582554 580066 578418 578262 579671 581937 584155 586177 588738 592475 597190 602395 608228
61305 608228 615365 624203 634567 646197 659104 673351 688650 704097 718151 729062 735660 737772
61293 737772 735849 730526 722773 714000 705327 696810 687942 678835 670325 662886 656185 649971 644725 641024
$$ packed form
61392D14283J18L81L25J47j82o13j045j330j183m35N70J169J111Q03P81J206J885
61375D17991K572L123L486L582L296K684K191K260K682K750K283K004K421K948
61361D56273K737J995J696K231L117L944M787N647O302O890P925R448J0823J1619
61347E35434J2171J2922J3701J3981J3426J1975R799P454N631M448L370K093J034
61334F47439O13N17Q6r00k258l837n440o676p302p544p599p129n771l965k693
61319E87541k396k591k488j648j56J409K266K218K022K561L737M715N205N833
61305F08228P137Q838J0364J1630J2907J4247J5299J5447J4054J0911O598K112
61293G37772j923n323p753q773q673q517q868r107q510p439o701o214n246l701
$$ plain form
61279 641024 638750 637427 637008 637765 639636 642191 645182 648724 652996 658060 663955 670662 677982 685677 693625
61264 693625 701635 709306 716481 723726 731988 741762 753003 765782 780466 796997 814379 831262 846819
61251 846819 860702 872286 880361 883838 882646 877781 870444 861178 849938 836901 822966 809342 796780
61238 796780 785382 775010 765632 757289 749949 743498 737837 732952 728912 725715 723096 720643 718271 716481
61224 716481 716006 717237 720071 724144 729043 734365 739714 744571 748208 750106 750709 751433 753532 757112 761492
61209 761492 766193 771052 775646 779287 781712 783319 784685 786343 789021 793550 800268 808920 819387 832150
61195 832150 847868 866761 888564 912861 939296 967649 997644 1028387 1058044 1084573 1106917
61184 1106917 1125219 1139951 1151322 1159574 1165240 1168830 1170647 1170996 1170020 1167199 1161625 1153133 1142592
$$ packed form
61279F41024k274j323m19P57J871K555K991L542M272N064N895O707P320P695P948
61264F93625Q010P671P175P245Q262R774J1241J2779J4684J6531J7382J6883J5557
61251H46819J3883J1584Q075L477j192m865p337r266j1240j3037j3935j3624j2562
61238G96780j1398j0372r378q343p340o451n661m885m040l197k619k453k372j790
61224G16481m75J231K834M073M899N322N349M857L637J898O03P24K099L580M380
61209G61492M701M859M594L641K425J607J366J658K678M529O718Q652J0467J2763
61195H32150J5718J8893K1803K4297K6435K8353K9995L0743K9657K6529K2344
61184A106917J8302J4732J1371Q252N666L590J817L49r76k821n574q492j0541
$$ plain form
61171 1142592 1130751 1117367 1101945 1084781 1066699 1048141 1029067 1009401 989036 967729 945555
61160 945555 923236 901477 880268 859408 839470 821583 806426 793982 784069 776415 770318 765055
61148 765055 760822 758657 759222 762045 765983 769878 772671 773441 771672 767161 759647 749128 736765 724899
61134 724899 715604 709420 705670 703662 703220 704412 707398 712488 719983 729864 741908 756062 772457 791102
61120 791102 811864 834794 860135 887851 917390 948129 979875 1012664 1046165 1079653 1112583
61109 1112583 1144886 1176501 1206934 1235516 1261895 1285970 1307447 1325796 1340600 1351595 1358440
61098 1358440 1360770 1358539 1351875 1340492 1323599 1300673 1272166 1239346 1203707 1166649 1129370 1092662
61086 1092662 1056772 1021542 986724 952294 918780 887323 859040 834146 811943 791761 773581
$$ packed form
61171A142592j1841j3384j5422j7164j8082j8558j9074j9666k0365k1307k2174
61160I45555k2319k1759k1209k0860j9938j7887j5157j2444r913p654o097n263
61148G65055m233k165N65K823L938L895K793P70j769m511p514j0519j2363j1866
61134G24899r295o184l750k008m42J192K986N090P495R881J2044J4154J6395J8645
61120G91102K0762K2930K5341K7716K9539L0739L1746L2789L3501L3488L2930
61109A112583L2303L1615L0433K8582K6379K4075K1477J8349J4804J0995O845
61098A358440K330k231o664j1383j6893k2926k8507l2820l5639l7058l7279l6708
61086A092662l5890l5230l4818l4430l3514l1457k8283k4894k2203k0182j8180
$$ plain form
61075 773581 757565 743342 730197 717871 706882 697981 691409 686630 682792 679483 677002 675739 675453
61062 675453 675427 675244 675108 675486 676825 679521 683704 689007 695033 702048 710708 721087 732593 745009 758931
61047 758931 774910 792755 812087 833100 856336 882011 909809 939001 968588 997746 1026338
61036 1026338 1054646 1082578 1109675 1135967 1162101 1188354 1214227 1239300 1263839 1288226 1312478
61025 1312478 1336763 1361716 1387895 1415480 1444779 1476277 1509829 1544523 1579684 1615389 1651980
61014 1651980 1690314 1732843 1783202 1844022 1916194 2000721 2099931 2216196 2351021 2506523 2686665
61003 2686665 2896477 3141989 3432253 3779643 4196872 4695780 5290651 6000472 6846591
60994 6846591 7852206 9047366 10468396 12142245 14067845 16211072 18502071 20811200
$$ packed form
61075G73581j6016j4223j3145j2326j0989q901o572m779l838l309k481j263k86
61062F75453k6j83j36L78J339K696M183N303O026P015Q660J0379J1506J2416J3922
61047G58931J5979J7845J9332K1013K3236K5675K7798K9192K9587K9158K8592
61036A026338K8308K7932K7097K6292K6134K6253K5873K5073K4539K4387K4252
61025A312478K4285K4953K6179K7585K9299L1498L3552L4694L5161L5705L6591
61014A651980L8334M2529N0359O0820P2172Q4527R9210J16265J34825J55502J80142
61003B686665K09812K45512K90264L47390M17229M98908N94871P09821Q46119
60994F846591J005615J195160J421030J673849J925600K143227K290999K309129
$$ plain form
60986 20811200 22921480 24560246 25516207 25767654 25506909 25033709 24611840 24395564 24430788
60977 24430788 24660187 24904636 24879643 24300133 23025219 21129175 18844703 16438999 14121221
60968 14121221 12018833 10192325 8653076 7379300 6334675 5483013 4792091 4232305
60960 4232305 3777869 3408636 3108175 2861119 2654114 2477815 2325845 2192693 2073995
60951 2073995 1967503 1871973 1785880 1708307 1639595 1579392 1525206 1474564 1427492 1384945 1345545
60940 1345545 1305867 1263708 1219576 1175259 1132316 1091657 1053243 1016224 980284 946487 915975
60929 915975 888512 863339 840733 821377 804768 789685 775882 763989 753995 745167 737252 730507
60917 730507 724627 718913 713479 709133 705963 703112 700139 697687 696586 696958 698329 700064 701686 703125
$$ packed form
60986B0811200K110280J638766R55961K51447k60745m73200m21869k16276L5224
60977B4430788K29399K44449k4993n79510j274914j896044k284472k405704k317778
60968A4121221k102388j826508j539249j273776j044625q51662o90922n59786
60960D232305m54436l69233l00461k47056k07005j76299j51970j33152j18698
60951B073995j06492r5530q6093p7573o8712o0203n4186n0642m7072m2547l9400
60940A345545l9678m2159m4132m4317m2943m0659l8414l7019l5940l3797l0512
60929I15975k7463k5173k2606j9356j6609j5083j3803j1893r994q828p915o745
60917G30507n880n714n434m346l170k851k973k452j101L72J371J735J622J439
$$ plain form
60903 703125 704486 705290 704481 701658 697636 693203 688058 681757 674845 668010 660875 652887 644765 637671 631354
60888 631354 624525 616915 609619 603533 598710 595168 593015 591705 590376 589003 588194 587853 587199 586162 585548
60873 585548 585667 585991 586393 587580 589891 592695 595436 598480 602525 607828 614233 621317 628365 634879 641256
60858 641256 648325 656223 664460 672972 682156 691760 700737 708455 715267 721681 727741 733363 738529 743022
60844 743022 746662 749875 753284 756685 759223 760485 760481 758637 753995 746712 738291 730022 722126 714715 708435
60829 708435 703659 700018 697294 695937 696187 697494 699344 701930 705520 709961 715334 722262 730889 740201
60815 740201 749116 757723 766815 776720 787295 798616 810910 823984 837297 850577 863996 877868
60803 877868 892381 907461 922748 938000 953508 969642 985896 1001029 1014388 1026497 1037961
$$ packed form
60903G03125J361Q04q09k823m022m433n145o301o912o835p135p988q122p094o317
60888F31354o829p610p296o086m823l542k153j310j329j373q09l41o54j037o14
60873E85548J19L24M02J187K311K804K741L044M045N303O405P084P048O514O377
60858F41256P069P898Q237Q512R184R604Q977P718O812O414O060N622N166M493
60844G43022L640L213L409L401K538J262mj844m642p283q421q269p896p411o280
60829G08435m776l641k724j357K50J307J850K586L590M441N373O928Q627R312
60815G40201Q915Q607R092R905J0575J1321J2294J3074J3313J3280J3419J3872
60803H77868J4513J5080J5287J5252J5508J6134J6254J5133J3359J2109J1464
$$ plain form
60792 1037961 1048375 1056815 1062987 1067309 1070202 1071749 1071898 1070498 1067162 1061440 1053234 1043022 1031684
60779 1031684 1020020 1008271 996138 983377 970101 956295 941501 925520 909097 893166 877618
60768 877618 861664 845312 829600 815301 802236 790043 778723 768143 757758 747295 737080
60757 737080 727371 717878 708291 698754 689488 680419 671449 662651 654029 645536 637453 630248 623913 618005
60743 618005 612454 607696 603876 600462 596802 592464 587032 580331 573057 566446 561028 556364 552136 548761
60729 548761 546624 545459 544781 544294 543637 542435 540864 539523 538635 538072 538149 539327 540920 541257 539582 536788
60713 536788 533886 530855 527508 524246 521122 517275 512270 507011 502374 497846 492636 487292 482896 479279
60699 479279 475405 471161 467483 464794 462469 459886 457067 454230 451515 449193 447428 445892 444290 443231
$$ packed form
60792A037961J0414Q440O172M322K893J547J49j400l336n722q206j0212j1338
60779A031684j1664j1749j2133j2761j3276j3806j4794j5981j6423j5931j5548
60768H77618j5954j6352j5712j4299j3065j2193j1320j0580j0385j0463j0215
60757G37080r709r493r587r537r266r069q970q798q622q493q083p205o335n908
60743F18005n551m758l820l414l660m338n432o701p274o611n418m664m228l375
60729E48761k137j165o78m87o57j202j571j341q88n63P7J178J593L37j675k794
60713E36788k902l031l347l262l124l847n005n259m637m528n210n344m396l617
60699D79279l874m244l678k689k325k583k819k837k715k322j765j536j602j059
$$ plain form
60685 443231 443829 446307 449553 452196 453786 454907 456474 458872 461532 463499 464600 465751 467873 470929
60671 470929 474386 478062 481967 485751 489026 491989 495132 498512 501816 504895 507678 509817 510954 511137
60657 511137 510538 509119 507183 505964 506846 510031 514510 519327 524293 529503 534731 539522 543661 547460 551539
60642 551539 556006 559757 561131 559627 556563 553575 550899 547604 543104 537770 532335 527370 523186 519725
60628 519725 516561 513411 510507 508201 506412 504820 503300 501824 500256 498576 496997 495563 494082 492654
60614 492654 491646 490736 488791 485382 481682 479058 477384 475716 474047 473197 473271 473453 473296 473097 472950 472437
60598 472437 471543 470947 471071 471488 471609 471419 471302 471620 472659 474493 476704 478627 480042 481364 483068 485222
60582 485222 487593 489894 491878 493398 494375 494623 494019 493074 492914 494257 496639 499070 501164 503226 505683
$$ packed form
60685D43231N98K478L246K643J590J121J567K398K660J967J101J151K122L056
60671D70929L457L676L905L784L275K963L143L380L304L079K783K139J137J83
60657E11137n99j419j936j219Q82L185M479M817M966N210N228M791M139L799M079
60642E51539M467L751J374j504l064k988k676l295m500n334n435m965m184l461
60628E19725l164l150k904k306j789j592j520j476j568j680j579j434j481j428
60614D92654j008r10j945l409l700k624j674j668j669q50P4J82j57j99j47n13
60598D72437q94n96J24M17J21j90j17L18J039J834K211J923J415J322J704K154
60582D85222K371K301J984J520R77K48o04r45j60J343K382K431K094K062K457
$$ plain form
60567 505683 508996 513741 520102 527534 535537 544399 554547 565614 577062 589400 603611 619359 634695
60554 634695 647692 657513 663819 666188 664609 659913 653254 645568 637708 630540 624672 620461 618381 618835
60540 618835 621476 625287 629623 634802 641590 650614 662410 677411 695442 715495 736257 756626 775593
60527 775593 791976 804608 812707 816005 814681 809273 800567 789623 777849 766700 756954 748516 741113
60514 741113 734857 729771 725297 720897 716928 714309 713469 714165 716047 718792 721861 724951 728656 733981 741207
60499 741207 749950 760364 773554 790622 811895 837286 866850 900823 939594 983656 1033045 1086662
60487 1086662 1142622 1199310 1255566 1309803 1359521 1401900 1434405 1454837 1461498 1453732 1432066 1397730
60475 1397730 1352411 1298411 1238499 1175354 1111391 1048980 990227 936376 887792 844501 806281
$$ packed form
60567E05683L313M745O361P432Q003Q862J0148J1067J1448J2338J4211J5748J5336
60554F34695J2997R821O306K369j579m696o659p686p860p168n868m211k080M54
60540F18835K641L811M336N179O788R024J1796J5001J8031K0053K0762K0369J8967
60527G75593J6383J2632Q099L298j324n408q706j0944j1774j1149r746q438p403
60514G41113o256n086m474m400l969k619q40O96J882K745L069L090L705N325P226
60499G41207Q743J0414J3190J7068K1273K5391K9564L3973L8771M4062M9389N3617
60487A086662N5960N6688N6256N4237M9718M2379L2505K0432O661p766k1666l4336
60475A397730m5319n4000n9912o3145o3963o2411n8753n3851m8584m3291l8220
$$ plain form
60464 806281 772354 741727 714127 690093 669962 653176 638692 625723 613967 603500 594527 586939
60452 586939 580186 573902 568414 564074 560297 556011 551020 546201 542256 538992 535882 532636 529064 525125
60438 525125 521364 518595 516812 515050 512623 509906 507601 505855 504569 503952 504186 504868 505374 505612 505973 506641
60422 506641 507320 507687 507852 508242 508956 509360 508608 506755 505032 504731 506083 508508 511441 514354 516461 517296
60406 517296 517429 517819 518594 519230 519746 520749 522353 524027 525630 527584 529857 531765 533107 534552 536536
60391 536536 538681 540749 543239 546451 549801 552763 555792 559549 563754 567573 570798 573914 577235 580549
60377 580549 583474 585729 587226 588283 589585 591642 594344 597191 599695 601492 602409 602628 602495 602130 601548
60362 601548 601165 601652 603122 604994 606773 608455 610020 611163 611839 612569 613937 616220 619643 624410 630148
$$ packed form
60464H06281l3927l0627k7600k4034k0131j6786j4484j2969j1756j0467q973p588
60452E86939o753o284n488m340l777m286m991m819l945l264l110l246l572l939
60438E25125l761k769j783j762k427k717k305j746j286o17K34O82N06K38L61O68
60422E06641O79L67J65L90P14M04p52j853j723l01J352K425K933K913K107Q35
60406E17296J33L90P75O36N16J003J604J674J603J954K273J908J342J445J984
60391E36536K145K068K490L212L350K962L029L757M205L819L225L116L321L314
60377E80549K925K255J497J057J302K057K702K847K504J797R17K19j33l65n82
60362F01548l83M87J470J872J779J682J565J143O76P30J368K283L423M767N738
$$ plain form
60347 630148 635907 641127 646327 652599 660760 671015 682885 695304 707235 718340 728537 737033 742560
60334 742560 744598 743474 739121 730854 718825 704748 690596 677354 665463 655451 647336 640270 633685
60321 633685 628211 624628 622473 620545 618334 616144 614201 612436 610857 609451 608024 606755 606468 607741
60307 607741 610228 613614 618662 626315 636093 646522 657119 669042 683676 701489 722412 746414
60295 746414 773136 801327 828992 853909 874030 887852 894741 894803 888467 876387 859669 839844
60283 839844 818440 796606 775004 753910 733422 713707 695011 677554 661633 647749 636205
60272 636205 626510 617627 609001 600988 594132 588433 583542 579227 575393 572030 569415 567992 567754 568072 568340
60257 568340 568487 568741 569328 570457 572101 573672 574536 574995 576008 577720 579100 579418 579209 579176 578969 577812 575755
$$ packed form
60347F30148N759N220N200O272Q161J0255J1870J2419J1931J1105J0197Q496N527
60334G42560K038j124m353q267j2029j4077j4152j3242j1891j0012q115p066o585
60321F33685n474l583k155j928k211k190j943j765j579j406j427j269k87J273
60307F07741K487L386N048P653R778J0429J0597J1923J4634J7813K0923K4002
60295G46414K6722K8191K7665K4917K0121J3822O889O2o336j2080j6718j9825
60283H39844k1404k1834k1602k1094k0488j9715j8696j7457j5921j3884j1544
60272F36205r695q883q626q013o856n699m891m315l834l363k615j423k38L18K68
60257E68340J47K54N87J129J644J571Q64M59J013J712J380L18k09l3k07j157k057
$$ plain form
60240 575755 573526 571582 569963 568664 567554 566414 565590 566035 568076 570738 573085 575584 579196 583676 587897
60225 587897 591629 595855 601332 607716 614141 619877 624375 627536 630149 633493 638239 644077 650368 656780
60211 656780 663334 670266 677823 685844 693687 700880 707596 714152 720392 726028 731203 736168 740658 744205
60197 744205 746845 748963 750685 751911 752666 752827 751792 749079 745065 740582 736084 731778 728142 725437 722956
60182 722956 719667 715564 711595 708276 705204 702004 698923 696252 693806 691250 688524 685810 683433 681858
60168 681858 681334 681529 681824 681893 681685 681112 680302 679924 680556 681800 682648 682763 682752 683096 683461 683317 682764 682485 683128
60149 683128 684852 687234 689571 691488 693256 695434 698393 702305 707308 713312 719885 726637 733498 740460
60135 740460 747384 754290 761384 768486 775008 780908 786986 793629 799953 804909 808594 811544 813295 812831
$$ packed form
60240E75755k229j944j619j299j110j140q24M45K041K662K347K499L612M480M221
60225E87897L732M226N477O384O425N736M498L161K613L344M746N838O291O412
60211F56780O554O932P557Q021P843P193O716O556O240N636N175M965M490L547
60197G44205K640K118J722J226P55J61j035k713m014m483m498m306l636k705k481
60182G22956l289m103l969l319l072l200l081k671k446k556k726k714k377j575
60168F81858n24J95K95O9k08n73q10l78O32J244Q48J15j1L44L65j44n53k79O43
60149F83128J724K382K337J917J768K178K959L912N003O004O573O752O861O962
60135G40460O924O906P094P102O522N900O078O643O324M956L685K950J751m64
$$ plain form
60121 812831 810209 806616 802955 799403 796264 794108 792848 791660 790073 788377 786810 785069 782866 780258
60107 780258 777305 773999 770624 767460 764023 759353 753355 747248 742401 739206 737201 735800 734706 734039
60093 734039 734318 736065 739379 744112 750196 757395 765067 772773 780892 789978 799704 809106 817657 825308
60079 825308 831714 836384 839576 842052 843745 843474 840189 833771 824519 812665 798710 783612 768363
60066 768363 753803 740756 729636 719856 710370 700920 692133 684323 677043 670018 663742 658791 655118
60053 655118 652203 649446 646348 642940 640108 638891 639321 640605 642370 645030 648890 653683 659075 664890
60039 664890 670735 676206 681499 686980 692053 695399 696511 696105 694853 692689 689559 685748 681081 674882
60025 674882 667274 659451 652082 644382 635432 625523 615434 605252 594846 584802 575940 568293 561352
$$ packed form
60121H12831k622l593l661l552l139k156j260j188j587j696j567j741k203k608
60107G80258k953l306l375l164l437m670n998o107m847l195k005j401j094o67
60093G34039K79J747L314M733O084P199P672P706Q119R086R726R402Q551P651
60079H25308O406M670L192K476J693k71l285o418r252j1854j3955j5098j5249
60066G68363j4560j3047j1120r780r486r450q787p810p280p025o276m951l673
60053F55118k915k757l098l408k832j217M30J284J765K660L860M793N392N815
60039F64890N845N471N293N481N073L346J112m06j252k164l130l811m667o199
60025F74882p608p823p369p700q950r909j0089j0182j0406j0044q862p647o941
$$ plain form
60012 561352 554985 549470 544962 541568 539595 539128 539650 540602 541987 543962 546294 548786 551847 555986 561019
59997 561019 566297 571391 576061 579878 582589 584748 587401 591131 595796 601012 606484 611932 617160 622234
59983 622234 627365 632617 637863 642892 647426 651072 653371 653907 652562 649828 646627 643429 639783 635249
59969 635249 630509 626812 624464 622781 621590 621700 623522 626154 628397 630007 631419 632939 634796 637328
59955 637328 640422 643134 644533 644635 644063 643154 641889 640326 638603 636750 634864 633223 631870 630387 628329
59940 628329 625592 622177 618049 613501 609133 605168 601308 597645 595108 594418 595024 595653 595697 595597 596104 597573
59924 597573 599778 602136 604249 606289 608517 610470 611322 611229 611548 613294 616062 618965 621945 625504 629745
59909 629745 634444 639649 645404 651144 656089 660171 664021 668120 672391 676506 680192 683311 685942 688241
$$ packed form
60012E61352o367n515m508l394j973m67N22R52J385J975K332K492L061M139N033
59997E61019N278N094M670L817K711K159K653L730M665N216N472N448N228N074
59983F22234N131N252N246N029M534L646K299N36j345k734l201l198l646m534
59969F35249m740l697k348j683j191J10J822K632K243J610J412J520J857K532
59955F37328L094K712J399J02n72r09j265j563j723j853j886j641j353j483k058
59940F28329k737l415m128m548m368l965l860l663k537o90O06O29M4j00N07J469
59924E97573K205K358K113K040K228J953Q52r3L19J746K768K903K980L559M241
59909F29745M699N205N755N740M945M082L850M099M271M115L686L119K631K299
$$ plain form
59895 688241 690042 690943 690976 690783 690841 690957 690918 691170 692368 694612 697641 701489 706378 712130 718097 723695 728773
59878 728773 733670 739060 745462 752666 759888 766530 772388 777042 779662 779788 777860 774633 770496 765575
59864 765575 760040 753953 747244 740130 733072 726119 718850 711262 704057 697678 691742 685832 680312 675904
59850 675904 673049 672024 672976 675349 678013 680599 684082 689461 696527 704597 713795 724653 736834 748992
59836 748992 759640 767691 772679 775223 776894 779005 781814 785210 789422 794267 798392 800159 798883 794516
59822 794516 786720 775280 761085 745754 730492 715976 702880 691525 681313 671434 662009 653802
59810 653802 647097 641657 637418 634317 631677 628782 625911 623945 623090 622861 623150 624256 625854 626857 626507
59795 626507 624833 622046 618212 613602 608633 603426 598067 593209 589542 586680 583435 579429 575676 573338
$$ packed form
59895F88241J801R01L3j93N8J16l9K52J198K244L029L848M889N752N967N598N078
59878G28773M897N390O402P204P222O642N858M654K620J26j928l227m137m921
59864G65575n535o087o709p114p058o953p269p588p205o379n936n910n520m408
59850F75904k855j025R52K373K664K586L483N379P066Q070R198J0858J2181J2158
59836G48992J0648Q051M988K544J671K111K809L396M212M845M125J767j276m367
59822G94516p796j1440j4195j5331j5262j4516j3096j1355j0212r879r425q207
59810F53802o705n440m239l101k640k895k871j966q55k29K89J106J598J003l50
59795F26507j674k787l834m610m969n207n359m858l667k862l245m006l753k338
$$ plain form
59781 573338 572572 572788 573348 573746 573656 573193 572775 572587 572540 572758 573601 575062 576658 578080 579566 581454 583759
59764 583759 586346 589231 592520 596251 600398 604873 609537 614310 619242 624409 629884 635849 642466 649589
59750 649589 656902 664360 672013 679406 685839 691417 697032 703039 708821 714053 719327 724751 728993 730853
59736 730853 731042 731249 731993 732619 732862 733069 733162 732766 732313 732737 734047 735340 736310 737541 739174 740433 740852
59719 740852 740952 741348 741992 742693 743626 744931 746388 747845 749472 751404 753554 755844 758250 760635 763008
59704 763008 765730 768964 772178 774891 777595 781095 785140 788642 791128 793043 794738 796179 797642 799630
59690 799630 802009 804210 806348 808966 811474 812071 809745 805401 800522 795676 790938 786801 783750 781369
59676 781369 778627 774824 769901 764131 757926 751666 745449 739130 732669 726163 719660 713329 707685 703064
$$ packed form
59781E73338p66K16N60L98r0m63m18j88m7K18Q43J461J596J422J486J888K305
59764E83759K587K885L289L731M147M475M664M773M932N167N475N965O617P123
59750F49589P313P458P653P393O433N578N615O007N782N232N274N424M242J860
59736G30853J89K07P44O26K43K07R3l96m53M24J310J293R70J231J633J259M19
59719G40852J00L96O44P01R33J305J457J457J627J932K150K290K406K385K373
59704G63008K722L234L214K713K704L500M045L502K486J915J695J441J463J988
59690G99630K379K201K138K618K508N97k326m344m879m846m738m137l051k381
59676G81369k742l803m923n770o205o260o217o319o461o506o503o331n644m621
$$ plain form
59662 703064 699019 694883 690842 687724 685767 684463 683649 683880 685490 688035 690904 693816 696534 698849 701029
59647 701029 703578 706336 708492 709551 709543 708164 704733 699290 692924 686562 680217 673788 667762 662624 658303
59632 658303 654736 652367 651484 651580 651852 651937 651780 651215 650072 648330 645897 642684 639126 636118 634167 632960
59616 632960 631962 630971 629952 628847 627727 626670 625410 623659 621839 620882 621182 622347 624031 626266 628878
59601 628878 631351 633483 635396 636761 636809 635400 633320 631255 629296 627603 626691 626649 626966 627517 628832 630894
59585 630894 632549 632772 631863 630858 630364 630385 630625 630413 628975 626266 622972 619368 614943 609600 604407 600477
59569 600477 597797 595773 594306 593600 593388 593099 592534 591942 591680 591998 592744 593218 592938 592625 593479 595307 596457
59552 596457 596031 595056 594895 595645 596953 599212 602839 607248 611726 616654 622673 629253 635318 641012 647782
$$ packed form
59662G03064m045m136m041l118j957j304q14K31J610K545K869K912K718K315K180
59647G01029K549K758K156J059qj379l431n443o366o362o345o429o026n138m321
59632F58303l567k369q83R6K72Q5j57n65j143j742k433l213l558l008j951j207
59616F32960r98r91j019j105j120j057j260j751j820r57L00J165J684K235K612
59601F28878K473K132J913J365M8j409k080k065j959j693r12m2L17N51J315K062
59585F30894J655K23r09j005m94K1K40k12j438k709l294l604m425n343n193l930
59569F00477k680k024j467p06k12k89n65n92k62L18P46M74k80l13Q54J828J150
59552E96457m26r75j61P50J308K259L627M409M478M928O019O580O065N694O770
$$ plain form
59537 647782 656964 669171 684729 703642 725263 748740 773368 797561 817956 831002 835791 834661
59525 834661 831093 827700 825894 826159 828104 830907 834062 837336 840054 841018 839280 834515 826719 816094
59511 816094 803290 789189 774285 758606 742315 726029 710541 696512 684411 674352 665983 658787
59499 658787 652519 647181 642694 638900 635837 633763 632928 633316 634440 635452 635782 635780 636333 637784 639721 641936
59483 641936 644948 649265 654693 660790 667453 674633 681944 689075 696220 703692 711566 720010 729410 739678
59469 739678 749878 759014 766659 772438 775625 775948 774315 772035 769761 767836 767129 768689 772923 779783
59455 779783 789399 801805 816371 832305 849368 867367 885250 901655 916214 929540 942078 953682
59443 953682 964111 973026 979468 982046 979760 972181 959142 941092 919769 897790 877337 859575
$$ packed form
59537F47782R182J2207J5558J8913K1621K3477K4628K4193K0395J3046M789j130
59525H34661l568l393j806K65J945K803L155L274K718R64j738m765p796j0625
59511H16094j2804j4101j4904j5679j6291j6286j5488j4029j2101j0059q369p196
59499F58787o268n338m487l794l063k074q35L88J124J012L30kN53J451J937K215
59483F41936L012M317N428O097O663P180P311P131P145P472P874Q444R400J0268
59469G39678J0200R136P645N779L187L23j633k280k274j925p07J560M234O860
59455G79783R616J2406J4566J5934J7063J7999J7883J6405J4559J3326J2538J1604
59443I53682J0429Q915O442K578k286p579j3039j8050k1323k1979k0453j7762
$$ plain form
59431 859575 844979 833365 823634 814373 805136 796713 790122 785766 783624 783687 786058 790949 798630 809091
59417 809091 821903 836688 853412 871727 890432 908351 925617 943341 962128 981609 1001095
59406 1001095 1019304 1033038 1037399 1028665 1007180 977278 944758 914595 890198 873541 865389 865487
59394 865487 872583 884103 895733 901886 897630 881200 855055 824225 793328 764940 740227 720011
59382 720011 704647 693442 685128 678994 675080 673338 673095 673568 674588 676627 680130 684903 690109 694935
59368 694935 699250 703545 708257 713369 718669 724116 729880 736232 743489 751841 761273 771803 783657 796841
59354 796841 810814 825206 840726 858600 879055 901103 923926 947613 972296 997407 1022259
59343 1022259 1046619 1070251 1092509 1112774 1130614 1145107 1154802 1158854 1157487 1150975 1139071 1122129
$$ packed form
59431H59575j4596j1614r731r261r237q423o591m356k142O3K371M891P681J0461
59417H09091J2812J4785J6724J8315J8705J7919J7266J7724J8787J9481J9486
59406A001095J8209J3734M361q734k1485k9902l2520l0163k4397j6657q152R8
59394H65487P096J1520J1630O153m256j6430k6145l0830l0897k8388k4713k0216
59382G20011j5364j1205q314o134l914j742k43M73J020K039L503M773N206M826
59368F94935M315M295M712N112N300N447N764O352P257Q352R432J0530J1854J3184
59354G96841J3973J4392J5520J7874K0455K2048K2823K3687K4683K5111K4852
59343A022259K4360K3632K2258K0265J7840J4493R695M052j367o512j1904j6942
$$ plain form
59331 1122129 1101781 1079571 1055610 1029528 1002107 974917 948842 924010 900825 879968 861502
59320 861502 844908 829930 816717 805262 795464 787566 781831 777877 774941 772608 770771 769174 767659
59307 767659 766593 766408 766937 767748 768864 770596 772973 775907 779594 784165 789404 795429 803202 813672 826756
59292 826756 841854 858802 877381 896143 912543 924039 928655 925266 914490 899021 882063 865549
59280 865549 850499 838382 830735 827631 827839 830615 836315 845148 856382 869075 882842 897640 913308
59267 913308 929430 945157 959272 970901 979931 986276 989132 987671 982029 972839 960267 944452 926499
59254 926499 907942 889454 871143 853843 838811 826185 814899 804263 794629 786504 780103 775912
59242 775912 774532 775672 778237 781767 786929 794290 803361 813121 822785 831768 839519 845686 849996 851976
$$ packed form
59331A122129k0348k2210k3961k6082k7421k7190k6075k4832k3185k0857j8466
59320H61502j6594j4978j3213j1455r798p898n735l954k936k333j837j597j515
59307G67659j066j85N29Q11J116J732K377K934L687M571N239O025P773J0470J3084
59292H26756J5098J6948J8579J8762J6400J1496M616l389j0776j5469j6958j6514
59280H65549j5050j2117p647l104K08K776N700Q833J1234J2693J3767J4798J5668
59267I13308J6122J5727J4115J1629R030O345K856j461n642r190j2572j5815j7953
59254I26499j8557j8488j8311j7300j5032j2626j1286j0636r634q125o401m191
59242G75912j380J140K565L530N162P361R071R760R664Q983P751O167M310J980
$$ plain form
59228 851976 851269 848089 842731 834870 824106 811103 797336 783791 770708 758409 747321 737162
59216 737162 727146 717206 708173 700668 694674 690239 687607 686449 685887 685560 685900 687172 689056 691366 694364
59201 694364 698108 702247 706622 711421 716585 721792 727190 733421 740727 748626 756501 763876 770225 775291
59187 775291 779601 783815 787600 790062 791272 792373 794046 795867 797389 798930 801003 803779 807325 811558
59173 811558 815810 819300 822298 826064 831368 837892 845207 853585 863443 874659 886624 898438 909066
59160 909066 917919 925190 930957 934259 933947 930201 924104 916000 905571 893373 880761 868080 854482
59147 854482 839960 826157 814517 804810 796123 788161 780946 774228 767981 762679 758458 754718 751012
59134 751012 747582 744604 741755 738997 736931 735870 735277 734545 733752 733379 734002 736351 740755 746366 751993
$$ packed form
59228H51976p07l180n358p861j0764j3003j3767j3545j3083j2299j1088j0159
59216G37162j0016r940r033p505n994m435k632j158n62l27L40J272J884K310K998
59201F94364L744M139M375M799N164N207N398O231P306P899P875P375O349N066
59187G75291M310M214L785K462J210J101J673J821J522J541K073K776L546M233
59173H11558M252L490K998L766N304O524P315Q378R858J1216J1965J1814J0628
59160I09066Q853P271N767L302l12l746o097q104j0429j2198j2612j2681j3598
59147H54482j4522j3803j1640r707q687p962p215o718o247n302m221l740l706
59134G51012l430k978k849k758k066j061n93p32p93l73O23K349M404N611N627
$$ plain form
59119 751993 757886 765598 775770 787248 798856 810785 823650 837370 851714 866874 882677 898108
59107 898108 912365 925559 937748 948219 956487 963128 968858 973498 976621 978422 979167 978425 975645 970998
59093 970998 965060 958250 951113 944565 939277 935239 932290 930426 929266 927924 925774 922652 918098 911298
59079 911298 902112 891284 879368 866454 853188 840727 829164 817329 804909 793484 784488 777261
59067 777261 770166 762660 755226 748161 741616 736114 731866 728049 723709 718966 714568 710804 707610 705114
59053 705114 703233 701267 698643 695665 692944 690701 689155 688816 689669 690818 691631 692524 693880 695100 695621
59038 695621 696109 697584 699942 702318 704406 706484 708619 710749 713296 716917 721983 728860 738156 750040
59024 750040 763813 778735 794739 811858 829633 847691 865988 883764 899055 910199 917206 920875
$$ packed form
59119G51993N893P712J0172J1478J1608J1929J2865J3720J4344J5160J5803J5431
59107H98108J4257J3194J2189J0471Q268O641N730M640L123J801P45p42k780m647
59093I70998n938o810p137o548n288m038k949j864j160j342k150l122m554o800
59079I11298r186j0828j1916j2914j3266j2461j1563j1835j2420j1425q996p227
59067G77261p095p506p434p065o545n502m248l817m340m743m398l764l194k496
59053G05114j881j966k624k978k721k243j546l39Q53J149Q13Q93J356J220N21
59038F95621M88J475K358K376K088K078K135K130K547L621N066O877R296J1884
59024G50040J3773J4922J6004J7119J7775J8058J8297J7776J5291J1144P007L669
$$ plain form
59012 920875 921408 918904 914401 909157 903356 896642 889631 883822 880210 878862 879626 882349 886532 891613 897622
58997 897622 905034 913981 923897 933715 942202 948542 952835 955650 957037 956674 954888 952354 948549 941827
58983 941827 931666 919656 907596 895852 884431 874367 866816 861739 858711 858141 860505 865102 870814
58970 870814 877528 885779 895634 906942 920066 935335 952346 970657 990388 1011214 1031618 1050184
58958 1050184 1066750 1081149 1091736 1096627 1095698 1090048 1080154 1066013 1048510 1029098 1008327 986025
58946 986025 962670 939447 917260 896827 879199 864891 852863 841808 832218 825876 823412 823623
58934 823623 825096 827265 829801 832070 833447 833480 831748 828146 823106 817001 809736 801470 793086 785216 777509
58919 777509 769711 762711 757473 753616 750163 747052 744845 743600 743228 744238 746865 750093 752896 755954
$$ packed form
59012I20875N33k504m503n244n801o714p011n809l612j348P64K723M183N081O009
58997H97622P412Q947R916R818Q487O340M293K815J387l63j786k534l805o722
58983I41827j0161j2010j2060j1744j1421j0064p551n077l028n70K364M597N712
58970H70814O714Q251R855J1308J3124J5269J7011J8311J9731K0826K0404J8566
58958A050184J6566J4399J0587M891r29n650r894j4141j7503j9412k0771k2302
58946I86025k3355k3223k2187k0433j7628j4308j2028j1055r590o342k464K11
58934H23623J473K169K536K269J377L3j732l602n040o105p265q266q384p870p707
58919G77509p798p000n238l857l453l111k207j245l72J010K627L228K803L058
$$ plain form
58905 755954 760808 767861 776536 786793 799005 812823 827749 844415 863714 884966 906610 928476
58893 928476 951620 975957 999908 1022757 1045780 1070515 1097162 1125115 1153978 1183468 1212998
58882 1212998 1241642 1268011 1290231 1306772 1317272 1322028 1321056 1314325 1302358 1285666 1264052 1237526
58870 1237526 1207490 1176058 1144657 1114317 1086666 1063252 1044139 1028336 1015225 1004390 994578
58859 994578 984276 973146 961737 950127 938060 925978 914557 903610 892766 882767 874627 867883
58847 867883 861136 853962 846782 839236 830416 820459 810257 799760 788318 776579 766254 757828 750224
58834 750224 742857 736372 731120 726552 722530 719728 718269 717228 715847 714178 712411 710740 709874 710397 711547
58819 711547 711938 711504 711497 712578 714332 716600 719716 723275 726196 728284 730315 732346 733394 733075 732237 731592
$$ packed form
58905G55954M854P053Q675J0257J2212J3818J4926J6666J9299K1252K1644K1866
58893I28476K3144K4337K3951K2849K3023K4735K6647K7953K8863K9490K9530
58882A212998K8644K6369K2220J6541J0500M756r72o731j1967j6692k1614k6526
58870A237526l0036l1432l1401l0340k7651k3414j9113j5803j3111j0835r812
58859I94578j0302j1130j1409j1610j2067j2082j1421j0947j0844r999q140o744
58847H67883o747p174p180p546q820r957j0202j0497j1442j1739j0325q426p604
58834G50224p367o485n252m568m022k802j459j041j381j669j767j671q66N23J150
58819G11547L91m34pJ081J754K268L116L559K921K088K031K031J048l19q38o45
$$ plain form
58803 731592 730955 730115 729225 728096 726271 724026 722130 720465 718029 714379 709923 704890 699318 694139 690796
58788 690796 689547 689328 689410 690025 691381 693438 696666 701680 707949 714122 719669 725042 730345 735189 739730
58773 739730 744369 748435 750574 750412 748611 745546 741391 737084 733430 729494 723782 716842 710847 706721
58759 706721 703698 701638 701510 703290 705496 707280 709105 711074 712523 713625 715410 717843 719769 721126
58745 721126 723231 726569 730451 735241 742557 752550 763157 772947 782697 793329 804384 815443 827123
58732 827123 839549 851702 863318 875695 889491 903266 915172 924704 932044 937280 941039 944290
58720 944290 946788 947305 946037 945067 945877 948206 951859 957488 964740 971717 977282 981869 985144 985093 980693
58705 980693 973391 964619 953785 940091 924279 907014 887406 864841 840715 816751 793035 769204
$$ packed form
58803G31592o37q40q90j129j825k245j896j665k436l650m456n033n572n179l343
58788F90796j249k19Q2O15J356K057L228N014O269O173N547N373N303M844M541
58773G39730M639M066K139j62j801l065m155m307l654l936n712o940n995m126
58759G06721l023k060j28J780K206J784J825J969J449J102J785K433J926J357
58745G21126K105L338L882M790P316R993J0607R790R750J0632J1055J1059J1680
58732H27123J2426J2153J1616J2377J3796J3775J1906R532P340N236L759L251
58720I44290K498N17j268r70Q10K329L653N629P252O977N565M587L275n1m400
58705I80693p302q772j0834j3694j5812j7265j9608k2565k4126k3964k3716k3831
$$ plain form
58693 769204 746122 724888 705538 688143 673864 663491 656100 650300 645445 640693 634557 626805 619227
58680 619227 613172 607764 601823 595937 591200 587482 584496 583117 584028 586354 589101 592666 597612 603425
58666 603425 609958 618600 630410 644455 659519 675931 693868 711226 725101 734410 739448 740074 736211
58653 736211 729227 720923 711788 701582 690789 680099 669429 658910 649907 643573 639151 635051 630813
58640 630813 626895 623508 620903 619765 620100 620654 620577 620643 621734 623318 624583 625800 627325 628464 628711 628934
58624 628934 630052 631619 632915 634297 636358 639067 642841 649058 658284 669428 681764 696123 712762
58611 712762 729808 745313 759191 771455 780352 784233 783919 781367 777330 772030 766636 762061 757474
58598 757474 751809 745578 739635 733564 727041 721331 717652 715459 714099 714590 717855 722883 728741 736705
$$ packed form
58693G69204k3082k1234j9350j7395j4279j0373p391n800m855m752o136p752p578
58680F19227o055n408n941n886m737l718k986j379R11K326K747L565M946N813
58666F03425O533Q642J1810J4045J5064J6412J7937J7358J3875R309N038O26l863
58653G36211o984q304r135j0206j0793j0690j0670j0519r003o334m422m100m238
58640F30813l918l387k605j138L35N54p7O6J091J584J265J217J525J139K47K23
58624F28934J118J567J296J382K061K709L774O217R226J1144J2336J4359J6639
58611G12762J7046J5505J3878J2264Q897L881l14k552m037n300n394m575m587
58598G57474n665o231n943o071o523n710l679k193j360M91L265N028N858P964
$$ plain form
58584 736705 748033 761191 773907 786694 801656 818820 836184 852450 867216 879330 887773 893715
58572 893715 899364 905192 910340 915138 921187 929544 940816 956300 976943 1001755 1029144 1059098 1092156
58559 1092156 1127088 1161589 1194365 1224517 1249817 1267948 1278908 1284219 1284504 1279816 1271496 1261408
58547 1261408 1249859 1236254 1221178 1205911 1190546 1174386 1157378 1139362 1118936 1095083 1069011
58536 1069011 1042500 1015599 987974 961229 937459 916606 897589 880918 867666 856913 846956
58525 846956 838262 832602 829975 828926 829189 831416 834924 838346 841928 846636 851577 854929 856895 859137
58511 859137 861739 863265 863381 862876 861426 857887 852572 846886 841057 834537 828198 823728 821089 818695 815690
58496 815690 812093 807487 801873 797027 794624 793704 792295 790713 790798 792837 795914 800514 808023 818248 830002
$$ packed form
58584G36705J1328J3158J2716J2787J4962J7164J7364J6266J4766J2114Q443N942
58572H93715N649N828N148M798O049Q357J1272J5484K0643K4812K7389K9954L3058
58559A092156L4932L4501L2776L0152K5300J8131J0960N311K85m688q320j0088
58547A261408j1549j3605j5076j5267j5365j6160j7008j8016k0426k3853k6072
58536A069011k6511k6901k7625k6745k3770k0853j9017j6671j3252j0753r957
58525H46956q694n660k627j049K63K227L508L422L582M708M941L352J966K242
58511H59137K602J526J16n05j450l539n315n686n829o520o339m470k639k394l005
58496H15690l597m606n614m846k403r20j409j582Q5K039L077M600P509J0225J1754
$$ plain form
58481 830002 843459 859432 877177 895527 915214 937199 959653 979505 995983 1009574 1018610 1020472
58469 1020472 1015588 1006782 995121 979805 961685 943356 925917 908946 893521 881980 874744 870501
58457 870501 869272 872141 878235 885333 893313 903766 916321 928508 938950 947479 952537 952024 946610
58444 946610 938833 929190 916599 902342 889705 879692 870756 862862 858066 856951 858066 861007 866439
58431 866439 873115 878719 883800 891092 900831 910738 920719 933399 949459 966522 983193 1000128 1016459
58418 1016459 1029341 1038001 1044371 1048785 1048944 1044073 1036250 1026559 1013713 997619 980624 964068 947078
58405 947078 929867 914752 902792 892706 883988 877779 873911 870538 867458 866424 867591 869184 871130
58392 871130 875204 880963 885464 887729 889610 891590 891782 889907 888119 886999 884748 881182 878449 876925
$$ packed form
58481H30002J3457J5973J7745J8350J9687K1985K2454J9852J6478J3591R036J862
58469A020472m884q806j1661j5316j8120j8329j7439j6971j5425j1541p236m243
58457H70501j229K869O094P098P980J0453J2555J2187J0442Q529N058n13n414
58444I46610p777r643j2591j4257j2637j0013q936p894m796j115J115K941N432
58431H66439O676N604N081P292R739R907R981J2680J6060J7063J6671J6935J6331
58418A016459J2882Q660O370M414J59m871p823r691j2846j6094j6995j6556j6990
58405I47078j7211j5115j1960j0086q718o209l868l373l080j034J167J593J946
58392H71130M074N759M501K265J881J980J92j875j788j120k251l566k733j524
$$ plain form
58378 876925 874642 871643 870537 871798 873005 873839 877268 884495 893236 902356 913557 926983 939731 950571
58364 950571 961869 975154 988961 1002582 1017654 1034382 1050369 1064617 1078525 1091719 1101410 1107192
58352 1107192 1111806 1115923 1117110 1115364 1114441 1115929 1117165 1116937 1117995 1121871 1126399 1130656 1137212 1147166
58338 1147166 1157957 1168464 1181234 1197321 1213964 1229712 1246697 1265432 1282632 1296730 1310258
58327 1310258 1324239 1335582 1342653 1347952 1352539 1353418 1349455 1344380 1340838 1336960 1331917 1329243 1331286 1335666
58313 1335666 1340417 1347211 1356465 1365076 1372285 1381982 1395802 1409805 1421340 1433119 1447015 1460257
58301 1460257 1471654 1485060 1502413 1519595 1533550 1547225 1563035 1577906 1589572 1601543 1616838
58290 1616838 1632820 1647025 1662105 1680225 1698795 1716480 1737011 1762114 1787200 1809149 1831693
$$ packed form
58378H76925k283k999j106J261J207Q34L429P227Q741R120J1201J3426J2748J0840
58364I50571J1298J3285J3807J3621J5072J6728J5987J4248J3908J3194R691N782
58352A107192M614M117J187j746r23J488J236k28J058L876M528M257O556R954
58338A147166J0791J0507J2770J6087J6643J5748J6985J8735J7200J4098J3528
58327A310258J3981J1343P071N299M587Q79l963n075l542l878n043k674K043M380
58313A335666M751O794R254Q611P209R697J3820J4003J1535J1779J3896J3242
58301A460257J1397J3406J7353J7182J3955J3675J5810J4871J1666J1971J5295
58290A616838J5982J4205J5080J8120J8570J7685K0531K5103K5086K1949K2544
$$ plain form
58279 1831693 1857890 1884248 1907928 1932810 1962512 1994160 2025013 2058423 2097182 2137797 2177466
58268 2177466 2219779 2267444 2316583 2364456 2415360 2472374 2530958 2587460 2645930 2709411 2772572
58257 2772572 2830589 2887188 2946153 3003191 3054416 3104630 3158728 3213209 3264852 3319267 3381885
58246 3381885 3448992 3516735 3590145 3673831 3762932 3853144 3950350 4060128 4177345 4296685 4423485
58235 4423485 4563096 4709932 4858800 5016525 5190196 5374810 5565365 5769781 5996202
58226 5996202 6239133 6492455 6764148 7063080 7383822 7720800 8084767 8488132 8927068
58217 8927068 9396180 9907254 10474319 11094480 11764355 12501125 13325688 14240565 15248319
58208 15248319 16376390 17659429 19115500 20769094 22681672 24930796 27578447 30692622
$$ packed form
58279A831693K6197K6358K3680K4882K9702L1648L0853L3410L8759M0615L9669
58268B177466M2313M7665M9139M7873N0904N7014N8584N6502N8470O3481O3161
58257B772572N8017N6599N8965N7038N1225N0214N4098N4481N1643N4415O2618
58246C381885O7107O7743P3410Q3686Q9101R0212R7206J09778J17217J19340J26800
58235D423485J39611J46836J48868J57725J73671J84614J90555K04416K26421
58226E996202K42931K53322K71693K98932L20742L36978L63967M03365M38936
58217H927068M69112N11074N67065O20161O69875P36770Q24563R14877J007754
58208A5248319J128071J283039J456071J653594J912578K249124K647651L114175
$$ plain form
58200 30692622 34379795 38760359 43936069 50026738 57221196 65751859 75850278 87786282
58192 87786282 101930014 118725733 138653566 162298114 190375741 223466234 261520383
58185 261520383 303443421 346792635 387477311 419859154 438021921 438119544 420294167
58178 420294167 388589111 348959858 307011720 266825118 230862285 200224778 174877063
58171 174877063 153936811 136129245 120284258 105686538 92153932 79840927 68934821
58164 68934821 59482234 51413752 44619720 38957042 34240623 30289880 26974324 24192876
58156 24192876 21838844 19817022 18072295 16570165 15265339 14113917 13097179 12205572
58148 12205572 11412870 10689652 10028178 9430403 8883471 8369091 7886029 7441985 7032737
$$ packed form
58200C0692622L687173M380564N175710O090669P194458Q530663J0098419J1936004
58192H7786282J4143732J6795719J9927833K3644548K8077627L3090493L8054149
58185B61520383M1923038M3349214M0684676L2381843J8162767R7623j7825377
58178D20294167l1705056l9629253m1948138m0186602l5962833l0637507k5347715
58171A74877063k0940252j7807566j5844987j4597720j3532606j2313005j0906106
58164F8934821r452587q068482o794032n662678m716419l950743l315556k781448
58156B4192876k354032k021822j744727j502130j304826j151422j016738q91607
58148A2205572p92702p23218o61474n97775n46932n14380m83062m44044m09248
$$ plain form
58139 7032737 6648906 6294016 5976483 5691358 5427470 5184949 4968951 4773497 4587760
58130 4587760 4411401 4248264 4091862 3932627 3773445 3623388 3481853 3342913 3209380
58121 3209380 3088308 2977471 2869736 2766227 2672398 2585755 2500028 2417214 2343433 2276997
58111 2276997 2212234 2150853 2097903 2050443 2001672 1952554 1908249 1866723 1822036 1775563 1733004
58100 1733004 1693306 1651262 1608250 1569856 1535369 1499915 1464635 1434723 1409412 1383663 1357903
58089 1357903 1336590 1318918 1300144 1280578 1264332 1250683 1235360 1218848 1204882 1192178 1175985
58078 1175985 1156468 1137404 1118104 1094827 1068907 1045329 1024326 1002270 979731 960717 944854
58067 944854 928196 911066 897417 887007 875761 863471 853809 846947 839295 830458 823618 819042 813708
$$ packed form
58139G032737l83831l54890l17533k85125k63888k42521k15998j95454j85737
58130D587760j76359j63137j56402j59235j59182j50057j41535j38940j33533
58121C209380j21072j10837j07735j03509r3829q6643q5727q2814p3781o6436
58111B276997o4763o1381n2950m7460m8771m9118m4305m1526m4687m6473m2559
58100A733004l9698m2044m3012l8394l4487l5454l5280k9912k5311k5749k5760
58089A357903k1313j7672j8774j9566j6246j3649j5323j6512j3966j2704j6193
58078A175985j9517j9064j9300k3277k5920k3578k1003k2056k2539j9014j5863
58067I44854j6658j7130j3649j0410j1246j2290r662o862p652q837o840m576n334
$$ plain form
58054 813708 807177 801537 795904 787306 776689 767807 760534 751516 740994 732633 726828 720496 713390 708380
58040 708380 705415 701297 695624 691068 687659 682557 675707 670021 665812 660576 654369 649756 646216 640227
58026 640227 631260 622301 614100 604368 593100 583259 575543 567632 559225 552749 548421 543534 537443 532550
58012 532550 529648 526817 523493 521169 519634 516990 513808 512800 513988 514602 513965 514030 514913 514641 513646 514748
57996 514748 518155 521085 522872 525810 530309 533900 535809 538038 541091 543034 543615 544962 547321 548400
57982 548400 547728 547359 547479 545665 541546 537852 535746 533219 529213 525251 521893 517680 512766 509610 508798
57967 508798 507980 506149 505155 505785 506271 505982 506841 509673 512745 515277 518853 524025 528987 532934 537289 542330
57951 542330 546004 547428 548305 549646 550389 550370 551165 552756 552895 551270 550858 553590 557853 561786 565888 570820
$$ packed form
58054H13708o531n640n633q598j0617q882p273r018j0522q361n805o332p106n010
58040G08380k965m118n673m556l409n102o850n686m209n236o207m613l540n989
58026F40227q967q959q201r732j1268r841p716p911q407o476m328m887o091m893
58012E32550k902k831l324k324j535k644l182j008J188O14o37O5Q83k72r95J102
57996E14748L407K930J787K938M499L591J909K229L053J943N81J347K359J079
57982E48400o72l69J20j814m119l694k106k527m006l962l358m213m914l156q12
57967E08798q18j831r94O30M86k89Q59K832L072K532L576N172M962L947M355N041
57951E42330L674J424Q77J341P43j9P95J591J39j625m12K732M263L933M102M932
$$ plain form
57935 570820 575814 580856 587516 596062 604598 612334 620757 630210 638427 643943 647902 650988 651569 648622
57921 648622 643642 637911 630535 620875 610352 600187 589771 578795 568591 559927 551788 543645 536605
57908 536605 531167 526266 521657 518712 517722 517011 515815 515308 515634 514824 512036 509008 506840 504087 499611
57893 499611 494612 490211 485694 480772 477008 475295 474370 473401 473522 475168 476489 476261 475974 477086 478436
57878 478436 478233 476563 474184 470877 466650 462575 458819 453834 446974 439885 433872 428017 421382 415003
57864 415003 410140 406614 404274 403999 405741 407719 408971 410659 413552 416555 419154 422922 428978 436197
57850 436197 443491 451511 460493 468809 475420 481450 487619 492498 495111 496904 499178 500915 501126 500970 501452
57835 501452 501342 499614 497764 497398 497650 497294 497284 498730 500406 500865 501185 502966 505368 506791 507975 510664
$$ packed form
57935E70820M994N042O660Q546Q536P736Q423R453Q217N516L959L086N81k947
57921F48622m980n731p376r660j0523j0165j0416j0976j0204q664q139q143p040
57908E36605n438m901m609k945r90p11j196n07L26q10k788l028k168k753m476
57893D99611m999m401m517m922l764j713r25r69J21J646J321k28k87J112J350
57878D78436k03j670k379l307m227m075l756m985o860p089o013n855o635o379
57864D15003m863l526k340k75J742J978J252J688K893L003K599L768O056P219
57850D36197P294Q020Q982Q316O611O030O169M879K613J793K274J737K11j56M82
57835E01452j10j728j850l66K52l56j0J446J676M59L20J781K402J423J184K689
$$ plain form
57819 510664 514492 517797 520390 523044 525277 525980 525285 523772 520983 516842 513236 511901 511765 510467 507315
57804 507315 502616 495489 484938 472190 459540 447617 435932 425241 416942 410714 404996 399448 395024
57791 395024 392048 390063 389092 389410 390565 392110 394607 398473 402749 406555 410737 416456 423199 429937 437131
57776 437131 445693 454909 463379 471183 479202 487060 493660 499034 503788 507342 508517 507308 504378 499515
57762 499515 492311 483659 474853 465779 455583 444451 433173 421826 410516 400536 392910 386593 379907
57749 379907 373062 367520 363657 360927 359522 359791 360619 360470 359732 360106 361919 363741 364462 364111 362927 361121
57733 361121 359272 357642 355568 352754 350443 349901 350534 351008 351385 352511 354112 355256 355959 356616 356623 355468
57717 355468 354441 355241 357330 358646 358516 357972 357585 356934 356017 355360 354745 353401 351335 349097 346574 343422
$$ packed form
57819E10664L828L305K593K654K233P03o95j513k789m141l606j335j36j298l152
57804E07315m699p127j0551j2748j2650j1923j1685j0691q299o228n718n548m424
57791C95024k976j985r71L18J155J545K497L866M276L806M182N719O743O738P194
57776D37131Q562R216Q470P804Q019P858O600N374M754L554J175j209k930m863
57762D99515p204q652q806r074j0196j1132j1278j1347j1310r980p626o317o686
57749C79907o845n542l863k730j405K69Q28j49p38L74J813J822P21l51j184j806
57733C61121j849j630k074k814k311n42O33M74L77J126J601J144P03O57Pj155
57717C55468j027Q00K089J316j30n44l87o51r17o57o15j344k066k238k523l152
$$ plain form
57701 343422 340233 337825 335898 333790 331948 331052 330369 328685 326326 324606 323841 323543 323923 325415 327285
57686 327285 328489 329353 330721 332208 333187 334732 338425 343865 349602 356046 365131 377449 392167 409723
57672 409723 432216 460855 495113 534794 581200 636023 700553 775694 860785 952014 1042957
57661 1042957 1125916 1191304 1227472 1225224 1184021 1112523 1023160 927432 834797 751785 680464
57650 680464 619613 568277 526817 494612 469143 448103 430591 415776 402341 389950 379505
57639 379505 371286 364375 358376 354025 351517 349789 347960 346116 344320 342360 340714 340148 340102 339126 337198
57624 337198 335883 335834 335871 335021 333723 332500 331074 329452 328289 327548 326187 323696 320651 317477 314096 311085
57608 311085 309518 309316 309323 309355 310496 313023 315754 317882 319776 321537 322618 323329 324769 326602 326795 324441
$$ packed form
57701C43422l189k408j927k108j842q96o83j684k359j720p65k98L80J492J870
57686C27285J204Q64J368J487R79J545L693N440N737O444R085J2318J4718J7556
57672D09723K2493K8639L4258L9681M6406N4823O4530P5141Q5091R1229R0943
57661A042957Q2959O5388L6168k248m1203p1498q9363r5728r2635q3012p1321
57650F80464o0851n1336m1460l2205k5469k1040j7512j4815j3435j2391j0445
57639C79505q219o911n999m351k508j728j829j844j796j960j646n66m6r76j928
57624C37198j315m9L7q50j298j223j426j622j163p41j361k491l045l174l381l011
57608C11085j567k02PL2J141K527K731K128J894J761J081P11J440J833J93k354
$$ plain form
57592 324441 321092 318476 316572 314737 312926 310793 307334 302617 298430 296094 294940 293835 292725 291679
57578 291679 289913 287016 283903 281451 279328 277130 275406 274476 273459 271551 269198 266999 264562 261537
57564 261537 258694 256803 255335 253373 251080 249318 248535 248785 250078 251946 253443 254201 254758 255373 255554 255248
57548 255248 255333 256323 257716 259262 261643 265137 268869 272159 275420 278889 281796 283738 285617 288032 289889
57533 289889 289818 288069 285789 283248 279954 275878 271429 266737 261876 257320 253452 250120 247261 245302 244412
57518 244412 244093 244024 244523 245760 247418 249567 252775 256862 260732 264046 267853 272824 278070 282558 286524
57503 286524 290565 294395 297467 299872 301782 302952 303527 304250 305145 305199 304172 303388 303725 304087 303061 300913
57487 300913 298725 296684 294484 292461 291019 289796 288525 287808 287945 287941 286826 285010 283243 281279 278816
$$ packed form
57592C24441l349k616j904j835j811k133l459m717m187k336j154j105j110j046
57578B91679j766k897l113k452k123k198j724r30j017j908k353k199k437l025
57564B61537k843j891j468j962k293j762p83K50J293J868J497P58N57O15J81l06
57548B55248Q5R90J393J546K381L494L732L290L261L469K907J942J879K415J857
57533B89889p1j749k280k541l294m076m449m692m861m556l868l332k859j959q90
57518B44412l19o9M99J237J658K149L208M087L870L314L807M971N246M488L966
57503B86524M041L830L072K405J910J170N75P23Q95N4j027p84L37L62j026k148
57487C00913k188k041k200k023j442j223j271p17J37mj115j816j767j964k463
$$ plain form
57472 278816 276656 275501 274566 272829 270761 269428 268749 268081 267622 267628 267105 265039 262343 260901 261103 261884 262734
57455 262734 264008 265582 266788 267529 268157 268516 268432 268701 270146 272046 273035 273287 274228 276248 278311 279869
57439 279869 281601 283994 286554 288773 290774 292681 294206 295096 295304 294754 293655 292828 292870 293253 293054 292262
57423 292262 291450 290596 289364 288236 288165 289210 290562 291720 292603 292821 292029 290902 290555 291033 291442 291446 291487 291673
57405 291673 291676 291750 292634 294276 295711 296357 296489 296365 295904 295390 295510 296483 297911 299581 301610 303759 305389
57388 305389 306218 306536 306780 307528 309547 312979 316799 319998 322962 326564 330273 332598 333400 334298 336473 339270
57372 339270 341351 342136 341703 340261 338261 336330 334663 333024 331507 330674 330799 331620 332857 334342 335679
57357 335679 336561 337355 338584 339872 340391 340338 340922 342677 344808 346634 348685 351823 355932 360066 363472 366000
$$ packed form
57472B78816k160j155r35j737k068j333o79o68m59On23k066k696j442K02P81Q50
57455B62734J274J574J206P41O28L59q4K69J445J900R89K52R41K020K063J558
57439B79869J732K393K560K219K001J907J525Q90K08n50j099q27M2L83j99p92
57423B92262q12q54j232j128p1J045J352J158Q83K18p92j127l47M78M09MM1J86
57405B91673LP4Q84J642J435O46J32j24m61n14J20R73J428J670K029K149J630
57388C05389Q29L18K44P48K019L432L820L199K964L602L709K325Q02Q98K175K797
57372C39270K081P85m33j442k000j931j667j639j517q33J25Q21J237J485J337
57357C35679Q82P94J229J288N19n3N84J755K131J826K051L138M109M134L406K528
$$ plain form
57341 366000 367810 369066 369901 370633 371938 374388 377506 379795 380315 379807 379600 379887 380003 380010 380854 382931 385547
57324 385547 387923 389886 391462 392567 393322 394077 395023 396234 397858 399690 400831 400631 399750 399475 400113 400945
57308 400945 401567 402307 403361 404496 405693 407284 409375 411762 414344 416952 419094 420650 422429 425072 427760
57293 427760 429128 429183 429094 429395 429733 430221 431532 433526 435213 436303 437430 438617 438920 437971 436479 434722
57277 434722 431963 428018 424176 421654 420088 418385 416368 414867 414731 416231 418943 421938 424720 428103
57263 428103 433452 440972 449563 458412 467636 477245 486626 495437 503943 512108 519386 525770 531986 538276
57249 538276 544094 549388 554917 560799 565960 569792 573213 577303 581872 586190 590194 594201 598269 602590
57235 602590 607662 613389 618885 623931 629716 637292 646127 655028 663678 672321 680728 688513 695932 703432
$$ packed form
57341C66000J810J256Q35P32J305K450L118K289N20n08k07K87J16PQ44K077K616
57324C85547K376J963J576J105P55P55R46J211J624J832J141k00q81k75O38Q32
57308D00945O22P40J054J135J197J591K091K387K582K608K142J556J779K643K688
57293D27760J368N5q9L01L38M88J311J994J687J090J127J187L03r49j492j757
57277D34722k759l945l842k522j566j703k017j501j36J500K712K995K782L383
57263D28103N349P520Q591Q849R224R609R381Q811Q506Q165P278O384O216O290
57249E38276N818N294N529N882N161L832L421M090M569M318M004M007M068M321
57235F02590N072N727N496N046N785P576Q835Q901Q650Q643Q407P785P419P500
$$ plain form
57221 703432 710870 717977 725086 732604 740291 747856 755737 764490 773862 783205 792432 801858 811554 821614
57207 821614 832569 844760 857548 869793 880896 891033 900887 911553 924032 938189 952797 967117
57195 967117 981741 997315 1013306 1028902 1044323 1060155 1076017 1091065 1105550 1120775 1137612
57184 1137612 1155877 1175069 1195014 1215854 1237948 1261602 1286533 1312022 1338085 1365875 1396238
57173 1396238 1428389 1460690 1492305 1523375 1554135 1584725 1615475 1646495 1677286 1707483 1737625
57162 1737625 1768506 1800234 1832703 1866472 1902192 1939510 1977494 2015895 2055019 2094597 2133750
57151 2133750 2172088 2210063 2248345 2287435 2327660 2368856 2410405 2452249 2495404 2540656 2587237
57140 2587237 2633907 2680976 2730090 2782187 2836817 2893493 2952568 3014609 3079845 3148455 3220664
$$ packed form
57221G03432P438P107P109P518P687P565P881Q753R372R343R227R426R696J0060
57207H21614J0955J2191J2788J2245J1103J0137R854J0666J2479J4157J4608J4320
57195I67117J4624J5574J5991J5596J5421J5832J5862J5048J4485J5225J6837
57184A137612J8265J9192J9945K0840K2094K3654K4931K5489K6063K7790L0363
57173A396238L2151L2301L1615L1070L0760L0590L0750L1020L0791L0197L0142
57162A737625L0881L1728L2469L3769L5720L7318L7984L8401L9124L9578L9153
57151B133750L8338L7975L8282L9090M0225M1196M1549M1844M3155M5252M6581
57140B587237M6670M7069M9114N2097N4630N6676N9075O2041O5236O8610P2209
$$ plain form
57129 3220664 3296425 3375584 3458244 3544367 3633440 3725396 3821515 3923365 4031192 4144517 4264016
57118 4264016 4391516 4528362 4675356 4834372 5008481 5200220 5411142 5643269 5899317
57109 5899317 6181062 6489335 6826767 7199526 7615862 8084637 8616482 9225413 9928728
57100 9928728 10747094 11706351 12838513 14180271 15772068 17659944 19896664 22538668
57092 22538668 25641530 29257611 33433899 38207126 43598898 49613810 56236376 63422410
57084 63422410 71090179 79118607 87348728 95581858 103583037 111102915 117905491 123767387
57076 123767387 128441777 131632935 133033065 132413508 129707121 125030769 118651819 110932887
57068 110932887 102277964 93086462 83720691 74491223 65653596 57404752 49877781 43142655
$$ packed form
57129C220664P5761P9159Q2660Q6123Q9073R1956R6119J01850J07827J13325J19499
57118D264016J27500J36846J46994J59016J74109J91739K10922K32127K56048
57109E899317K81745L08273L37432L72759M16336M68775N31845O08931P03315
57100I928728Q18366R59257J132162J341758J591797J887876K236720K642004
57092B2538668L102862L616081M176288M773227N391772O014912O622566P186034
57084F3422410P667769Q028428Q230121Q233130Q001179P519878O802576N861896
57076A23767387M674390L191158J400130o19557k706387m676352o378950p718932
57068A10932887q654923r191502r365771r229468q837627q248844p526971o735126
$$ plain form
57060 43142655 37215705 32072147 27657393 23898340 20714851 18028008 15763811 13855059
57052 13855059 12243120 10878244 9718188 8727284 7876472 7142431 6505689 5949901 5462518
57043 5462518 5034348 4657455 4324006 4027129 3761686 3523635 3309425 3116241 2941872
57034 2941872 2783883 2639715 2507927 2388496 2281528 2186504 2103129 2031981 1973847 1929030
57024 1929030 1897707 1880360 1877681 1890629 1920739 1969611 2037548 2121758 2213492 2294965 2341201
57013 2341201 2330372 2256158 2130413 1973944 1805799 1639804 1485779 1349497 1232037 1131860
57003 1131860 1047644 978187 920826 872150 830059 793705 761934 733377 707806 685885 667607
56992 667607 652102 638735 627203 616865 607238 599111 594004 592579 594480 599462 607506 617773 628279
$$ packed form
57060D3142655n926950n143558m414754l759053l183489k686843k264197j908752
57052A3855059j611939j364876j160056r90904q50812p34041o36742n55788m87383
57043E462518m28170l76893l33449k96877k65443k38051k14210j93184j74369
57034B941872j57989j44168j31788j19431j06968r5024q3375p1148n8134m4817
57024A929030l1323j7347k679J2948L0110M8872O7937Q4210R1734Q1473M6236
57013B341201j0829p4214j25745j56469j68145j65995j54025j36282j17460j00177
57003A131860q4216o9457n7361m8676m2091l6354l1771k8557k5571k1921j8278
56992F67607j5505j3367j1532j0338r627q127n107j425J901M982Q044J0267J0506
$$ plain form
56979 628279 636444 639234 633360 616854 590809 558785 524463 490352 458187 429316 404517 384193
56967 384193 368726 358052 351260 347447 346718 349575 355764 364747 376951 393438 414440 439083 466151
56954 466151 493726 518028 533933 537338 526863 503725 470973 432766 393248 355570 321994 294279
56942 294279 273126 257697 246734 239943 237547 239054 243714 251911 264872 283148 306560 335387
56930 335387 370133 409847 451478 490551 521313 536934 532113 506792 466513 418646 368858 320739
56918 320739 276688 237874 204238 175452 151553 132369 117061 104642 94381 85548 77540 70453
56906 70453 64780 60321 56204 52098 48591 46185 44762 44215 44719 46126 47967 50277 53647 58246 63667
56891 63667 69980 78129 89004 102840 119611 139100 160435 182446 204550 226130 244807 256606
$$ packed form
56979F28279Q165K790n874j6506k6045l2024l4322l4111l2165k8871k4799k0324
56967C84193j5467j0674o792l813p29K857O189Q983J2204J6487K1002K4643K7068
56954D66151K7575K4302J5905L405j0475k3138l2752l8207l9518l7678l3576k7715
56942B94279k1153j5429j0963o791k396J507M660Q197J2961J8276K3412K8827
56930C35387L4746L9714M1631L9073L0762J5621m821k5321m0279m7867m9788m8119
56918C20739m4051l8814l3636k8786k3899j9184j5308j2419j0261q833q008p087
56906G0453n673m459m117m106l507k406j423n47N04J407J841K310L370M599N421
56891F3667O313Q149J0875J3836J6771J9489K1335K2011K2104K1580J8677J1799
$$ plain form
56879 256606 258624 251003 236174 217199 197149 178743 163485 151536 142862 138012 137532 141395 149407
56866 149407 161582 177908 198491 224144 256124 295121 341258 394938 456170 522190 586408
56855 586408 640265 675953 688182 675549 641558 593495 539184 484679 434459 392088 359610
56844 359610 337132 323891 319338 323040 334552 354075 382528 420580 468478 527152 598339 682665
56832 682665 778066 879937 981020 1070140 1132998 1157255 1138394 1081223 996695 897671 795918
56821 795918 700281 615966 545115 487910 443414 410358 387967 375956 373813 380689 396226 420874
56809 420874 455265 499892 555257 621010 694105 768176 834697 884219 907459 898159 856876 791470
56797 791470 712949 630923 552300 481695 421283 371113 330876 300795 280213 266697 258010 254190
$$ packed form
56879B56606K018p621j4829j8975k0050j8406j5258j1949q674m850m80L863Q012
56866A49407J2175J6326K0583K5653L1980L8997M6137N3680O1232O6020O4218
56855E86408N3857L5688J2229j2633l3991m8063n4311n4505n0220m2371l2478
56844C59610k2478j3241m553L702J1512J9523K8453L8052M7898N8674P1187Q4326
56832F82665R5401J01871J01083Q9120O2858K4257j8861n7171q4528r9024j01753
56821G95918r5637q4315p0851n7205m4496l3056k2391j2011k143O876J5537K4648
56809D20874L4391M4627N5365O5753P3095P4071O6521M9522K3240r300m1283o5406
56797G91470p8521q2026p8623p0605o0412n0170m0237l0081k0582j3516q687l820
$$ plain form
56785 254190 256498 265126 279303 299000 324984 357196 393929 432112 467269 493635 505780 500825
56773 500825 479243 444283 401098 355294 310799 269047 230522 196379 167811 144683 125938
56762 125938 110893 99178 89938 82209 75750 70600 66132 61508 56820 52936 50329 48701 47491 46235
56748 46235 44758 43529 43324 44114 44913 45163 45356 45774 45667 44600 43519 43320 43255 42037 39778 37527 35545
56731 35545 33455 31592 30789 31084 31880 33118 35104 37468 39503 41331 43566 46089 48247 50101 52286
56716 52286 54816 57136 59250 61733 64657 67408 69522 70927 71573 71617 71643 71913 71845 71072 70416 70789 71683
56699 71683 71910 71318 70556 69732 68669 67998 68466 69428 69558 68819 68188 67663 66297 64270 63155 63669 64708
56682 64708 65097 65012 65079 65240 65154 64885 64647 64536 64676 64937 64460 62384 59169 56332 54734 53975 53487 53266 53396
$$ packed form
56785B54190K308Q628J4177J9697K5984L2212L6733L8183L5157K6366J2145m955
56773E00825k1582l4960m3185m5804m4495m1752l8525l4143k8568k3128j8745
56762A25938j5045j1715r240p729o459n150m468m624m688l884k607j628j210j256
56748D6235j477j229k05P90P99K50J93M18j07j067j081j99o5j218k259k251j982
56731C5545k090j863q03K95P96J238J986K364K035J828K235K523K158J854K185
56716E2286K530K320K114K483K924K751K114J405O46M4K6K70o8p73o56L73Q94
56699G1683K27n92p62q24j063o71M68R62J30p39o31n25j366k027j115N14J039
56682F4708L89q5O7J61q6k69k38j11J40K61m77k076l215k837j598p59m88k21J30
$$ plain form
56663 53396 53756 54421 55589 57025 58294 59452 60764 61991 62906 64240 67020 71146 75772 80869 87011
56648 87011 93605 98887 102096 104422 107416 111519 116427 121741 126802 130950 134438 138247 142580 146393
56634 146393 148792 150090 151124 152310 153717 155355 156987 158190 158832 159002 158532 157204 155373 153681 152231
56619 152231 150734 149259 148056 146850 145178 143216 141363 139318 136636 133890 132040 130833 129106 126552
56605 126552 123934 121639 119392 117351 116093 115430 114597 113699 113579 114190 114514 114255 114090 114111 113621 112784 112799 113932
56587 113932 114911 114942 114816 115354 116147 116606 116990 117624 118213 118695 119716 121555 123553 125192 126764 128506 130129
56570 130129 131734 134093 137464 141119 144524 147990 151807 155907 160799 167545 176321 186216 196973 209568
56556 209568 224423 240402 256315 272040 287272 300447 310081 316392 320807 324623 328668 333217 337552
$$ packed form
56663E3396L60O65J168J436J269J158J312J227R15J334K780M126M626N097O142
56648H7011O594N282L209K326K994M103M908N314N061M148L488L809M333L813
56634A46393K399J298J034J186J407J638J632J203O42J70m70j328j831j692j450
56619A52231j497j475j203j206j672j962j853k045k682k746j850j207j727k554
56605A26552k618k295k247k041j258o63q33q98j20O11L24k59j65K1m90q37J5J133
56587A13932R79L1j26N38P93M59L84O34N89M82J021J839J998J639J572J742J623
56570A30129J605K359L371L655L405L466L817M100M892O746Q776R895J0757J2595
56556B09568J4855J5979J5913J5725J5232J3175R634O311M415L816M045M549M335
$$ plain form
56543 337552 340487 341840 342457 342531 341291 338773 336296 334359 331595 326767 320426 313573 306079 297587 288664
56528 288664 279768 270219 259525 248752 239266 231002 223268 216395 211230 207563 204387 201310 198633 196356
56514 196356 194070 191510 188609 185387 182230 179659 177415 174638 171334 168669 167289 166527 165865 165826 166536
56499 166536 166760 165603 164047 163579 164175 164850 165344 165985 166552 166486 165815 164925 163923 162897 162238 162065 162047 162228
56481 162228 163064 164104 163954 162320 160793 160673 161299 161574 161788 162596 163444 163540 163448 164255 165886 167530 168979
56464 168979 170305 171033 170896 170659 170994 171390 171326 171581 172946 174519 174813 173942 173319 173678 174679 175869 176755
56447 176755 176518 174951 173246 172741 173331 174029 174416 174503 174048 173136 172687 173275 174226 174925 175970 177838 179542
56430 179542 180071 180092 180625 181042 180200 178769 178507 179705 181073 181754 181860 181421 180496 180023 180993 182977 184767
$$ packed form
56543C37552K935J353O17P4j240k518k477j937k764m828o341o853p494q492q923
56528B88664q896r549j0694j0773r486q264p734o873n165l667l176l077k677k277
56514A96356k286k560k901l222l157k571k244k777l304k665j380p62o62l9P10
56499A66536K24j157j556m68N96O75M94O41N67o6o71q90j002j026o59j73j8J81
56481A62228Q36J040j50j634j527j20O26K75K14Q08Q48R6r2Q07J631J644J449
56464A68979J326P28j37k37L35L96o4K55J365J573K94q71o23L59J001J190Q86
56447A76755k37j567j705n05N90O98L87Q7m55r12m49N88R51O99J045J868J704
56430A79542N29K1N33M17q42j431k62J198J368O81J06m39r25m73R70J984J790
$$ plain form
56413 184767 186133 187651 189253 190358 191057 191790 192270 192033 191597 191752 192255 192493 192748 193337 193253 191428 188860
56396 188860 187619 187998 188356 187626 186363 185390 184943 185231 186516 188526 190836 193721 197676 202389 207104 211467
56380 211467 215118 217244 217743 218076 219696 222312 224970 227835 231433 235077 237792 240009 242617 245084 246352
56365 246352 246875 247832 248978 249204 248716 248558 248449 247172 244873 242979 242019 241390 241061 241589 242584 243030 243050 243640
56347 243640 244844 245909 246930 248551 250310 251109 251090 251240 251386 250487 248699 247334 246994 247495 249173 252334
56331 252334 255853 258384 260551 263814 267633 270174 271571 273873 277742 281705 284846 287806 290708 292522
56317 292522 293012 293276 293832 294089 294037 294471 295276 295385 294772 294550 294982 295339 295858 297700 300755 303639 306164 309637
56299 309637 314401 319256 323747 328799 334568 339786 343838 347480 350904 353088 353679 353766 354305 355488 357935
$$ packed form
56413A84767J366J518J602J105O99P33M80k37m36J55N03K38K55N89q4j825k568
56396A88860j241L79L58p30j263r73m47K88J285K010K310K885L955M713M715M363
56380B11467L651K126M99L33J620K616K658K865L598L644K715K217K608K467J268
56365B46352N23R57J146K26m88j58j09j277k299j894r60o29l29N28R95M46K0N90
56347B43640J204J065J021J621J759P99j9J50J46q99j788j365l40N01J678L161
56331B52334L519K531K167L263L819K541J397K302L869L963L141K960K902J814
56317B92522M90K64N56K57n2M34Q05J09o13k22M32L57N19J842L055K884K525L473
56299C09637M764M855M491N052N769N218M052L642L424K184N91Q7N39J183K447
$$ plain form
56284 357935 362472 368355 373687 378046 382801 388533 394161 399063 404013 409542 415266 421233 428107 435714
56270 435714 443204 450797 459362 468380 476596 484727 495006 507799 521257 534664 549566 567079 586732
56257 586732 608542 633621 662006 692449 725147 762208 804690 851744 903398 961528 1026999
56246 1026999 1098517 1175343 1258555 1348382 1442772 1539944 1640001 1742570 1844965 1944083 2038220
56235 2038220 2125790 2204136 2270792 2324234 2362572 2383365 2385655 2370507 2339134 2292489 2233021
56224 2233021 2164351 2088552 2006032 1918522 1829513 1741117 1653220 1566464 1483231 1404782 1330224
56213 1330224 1259337 1193605 1133456 1077331 1024607 976584 933489 893437 855538 821077 790389
56202 790389 761644 734111 709500 688560 669507 651481 636412 625572 617273 609859 604059 600402
$$ packed form
56284C57935M537N883N332M359M755N732N628M902M950N529N724N967O874P607
56270D35714P490P593Q565R018Q216Q131J0279J2793J3458J3407J4902J7513J9653
56257E86732K1810K5079K8385L0443L2698L7061M2482M7054N1654N8130O5471
56246A026999P1518P6826Q3212Q9827R4390R7172J00057J02569J02395R9118R4137
56235B038220Q7570P8346O6656N3442L8338K0793K290j5148l1373m6645n9468
56224B233021o8670p5799q2520q7510q9009q8396q7897q6756q3233p8449p4558
56213A330224p0887o5732o0149n6125n2724m8023m3095m0052l7899l4461l0688
56202G90389k8745k7533k4611k0940j9053j8026j5069j0840q299p414n800l657
$$ plain form
56190 600402 597188 593122 589239 586208 582454 576969 571337 566986 563064 558907 555826 554466 553150 550892
56176 550892 549273 549342 549588 549057 549503 552091 554923 556300 557671 560852 565010 568930 573660 580304 587663
56161 587663 594501 601818 610634 619951 628978 638744 649501 659468 668260 678507 691805 706274 720486
56148 720486 736411 755861 777502 800390 827075 859975 897921 939594 987269 1043721 1108497
56137 1108497 1180817 1263317 1359220 1468420 1589675 1723703 1870241 2024367 2179103 2329093
56127 2329093 2468701 2590117 2688100 2764812 2826635 2878441 2923577 2965404 3003982 3033616 3048015
56116 3048015 3046131 3030040 3000555 2959217 2911358 2861851 2809279 2747985 2673563 2582831 2472035
56105 2472035 2340691 2195587 2046648 1900431 1761080 1634289 1525011 1433035 1355376 1291288
$$ packed form
56190F00402l214m066l883l031l754n485n632m351l922m157l081j360j316k258
56176E50892j619O9K46n31M46K588K832J377J371L181M158L920M730O644P359
56161E87663O838P317Q816R317R027R766J0757R967Q792J0247J3298J4469J4212
56148G20486J5925J9450K1641K2888K6685L2900L7946M1673M7675N6452O4776
56137A108497P2320Q2500R5903J09200J21255J34028J46538J54126J54736J49990
56127B329093J39608J21416R7983P6712O1823N1806M5136M1827L8578K9634J4399
56116C048015j884j6091k9485m1338m7859m9507n2572o1294p4422r0732j10796
56105B472035j31344j45104j48939j46217j39351j26791j09278r1976p7659o4088
$$ plain form
56095 1291288 1240864 1201063 1167804 1140259 1119039 1102303 1087778 1076239 1068777 1063057 1056557 1050833
56083 1050833 1048258 1047348 1045882 1045639 1049002 1053748 1056438 1058308 1062617 1068879 1075020 1082451 1093409 1105826
56069 1105826 1116519 1127061 1140917 1157212 1172932 1188679 1206496 1224552 1239869 1253840 1269169
56058 1269169 1284076 1295495 1305197 1316517 1327926 1336306 1343722 1354133 1366253 1376612 1386914 1401131
56046 1401131 1417975 1433556 1448935 1467574 1487954 1506445 1524966 1547900 1573846 1598421 1622761
56035 1622761 1650984 1681618 1710102 1737620 1768885 1803274 1836839 1870938 1909874 1951979 1992156
56024 1992156 2031363 2074451 2120591 2165142 2209001 2256632 2306882 2355414 2404138 2458336 2516663
56013 2516663 2574111 2632477 2697309 2766964 2835701 2905121 2981137 3062183 3142427 3224138 3314340
$$ packed form
56095A291288n0424l9801l3259k7545k1220j6736j4525j1539p462n720o500n724
56083A050833k575r10j466k43L363M746K690J870M309O262O141P431J0958J2417
56069A105826J0693J0542J3856J6295J5720J5747J7817J8056J5317J3971J5329
56058A269169J4907J1419R702J1320J1409Q380P416J0411J2120J0359J0302J4217
56046A401131J6844J5581J5379J8639K0380J8491J8521K2934K5946K4575K4340
56035A622761K8223L0634K8484K7518L1265L4389L3565L4099L8936M2105M0177
56024A992156L9207M3088M6140M4551M3859M7631N0250M8532M8724N4198N8327
56013B516663N7448N8366O4832O9655O8737O9420P6016Q1046Q0244Q1711R0202
$$ plain form
56002 3314340 3411628 3509362 3609618 3720358 3840778 3963510 4089429 4225826 4371825 4520753
55992 4520753 4675309 4844787 5028752 5219399 5418487 5635325 5869658 6114080 6371891
55983 6371891 6654388 6962005 7287260 7634783 8018162 8438456 8887358 9370442 9904603
55974 9904603 10493662 11130846 11824973 12598807 13462164 14414208 15472772 16673221 18039473
55965 18039473 19589176 21369902 23458166 25922818 28826205 32262281 36353186 41208204
55957 41208204 46934915 53698874 61727786 71258825 82544383 95920716 111814857 130694818
55949 130694818 153107141 179750402 211304617 247952546 288890655 332014109 373651013
55942 373651013 408505393 430527839 435010972 420789571 390804909 350577881 305921250
$$ packed form
56002C314340R7288R7734J00256J10740J20420J22732J25919J36397J45999J48928
55992D520753J54556J69478J83965J90647J99088K16838K34333K44422K57811
55983F371891K82497L07617L25255L47523L83379M20294M48902M83084N34161
55974I904603N89059O37184O94127P73834Q63357R52044J058564J200449J366252
55965A8039473J549703J780726K088264K464652K903387L436076M090905M855018
55957D1208204N726711O763959Q028912R531039J1285558J3376333J5894141J8879961
55949A30694818K2412323K6643261L1554215L6647929M0938109M3123454M1636904
55942C73651013L4854380K2022446M483133j4221401k9984662m0227028m4656631
$$ plain form
55935 305921250 261452997 220236300 183941026 153102434 127484751 106501657 89480562
55928 89480562 75732487 64598030 55531663 48121843 42030237 36963176 32703531 29110516
55920 29110516 26066439 23455495 21194802 19240709 17550727 16070041 14760370 13607925
55912 13607925 12593896 11685419 10861909 10122543 9460779 8856472 8298828 7792696 7335899
55903 7335899 6912788 6515888 6152321 5823101 5516349 5226478 4960694 4720865 4497125
55894 4497125 4284633 4089242 3911561 3742178 3577637 3425102 3286523 3153736 3023936
55885 3023936 2904663 2798578 2697889 2598782 2507308 2426113 2348967 2273451 2206008 2149380 2097404
55874 2097404 2046937 2002564 1964567 1924161 1875965 1824217 1771966 1715189 1652532 1590243 1532291
$$ packed form
55935C05921250m4468253m1216697l6295274l0838592k5617683k0983094j7021095
55928H9480562j3748075j1134457r066367p409820o091606n067061m259645l593015
55920B9110516l044077k610944k260693j954093j689982j480686j309671j152445
55912A3607925j014029r08477q23510p39366o61764o04307n57644n06132m56797
55903G335899m23111l96900l63567l29220l06752k89871k65784k39829k23740
55894D497125k12492j95391j77681j69383j64541j52535j38579j32787j29800
55885C023936j19273j06085j00689r9107r1474q1195p7146p5516o7443n6628n1976
55874B097404n0467m4373l7997m0406m8196n1748n2251n6777o2657o2289n7952
$$ plain form
55863 1532291 1475435 1418678 1367656 1324885 1285147 1245291 1209439 1179888 1151919 1122430 1095133
55852 1095133 1072547 1051125 1028734 1008812 992611 975170 953430 930786 909465 886131 859325
55841 859325 833720 812443 792246 770605 750646 734699 719720 703507 689007 678205 668019
55830 668019 656379 646258 639544 632911 623911 615433 610145 605937 600656 595868 592197 586380 576714 566355
55816 566355 557807 549234 539473 531312 526411 522175 517002 513425 512797 512233 510332 510671 515957 523679 531144
55801 531144 539908 551544 563765 574394 584684 595210 602914 605590 604891 601687 593155 577957 559823
55788 559823 542413 524930 506176 488511 474125 461601 449845 441406 438199 437654 436501 434742 432767
55775 432767 428589 421396 414138 409280 405602 402228 401885 406761 414882 423844 434295 446303 456047 459724
$$ packed form
55863A532291n6856n6757n1022m2771l9738l9856l5852k9551k7969k9489k7297
55852A095133k2586k1422k2391j9922j6201j7441k1740k2644k1321k3334k6806
55841H59325k5605k1277k0197k1641j9959j5947j4979j6213j4500j0802j0186
55830F68019j1640j0121o714o633r000q478n288m208n281m788l671n817r666j0359
55816E66355q548q573r761q161m901m236n173l577o28n64j901L39N286P722P465
55801E31144Q764J1636J2221J0629J0290J0526P704K676o99l204q532j5198j8134
55788E59823j7410j7483j8754j7665j4386j2524j1756q439l207n45j153j759j975
55775D32767m178p193p258m858l678l374l43M876Q121Q962J0451J2008R744L677
$$ plain form
55761 459724 457488 450480 437811 419931 401225 385474 371923 358992 348209 340877 334523 326588
55749 326588 318472 312177 306134 298168 289589 282534 276068 268578 261282 255774 250770 244834 239612 236864
55735 236864 235012 232115 229546 229145 229449 228407 227236 227811 228656 227307 224428 221968 219411 215438 211167
55720 211167 208175 205326 201021 196613 194202 193085 191761 191312 193283 196201 197804 198977 201971 206437
55706 206437 210560 214489 219274 223958 226955 228760 230254 230040 226629 221566 217202 213058 207576 201722
55692 201722 197529 194646 191670 189395 189413 190837 191697 192276 194028 196575 198855 201786 206569 211762 215258
55677 215258 217929 222062 227375 231755 234783 237388 239089 238747 237143 235860 234557 232069 229072 226876
55663 226876 224909 222337 220822 222489 226295 229494 231629 234078 236929 239541 243019 248720 255140 259495
$$ packed form
55761D59724k236p008j2669j7880j8706j5751j3551j2931j0783p332o354p935
55749C26588q116o295o043p966q579p055o466p490p296n508n004n936n222k748
55735B36864j852k897k569m01L04j042j171N75Q45j349k879k460k557l973m271
55720B11167k992k849m305m408k411j117j324m49J971K918J603J173K994M466
55706B06437M123L929M785M684K997J805J494k14l411n063m364m144n482n854
55692B01722m193k883k976k275J8J424Q60N79J752K547K280K931M783N193L496
55677B15258K671M133N313M380L028K605J701l42j604j283j303k488k997k196
55663B26876j967k572j515J667L806L199K135K449K851K612L478N701O420M355
$$ plain form
55649 259495 261557 262766 262587 259205 253106 246481 239580 231003 221231 212505 205356 198399 191432 185680
55635 185680 181026 175867 169891 164370 159727 155293 151294 148677 147129 145532 143987 143164 142277 140124 137448
55620 137448 135713 134273 131447 127739 125130 123675 121731 119174 117457 116689 115566 114095 113577 113895 113579
55605 113579 112588 112407 113287 113917 113877 113884 113653 112075 109643 108203 108101 107874 106859 105813 104925 103589 102237
55588 102237 102119 103109 103832 103970 104316 104657 103874 102172 101012 100829 100895 101241 102468 103875 104143 103815 104656 106610
55570 106610 107860 108008 108666 110607 112692 114121 115553 117563 119864 122352 125167 127619 128834 129383 130406
55555 130406 131425 131046 129443 127908 126277 123344 119696 117498 117263 117397 117208 117853 119834 121949 123300
55540 123300 124331 125447 126591 128375 131502 134889 136521 136437 136690 138125 139451 139781 139694 139372 137973 135433
$$ packed form
55649B59495K062J209j79l382o099o625o901q577r772q726p149o957o967n752
55635A85680m654n159n976n521m643m434l999k617j548j597j545q23q87k153k676
55620A37448j735j440k826l708k609j455j944k557j717p68j123j471n18L18l16
55605A13579r91j81Q80O30m0Pk31j578k432j440j02k27j015j046q88j336j352
55588A02237j18R90P23J38L46L41p83j702j160j83O6L46J227J407K68l28Q41J954
55570A06610J250J48O58J941K085J429J432K010K301K488K815K452J215N49J023
55555A30406J019l79j603j535j631k933l648k198k35J34j89O45J981K115J351
55540A23300J031J116J144J784L127L387J632q4K53J435J326L30q7l22j399k540
$$ plain form
55524 135433 132726 129849 125707 120483 115940 112800 109973 106950 104744 103749 102769 101028 99259 98109 97198
55509 97198 96409 96278 96555 96130 94880 93846 93212 92102 90760 90822 92806 95264 97061 98573 100026 100656
55493 100656 100239 99641 99205 98305 97017 96340 96279 95712 94691 94686 95879 96390 95123 93345 92397 91813 90814 89865
55475 89865 89518 89237 88525 87862 87636 87456 87209 87448 88087 88197 87639 87406 87779 87786 87026 86370 86310 86348 86527 87689
55455 87689 89576 90642 90527 90780 92207 93453 93256 92311 91757 91479 91056 90840 91011 90980 90668 90916 91776 91974
55437 91974 90950 89851 89626 89737 89633 89772 90222 89997 88910 88379 89247 90405 90772 91007 91982 93099 93520
55420 93520 93650 94090 94456 94547 95322 97355 99550 100741 101407 102540 103950 105026 106011 107226 108022 107751 106889
55403 106889 106099 105149 103761 102461 101471 99855 96926 93524 90740 88406 85949 83767 82592 82302 82403
$$ packed form
55524A35433k707k877m142n224m543l140k827l023k206r95r80j741j769j150r11
55509I7198p89j31K77m25j250j034o34j110j342O2J984K458J797J512J453O30
55493A00656m17n98m36r00j288o77o1n67j021nJ193N11j267j778r48n84r99r49
55475H9865l47k81p12o63k26j80k47K39O39J10n58k33L73Pp60o56o0L8J79J162
55455H7689J887J066j15K53J427J246j97r45n54k78m23k16J71l1l12K48Q60J98
55437I1974j024j099k25J11j04J39M50k25j087n31Q68J158L67K35R75J117M21
55420I3520J30M40L66R1P75K033K195J191O66J133J410J076R85J215P96k71q62
55403A06889p90r50j388j300r90j616k929l402k784k334k457k182j175k90J01
$$ plain form
55388 82403 82851 83501 83725 83486 83787 85067 86146 85811 84439 83077 81935 80845 80194 80212 80166 79364 78273
55371 78273 77685 77556 77556 77922 78886 80018 80997 82269 84193 86333 88225 89958 91460 92233 92408 92894 93869
55354 93869 94342 93879 93425 93605 93660 93020 92545 93073 93942 94094 93547 92767 91698 90438 89701 89677 89630 89542 90719
55335 90719 93632 96585 97794 97495 96689 95268 92886 90452 89094 88571 88187 88269 89266 90420 90866 91129 92004
55318 92004 92861 92597 91461 90383 89332 87917 86890 87344 88967 90594 92006 93644 95079 95316 94414 93456
55302 93456 93115 93262 93595 93687 92977 91739 91452 93096 95654 97338 97616 97042 95942 94563 93724 93994 94751
55285 94751 95209 95715 96910 98419 99588 100730 102291 103603 103879 103738 104251 105141 105376 104935 104465 103783 102308
55268 102308 100547 99568 99357 99114 98777 98788 98725 97751 96162 95083 94835 95007 95789 97729 100275 102056 102641
$$ packed form
55388H2403M48O50K24k39L01J280J079l35j372j362j142j090o51J8m6q02j091
55371G8273n88j29%L66R64J132R79J272J924K140J892J733J502P73J75M86R75
55354I3869M73m63m54J80N5o40m75N28Q69J52n47p80j069j260p37k4m7q8J177
55335I0719K913K953J209k99q06j421k382k434j358n23l84Q2R97J154M46K63Q75
55318I2004Q57k64j136j078j051j415j027M54J623J627J412J638J435K37r02r58
55302I3456l41J47L33R2p10j238k87J644K558J684K78n74j100j379q39K70P57
55285I4751M58N06J195J509J169J142J561J312K76j41N13Q90K35m41m70o82j475
55268A02308j761r79k11k43l37J1o3r74j589j079k48J72P82J940K546J781N85
$$ plain form
55251 102641 102760 102867 102768 102555 102556 102353 101134 99127 97591 97231 97541 97701 97256 96037 94331 93022 92728 93004
55233 93004 93171 93526 94771 96685 98438 99839 101137 101954 101691 100832 100588 101219 101726 101270 100022 98621 97601
55216 97601 97305 97704 98309 98736 99005 98956 98079 96511 95394 95438 95924 95943 95731 95797 95802 95535 95994 97983 100435 101710
55196 101710 101892 102244 102955 103142 102719 102576 103021 103522 103870 104191 104051 102850 101002 99424 98153 96738 95582
55179 95582 95447 95937 96012 95778 96235 97412 98276 98431 98404 98369 98061 97872 98550 99828 100755 101289 102157 103301 104046
55160 104046 104690 106152 107991 108594 107631 106596 106504 106681 106397 106097 106291 106520 106222 105666 105451 105879 107080 108846
55142 108846 110168 110023 108837 108069 108222 108387 107932 107363 107222 107382 107791 108718 109771 109824 108475 106703 105605
55125 105605 105285 105307 105405 105457 105578 106374 108235 110280 111002 110146 108956 108462 108527 108776 109300 110088 110718 110989 111048
$$ packed form
55251A02641J19J07r9k13Jk03j219k007j536l60L10J60m45j219j706j309k94K76
55233I3004J67L55J245J914J753J401J298Q17k63q59k44O31N07m56j248j401j020
55216I7601k96L99O05M27K69m9q77j568j117M4M86J9k12O6Nk67M59J989K452J275
55196A01710J82L52P11J87m23j43M45N01L48L21j40j201j848j578j271j415j156
55179I5582j35M90P5k34M57J177Q64J55k7l5l08j89O78J278R27N34Q68J144P45
55160A04046O44J462J839O03r63j035r2J77k84l00J94K29k98n56k15M28J201J766
55142A08846J322j45j186p68J53J65m55n69j41J60M09R27J053N3j349j772j098
55125A05605l20K2R8N2J21P96J861K045P22q56j190m94O5K49N24P88O30K71N9
$$ plain form
55106 111048 110741 109781 108650 108402 109341 110859 112639 114903 117297 118673 118386 116961 115288 114048 113969 115438
55090 115438 117610 118964 119051 118712 118478 118006 117345 117440 118741 120311 120930 120290 118748 116812 115262 114879 115559
55073 115559 116415 117062 117957 119288 120410 120745 120416 119694 118685 117808 117697 118289 118796 118779 118483 118040 117258 116353
55055 116353 115889 115722 115024 113612 112341 111859 111889 111997 112226 112681 113309 114230 115416 116019 115036 112759 110574
55038 110574 109260 108597 108645 109995 112465 114836 116356 117379 118178 118370 117988 117877 118387 118742 118271 117259 116136
55021 116136 114892 113793 113546 114106 114339 113561 112479 111987 111926 111713 111352 111178 111274 111636 112258 112722 112478 111823
55003 111823 111718 112309 112644 112232 111892 112579 114286 116518 118892 120880 121971 122618 124036 126564 129127 130735
54987 130735 131527 131918 131817 131256 130810 130807 130979 131340 132394 134015 135206 135500 135532 135720 135525 134650 133829 133713 134035
$$ packed form
55106A11048l07r60j131k48R39J518J780K264K394J376k87j425j673j240p9J469
55090A15438K172J354Q7l39k34m72o61R5J301J570O19o40j542j936j550l83O80
55073A15559Q56O47Q95J331J122L35l29p22j009q77j11N92N07j7k96m43p82r05
55055A16353m64j67o98j412j271m82L0J08K29M55O28R21J186O03r83k277k185
55038A10574j314o63M8J350K470K371J520J023P99J92l82j11N10L55m71j012j123
55021A16136j244j099k47N60K33p78j082m92o1k13l61j74R6L62O22M64k44o55
55003A11823j05N91L35m12l40O87J707K232K374J988J091O47J418K528K563J608
54987A30735P92L91j01n61m46lJ72L61J054J621J191K94L2J88j95q75q21j16L22
$$ plain form
54968 134035 134534 135592 137157 138157 137904 137182 137081 137609 138224 138854 139574 140102 140368 140807 141443 141569 140961 140433
54950 140433 140470 140345 139464 138543 138519 139150 139680 140103 140800 141636 142332 143110 144175 145195 145943 146806 148020 149167
54932 149167 150045 151183 152834 154411 155605 157125 159567 162520 165652 169642 175155 181894 189541 198542
54918 198542 208860 218941 227145 233379 238185 241190 241747 240223 237181 231938 223514 212632 201425
54905 201425 191287 182192 173881 166575 160526 155775 152329 149959 148096 146501 145590 145508 145509 144994 144527 144973
54889 144973 146220 147631 149237 151518 154465 157740 161404 165668 170284 174922 179801 185432 192170 200400
54875 200400 210355 221163 230942 238516 244135 247897 248666 245576 239543 232038 223346 213269 202673 192922
54861 192922 184441 177033 170951 166347 162392 158260 154334 151165 148073 144274 140630 138481 137310 135410
$$ packed form
54968A34035M99J058J565J000k53p22j01N28O15O30P20N28K66M39O36J26o08n28
54950A40433L7j25q81r21k4O31N30M23O97Q36O96P78J065J020P48Q63J214J147
54932A49167Q78J138J651J577J194J520K442K953L132L990N513O739P647R001
54918A98542J0318J0081Q204O234M806L005N57j524l042n243q424j0882j1207
54905B01425j0138r095q311p306o049m751l446k370j863j595r11q2Jn15m67M46
54889A44973J247J411J606K281K947L275L664M264M616M638M879N631O738Q230
54875B00400R955J0808R779P574N619L762P69l090o033p505q692j0077j0596r751
54861A92922q481p408o082m604l955m132l926l169l092l799l644k149j171j900
$$ plain form
54847 135410 132532 130022 128481 127126 125610 124731 124975 125756 126473 127096 127502 127417 127201 127514 128062 127849 126892
54830 126892 126464 127348 128884 130020 130339 129796 128553 127431 127581 129227 131380 133067 134195 134999 135395 135173
54814 135173 134329 133058 131828 131351 131920 132889 133444 133710 134412 135683 136964 137865 138342 138253 137599 137044 137267 137890
54796 137890 137903 137070 136035 135209 134559 134417 135413 137446 139628 141427 143047 144567 145547 145759 145665 145924 146902
54779 146902 148655 150877 152945 154593 156387 158994 162282 165772 169635 174408 180024 185982 192234 199063
54765 199063 206358 213950 222297 231668 240786 247567 251236 252658 252521 250394 245840 239343 231690 223324
54751 223324 214715 206602 199438 193095 187364 182240 177653 173511 170102 167870 166758 166285 166249 166770 167688
54736 167688 168560 169195 169676 170013 170347 171235 173067 175469 177910 180578 183899 187685 191706 196675 203494 211721
$$ packed form
54847A35410k878k510j541j355j516q79K44P81P17O23M06q5k16L13N48k13r57
54830A26892m28Q84J536J136L19n43j243j122J50J646K153J687J128Q04L96k22
54814A35173q44j271j230m77N69R69N55K66P02J271J281R01M77q9o54n55K23O23
54796A37890J3q33j035q26o50j42R96K033K182J799J620J520R80K12r4K59R78
54779A46902J753K222K068J648J794K607L288L490L863M773N616N958O252O829
54765A99063P295P592Q347R371R118O781L669J422j37k127m554o497p653q366
54751B23324q609q113p164o343n731n124m587m142l409k232j112m73l6N21R18
54736A67688Q72O35M81L37L34Q88J832K402K441K668L321L786M021M969O819Q227
$$ plain form
54720 211721 219918 227403 234511 241241 246868 250796 252602 251234 245563 236084 224968 214116 204092
54707 204092 195011 187249 180842 175263 170269 166157 162929 160090 157531 155690 154528 153275 151543 149838
54693 149838 148611 147651 146767 146243 146262 146602 147227 148366 149695 150252 149598 148371 147308 146406 145411 144507 144044
54676 144044 144025 144148 144021 143334 142292 141830 142683 144233 145012 144388 143051 141875 141114 140759 140743 140613 139849 138751
54658 138751 138268 138796 139837 140890 141872 142566 142576 142021 141495 141215 140986 141048 141946 143386 144195 143733 142556 141488
54640 141488 140854 140800 141424 142342 142931 143232 143755 144348 144225 143332 142625 142646 142820 142489 141715 140727 139524 138434 138141
54621 138141 138722 139429 139786 140068 140475 140725 140851 141424 142611 143812 144554 144959 145140 145058 145139 145949 147018 147177
54603 147177 146395 146053 146945 148228 148974 149476 150220 150737 150429 149678 149218 149128 149213 149707 150818 152134 153069 153445
$$ packed form
54720B11721Q197P485P108O730N627L928J806j368n671r479j1116j0852j0024
54707B04092r081p762o407n579m994m112l228k839k559j841j162j253j732j705
54693A49838j227r60q84n24J9L40O25J139J329N57o54j227j063r02r95r04m63
54676A44044j9J23j27o87j042m62Q53J550P79o24j337j176p61l55j6j30p64j098
54658A38751m83N28J041J053R82O94J0n55n26k80k29O2Q98J440Q09m62j177j068
54640A41488o34n4O24R18N89L01N23N93j23q93p07K1J74l31p74r88j203j090k93
54621A38141N81P07L57K82M07K50J26N73J187J201P42M05J81q2Q1Q10J069J59
54603A47177p82l42Q92J283P46N02P44N17l08p51m60r0Q5M94J111J316R35L76
$$ plain form
54585 153445 153298 152836 152803 153886 155348 155383 153409 150947 149541 148992 148447 148045 148353 149069 149518 149845 150629 151739
54567 151739 152486 152550 152043 151097 150024 149427 149583 150176 151031 152378 153951 154758 154384 153655 153316 152988 152258 151800
54549 151800 152338 153305 153664 153483 153588 154203 154945 155748 156807 157968 159077 160506 162505 164461 165635 166192
54533 166192 166695 167077 167062 167108 167929 169339 170468 170865 170597 169619 167951 166212 165140 164741 164579 164603 164970 165404
54515 165404 165515 165454 165564 165691 165574 165540 166033 166766 167099 166968 166689 166175 165145 163810 162602 161474 160205 159101
54497 159101 158609 158496 158198 157767 157701 158030 158321 158386 158300 157928 157160 156472 156570 157632 159409 161719 164202 165959
54479 165959 166289 165633 165119 165296 165905 166563 167036 167177 167285 168158 170016 171775 172242 171721 171499 172008 172567 172845
54461 172845 173426 174658 175884 176211 175521 174476 173913 174272 175220 175882 175797 175485 175616 175891 175411 173986 172436
$$ packed form
54585A53445j47m62l3J083J462L5j974k462j406n49n45m02L08P16M49L27P84J110
54567A51739P47O4n07r46j073n97J56N93Q55J347J573Q07l74p29l39l28p30m58
54549A51800N38R67L59j81J05O15P42Q03J059J161J109J429J999J956J174N57
54533A66192N03L82j5M6Q21J410J129L97k68r78j668j739j072l99j62K4L67M34
54515A65404J11o1J10J27j17l4M93P33L33j31k79n14j030j335j208j128j269j104
54497A59101m92j13k98m31o6L29K91O5q6l72p68o88R8J062J777K310K483J757
54479A65959L30o56n14J77O09O58M73J41J08Q73J858J759M67n21k22N09N59K78
54461A72845N81J232J226L27o90j045n63L59R48O62q5l12J31K75m80j425j550
$$ plain form
54444 172436 171586 171513 171774 171840 171301 170068 168426 166659 164836 163228 162470 162834 163622 163849 163333 162663 162371 162548
54426 162548 163004 163362 163342 163339 164255 166263 168302 169412 169979 170934 172261 173212 173594 173844 174112 174232 174420 175087
54408 175087 175983 176362 175974 175233 174489 173858 173627 174056 174835 175405 175749 176250 176973 177773 178861 180486 182148 182990
54390 182990 182931 182707 182834 183252 183897 184841 185873 186598 186963 187061 186615 185454 184330 184298 185232 185872 185541 184945 184960
54371 184960 185420 185592 185329 185126 185269 185365 184873 183971 183665 184721 186558 187753 187779 187554 187897 188283 187807 186754
54353 186754 186253 186831 188124 189670 191100 191858 191673 191096 190794 190553 189794 188736 188072 187784 187291 186653 186537
54336 186537 187059 187661 188183 189068 190440 191894 193316 194987 196786 198169 199077 200067 201434 203011 204860 207261
54320 207261 209888 211841 212639 212404 211029 208215 204499 201217 199018 197298 195468 193866 192910 192199 191187
$$ packed form
54444A72436q50p3K61O6n39j233j642j767j823j608p58L64P88K27n16o70k92J77
54426A62548M56L58k0lR16K008K039J110N67R55J327R51L82K50K68J20J88O67
54408A75087Q96L79l88p41p44o31k31M29P79N70L44N01P23Q00J088J625J662Q42
54390A82990n9k24J27M18O45R44J032P25L65R8m46j161j124l2R34O40l31n96J5
54371A84960M60J72k63k03J43R6m92r02l06J056J837J195K6k25L43L86m76j053
54353A86754n01N78J293J546J430P58j85n77l02k41p59j058o64k88m93o38j16
54336A86537N22O02N22Q85J372J454J422J671J799J383R08R90J367J577J849K401
54320B07261K627J953P98k35j375k814l716l282k199j720j830j602r56p11j012
$$ plain form
54305 191187 190094 189449 189127 188531 187507 186514 185899 185376 184318 182492 180462 179163 178997 179521 180123 180682 181360
54288 181360 182126 182908 183772 184536 184630 183844 182820 182219 181882 181428 181136 181439 182018 182317 182541 183162 183845 183882 183383
54269 183383 182967 182590 181856 181293 181971 183875 185861 187257 188348 189245 189570 189441 189581 190160 190572 190567 190570 190757 190879
54250 190879 191121 191914 192785 192714 191882 191683 192523 193011 191937 189798 187694 185905 184363 183458 183413 183717 183962 184496
54232 184496 185541 186475 186706 186557 186581 186727 186875 187461 188752 190044 190347 189496 188041 186498 185184 184310 183764
54215 183764 183269 182996 183464 184573 185432 185454 184861 183887 182417 180799 179936 180006 180049 179499 179126 179742 180897 181740
54197 181740 182301 182968 183466 183419 183322 183875 184780 185171 184941 184748 184936 185276 185599 186037 186777 188007 189764 191507
54179 191507 192387 192399 192616 193682 194789 194855 194003 193037 192100 190916 189806 189340 189214 188515 186972 185101 183254
$$ packed form
54305A91187j093o45l22n96j024r93o15n23j058j826k030j299j66N24O02N59O78
54288A81360P66P82Q64P64R4p86j024o01l37m54k92L03N79K99K24O21O83L7m99
54269A83383m16l77p34n63O78J904J986J396J091Q97L25j29J40N79M12nLJ87J22
54250A90879K42P93Q71p1q32j99Q40M88j074k139k104j789j542r05m5L04K45N34
54232A84496J045R34K31j49K4J46J48N86J291J292L03q51j455j543j314q74n46
54215A83764m95k73M68J109Q59K2n93r74j470j618q63P0M3n50l73O16J155Q43
54197A81740N61O67M98m7r7N53R05L91k30j93J88L40L23M38P40J230J757J743
54179A91507Q80J2K17J066J107O6q52r66r37j184j110m66j26o99j543j871j847
$$ plain form
54162 183254 181399 179721 178562 177765 176861 175958 175725 176387 177305 177678 177194 176009 174514 173166 172243 171735 171600
54145 171600 171833 172091 171777 170873 170207 170348 170816 171028 171490 173146 175848 178430 180148 181235 182083 182785 183519
54128 183519 184593 185890 186871 187252 187184 186763 185999 185310 185372 186206 187020 187282 187495 188569 190713 193268 195432
54111 195432 196843 197645 198247 199034 200158 201471 202594 203058 202552 201188 199463 197877 196646 195761 195116 194479
54095 194479 193590 192459 191403 190629 189960 189171 188455 188325 189089 190517 192049 193291 194330 195493 196806 197851
54079 197851 198324 198443 198613 198984 199650 200869 202555 203930 204405 204529 205273 206566 207492 207850 208451 209688 210855
54062 210855 211243 211003 210535 209845 208987 208338 207934 207265 206207 205504 205837 207050 208710 210742 213029 215183 217200
54045 217200 219632 222583 225268 227210 229088 231741 235059 238591 242577 247537 253454 260210 268274 278032
$$ packed form
54162A83254j855j678j159p97r04r03k33O62R18L73m84j185j495j348r23n08j35
54145A71600K33K58l14r04o66J41M68K12M62J656K702K582J718J087Q48P02P34
54128A83519J074J297R81L81o8m21p64o89O2Q34Q14K62K13J074K144K555K164
54111A95432J411Q02O02P87J124J313J123M64n06j364j725j586j231q85o45o37
54095A94479q89j131j056p74o69p89p16j30P64J428J532J242J039J163J313J045
54079A97851M73J19J70L71O66J219J686J375M75J24P44J293R26L58O01J237J167
54062B10855L88k40m68o90q58o49m04o69j058p03L33J213J660K032K287K154K017
54045B17200K432K951K685J942J878K653L318L532L986M960N917O756Q064R758
$$ plain form
54031 278032 288879 299812 310671 322049 334343 347596 361910 377251 393170 409429 426540
54020 426540 444969 463983 481783 496379 505784 508075 502327 489523 472059 452539 433247 415835
54008 415835 400634 386684 373247 360806 349927 339902 329599 319095 309379 300830 293133 286364
53996 286364 280967 276740 272971 269469 266487 263736 260573 257168 254390 252475 250745 248756 246759 244900
53982 244900 242900 240745 238875 237447 236147 234900 234066 233747 233585 233392 233298 233185 232691 231937 231529 231666 231873
53965 231873 231826 231756 231842 231831 231565 231361 231550 232033 232458 232548 232211 231709 231689 232558 233879 234848 235357 236044 237376 239257
53945 239257 241500 244018 246524 248749 251130 254672 259873 266232 272910 279365 285293 290546 295382 300331
53931 300331 305551 310684 315445 319978 324476 328802 332679 335969 338697 341043 343371 346056 349236 352867
$$ packed form
54031B78032J0847J0933J0859J1378J2294J3253J4314J5341J5919J6259J7111
54020D26540J8429J9014J7800J4596R405K291n748j2804j7464j9520j9292j7412
54008D15835j5201j3950j3437j2441j0879j0025j0303j0504r716q549p697o769
53996B86364n397m227l769l502k982k751l163l405k778j915j730j989j997j859
53982B44900k000k155j870j428j300j247q34l19j62j93r4j13m94p54m08J37K07
53965B31873m7p0Q6j1k66k04J89M83M25R0l37n02k0Q69J321R69N09O87J332J881
53945B39257K243K518K506K225K381L542N201O359O678O455N928N253M836M949
53931C00331N220N133M761M533M498M326L877L290K728K346K328K685L180L631
$$ plain form
53917 352867 356877 361088 365318 369806 375225 381836 389036 396211 403698 412216 421620 430893 439256 446564
53903 446564 452748 457591 461145 463651 464958 464541 462195 458334 453600 448610 443896 439637 435494 431191
53889 431191 427042 423407 419855 415531 410228 404466 398685 393051 387935 383876 381036 379274 378619 379044 379940
53874 379940 380649 381359 382679 384292 384880 383492 380282 375868 370793 365736 361478 358412 356703 357068 360699
53859 360699 368165 378937 392136 407201 423635 440517 456230 468179 472990 468060 453427 431815
53847 431815 406805 381298 357322 336173 318291 303517 291679 282567 275461 269421 264104 259723
53835 259723 256227 253208 250583 248571 246967 245244 243533 242698 243160 244296 245212 245540 245332 244797 244325 244240
53819 244240 244442 244750 245417 246649 247851 248323 248598 250014 252823 255737 257629 258719 259809 261298 263340
$$ packed form
53917C52867M010M211M230M488N419O611P200P175P487Q518R404R273Q363P308
53903D46564O184M843L554K506J307m17k346l861m734m990m714m259m143m303
53889D31191m149l635l552m324n303n762n781n634n116m059k840j762o55M25Q96
53874C79940P09P10J320J613N88j388l210m414n075n057m258l066j709L65L631
53859C60699P466J0772J3199J5065J6434J6882J5713J1949M811m930j4633k1612
53847D31815k5010k5507k3976k1149j7882j4774j1838r112p106o040n317m381
53835B59723l496l019k625k012j604j723j711q35M62J136R16L28k08n35m72q5
53819B44240K02L08O67J232J202M72K75J416K809K914J892J090J090J489K042
$$ plain form
53804 263340 266082 269289 272446 275628 279518 284251 289066 293505 298203 303924 310467 316990 322898 328053
53790 328053 332571 336707 340506 343452 345072 345915 347195 349294 351376 352614 353003 352776 351895 350388 348415
53775 348415 345809 342310 338319 334403 330007 323904 316227 308802 302944 298133 293449 289080 285555 282557
53761 282557 279434 276104 272682 269066 265606 263330 262648 262604 262171 261468 260923 260136 258523 256330 254056 251590
53745 251590 248822 246406 244941 244007 242983 242133 241941 242033 241861 241852 242657 243759 244049 243461 242927 242977 243449 244288
53727 244288 245506 246526 246646 246168 246120 246931 248250 249840 251704 253470 254699 255780 257557 260019 262311
53712 262311 264057 265747 267728 269775 271868 274486 277785 281143 283888 285984 287819 289813 292347 295540
53698 295540 298942 301902 304371 306931 309999 313530 317473 321949 326801 331443 335371 338528 341048 342959
$$ packed form
53804B63340K742L207L157L182L890M733M815M439M698N721O543O523N908N155
53790C28053M518M136L799K946J620Q43J280K099K082J238L89k27q81j507j973
53775C48415k606l499l991l916m396o103p677p425n858m811m684m369l525k998
53761B82557l123l330l422l616l460k276o82m4m33p03n45p87j613k193k274k466
53745B51590k768k416j465r34j024q50j92R2j72rQ05J102K90n88n34N0M72Q39
53727B44288J218J020J20m78m8Q11J319J590J864J766J229J081J777K462K292
53712B62311J746J690J981K047K093K618L299L358K745K096J835J994K534L193
53698B95540L402K960K469K560L068L531L943M476M852M642L928L157K520J911
$$ plain form
53684 342959 344255 344984 345198 344949 344258 342963 340861 338277 336206 335503 336073 337164 338142 338657 338412 337393
53668 337393 336090 334951 333770 332140 330298 328924 328219 327752 327122 326242 325044 323561 322305 322024 322859 324110
53652 324110 324878 324778 324055 323267 322727 322111 320862 319188 318187 318568 319709 320545 320957 321587 322625 323596 324227
53635 324227 324725 325190 325478 325671 326062 326658 327283 328139 329623 331522 333102 334166 335427 337554 340316 343012
53619 343012 345415 347980 351223 355081 358884 361994 364462 366862 369508 372293 375402 379492 384644 389773
53605 389773 393813 397044 400496 404428 408354 412247 416602 421293 425430 428631 431526 434723 438067 441280
53591 441280 444493 447616 449865 450636 450487 450545 451095 451297 450375 448623 446993 445867 444584 442359 439410 436749
53575 436749 434847 433146 431120 429195 428002 427275 426211 424679 423225 422033 420741 419343 418510 418816 420238
$$ packed form
53684C42959J296P29K14k49o91j295k102k584k071p03N70J091R78N15k45j019
53668C37393j303j139j181j630j842j374p05m67o30q80j198j483j256k81Q35J251
53652C24110P68j00p23p88n40o16j249j674j001L81J141Q36M12O30J038R71O31
53635C24227M98M65K88J93L91N96O25Q56J484J899J580J064J261K127K762K696
53619C43012K403K565L243L858L803L110K468K400K646K785L109M090N152N129
53605C89773M040L231L452L932L926L893M355M691M137L201K895L197L344L213
53591D41280L213L123K249P71j49N8N50K02r22j752j630j126j283k225k949k661
53575D36749j902j701k026j925j193p27j064j532j454j192j292j398q33L06J422
$$ plain form
53560 420238 422517 425433 428561 431416 434089 437257 441308 445866 450373 454662 458728 462280 464800 465837
53546 465837 465182 463082 460302 457605 455126 452623 450282 448710 448093 447950 447931 448278 449221 450450 451660 453241
53530 453241 455953 460107 465437 471692 478952 487350 496742 506814 517491 529062 541711 555002 568203
53517 568203 581315 595318 611042 628105 645493 662929 681022 700249 720564 742024 765043
53506 765043 789740 815689 842591 870590 899516 928341 955951 982183 1007685 1032980 1058159
53495 1058159 1083325 1108768 1134512 1160052 1184807 1208809 1232738 1257184 1281998 1306501 1330254
53484 1330254 1353336 1375857 1397610 1418453 1438708 1458800 1478744 1498422 1518180 1538654 1559945
53473 1559945 1581398 1602227 1622002 1640446 1657118 1671491 1683194 1692158 1698659 1703145 1705761 1706043
$$ packed form
53560D20238K279K916L128K855K673L168M051M558M507M289M066L552K520J037
53546D65837o55k100k780k697k479k503k341j572o17j43j9L47R43J229J210J581
53530D53241K712M154N330O255P260Q398R392J0072J0677J1571J2649J3291J3201
53517E68203J3112J4003J5724J7063J7388J7436J8093J9227K0315K1460K3019
53506G65043K4697K5949K6902K7999K8926K8825K7610K6232K5502K5295K5179
53495A058159K5166K5443K5744K5540K4755K4002K3929K4446K4814K4503K3753
53484A330254K3082K2521K1753K0843K0255K0092J9944J9678J9758K0474K1291
53473A559945K1453K0829J9775J8444J6672J4373J1703Q964O501M486K616K82
$$ plain form
53461 1706043 1703183 1696622 1686354 1672904 1657170 1640042 1621914 1602804 1583154 1564071 1546335 1529372
53449 1529372 1511637 1491828 1469459 1444722 1418501 1392287 1367261 1343345 1319626 1295663 1271889
53438 1271889 1248856 1226773 1205868 1186596 1169293 1154050 1141043 1130535 1122415 1116129 1111145 1107233
53426 1107233 1104348 1102609 1102356 1103828 1106795 1110879 1116101 1122704 1130598 1139592 1150025 1162537 1177203
53413 1177203 1193596 1211709 1232019 1254436 1277968 1301829 1326296 1352148 1379782 1409279 1440795
53402 1440795 1474313 1509338 1545368 1582587 1621730 1663354 1707501 1754029 1802964 1854464 1908591
53391 1908591 1965196 2024072 2085106 2148098 2212397 2277097 2341823 2407048 2473238 2539885 2605729
53380 2605729 2669751 2731500 2790678 2846906 2900032 2950277 2997974 3043247 3085701 3124276 3157823
$$ packed form
53461A706043k860o561j0268j3450j5734j7128j8128j9110j9650j9083j7736j6963
53449A529372j7735j9809k2369k4737k6221k6214k5026k3916k3719k3963k3774
53438A271889k3033k2083k0905j9272j7303j5243j3007j0508q120o286m984l912
53426A107233k885j739k53J472K967M084N222O603P894Q994J0433J2512J4666
53413A177203J6393J8113K0310K2417K3532K3861K4467K5852K7634K9497L1516
53402A440795L3518L5025L6030L7219L9143M1624M4147M6528M8935N1500N4127
53391A908591N6605N8876O1034O2992O4299O4700O4726O5225O6190O6647O5844
53380B605729O4022O1749N9178N6228N3126N0245M7697M5273M2454L8575L3547
$$ plain form
53369 3157823 3186252 3210697 3232070 3249822 3262733 3270424 3273198 3270602 3261111 3243262 3216401 3180369
53357 3180369 3135393 3082516 3023522 2960288 2894603 2828333 2762870 2698404 2634511 2571490 2510336
53346 2510336 2451521 2394796 2340308 2288697 2239640 2191217 2141425 2089795 2037192 1984696 1933089
53335 1933089 1882824 1834017 1786824 1742023 1700707 1663217 1628950 1597373 1568582 1542762 1519809
53324 1519809 1499679 1482258 1466636 1451284 1435319 1418799 1401677 1383515 1364732 1346942 1331288
53313 1331288 1317237 1303778 1290986 1279545 1269497 1260520 1252903 1247204 1243276 1240540 1239017 1239257 1241388
53300 1241388 1244990 1249788 1255867 1263332 1272360 1283440 1297004 1312880 1330566 1349883 1370970 1393916
53288 1393916 1418831 1445902 1474846 1504625 1534306 1564037 1594543 1625835 1657013 1687196 1715966
$$ packed form
53369C157823K8429K4445K1373J7752J2911P691K774k596r491j7849k6861l6032
53357C180369m4976n2877n8994o3234o5685o6270o5463o4466o3893o3021o1154
53346B510336n8815n6725n4488n1611m9057m8423m9792n1630n2603n2496n1607
53335A933089n0265m8807m7193m4801m1316l7490l4267l1577k8791k5820k2953
53324A519809k0130j7421j5622j5352j5965j6520j7122j8162j8783j7790j5654
53313A331288j4051j3459j2792j1441j0048q977p617n699l928k736j523K40K131
53300A241388L602M798O079P465R028J1080J3564J5876J7686J9317K1087K2946
53288A393916K4915K7071K8944K9779K9681K9731L0506L1292L1178L0183K8770
$$ plain form
53277 1715966 1742871 1767200 1788598 1807530 1824838 1840842 1854909 1865893 1873071 1876649 1877186 1874647
53265 1874647 1868481 1858677 1846160 1831837 1815668 1797020 1775500 1751080 1723853 1694131 1662545 1629699
53253 1629699 1595939 1561649 1527249 1492597 1456968 1420244 1383694 1348968 1316595 1286019 1256808
53242 1256808 1229048 1202585 1176538 1149812 1121881 1093064 1064181 1035889 1008243 981084 954743
53231 954743 929830 906290 883356 860768 839360 820035 802801 787378 774006 762831 753060 743645
53219 743645 734461 725917 717613 708328 697299 684696 670899 656108 640719 625316 610122 595056
53207 595056 580375 566631 553832 541353 528893 517018 506482 497445 489541 482287 475120 467424
53195 467424 458932 449952 441036 432578 424802 417843 411598 405649 399532 393131 386748 380816 375548 370768
$$ packed form
53277A715966K6905K4329K1398J8932J7308J6004J4067J0984P178L578N37k539
53265A874647o166r804j2517j4323j6169j8648k1520k4420k7227k9722l1586l2846
53253A629699l3760l4290l4400l4652l5629l6724l6550l4726l2373l0576k9211
53242A256808k7760k6463k6047k6726k7931k8817k8883k8292k7646k7159k6341
53231I54743k4913k3540k2934k2588k1408j9325j7234j5423j3372j1175r771r415
53219G43645r184q544q304r285j1029j2603j3797j4791j5389j5403j5194j5066
53207E95056j4681j3744j2799j2479j2460j1875j0536r037p904p254p167p696
53195D67424q492q980q916q458p776o959o245n949o117o401o383n932n268m780
$$ plain form
53181 370768 366101 361392 356897 352994 349732 346709 343397 339650 335914 332830 330534 328551 326606 325220
53167 325220 325021 325694 326262 326382 326649 327509 328631 329549 330183 330333 329440 327458 325331 323934 323011 321812 320318
53150 320318 319075 318114 316879 315172 313458 312198 311373 310676 309798 308562 307130 305986 305425 305165 304754 304129
53134 304129 303474 302763 301843 300800 299900 299338 299264 299781 300655 301372 301789 302368 303421 304538 305191 305478 305787 306167
53116 306167 306536 307136 308104 308916 308985 308580 308497 308921 309206 308757 307591 306023 304279 302459 300621 298939 297862
53099 297862 297760 298226 298236 297355 296213 295399 294609 293515 292742 292999 293730 293708 292733 291728 291270 291029 290650 290281
53081 290281 290089 290015 290080 290271 290064 288830 286789 284938 283949 283714 284001 284812 285994 287213 288474 290169 292418
53064 292418 294828 296972 298658 299704 300001 299842 299709 299689 299526 299225 299111 299318 299666 299964 300051 299664 298840 298257
$$ packed form
53181C70768m667m709m495l903l262l023l312l747l736l084k296j983j945j386
53167C25220j99O73N68J20K67Q60J122R18O34J50q93j982k127j397r23j199j494
53150C20318j243r61j235j707j714j260q25o97q78j236j432j144n61k60m11o25
53134C04129o55p11r20j043r00n62p4N17Q74P17M17N79J053J117O53K87L09L80
53116C06167L69O00R68Q12O9m05q3M24K85m49j166j568j744j820j838j682j077
53099B97862j02M66J0q81j142q14p90j094p73K57P31k2r75j005m58k41l79l69
53081B90281j92p4O5J91k07j234k041j851r89k35K87Q11J182J219J261J695K249
53064B92418K410K144J686J046K97j59j33k0j63l01j14K07L48K98Q7l87q24n83
$$ plain form
53046 298257 298637 299855 301107 301761 301623 300737 299586 299080 299504 299804 298818 296890 295264 294253 293235 292240
53030 292240 292008 292327 291903 290405 289238 289511 290413 290569 289991 289653 289816 289930 289783 289735 290003 290516 291388 292812
53012 292812 294472 295617 295823 295382 294916 294832 295174 295791 296595 297568 298459 298749 298290 297804 298194 299381 300369 300583
52994 300583 300549 301081 302353 303952 305373 306183 306175 305634 305162 305062 305272 305963 307676 310586 314038 317049 319024
52977 319024 319912 320103 320228 320672 321200 321473 321885 323307 325928 328929 331499 333586 335503 337379 339196 340867
52961 340867 342086 342587 342672 342857 342972 342312 340849 339432 338529 337581 336030 334159 332424 330709 328859 327258
52945 327258 326202 325183 323551 321469 319598 318192 317123 316419 316133 315897 315258 314293 313402 312635 311676 310421
52929 310421 309135 308140 307647 307758 308350 309081 309708 310266 310795 311183 311411 311665 312006 312271 312471 312953 313969 315395
$$ packed form
53046B98257L80J218J252O54j38q86j151n06M24L00r86j928j626j011j018r95
53030B92240k32L19m24j498j167K73R02J56n78l38J63J14j47m8K68N13Q72J424
53012B92812J660J145K06m41m66q4L42O17Q04R73Q91K90m59m86L90J187R88K14
52994C00583l4N32J272J599J421Q10qn41m72j00K10O91J713K910L452L011J975
52977C19024Q88J91J25M44N28K73M12J422K621L001K570K087J917J876J817J671
52961C40867J219N01Q5J85J15o60j463j417r03r48j551j871j735j715j850j601
52945C27258j056j019j632k082j871j406j069p04k86k36o39r65q91p67r59j255
52929C10421j286r95m93J11N92P31O27N58N29L88K28K54L41K65K00M82J016J426
$$ plain form
52911 315395 316984 318481 319472 319672 319495 319644 319879 319045 316727 314115 312586 312099 311742 311266 311165 311610 312250
52894 312250 312951 313855 314751 315119 314967 315069 316137 318085 320122 321314 321130 319842 318326 317181 316085 314266
52878 314266 311463 308138 304909 302142 300036 298671 297918 297482 297143 296889 296910 297505 298799 300514 302232 303884
52862 303884 305693 307667 309594 311618 314201 317314 320224 322461 324396 326379 327801 327629 325573 322213
52848 322213 318214 313950 309682 305557 301506 297525 293917 290911 288223 285400 282437 279720 277512 275873
52834 275873 274854 274379 274093 273712 273394 273454 273887 274497 275327 276580 278219 279955 281461 282410 282514 281829 280826
52817 280826 279883 279005 278248 278053 278736 279980 281275 282636 284442 286798 289539 292702 296479 300740 304878
52802 304878 308040 309363 308362 305468 301896 298539 295237 291514 287637 284379 282027 280308 279090 278418
$$ packed form
52911C15395J589J497R91K00j77J49K35q34k318k612j529m87l57m76j01M45O40
52894C12250P01R04Q96L68j52J02J068J948K037J192j84j288j516j145j096j819
52878C14266k803l325l229k767k106j365p53m36l39k54K1N95J294J715J718J652
52862C03884J809J974J927K024K583L113K910K237J935J983J422j72k056l360
52848C22213l999m264m268m125m051l981l608l006k688k823k963k717k208j639
52834B75873j019m75k86l81l18O0M33O10Q30J253J639J736J506R49J04o85j003
52817B80826r43q78p57j95O83J244J295J361J806K356K741L163L777M261M138
52802C04878L162J323j001k894l572l357l302l723l877l258k352j719j218o72
$$ plain form
52788 278418 277902 276875 275373 274359 274582 275579 276165 275756 274975 274942 276088 277755 279005 279729 280695 282493 284785
52771 284785 286770 287978 288414 288294 287979 287865 287954 287789 287077 286075 285053 283833 282324 281106 280899 281654 282756
52754 282756 283928 285384 287133 288672 289375 288838 286979 284238 281571 279795 278942 278597 278646 279234 280156 280867
52738 280867 281174 281470 282234 283613 285433 287295 288708 289501 290051 290785 291600 292187 292730 293794 295528 297460
52722 297460 299119 300419 301425 302214 303037 304162 305425 306246 306295 305847 305384 305082 304846 304636 304568 304764 305183 305557
52704 305557 305558 305079 304333 303594 302962 302408 301876 301265 300519 299852 299637 299902 300164 299889 298868 297166 295151 293754
52686 293754 294084 296240 298852 300342 300506 300479 301369 303331 305824 308257 310297 311843 312859 313282 313245 313238 313644
52669 313644 314161 314218 313965 314104 314545 314098 312075 309422 307550 306706 306280 306177 306865 308341 309940 311163 312012
$$ packed form
52788B78418n16j027j502j014K23R97N86m09p81l3J146J667J250P24R66J798K292
52771B84785J985J208M36j20l15j14Q9j65p12j002j022j220j509j218k07P55J102
52754B82756J172J456J749J539P03n37j859k741k667j776q53l45M9N88R22P11
52738B80867L07K96P64J379J820J862J413P93N50P34Q15N87N43J064J734J932
52722B97460J659J300J006P89Q23J125J263Q21M9m48m63l02k36k10o8J96M19L74
52704C05557Jm79p46p39o32n54n32o11p46o67k15K65K62k75j021j702k015j397
52686B93754L30K156K612J490J64k7Q90J962K493K433K040J546J016M23l7pM06
52669C13644N17N7k53J39M41m47k023k653j872q44m26j03O88J476J599J223Q49
$$ plain form
52652 312012 312657 313358 314551 316371 318232 319443 319996 320186 319835 318630 316951 315499 314291 312844 311183
52637 311183 309865 309053 308490 308358 309248 311135 313234 315158 317458 320707 324629 328499 331976 335259 338599
52622 338599 341786 343881 343652 340660 335832 330569 325490 320517 315863 312203 309899 308674 308034 307565 307014
52607 307014 306620 307101 308614 310053 310200 309363 308939 309448 310055 310063 309845 310067 310898 312301 314316 316688 318874
52590 318874 320659 322158 323181 323355 323034 323234 324371 325832 327040 328107 329081 329423 328814 327891 327650 328536
52574 328536 330391 332730 334737 335601 335279 334510 333795 332894 331603 330360 329679 329439 329127 328334 326751 324215
52558 324215 321160 318531 316881 315914 315150 314570 314334 314404 314726 315288 315719 315351 314115 312935 312842 313974 315670
52541 315670 317131 317767 317379 316329 315221 314269 313373 312800 313154 314436 315788 316472 316588 316604 316775 317272 318264
$$ packed form
52652C12012O45P01J193J820J861J211N53J90l51j205j679j452j208j447j661
52637C11183j318q12n63j32Q90J887K099J924K300L249L922L870L477L283L340
52622C38599L187K095k29k992m828n263n079m973m654l660k304j225o40m69n51
52607C07014l94M81J513J439J47q37m24N09O07Qk18K22Q31J403K015K372K186
52590C18874J785J499J023J74l21K00J137J461J208J067R74L42o09r23k41Q86
52574C28536J855K339K007Q64l22p69p15r01j291j243o81k40l12p93j583k536
52558C24215l055k629j650r67p64n80k36P0L22N62M31l68j236j180r3J132J696
52541C15670J461O36l88j050j108r52q96n73L54J282J352O84J16J6J71M97R92
$$ plain form
52524 318264 319540 320592 321313 322025 322661 322644 321889 321160 321029 321217 321412 321974 323282 325083 327117 329761 333364
52507 333364 337429 341097 344059 346457 348246 349164 349001 347571 344867 341492 338333 335474 332164 328275 324890
52492 324890 322910 321892 321035 320430 320392 320367 319680 318833 318900 319921 320992 321698 322352 322997 323290 323395 324002 325309
52474 325309 326830 328295 329927 331642 332794 333056 332986 333455 334891 337209 340015 342727 344911 346671 348501
52459 348501 350688 353041 355057 356130 355794 354130 351712 348864 345259 340666 335720 331373 327893 325038
52445 325038 322914 321843 321492 320944 319764 318359 317231 316472 316083 316143 316434 316423 315871 315133 314673 314532 314382 313807
52427 313807 312550 310773 309102 308127 307842 307830 307849 307923 307965 307785 307459 307347 307721 308676 310277 312438 314784 317049
52409 317049 319554 322911 327347 332717 339035 346479 354930 364045 373826 384631 396556 409225 422064
$$ packed form
52524C18264J276J052P21P12O36j7p55p29j31J88J95N62J308J801K034K644L603
52507C33364M065L668K962K398J789R18j63j430k704l375l159k859l310l889l385
52492C24890j980j018q57o05l8k5o87q47O7J021J071P06O54O45K93J05O07J307
52474C25309J521J465J632J715J152K62p0M69J436K318K806K712K184J760J830
52459C48501K187K353K016J073l36j664k418k848l605m593m946m347l480k855
52445C25038k124j071l51n48j180j405j128p59l89O0K91j1n52p38m60j41j50n75
52427C13807j257j777j671r75k85j2J9P4M2j80l26j12L74R55J601K161K346K265
52409C17049K505L357M436N370O318P444Q451R115R781J0805J1925J2669J2839
$$ plain form
52396 422064 434121 443528 447922 446011 438582 427740 415391 402621 390142 378747 369213 361945 356806
52383 356806 353287 350839 349117 348035 347724 348354 349787 351455 352898 354426 356866 360535 364874 369267 373741
52368 373741 378572 383707 388957 394286 399396 403408 405549 405930 405117 403314 400603 397696 395673 394951 395099
52353 395099 395566 396085 396447 396601 396966 398073 399834 401704 403550 405798 408651 411774 414849 417904 420945
52338 420945 423762 426322 428975 432116 435903 440298 445073 449843 454515 459710 466276 474383 483529 493369
52324 493369 504054 515769 528535 542501 557827 574110 590397 605985 620773 634843 648261
52313 648261 661509 675583 691325 708916 728112 748500 769422 790191 810718 831622 853486
52302 853486 876259 899496 922779 945811 968471 990951 1013489 1035805 1057143 1076845 1094478
$$ packed form
52396D22064J2057R407M394j911p429j0842j2349j2770j2479j1395r534p268n139
52383C56806l519k448j722j082l11O30J433J668J443J528K440L669M339M393M474
52368C73741M831N135N250N329N110M012K141L81q13j803k711k907k023p22J48
52353C95099M67N19L62J54L65J107J761J870J846K248K853L123L075L055L041
52338D20945K817K560K653L141L787M395M775M770M672N195O566Q107R146R840
52324D93369J0685J1715J2766J3966J5326J6283J6287J5588J4788J4070J3418
52313F48261J3248J4074J5742J7591J9196K0388K0922K0769K0527K0904K1864
52302H53486K2773K3237K3283K3032K2660K2480K2538K2316K1338J9702J7633
$$ plain form
52291 1094478 1109399 1120836 1128643 1133422 1135736 1135800 1134240 1132326 1130842 1129207 1126403 1122410 1118031 1113555
52277 1113555 1108426 1102359 1096106 1090769 1086682 1083285 1080001 1076908 1074513 1073079 1072548 1073226 1076108 1081996
52263 1081996 1090410 1099934 1109706 1120055 1131514 1143882 1156692 1170125 1184863 1201279 1219294 1238811
52251 1238811 1259640 1280967 1301562 1320704 1338495 1354976 1369410 1380880 1389408 1395975 1401361 1405453
52239 1405453 1407885 1408894 1409044 1408366 1406410 1403192 1399423 1395558 1391143 1385562 1378903 1371617 1363724 1355047
52225 1355047 1345976 1337225 1328878 1320420 1311738 1303342 1295459 1287707 1280055 1273371 1268432 1264848 1261598 1258293
52211 1258293 1255322 1252986 1251210 1250200 1250806 1253839 1259206 1265927 1272925 1279745 1286561 1293666 1301031 1308287
52197 1308287 1315047 1321218 1327191 1333765 1341672 1351016 1361241 1371776 1382415 1392864 1402316 1409966 1415754
$$ packed form
52291A094478J4921J1437P807M779K314O4j560j914j484j635k804l993m379m476
52277A113555n129o067o253n337m087l397l284l093k395j434n31O78K882N888
52263A081996Q414R524R772J0349J1459J2368J2810J3433J4738J6416J8015J9517
52251A238811K0829K1327K0595J9142J7791J6481J4434J1470Q528O567N386M092
52239A405453K432J009J50o78j956l218l769l865m415n581o659p286p893q677
52225A355047r071q751q347q458q682q396p883p752p652o684m939l584l250l305
52211A258293k971k336j776j010O06L033N367O721O998O820O816P105P365P256
52197A308287O760O171N973O574P907R344J0225J0535J0639J0449R452P650N788
$$ plain form
52184 1415754 1420018 1422539 1422618 1420192 1416200 1411538 1406141 1399393 1391047 1381465 1371374 1361676 1353079 1345501
52170 1345501 1338153 1330537 1323080 1316401 1310424 1304794 1299893 1296694 1295530 1295602 1295938 1296432 1297666 1299984 1302981
52155 1302981 1305795 1307714 1308589 1308782 1308732 1308474 1307641 1306015 1304067 1302864 1303349 1305620 1308899 1312217 1315080 1317488
52139 1317488 1319498 1320975 1321752 1321735 1320763 1318602 1315399 1312046 1309744 1309032 1309432 1310273 1311777 1315056 1321004 1329499
52123 1329499 1339827 1351620 1365041 1380255 1397169 1415649 1435510 1456234 1477173 1498222 1519848
52112 1519848 1542191 1564582 1586289 1607333 1628190 1649000 1669586 1690019 1710654 1731706 1753237
52101 1753237 1775431 1798466 1822160 1846087 1869924 1893303 1915479 1935501 1952551 1965740 1973882
52090 1973882 1976126 1972801 1965144 1954297 1941079 1926505 1911736 1897345 1883221 1869254 1855662 1842611
$$ packed form
52184A415754M264K521P9k426l992m662n397o748q346r582j0091r698q597p578
52170A345501p348p616p457o679n977n630m901l199j164P2L36M94J234K318K997
52155A302981K814J919Q75J93n0k58q33j626j948j203M85K271L279L318K863K408
52139A317488K010J477P77j7r72k161l203l353k302p12M00Q41J504L279N948Q495
52123A329499J0328J1793J3421J5214J6914J8480J9861K0724K0939K1049K1626
52112A519848K2343K2391K1707K1044K0857K0810K0586K0433K0635K1052K1531
52101A753237K2194K3035K3694K3927K3837K3379K2176K0022J7050J3189Q142
52090A973882K244l325p657j0847j3218j4574j4769j4391j4124j3967j3592j3051
$$ [...]
##END NTUPLES=NMR SPECTRUM
##END=
