
##TITLE=UV1282_M1_1242-1388_70_7534403_EDVj0BgeuQ
##JCAMPDX= 6.0         $$ Bruker NMR JCAMP-DX V2.0
##DATA TYPE= NMR SPECTRUM
##DATA CLASS= NTUPLES
##ORIGIN= BRUKER
##OWNER= Administrator
$$ 1.72 TOPSPIN		Version 2.1
$$ 2013-02-22 01:26:39.819 -0500  Administrator@X
$$ Compression mode = diff/dup
##.OBSERVE FREQUENCY= 400.02188249412
##.OBSERVE NUCLEUS= ^1H
##.ACQUISITION MODE= SIMULTANEOUS (DQD)
##.ACQUISITION SCHEME= undefined
##.AVERAGES= 8
##.DIGITISER RES= 22
##SPECTROMETER/DATA SYSTEM= spect
##.PULSE SEQUENCE= zg30
##.SOLVENT NAME= COFFEE_meoh
##.SHIFT REFERENCE= INTERNAL, COFFEE_meoh, 1, 14.98509
##AUDIT TRAIL= $$ (NUMBER, WHEN, WHO, WHERE, PROCESS, VERSION, WHAT)
$$ ##TITLE= Audit trail, TOPSPIN		Version 2.1
$$ ##JCAMPDX= 5.01
$$ ##ORIGIN= Bruker BioSpin GmbH
$$ ##OWNER= Administrator
$$ $$ E:\/data/COFFEE/nmr/UV1282_M1_1242-1388_70_7534403_EDVj0BgeuQ/10/pdata/1/auditp.txt
$$ ##AUDIT TRAIL=  $$ (NUMBER, WHEN, WHO, WHERE, PROCESS, VERSION, WHAT)
(   1,<2013-02-22 01:26:31.428 -0500>,<Administrator>,<X>,<go>,<TOPSPIN 2.1>,
      <created by zg
	started at 2013-02-22 01:25:24.602 -0500,
	POWCHK enabled, PULCHK disabled,
       configuration hash MD5:
       86 BA 57 50 F2 9D 5C 9B 26 00 A9 28 5F 66 2E 89
       data hash MD5: 64K
       8B F1 EA F8 AC 4B 07 B6 F7 10 46 F0 71 E0 40 6F>)
(   2,<2013-02-22 01:26:34.569 -0500>,<Administrator>,<X>,<proc1d>,<TOPSPIN 2.1>,
      <Start of raw data processing
       efp LB = 0 FT_mod = 6 PKNL = 1 PHC0 = 0 PHC1 = 0 SI = 32K 
       data hash MD5: 32K
       9B 15 56 4E DB 09 44 2F DB F6 08 C2 F3 56 66 C7>)
(   3,<2013-02-22 01:26:35.085 -0500>,<Administrator>,<X>,<proc1d>,<TOPSPIN 2.1>,
      <pk PHC0 = 67.93945 PHC1 = 0 
       data hash MD5: 32K
       0F 51 A4 41 F5 C9 AA 6D A1 E4 31 A4 9A 54 F4 3D>)
(   4,<2013-02-22 01:26:35.335 -0500>,<Administrator>,<X>,<proc1d>,<TOPSPIN 2.1>,
      <abs ABSG = 1 
       data hash MD5: 32K
       3F D4 F1 80 3B CD 21 C0 A9 1E 49 36 30 81 99 1C>)
(   5,<2013-02-22 01:26:35.491 -0500>,<Administrator>,<X>,<proc1d>,<TOPSPIN 2.1>,
      <abs ABSG = 2 
       data hash MD5: 32K
       1B AC FB 85 2F 5F D4 69 3D F7 52 E2 36 7D 92 28>)
(   6,<2013-02-22 01:26:35.631 -0500>,<Administrator>,<X>,<proc1d>,<TOPSPIN 2.1>,
      <abs ABSG = 3 
       data hash MD5: 32K
       31 B9 94 DE 12 6B 89 E8 BB F0 5C 6A 46 58 4C 59>)
(   7,<2013-02-22 01:26:35.788 -0500>,<Administrator>,<X>,<proc1d>,<TOPSPIN 2.1>,
      <abs ABSG = 4 
       data hash MD5: 32K
       5C C2 F2 07 C0 76 A7 8E B3 53 1D 6F BD 47 51 3E>)
(   8,<2013-02-22 01:26:35.913 -0500>,<Administrator>,<X>,<proc1d>,<TOPSPIN 2.1>,
      <abs ABSG = 5 
       data hash MD5: 32K
       4E B3 F6 B7 0C 53 DA 44 1C DD 29 F2 7A 06 98 25>)
$$ ##END=
$$ 
$$ $$ hash MD5
$$ $$ ED FC BD C6 7A 71 44 77 CE A8 2F B5 E6 7B D9 B7
##$RELAX= 
##$RELAX= 
##$RELAX= 
##$RELAX= 
##$RELAX= 
##$RELAX= 
##$RELAX= 
$$ Bruker specific parameters
$$ --------------------------
##$DU= <E:\>
##$EXPNO= 10
$$ [...]
##$TP= (0..7)
150 150 150 150 150 150 150 150
##$TP07= 0
##$TPNAME0= <>
##$TPNAME1= <>
##$TPNAME2= <>
##$TPNAME3= <>
##$TPNAME4= <>
##$TPNAME5= <>
##$TPNAME6= <>
##$TPNAME7= <>
##$TPOAL= (0..7)
0.5 0.5 0.5 0.5 0.5 0.5 0.5 0.5
##$TPOFFS= (0..7)
0 0 0 0 0 0 0 0
##$TUNHIN= 0
##$TUNHOUT= 0
##$TUNXOUT= 0
##$USERA1= <user>
##$USERA2= <user>
##$USERA3= <user>
##$USERA4= <user>
##$USERA5= <user>
##$V9= 5
##$VALIST= <valist>
##$VCLIST= <CCCCCCCCCCCCCCC>
##$VD= 0
##$VDLIST= <DDDDDDDDDDDDDDD>
##$VPLIST= <PPPPPPPPPPPPPPP>
##$VTLIST= <TTTTTTTTTTTTTTT>
##$WBST= 1024
##$WBSW= 4
##$XGAIN= (0..3)
0 0 0 0
##$XL= 0
##$YL= 0
##$YMAX_a= 524257
##$YMIN_a= -522921
##$ZGOPTNS= <>
##$ZL1= 120
##$ZL2= 120
##$ZL3= 120
##$ZL4= 120
##$ABSF1= 14.98509
##$ABSF2= -5.573092
##$ABSG= 5
##$ABSL= 3
##$ALPHA= 0
##$AQORDER= 0
##$ASSFAC= 0
##$ASSFACI= 0
##$ASSFACX= 0
##$ASSWID= 0
##$AUNMP= <proc_prof1d_extract_pilot.lims>
##$AXLEFT= 0
##$AXNAME= <>
##$AXNUC= <1H>
##$AXRIGHT= 0
##$AXTYPE= 0
##$AXUNIT= <>
##$AZFE= 0.1
##$AZFW= 0.1
##$BCFW= 0
##$BC_mod= 0
##$BYTORDP= 0
##$COROFFS= 0
##$CY= 15
##$DATMOD= 1
##$DC= 0
##$DFILT= <>
##$DTYPP= 0
##$F1P= 0
##$F2P= 0
##$FCOR= 0.5
##$FTSIZE= 32768
##$FT_mod= 6
##$GAMMA= 0
##$GB= 0
##$INTBC= 1
##$INTSCL= 1
##$ISEN= 128
##$LB= 0
##$LEV0= 0
##$LPBIN= 0
##$MAXI= 10000
##$MC2= 0
##$MEAN= 0
##$ME_mod= 0
##$MI= 0
##$NCOEF= 0
##$NC_proc= -8
##$NLEV= 6
##$NOISF1= 0
##$NOISF2= 0
##$NSP= 0
##$NTH_PI= 0
##$NZP= 0
##$OFFSET= 14.98509
##$PC= 1
##$PHC0= 67.93945
##$PHC1= 0
##$PH_mod= 1
##$PKNL= yes
##$PPARMOD= 0
##$PPDIAG= 0
##$PPIPTYP= 0
##$PPMPNUM= 2147483647
##$PPRESOL= 1
##$PSCAL= 4
##$PSIGN= 0
##$PYNMP= <proc.py>
##$REVERSE= no
##$SF= 400.02
##$SI= 32768
##$SIGF1= 0
##$SIGF2= 0
##$SINO= 400
##$SIOLD= 32768
##$SPECTYP= <>
##$SREGLST= <1H.CDCl3>
##$SSB= 0
##$STSI= 32768
##$STSR= 0
##$SW_p= 8223.68421052631
##$SYMM= 0
##$S_DEV= 0
##$TDeff= 65536
##$TDoff= 0
##$TI= <>
##$TILT= no
##$TM1= 0
##$TM2= 0
##$TOPLEV= 0
##$USERP1= <user>
##$USERP2= <user>
##$USERP3= <user>
##$USERP4= <user>
##$USERP5= <user>
##$WDW= 1
##$XDIM= 32768
##$YMAX_p= 465264747
##$YMIN_p= -696667
##$CURPLOT= <Network HP LaserJet P1505>
##$CURPRIN= <$Network HP LaserJet P1505>
##$DFORMAT= <normdp>
##$LAYOUT= <+/1D_H.xwp>
##$LFORMAT= <normlp>
##$PFORMAT= <normpl>
##$SURQMSG= 1
$$ End of Bruker specific parameters
$$ ---------------------------------
##NTUPLES= NMR SPECTRUM
##VAR_NAME=  FREQUENCY,     SPECTRUM/REAL,   SPECTRUM/IMAG
##SYMBOL=    X,             R,               I
##VAR_TYPE=  INDEPENDENT,   DEPENDENT,       DEPENDENT
##VAR_FORM=  AFFN,          ASDF,            ASDF
##VAR_DIM=   32768,         32768,           32768
##UNITS=     HZ,            ARBITRARY UNITS, ARBITRARY UNITS
##FACTOR=    0.250966925370066, 1,           1
##FIRST=     8223.43324360094, 65846,        150015
##LAST=      0,             101078,          25712
##MIN=       0,             -696667,         0
##MAX=       8223.43324360094, 465264747,    0
$$ Real data points
##PAGE= N=1
##DATA TABLE= (X++(R..R)), XYDATA
$$ [...]
19586h1613A87919a53382K3556a339j26517L2039k4087A88681i1985j14785L6111
19575a70659P9851E00956b39257A10968a40799F3880b03342a7218A34764c68281
19564b824k30156b1713A09288b33443j08554P8888a26183L6893J3919m4475C37201
19552a94323K4280k7116g1356C9857a31565B43750F6906a94192h3232k67119a17844
19540A24134e545l15265C89918F4082a97948B19339A3259b57636a02209A91186
19529c13376j23715b7427j39076j76644h6001k36114a56816A8760B662a71315
19518b79088M2002L1973g9364m53405G1697Q24a96290I5200d5142C7788Q7183
19507A24971b13416N6657A15927f5305k32436E8267a54948g5253q397B1369g2358
$$ y = [-81613, 187919, -153382, -129826, -1339, -127856, -95817, -119904, 188681, -91985, -206770, -170659, -90808, 500956, -239257, 110968, -140799, 63880, -203342, -17218, 134764, -368281, -2824, -232980, -21713, 109288, -233443, -341997, -263109, -126183, -89290, -75371, -119846, 337201, -194323, -170043, -197159, -71356, 39857, -131565, 243750, 66906, -194192, -83232, -350351, -117844, 124134, -5545, -320810, 389918, 64082, -197948, 219339, 13259, -257636, -102209, 191186, -313376, -437091, -27427, -166503, -343147, -86001, -322115, -156816, 18760, 2662, -171315, -279088, -237086, -205113, -79364, -532769, 71697, 72521, -196290, 95200, -45142, 37788, 124971, -213416, -156759, 115927, -65305, -297741, 58267, -154948, -75253, -83650, 21369, -72358]
19495A84077E4173j8856j3638a46543B8330M0549a29303F3137a40658o2530A5609
19483A87732i6793r0604K4724n7942b2271A52385b69298C90655a44945G9358d8476
19471b40970J15341Q688h598F4677c60804A04211M1255L8655j0860Q776D7513
19459e3541r6545A8885c64429J03568f3074j49277H1626a89305H1229J765a52878
19447A43734F5401J2110L5721A1333a24168B22349n7842Q6195a2749k5558A6490
19435A29592a84051L9351h905j30338l6605B8659a67259j18259f36k5543j92162
19424b18341d9896B17259a75922d6806A51212d68636B87435c96239A59807R4026
19414B53833a46091j4875D6933J3250R9787e4775b7280A0355a48833C7520K03299
$$ y = [184077, 54173, 35317, 21679, -146543, 28330, 68879, -129303, 63137, -140658, -203188, 15609, 187732, -96793, -187397, -162673, -220615, -22271, 152385, -269298, 390655, -144945, 79358, -48476, -240970, -125629, -116941, -8598, 64677, -360804, 104211, 145466, 184121, 173261, 182037, 47513, -53541, -150086, 18885, -364429, -260861, -63074, -212351, 81626, -189305, 81229, 82994, -152878, 143734, 65401, 77511, 113232, 11333, -124168, 222349, 164507, 250702, -12749, -38307, 16490, 129592, -184051, -144700, -8905, -139243, -175848, 28659, -167259, -285518, -636, -26179, -218341, -49896, 217259, -175922, -46806, 151212, -468636, 287435, -396239, 159807, 253833, -146091, -160966, 46933, 60183, 159970, -54775, -27280, 10355, -148833, 37520, 240819]
19403B40819a369A74019i08r8277j46884I1893a69405L5936o4939P2938k5824
19392a51294M6399b7884j13483e8524a0021F665d81397C19290A03832c71316e4756
19380a0883o064j08394j02040d6606K2185C30941a51276k47283J36209h1265j8282
19369i9547A6721J06399k3162a07501I6483b10922f6801C9062a26344I0032a76688
19357H9864c2615A37210c99341d8042j435j25093j5574l3196j44188a3448B30297
19345A11718m6504a17698l8717O6697A60056h5711j26326I6561k1406a19051d8906
19333b9077j37021O816B8832a12205K0212J3107r2188j51577f601k21869B14088
19321a72186B372J04093A2767b06761L2201L0540B37148a0180k56863A43299e3755
$$ y = [240819, -1369, 174019, -908, -99185, -246069, 91893, -169405, -133469, -198408, -125470, -151294, -104895, -27884, -141367, -58524, -10021, 6665, -481397, 319290, 103832, -371316, -54756, -10883, -16947, -125341, -227381, -46606, -24421, 330941, -151276, -398559, -262350, -81265, -99547, 16721, 123120, 99958, -107501, 96483, -210922, -66801, 39062, -126344, 90032, -176688, 89864, -32615, 137210, -399341, -48042, -49477, -174570, -190144, -223340, -367528, -13448, 230297, 111718, 65214, -117698, -156415, -89718, 160056, -85711, -212037, 96561, 75155, -119051, -48906, -29077, -166098, -159282, 28832, -112205, -91993, -78886, -171074, -322651, -6601, -228470, 214088, -172186, 2372, 106465, 12767, -206761, -174560, -144020, 237148, -10180, -267043, 143299, -53755]
19309D9756M8879c401C393b00079e4410r3344m7622l1501A46543F7758d04388
19297a19549j33540a11216j98612R2394G9554a67550P1347k03329B36897D4394
19286A4797g5350K0093E6957b99844J03901B40950i66j739B18257j02924b71700
19274d60081K24534A17435c57795A18763b40117f2759k9204k18372B19331B6390
19263C3557e0480A5680J41049d3586P129j32478e5355D8566e3666J1594j18248
19252a60320A7008a83440C1131J37888n5013b90882a4089r8378J2070f312j52265
19241a58577B01556o5785g8721A04623b62047a10059d6161I2107g1683K13A98184
19229a35116f5988k64103a19352D8505b27975p9228j64463a76458L4498C4819
$$ y = [49756, 98635, -3401, 3393, -200079, -54410, -147754, -195376, -226877, 146543, 67758, -404388, -119549, -253089, -111216, -309828, -217434, 79554, -167550, -96203, -299532, 236897, 44394, 14797, -75350, -55257, 56957, -299844, -195943, 240950, -966, -2705, 218257, 115333, -271700, -460081, -235547, 117435, -357795, 118763, -240117, -62759, -91963, -310335, 219331, 26390, 33557, -50480, 15680, 156729, -43586, -36457, -168935, -55355, 48566, -53666, -42072, -160320, 17008, -183440, 31131, 169019, 114006, -290882, -14089, -112467, -100397, -6312, -158577, 201556, 135771, -78721, 104623, -262047, -110059, -46161, 92107, -71683, -71470, 198184, -135116, -65988, -330091, -119352, 48505, -227975, -307203, -471666, -176458, -141960, 34819]
19218d1512A45925J59788b94303A05637a70280N9793j09325m6865a26014e0396
19207a50857A1670c7264A73331E687a99597M0512A60950b19590j99368J16697
19197c02261B49087c10892j03483B2991K76335c06539B04242a27505B2728a84630
19186a66063f3950m9284n5799M5496A455K53193A01428a65259C49933D5843a35069
19174a02124j37433A04081b31268N7607j30726i2086k31588C6728J02508c7793
19163B63601c36101J07010Q8403O882G836J5050J55606p9207a95330B81715c78605
19151B16789a22410D6886P3013e1518j26943R912A30305b84225P5436B4206c94678
19139i6751a5909C3967J33134F2864g9181N422E1916c18158A08483E0802J55195
$$ y = [-41512, 145925, 305713, -294303, 105637, -170280, -110487, -219812, -266677, -126014, -50396, -150857, 11670, -37264, 173331, 5687, -199597, -159085, 160950, -219590, -418958, -302261, 249087, -310892, -414375, 22991, 299326, -306539, 204242, -127505, 22728, -184630, -166063, -63950, -113234, -169033, -123537, 1455, 254648, 101428, -165259, 349933, 45843, -135069, -102124, -239557, 104081, -231268, -173661, -304387, -92086, -323674, 36728, 139236, -37793, 263601, -336101, -229091, -140688, -133806, 7836, 22886, 178492, 99285, -195330, 281715, -378605, 216789, -122410, 46886, 119899, -51518, -178461, -168549, 130305, -284225, -208789, 24206, -394678, -96751, -15909, 33967, 167101, 62864, -79181, -73759, 51916, -318158, 108483, 50802, 205997]
19128B05997i7924D0249K29465a34467M1020r582l72158A23308c7409J0530o7772
19117i4651j4930A81519H7712a30303l29310C06350B8481b0413j84155j68514
19107c73082a9081A45186O9400R8798I0038a98935L9709k34415a69608M0333j56557
19096b85832N0261g1036J226j12318e9708j91856e1502C9404a81040L6400A22614
19084b09124I2902k9589e452A300a31306l6767J3097M431L8250A58892J0883b31215
19071a25088A54078m7583J39057a22638j70171a18873p1461k13890A60622c3485
19060C4536M24063d0848r5708l4558h4645c4973H5134J3970K1689d1577A12121
19048a23704K1851c7516j04232B18029c06067b0649j46996A35690A5623J00977
$$ y = [205997, -97924, 40249, 269714, -134467, -93447, -103029, -475187, 123308, -37409, -26879, -94651, -109581, 181519, 87712, -130303, -459613, 306350, 28481, -20413, -204568, -373082, -19081, 145186, 214586, 313384, 90038, -198935, -159226, -393641, -169608, -129275, -285832, -235571, -71036, -69810, -182128, -59708, -251564, -51502, 39404, -181040, -144640, 122614, -209124, 92902, 63313, -5452, 1300, -131306, -168073, -154976, -150545, -112295, 158892, 169775, -231215, -125088, 154078, 106495, 245552, -122638, -292809, -118873, -190334, -404224, 160622, -33485, 34536, 458599, -40848, -136556, -171114, -84645, -34973, 85134, 99104, 120793, -41577, 112121, -123704, -101853, -37516, -141748, 218029, -306067, -20649, -167645, 135690, 15623, 116600]
19038A16600H150J26636N4793L4461a34533B10565l5626b77452a18151j43467
19028b61618C68854c88917a48544a9128g003j24721G56a7318m5154D4792g0174
19016b08495l5509a5134k53420Q1764l24007i2331G6030c4016j13932O4773p4620
19005a57795k60835Q8919i1003C3343f6524k77464a70541D8945a20212p395O0655
18994f6952A38144k2281a92896A4533a50182D79971h069k1837r7010K7965B0911
18982e6060B82567c26489i0295J8103K4285k2943k57148R4306A42133J05649b55863
18970a89969Q7787A03643b0593m5487I1859d3088j06733A00545N525K4963m3365
18959H7668b5681o03j33985d9864k22765B12178F0136A431P6597N8662F5b3446
$$ y = [116600, 8150, 134786, 189579, 224040, -134533, 210565, 174939, -277452, -118151, -261618, 368854, -388917, -148544, -19128, -7003, -131724, 756, -17318, -62472, 44792, -70174, -208495, -244004, -15134, -268554, -186790, -510797, -92331, 76030, -34016, -147948, -83175, -157795, -418630, -329711, -91003, 33343, -66524, -343988, -170541, 48945, -120212, -127607, -66952, 138144, 115863, -192896, 14533, -150182, 479971, -8069, -29906, -126916, -98951, 20911, -56060, 282567, -326489, -90295, -72192, -47907, -70850, -327998, -233692, 142133, 247782, -255863, -189969, -102182, 103643, -20593, -66080, 91859, -43088, -149821, 100545, 106070, 131033, 87668, -25681, -26284, -160269, -49864, -272629, 212178, 60136, 1431, 78028, 136690, 65, -23446]
18946G4606a90709B08934a02950D3313J8903i3270F9249A9269K02565r5870g2600
18934b13363A32448g1418H3066f7855E7407L38212A70519m5357c3253k4192A80321
18922b94673H1750Q8049b43861k347h4503j11429g8746E3551g2329A43046a09659
18910F4623f8018J1736a0948j75474H2670i0505k02103B26345r7392a12079I9118
18898B19080b20360j81472B43740e824r6970K9085A06666e5916j01347E8239b07752
18886b79306G8764d83369i6065A13679g5806K1515D1137a98360j22748a33684
18875b6139j15356b0241p9187j9934q6339H4162R9648F7222b36174B41153c6116
18863a94907N0495d1136A07208a12304j18746j46863e5135j71397h0956j99383
$$ y = [74606, -190709, 208934, -102950, 43313, 62216, -93270, 69249, 19269, 221834, 125964, -72600, -213363, 132448, -71418, 83066, -67855, 57407, 395619, 170519, 125162, -33253, -57445, 180321, -294673, 81750, 169799, -243861, -246208, -84503, -195932, -78746, 53551, -72329, 143046, -109659, 64623, -68018, -56282, -10948, -186422, 82670, -90505, -292608, 226345, 128953, -112079, 99118, 219080, -220360, -401832, 243740, -5824, -102794, -73709, 106666, -55916, -157263, 58239, -207752, -279306, 78764, -483369, -96065, 113679, -75806, -54291, 41137, -198360, -321108, -133684, -26139, -141495, -20241, -99428, -119362, -205701, 84162, 183810, 67222, -236174, 241153, -36116, -194907, -144412, -41136, 107208, -112304, -231050, -377913, -55135, -226532, -80956, -280339]
18853b80339N4630l0311K4732Q6608L9898k4421a5234A4936K37552g5477A80846
18841b8676l13867a40843d2419l12242B75322d47366G592J6076a60258j0679E2611
18829a27024G9157a79050B20542c02726B03704q3813B1470c03102A78348n3323
18819A25025K3893a45779D2040d31774A68722n7210g6757B40637B1814P0912J90939
18808B83665h3348D3435K03741A16819D3480B626K00609a09486p3908j69183A27112
18796a97811E990g8889B13635f6746E391J43905a82700A21949q859a4013l23806
18785c37819G8377n115a26633l2699b8299k39080J8015M4974E6620d930q3205
18774h8135l3335D13622b85228a21696c2784J2099o6715A33551M3807i7018E560
$$ y = [-280339, -225709, -256020, -231288, -144680, -104782, -129203, -15234, 14936, 252488, -75477, 180846, -28676, -342543, -140843, -42419, -354661, 275322, -447366, 7592, 23668, -160258, -170937, 52611, -127024, 79157, -179050, 220542, -302726, 203704, 119891, 21470, -303102, 178348, 125025, 148918, -145779, 42040, -431774, 168722, 111512, -76757, 240637, 21814, 92726, 283665, -83348, 43435, 247176, 116819, 43480, 2626, 203235, -109486, -183394, -352577, 127112, -197811, 5990, -78889, 213635, -66746, 5391, 149296, -182700, 121949, 113090, -14013, -337819, 78377, 73262, -126633, -159332, -28299, -267379, -249364, -204390, 56620, -4930, -88135, -121470, 413622, -285228, -121696, -32784, -20685, -87400, 133551, 177358, -97018, 5560]
18762D5494a997A29866f4023b7444n1611k51214a24621c1899l4824I8663e2520
18750c82974J58143b7146j09885l08242E6931d80274J86754A33777b41549B63814
18739c90559A37418a08741m6754B6433N0563a52716k7898J838A87666P327g9683
18727a93028a2994j41368I3243a75512O3197Q761C5080O0057a27518C47934A32203
18715g3545J9400A76514a74888k69818a07796O0B02954h151m8453B09859a09932
18703A43011a15676j64845F4459i1160B24765a95857D3016J50440c02227J00211
18693b02016a8091A30528b7014C554c43305D2602a05791K2043o3630O7887j96015
18682b75506A26415b11140i1967a0159c984C63273a00917A33460f5464k20239
$$ y = [45494, -1997, 129866, -64023, -27444, -79055, -330269, -124621, -31899, -66723, 98663, -52520, -382974, -224831, -27146, -137031, -445273, 56931, -480274, -293520, 133777, -241549, 263814, -390559, 137418, -108741, -155495, 26433, 76996, -152716, -180614, -178776, 187666, 194993, -79683, -193028, -12994, -154362, 93243, -175512, -112315, -103554, 35080, 95137, -127518, 347934, 132203, -73545, -54145, 176514, -174888, -444706, -107796, -107736, 202954, -8151, -56604, 209859, -109932, 143011, -115676, -280521, 64459, -91160, 224765, -195857, 43016, 193456, -302227, -202016, -18091, 130528, -27014, 3554, -343305, 42602, -105791, -83748, -147378, -79491, -275506, 126415, -211140, -91967, -10159, -3984, 363273, -100917, 133460, -65464, -285703]
18672b85703d16l9213B55931a72367L609j03588A82889n6685D5188O5112K73157
18661C83457a89296A08885a64933D02280j75710a76933Q6057j27850A80364o0732
18651A19632E9596J0432J81940A18601b73626l05050g7104B1436a22652D7484
18640a7382F2747e1404A50789b66023B44461a86956F267N9216a51541k36191B26538
18628C6513a53879j80857J26623A35343b22209A27401J19902C734a66758D6444
18617d69236K22930a5030k01860e0752E2177b66419P137F8101i6398A21057a20194
18605A57390a27290G6783J00280b5883B1877a30822A31070e6259A0105b36905
18594B3557N0780g815D3264Q8082l8245a43369B484e16841a9721B88898e13879
$$ y = [-285703, -416, -39629, 255931, -172367, -168758, -272346, 182889, 126204, 45188, 110300, 383457, -189296, 108885, -164933, 402280, 226570, -176933, -90876, -218726, 180364, 119632, 59596, 70028, 251968, 118601, -273626, -578676, -77104, 21436, -122652, 47484, -17382, 62747, -51404, 150789, -266023, 244461, -186956, 6267, 65483, -151541, -387732, 226538, 36513, -153879, -334736, -208113, 135343, -222209, 127401, 247303, 3734, -166758, 46444, -469236, -246306, -15030, -216890, -50752, 52177, -266419, -259282, 68101, -96398, 121057, -120194, 157390, -127290, 76783, 177063, -25883, 21877, -130822, 131070, -56259, 10105, -236905, 23557, 74337, -7815, 43264, 131346, 93101, -143369, 2484, -516841, -19721, 288898, -513879]
18582G012a37720C1226j0232b25742m1539Q6823D0518g6478j30827A89630D8869
18570a634B50500r3663l4080A3594J45913A2418J70481E5440a54108j21486G6703
18558D3898a2632o0576A01495g21F8042a57652N145C6350J9690g621C3385e2596
18545B8415a08211J420l09399A13491O479a79778h1261j43960O9136f8198k16151
18534b84349B22101b5997k21725M3055g6688H1598R5999g1130k07154g9599H6026
18522a29982j62297l3609a11487B18645a203A80448a82572k3145Q6205A68700
18511B53448g6262A8019F390a27873d4018j38727O9202E7564L01602a75810O4158
18500a11652M7938C2832J05413e2985j6220r6696A10498A0113J54755G8984b21516
$$ y = [7012, -137720, 31226, 20994, -225742, -267281, -180458, 40518, -76478, -207305, 189630, 48869, -1634, 250500, 156837, 122757, 13594, 159507, 12418, 182899, 55440, -154108, -275594, 76703, 43898, -12632, -73208, 101495, -721, 68042, -157652, -152507, 36350, 56040, -7621, 33385, -52596, 28415, -108211, -106791, -416190, 113491, 119970, -179778, -81261, -225221, -156085, -68198, -284349, 222101, -25997, -247722, -204667, -76688, 81598, 177597, -71130, -278284, -79599, 86026, -129982, -292279, -325888, -111487, 218645, -1203, 180448, -182572, -205717, -119512, 168700, 253448, -76262, 18019, 6390, -127873, -44018, -182745, -113543, 57564, 359166, -175810, -111652, -63714, 32832, 138245, -52985, -69205, -165901, 110498, 10113, 164868, 78984, -221516]
18488c20521E7359A9119J8869b11608L8004F3928b25970A17760d7597C0531j598
18477B8933P1662c24542G1227l213a28841N4936n2447M5387J0473A91581a18293
18465I9485a8214q6289A20754K00525j05764K2419a30993b1263A27669R3064b43146
18453A1844e2446A47482P361h5655o9398j38634Q7303i6797j4840d4549j74762
18442b19311J00728j76946a28427A82326N9328q9912a84879B4874n429a63513
18431d6083E5740h350B51389A23668h3523H302P1979l8679N5888a78644G8855
18419g146k9785n02035K23805A38681a16477j46202b9594A11971c929k6250A64814
18407A13026C6563i9435i416A55263c08704A56755Q0546A06926a55166G2771a1114
$$ y = [-320521, 57359, 19119, 37988, -211608, -173604, 63928, -225970, 117760, -47597, 30531, 28933, 100595, -324542, 71227, 68014, -128841, -73905, -126352, -80965, -70492, 191581, -118293, 99485, -18214, -104503, 120754, 321279, 215515, 237934, -130993, -21263, 127669, 220733, -243146, 11844, -52446, 147482, 154843, -85655, -155053, -293687, -206384, -96797, -111637, -44549, -219311, -118583, -295529, -128427, 182326, 241654, 151742, -184879, 24874, 19445, -163513, -46083, 55740, -8350, 251389, 123668, -83523, 8302, 80281, 41602, 97490, -178644, 78855, -7146, -36931, -538966, -315161, 138681, -116477, -262679, -29594, 111971, -3929, -30179, 164814, 113026, 36563, -99435, -9416, 155263, -308704, 156755, 237301, 106926, -155166, 72771, -11114]
18395b08186B2551b34331b2768B5065b76593R7055p9615h7923A9311N8477b1012
18383b57289k44084A59324m4775A2961e4742B52651b64242L1675m7922A48055
18372a22569A98124J28322o4892b57728a10641A36095a76391A91252G8024f8957
18361h7198m23699c222k42639e2480r092C21047f4935l70545a50846B15066A7171
18349A39949a12289q8751a3537e676A6287L8003K02610r868a02695l78907h0881
18337C9404d281C20188b26786a8535k76535I5346a05794C27064B2291e6130B4258
18325a00203j26433l12615N0646B78929i9835E9363M1182K12841a35051k38942
18315c73993i9248r6836g7880A06379J69899j20770R1939e2498j94492A11154
$$ y = [-208186, 22551, -234331, -22768, 25065, -276593, -179538, -259153, -87923, 19311, 77788, -21012, -257289, -501373, 159324, 114549, 12961, -54742, 252651, -264242, -232567, -280489, 148055, -122569, 198124, 326446, 261554, -257728, -110641, 136095, -176391, 191252, 78024, -68957, -87198, -510897, -3222, -245861, -52480, -61572, 321047, -64935, -435480, -150846, 215066, 17171, 139949, -112289, -201040, -13537, -5676, 16287, 54290, 256900, 247032, -102695, -481602, -80881, 39404, -4281, 320188, -226786, -18535, -295070, 95346, -105794, 327064, 22291, -56130, 24258, -100203, -226636, -539251, -488605, 278929, -99835, 59363, 100545, 313386, -135051, -373993, -99248, -196084, -77880, 106379, 276278, 155508, 247447, -52498, -246990, 111154]
18304A568e3035q6440O3229G560J78955A9242J54407D5834c56498a19138a9634
18292A72842a23128C28083A01362d34261G3236a77066B55370c97070J34595A57344
18281G7876J24345I1909a75341D6302h1776A49712f369F3759b42853j25612E244
18269f1526j07480B98180C8734j480a15027l23454a81497d7286A66590f1466A21811
18257b89142R4498b686B52876E3133Q2527C2045b5504D6319A9056a44542A67116
18245h8374k39199B31375r4974h0192o948a5761E4243P5464d5435j75007A20377
18233C16495h5997j5335k68474a4368B6441f2963A72425i5305p2980A4681L0459
18222D5140a16500A63371c11278b6827n58008D4864L4540M6166A4747c6191B13042
$$ y = [1568, -53035, -139475, -76246, 7560, 186515, 19242, 173649, 45834, -356498, -119138, -19634, 172842, -123128, 328083, 101362, -434261, 73236, -177066, 255370, -397070, -262475, 157344, 77876, 202221, 91909, -175341, 46302, -81776, 149712, -6369, 63759, -242853, -368465, 5244, -61526, -169006, 298180, 38734, 37254, -115027, -438481, -181497, -47286, 166590, -61466, 121811, -289142, -194644, -2686, 252876, 53133, 135660, 32045, -25504, 46319, 19056, -144542, 167116, -88374, -327573, 231375, 136401, -80192, -87140, -15761, 54243, 129707, -45435, -220442, 120377, 316495, -85997, -101332, -369806, -14368, 26441, -62963, 172425, -95305, -168285, 14681, 45140, -116500, 163371, -311278, -26827, -584835, 44864, 79404, 125570, 14747, -36191, 213042]
18210A99862I5821a88748A03207m9692O0749a27051B93632c85193h6701j54819
18200b41520j36056A28057B7082L5632N9487a60454a5091F258b32426H2951d9128
18188g0017l106a8644q3790A38316b4549j87560b5593A10454c02146P6518A98095
18176g6053r8570C05162i4653E5957Q536K2439O4336a02007j19546A12773m0951
18165G1822a70905B06040b78356L8779A24200a03835K2836B5271e9827A491d3176
18153a86594b9474j51112f956m8123j1837l316j48495i3889c7834j34747G2287
18141a27370k7577C4423J4731b16310B19008b17784f5303l0765j13017f5823A12697
18129g6651D51456C2920b39323B98432e7233J7996j2152a7170F1253J23215a71118
$$ y = [199862, 95821, -188748, 103207, 53515, 114264, -127051, 293632, -385193, -86701, -241520, -377576, 128057, 27082, 62714, 122201, -160454, -15091, 6258, -232426, 82951, -49128, -70017, -73123, -18644, -102434, 138316, -24549, -212109, -25593, 110454, -302146, -225628, 198095, -76053, -174623, 305162, -94653, 55957, 64493, 86932, 151268, -102007, -221553, 112773, 71822, -170905, 206040, -278356, -239577, 124200, -103835, -80999, 25271, -59827, 1491, -43176, -186594, -29474, -180586, -6956, -55079, -66916, -70232, -218727, -93889, -37834, -172581, 72287, -127370, -154947, 34423, 49154, -216310, 219008, -217784, -65303, -96068, -209085, -65823, 112697, -76651, 451456, 32920, -239323, 298432, -57233, -39237, -51389, -17170, 61253, 184468, -171118]
18117d07488d9124A60654a1667n5463m1476c6852I2580c29995e3728n0255M0082
18106f3901m7984d7187C5249a09360A42173E841b78435I4540b15080A0170M4511
18095E4681i7428b3440j39819F746L8417O0529B5324h0111d217l14055a02793
18083b8478d082A1062L3911j1509a96086B8628d3235j15723j48471J41118B51682
18071B738P1758e6683A66851e8204A85971P3856a6829A05688B4031o910E062a47125
18058b48051e8656k52200B1826b68066h5353A81487A3343g4123a2214j32340c0374
18046B76015b3200a1556k9958k25771F7378J18429b08171Q7077R681E6125b41034
18034A6034a06513j9576q12a1374j44371C80035q205A34291L8054q4940a43654
$$ y = [-407488, -49124, 160654, -11667, -67130, -108606, -36852, 92580, -329995, -53728, -103983, -63901, -111885, -47187, 35249, -109360, 142173, 5841, -278435, 94540, -215080, 10170, 54681, -97428, -23440, -163259, 6746, 45163, 105692, 25324, -80111, -4217, -318272, -102793, -28478, -4082, 11062, 44973, 33464, -196086, 28628, -43235, -158958, -307429, -166311, 251682, 2738, 74496, -56683, 166851, -58204, 185971, 259827, -16829, 105688, 24031, 17121, 5062, -147125, -248051, -58656, -310856, 21826, -268066, -85353, 181487, 13343, -74123, -12214, -144554, -30374, 276015, -23200, -11556, -41514, -267285, 67378, 185807, -208171, -121094, -111413, 56125, -241034, 16034, -106513, -126089, -126901, -11374, -155745, 380035, 371830, 134291, 172345, 87405, -143654]
18022c13787a8090I9146a3897k38854A10388d16971Q8345b2385A13358c6093a4659
18010b42537A20648a0881l09378P1137A21154n936a79806J3015C6380d2901I2818
17998c52039J63284O0489D68070a36261A08356g5542A16772a03262n7342A51116
17987A700J88938D4973J7819b98058A37154a07565q462A27957J60682g2847C2169
17975A74269a94254C02502i0329F1910a60032A7300J26065b72772g576A09850
17964H4619b6262m40A95703n665b48520L4631a00541E2809K46815A02664d8235
17952E2789d12727e6551l0628l84764c6577A23389c4265j11626A8458d747E7704
17940b22486B82097a04066R675n1907d4580k2409k924n9I346b59884A54704b31235
$$ y = [-313787, -18090, 99146, -13897, -252751, 110388, -416971, -328626, -22385, 113358, -36093, -14659, -242537, 120648, -10881, -320259, -249122, 121154, 115218, -179806, -166791, 36380, -42901, 92818, -352039, -188755, -128266, 468070, -136261, 108356, -75542, 116772, -103262, -160604, 151116, 1700, 190638, 44973, 62792, -298058, 137154, -107565, -116027, 127957, 288639, -72847, 32169, 174269, -194254, 302502, -90329, 61910, -160032, 17300, 143365, -272772, -7576, 109850, 84619, -26262, -26702, 195703, 190038, -248520, -213889, -100541, 52809, 299624, 102664, -48235, 52789, -412727, -56551, -87179, -471943, -36577, 123389, -34265, -145891, 18458, -4747, 57704, -222486, 282097, -104066, -94391, -146298, -44580, -66989, -69913, -69972, 9346, -259884, 154704, -231235]
17927e4525a7328k50817A51660a43031B17357g6803j3799H5945a50232m4360N2761
17916a41831L4277E2304c57788J47981A8225g7642j16628P5588A72980D4625f1841
17904A12425d38p299j63259c2834A67516J1480C1619b96568d3173C3314a3887
17892a92049r0259F9291M28726e6337j56080i6407p5125G8710e3904j2122B36927
17880b3382l1892l8252A48402b38526B3468b38264g9176C0415b28277A32564g268
17868b65463b8679j00099d6928j05022a9372k18408L1375C2579A648L62039C3517
17856A22590i1832H9689c3588i645A83805a88190C4474A4798J08797a58116d609
17844e5896D26b20635B70485D3984e6283j92135j09429J52453N2261L6032B07974
$$ y = [-54525, -17328, -268145, 151660, -143031, 217357, -76803, -90602, 85945, -150232, -194592, -141831, -107554, 52304, -357788, -209807, 18225, -77642, -194270, -118682, 172980, 44625, -61841, 112425, -438, -7737, -170996, -32834, 167516, 178996, 31619, -296568, -43173, 33314, -13887, -192049, -282308, 69291, 498017, -56337, -212417, -96407, -171532, 78710, -53904, -66026, 236927, -23382, -55274, -93526, 148402, -238526, 23468, -238264, -79176, 30415, -228277, 132564, -7268, -265463, -28679, -128778, -46928, -151950, -19372, -237780, -206405, 32579, 1648, 363687, 33517, 122590, -91832, 89689, -33588, -9645, 183805, -188190, 34474, 14798, 123595, -158116, -4609, -55896, 426, -220635, 270485, 43984, -56283, -248418, -357847, -205394, -153133, -117101, 207974]
17832g6619B40705e3697J1005G3392J45265H0783F917b41298J17075k6005B43818
17820B30977a29688F9274h8658k7881K7669k42496A45744D38a41853j0759H3218
17808A4181J1545R7774p861e3745K2254B8955a6921A81304a95851O0770A77798
17796B9166K68375a53615N5484g168j38680A3463c14731B93677m7161I9878C8710
17784a89007B69998j31497e2340p3484D9733J45095a04581b8737N376A63847b2772
17772B40718d0098B033K22555r8506b00393A10538i5396B11787q0851m581b36246
17760a16700G8160h0054j11544B17059F5842a92456A78300m9836D3787Q94g6799
17748c2877B11531b269j08671J2735C1985J09557b15595d3634l4324C69485b5808
$$ y = [-76619, 240705, -53697, -42692, 73392, 218657, 80783, 6917, -241298, -124223, -150228, 243818, 230977, -129688, 69274, -88658, -116539, -88870, -331366, 145744, 438, -141853, -152612, 83218, 14181, 25726, 123500, 115639, -53745, -31491, 28955, -16921, 181304, -195851, -135081, 177798, 29166, 297541, -153615, -98131, -7168, -145848, 13463, -314731, 293677, 246516, 99878, 38710, -189007, 269998, 138501, -52340, -125824, 49733, 194828, -104581, -28737, -23361, 163847, -22772, 240718, -40098, 2033, 224588, 126082, -200393, 110538, -95396, 211787, 130936, 126355, -236246, -116700, 78160, -80054, -191598, 217059, 65842, -192456, 178300, 128464, 43787, 44681, -76799, -32877, 211531, -2269, -110940, -98205, 31985, 141542, -215595, -43634, -77958, 369485, -25808]
17736A07217b67925I5735g5226A82677a18573A08391Q5812a07604k48167D4549
17725c4957j50124a7953B35287A6384J46836e5413k1399p5256N4954C3072g1548
17713b42654i4503J6404k6760C03347a00248K680A25306b15166B41616a26782
17702F7038L2959G324J15841c9883k01157K5910A46995j8798J21943f276A02576
17690D34P3560C6060b20971P0142C5533o449h0949A72499a2847G3547h6928B1699
17677a25261A15541j6167L29150F4748I642L3183d3682p8279N7946C47016a49633
17665h9915A51213c14384L0519G4457O0254h2909F1462j3054J07411a83660C4830
17653B2340a13658I5136L5271a7958k21880Q4838b8327A17525G96f897B44951
$$ y = [107217, -267925, 95735, -75226, 182677, -118573, 108391, 194203, -107604, -355771, 44549, -34957, -185081, -17953, 235287, 16384, 163220, -55413, -76812, -152068, -97114, 33072, -71548, -242654, -94503, -78099, -104859, 303347, -100248, -97568, 125306, -215166, 241616, -126782, 67038, 99997, 7324, 123165, -39883, -241040, -215130, 146995, 128197, 250140, -6276, 102576, 434, 73994, 36060, -220971, -150829, 35533, 29084, -80949, 172499, -12847, 73547, -86928, 21699, -125261, 115541, 99374, 428524, 64748, 9642, 42825, -43682, -121961, -64015, 347016, -149633, -89915, 151213, -314384, -283865, 74457, 134711, -82909, 61462, 48408, 155819, -183660, 34830, 22340, -113658, 95136, 130407, -17958, -239838, -155000, -28327, 117525, 796, -6897, 244951]
17641B99588A19505f129A68411R4721c3814A40284a49907N0333A4219J07023b89705
17629C21673a13205A74243Q4933c951k81746f7932j40619c9695A56114d0308Q233
17618c2075B6900a54565C02428a14273A11279a82466q8824d0809R854G7462d0632
17606a45740j464I4459j6279J98391a1221k29981A66085J1883e3355A56886E2965
17594F6867a25850A44723k5212a1070F7856J9420D2197j7980J79999B6051J05534
17583A31585a49218c4763l2731l28344E6204A222a37688C1185d2243a5987g784
17571h0059B23897a64777A802a82363N496e9220A01330e1803o2834B71937A22125
17559B7548P4871G261f37B4852K1810J62569m252I592L10942b08940B82664o7845
$$ y = [299588, 119505, -6129, 168411, 263132, -33814, 140284, -149907, -99574, 14219, 121242, -289705, 321673, -113205, 174243, 259176, -3951, -285697, -67932, -208551, -39695, 156114, -40308, -32075, 26900, -154565, 302428, -114273, 111279, -182466, -271290, -40809, -30955, 77462, -40632, -145740, -147204, 94459, 78180, 276571, -11221, -241202, 166085, 177968, -53355, 156886, 52965, 66867, -125850, 144723, 119511, -11070, 67856, 87276, 42197, 24217, 204216, 26051, 131585, -149218, -34763, -67494, -395838, 56204, 1222, -137688, 31185, -42243, -15987, -7784, -80059, 223897, -164777, 1802, -182363, -176867, -59220, 101330, -51803, -114637, 271937, 122125, 27548, 102419, 7261, -637, 24852, 46662, 209231, 204979, 9592, 320534, -208940, 282664, 214819]
17547B14819e5198J2451B0785J3651c3974o6428B91676d5897H6903e8668B24239
17535A95181F7232J02145K0078E601J37355A5633J60298k7914f6334o0779J4209
17524a12904m2806A57893b0854A18752b51658g0856f087E01708A71655J3376A1243
17512A27913J32061j25050C3475b60213B92264A1438O1612G30a69834m1520e5461
17500A48347g0703B45588M3356a82092A71542j6028R6489A20813J3243c6121l1773
17489f7894n8969C75599j59257b9985B29977m390J09483A51812b4311B34536B4613
17477A63969J63145C1547J12025a26245C9970K48682N3296l7904B3619J81563
17467B05182l7648J04943j6700M9838h3072b9449A28481a28783D59707a23634
$$ y = [214819, -55198, -42747, 20785, 34436, -33974, -100402, 291676, -45897, 86903, -58668, 224239, 195181, 67232, 169377, 189455, 5601, 142956, 15633, 175931, 148017, -66334, -127113, -112904, -155710, 157893, -20854, 118752, -251658, -70856, -6087, 501708, 171655, 185031, 11243, 127913, 259974, 134924, 33475, -260213, 292264, 11438, 73050, 730, -169834, -211354, -55461, 148347, -70703, 245588, 288944, -182092, 171542, 155514, 252003, 120813, 134056, -36121, -67894, -126863, 375599, 216342, -29985, 229977, 225587, 335070, 151812, -24311, 234536, 24613, 163969, 327114, 31547, 143572, -126245, 39970, 288652, 341948, 304044, 23619, 205182, 167534, 272477, 255777, 305615, -83072, -29449, 128481, -128783, 459707, -123634]
17456B5733K36989J37935J39447B40262j12636K78837n7432A33509b01030C15276
17445C11743n6060c9579A28671L08590l7441j18047r9102K63877A79513K8661
17435B08174q3757N2204k7283k5749C2063K86300N0394j07518A9653K26904o9063
17424A77494J38160o1370K39704c4294C34625D314J80813e0066B27407J85103
17414D12510A69357O3774K60418k30526O6271K9926A43138R341M8336N7490A21973
17402F4521K45117a49516C73283A18003g5307D46197b65604B06069g970C29747
17391A66456O8L9840k6126j2583K04781M6538A83702l4010J29760J97180j43968
17380C32664j54770o7141J64076e3667e907q1181M2883B91776O0893A49468d836
$$ y = [25733, 262722, 400657, 540104, 240262, 127626, 406463, 349031, 133509, -201030, 315276, 311743, 255683, -39579, 128671, 437261, 399820, 281773, 182671, 446548, 179513, 208174, 124417, 176621, 149338, 123589, 32063, 318363, 368757, 261239, 19653, 246557, 177494, 315654, 254284, 493988, -34294, 334625, 4314, 185127, -50066, 227407, 412510, 169357, 233131, 493549, 263023, 329294, 359220, 143138, 152479, 200815, 258305, 121973, 64521, 309638, -149516, 373283, 118003, -75307, 446197, -265604, 206069, -7970, 329747, 166456, 166524, 206364, 180238, 167655, 372436, 418974, 183702, 149692, 279452, 476632, 332664, 177894, 110753, 274829, -53667, -5907, -87088, -44205, 291776, 352669, 149468, -4836]
17368E37384a85230B43234K47322A36442a63702C8108j2735b1054j57810Q2631
17358i6233B11169J92568C8276J1086K71847J08686g0241a3304B83303p5240N7773
17347B65836e7592A0120J13907G937O8209J97082j04649C8470J14945l2198J5803
17336A37020B6363a37536B39147D4065L59954I5303J40581j6184k8891N164H9441
17324A74315H0803L1056k1482g8343A6152J10288k897L45626G9939J58319h365
17312C74905j8063j74524g92B5212J90148a41189A21448c4077A3570K20800j05833
17301A28537h2654A37827O21087i6788A41456P8901j04454M4452q079d950C46142
17289B60621G7618L74220A24276a8567k9415j88903C34942p9220e9612B2077N3915
$$ y = [537384, -185230, 243234, 490556, 136442, -163702, 38108, 25373, -21054, -178864, -96233, 211169, 403737, 38276, 49362, 321209, 429895, -70241, -13304, 283303, 208063, 265836, -57592, 10120, 124027, 7937, 76146, 273228, 168579, 38470, 153415, 121217, 137020, 26363, -137536, 239147, 44065, 404019, 95303, 235884, 219700, 190809, 195973, 89441, 174315, 80803, 111859, 90377, -78343, 16152, 126440, 123543, 469169, 79939, 238258, -8365, 374905, 356842, 182318, -792, 25212, 215360, -141189, 121448, -34077, 13570, 234370, 128537, -82654, 137827, 758914, -96788, 141456, 220357, 115903, 160355, 152276, -4950, 346142, 260621, 77618, 451838, 124276, -18567, -47982, -236885, 334942, 255722, -59612, 22077, 75992]
17278G5992j3321j9065d418E37947I8334K98983F6246M96592k48478A43595a92629
17266H4692N0222K6504M51446A11974m1157a36414B08863f3601B06628o6751P8782
17255B18659Q4957A06448j0612M5951J72559q1465a48108B26195H1924N0472K3083
17244A55479P3901D8514M07525n7857j81331q1486L02549j00480A59595Q0802
17234B40397G2066K2071L85662A88025I705J19841J37400l8077H0833J76164O9500
17223C26497k2093q6262E4739R6004J19472n4605c2725A84020J09291E2372a75878
17211A80645J22253j27977N0826J61690j80233J07605K3706j21348o0528i0679
17200a18095H7142B8748J65714G2089L94012E7945K01290q4828K29002A55657
$$ y = [75992, 62671, 43606, -4418, 537947, 98334, 397317, 66246, 562838, 314360, 143595, -192629, 84692, 134914, 161418, 612864, 111974, 70817, -136414, 208863, -63601, 206628, 139877, 218659, 303616, 106448, 95836, 141787, 314346, 232881, -148108, 226195, 81924, 132396, 155479, 229380, 48514, 456039, 398182, 216851, 135365, 437914, 337434, 159595, 240397, 72066, 94137, 479799, 188025, 9705, 129546, 266946, 228869, 80833, 256997, 326497, 304404, 218142, 54739, 150743, 270215, 215610, -32725, 184020, 293311, 52372, -175878, 180645, 302898, 174921, 225747, 387437, 207204, 314809, 338515, 217167, 156639, -90679, -118095, 87142, 28748, 194462, 72089, 466101, 57945, 259235, 174407, 403409, 155657]
17189C39062A27879J27599j10740K91089k8406j9810N9860Q9112k18521n5213
17179B62849K72212A63855K13591j56550Q115p4875b4166B98274j05051K12867
17169D06090j86373b8951b453B52648K56782j37356J00799R0296o0145A61344
17158B09427K37494k7583A54437K88747k9612A74103L48139A54262R9372L50626
17148F04260B23827L58869B56262L7487R0605o3859M7529A6645M17756M3149k25006
17137B52544q0500Q1479c8377E23425k55739J77360j68257d0832D20389O2290
17127D82679l2908j09635N971D5532M81059P2673A88399M70465L5358j33419K60675
17116H21478C47006Q1268a4398C66615J09595A22471N70490B17590K95861j82239
$$ y = [339062, 127879, 255478, 144738, 435827, 407421, 387611, 447471, 536583, 318062, 262849, 535061, 163855, 377446, 220896, 229011, 154136, -24166, 298274, 193223, 406090, 219717, -28951, -2453, 252648, 509430, 372074, 472873, 563169, 503024, 161344, 209427, 446921, 419338, 154437, 443184, 413572, 174103, 522242, 154262, 253634, 604260, 223827, 582696, 256262, 293749, 384354, 320495, 368024, 16645, 434401, 477550, 252544, 172044, 253523, -38377, 523425, 267686, 445046, 276789, -40832, 420389, 482679, 449771, 340136, 346107, 45532, 526591, 599264, 188399, 658864, 694222, 560803, 821478, 347006, 428274, -14398, 366615, 476210, 122471, 692961, 217590, 513451, 331212]
17106C31212J15467N8957L4317B30439K63186j8447J8319L65340C68558L6227
17096D04785N8573J17746j10394k6468j9637K4045A75190M59620k67047j56155
17086B11608J59585m1930A38464b8448E80406K1313K8920m8825A74055K30408
17076D04463K69752n7118j03235K20679C17983J72146o6153J05341j02309K91943
17066G18951n7674o544q861Q9299C09430Q79561C16786K03222o8020R695A59294
17054G52398r0517B76590P1632q9339L91276L4673j47959K12579C23681J91776
17044E15457L8151j10508m1106J87184l0571K6078j43152K46838j88075n1487
17034D48809K46634j80495j54419O3843p5467L20899J11047j98619J6977K747
$$ y = [331212, 446679, 505636, 539953, 230439, 493625, 475178, 493497, 858837, 368558, 404785, 463358, 581104, 470710, 444242, 424605, 448650, 175190, 634810, 367763, 211608, 371193, 329263, 138464, -28448, 580406, 601719, 630639, 581814, 174055, 404463, 674215, 617097, 513862, 734541, 317983, 490129, 423976, 529317, 427008, 718951, 661277, 654733, 645872, 735171, 309430, 1188991, 316786, 520008, 451988, 461683, 159294, 752398, 661881, 276590, 348222, 258883, 650159, 684832, 536873, 749452, 323681, 515457, 553608, 443100, 401994, 589178, 558607, 584685, 441533, 688371, 500296, 448809, 695443, 514948, 360529, 424372, 348905, 669804, 780851, 582232, 599209, 601956]
17024F01956j37435M91458m35951K32419k1756j66806K78283k06076p3568K12638
17014G75162q8075L1973l6326j12282r779K03669n0938j46312j09856M01741L3778
17003H92755k8730Q38P751j74580R6818K71689r1722k32808J45316j42029L44077
16992A089375l66934K41897k99401P2129J98407o2219j93433L55018J8143j50307
16982I02675O417n2882N8644J98261m87580M46287K9472k76351K08606m3207j55709
16971H34633J26974J41093l54563L55034j89190J47425j47086l63449N75669l2916
16961A093624k29485J82732j83992N32817l11865J21260l79881N88516m82206
16952I31520M20260r9705j01031r4831O8597J69334k24294J54874j05128K66240
$$ y = [601956, 464521, 955979, 520028, 752447, 730691, 563885, 842168, 636092, 562524, 775162, 687087, 719060, 682734, 570452, 560673, 764342, 713404, 567092, 457236, 858977, 892755, 864025, 864863, 872614, 698034, 794852, 1066541, 974819, 742011, 887327, 745298, 1089375, 722441, 964338, 664937, 737066, 935473, 873254, 679821, 1034839, 1052982, 902675, 909092, 856210, 914854, 1113115, 625535, 1071822, 1101294, 824943, 1033549, 990342, 834633, 961607, 1102700, 748137, 1103171, 913981, 1061406, 914320, 550871, 1126540, 1093624, 864139, 1046871, 862879, 1395696, 1083831, 1205091, 825210, 1413726, 931520, 1351780, 1252075, 1151044, 1056213, 1124810, 1294144, 1069850, 1224724, 1119596, 1385836]
16942A385836j51415J38968R0549k27390J83696J2680o0561k26865N88360n79521
16932A154337L630K5134L33969j54266p9765J54616L2310j8808l15637O35842
16922A771362n47559L51009j62595J86175j11580N8606j1311p7799L2216R8598
16912A587122J33764j77984K28439j08883J4454r530M66161n55084L0719j0004
16902A599174J61018k88609Q54733m46741P2942j33695P995L09838o26310N20830
16892B031175j87220M50314k82447K73276j87640j4966r9156M04304j28476L7357
16882B296521J88316k43145j5899P8377l46943M61499M2005l71389K51035r9330
16872B241047J33818K14697Q0041k50280M87775j48034j98811k51767O33347k69759
$$ y = [1385836, 1234421, 1373389, 1463938, 1236548, 1420244, 1432924, 1372363, 1145498, 1733858, 1154337, 1157967, 1183101, 1517070, 1362804, 1283039, 1437655, 1469965, 1451157, 1135520, 1771362, 1223803, 1574812, 1412217, 1598392, 1486812, 1545418, 1534107, 1456308, 1488524, 1587122, 1720886, 1542902, 1771341, 1662458, 1676912, 1667382, 2133543, 1578459, 1609178, 1599174, 1760192, 1471583, 2326316, 1879575, 1952517, 1818822, 1826817, 2136655, 1510345, 2031175, 1843955, 2294269, 2011822, 2285098, 2097458, 2082492, 1983336, 2387640, 2259164, 2296521, 2484837, 2241692, 2225793, 2304170, 1957227, 2418726, 2460731, 2089342, 2340377, 2241047, 2374865, 2589562, 2669603, 2419323, 2907098, 2759064, 2560253, 2308486, 2941833, 2672074]
16862B672074K36001P5971J84215l04672p5743N22818n4046j16738k20340K32522
16852C152062J84349L22232l26444J92556J69586m9095m65847M86861L4061K22730
16842C923051J4162K1072J12320k09630J17330Q4214L93552k43566L18781j45206
16832D386080K86978m23424O07995k34937L14045N195K08884L5224j55090K03065
16822E234015L05286J0197l7457J68605O1400Q9555J73635L77907j96967J76822
16812F362998K147K70176J93401K25923J25390L37667l11963J26372Q2257M83128
16802G897496J0355K85573N01449Q7171J54590M15219J31324L95155J1614m6101
16792I843845O17854J6282L63843N56683J00651M98075K72473J70622M06573J64680
$$ y = [2672074, 2908075, 2984046, 3168261, 2863589, 2787846, 3310664, 3256618, 3139880, 2919540, 3152062, 3336411, 3658643, 3332199, 3524755, 3694341, 3645246, 3179399, 3666260, 3700321, 3923051, 3937213, 3958285, 4070605, 3860975, 3978305, 4062519, 4456071, 4212505, 4531286, 4386080, 4673058, 4249634, 4857629, 4622692, 4936737, 4941932, 5150816, 5186040, 5030950, 5234015, 5539301, 5549498, 5512041, 5680646, 5742046, 5831601, 6005236, 6383143, 6186176, 6362998, 6365145, 6635321, 6828722, 7054645, 7180035, 7517702, 7205739, 7332111, 7414368, 7897496, 7907851, 8193424, 8694873, 8782044, 8936634, 9351853, 9483177, 9878332, 9889946, 9843845, 10461699, 10477981, 10841824, 11398507, 11499158, 11997233, 12269706, 12440328, 12846901, 13011581]
16782A3011581K86960Q87537J11751K79952N23529P03035J39395P22714M61122
16773A7127576N83869N25236N02730O96813P25012O93196J272218J22923J212288
16764B3461861N41858J193524L51488J536186J008308R08281J244066J576000
16756C1821572P48995J798265J262084J596312J759201K267831J566593K113449
16748D4934302K098356K167844K213645K826112L120127K825131L185880L174351
16740F6545748L898451L691548M037986M611810M889085M580410M633615N388033
16732A02276686N767390N747318O073579O066645N886184O113668N964109N405616
16724A49301195N506574N100799M333470L539656K736101J749252J150806k28305
$$ y = [13011581, 13298541, 14186078, 14297829, 14577781, 15101310, 15804345, 15943740, 16666454, 17127576, 17711445, 18236681, 18739411, 19436224, 20161236, 20854432, 22126650, 22249573, 23461861, 24003719, 25197243, 25548731, 27084917, 28093225, 29001506, 30245572, 31821572, 32570567, 34368832, 35630916, 37227228, 38986429, 41254260, 42820853, 44934302, 47032658, 49200502, 51414147, 54240259, 57360386, 60185517, 63371397, 66545748, 70444199, 74135747, 78173733, 82785543, 87674628, 92255038, 96888653, 102276686, 108044076, 113791394, 119864973, 125931618, 131817802, 137931470, 143895579, 149301195, 154807769, 159908568, 164242038, 167781694, 170517795, 172267047, 173417853, 173189548]
16716A73189548j022576k273625l101952l748425m454608n128171n582110n936968
16708A41941113n923850o218282o317733o032565o060260n802592n642092n435141
16700I4508598n100594m948351m545987m261678m006969l640066l419610l749980
16692F0835363k920349l067712k717982k715575k615687k253457k024330j880982
16684D0639289j979891j517993j708656j559492j652994r52769j980706q22003
16676B8464785j336745r81445j310261r55619o01874j025861r54412n90239o66693
16667B0041636p38401p44111o63638r85524k30558n00615q13217k89221l48949
16658A4727402p48411j14203m01766m72549m46011m63004l09072j28655m69875
$$ y = [173189548, 172166972, 169893347, 166791395, 163042970, 158588362, 153460191, 147878081, 141941113, 136017263, 129798981, 123481248, 117448683, 111388423, 105585831, 99943739, 94508598, 89408004, 84459653, 79913666, 75651988, 71645019, 68004953, 64585343, 60835363, 57915014, 54847302, 52129320, 49413745, 46798058, 44544601, 42520271, 40639289, 38659398, 37141405, 35432749, 33873257, 32220263, 31267494, 29286788, 28464785, 27128040, 26146595, 24836334, 23880715, 23278841, 22252980, 21298568, 20708329, 20041636, 19303235, 18559124, 17895486, 16909962, 16679404, 16178789, 15365572, 15076351, 14727402, 13978991, 13864788, 13463022, 12990473, 12544462, 12081458, 11772386, 11643731, 11173856]
16649A1173856m33805j59142n50863j50744m5838n97480k40274L9875l18994k22128
16639H494463n60404K36094j02017m12900K357m12620K15256p85550J04733j81079
16629F598333J75348l11448m78015J32816j91106j06356n4773r4091j50419k26854
16619E293435J33508l65732p0305o9503j42991P2847l37480j66822l309m6482
16609D297166K17046l55932k69703J57404J59894l67750K58636J57744o49386
16600C605119j62563K25056l24045J92105Q6500l06485j24602n9084j94090M7308
16590B985219K98390l63855K18619q3385k10465N4834q630n27951K02420K77281
16580B842477n84062j4515J3856M1942L35413j14601k02331o7568Q0748k12810
$$ y = [11173856, 10740051, 10580909, 10030046, 9879302, 9833464, 9235984, 8995710, 9035585, 8716591, 8494463, 7934059, 8170153, 8068136, 7655236, 7657593, 7244973, 7460229, 6674679, 6779412, 6598333, 6773681, 6462233, 5984218, 6117034, 5925928, 5819572, 5764799, 5670708, 5520289, 5293435, 5426943, 5061211, 4990906, 4921403, 4778412, 4851259, 4513779, 4346957, 4343648, 4297166, 4514212, 4158280, 3888577, 4045981, 4205875, 3838125, 4096761, 4254505, 3605119, 3442556, 3667612, 3343567, 3535672, 3622172, 3315687, 3191085, 3132001, 2937911, 2985219, 3283609, 2919754, 3138373, 3054988, 2844523, 2899357, 2890727, 2362776, 2565196, 2842477, 2258415, 2243900, 2257756, 2299698, 2635111, 2520510, 2318179, 2250611, 2331359, 2118549]
16570B118549P067J72760J05217j93470M6492J61787j97826j07718K363l37291
16560A777930P5961K42657j61023J35472j72807N6517j07784l68252O21726m83701
16550A616696k4353J40137k872K33099l36617K6615Q1550k21099K9496n1962n5296
16539A435394L31210M7070l89837J90680K01978m60315j19402j8199j80467O73203
16529A711315l13578L597M1350k92250M2754K27421n33903J49797J57342J8852
16519A212697m54882J58947J16449L15260l16913j66964K51027K12273k89257
16510A038637k7080K02397k56241K28983k83912O06598m70108m42066M45095j91012
16500H51291K63908k31301q159L66580k69419Q7520p660j80767J65549j75983
$$ y = [2118549, 2125616, 2298376, 2403593, 2210123, 2256615, 2418402, 2220576, 2112858, 2115221, 1777930, 1853891, 2096548, 1935525, 2070997, 1898190, 1954707, 1846923, 1478671, 2100397, 1616696, 1592343, 1732480, 1729608, 1962707, 1626090, 1652705, 1734255, 1513156, 1542652, 1490690, 1435394, 1766604, 1813674, 1423837, 1614517, 1816495, 1356180, 1236778, 1218579, 1038112, 1711315, 1397737, 1401334, 1442684, 1150434, 1193188, 1420609, 886706, 1036503, 1193845, 1212697, 757815, 916762, 1033211, 1348471, 1031558, 864594, 1115621, 1327894, 1038637, 1011557, 1213954, 957713, 1186696, 902784, 1509382, 1039274, 597208, 1042303, 851291, 1115199, 883898, 875739, 1242319, 972900, 1060420, 1052760, 871993, 1037542, 861559]
16490H61559k68862J26681M46918k13727k84570L17051j10779j94828J75327J03604
16480I58374j05036k29178J19014j20982J56636L06613m55596J65917l3980q2112
16470F79670L6036J36537j80049L7750n8978j71496N6070J66388K2507j00102
16460F24333J54645j65711k00591J37490l8261J70437k78443J10372P8472k72991
16450C19752M32708l04379l5213J56672J0724L5776l9454L63460D37909K5691
16440D63600j1385L54900l47969K18167k96252L83307B49169M35900q7006j32474
16430D65589L83J45332j75089M4909l8067J33862J94223l62095j7709J5093L73577
16419G80008l11127n6500K26Q4764o1254J08968B43567L5247k4867o7109m85G2472
$$ y = [861559, 592697, 719378, 1166296, 952569, 667999, 985050, 874271, 679443, 854770, 958374, 853338, 624160, 743174, 622192, 778828, 1085441, 629845, 795762, 761782, 679670, 715706, 852243, 672194, 709944, 650966, 479470, 535540, 701928, 724435, 624333, 778978, 613267, 412676, 550166, 511905, 682342, 403899, 514271, 592743, 319752, 752460, 448081, 412868, 569540, 580264, 616040, 576586, 940046, 437909, 463600, 452215, 807115, 459146, 677313, 381061, 764368, 249169, 685069, 598063, 465589, 465972, 611304, 436215, 481124, 443057, 576919, 771142, 409047, 391338, 406431, 780008, 468881, 412381, 412607, 497371, 436117, 545085, 243567, 278814, 253947, 186838, 186353, 72472]
16406C53948N7039K91494B70092J12067j04306A30170L26693q025f6689D24862
16395C88354j44925J22404J29005A35975K82548K05842l02922J1114j22181k9208
16385A81168r18J59105L5148A67705n4553K47808N7J92953n1801R6992o7668A73146
16372C81800m1124C2155L879K73839l7584k9638f783B14011J70943o744J0010
16361C88220F6254O6715N7390B5658L91317A23445K74827Q6738k35784K94747
16351E43973B57854N3076q6600l6840q479N9179J43652A41206K26604P3775A19436
16339A67338Q6546r902J56713b30907D90063O5848C9537K66652F8643K61664O8869
16328C99176j08566A12772b8972A80750K77085k4015a0013B65984A18386J01013
$$ y = [353948, 410987, 702481, 270092, 382159, 277853, 130170, 456863, 448838, -66689, 424862, 388354, 243429, 365833, 494838, 135975, 418523, 624365, 321443, 332557, 210376, 181168, 180250, 339355, 374503, 167705, 113152, 360960, 361017, 553970, 502169, 599161, 531493, 173146, 381800, 340676, 32155, 36034, 309873, 272289, 242651, -6783, 214011, 384954, 378210, 388220, 66254, 132969, 190359, 25658, 416975, 123445, 398272, 485010, 249226, 543973, 257854, 310930, 224330, 187490, 179011, 238190, 381842, 141206, 367810, 441585, 119436, 167338, 253884, 243982, 400695, -230907, 490063, 555911, 39537, 306189, 68643, 330307, 399176, 290610, 112772, -28972, 180750, 457835, 433820, -10013, 265984, 118386, 219399]
16318B19399K61860b0628B03327r0908J47297e2283B3067J57798J12734J27373
16308D20972j91830b467C28779p4983A2429K34172l9089a40569B45015q402a20125
16296C92972a93911C48659j71890l8296n7512K52883p2806E3802J29605A1373
16285b4309C81387j49762G5959R5055q4791A3427J39616E7570J98714J1395K77698
16274E45377a40722l3826A50624L75173A93477r310H6457J97917b73412C30532
16263a7394B45935n2547q49p6846n3393K73366a34958E30601a52345F0423J6124
16252G6547b9681p7691A44855d573B36315e6238C47422q3011a43035B01230r5569
16241A05661J09670j01817q618l7228P3137J12595A7687b52723A61279n9423i2541
$$ y = [219399, 481259, -20628, 203327, 112419, 259716, -52283, 23067, 180865, 293599, 420972, 229142, -2467, 328779, 253796, 12429, 246601, 207512, -140569, 245015, 236613, -120125, 392972, -193911, 348659, 176769, 138473, 80961, 333844, 261038, 53802, 183407, 11373, -24309, 381387, 231625, 75959, 171014, 86223, 13427, 153043, 57570, 256284, 267679, 545377, -140722, -174548, 150624, 525797, 193477, 184167, 86457, 284374, -273412, 330532, -17394, 245935, 193388, 192539, 115693, 62300, 335666, -134958, 530601, -152345, 60423, 76547, -29681, -107372, 144855, -4573, 236315, -56238, 347422, 264411, -143035, 201230, 105661, 215331, 113514, 104896, 67668, 140805, 253400, 17687, -252723, 161279, 101856, -92541]
16229f9246L0997C35202G5527J4801K00640a34075C21778C4488L60512h8169r4126
16218a82295H3926k2967J5031a4203A96721q0025J73744g4294H7566K60276A33363
16206a5082q3119A09503b26540D07505A52523P2366o0427p0219J45071A04477
16195b02191L4393A5254K6381J36610n2757L46144k01838G8399l7247i8412A43989
16183A38939P401D132i065A94104C0092h8670k1488l9734l68460G8520b8546j44238
16171a72784B439K75776a5873j26521B48717J00592a16165k066B17208e42845
16160C3357d184G1924J24977a10957B48888A7915d7933A51903c31305I5264g6181
16148a69836A94623f1223D0644R0713h752B445K86355e3147j1095A46200d7710
$$ y = [-69246, -38249, 335202, 75527, 90328, 290968, -134075, 321778, 34488, 395000, -88169, -182295, 83926, 60959, 75990, -14203, 196721, 116696, 290440, -74294, 87566, 347842, 133363, -15082, -98201, 109503, -226540, 407505, 152523, 224889, 164462, 94243, 239314, 104477, -202191, -167798, 15254, 41635, 178245, 125488, 471632, 269794, 78399, 41152, -98412, 143989, 138939, 146340, 4132, -9065, 194104, 30092, -88670, -110158, -149892, -518352, 78520, -28546, -172784, 2439, 278215, -15873, -142394, 248717, 349309, -116165, -118231, 217208, -542845, 33357, -4184, 71924, 196901, -110957, 248888, 17915, -47933, 151903, -331305, 95264, -76181, -169836, 194623, -61223, 40644, 131357, -8752, 2445, 288800, -53147, -64242, 146200, -47710]
16136F6471b86104B98285b06821J02032J3671J5492j65155a13628N6350m770j66819
16125b28867J07538j01871J03581k0850C1033J36142n5057R7511C4296a8458K649
16114a5809l0006A16517Q0511c88788B89928A08445D1860J50553d462l8675j6339
16103e9476B48883k5262n026A2119M7295J62672K0884k6643r6225J0914e6852
16091f1223K6730E0158b10580B18661i3313J6362j40320i2093k3786G6763h961
16079g721j01408g659F1137k8182a66412h2175D3803a86724j63602h5625L468
16068h2157e6C87247B4873d3359j43987E1036J53443h8108H0395b28439H060K52200
16056B60260H9882M2264b7878O122p2241A25030d6921H7422O0815b110k35281
$$ y = [66471, -286104, 298285, -206821, -104789, -91118, -75626, -240781, -113628, -57278, -62048, -228867, -121329, -223200, -119619, -140469, 31033, 167175, 112118, 209629, 34296, -18458, -15809, -45815, 116517, 197028, -388788, 289928, 108445, 41860, 192413, -4462, -43137, -59476, 248883, 223621, 218595, 12119, 59414, 222086, 242970, 216327, 120102, 131016, -56852, -61223, -34493, 50158, -210580, 218661, -93313, -76951, -217271, -92093, -115879, 76763, -8961, -7721, -109129, -7659, 61137, 32955, -166412, -82175, 43803, -186724, -350326, -85625, -82157, -56, 387247, 24873, -43359, -187346, 51036, 204479, -88108, 80395, -228439, 8060, 260260, 89882, 132146, -27878, -21756, -93997, 125030, -46921, 87422, 148237, -2110, -237391]
16045b37391P4586b8694B96705a40794D0345J07180a60740f6691p7219I6259b16088
16033a14271K3661G810b16362G4058c644p4343A18078c20802a48013B49641h9421
16021b34252C22887E3910m201b36284C0625f5719B59051e1859r6936g0461C5032
16009A3242Q1344b11229j06003J17857A00481b35452a08159A48555a19064D24078
15998C8098J05989D2620b98220g2876p0580E2783f1646A76536e8911j21599B13380
15986D377R7526h3668B46321j09304K04729q8109B3671K57552p7367F0540a27360
15974c65929G5794c8909D2164A5790a09628l64348i4462A62180G8064a91745c3658
15962a5913j52160A71538m3190R7898D6149M6682J07087c01962B32741a78405
$$ y = [-237391, -162805, -28694, 296705, -140794, 40345, 147525, -160740, -66691, -143910, 96259, -216088, -114271, -90610, 7810, -216362, 74058, -3644, -77987, 118078, -320802, -148013, 249641, -89421, -234252, 322887, 53910, 49709, -236284, 30625, -65719, 259051, -51859, -148795, -70461, 35032, 13242, 94586, -211229, -317232, -199375, 100481, -235452, -108159, 148555, -119064, 424078, 38098, 144087, 42620, -298220, -72876, -143456, 52783, -61646, 176536, -58911, -180510, 213380, 4377, 101903, -83668, 246321, 137017, 341746, 253637, 23671, 281223, 203856, 60540, -127360, -365929, 75794, -38909, 42164, 15790, -109628, -473976, -94462, 162180, 78064, -191745, -33658, -15913, -168073, 171538, 128348, 226246, 46149, 92831, 199918, -301962, 232741, -178405]
15951A37141E4316Q1403m2328b28017a02377C3409f8702j38678c8085k21780Q4182
15940a75683c6834k50235g0952A88828G7070e1740j5446j04057k3726H1218a66264
15928A65327C378f8168k8479D54784E5882I658P6618A022K72973d23857a30597
15916B7759g5541j4257k56541a64458e7884b4711j38650K6865k13917D3920a13715
15904b16374P1307F4953o539L1293d0020A04536b3545I6067a22433e7449j15141
15893a72590A91915b94160A68175h2689l3069A0716a96539N6186C7827e7552j50170
15882b07722F6886a21453A03612L732a24477A84636a40637k24393f5032A80040
15871G5743c8428j9441B99935d34493H9261Q7182B4204h0926A28747b65076F072
$$ y = [137141, 54316, 135719, 93391, -228017, -102377, 33409, -68702, -207380, -38085, -259865, -175683, -36834, -287069, -70952, 188828, 77070, -51740, -67186, -171243, -194969, 81218, -166264, 165327, 3378, -68168, -96647, 454784, 55882, 9658, 86276, 1022, 273995, -423857, -130597, 27759, -75541, -89798, -346339, -164458, -57884, -24711, -163361, -136496, -350413, 43920, -113715, -216374, -145067, 64953, 58414, 89707, -40020, 104536, -23545, 96067, -122433, -57449, -172590, 191915, -294160, 168175, -82689, -115758, 10716, -196539, -140353, 37827, -57552, -207722, 66886, -121453, 103612, 107344, -124477, 184636, -140637, -365030, -65032, 180040, 75743, -38428, -57869, 299935, -434493, 89261, 176443, 24204, -80926, 128747, -265076, 6072]
15859G6250K21836a14826k20953A85155B4838c6068j11356A7457J25106f2501
15848a08408j35429a08524p3170p9626A08514d3184l59856c8353I8870c1224C2291
15836a78683q1814A00599j4878a4213A49649A2827P8291e9219A20470d70604J31948
15825c38656F9135c6811A36704b9780p1513c1312j89702f4952E6627K65638A47855
15813c6792k08717E0083M5691b50846f5206D6326e4215k205K649G2580f1760I5643
15800a21853C8204e5401C015a90591j06488A51308k4375k3430B4908b28982K8745
15789b00237L8517A80170g5986C58247a6393m0144j41423Q8173C16498b89287
15778b61147f625A2593Q9795c33656D3393b96101a7273j11475m2704j96228B35819
$$ y = [76250, 298086, -114826, -335779, 185155, 24838, -36068, -147424, 17457, 142563, -62501, -108408, -243837, -108524, -181694, -261320, 108514, -43184, -403040, -38353, 98870, -31224, 32291, -178683, -260497, 100599, 85721, -14213, 149649, 12827, 91118, -59219, 120470, -470604, -338656, 69135, -36811, 136704, -29780, -101293, -31312, -221014, -64952, 56627, 322265, 147855, -36792, -245509, 50083, 95774, -250846, -65206, 46326, -54215, -56420, -53771, 72580, -61760, 95643, -121853, 38204, -55401, 3015, -190591, -297079, 151308, 126933, 103503, 24908, -228982, -200237, -161720, 180170, -75986, 358247, -16393, -56537, -197960, -109787, 316498, -289287, -261147, -6625, 12593, 102388, -333656, 43393, -296101, -17273, -128748, -171452, -367680, 235819]
15766a12482A86630H9144a78669g0453B64800A11116J892E4492O9007f8493G9982
15754B34154E761K15082G0474g4359A4563a3079G9550g5571p6240A53852d451
15742A396b06847I808a90238M3335k80041Q4636H3436a98727g2767r6429P0714
15731i8482H9653a68886O9484C919a55058A40317a97130J4811B78319m1139a560
15719e6019D896b94201Q1487p3378j307F5754a12113J8526B28690b7682B40713
15707c33172A23664L30618A83821m8881a33865c2664B17195e3886A41945D355
15696b24799I4207R8882o47J24601b4236A41376J17517E1628a89093j45254J41979
15685a92368f9585B7169a0842l9258b1073F4580i4571d2150H1234b26172A96736
$$ y = [-112482, 186630, 89144, -178669, -70453, 264800, 111116, 113008, 54492, 123499, -68493, 79982, 234154, 5761, 220843, 70474, -74359, 14563, -13079, 79550, -75571, -151811, 153852, -4451, 1396, -206847, 9808, -190238, -146903, -426944, -342308, 83436, -198727, -72767, -169196, -98482, 89653, -168886, -99402, 3919, -155058, 140317, -197130, -182319, 278319, 237180, -1560, -56019, 4896, -294201, -212714, -286092, -287399, 65754, -112113, -93587, 228690, -27682, 240713, -333172, 123664, 454282, 183821, 134940, -133865, -32664, 217195, -53886, 141945, 4355, -224799, 94207, 193089, 192442, 317043, -24236, 141376, 258893, 51628, -189093, -334347, -192368, -69585, 27169, -10842, -50100, -21073, 64580, -94571, -42150, 81234, -226172, 196736]
15673d3858d061l35580d3869C4941L47512I3969M1403i0348j8678F6426a31926
15661f8816b086A32440E7924J83507B4157D641b01768A15450b23958M3202A32173
15649D4603k0445a27988M7585B50312E6553f2986p0561B12198m2623e9057l2858
15638i1915j980b693r5983d8727q8244p4695L1317E0015c9932D4146K66323I1089
15625B3037J25009D2381b27474B08017a05303k43585B22308o9828a12209B8803
15614H307g3286j1672l7185a4755k08216n3495H0551l088d2139j13321B10764
15602a08206A77418b40078G1292j0792M5844k1722k1063a47016l7325f5906E9923
15590a98223B6741A355g3939B13708a25420A36149K85995a9804p7523a524j14725
$$ y = [-43858, -4061, -339641, -43869, 34941, 382453, 93969, 135372, -90348, -109026, 66426, -131926, -68816, -2086, 132440, 57924, 241431, 24157, 4641, -201768, 115450, -223958, -180756, 132173, 44603, 24158, -127988, -80403, 250312, 56553, -62986, -133547, 212198, 169575, -59057, -91915, -93895, -2693, -98676, -48727, -136971, -211666, -180349, 50015, -39932, 44146, 310469, 91089, 23037, 148046, 42381, -227474, 208017, -105303, -348888, 222308, 152480, -112209, 28803, 8307, -73286, -84958, -122143, -14755, -222971, -276466, 80551, 77463, -42139, -155460, 210764, -108206, 177418, -240078, 71292, 60500, 106344, 84622, 63559, -147016, -184341, -65906, 59923, -198223, 26741, 1355, -73939, 213708, -125420, 136149, 422144, -19804, -97327, -1524, -116249]
15579a16249M8564A93765c7358B8255J75899M7598a32533A64501H1859J243a6076
15567a84271e4561F0452a23903Q28A18686J70715D8344L0695M4062J09776b98340
15555I523K47004b41187E8240a76244P4063j24891F2076J29279a02814C29007
15544i4116H9501d1119j60468K5304A37821b11928q1087F9872e6499A39359d28430
15532c02131i6080k16199H2585l3323c71066a16535N4112n494C69144a02034J8968
15521h3066c5901C4075L05521a97830g541k19180B2448f8513F8815N6902K701
15510A28418o1036J9622a9223A3456o259J59601p6060K97362a079A36594A2760
15498A12063J1601c25255a07709j9109j13710A88426h0031f549j02095C65030
$$ y = [-116249, -67685, 193765, -37358, 28255, 204154, 251752, -132533, 164501, 81859, 83102, -16076, -184271, -54561, 60452, -123903, -123075, 118686, 289401, 48344, 79039, 123101, 232877, -298340, 9523, 256527, -241187, 58240, -176244, -102181, -227072, 62076, 191355, -102814, 329007, -94116, 89501, -41119, -201587, -176283, 137821, -211928, -293015, 69872, -56499, 139359, -428430, -302131, -96080, -312279, 82585, 49262, -371066, -116535, -62423, -67917, 369144, -102034, -83066, -35901, 34075, 339596, -197830, -7541, -226721, 22448, -68513, 68815, 125717, 128418, 67382, 87004, -19223, 13456, 7197, 166798, 90738, 388100, -1079, 136594, 12760, 112063, 123664, -325255, -107709, -126818, -240528, 188426, -80031, -6549, -108644, 365030]
15487A57088a56163j6588a8408H4345J5530c8004k75374A72446B8185L0653b58702
15475A84030K03926j69605a26613a6440l1804k32643A28184J76255a47983j2181
15465a60164b2300B19375a22472C9679B914h8153k9532e7458E4444o389K85325
15454C33380A18159c45932A9928b5427q0394D4353A5691J59621D997J32904a71063
15442E6038a78480B51217i9139j686F6655J74045i1001B39674b70431F0473A4769
15430a27199M7598D1973b9692C20150E4387b28313A0093J48283e1252r3887M5498
15419i9641n5126c2068I7505m7139J59386g7946B57755B7720h4236j85851n545
15408b75632a32478k14219h2627H278J79807c6432p3199A54660b3465C2112a87782
$$ y = [157088, -156163, -172751, -18408, 84345, 99875, -38004, -313378, 172446, 28185, 58838, -258702, 184030, 387956, 218351, -126613, -16440, -48244, -280887, 128184, 304439, -147983, -160164, -22300, 219375, -122472, 39679, 2914, -88153, -117685, -57458, 54444, 48055, 333380, 118159, -345932, 19928, -25427, -105821, 44353, 15691, 175312, 4997, 137901, -171063, 56038, -178480, 251217, -99139, -100825, 66655, 240700, -91001, 239674, -270431, 60473, 14769, -127199, -79601, 41973, -29692, 320150, 54387, -228313, 10093, 158376, -51252, -145139, -99641, -154767, -32068, 97505, 50366, 209752, -77946, 257755, 27720, -84236, -270087, -275632, -132478, -346697, -82627, 8278, 188085, -36432, -109631, 154660, -23465, 32112, -187782]
15396a68160A7103b3347j84382h8218E9387J56247c08757H4817a31557K5086I121
15384A54013b20532A15691k8682J56391i785k48543a26542B35396a50020I7597
15373A58046a5415A10789b12139P5228A24655a96553H8467c7914J0273j22276
15363a49917f5162p1497E0114J92252e1608A8605K992K50144G3913a07329l4184
15352a41513O1520B22263b96489f2551A14340E2686B0275e2427h616A28529M5589
15341A74118G4042j9381K71908k4310a41880r3968H7504d00539a66431d5729I592
15329b08868j14624C26331a29501j06264B73536a38308B12129l9431a20268B31292
15318G1776f3256o7358B0302h6610C0836m246a61400r1197H0309f8059C90858
$$ y = [-168160, 17103, -23347, -207729, -88218, 59387, 215634, -308757, 84817, -131557, -106471, 9121, 154013, -220532, 115691, 87009, 243400, -9785, -258328, -126542, 235396, -150020, 97597, 158046, -15415, 110789, -212139, -136911, 124655, -196553, 88467, -37914, -27641, -149917, -65162, -136659, 50114, 242366, -51608, 18605, 21597, 271741, 73913, -107329, -141513, -79993, 222263, -296489, -62551, 114340, 52686, 20275, -52427, -8616, 128529, 174118, 74042, 54661, 326569, 302259, -141880, -235848, 87504, -400539, -166431, -45729, 9592, -208868, -323492, 326331, -129501, -235765, 273536, -138308, 212129, 172698, -120268, 231292, 71776, -63256, -130614, 20302, -86610, 30836, 26590, -161400, -252597, 80309, -68059, 390858]
15306c07693f0832A74717a48561B94693j08986m9451E7286P9995B9954J15112
15296A45066K95611g6879B43240D8646a0199B35519B6698J21684K6394J53399
15286C28175K7754a44300L4755J2965j8413m409o9662B25283n9595J830a68894
15274d1158j26657B50321A9758o124K01796i2961E4916e3407A73778a30236B6922
15262h1877R404L5120F5251J56447N0738H5111j8831e6556A45151E8157J03923
15251A62080B2983R7675K14824N87181P02461l38454j43892O27201C06293o7751
15241B38542A3194N436Q1963K08968r1722N2988r0555A0635b8864B7350N521Q8942
15229A21813a3909I8485a00128I956J40779d1196k13160l2805C11595j25398r1778
$$ y = [-307693, -60832, 174717, -148561, 294693, 185707, 136256, 57286, 137281, 29954, 145066, 440677, -76879, 243240, 48646, -10199, 235519, 26698, 148382, 174776, 328175, 355929, -144300, -109545, -96580, -114993, -119402, -189064, 225283, 165688, 167518, -168894, -41158, -167815, 250321, 19758, 13634, 215430, -92961, 54916, -53407, 173778, -130236, 26922, -81877, -72473, -37353, 65251, 221698, 272436, 85111, 66280, -56556, 145151, 58157, 162080, 22983, 120658, 335482, 922663, 1625124, 1286670, 1142778, 1769979, 306293, 238542, 13194, 18630, 100593, 309561, 217839, 270827, 180272, 10635, -28864, 27350, 32871, 121813, -13909, 98485, -100128, 9956, 150735, -41196, -254356, -287161, 311595, 186197, 94419]
15218I4419r476B0858c17041I7885K48944D8142J21321Q5826r6269P6373b6037
15206B02296J71904j59750L27977c5274j04747D9656N1235m3955b01482B85459
15195A71674k5885g7455J5935a1431l9703A34258F0605a10845A17247f6594A10447
15183A84666J86714f3746B66912J57346a75232j01166B0618M60880A35100Q3380
15173B18480Q5605j10008E7963L3390a20231A82263D601M8278J80072A05436M6583
15162A52019M0757i7784B82364B3378J66349f781k4791F1920a58883N60A02875
15150B64177M5884F3366P794M010N0593K11117j59206J36901A05788k5132B5611
15138A23084Q0773g7374A71759D8224K68987o2324C9325J87659H1907e06597e609
$$ y = [94419, 84943, 20858, -317041, 97885, 346829, 48142, 169463, 255289, 159020, 235393, -26037, 202296, 374200, 214450, 542427, -35274, -140021, 49656, 100891, 56936, -201482, 285459, 171674, 145789, -77455, -61520, -11431, -51134, 134258, 60605, -110845, 117247, -66594, 110447, 184666, 371380, -63746, 266912, 424258, -175232, -276398, 20618, 481498, 135100, 218480, 304085, 194077, 57963, 91353, -120231, 182263, 4601, 52879, 232951, 105436, 152019, 192776, -97784, 282364, 23378, 189727, -6781, -31572, 61920, -158883, -158323, 102875, 264177, 310061, 63366, 71160, 75170, 125763, 336880, 177674, 314575, 105788, 80656, 25611, 123084, 203857, -77374, 171759, 48224, 317211, 254887, 39325, 226984, 81907, -506597, -5609]
15126F7505h6149b7469j44425A2235K90984j19886r0381J99595j43958a00051
15115d54327A61963K62471j15178j10051a13311A86484b1693B38307b81378c2857
15104c1752k0615J5892m2708C06612H6457a08613B43911B0019K59241f1956C02715
15092A92657a44218B37590b26932B29630J32759I4761K42192D135K36304D4416
15081a19860B64522P1420A22596K07281A29989J62217p0836G2582P6447K0395
15071A69424H2339J28323a1418j89912A51693J6714O8574J02007j30189h6850
15060A09622m8623j0058d639A92856G6244K85156J640r9607b1673r123A54702
15048B3618M1827b9972A1502R3369L71515k15180D1680M0539L17410j88187l9080
$$ y = [67505, -86149, -27469, -171894, 12235, 303219, 183333, 92952, 292547, 148589, -100051, -454327, 161963, 424434, 309256, 199205, -113311, 186484, -21693, 238307, -281378, -32857, -31752, -52367, -36475, -79183, 306612, 86457, -108613, 243911, 20019, 279260, -61956, 302715, 192657, -144218, 237590, -226932, 229630, 362389, 94761, 336953, 4135, 240439, 44416, -119860, 264522, 335942, 122596, 329877, 129989, 292206, 221370, 72582, 149029, 169424, 82339, 210662, -11418, -201330, 151693, 168407, 236981, 338988, 208799, -86850, 109622, 60999, 50941, -4639, 192856, 76244, 361400, 363040, 263433, -21673, -30796, 154702, 23618, 65445, -29972, 11502, 104871, 476386, 261206, 41680, 82219, 399629, 211442, 172362]
15037A72362O4720K0741P3933j02187j05581J10084k136O3543k3560A26439K20431
15026C46870J00915A1825J06337J66060A26681E2339L4844O8615R1512O3736h7543
15014C72711j23659K09888o0137A68499a00297B10362n098Q3328l0894A06591
15003B94824b7474E09249j91868J86793q8692q9137C8142J57570J55075A61340
14992A39876J85464m6881A22612O3707a8489B47493G0322K08468K0977N3051j57469
14981A95349M855b0334A43530N2915r0305D8695M04995I8119P4877K0034a97640
14969B52600A0264e9709B35208M4424I7869L8985O2891J9193E6093j4434Q7758
14958A29417L12639J93621B48622A00736P5424K5816n9492c2575c916B95664Q9150
$$ y = [172362, 237082, 257823, 331756, 229569, 123988, 234072, 231936, 295479, 271919, 126439, 346870, 447785, 11825, 118162, 284222, 126681, 52339, 87183, 155798, 247310, 311046, -87543, 372711, 249052, 458940, 398803, 168499, -100297, 210362, 205264, 288592, 257698, 106591, 294824, -27474, 509249, 317381, 504174, 415482, 326345, 38142, 195712, 350787, 161340, 139876, 325340, 278459, 122612, 186319, -18489, 247493, 70322, 278790, 299767, 352818, 195349, 200204, -20334, 143530, 196445, 106140, 48695, 453690, 98119, 172996, 193030, -197640, 252600, 10264, -59709, 235208, 279632, 97869, 136854, 199745, 218938, 56093, 41659, 129417, 442056, 635677, 248622, 100736, 176160, 201976, 142484, -32575, -3916, 295664, 384814]
14947C84814q2413K29787a29197D7398L23452j74367m169l2394J59933n1160J45759
14936D14452E1535J88921H7761K79930A10712q935L11798l6807N8986k02646m1247
14925A91861F9009a5765A07649P0144K13083D775J98595Q6858J9193R8491p442
14914D00470C3466M61400k28165F4959A7803K18293R1628A01538c60399B56411
14903H1143J47581K94938c7154E51402B73578K63689k01167J6341j44778K18021
14893D25684k07532K5038L63484i1626H4013O25948l12964R374J16097B55209
14882D58679j87679j18420O7842n2460N556K15442j47911J44514N9598p8476J75980
14871E42665r2449B09364J16583H1433J46159J22854k2232k263A19193J8257O9418
$$ y = [384814, 302401, 532188, -129197, 47398, 370850, 196483, 192314, 159920, 319853, 268693, 414452, 51535, 240456, 87761, 367691, 110712, 101777, 413575, 376768, 435754, 233108, 191861, 69009, -15765, 107649, 177793, 390876, 4775, 203370, 290228, 309421, 407912, 400470, 33466, 494866, 266701, 64959, 17803, 236096, 327724, 101538, -360399, 256411, 81143, 228724, 523662, -37154, 551402, 273578, 537267, 336100, 352441, 207663, 425684, 218152, 243190, 606674, -91626, 84013, 709961, 396997, 406371, 522468, 255209, 458679, 271000, 152580, 220422, 167962, 173518, 388960, 241049, 385563, 445161, 366685, 542665, 450216, 209364, 325947, 81433, 227592, 350446, 328214, 325951, 119193, 137450, 206868]
14860B06868L56635B62243K74114A31574K21747K70050j74219n8196K8496n8073
14850C61379K45200A65880J01971J45152o4701J83353A54831L17821L15730I4882
14839D85284I7633K82693O4220N9750N4973k2784j55390D0442L72816L14304B56952
14827D06702o9529L22974k67755o2299r3331K10456b3867F11013k52786R6783
14817D55010J64317r5887n7640K2555m5678O1527j20483J42582j1106j17447K234
14806C99984L36114k17997l3756A61881L53823o4385j54974L38403l4836K01492
14796H01404j21505j835k17310L93214k16356k49889M06054k83497r02K1757j55430
14785C75705L39701k06335m5911J34006j42041K46760l4238L157p853M7326J74073
$$ y = [206868, 563503, 262243, 536357, 131574, 353321, 623371, 449152, 390956, 419452, 361379, 606579, 165880, 267851, 413003, 348302, 531655, 154831, 472652, 788382, 94882, 485284, 97633, 380326, 444546, 504296, 559269, 536485, 381095, 40442, 413258, 727562, 256952, 406702, 337173, 660147, 392392, 330093, 236762, 447218, -23867, 611013, 358227, 455010, 619327, 523440, 465800, 488355, 442677, 504204, 383721, 526303, 515197, 397750, 399984, 736098, 518101, 484345, 161881, 515704, 451319, 296345, 634748, 599912, 801404, 679899, 678064, 460754, 853968, 637612, 387723, 793777, 510280, 509378, 531135, 375705, 715406, 509071, 463160, 597166, 455125, 701885, 667647, 670804, 662951, 710277, 884350]
14774H84350l96101K52811A94861K17051J58191K52955k46276q7575J86068r8088
14764E77187j32848Q4062M85920k26344k76339J9861L3404n1010P8401l9139M85316
14753A038471m05540l09440M25885j40971l02481J76261K53033j61410l4312j7153
14743E22343L34254B91367L43238p9400M99106o4847l52550j3483j77179J66947
14733F13199j17283n7683L24800r0513J73254C28759L32780J19372J48484j25385
14723H04010k61703J652L88182j62257K34095l36050J82472j94438l10895N08429
14713H53497k61800K19002m5489k36943L07205l07245J06393L23443C46797N92241
14703I39038O428p8723m069k65319O3190Q4321J03667j48473Q8017L51409m24106
$$ y = [884350, 488249, 741060, 194861, 411912, 570103, 823058, 576782, 489207, 675275, 577187, 444339, 528401, 1014321, 787977, 511638, 531499, 564903, 513893, 592294, 553155, 1038471, 632931, 323491, 749376, 608405, 305924, 482185, 735218, 573808, 539496, 522343, 856597, 291367, 634605, 555205, 1054311, 989464, 636914, 623431, 446252, 613199, 495916, 438233, 763033, 672520, 845774, 328759, 661539, 780911, 929395, 804010, 542307, 543959, 932141, 769884, 1003979, 667929, 850401, 655963, 345068, 853497, 591697, 810699, 765210, 528267, 835472, 528227, 634620, 958063, 346797, 939038, 945466, 866743, 862674, 597355, 660545, 744866, 848533, 700060, 788077, 1139486, 715380]
14692G15380K02183k46854O4866r0488R0746O6881o0004N7277k1052j32170L05568
14681I52333p2864j53272J51911j7387J32164k21774k2180K80096j90007r212
14671H29808l85378L62253J94418k26109R8506O00526l53288J62547m92240L46530
14661A137573k4457k29435K55705E51911M26981K33949m56549K04738P6050P9328
14651A116408K20922k18992P5895N8890l01493J25363l17423O88335l29327j53523
14641I65055J52809J32141j62369O324J73460L7905n22997L66650k09706L98878
14631A338150N7657j61010J23546j40144r560j11208K62409N0693j84193j67902
14621A058438Q0424K22250O007l88037K71200K86802j54705l10372K61799j01800
$$ y = [715380, 917563, 670709, 735575, 645087, 735833, 802714, 742710, 799987, 778935, 646765, 952333, 879469, 726197, 878108, 860721, 992885, 771111, 748931, 1029027, 839020, 829808, 444430, 806683, 1001101, 774992, 873498, 1474024, 1120736, 1283283, 791043, 1137573, 1113116, 883681, 1139386, 551911, 978892, 1212841, 756292, 961030, 1037080, 1116408, 1337330, 1118338, 1194233, 1253123, 951630, 1076993, 759570, 1447905, 1118578, 965055, 1117864, 1250005, 1087636, 1093960, 1267420, 1305325, 782328, 1148978, 939272, 1338150, 1395807, 1234797, 1358343, 1218199, 1208639, 1097431, 1359840, 1410533, 1226340, 1058438, 1138862, 1361112, 1367119, 979082, 1250282, 1537084, 1382379, 1072007, 1333806, 1232006]
14611A232006Q4687J79217M8071L9472j81609Q778L16276l12686Q3851j07342
14601A390721P8125L7071n3702K7160K35636q1551q6531K51209j73095N3511j32207
14590A546347M52225l42345l61776P73925m83955p1142N07036j99107Q1422l4877
14580A867753J28809l94754J21144q9306M045N05298k71956K1397j29411L00655
14570B063674j79203K69370K41750m11759J76041K41594l5695j65651J96191j03888
14560B292424J34115L85008k05983M04404j93294k01996N91535K44311J16924
14551C567448R18609L24781J937679L498886P858615K0419603J5679015B0128153
14542H905280C692437j430590m70482j932r4229K85768K99704k67993r7767M5043
$$ y = [1232006, 1316693, 1495910, 1543981, 1583453, 1401844, 1410622, 1726898, 1414212, 1498063, 1390721, 1468846, 1505917, 1452215, 1479375, 1715011, 1633460, 1546929, 1798138, 1625043, 1678554, 1546347, 1998572, 1656227, 1294451, 2068376, 1584421, 1513279, 2020315, 1821208, 1902630, 1867753, 1996562, 1601808, 1722952, 1633646, 1637691, 2142989, 1871033, 1892430, 1763019, 2063674, 1884471, 2153841, 2395591, 1983832, 2159873, 2401467, 2365772, 2200121, 2396312, 2292424, 2426539, 2811547, 2605564, 3009968, 2816674, 2614678, 3206213, 3450524, 3567448, 4486057, 4810838, 6748517, 10247403, 18106018, 38525621, 54204636, 20128153, 8905280, 3692437, 2261847, 1791365, 1789433, 1695204, 1980972, 2280676, 2012683, 1914916, 1959959]
14532A959959J904k0569j60236M24028m30298O7420J72127l45775K43997J6448
14522A929005O84511l70417p5170K40467J6610j88438M01254j59237L6710o3478
14512B451817j16725J74885L14223k20058p2353K4161j44209K76213o2894K68393
14502B893453j47773J00008J65443m73709N03755j64258j69250J31751J84031
14493C023451J13416Q2821k0376p2616R9306l6953J37142Q9504K4883l51881K97031
14482C385728j23242R9408L60760L73527k73463r0089M26771l09477K16141l21718
14472C744346J11488J47660j2925K92173l04192k13930M86103m33165M78938J9879
14462D316375p8432J51584K43862q6680k419K82982m05652L02347k66136J91681
$$ y = [1959959, 1961863, 1941294, 1781058, 2205086, 1774788, 1842208, 2014335, 1668560, 1912557, 1929005, 2613516, 2243099, 2167929, 2408396, 2425006, 2236568, 2637822, 2478585, 2515295, 2451817, 2335092, 2509977, 2824200, 2604142, 2531789, 2555950, 2411741, 2687954, 2625060, 2893453, 2745680, 2845688, 3011131, 2537422, 3041177, 2876919, 2707669, 2839420, 3023451, 3136867, 3219688, 3199312, 3126696, 3226002, 3189049, 3326191, 3415695, 3440578, 3088697, 3385728, 3262486, 3361894, 3722654, 4096181, 3822718, 3732629, 4159400, 3849923, 4066064, 3744346, 3855834, 4003494, 3990569, 4282742, 3978550, 3764620, 4250723, 3817558, 4296496, 4316375, 4237943, 4389527, 4633389, 4546709, 4544290, 4827272, 4421620, 4723967, 4457831, 4649512]
14452D649512L64985j50311J24478J93396k08885N1846K73001m0895m185J26591
14442E379533J19937k2590K32476q1454R0915l06981M03990L23170k45229K48912
14432F142679j63041K80481j00362p9448O02890k47715K87673l49490L59611j13344
14422F619934M93288K672J05486K07109q6825L19665K3105L14506k3704P1267
14412H046503J37738O6808M40956j58284J32402J87112J97123K77649q0440p4273
14402I173294L84048N0653j730J76634K95785J24745K04264j4193L77523K25191
14392A0996214P2898L30133J58217n0898O19043r3457L71596K3532M72672J44820
14382A3044770k51674N82391J65082M95589j25980L60287L77593M13615J11482
$$ y = [4649512, 5014497, 4864186, 4988664, 5182060, 4973175, 5025021, 5298022, 5257127, 5252942, 5379533, 5499470, 5476880, 5709356, 5627902, 5718817, 5411836, 5815826, 6138996, 5893767, 6142679, 5979638, 6260119, 6159757, 6080309, 6683199, 6435484, 6723157, 6373667, 6733278, 6619934, 7113222, 7115894, 7221380, 7428489, 7341664, 7661329, 7684434, 7998940, 7975236, 8046503, 8184241, 8251049, 8692005, 8533721, 8666123, 8853235, 9050358, 9328007, 9247567, 9173294, 9557342, 9607995, 9606265, 9782899, 10078684, 10203429, 10407693, 10393500, 10771023, 10996214, 11069112, 11399245, 11557462, 11506564, 12125607, 12032150, 12403746, 12427278, 12899950, 13044770, 12793096, 13375487, 13540569, 14036158, 13910178, 14270465, 14648058, 15061673, 15173155]
14373A5173155K86231J79017M30683L05098M57960J69235K81148L13669L88890
14364A7985086O71429O21751J18600M66117L53872N43884M7860M07566J104420
14355B2320585N10311L20198P88045N07822N59942L97461K83997Q40619J047303
14346B7576283N26782L16695J116085O27283R13731J032992O26118J090891R57467
14337C4784327P43913Q07179J458214J373215J119540J352767J406885P70786
14329D3816826J526818J625841J015851J820800J816262J579788J928003J652717
14321E6782906K072951K261860K085350K374300K498183K673939K719359K807801
14313G6276649K926093L291797L354972L732257L627085M495528L988803M447815
$$ y = [15173155, 15459386, 15638403, 16069086, 16374184, 16832144, 17001379, 17282527, 17596196, 17985086, 18656515, 19278266, 19396866, 19862983, 20216855, 20760739, 20808599, 21216165, 22320585, 22830896, 23151094, 23939139, 24446961, 25006903, 25404364, 25688361, 26528980, 27576283, 28103065, 28419760, 29535845, 30163128, 31076859, 32109851, 32735969, 33826860, 34784327, 35528240, 36335419, 37793633, 39166848, 40286388, 41639155, 43046040, 43816826, 45343644, 46969485, 47985336, 49806136, 51622398, 53202186, 55130189, 56782906, 58855857, 61117717, 63203067, 65577367, 68075550, 70749489, 73468848, 76276649, 79202742, 82494539, 85849511, 89581768, 93208853, 97704381, 101693184, 106140999]
14305A06140999M561173N425323N367669N778268O396222O650802O703083P593204
14297A54616743Q024569Q203205R173749R285143J0351931J0547572J1435620
14290B21638532J1699996J2701008J3104137J4027705J4477272J4762612J5785041
14283C18196303J6193837J5786831J6186394J5916552J5736919J4978418J4011233
14276D27006487J2726280J0963461Q896504M334328J337687p96804n72849j346321
14268D62548773k370448n221873q880011j1527357j3036571j4163682j5579581
14261C91769250j5910970j6430602j6413648j6326083j5981331j5565475j5343468
14254B79797673j3106325j3605669j3352466j2406127j1891781j1081170j0406947
$$ y = [106140999, 110702172, 116127495, 121495164, 127273432, 133669654, 140320456, 147023539, 154616743, 162641312, 170844517, 180018266, 189303409, 199655340, 210202912, 221638532, 233338528, 246039536, 259143673, 273171378, 287648650, 302411262, 318196303, 334390140, 350176971, 366363365, 382279917, 398016836, 412995254, 427006487, 439732767, 450696228, 459592732, 463927060, 465264747, 464467943, 463895094, 462548773, 460178325, 454956452, 446076441, 434549084, 421512513, 407348831, 391769250, 375858280, 359427678, 343014030, 326687947, 310706616, 295141141, 279797673, 266691348, 253085679, 239733213, 227327086, 215435305, 204354135, 193947188]
14247A93947188r900991r580569q296824p692079p892662p247486p137211o190752
14239A30008614o341200n063973n048667n277750m743911m476064m279065m215379
14231I0562605k890964l464423l805457l051987l296810k778271k857861k321909
14223F6094923k550107k284326j965203j831729k341036j903025j787533j893378
14215D9538586j325956j020666j317995j688221j429532j494080j121106r13481
14207C9227549q48455p55210j602356r10605j703047k64025p77084k17598j345075
14198C0804094q80201p73384r65600n29498p14126p35826m07828o58099r17410
14189B4222122j64197r59230m78237q21348j01558k08817o85160o77521l84819
$$ y = [193947188, 184046197, 174465628, 166168804, 158476725, 150584063, 143336577, 136199366, 130008614, 123667414, 118603441, 113554774, 108277024, 103533113, 99057049, 94777984, 90562605, 87671641, 84207218, 80401761, 77349774, 74052964, 71274693, 68416832, 66094923, 63544816, 61260490, 59295287, 57463558, 55122522, 53219497, 51431964, 49538586, 48212630, 47191964, 45873969, 44185748, 42756216, 41262136, 40141030, 39227549, 38379094, 37623884, 36021528, 35110923, 33407876, 33143851, 32366767, 32149169, 30804094, 29923893, 29150509, 28184909, 27655411, 26941285, 26205459, 25797631, 25139532, 24222122, 24057925, 23098695, 22620458, 21799110, 21697552, 21488735, 20803575, 20126054, 19741235]
14180A9741235l6669m80955n62897m33496n42234j40405l58896o02859k31259
14171A6351565j83402k40421l12004m92998J39311m98540m18508m2913n45302
14162A3756788l25113J77439l81608k91695l47850O63l75293o9723m17617N3812
14152A1779803l92538m41142J41332m5219k80551j37662l52164j22379j42833
14143A0006647J15390k38403k40486j27409m91484j18806M85051l73281j39971
14134H877248J19448l44197j08360m06325k8019O6787j45993k61028K23546n24738
14124G468369M06364n95202p1694l19567M13287j05558l19005J53622l26305M0580
14114F744891j2555j27643r0042J8191k23106j56329j58514j97823P0932m9998
$$ y = [19741235, 19704566, 19223611, 18660714, 18227218, 17684984, 17544579, 17185683, 16582824, 16351565, 16168163, 15927742, 15615738, 15122740, 15262051, 14763511, 14345003, 14302090, 13756788, 13431675, 13609114, 13227506, 12935811, 12587961, 12588624, 12213331, 12143608, 11725991, 11779803, 11387265, 10946123, 11087455, 11042236, 10761685, 10624023, 10271859, 10149480, 10006647, 10122037, 9883634, 9643148, 9515739, 9024255, 8905449, 9390500, 9017219, 8877248, 8996696, 8652499, 8544139, 8137814, 8109795, 8176582, 8030589, 7769561, 7993107, 7468369, 7874733, 7279531, 7207837, 6888270, 7301557, 7195999, 6876994, 7030616, 6704311, 6744891, 6732336, 6604693, 6514651, 6532842, 6309736, 6153407, 5994893, 5797070, 5868002, 5818004]
14104E818004k60075J12810J04297j13828l02523m2487n4939J52300j6943L6834
14094E433450k46579o237j52239J85241o49608M84292O3030k55409j93523k54308
14084D408110K2329M11612k55333k34694J80245M5564k1371n17080K79012j48763
14074D169631l88598K87801n3516k41J0977J27668l29044j31613o9729L38804
14064C962140j45368j6162k0395j09120M8016m8082J72171j17259l28534L04106
14054C701513n1709J21589n85961K28749O087k21161k50903R1656J70394R2417
14044C302671k17221l55447L49404j47882K0623R0573Q0085k03416j26782L6576
14034B829184J10720J08169j44726j46719L83060p07078M00544o3678j51657L2891
$$ y = [5818004, 5557929, 5670739, 5775036, 5661208, 5358685, 5316198, 5261259, 5413559, 5396616, 5433450, 5186871, 5180634, 5028395, 5213636, 4564028, 5048320, 5111350, 4855941, 4662418, 4408110, 4430439, 4842051, 4586718, 4352024, 4532269, 4577833, 4556462, 4039382, 4318394, 4169631, 3781033, 4068834, 4015318, 4015077, 4026054, 4153722, 3824678, 3693065, 3623336, 3962140, 3816772, 3800610, 3780215, 3671095, 3719111, 3671029, 3843200, 3725941, 3397407, 3701513, 3649804, 3771393, 3185432, 3414181, 3420268, 3199107, 2948204, 3039860, 3210254, 3302671, 3085450, 2730003, 3079407, 2931525, 2952148, 3042721, 3122806, 2919390, 2792608, 2829184, 2939904, 3048073, 2903347, 2756628, 3139688, 2432610, 2833154, 2769476, 2617819, 2650710]
14024B650710k76584J7032M46008m30699N05035j009830P74037m28585L7811j34707
14014B150228J28959j9777J99082l38620K92303l40182o1257M0728j09452O4796
14004B006808J83952j72214l68955K37644K05783j40274j23379P6246j60521J1249
13994A756339p7103j40550J34571K75909K04091O27739K216672N943027J7663391
13985B8604086K7095802B7180139A0891958m403190j782409m78717q11447k12699
13977C203496j72391K49533n08803n74845L42319J6625K5631j10637K216l26381
13967B146763J73236j26507j53675k61562K28394j75190j42854K45056K62067
13958B195728m40565K10452k56042J62506O0422q8773J35576n21679M84245m34256
$$ y = [2650710, 2374126, 2391158, 2837166, 2406467, 2911502, 1901672, 2675709, 2247124, 2284935, 2150228, 2279187, 2259410, 2458492, 2119872, 2412175, 2071993, 2010736, 2051464, 1942012, 2006808, 2190760, 2018546, 1649591, 1887235, 2093018, 1952744, 1829365, 1905611, 1745090, 1756339, 1679236, 1538686, 1673257, 1949166, 2153257, 2780996, 4997668, 10940695, 28604086, 55699888, 27180139, 10891958, 6488768, 4706359, 4227642, 3416195, 3203496, 3031105, 3280638, 2771835, 2196990, 2539309, 2555934, 2581565, 2470928, 2473144, 2146763, 2319999, 2193492, 2039817, 1778255, 2006649, 1831459, 1688605, 1933661, 2195728, 1755163, 1965615, 1709573, 1872079, 1932501, 1843728, 1979304, 1457625, 1941870, 1507614]
13948A507614M07305K7528k62911j7007O1254l78060K01094L13884l97712j69788
13938A293201Q9565l3666j36780L22629N1797j6154j75554J58473k11383N25064
13928A867192o21273K92522k14387l9052J76454K9447J10859k86072J81141l47908
13918A148923j67675L49074j08943n6377K94450j47962j05785J20296J22187l63416
13908A084772M80129k60659l3166Q3284k21059L7920J44468k51550M11980l15684
13898A160435J54687j14423l20412K12214J65940k06857r0833L75599j88361k2170
13888A125819L8209j94811J87171j0555r8137J72814P1897l07284L84226j94872
13878A174477o1767j66953J57799k95798J6790K35552P0747j15334j1936j987
$$ y = [1507614, 1914919, 1942447, 1679536, 1662529, 1723783, 1345723, 1546817, 1860701, 1462989, 1293201, 1382766, 1349100, 1212320, 1534949, 1586746, 1570592, 1395038, 1553511, 1342128, 1867192, 1245919, 1538441, 1324054, 1285002, 1461456, 1490903, 1601762, 1315690, 1496831, 1148923, 981248, 1330322, 1221379, 1165002, 1459452, 1311490, 1205705, 1326001, 1448188, 1084772, 1564901, 1304242, 1271076, 1354360, 1133301, 1171221, 1315689, 1064139, 1476119, 1160435, 1315122, 1200699, 880287, 1092501, 1258441, 1051584, 960751, 1336350, 1147989, 1125819, 1164028, 969217, 1156388, 1145833, 1047696, 1220510, 1292407, 985123, 1369349, 1174477, 1112710, 945757, 1103556, 807758, 824548, 1060100, 1130847, 1015513, 1003577, 1001590]
13868A001590L37550n36232K91439l34373N34394j13815J413m76270N04630k38339
13858I71987j1672M9855J38795k43940j41157J7547K27288M318k19335J3458K921
13847H10065R0545J6147l16559L21882r6282p2365j20136L45294j80517K03579
13837A001653j54340r7611C70988N57909j33112J6465J78688j8028j54259j05669
13827G12982K81667l13501J10851j44623k3415K43394k07042J82024P7524k81631
13817F38230j2642K49840L5717j6785K4676j73235K17376j05591j88876J26876
13807G95586p9231R8180j26301R2292C61700N43698j57406L2329j80115J82111
13797G82317j46910P9146L00402C69845J90053N0428m2250J83223k42242P2298
$$ y = [1001590, 1339140, 802908, 1094347, 759974, 1294368, 1180553, 1181966, 705696, 1210326, 971987, 960315, 1010170, 1148965, 905025, 763868, 781415, 1008703, 1013021, 793686, 807144, 810065, 900610, 916757, 600198, 922080, 825798, 753433, 633297, 978591, 798074, 1001653, 847313, 749702, 370988, 928897, 795785, 812250, 990938, 972910, 818651, 712982, 994649, 681148, 791999, 647376, 623961, 867355, 660313, 842337, 919861, 638230, 625588, 875428, 911145, 894360, 919036, 745801, 963177, 857586, 668710, 795586, 716355, 814535, 688234, 780526, 361700, 905398, 747992, 780321, 600206, 782317, 635407, 714553, 1014955, 369845, 559898, 610326, 568076, 751299, 509057, 581355]
13787E81355q8380K60719K18446l11400L31786k72670L6297k25123J01464K24782
13777H57276k77228j63686Q8805J82797q8416J97640l9694J25679j23714q6282
13767F73177k91786K76922j55709L64101k5690l18605N02469D89472K92159B46978
13756E65373M9475L0716r0866R0165j12054B63654L80870l04244L64534k35854
13746D68960K79321j71643J1505k01328Q8353K44657j97705k00113K06412K47775
13736G76194k1874k19691M9873r1491O7487k59908L86773J01137C15751L24898
13726F40649k84257K45862p4999j58971j66750J55878K01273L0975K3271o0354
13716E52577k7425J29630C23130J32159J28305r3835m4227K49910k79167k7387
$$ y = [581355, 492975, 753694, 972140, 660740, 992526, 719856, 756153, 531030, 632494, 857276, 580048, 416362, 505167, 687964, 599548, 797188, 757494, 883173, 759459, 673177, 381391, 658313, 502604, 866705, 841015, 522410, 1024879, 489472, 781631, 246978, 565373, 614848, 645564, 554698, 644863, 532809, 263654, 644524, 340280, 704814, 468960, 748281, 576638, 588143, 386815, 475168, 719825, 522120, 322007, 528419, 776194, 754320, 534629, 584502, 493011, 560498, 300590, 687363, 788500, 315751, 640649, 356392, 602254, 527255, 368284, 201534, 357412, 558685, 589660, 612931, 552577, 525152, 654782, 323130, 455289, 583594, 489759, 445532, 695442, 416275, 388888]
13706C88888n0707J01038A82475L27467J2681j5458n9880Q4398J43457j47383
13696E27757k61233G9354N59925C11889J71829m9948k06281J79427P3645o6898
13686D13663r7997N3238K2486K58615k15539B05964M70328q3033k42537o1504
13676B89218J72720O6964L1247j70863A09208L66608B34838Q7871M09015j54713
13666E77011A03395m5934M57468j55047j39465K64166k40884O2353N9815p9911
13656B85956j9847K35319b0271E93404J13400B11041J58514A74881N0729J93784
13646D19394j23335A45291m0989J69344K4219N9956k0794I4399L08301q852K34548
13635F28396k63795A63103k8592J0524m2149L04419F0531L77560G6211K30395
$$ y = [388888, 338181, 439219, 182475, 509942, 522623, 507165, 447285, 531683, 675140, 527757, 266524, 79354, 639279, 311889, 483718, 433770, 227489, 406916, 480561, 413663, 315666, 368904, 391390, 650005, 434466, 205964, 676292, 593259, 350722, 289218, 461938, 528902, 560149, 389286, 109208, 475816, 234838, 322709, 731724, 577011, 103395, 57461, 514929, 359882, 220417, 484583, 243699, 306052, 365867, 285956, 266109, 501428, -20271, 593404, 706804, 211041, 369555, 174881, 225610, 419394, 296059, 145291, 104302, 273646, 297865, 357821, 337027, 94399, 402700, 393848, 628396, 364601, 163103, 134511, 145035, 102886, 407305, 60531, 438091, 76211, 306606]
13625C06606A14455J69073K64459A37509P6798K65567o4974J27003R9140o171
13615F34872A32056L52664j95574K45662A92925B6611K00612J80877j48573J23859
13605C83386j72806o7076D4676J18102R0447C0288R1554J12277a50725B20866
13594A87497R8821J31072j63171k2352n7540Q0436f3108B04618K84355L12798
13584H01771C37300k141k4083N4241L0297A67762O6786p8657K23276J89838B18328
13572A58492J82419k9083P9804q8300C5611J10551J51703l2483M3540O2296J5188
13561C86406r0458j01168J22038j42695m7400l8158O03184l30668j28314j0028
13551B22739m1799A9162M62486I2846K12711J25216j88975O0196E8292L80450
$$ y = [306606, 114455, 283528, 547987, 137509, 214307, 479874, 414900, 541903, 641043, 634872, 132056, 484720, 289146, 534808, 192925, 26611, 227223, 408100, 259527, 383386, 210580, 143504, 44676, 162778, 253225, 30288, 121842, 234119, -150725, 220866, 187497, 286318, 417390, 254219, 231867, 174327, 254763, -63108, 204618, 488973, 801771, 337300, 335159, 311076, 365317, 395614, 167762, 234548, 155891, 379167, 569005, 218328, 158492, 340911, 311828, 391632, 303332, 35611, 146162, 297865, 265382, 308922, 371218, 386406, 295948, 194780, 316818, 174123, 126723, 88565, 691749, 361081, 232767, 222739, 180940, 19162, 481648, 92846, 305557, 430773, 241798, 301994, 58292, 438742]
13541D38742H6449E734J80449J01237K15602B20203J03351J63433A80708N7454
13531B38162H7179L09732J84788j11467B11947l7771K17988a38109B31193J19649
13521C50842F2317J95328m7943A03194J81233l347C3951J31640l7380K85701j76551
13510B37361j2501p873Q459n0877E6995J03483P3333r1128J07926A6745L2987
13499D9732d4054B2223L902O6193K77686d7330A61362g5192A85700a23116C33367
13487D10195A44475K15140C8334K90430l723K7401p5855O4160A64631m6752K92785
13476D10664j20163G339N72653B40695m123n7466M65146j78520A46339N1853b4141
13464C60301D1565M61452g7480B91956K014b90157A29880j7008N01258k80894
$$ y = [438742, 86449, 5734, 186183, 287420, 503022, 220203, 323554, 486987, 180708, 238162, 87179, 396911, 581699, 470232, 211947, 174176, 392164, -138109, 231193, 350842, 62317, 257645, 209702, 103194, 284427, 281080, 33951, 165591, 128211, 413912, 237361, 224860, 216987, 225446, 174569, 56995, 160478, 233811, 142683, 250609, 16745, 49732, -44054, 22223, 26125, 92318, 370004, -47330, 161362, -75192, 185700, -123116, 333367, 410195, 144475, 359615, 38334, 328764, 325041, 352442, 276587, 340747, 164631, 117879, 410664, 290501, 7339, 579992, 240695, 236572, 179106, 644252, 465732, 146339, 198192, -24141, 360301, 41565, 503017, -77480, 291956, 293970, -290157, 129880, 112872, 614130, 333236]
13454C33236A49911d4845j40720A04650J12564g4057E81381g61A64221K21110
13444C85331m8130q6129J50958a3378B33729J0514j18184J23K5369M41750I7232
13432B18393o3406J61232K37154a74065E5532a4223A9013K82639J50377B10445
13421D74415d0484G7568M32517H5391J02721K11591r0708q2929I9598K9827M5754
13410A75179d5602C28535A3694K81442j43491Q8602N7809Q9051J09971j69153
13400C27925a22114B64076K8841r357D1299M1901J44418F6271b81650E4794K67605
13389C22399j39037a2769B27463c0192j3406p989A9235J54545K7923o0495M4196
13378A85404K11854J53881A31099Q0916m7328b4218A00083J99813A26815J52619
$$ y = [333236, 149911, -44845, -185565, 104650, 217214, -74057, 581381, -761, 164221, 385331, 337201, 251072, 402030, -13378, 233729, 244243, 126059, 126182, 151551, 593301, 97232, 218393, 154987, 316219, 553373, -174065, 55532, -14223, 19013, 301652, 452029, 210445, 474415, -40484, 77568, 510085, 85391, 188112, 399703, 308995, 226066, 99598, 129425, 175179, -45602, 328535, 13694, 295136, 151645, 240247, 298056, 387107, 497078, 327925, -122114, 264076, 292917, 283560, 41299, 83200, 227618, 66271, -281650, 54794, 322399, 183362, -12769, 227463, -30192, -43598, -51587, 19235, 173780, 201703, 141208, 185404, 397258, 551139, 131099, 212015, 164687, -24218, 100083, 299896, 126815, 279434]
13368B79434r2160E0056J2200j6680J01695b771j8386C57979A76303n0920K3717
13357A49100J86703a11485B1687e039k68598C18165j04424m6085m4510L3504F9071
13345C23722j29200K4167K02101r7528A29181A2039L90529F1528K3246J76704
13335B61478B0139M39505J05036A50738M026J11272L21434F1711a05780b9707
13324a09980B38279j958h1302E19300K8994E6620M7936a5589A61552L59365B1493
13312A4983g4083B97444A33440J52286l807c6847H6246Q6225O3261A06177J47691
13301B53868m0753a44904E604J94847K01549d8111D9977K92975j01885a88504
13290b4506C58607r8658A28454d614j22412d0146a7713C89041i4609o931B28680
$$ y = [279434, 187274, 50056, 62256, 45576, 147271, -2771, -21157, 357979, 176303, 125383, 149100, 335803, -111485, 21687, -5039, -273637, 318165, 213741, 167656, 123146, 156650, 69071, 323722, 194522, 218689, 420790, 323262, 129181, 12039, 402568, 61528, 84774, 261478, 20139, 459644, 564680, 150738, 154764, 266036, 587470, 61711, -105780, -29707, -109980, 238279, 236321, -81302, 519300, 548294, 56620, 104556, -15589, 161552, 520917, 21493, 14983, -74083, 297444, 133440, 285726, 281919, -36847, 86246, 172471, 235732, 106177, 253868, 213115, -144904, 5604, 200451, 402000, -48111, 49977, 342952, 241067, -188504, -24506, 358607, 259949, 128454, -4614, -127026, -40146, -17713, 389041, -94609, -101540, 228680]
13278I8665R276K90946o9374G3190J03495b87091A47703e7377j67584C61455H7767
13266B38981J4470L0193I9245P0514n3577c4270P990B0884M66349I1812A284a59564
13253A20560i9967B65631F6392a6203C80269m3890A14290l7116b12956B84443
13242A95909C3139f3381B71874r8302N9478A8121a21538j92411D97230a51229
13231a87238A20264D3910M23595A24011d4967G6989K11933a39204A97965d0443
13220b32994F3268b11783B07907b347D2071d3493A60738A5078J05387J12389j13392
13209A19462a29048N5135B38519m1884K33427j61843Q3458b77083a10089C46460
13198B69286q3031o3257K7598C3707b84225A91100q0364a29197A128L63709p6025
$$ y = [98665, 107941, 398887, 329513, 73190, 176685, -287091, 147703, -57377, -224961, 361455, 87767, 238981, 253451, 283644, 99245, 169759, 116182, -34270, -26280, 20884, 487233, 91812, 1284, -159564, 120560, -99967, 265631, 66392, -16203, 380269, 336379, 114290, 77174, -212956, 284443, 195909, 33139, -63381, 271874, 173572, 233050, 18121, -121538, -313949, 497230, -151229, -187238, 120264, 43910, 467505, 124011, -44967, 76989, 288922, -139204, 197965, -40443, -232994, 63268, -211783, 207907, -2347, 42071, -43493, 160738, 15078, 120465, 232854, 119462, -129048, -73913, 238519, 196635, 430062, 268219, 351677, -277083, -110089, 346460, 269286, 186255, 122998, 150596, 33707, -284225, 191100, 110736, -129197, 1128, 364837, 288812]
13187B88812e9029A32744j9956J61319j28891D768J9423c39889A44955B1331g8104
13175C53L10672b2473A66447b0518r8340l87543A29666L30567a7825k1155a2294
13163A39638c2294A31375b38885E9444b6083G4301J5641j9642a98363A07941a19989
13151C91617E0183L115K04558p3021a0508B08508a94016F1364G070J86565b28505
13139g02n1800A32344k5607k1160J50433m2085a13192B84710b8162A80200J3357
13128A93557R779b05785H2710K24345b9663A24056Q0863a10499A9018K7894P351
13117E4263a32863K1539l926B23178o0980a20119C6803J74690F9568d4211a7237
13105a26632j4152a7956E1678a81590l0966R5942A7950K5430a01515K4387A14807
$$ y = [288812, -59029, 132744, 112788, 274107, 145216, 4768, 24191, -339889, 144955, 21331, -78104, 353, 311025, -22473, 166447, -20518, -118858, -506401, 129666, 460233, -17825, -38980, -12294, 139638, -32294, 131375, -238885, 59444, -26083, 74301, 89942, 70300, -198363, 107941, -119989, 391617, 50183, 53298, 257856, 184835, -10508, 208508, -194016, 61364, 7070, 193635, -228505, -702, -52502, 132344, 106737, 85577, 236010, 193925, -113192, 284710, -28162, 180200, 193557, 203336, -205785, 82710, 307055, -29663, 124056, 204919, -110499, 19018, 46912, 54263, -132863, -111324, -115250, 223178, 162198, -120119, 36803, 211493, 69568, -44211, -17237, -126632, -140784, -17956, 51678, -181590, -212556, -116614, 17950, 43380, -101515, -77128, 114807]
13093C6689A0739a04771b8803m3566j6328A29674l2579i0621C02020c3554I7147
13081a04924P175D4635L01094D0550J02691K87265A61196c168k47171d2500A71055
13069c40789G0426J07665F8042a54465C18295a54042C95389A75341B2650a26531
13058a666C40539G631a73445H2244L21487g7763A12866N2998J01361r2566k5898
13047A48761n3271J54113M7174f6672E10307B31520r6358E776b9667B37458B887
13035I4979C4858J4066L31361A2140N6884J29910B4865J12158o4033b1327I8092
13023C49059a64219b1272C48201j45151m2452D7942c5692k7195b7835A55352O5857
13012B21209d7259A76656B0652J82031A8742L94K74913h9174j1711B8255J0805
$$ y = [36689, 10739, -104771, -28803, -72369, -88697, 129674, 97095, -90621, 302020, -33554, 97147, -104924, -97749, 44635, 345729, 40550, 143241, 430506, 161196, -3168, -250339, -42500, 171055, -340789, 70426, 178091, 68042, -154465, 318295, -154042, 395389, 175341, 22650, -126531, -1666, 340539, 7631, -173445, 82244, 403731, -77763, 112866, 165864, 267225, 174659, 148761, 95490, 249603, 296777, -66672, 510307, 231520, 135162, 5776, -29667, 237458, 2887, 94979, 34858, 48924, 380285, 12140, 69024, 198934, 24865, 137023, 72990, -21327, 98092, 349059, -164219, -21272, 348201, 203050, 160598, 47942, -35692, -62887, -27835, 155352, 221209, -47259, 176656, 20652, 202683, 18742, 19136, 294049, -89174, -100885, 28255, 39060]
13001C9060N8436J44434b26770G9875A7496i2635e351A45749h2989D08357g6195
12989d748l74931a15715H1350K96193c0341j42531A9221c3836A004K97863e3455
12977B20622o9761l4770J14123a2380H6933B8212b3255A80275L8716p4183D6630
12965A25626K5750f5707B39116a55994B6702b0769H6536O7906i5386j81606A11034
12953A97771l614J47572a6777A51515k6759L34106a60427b9828B2034N0036J74936
12942B47006q2893o253b05185A73612K21824A82588q1957i279j30078I5859b11762
12930I9504B4934a2852o2004C16113h6590B57357a7404k0262n8422p278A05521
12918b33653D28128B08304k4589G1601j5501a81269a8963B61524R465a35526B62399
$$ y = [39060, 97496, 241930, -226770, 79875, 17496, -92635, -5351, 145749, -82989, 408357, -76195, -4748, -379679, -115715, 81350, 377543, -30341, -172872, 19221, -33836, 1004, 298867, -53455, 220622, 150861, 116091, 230214, -12380, 86933, 28212, -23255, 180275, 218991, 144808, 46630, 125626, 151376, -65707, 239116, -155994, 26702, -20769, 86536, 154442, -95386, -276992, 111034, 197771, 194157, 341729, -16777, 151515, 124756, 458862, -160427, -29828, 22034, 72070, 247006, 164113, 157860, -205185, 173612, 395436, 182588, 100631, -9279, -139357, 95859, -211762, 99504, 24934, -12852, -74856, 316113, -86590, 257357, -17404, -37666, -96088, -103366, 105521, -233653, 428128, 208304, 183715, 71601, 56100, -181269, -18963, 261524, 270989, -135526, 262399]
12906b18903A59702F9495b1778A41831K14315G8646I477K20507K2552A09628J2022
12895A21650e8881j56595e8455j2881A31909n2474K7635C4545J13750j3696L6831
12884A71430B6450J76005C7594K41991A38284c5844k3068A91648a53078P2835
12874h0243l1670i705j12142A18536B5281L4573e46491a01261L4224B94729H6298
12862a05378B6926R9257C5250a5987n6578j25336B26126J44052e7893B55061R36
12851B55997n8458p3687a78381C3020i4723A22951D2212a02015C17666j7116r7157
12840B03393A8996b33923A09911i7701c8633j5117B16415l6613a57233e2054q8624
12829a40678M4804C19733g1932J6922J4597l0594r6961L7667A81824Q4068c66047
$$ y = [-218903, 159702, 69495, -21778, 141831, 356146, 78646, 9477, 229984, 252536, 109628, 121650, -58881, -215476, -58455, -71336, 131909, 79435, 107070, 34545, 148295, 134599, 171430, 26450, 202455, 37594, 279585, 138284, -35844, -58912, 191648, -153078, -80243, -111913, -9705, -121847, 118536, 25281, 59854, -546491, -101261, -67037, 294729, 86298, -105378, 26926, 126183, 35250, -15987, -72565, -197901, 226126, 370178, -57893, 255061, 255997, 197539, 123852, -178381, 33020, -94723, 122951, 42212, -102015, 317666, 300550, 203393, 18996, -233923, 109911, -97701, -38633, -53750, 216415, 179802, -157233, -52054, -140678, -95874, 319733, -71932, -55010, -40413, -71007, -167968, -130301, 181824, 265892, -366047]
12817i8528c1630A96504a29907r5126h4496O362a8990E1113b86928C35981d0657
12805f0844G1882D803K7031a26352A05627D1664r677A3436c10939I6807a03814
12793b88073P0952C4713b02807A69448f286j60251E9544K46026A6809b22495f0733
12781a13451F5171e1654j03590F7026J22430H3207J5574K29560M5640a87749c5431
12769d1612f087o8065K0087d184F688K49724a79290Q0143o4085A3002f729A63276
12756e11626a8293C50127b01270C5677n423J2844P4359B6370L03411a66858A74391
12744H2002a37752j5890F9851L8041b53863a02017o7669E0685h1029R587B39733
12732H1826a19845D1573M21071j76566a23561r9780F3973d2163f604q5541l38564
$$ y = [-98528, -31630, 196504, -129907, -225033, -84496, -78134, -18990, 51113, -286928, 335981, -40657, -60844, 71882, 4803, 31834, -126352, 105627, 41664, 31987, 13436, -310939, 96807, -103814, -288073, -217121, 34713, -202807, 169448, -6286, -166537, 59544, 305570, 16809, -222495, -60733, -113451, 65171, -51654, -155244, 67026, 189456, 83207, 98781, 328341, 373981, -187749, -35431, -41612, -6087, -74152, -54065, -4184, 6688, 256412, -179290, -99147, -163232, 13002, -6729, 163276, -511626, -18293, 350127, -201270, 35677, 30254, 43098, 117457, 26370, 329781, -166858, 174391, 82002, -137752, -153642, 69851, 107892, -253863, -102017, -169686, 50685, -81029, -71442, 239733, 81826, -119845, 41573, 462644, 286078, -123561, -223341, 63973, -42163, -6604, -92145, -430709]
12721d30709a16931A88966a54503M7420C0812j280A487J24604b28466A33335L2421
12710A65756D6822K26972o3985C2494J19692n6130J9998J88953o7014j11841D0746
12698A19859K2298J5775m1117J61235A38443n8898J84723A24343F1214R5709a9713
12686A18124c46450J39598e4876A12855e2963B69723A22026c37294C76648A2343
12675A10420f5841A29552J47759B5351g229o3380B85691A07939b25649d5165A96367
12663a78740A53272f2667B03606g4076P965B11040M5475B8101M20493A77790k7146
12652A50644i8138C5052J02422o5407b64490J07920j06248A83429e3769B99066
12641g0852o892B98756F9509k0160N3631a32993A50565k7983n1030C4370J92218
$$ y = [-430709, -116931, 188966, -154503, -107083, 30812, 29532, 1487, 126091, -228466, 133335, 165756, 46822, 273794, 209809, 32494, 152186, 96056, 116054, 305007, 237993, 126152, 40746, 119859, 142157, 157932, 116815, 278050, 138443, 79545, 264268, 124343, 61214, 156923, -19713, 118124, -346450, -206852, -54876, 112855, -52963, 269723, 122026, -337294, 376648, 12343, 110420, -65841, 129552, 277311, 25351, -7229, -70609, 285691, 107939, -225649, -45165, 196367, -178740, 153272, -62667, 203606, -74076, -66111, 211040, 256515, 28101, 448594, 177790, 150644, -98138, 35052, 137474, 72067, -264490, -156570, -262818, 183429, -53769, 299066, -70852, -77744, 298756, 69509, 49349, 102980, -132993, 150565, 122582, 71552, 34370, 226588]
12630B26588K7137L20824A40478c9922E0065J71865L2700J06727j80110h5847
12619D05182q5459A42457j9594c05137A60859a88304B67506a15864A02353J1445
12609A13798g7022B61260c90885F7904a799A1471J49052a36369C14367B5790M44037
12598D69827j38417G3732L3751P3868A2141Q0305L5097d7961G3482L60786a36219
12586A77436d8241m9176E3812g1349j48441B10434e251A63020a59935M1257E4196
12574c2335m2516r7091e1316C39543A6730J79205H993J19246a30011D5411a10763
12562A06744B8909P654J22949M23621E8679L9123J13618L07836b12940K0154A83200
12550b85210B08786b82772l9290a54292f7108A18471O2619c14066C6756A7869
$$ y = [226588, 253725, 574549, 140478, -39922, 50065, 221930, 254630, 361357, 181247, -85847, 405182, 319723, 142457, 122863, -305137, 160859, -188304, 267506, -115864, 102353, 113798, -77022, 261260, -390885, 67904, -1799, 11471, 160523, -136369, 314367, 25790, 469827, 331410, 73732, 107483, 181351, 12141, 92446, 127543, -47961, 73482, 434268, -136219, 177436, -48241, -97417, 53812, -71349, -219790, 210434, -5251, 163020, -159935, -118678, 54196, -32335, -74851, -171942, -51316, 339543, 16730, 195935, 8993, 128239, -130011, 45411, -110763, 106744, 28909, 36563, 159512, 583133, 58679, 97802, 211420, 519256, -212940, -192786, 183200, -285210, 208786, -282772, -322062, -154292, -67108, 118471, 181090, -314066, 36756, 17869]
12539h6468B52271f4883J1552A19955g0966G9474i2137B62607O5716j39475L87612
12528E76460A12359c09318i621j49415a2922B85815A06671D3791f4652l2645J955
12517i5342B28814q5960a70101E5817j8227g5791I2927D5407a19908D5727K38753
12506B84480m1537G3613K2479J97185j13592B7179J41449k637D1582K4935M2299
12495A08816a44327B20738g6021F138J24773a62127D773b51773C4182c4329n4045
12484h8374A68779G3518a7026N204l30255A44216F9089b08115L7874A81899F5757
12472a14552a1789A57032k644J0264K5200E812R5145i7317A31810N2829r996b25537
12459d5460j91615A42619c33787I2299B5298J8055g4253k28493o3360J16207E4819
$$ y = [-86468, 252271, -64883, -53331, 119955, -70966, 79474, -92137, 262607, 328323, 188848, 576460, 112359, -309318, -9621, -159036, -12922, 285815, 106671, 43791, -64652, -97297, -95342, 228814, 142854, -170101, 55817, 37590, -75791, 92927, 45407, -119908, 45727, 284480, 242943, 73613, 96092, 293277, 179685, 27179, 168628, 165991, 41582, 66517, 108816, -144327, 220738, -76021, 6138, 130911, -162127, 4773, -251773, 34182, -34329, -88374, 168779, 73518, -17026, -11822, -342077, 144216, 69089, -208115, -170241, 181899, 65757, -114552, -11789, 157032, 154388, 164652, 189852, 5812, 100957, -97317, 131810, 184639, 174643, -225537, -45460, -237075, 142619, -333787, 92299, 25298, 43353, -74253, -302746, -366106, -249899, 54819]
12447b86036J28657m974C9366b42338B36313b09610A75216c37256b7761F1784
12436B09368h0171A46085g4121l14350H3493J75338B2133a19528I8963m6182d4577
12424e8813A81834q1764N0643J82652j44329K513c07508e4151A53028B6609a65622
12412a6428n7907E3673e4906F8474i7568l86856e9128a8646G1381P8117j4223
12401A35275O6262L268a20501j62229c8818r2863j13910I7802Q8301a12238K1614
12390i0624A19554K20982H3403A2991i0893L626A69410a38550A22638f9839J9836
12379e0003j5752K5706A79526d3445i222q7724C01796g5082H7547K76914p6421
12368B88040b7408o5102l2207B68928a36159L7925F1783f6816j26723A59762p6189
$$ y = [-286036, -157379, -162353, 39366, -242338, 236313, -209610, 175216, -337256, -27761, 61784, 209368, -80171, 146085, -74121, -388471, 83493, 258831, 22133, -119528, 98963, 52781, -44577, -58813, 181834, 100070, 150713, 333365, 189036, 191549, -307508, -54151, 153028, 26609, -165622, -16428, -74335, 53673, -54906, 68474, -97568, -484424, -59128, -18646, 71381, 149498, 135275, 201537, 204805, -120501, -282730, -38818, -131681, -245591, 97802, 186103, -112238, -90624, 119554, 340536, 83403, 12991, -90893, -87267, 169410, -138550, 122638, -69839, -50003, -65755, -40049, 179526, -43445, -9222, -96946, 301796, -75082, 87547, 364461, 288040, -27408, -92510, -124717, 268928, -136159, -98234, 61783, -66816, -193539, 159762, 83573]
12357H3573B2865a84759c8635o304j94909D6875h9348j52979E8768d8538G8343
12345a08921D63939B2395J37214p0302b47644o8660K9345a40076j0108D9667J4840
12334F4507g2534H3979b5121j06565E210a9097o4625A14756J7705A4869a03521
12322A53682F3632d17359A8420e6768j8776b5695j15480B52495c1992H3842b60977
12310C212M3466J5391e48333e6343b6652A48218A0560a19024d682k11973C12479
12298I6926J04045D5761c2593g385j11116n1384A67157B6077J02668b01439H9903
12286d4870A65089K520K6858n9708A1951K80029g9944D39109a27525j48246D12649
12274a19712B49328n9316q8254g7865C00847a69605c4198I4118b93185I7398Q9696
$$ y = [83573, 22865, -184759, -38635, -44939, -239848, 46875, -89348, -242327, 58768, -48538, 78343, -108921, 463939, 22395, 159609, 89307, -247644, -316304, -286959, -140076, -150184, 49667, 64507, -72534, 83979, -25121, -131686, 5210, -19097, -83722, 114756, 132461, 14869, -103521, 153682, 63632, -417359, 18420, -56768, -75544, -25695, -141175, 252495, -31992, 83842, -260977, 3212, 46678, 62069, -548333, -56343, -26652, 148218, 10560, -119024, -4682, -216655, 312479, 96926, 200971, 45761, -32593, -7385, -118501, -169885, 167157, 26077, 128745, -201439, 89903, -44870, 165089, 167609, 194467, 134759, 11951, 291980, -79944, 439109, -127525, -275771, 412649, -119712, 249328, 190012, 101758, -77865, 300847, -169605, -34198, 94118, -293185, 97398, 187094]
12263A87094r0293J09519a96431D1435A5502G502c36084D1918g5685D30360k05090
12252B25270D3516a7567j53228B075J97091m9679j6389E9525L3424i6133r9356
12241a95489Q9486H5399a26332A44439F4735g0218A67865G943N9664J07314D7621
12229D9306L07179D744J31714a03772B99761A25384l7655K50998j48305J10599
12219C01021j05288I6156b7442D21583E9731N7269i1865A18314b13606G2791k8269
12208D4522i998C30168G1188L63274E4328b7453B46946a01532a1927B95353E2048
12196C66295A20843L89840i3114D10388A12831L35420j3086A98035e0400G21997
12185A24549A4044h0074C0022h0796b1064A06580K98893i1832A18360K06683K21907
$$ y = [187094, 96801, 206320, -196431, 41435, 15502, 7502, -336084, 41918, -75685, 430360, 225270, 43516, -17567, -170795, 2075, 199166, 149487, 133098, 59525, 92949, -96133, -195489, -106003, 85399, -126332, 144439, 64735, -70218, 167865, 7943, 67607, 174921, 47621, 49306, 356485, 4744, 136458, -103772, 299761, 125384, 87729, 338727, 190422, 301021, 195733, 96156, -27442, 421583, 59731, 117000, -91865, 118314, -213606, 72791, 44522, -9998, 330168, 71188, 434462, 54328, -27453, 246946, -101532, -11927, 295353, 52048, 366295, 120843, 510683, -93114, 410388, 112831, 448251, 435165, 198035, -50400, 721997, 124549, 14044, -80074, 30022, -80796, -21064, 106580, 405473, -91832, 118360, 325043, 546950]
12174E46950B701K85394n2871h4033A46959k3476e7587C21951I4201K4894O6934
12163A86029Q9992A33314a18951A64957c5173D3497j2551a21k38897A8282a74902
12151A07659E1572K53345e8827D4750K5867J91804b688B12172e1200A17773N4623
12140A72396J34795d14683E7481K52172B4494R1960A7978K6694b10680j95193
12130d05873e3327E2016b07826k65128a61862H2330J09816o6702d5470A13221
12119G3298A3856J61035K9384a13470G4367L21266A62129l390e4053j20132Q3433
12108i0752A97994n4448a04008C4933Q9851k4339R0620n6605K66195D4709N688
12097E0397a43359A19454L3746k221i7054C92136b72273B8928g8910A06178L331
$$ y = [546950, 2701, 288095, 235224, -84033, 146959, 123483, -57587, 321951, 94201, 119095, 186029, 276021, 133314, -118951, 164957, -35173, 43497, 30946, -121, -239018, 18282, -174902, 107659, 51572, 304917, -58827, 44750, 70617, 262421, -2688, 212172, -51200, 117773, 172396, 307191, -414683, 57481, 309653, 24494, 116454, 17978, 44672, -210680, -405873, -53327, 52016, -207826, -472954, -161862, 82330, 192146, 125444, -45470, 113221, 73298, 13856, 174891, 204275, -113470, 74367, 395633, 162129, 158739, -54053, -174185, -90752, 197994, 143546, -104008, 34933, 124784, 100445, 191065, 134460, 400655, 44709, 50397, -143359, 119454, 153200, 150979, -97054, 392136, -272273, 28928, -78910, 106178, 109509]
12086A09509C9420M3726a53213l32590g2888k3232a8100A17653J43143f8492j4828
12075h3320B87022Q12581J139090I23897A53302a99964A13805l9706a61848B21296
12064b04640I4593k2477i3346j17733A08350L8920d5432B99610r1892a33514E9462
12052B10659a60069D0974c42816m4045R9177B10459b24155A46746P086P9606G7915
12040e6288K7883j69920D2805h2680r8572A70294a51932A27937h4004C00923a05465
12028b45888g3379B80679a29406B54180c66831a04947l77550J56827e2339b4353
12017B18407b44167k12907h4554B40832B343b35866A82963a97700C51662C7318
12006i8694b5778c956l39297a55965k6547P9902n6019g5155k84225A0982a82819
$$ y = [109509, 39420, 83146, -153213, -485803, -72888, -96120, -18100, 117653, 260796, -68492, -83320, 287022, 1099603, 2238693, 923897, 153302, -199964, 113805, 74099, -161848, 221296, -204640, 94593, 72116, -93346, -211079, 108350, 147270, -45432, 299610, 207718, -133514, 59462, 210659, -160069, 40974, -342816, -386861, -287684, 210459, -224155, 146746, 153832, 233438, 77915, -56288, -28405, -198325, 42805, -82680, -181252, 170294, -151932, 127937, -84004, 300923, -105465, -245888, -73379, 280679, -129406, 254180, -366831, -104947, -482497, -325670, -52339, -24353, 218407, -244167, -457074, -84554, 240832, 2343, -235866, 182963, -197700, 351662, 37318, -98694, -25778, -3956, -343253, -155965, -182512, -102610, -158629, -75155, -359380, 10982, -182819]
11994i522E1436b53693c735D49927j30309c9869j6112j10706L0353C1964K0944
11983E2908J91518M0191a96607D1693a80080Q6774D2466i8169j61934Q8731C0147
11971A16604J14917b19151H9085a02152k96484J98574l658j72140c1999G0631
11960f6086J3140g120j80103k05217a28318B98082a77536a0533D3925O5018K5431
11949A34374i0608a7166A10595b76262J27868A58980a0723n1486A85045b73666
11938a22482o7532e0380J5732E8461B0890L75765C8868J75829c0655A45760b83854
11926b4599A59342k1261J07116a60695C53261b94847o5923f3529a5165A92366
11915a14062B9035P3168b52942E6427J7124a87326j44183E8827a50785P4903q0849
$$ y = [-9522, 51436, -253693, -3735, 449927, 319618, -39869, -55981, -166687, -136334, 31964, 52908, 244426, 284617, -196607, 41693, -180080, -93306, 42466, -98169, -260103, -171372, 30147, 116604, 231521, -219151, 89085, -102152, -398636, -200062, -203720, -375860, -31999, 70631, -66086, -52946, -7120, -187223, -392440, -128318, 298082, -177536, -10533, 43925, 108943, 134374, -90608, -17166, 110595, -276262, -148394, 158980, -10723, -62209, 185045, -273666, -122482, -190014, -50380, -34648, 58461, 20890, 396655, 38868, 214697, -30655, 145760, -283854, -24599, 159342, 138081, 245197, -160695, 353261, -294847, -360770, -63529, -15165, 192366, -114062, 29035, 102203, -252942, 56427, 73551, -187326, -331509, 58827, -150785, -75882, -156731]
11904a56731A1451K11077f6484g058A48765a30429B6584J13013a2325k5039B92258
11892e3735a1341p9938C42110p4936p1618a85515B3130c24347a16847d0732B9022
11880e6277B59927b21133B21251r026d19740A32228a99968b6760j68146I947a10734
11868A24133q087h9111p7112D6998L3919a66390D8657O5463a1948k61333j03539
11857c76820C27771a13318C6805E266a43297D32K1411L7918c05782A57118a87508
11845h7219j7514A5870C262d53824C8138b87532a21602d2560l0948F1335n678
11834E5657c9247l40825g798p6693c2878D149i2532c5661n0440j8142m9536P4083
11822g9696H5529h254A0841J8988b07476C0512c3374A00376c4857B1039a05937
$$ y = [-156731, 11451, 222528, -66484, -7058, 148765, -130429, 26584, 139597, -12325, -37364, 292258, -53735, -11341, -91279, 342110, 267174, 195556, -185515, 23130, -324347, -116847, -40732, 29022, -56277, 259927, -221133, 221251, 212225, -419740, 132228, -199968, -26760, -194906, 9947, -110734, 124133, 116046, -89111, -166223, 46998, 80917, -166390, 48657, 114120, -11948, -273281, -376820, 327771, -113318, 36805, 5266, -143297, 432, 21843, 59761, -305782, 157118, -187508, -87219, -104733, 15870, 3262, -453824, 38138, -287532, -121602, -42560, -73508, 61335, 55657, -39247, -380072, -7798, -84491, -32878, 4149, -92532, -35661, -86101, -104243, -153779, -79696, 85529, -8254, 10841, 29829, -207476, 30512, -33374, 100376, -34857, 21039, -105937]
11810I3702a18991d6615B75703E2989K98731p5116a0209A1647a31546B5488J13175
11799A38663D6236M9114K51269A469N839c31388A8196J62741J576c75798H6112
11787I2706k6811g4434A14754e2015E5878g0187r4310M4308B66838f7691j81547
11776b49238D7840b04264C6272b11623C0805a10597B23558b33383d8601j18496
11766a67097A10750b1950B70149a55046g4427A08462a32218A24227a70781k9820
11756b00601d5084A9350J69626b12463D7533J326B305b60402A75473n4412J47621
11745B68682a33200c3634k14507F298Q3660a00753D1591A290i22r4363c2079k7581
11733e9660B15203d5552A82684e2929C4422f0384A02169I970P231K54298I4996
$$ y = [93702, -118991, -46615, 275703, 52989, 351720, 276604, -10209, 11647, -131546, 25488, 138663, 46236, 95350, 346619, 1469, 7308, -331388, 18196, 180937, 182513, -375798, 86112, 92706, 65895, -74434, 114754, -52015, 55878, -70187, -164497, -120189, 266838, -67691, -249238, 47840, -204264, 36272, -211623, 30805, -110597, 223558, -233383, -48601, -167097, 110750, -21950, 270149, -155046, -74427, 108462, -132218, 124227, -170781, -200601, -45084, 19350, 188976, -212463, 47533, 48859, 2305, -260402, 175473, 121061, 268682, -133200, -33634, -248141, 6298, 89958, -100753, 41591, 1290, -922, -95285, -32079, -59660, 215203, -45552, 182684, -52929, 34422, -60384, 102169, 9970, 17201, 271499, 94996]
11721E8956N8253J54534b50752A87861O1574a75999B26117e8120A71516O720j9357
11710A58879K3393F1535P2805b2504J1138A27371L3268N5653E4117b25210B51063
11698c16228d7870j7987k5006H3136A790a35324B76452E7250K93909A40607e9864
11686a0512j9736j61383E35463A86133k7966i8845E7187J33275m2800A4523J86309
11675B00832B2239F09N3666a43365M9993A72404d2150n0925C36062E7210k3023
11664C4187L19334H4340a67992B97516c7653A77670C3294J14278a9921A20442
11653a43632A77444C850a13474A54528k008O9006j5325r4359c9190j15235B2915
11641F8277a11696o533I7224J46710a45629b7433k54383o2431c6275a4895d629
$$ y = [58956, 117209, 271743, -250752, 187861, 249435, -175999, 226117, -58120, 171516, 178236, 158879, 182272, 61535, 134340, -22504, -11366, 127371, 160639, 216292, 54117, -225210, 251063, -316228, -47870, -65857, -90863, 83136, 1790, -135324, 276452, 57250, 351159, 140607, -59864, -10512, -30248, -191631, 535463, 186133, 158167, -98845, 57187, 190462, 147662, 14523, 200832, 22239, 609, 54275, -143365, -93372, 172404, -42150, -93075, 336062, 57210, 34187, 353521, 84340, -167992, 297516, -37653, 177670, 33294, 147572, -19921, 120442, -143632, 177444, 3850, -113474, 154528, 152520, 221526, 206201, 111842, -39190, -154425, 22915, 68277, -111696, -118229, 97224, 243934, -145629, -27433, -281816, -344247, -36275, -14895, -4629]
11629H9944b19222G9663b38977A22614o0097b61982L6100A15568a31717A506Q8579
11618I0085J80573g3343j9998A2486a24775b6464E0510K2223j8391J21917a18936
11606G9041b05229A4298M98162b5457j7259L342C07093j09233K78505a42593A1610
11594B68082i671I4254i0914o7647B21789M945p8860J6734o7672N2780g8199A74323
11581C13934a65635e503j88176B54430a53094A82041L6967i7956A41582l2182
11571A09400c47669J24830f9641A6638J27324i0135A22252C5154H784R4479b9629
11559f7197l3280L3892k8239r9480C88476c28428A01977J06237g237C14345A17665
11547H565b6317q7406K4573B14193C5896a61705A4758J47831o3916R9417I063
$$ y = [89944, -219222, 79663, -238977, 122614, 62517, -261982, -225882, 115568, -131717, 1506, 90085, 270658, -73343, -93341, 12486, -124775, -26464, 50510, 72733, 54342, 176259, -118936, 79041, -205229, 14298, 512460, -25457, -42716, -39374, 307093, 197860, 476365, -142593, 11610, 268082, -9671, 94254, -90914, -158561, 221789, 226734, 147874, 164608, 96936, 149716, -78199, 174323, 313934, -165635, -5503, -193679, 254430, -153094, 182041, 219008, -97956, 141582, 109400, -347669, -222839, -69641, 16638, 143962, -90135, 122252, 35154, 8784, 103263, -29629, -67197, -100477, -66585, -94824, -194304, 388476, -328428, 101977, 208214, -7237, 314345, 117665, 8565, -26317, -113723, -89150, 214193, 35896, -161705, 14758, 162589, 98673, 198090, 9063]
11535b43311A96309G9749g1109F6290J32702F8031i7563n3873I1610d2284B05179
11523B12286g1140J3127B75796i5010B02672b17934B44186F6892P8655J24771
11513B70318a48528C6451M38819D2765L6211K94888G9138h651A33746F6851k6059
11502D0792a8032j88257A04263q97N778J79168j21980K64370H3988L22172D9052
11490d9563D927J3320f0356A92868q7807J21466P8365h6500B1911N9458J39334
11479B20703b018B33550F4987b93270B88843D6504b8854C2878R6033C2397L8685
11468G1082K42529A43767K49085a0378m9406l2261A36073P7071C6776g2442j65603
11457b38045C08070D0254Q5729a29888D52333c3228F7445M9725L9845D0120O650
$$ y = [-243311, 196309, 79749, -71109, 66290, 198992, 68031, -97563, -151436, 91610, -42284, 205179, 212286, -71140, -58013, 275796, -95010, 202672, -217934, 244186, 66892, 145547, 270318, -148528, 36451, 475270, 42765, 78976, 373864, 79138, -8651, 133746, 66851, 40792, -18032, -206289, 104263, 103366, 109144, 288312, 166332, 430702, 83988, 406160, 49052, -49563, 4927, 18247, -60356, 192868, 105061, 226527, 304892, -86500, 21911, 81369, 220703, -2018, 233550, 64987, -293270, 288843, 46504, -28854, 32878, 128911, 32397, 71082, 313611, 143767, 392852, -10378, -59784, -92045, 136073, 213144, 36776, -72442, -238045, 308070, 40254, 125983, -129888, 452333, -33228, 67445, 117170, 157015, 40120, 46770]
11446D6770g9602A92671G9597J84357f9806j04247A47680J03881b5574A4044g1242
11434B9353M3003b21546A00274K35601E0464J48055G4630L240N496l2759b6353
11422a46436l2595K5590A36253a41355I0583c7053n50985B77605A09932c0528
11411A22028o0470b1708C2625R8224b49091l7453A1683e1885A64310j0113J52970
11400C07167F1783a23477M7601m9353A31373J16243b01837a2387A25507n1304
11390G4203Q767d7189m8719C75062f2289B31724b22281Q6097D46565B19902o9760
11379A50142l3842K22679g311B06036I8160a7759C42641b11382A814K53682B0732
11367e481B9399J91485J94385e0508A79218d96572b27697B65772a05009a4974
$$ y = [46770, -79602, 192671, 79597, 263954, -69806, -174053, 147680, 251561, -25574, 14044, -71242, 29353, 72356, -221546, 100274, 335875, 50464, 198519, 74630, 77870, 83366, 50607, -26353, -146436, -179031, -153441, 136253, -141355, 90583, -37053, -588038, 277605, 109932, -30528, 122028, 61558, -21708, 32625, 130849, -249091, -286544, 11683, -51885, 164310, 154197, 307167, 61783, -123477, -75876, -125229, 131373, 247616, -201837, -12387, 125507, 74203, 82970, -47189, -95908, 375062, -62289, 231724, -222281, -136184, 446565, 219902, 150142, 116300, 338979, -7311, 206036, 98160, -17759, 342641, -211382, 1814, 255496, 20732, -5481, 29399, 220884, 415269, -50508, 179218, -496572, -227697, 265772, -105009, -14974]
11356A13116B6462M8377P9321a78384G455L2919b09865O8350P550E769K2662a34585
11343A33269a572A89268J64051d0413H0003d8918C97524e5827n7362b8268n7580
11332h5848B5408a0389l05893B10927F0733Q1849c6832A60691b96137B11345D6425
11320e5101J4840E5615b6724j03399B07067b19568E9083j3207K58416g7632j10432
11309a88064g8775A63740a49186N7253K6294D30082c1521j48034b4251j39741
11299a63992p2751a17449c9433B07433a31830m21394K54246J08932Q2168B0320
11288F2669f3256A54041b01734A22146b2567A90949a8478A97197K36664i6668
11277B0660J36507a11916L095B24140C922a26552j0118A21345d2642A97055a2721
$$ y = [113116, 26462, 74839, 154160, -178384, 7455, 40374, -209865, -141515, -133965, 5769, 28431, -134585, 133269, -1572, 189268, 353319, -40413, 80003, -48918, 397524, -55827, -113189, -28268, -85848, 25408, -10389, -316282, 210927, 60733, 142582, -36832, 160691, -296137, 211345, 46425, -55101, -40261, 55615, -26724, -130123, 207067, -219568, 59083, 45876, 304292, -77632, -188064, -78775, 163740, -149186, -91933, -65639, 430082, -31521, -179555, -24251, -163992, -236743, -117449, -39433, 207433, -131830, -553224, -298978, -190046, -107878, 20320, 62669, -63256, 154041, -201734, 122146, -22567, 190949, -18478, 197197, 433861, -96668, 20660, 157167, -111916, -108821, 224140, 3922, -126552, -136670, 121345, -42642, 197055, -12721]
11265b48226A69339C3280c43449A36223J128I557a95238i2550m104L5346j16610
11254a77918k65948c8275k33491J15292l479M7293j1546J8162B88985q3884e0837
11242i956k653D11521e60992b37871o2045K3794l6379h6053B35661g287k23800
11231b31087A25749a70513j16845a33078A89919B8572J09158h6706a7218k5802
11221d3020b808j27720B39026h4720A46589b43793f4585l1944k11989f0614k02217
11210b62831i5916A22879K03262p1689a52240N125O9317B3607J509c33448J47020
11199a86428Q8735j08166b1875j69559L2377e1566l14911i6951B3031N2836R8
11188G5965K14423a51496E5501e6089l6113H53b49292B5511a91718B461b00120
$$ y = [-248226, 169339, 33280, -343449, 136223, 137351, 9557, -195238, -92550, -96654, -61308, -177918, -443866, -38275, -271766, -156474, -159953, -112660, -124206, -106044, 288985, 205101, -50837, -9956, -12609, 411521, -560992, -237871, -299916, -276122, -312501, -86053, 235661, -7287, -231087, 125749, -170513, -287358, -133078, 189919, 28572, 137730, -86706, -17218, -43020, -2808, -130528, 239026, -84720, 146589, -243793, -64585, -96529, -308518, -60614, -262831, -95916, 122879, 326141, 254452, -152240, -147115, -77798, 23607, 25116, -333448, -186428, -97693, -205859, -21875, -191434, -159057, -51566, -366477, -96951, 23031, 75867, 75965, 290388, -151496, 55501, -56089, -92202, 853, -249292, 25511, -191718, 2461, -200120]
11176a76676B0993f5108k11658J10738j40136D06891b36827A29989c71887a19181
11165d66464J36259C2610a0379A71190F5606K53924c22947F6500c89377a88486
11154A16191a02243h456j80882A71821a50661G3711B6699L0036J20076g7565j78337
11143b55902F5857a45202D3504d29354g8340J4299E8060a76600e8119j14995q053
11132a81167D00638H3219P5704a66593f6818E177J01752R3453o0236n8343K40208
11121C22011E0841J8022a60669A9927L5818b5761F7905J41135A4158b44846J09869
11110a34977l244o1361a8836B33305n452i8654B47984K42954H8768J86119i9308
11098a26162h83C50232K4009A42670L46506L3295A29265k1363r266K42735o9376
$$ y = [-176676, 20993, -65108, -276766, -166028, -306164, 406891, -236827, 129989, -371887, -119181, -466464, -330205, 32610, -10379, 171190, 65606, 319530, -322947, 66500, -389377, -188486, 116191, -102243, -8456, -189338, 171821, -150661, 73711, 26699, 56735, 176811, -77565, -255902, 65857, -145202, 43504, -429354, -78340, -64041, 58060, -176600, -58119, -173114, -181167, 400638, 83219, 158923, -166593, -66818, 5177, 106929, 200382, 140146, 81803, 322011, 50841, 68863, -160669, 19927, 55745, -25761, 67905, 209040, 14158, -244846, -134977, -138221, -199582, -18836, 233305, 227853, -98654, 247984, 490938, 88768, 274887, -99308, -126162, -883, 350232, 374241, 142670, 489176, 522471, 129265, 107902, 98636, 341371, 271995]
11087B71995j02702Q6910R9156j42196o2857a64091D2153G782L01049j46431D2661
11075B63955M0240m0709b5778A73399l8877P2410n3405N2391j0560J26074k7504
11064B93928J10374A98362P9032K5274L56076o7065j39646K06879L56805C85888
11053F00650N9022n0694J59524O9761q2408j59821K64080k77039J11767o2040
11043F32802j0854q2426P3318K59151R8963l35944M84457l63999J31815M5655
11033I32938j93694j17067m145n9563M28703m3306l38995L58468J78684J0517
11023A152540m18520B77094L04288j72442Q9577m4330n4620j68797K40392K81865
11013G53027C03307M88091k97565j22897K80765M9273L0685l28819M70817l64491
$$ y = [271995, 169293, 256203, 355359, 213163, 150306, -164091, 42153, 7782, 308831, 162400, 42661, 263955, 304195, 263486, -25778, 173399, 134522, 206932, 153527, 205918, 195358, 321432, 293928, 404302, 198362, 277394, 302668, 658744, 591679, 452033, 658912, 1015717, 385888, 600650, 659672, 608978, 768502, 838263, 755855, 596034, 860114, 583075, 694842, 632802, 621948, 539522, 612840, 871991, 970954, 635010, 1119467, 755468, 887283, 932938, 739244, 622177, 618032, 558469, 987172, 943866, 604871, 963339, 1142023, 1152540, 734020, 277094, 581382, 408940, 498517, 454187, 399567, 230770, 471162, 753027, 303307, 791398, 493833, 370936, 651701, 700974, 731659, 402840, 873657, 509166]
11003E09166j16353K36479r7425J12179k55266J42132N995J8858L35638k65317
10993F26086J91762K4472j51989J42544P4462r6621k09036M26190m19408J84654
10983G93116K98496j94248P2186J87595J46299l5999L74232j18921L9282M25286
10973A987324q0118O84962Q2952r5055K3494K01566j21918n10780k9143j37058
10963B006226m47882J41478q8402M7537R7661k32608j1344M30024j70179k77611
10953A494900j75837k00917N4070l9305k02374J98334m42500J1679A39421J25674
10943B65095K37988M3206F5950K0091K32821J096A34941J89063A03310K98570
10933D01880g9254F3942K20050p9871J11183C5942R263L31379d5434A18901c6191
$$ y = [509166, 392813, 629292, 531867, 644046, 388780, 530912, 536907, 555765, 891403, 626086, 817848, 842320, 690331, 832875, 907337, 810716, 601680, 1027870, 608462, 793116, 1091612, 897364, 969550, 1157145, 1303444, 1267445, 1641677, 1522756, 1562038, 1987324, 1907206, 2592168, 2675120, 2580065, 2603559, 2805125, 2683207, 2172427, 2143284, 2006226, 1558344, 1699822, 1611420, 1658957, 1756618, 1524010, 1512666, 1942690, 1772511, 1494900, 1319063, 1118146, 1172216, 1132911, 930537, 1128871, 686371, 698050, 139421, 265095, 503083, 546289, 65950, 86041, 318862, 319958, 134941, 324004, 103310, 401880, -79254, 63942, 283992, 204121, 315304, 35942, 45205, 376584, -45434, 118901, -36191]
10921B16379b34961q5707C51068b38410a00042q205G8090f2643m35331F027J83082
10910A89109l5518n5351k843a86148q5289a19589A89637d67288e4885k93565G548
10898H5064c1750A1494K62167d09033a34368j13715B94924a7526I1711D3204O1414
10887A04618D8510J82945G0082B7891J45473a09076C21056G1799k3339a88866
10876b8125k98915A4261J78635F4190C1421a73341K1069b2063A96157i7745C25029
10864b69111E839a60125e2589o9487N3530J4660j31896j1863j38661H1547J18582
10853B00129h8393a144k34757C18358A47317b43364E9451b95610C2324e7067j48039
10842b05106A98296a63511d632q3909R703G1151J34804a30048o5632C00422G5655
$$ y = [216379, -234961, -320668, 351068, -238410, -100042, -108247, 78090, -62643, -497974, 6027, 189109, 153591, 98240, 95397, -186148, -271437, -119589, 189637, -467288, -54885, -348450, 7548, 85064, -31750, 11494, 273661, -409033, -134368, -248083, 294924, -17526, 91711, 43204, 104618, 48510, 231455, 70082, 27891, 173364, -109076, 321056, 71799, 48460, -188866, -28125, -327040, 14261, 192896, 64190, 31421, -173341, -152272, -22063, 196157, -97745, 325029, -269111, 5839, -160125, -52589, -122076, -68546, -53886, -185782, -197645, -336306, 81547, 200129, -88393, -1144, -235901, 318358, 147317, -243364, 59451, -295610, 32324, -57067, -205106, 198296, -163511, -4632, -88541, -78838, 71151, 205955, -130048, -195680, 300422, 75655]
10830a39529J3502A83198C3183Q2179P723K14403i4645J5231F8012i3174A24404
10818g152B04037l4759b246B18080a62737L1130m7919c673r8487A61056a8485
10806A81450J0134j6771a21611G4176C2463c95752a83423j12124R4434j08653
10796c09766I8967N116J8143a89633A32426f3008F8074L6503n1461b26920A45317
10784A47437f5338B95918e1482n9331A94528k9576a25021k2494K9985c3231A35770
10772b10281M7464a1426k83225O0551A11558e9760J6253l42258J53687B5679f0289
10760f3786k02757A58774c46683f7736j39498b6299j5822k16565G3020g9110J7430
10749f1680n4678c6471A49895B8561J32503B0418a31373l2392q4091Q7500H8647
$$ y = [-139529, -126027, 183198, 33183, 115362, 123085, 337488, -94645, -79414, 68012, -93174, 124404, -7152, 204037, 169278, -2246, 218080, -162737, -131607, -179526, -3673, -102160, 161056, -18485, 181450, 191584, 174813, -121611, 74176, 32463, -395752, -183423, -295547, -201113, -309766, 98967, 104083, 122226, -189633, 132426, -63008, 68074, 104577, 53116, -226920, 145317, 147437, -65338, 295918, -51482, -110813, 194528, 164952, -125021, -147515, -117530, -33231, 135770, -210281, -162817, -11426, -294651, -234100, 111558, -59760, -43507, -385765, -232078, 25679, -60289, -63786, -266543, 158774, -346683, -67736, -207234, -26299, -42121, -258686, 73020, -79110, -61680, -116358, -36471, 149895, 28561, 161064, 20418, -131373, -163765, -247856, -160356, 88647]
10737d52868a09209k43788A28460a99532A41319B2090e4422H5804a39244j99091
10727c38335f988A37310j6563q431b13132K5162n7232A19234b41797A57792G666
10715A075g9763j10877B26075D8248a25271J0384j0619O2004j2971B0885a90727
10703a29227j02255C8626h5592p5182H8077B6521N8837e0214q3728H3960b11063
10691a45870k32392a30293A24261d6700j84426A6784C853e4406A7534b43426k091
10680b45517O8610Q4511L5266r2562P1662A81564g2569J8065F9725o545a79230
10668A34886D2613b36752a06231A33427e3030F766a02537K1025J6497A62814D1875
10656a91931M1346P2981j07744B36621b06098m3976A65943b39330R5430M5740
$$ y = [-452868, -109209, -352997, 128460, -199532, 141319, 22090, -54422, 85804, -139244, -338335, -6988, 137310, 120747, 112316, -213132, -187970, -245202, 119234, -241797, 157792, 7666, 1075, -79763, -190640, 226075, 48248, -125271, -114887, -125506, -63502, -76473, 20885, -190727, -129227, -231482, 38626, -85592, -160774, 88077, 26521, 85358, -50214, -133942, 83960, -211063, -145870, -378262, -130293, 124261, -46700, -231126, 16784, 3853, -54406, 17534, -243426, -245517, -176907, -92396, -57130, -149692, -78030, 181564, -72569, -54504, 69725, 63180, -179230, 134886, 42613, -236752, -106231, 133427, -53030, 6766, -102537, -81512, -65015, 162814, 41875, -191931, -150585, -77604, -185348, 236621, -206098, -250074, 165943, -239330, -143900, -98160]
10646i8160I789c20995a4605n1889p957j65392P1990q0172f0936R465I050K66238
10634B75288D65g6202n1180F9374N7925B6115c48685D5816b03842A4472a94570
10622B07612l4950c04939J47851J7502e4693A73619l1819a87464A95095h2772
10611D29081j44810j09603D8255K06313J94543A44807a50934P3549B98782a4814
10600d1087A2605J85942o9240c03949A64839a85710B53330c52992B0898O3115
10590H4013g9551D3123a94370C86686e1374m4247j17013B91117a69653k70950
10580d40603d8592p5637C23362i4739G0020P966f5756J6712m21591K07330R6159
10569a67146l4524D8055J75238A7073R6877a14558M3664A75224i2599L6489b6030
$$ y = [-98160, 9789, -320995, -14605, -66494, -74451, -239843, -167853, -248025, -60936, -51471, 9050, 275288, 465, -76202, -127382, 69374, 127299, 26115, -348685, 45816, -203842, 14472, -194570, 207612, 172662, -304939, -157088, -139586, -54693, 173619, 141800, -187464, 195095, -82772, 429081, 284271, 174668, 48255, 254568, 449111, 144807, -150934, -77385, 298782, -14814, -41087, 12605, 198547, 129307, -303949, 164839, -185710, 253330, -352992, 20898, 84013, -79551, 43123, -194370, 386686, -51374, -95621, -212634, 291117, -169653, -440603, -48592, -124229, 323362, -94739, 70020, 77986, -65756, -49044, -470635, -263305, -167146, -201670, 48055, 223293, 17073, 113950, -114558, -70894, 175224, -92599, -56110, -26030]
10557b89730d5200q584K1869j58616f5160k3674K8770b1279k54277b9211p7372
10546a06583A8264a27007r3246A00911B2786e2962F6836K82a522A08557c51083
10534B9504b70772A10949e0374j43000f2074j02264F5004K79781h26k6580C12070
10522B634K99705a47525m0204P7805j02944K5889h7908p5674B6377h7653c5211
10510G4102h2102B30711D8339n462O4208a89114H5613M9172h5979L5767A9972
10498B84184a32954c6275n7549j51329j13732h7193A13727c91973R1829A40671
10487D33751A30391i9863b6980A94775n8615L20337j41878K3812O5705K87869
10477F92005B28808m3948K32876a535B29194I0512k3244P511i7227k74787B28012
$$ y = [-289730, -45200, -53784, -31915, -190531, -65160, -88834, -60064, -21279, -275556, -29211, -106583, 18264, -127007, -220253, 100911, 22786, -52962, 66836, 67118, -1522, 108557, -351083, 29504, -270772, 110949, -50374, -193374, -62074, -164338, 65004, 344785, -826, -27406, 312070, 2634, 302339, -147525, -187729, -109924, -212868, -186979, -87908, -163582, 26377, -87653, -35211, 74102, -82102, 230711, 48339, 42877, 107085, -189114, 85613, 134785, -85979, -50212, 19972, 284184, -132954, -36275, -93824, -245153, -358885, -87193, 113727, -391973, -300144, 140671, 433751, 130391, -99863, -26980, 194775, 136160, 456497, 314619, 338431, 404136, 692005, 228808, 184860, 417736, -1535, 229194, 90512, 67268, 74779, -97227, -372014, 228012]
10465B51533B1494K83615o9388A6311K90609A255d0433G6438C5559b68434m2642
10454c11076J33215n2580A24495d3264C40676a21121A09147B8448j2145a25441
10443h0185a1675r1379J5694a2977G5294l4708J59770d295D7366A216K8432P3294
10431A02942e03450A05402L8711g7957A43940h7531K2285G7717b53446R2210j87825
10420c49061A93497K3690L3567j23245f1847A8497a12752B81821e3551A850f0600
10408a3016j30262q7543B76682c03962A56353b41210j48980c3715B07118d7548
10397I3229q420a45016B65769d75767D4914K36875m4344J31801d4521A49060N931
10386A54991L6542c0278r1652B26236j09621j9458b60936b2046D9281K54860e4221
$$ y = [251533, 21494, 305109, 235721, 16311, 306920, 1255, -40433, 76438, 35559, -268434, -311076, -177861, -230441, 124495, -43264, 340676, -121121, 109147, 28448, 16303, -125441, -80185, -11675, -103054, -87360, -12977, 75294, 40586, 200356, -4295, 47366, 1216, 29648, 102942, -503450, 105402, 144113, -77957, 143940, -87531, -65246, 77717, -253446, -161236, -349061, 193497, 217187, 250754, 127509, -61847, 18497, -112752, 281821, -53551, 1850, -60600, -13016, -143278, -230821, 276682, -303962, 156353, -241210, -390190, -33715, 207118, -47548, 93229, 84809, -145016, 265769, -475767, 44914, 281789, 237445, 369246, -44521, 149060, 154991, 191533, -30278, -121930, 226236, 116615, 97157, -260936, -22046, 49281, 304141, -54221]
10374B26808K80214A30951n1765J33860o0721l66j0284L66716J0330J02945B92161
10362g2037D80839k10664J84755A54290M0430b008A98046P1965m0431c10721a140
10350E44743A82214O36324B59273L36671a76347C56550r2845J81444M3603L6144
10340E24896A01219Q5536q6025J03541o3852P6832i7990F1006j8324K69951a33827
10328A08326N3000b66758A41518J54518P8811A29052d7897O749A25861R0656c9317
10316B87117d9316H9228K05941R8510A71775f5286B33856E9978Q6431J24578d7809
10304a77448Q1960B51288I9878a76546j40093a713j43612B80925c27856a60962
10293C16998d4395D08592d14039H0472c44623A49065a47338C2847b01300f1048
$$ y = [226808, 507022, 130951, 79186, 213046, 152325, 151959, 141675, 508391, 518721, 621666, 292161, -72037, 480839, 270175, 454930, 154290, 194720, -2008, 198046, 270011, 229580, -310721, -1140, 544743, 182214, 818538, 259273, 595944, -176347, 356550, 263705, 445149, 488752, 524896, 101219, 186755, 100730, 204271, 140419, 217251, -97990, 61006, 42682, 312633, -133827, 108326, 161326, -266758, 141518, 296036, 374847, 129052, -47897, -41148, 125861, 216517, -39317, 287117, -49316, 89228, 295169, 393679, 171775, -65286, 233856, 59978, 146409, 270987, -47809, -177448, -95488, 251288, 99878, -176546, -316639, -1713, -145325, 280925, -327856, -160962, 316998, -44395, 408592, -414039, 80472, -344623, 149065, -147338, 32847, -201300, -61048]
10282d9729A12447m3042J84968o0423a06915n5752j61261b3590I5798b32227E011
10270F9721D464L5465a31482E5220J14940a13177A88451h6318A01292K47992A19340
10258C01822m6950l4480L57359B81689o4826B5905J12090E728J05696a86565g7146
10246D9557J52515G8049J39447a49240D16476D4885b04897n4646l9038J36097
10236a62484C6305j2744J53122e0809A63840a09156p0762A55966C7280a82087
10225H0640a12620A37619B0592b39565r2382h9546D0961b30833g87n6823A46982
10213A63902a30363d8639b924E2996B1665L01891I6357A6542b3643q4255q6020
10202a93918L1055o340q2138I166J16068b36391B2354C827a41027K0890j17498
$$ y = [-49729, 112447, 69405, 254373, 193950, -106915, -162667, -323928, -23590, 95798, -232227, 5011, 69721, 4464, 39929, -131482, 55220, 170160, -113177, 188451, -86318, 101292, 349284, 119340, 301822, 254872, 220392, 577751, 281689, 216863, 25905, 137995, 5728, 111424, -186565, -77146, 49557, 202072, 78049, 217496, -149240, 416476, 44885, -204897, -259543, -298581, -162484, 36305, 23561, 176683, -50809, 163840, -109156, -179918, 155966, 37280, -182087, 80640, -112620, 137619, 20592, -239565, -331947, -89546, 40961, -230833, -787, -57610, 146982, 163902, -130363, -48639, -2924, 52996, 21665, 323556, 96357, 16542, -23643, -107898, -193918, -162863, -169203, -251341, 9166, 125234, -236391, 22354, 3827, -141027, -120137, -237635]
10191b37635E5457b22783J04276q7789c532n9238p8023j74432J35516A79960A1161
10179d5552k47746A56373b46988G5997d3163a1409H0952a82087A05016B927J45048
10168A47975a04739j02471h240j065k9068m21641B17116d0566A54421b01393A66875
10156b20110h7593O188B39590O4677e4405q9945J6184r1850A00114g2138C48640
10144a30427B62685a66331j96913a46733a645j93867o6252p1811A68987c11853
10133b69659h1889k1182j31686c2989k43270a2450C679K67566N0035c79962J68210
10122b11752i0784C381J00283a80132b3274B90516d20001a42144l0300o5551H0911
10110A11803a53452g2679B55932C3274g7333C07038a91637p6612K0053j46486
$$ y = [-237635, 55457, -222783, -118507, -206296, -3532, -62770, -140793, -315225, -179709, 179960, 11161, -45552, -293298, 156373, -246988, 75997, -43163, -11409, 80952, -182087, 105016, 2927, 147975, -104739, -207210, -8240, -9305, -38373, -460014, 217116, -40566, 154421, -201393, 166875, -220110, -87593, -81405, 239590, 304267, -54405, -144350, -128166, -220016, 100114, -72138, 348640, -130427, 262685, -166331, -363244, -146733, -1645, -195512, -261764, -333575, 168987, -311853, -269659, -81889, -103071, -234757, -32989, -276259, -12450, 3679, 271245, 321280, -379962, -211752, -90784, 3381, 103664, -180132, -23274, 290516, -420001, -142144, -172444, -237995, 80911, 111803, -153452, -72679, 255932, 33274, -77333, 307038, -191637, -268249, -248196, -394682]
10100c94682b9154j64020K5305I6538b72555e6937F2434J34635F0705a94427n3630
10089b48057N4950o576j46397J39707l4709B5290f0659C21038M6056a52812M3883
10078a08929C8697J29880i8388F3460B1025a55392G0132f505p3433k58598j1297
10067c49833J5548F2780c82800a03643L2044r9995m8480J05896A8040g4920A10446
10055c9872j98021A6509a16523j18766i7939j40355i4095c0314k51931n3713G1063
10043b7368D8697g3058b2395l2852J0341j4273B0333L3044a13952a4250j22609
10032a36859k04243J39938p3600g5169A43459a82711O2323L6199b9877k89954
10022c19831A08269b21852k57113m7235e8473k26574D0189J0425j0797h00j2008
$$ y = [-394682, -29154, -193174, -167869, 96538, -272555, -56937, 62434, 197069, 60705, -194427, -248057, -193107, -199683, -346080, -206373, -241082, 25290, -60659, 321038, 367094, -152812, -108929, 38697, 168577, -98388, 63460, 21025, -155392, 70132, -6505, -79938, -338536, -349833, -334285, 62780, -382800, -103643, -71599, -171594, -220074, -114178, 18040, -74920, 110446, -39872, -237893, 16509, -116523, -235289, -97939, -238294, -94095, -30314, -282245, -335958, 71063, -27368, 48697, -73058, -22395, -55247, -44906, -59179, 20333, 53377, -113952, -14250, -136859, -341102, -201164, -274764, -75169, 143459, -182711, -120388, -84189, -29877, -319831, 108269, -221852, -478965, -526200, -58473, -285047, 40189, 50614, 39817, -800, -12808]
10011a2808B28368a66670G5492f6088m5638B44866c66640E8354K4209a87326L6209
10000a51117A15028g208D6N9398B7177A0517J22996a62822A61128b76319A08218
9988A24805Q6180F191a82479A20630d73035J65643a51662n8509d5486j59266A4499
9976h5424n0985A95207c56721a29137j8321M8D2191a24448I2969b36127Q4797
9965a51330L3785C154L8236c63587b7667j24314i161G0008R5841b15141A51852
9953g7875E8305a77034H3773L5432d4564A95037a96150g47k48779f9360k4228
9942i3588H4231b49885O4311h4620G2346L5905i3242L4808j89587O3692L8906
9931a45423P1921B53176I6624J5307b16446A49839e0369j4164m8879c0999m08672
$$ y = [-12808, 228368, -166670, 75492, -66088, -111726, 244866, -366640, 58354, 82563, -187326, -151117, 115028, -7208, 46, 59444, 27177, 10517, 133513, -162822, 161128, -276319, 108218, 124805, 210985, 6191, -182479, 120630, -473035, -307392, -151662, -210171, -45486, -204752, 14499, -85424, -136409, 195207, -356721, -129137, -147458, -147410, 42191, -124448, 92969, -236127, -151330, -117545, 3154, 41390, -363587, -27667, -151981, -9161, 70008, 165849, -215141, 151852, -77875, 58305, -177034, 83773, 119205, -44564, 195037, -196150, -747, -249526, -69360, -93588, 84231, -249885, -185574, -84620, 72346, 108251, -93242, -58434, -248021, -184329, -145423, -73502, 253176, 96624, 111931, -216446, 149839, -50369, -64533, -113412, -30999, -439671]
9920d39671K10277f5070j50436Q2039e7181j85195A53289b17970B1487b55348
9909b7076j00395A84451a33914L9361A1787f3311j16406A24830C0455p144c74847
9897A13671M9850b64759A22581a14586e6257B87500A39385b03199A56812a86854
9886b22629M7223l2354A72370c7762j16858G2438l0810J42110c82194E8713k6355
9875C2358J555K33P4810a27592d2312k52114j40146A66802h3245J7905j27306
9864a92646O121d9144A85846k3334c0740J5169o6404n0597d1440j10872O7192
9853h5120k93453b9877B07732o530I0745o414c6296a7518B58389c58657G5802
9841d10164G6226P993N3372i2385b3692r911A39837a41392C0314a01207r1462
$$ y = [-439671, -229394, -65070, -215506, -133467, -57181, -242376, 153289, -217970, 21487, -255348, -27076, -127471, 184451, -133914, -94553, 11787, -63311, -179717, 124830, 30455, 23311, -374847, 113671, 163521, -264759, 122581, -114586, -56257, 287500, 139385, -203199, 156812, -186854, -222629, -175406, -207760, 172370, -37762, -154620, 72438, 41628, 183738, -382194, 58713, 32358, 33913, 34146, 108956, -127592, -42312, -294426, -434572, 166802, -83245, -65340, -192646, -186525, -49144, 185846, 162512, -30740, -15571, -81975, -132572, -41440, -152312, -85120, -378573, -29877, 207732, 201202, 90745, 84331, -36296, -17518, 258389, -358657, 75802, -410164, 76226, 84219, 137591, -92385, -23692, -33603, 139837, -141392, 30314, -101207, -192669]
9830a92669a9235m38594F8619A2821c09237m6729j20831a67448A00808J06079
9820B06887c80551e1053m17179h954E4687b16829A49187f6746a4746j0812j97536
9809b23094a09621K1562l06591C6045M1669b17915k10481d8310B84128c1591j16493
9798a48084j12914F6551J58795f5025j45263q1967R8860g9322E7597c10536A20929
9786b21816A29123g4840A2313b5652A29027c7884j26908g0072A79133h9763j51917
9775b41680R9620K3235c7415k38886j41966h2656c3060B35358i615A77701D2242
9763a04102A13452c47683c7712j8406j93761J13482L3840A36178c47037F9617
9752b24882P880G0413B2848e2544k45081A17723a12175k38938i8960R463D5352
$$ y = [-192669, -19235, -457829, 68619, 12821, -309237, -355966, -476797, -167448, 100808, 206887, -380551, -51053, -468232, -8954, 54687, -216829, 149187, -66746, -14746, -25558, -223094, -109621, -88059, -394650, 36045, 77714, -217915, -428396, -48310, 284128, -31591, -148084, -260998, 66551, 225346, -65025, -210288, -292255, -193395, -79322, 57597, -310536, 120929, -221816, 129123, -74840, 12313, -25652, 129027, -37884, -164792, -70072, 179133, -89763, -241680, -142060, -118825, -37415, -276301, -418267, -82656, -33060, 235358, -9615, 177701, 42242, -104102, 113452, -347683, -37712, -56118, -249879, -136397, -102557, 136178, -347037, 69617, -224882, -217002, 70413, 22848, -52544, -297625, 117723, -112175, -351113, -98960, -89497, 45352]
9740a21574m7467C2382a11625r7961d1258B78900a39447F2207L8516d4495j4896
9729e9391j47092C0745e2369A58314n8250a98150A77408A7055J31122a7320K047
9718a5273j12772d4517j52942f6131A70631C8749a43360A2749J18260a0302j64394
9707a74696P7132B98329a98766K2335A5777b12562K5784E4386j6328P0243N6858
9696A65159c47636A22950j2434a00120i78r4319k43423d5483B3524i1999j62863
9685b54862h6651M1332j65263f8751j32811a6677j61574j56267C09400a87747
9674b08761J5185A57811a00202o4067A09743a7693A49667a42444A15172m7771
9664F7401P5590f9117a7639j03854A0352J59292m7804d38974A14009n4887h0943
$$ y = [-121574, -169041, 32382, -111625, -209586, -41258, 278900, -139447, 62207, 100723, -44495, -59391, -206483, 30745, -52369, 158314, 100064, -198150, 177408, 17055, 148177, -17320, -15273, -128045, -44517, -197459, -66131, 170631, 38749, -143360, 12749, 131009, -10302, -174696, -97564, 298329, -198766, -176431, 15777, -212562, -186778, 54386, 38058, 108301, 165159, -347636, 122950, 110516, -100120, -978, -95297, -338720, -45483, 23524, -91999, -254862, -86651, -45319, -210582, -68751, -201562, -16677, -178251, -334518, 309400, -187747, -208761, -193576, 157811, -100202, -164269, 109743, -17693, 149667, -142444, 115172, 67401, 142991, -69117, -17639, -121493, 10352, 169644, 121840, -438974, 114009, 59122, -80943]
9652e6876j73419a05393E2878B1630P8277a93848n3142b3589R374k12442a5930
9640a87896f3353a9966j67973B4083M0957a11685G6128a97310H2980C94e8889
9628f372A86795n9626E985a24912j6414B02960q6074B5258N9121e867k15225j14445
9616c35537P0379E0813K39884c33738R5208C03666a4304j84419O3563K6565A4827
9604g5844j85014J3143J01134A42068e08133K22803P4885b4259j6820C4240f5686
9592A10662E0997b75912b7581l76741a38385C4232a5774k16697A1383J30874c98912
9580F7475a62552n2572h5924A1488a07932A34918a39162F531a78857j9135n7537
9569b55529A053J08329N4150F3544i7120I1445h3141F5200a74054j99043I1574
$$ y = [-56876, -230295, -105393, 52878, 21630, 99907, -193848, -246990, -23589, -14215, -226657, -15930, -187896, -63353, -19966, -187939, 24083, 65040, -111685, 76128, -197310, 82980, 394, -58889, -6372, 186795, 127169, 5985, -124912, -141326, 202960, 116886, 25258, 84379, -5867, -221092, -335537, -265158, 50813, 290697, -333738, -238530, 303666, -14304, -198723, -135160, -108595, 14827, -75844, -260858, -247715, -146581, 142068, -508133, -285330, -210445, -24259, -41079, 34240, -65686, 110662, 50997, -275912, -27581, -404322, -138385, 34232, -15774, -232471, 11383, 142257, -398912, 67475, -162552, -215124, -85924, 11488, -107932, 134918, -139162, 6531, -178857, -197992, -255529, 1053, 109382, 163532, 63544, -97120, 91445, -83141, 65200, -174054, -373097, 91574]
9557b59775F9323A027b74702A18690a40211H2379d3413A32959a9195o82A682d2983
9544A2663b60587E7987J20631p9256b42685d1412B01616a07907A72471J0690g1511
9532c67780A53975F245a29604A02817M1965g2597A02770c08227A43065L7536c21706
9520a31072A73622G6739c69249e7024C06314a22633B25828h0435n0230A3592b9686
9508b46041a17374a4618A39607b35854O6143l0679H384P8366b81103a39833j06232
9497b46065L9113F429K32115C2976K9120c2367A49370a63625c0917H8737f4320
9485I2271d104j9490o7753E6974g0609m603k9389j41090k65386G2280a86650N9554
9473a27096d6042j95105a07998j27072B17754d6933B8439f1546j77901J09715
$$ y = [-259775, 69323, 1027, -274702, 118690, -140211, 82379, -43413, 132959, -19195, -19877, 1682, -42983, 12663, -260587, 57987, 178618, 99362, -242685, -41412, 201616, -107907, 172471, 183161, -71511, -367780, 153975, 6245, -129604, 102817, 144782, -72597, 102770, -308227, 143065, 180601, -321706, -131072, 173622, 76739, -369249, -57024, 306314, -122633, 225828, -80435, -130665, 13592, -29686, -246041, -117374, -14618, 139607, -235854, -169711, -200390, 8384, 86750, -281103, -139833, -246065, -206952, 6429, 238544, 32976, 62096, -32367, 149370, -163625, -30917, 88737, -64320, 92271, -4104, -23594, -91347, 56974, -70609, -75212, -104601, -245691, -511077, 72280, -186650, -127096, -46042, -241147, -107998, -235070, 217754, -46933, 28439, -61546, -239447, -129732]
9463a29732N0096o8952J1545A35393b55271j22213B092L7203a09801n6809r4723
9452b61333O0026j89617e6682J1404j53458R2377B60325L8815b3598k32030L6838
9441b18790r650A63578c518D0962c6634D386b11674J0442R9330L5191l2586j77686
9429b76983d0408j73453c4071B4375a48292J9445m4493e0649j48234g4567r5832
9418a70399j60866A71241d17509B18978c06327d8375A33555d54656B79615d9740
9407b83732e1991G487K3504b1603g692A62558E183K51072i4689A797N700L2403
9395C9900M445b88749J29599L7141D3316a80687A08852J6862a51318F4417Q9701
9384A54118p1689J42519b0196D4178b65545B31311K2318r4042b13197g0136m5600
$$ y = [-129732, -79636, -148588, -137043, 135393, -255271, -377484, 2092, 39295, -109801, -166610, -261333, -201307, -390924, -56682, -45278, -198736, -106359, 260325, 299140, -23598, -255628, -218790, -228440, 163578, -3518, 40962, -36634, 4386, -211674, -201232, -101902, -66711, -99297, -276983, -40408, -213861, -34071, 24375, -148292, -128847, -173340, -50649, -198883, -74567, -170399, -331265, 171241, -417509, 218978, -306327, -48375, 133555, -454656, 279615, -49740, -283732, -51991, 7487, 30991, -21603, -7692, 162558, 5183, 256255, -94689, 1797, 7497, 39900, 44345, -288749, -159150, -122009, 43316, -180687, 108852, 125714, -151318, 64417, 154118, 82429, 224948, -20196, 44178, -265545, 231311, 253629, 159587, -213197, -70136, -115736]
9373a15736F6262g5525k40348H0510a7648j46467C21940F4884d6076j67648F5978
9361c08905G8971a0315k82409B57058F2149P9030a84592N782p4833M9842H5112
9349A1548J3211R8257C6145Q9439a16038k55528a10187j01B16378a82446g23r9937
9337a00660j18387Q7973l05221J67587k6332g3522j49284f5890j17510I34J79309
9326A80243A8707a58343j66913b0283K85A62646o1276a77079c0572B17182c01115
9314A21850b16484g1283g916n6828G136M976h2381j27906p6233a06796m35128
9303e41924b2949q4807B76828a07795A1467a00568d8314I8810a45018B6460d4300
9291A1269a52179b4267j16608J6353D0580N6992J63670E0797c6906k9435D7749
$$ y = [-115736, 66262, -75525, -315873, 80510, -17648, -164115, 321940, 64884, -46076, -213724, 65978, -308905, 78971, -10315, -292724, 257058, 62149, 141179, -184592, -178810, -253643, -203801, 85112, 11548, 24759, 123016, 36145, 125584, -116038, -371566, -110187, -110288, 216378, -182446, -723, -100660, -219047, -131074, -436295, -268708, -295040, -73522, -222806, -65890, -183400, 934, 180243, 18707, -158343, -325256, -20283, -19998, 162646, 101370, -177079, -30572, 217182, -301115, 121850, -216484, -71283, -7916, -64744, 7136, 12112, -82381, -210287, -286520, -106796, -541924, -22949, -107756, 276828, -107795, 11467, -100568, -48314, 98810, -145018, 26460, -44300, 11269, -152179, -24267, -140875, -124522, 40580, 97572, 261242, 50797, -36906, -66341, 47749]
9279a33331f0718K0290D99J87962C3227b22662i3236H2246f7063B16310b1582
9267e1930G6959i9989A03614A7887J30491e2393A5591a6075A82644j6594o1728
9256A04322b18475h0907r075f073k16309g2314A76264b05951A34115i265m3823
9245e3088j31370k08546f851m1249j39633I9461a44420C7144J39810a8351k29920
9234b48271N7110L5688P3549j52337A37502G295K2812Q1370a75072l16945K20765
9223b71252B01532B8771a96944Q6394c2919j01227m8289B8430a55800K9678o3012
9212a89134f9001B561a02300o1300b3172j09319d1211q6685j74218a33393m33166
9201e66559h6614C59817A64509a27241h98k31745i9618j27993G847b49016j44581
$$ y = [-133331, -60718, -40428, 499, 188461, 33227, -222662, -93236, 82246, -67063, 216310, -21582, -51930, 76959, -99989, 103614, 17887, 148378, -52393, 15591, -16075, 182644, 166050, 104322, -218475, -80907, -89982, -6073, -222382, -72314, 176264, -205951, 134115, -9265, -53088, -184458, -393004, -6851, -48100, -187733, 99461, -144420, 37144, 176954, -18351, -248271, -191161, -155473, -81924, -234261, 137502, 7295, 30107, 111477, -175072, -492017, -271252, 201532, 28771, -196944, -110550, -32919, -134146, -182435, 28430, -155800, -126122, -189134, -69001, 2561, -102300, -163600, -23172, -132491, -41211, -127896, -302114, -133393, -566559, -86614, 359817, 164509, -127241, -898, -232643, -99618, -227611, 7847, -249016, -393597]
9190c93597O1153J03868I2442C9968l770a93727O1863b3514k10718c0523C8004
9178f2238r6302d9434k19199D2738b16012O0093A22775c11699J41018g940j94237
9167b02177a8737A34883g3741F5921B1021M03152f4066B7266c42354J3616a20393
9155A89707b84001a41637a752l18944h6374l79892J07777e9824G718e4720F7022
9143F0534E419i4106B0884h3939l06002I9974b18544A1898a79907j5402C46960
9131B54405b11410A06785A5743a5301k54019A67557a14366G3785d41507b17275
9120B76839a29726d0194A75137D5697K1932a72787k29827A39723Q74c18228d2858
9108b79113A69372a09786A66321a24347C40001a73398g135n5182A44235g0825
$$ y = [-393597, -332444, -228576, 92442, 39968, 36198, -193727, -131864, -23514, -234232, -30523, 38004, -62238, -158540, -49434, -268633, 42738, -216012, -155919, 122775, -311699, -170681, -7940, -202177, -18737, 134883, -73741, 65921, 21021, 424173, -64066, 27266, -342354, -328738, -120393, 189707, -284001, -141637, -1752, -320696, -86374, -466266, -358489, -59824, 7718, -54720, 67022, 60534, 5419, -94106, 20884, -83939, -389941, 99974, -218544, 11898, -179907, -195309, 346960, 254405, -211410, 106785, 15743, -15301, -269320, 167557, -114366, 73785, -441507, -217275, 276839, -129726, -40194, 175137, 45697, 67629, -172787, -402614, 139723, 140597, -318228, -42858, -279113, 169372, -109786, 166321, -124347, 340001, -173398, -7135, -62317, 144235, -70825]
9097b03865P3373B65964a54357N7947C07875b07715C3975Q1843J22243a24460
9086A65412J98163j76192N4826j0985i396A16354d7372k17778P0515A0434N292
9075A5726J33958b53042I8335J58422k1885e5092G5601a14991M0004A17619b15696
9063h3777A50268f6110o84p4207L3109p3949M0496b145k03214G2330j3819L09004
9051C67515a6884j31289b0242A30915F569a76506E0724J756a79208L0534A1053
9039E1075b31366H8950J10797d5235E1497k4824c26710j16549A48413n9883a27400
9027b24416A2185c06365J38683q0177A63994a80858C2154b45899a00386A23547
9016a89089o7164d7169D4796i2395K9374F374K05812a52976M9706B01406a88258
$$ y = [-203865, -130492, 265964, -154357, -96410, 307875, -207715, 33975, 115818, 238061, -124460, 165412, 363575, 187383, 242209, 231224, -9396, 116354, -47372, -265150, -194635, 10434, 15726, 149684, -253042, 98335, 256757, 234872, -55092, 75601, -114991, -74987, 117619, -215696, -83777, 150268, -66110, -66794, -141001, -107892, -181841, -141345, -2145, -205359, 72330, 58511, 367515, -16884, -148173, -20242, 130915, 6569, -176506, 50724, 52480, -179208, -148674, 11053, 51075, -231366, 88950, 199747, -45235, 51497, 26673, -326710, -443259, 148413, 88530, -127400, -224416, 12185, -306365, -167682, -247859, 163994, -180858, 32154, -245899, -100386, 123547, -189089, -256253, -47169, 44796, -92395, -63021, 6374, 212186, -152976, -103270, 201406, -188258]
9004C9476c95588N2408g78B5408b98756p0023A03289h5093j95666I8645M9271
8993A47916a22094M1107n516q4214j07845A5423d0457p3362e314D5647J76136
8982B21783a99141b1573j30368A90895h5196K5264r9325G5906b53324J14679B16146
8970f3038j86154B5766d6486A59056a19505G8578j7631L4598N9468a21053A41707
8958a94817K2636N6961A98220a01757B12824D1377a19401C8680a71010p4851I6672
8946B9778a8997j21864c7083A25637a09769k994q8765H8859a2904A466d4798A53730
8933B77079G4898b90895A4037R1872J2802a26027A3766K53909j5767J81995M18618
8922H52521K545929J1562189E199986C67751H7083C3326K21438E1926M6863k7430
$$ y = [39476, -395588, -343180, -778, 25408, -298756, -368779, 103289, -85093, -280759, 98645, 147916, -122094, -80987, -86503, -170717, -278562, 15423, -40457, -113819, -5314, 45647, 221783, -199141, -21573, -151941, 190895, -85196, -59932, -159257, 75906, -253324, -138645, 216146, -63038, -249192, 25766, -46486, 159056, -119505, 78578, 60947, 95545, 155013, -121053, 141707, -194817, -172181, -115220, 198220, -101757, 212824, 41377, -119401, 38680, -171010, -245861, 96672, 29778, -18997, -140861, -37083, 125637, -109769, -112763, -201528, 88859, -12904, 1466, -44798, 153730, 277079, 74898, -290895, 14037, 105909, 118711, -126027, 13766, 267675, 251908, 433903, 852521, 3398450, 14960639, 5199986, 367751, 87083, 33326, 254764, 51926, 98789, 71359]
8912G1359a94136r228f3453j32924B20932j3362b6154n5604C8209a57532E7703
8900b74894B68069q234a69877g7492o2463C14539E1126n487c4326A91854d5062
8888e6675F292h2279B7048a26989A3935J3024c31894B5612a61148I7993c54180
8876h5743k55778L1292e0081j73648F2055a33399C662b07521k1810L2285j39669
$$ y = [71359, -194136, -203364, -63453, -196377, 220932, 207570, -26154, -81758, 38209, -157532, 57703, -274894, 268069, 259835, -169877, -77492, -139955, 314539, 51126, 45639, -34326, 191854, -45062, -56675, 6292, -82279, 27048, -126989, 13935, 26959, -331894, 25612, -161148, 97993, -354180, -85743, -341521, -310229, -50081, -223729, 62055, -133399, 3662, -207521, -229331, -197046, -336715]
$$ [...]
##END NTUPLES=NMR SPECTRUM
##END=
