
##TITLE=UV1282_M1_1242-1388_70_7534403_EDVj0BgeuQ
##JCAMPDX= 6.0         $$ Bruker NMR JCAMP-DX V2.0
##DATA TYPE= NMR SPECTRUM
##DATA CLASS= NTUPLES
##ORIGIN= BRUKER
##OWNER= Administrator
$$ 1.72 TOPSPIN		Version 2.1
$$ 2013-02-22 01:39:43.273 -0500  Administrator@X
$$ Compression mode = diff/dup
##.OBSERVE FREQUENCY= 400.02188249412
##.OBSERVE NUCLEUS= ^1H
##.ACQUISITION MODE= SIMULTANEOUS (DQD)
##.ACQUISITION SCHEME= undefined
##.AVERAGES= 64
##.DIGITISER RES= 22
##SPECTROMETER/DATA SYSTEM= spect
##.PULSE SEQUENCE= noesygpps1d.comp
##.SOLVENT NAME= COFFEE_meoh
##.SHIFT REFERENCE= INTERNAL, COFFEE_meoh, 1, 14.9613
##AUDIT TRAIL= $$ (NUMBER, WHEN, WHO, WHERE, PROCESS, VERSION, WHAT)
$$ ##TITLE= Audit trail, TOPSPIN		Version 2.1
$$ ##JCAMPDX= 5.01
$$ ##ORIGIN= Bruker BioSpin GmbH
$$ ##OWNER= Administrator
$$ $$ E:\/data/COFFEE/nmr/UV1282_M1_1242-1388_70_7534403_EDVj0BgeuQ/12/pdata/1/auditp.txt
$$ ##AUDIT TRAIL=  $$ (NUMBER, WHEN, WHO, WHERE, PROCESS, VERSION, WHAT)
(   1,<2013-02-22 01:39:36.838 -0500>,<Administrator>,<X>,<go>,<TOPSPIN 2.1>,
      <created by zg
	started at 2013-02-22 01:28:06.772 -0500,
	POWCHK enabled, PULCHK disabled,
       configuration hash MD5:
       86 BA 57 50 F2 9D 5C 9B 26 00 A9 28 5F 66 2E 89
       data hash MD5: 64K
       BE 42 36 C7 BB 00 58 A6 20 97 78 F4 06 3B 2F 99>)
(   2,<2013-02-22 01:39:40.224 -0500>,<Administrator>,<X>,<proc1d>,<TOPSPIN 2.1>,
      <Start of raw data processing
       efp LB = 0.3 FT_mod = 6 PKNL = 1 PHC0 = 0 PHC1 = 0 SI = 128K 
       data hash MD5: 128K
       DA C9 E4 06 93 A0 F2 12 DF 37 AF 15 D6 79 26 BC>)
(   3,<2013-02-22 01:39:41.420 -0500>,<Administrator>,<X>,<proc1d>,<TOPSPIN 2.1>,
      <pk PHC0 = 249.9719 PHC1 = 0 
       data hash MD5: 128K
       64 91 CD 25 28 3E 48 1E 89 A0 A0 56 32 82 50 4E>)
(   4,<2013-02-22 01:39:42.195 -0500>,<Administrator>,<X>,<proc1d>,<TOPSPIN 2.1>,
      <abs ABSG = 1 
       data hash MD5: 128K
       91 DD 58 8B E4 F0 82 5C 5E DB E2 C0 FF 11 AC C5>)
(   5,<2013-02-22 01:39:42.381 -0500>,<Administrator>,<X>,<proc1d>,<TOPSPIN 2.1>,
      <abs ABSG = 2 
       data hash MD5: 128K
       24 78 E4 CD A4 9D E0 37 13 5D 3C 5B 2F 70 A4 EF>)
(   6,<2013-02-22 01:39:42.566 -0500>,<Administrator>,<X>,<proc1d>,<TOPSPIN 2.1>,
      <abs ABSG = 3 
       data hash MD5: 128K
       72 26 36 14 0B C8 6C CF 89 FD 92 F8 60 CD 15 3C>)
(   7,<2013-02-22 01:39:42.734 -0500>,<Administrator>,<X>,<proc1d>,<TOPSPIN 2.1>,
      <abs ABSG = 4 
       data hash MD5: 128K
       5F 63 4C FB 43 AC 40 4E EB A7 E6 F7 9A 05 3E 56>)
(   8,<2013-02-22 01:39:42.903 -0500>,<Administrator>,<X>,<proc1d>,<TOPSPIN 2.1>,
      <abs ABSG = 5 
       data hash MD5: 128K
       8E 56 CB 72 4D D2 AB 85 B9 CD 80 06 50 9A 84 1E>)
$$ ##END=
$$ 
$$ $$ hash MD5
$$ $$ D9 2B D8 A3 C4 21 B5 15 6A BE BF 34 DA 1D AD 08
##$RELAX= 
##$RELAX= 
##$RELAX= 
##$RELAX= 
##$RELAX= 
##$RELAX= 
##$RELAX= 
##$RELAX= 
$$ Bruker specific parameters
$$ --------------------------
##$DU= <E:\>
##$EXPNO= 12
$$ [...]
150 150 150 150 150 150 150 150
##$TP07= 0
##$TPNAME0= <>
##$TPNAME1= <>
##$TPNAME2= <>
##$TPNAME3= <>
##$TPNAME4= <>
##$TPNAME5= <>
##$TPNAME6= <>
##$TPNAME7= <>
##$TPOAL= (0..7)
0.5 0.5 0.5 0.5 0.5 0.5 0.5 0.5
##$TPOFFS= (0..7)
0 0 0 0 0 0 0 0
##$TUNHIN= 0
##$TUNHOUT= 0
##$TUNXOUT= 0
##$USERA1= <user>
##$USERA2= <user>
##$USERA3= <user>
##$USERA4= <user>
##$USERA5= <user>
##$V9= 5
##$VALIST= <valist>
##$VCLIST= <CCCCCCCCCCCCCCC>
##$VD= 0
##$VDLIST= <DDDDDDDDDDDDDDD>
##$VPLIST= <PPPPPPPPPPPPPPP>
##$VTLIST= <TTTTTTTTTTTTTTT>
##$WBST= 1024
##$WBSW= 4
##$XGAIN= (0..3)
0 0 0 0
##$XL= 0
##$YL= 0
##$YMAX_a= 5722946
##$YMIN_a= -10675360
##$ZGOPTNS= <>
##$ZL1= 120
##$ZL2= 120
##$ZL3= 120
##$ZL4= 120
##$ABSF1= 14.9613
##$ABSF2= -5.596882
##$ABSG= 5
##$ABSL= 3
##$ALPHA= 0
##$AQORDER= 0
##$ASSFAC= 0
##$ASSFACI= 0
##$ASSFACX= 0
##$ASSWID= 0
##$AUNMP= <proc_prof1d_extract.lims>
##$AXLEFT= 0
##$AXNAME= <>
##$AXNUC= <1H>
##$AXRIGHT= 0
##$AXTYPE= 0
##$AXUNIT= <>
##$AZFE= 0.1
##$AZFW= 0.1
##$BCFW= 0
##$BC_mod= 0
##$BYTORDP= 0
##$COROFFS= 0
##$CY= 15
##$DATMOD= 1
##$DC= 0
##$DFILT= <>
##$DTYPP= 0
##$F1P= 0
##$F2P= 0
##$FCOR= 0.5
##$FTSIZE= 131072
##$FT_mod= 6
##$GAMMA= 0
##$GB= 0
##$INTBC= 1
##$INTSCL= 1
##$ISEN= 128
##$LB= 0.3
##$LEV0= 0
##$LPBIN= 0
##$MAXI= 10000
##$MC2= 0
##$MEAN= 0
##$ME_mod= 0
##$MI= 0
##$NCOEF= 0
##$NC_proc= -2
##$NLEV= 6
##$NOISF1= 0
##$NOISF2= 0
##$NSP= 0
##$NTH_PI= 0
##$NZP= 0
##$OFFSET= 14.9613
##$PC= 1
##$PHC0= 249.9719
##$PHC1= 0
##$PH_mod= 1
##$PKNL= yes
##$PPARMOD= 0
##$PPDIAG= 0
##$PPIPTYP= 0
##$PPMPNUM= 2147483647
##$PPRESOL= 1
##$PSCAL= 4
##$PSIGN= 0
##$PYNMP= <proc.py>
##$REVERSE= no
##$SF= 400.020009518603
##$SI= 131072
##$SIGF1= 0
##$SIGF2= 0
##$SINO= 400
##$SIOLD= 131072
##$SPECTYP= <>
##$SREGLST= <1H.CDCl3>
##$SSB= 0
##$STSI= 131072
##$STSR= 0
##$SW_p= 8223.68421052631
##$SYMM= 0
##$S_DEV= 0
##$TDeff= 65536
##$TDoff= 0
##$TI= <>
##$TILT= no
##$TM1= 0
##$TM2= 0
##$TOPLEV= 0
##$USERP1= <user>
##$USERP2= <user>
##$USERP3= <user>
##$USERP4= <user>
##$USERP5= <user>
##$WDW= 1
##$XDIM= 131072
##$YMAX_p= 465893895
##$YMIN_p= -11575
##$CURPLOT= <Network HP LaserJet P1505>
##$CURPRIN= <$Network HP LaserJet P1505>
##$DFORMAT= <normdp>
##$LAYOUT= <+/1D_H.xwp>
##$LFORMAT= <normlp>
##$PFORMAT= <normpl>
##$SURQMSG= 1
$$ End of Bruker specific parameters
$$ ---------------------------------
##NTUPLES= NMR SPECTRUM
##VAR_NAME=  FREQUENCY,     SPECTRUM/REAL,   SPECTRUM/IMAG
##SYMBOL=    X,             R,               I
##VAR_TYPE=  INDEPENDENT,   DEPENDENT,       DEPENDENT
##VAR_FORM=  AFFN,          ASDF,            ASDF
##VAR_DIM=   131072,        131072,          131072
##UNITS=     HZ,            ARBITRARY UNITS, ARBITRARY UNITS
##FACTOR=    0.0627417313425164, 1,          1
##FIRST=     8223.62146879497, -358,         -60899
##LAST=      0,             1270,            -62118
##MIN=       0,             -11575,          0
##MAX=       8223.62146879497, 465893895,    0
$$ Real data points
##PAGE= N=1
##DATA TABLE= (X++(R..R)), XYDATA
$$ [...]
63870G16619K2102K5156K7088K8547L0585L3153L5274L6419L6883L6996L6706
63859A065528L5880L4471L2407K9720K6595K3093J9075J4617J0007N075p45p240
63847A288483j3094j7403k0883k4698k8764l2141l4605l6835l9217m1443m3136
63836I56264m4107m4079m2946m1171l9366l7599l5668l3657l1578k8937k5538
63825E51618k2359k0604k0052j9346j7842j6110j4660j3234j1611j0176r284q737
63813C67603q193p541o692n566m460l872l821l743l298k731k390k313k444k814
63799C07725l365l956m562n125n227m439l035j867j440j524j717j913k039j894
63785B65622j475j139j182j430j465j066l90J91L83K14l9j96l44n65p18o20k80
$$ y = [716619, 738721, 763877, 790965, 819512, 850097, 883250, 918524, 954943, 991826, 1028822, 1065528, 1101408, 1135879, 1168286, 1198006, 1224601, 1247694, 1266769, 1281386, 1291393, 1296468, 1295723, 1288483, 1275389, 1257986, 1237103, 1212405, 1183641, 1151500, 1116895, 1080060, 1040843, 999400, 956264, 912157, 868078, 825132, 783961, 744595, 706996, 671328, 637671, 606093, 577156, 551618, 529259, 508655, 488603, 469257, 451415, 435305, 420645, 407411, 395800, 385624, 376340, 367603, 359410, 351869, 345177, 339611, 335151, 331279, 327458, 323715, 320417, 317686, 315296, 312983, 310539, 307725, 304360, 300404, 295842, 290717, 285490, 281051, 278016, 276149, 274709, 273185, 271468, 269555, 267516, 265622, 264147, 263008, 261826, 260396, 258931, 257865, 257475, 257666, 258049, 258263, 258224, 258028, 257684, 257119, 256401, 255781, 255501]
63768B55501J92O25O82J14p60j249j205j222j694k205k266k025j778j353o67k19
63752B40471l99o94m01L06P77R98J377J809J867J711J893K336K460K279K401K909
63736B62100L096K530J664J183J326J955K679K902K383J728J728K230K408K161
63722B92073K341L408M664N206N020M698M584M484L973K714Q09j102k363k917
63708C27592l126l151k950k720k681k563j890q28m8K23M44R43J527J988K436K976
63692C18172L524L998M289M083L246K233J544R34j48j496k294k271j888j405o78
63677C31843L4R9m10n96k3P19J050J169J407J678J991K654L455L464K290Q22K4
63660C51670l60j155k419l560m301m708m598l782k798k573l290m157m375l885
$$ y = [255501, 255693, 256318, 257000, 257114, 256354, 255105, 253900, 252678, 250984, 248779, 246513, 244488, 242710, 241357, 240690, 240471, 240072, 239378, 238977, 239283, 240060, 241058, 242435, 244244, 246111, 247822, 249715, 252051, 254511, 256790, 259191, 262100, 265196, 267726, 269390, 270573, 271899, 273854, 276533, 279435, 281818, 283546, 285274, 287504, 289912, 292073, 294414, 297822, 302486, 307692, 312712, 317410, 321994, 326478, 330451, 333165, 333974, 332872, 330509, 327592, 324466, 321315, 318365, 315645, 312964, 310401, 308511, 307683, 307635, 307858, 308302, 309245, 310772, 312760, 315196, 318172, 321696, 325694, 329983, 334066, 337312, 339545, 341089, 342023, 341875, 340379, 338085, 335814, 333926, 332521, 331843, 331877, 331976, 331566, 330970, 330947, 331666, 332716, 333885, 335292, 336970, 338961, 341615, 345070, 348534, 350824, 351646, 351670, 351310, 350155, 347736, 344176, 339875, 335167, 330569, 326787, 323989, 321416, 318126, 313969, 309594, 305709]
63646C05709l082k198j210j29P70J117R16P87J418K732L861M129L781L560L871
63631C26032M531N111N245M829M188L901M363N511O979Q384R504J0417J1461J2796
63617D23252J4106J5053J5924J7356J9410K1461K3018K4242K5467K6690K7714
63606F53693K8389K8460K7525K5219K1254J5433Q110O28n388r329j1736j3037
63594G69221j2879j0980q056n462m286n039p709j1686j5925j9539k2138k3575
63582F21947k3797k3033k1667j9759j7183j4311j1905j0079q057n403k760r14
63570D63079L01J490K633L284L488L751M288M896N490O147O681O826O879P619
63556E26852R401J1736J3921J5800J7727K0102K3090K6680L0775L5244L9853M4069
$$ y = [305709, 302627, 300429, 299219, 299090, 299860, 300977, 301893, 302680, 304098, 306830, 310691, 314820, 318601, 322161, 326032, 330563, 335674, 340919, 345748, 349936, 353837, 358200, 363711, 370690, 379074, 388578, 398995, 410456, 423252, 437358, 452411, 468335, 485691, 505101, 526562, 549580, 573822, 599289, 625979, 653693, 682082, 710542, 738067, 763286, 784540, 799973, 808083, 808711, 803323, 793994, 782258, 769221, 756342, 745362, 737306, 731844, 727558, 722519, 714810, 703124, 687199, 667660, 645522, 621947, 598150, 575117, 553450, 533691, 516508, 502197, 490292, 480213, 472156, 466753, 463993, 463079, 463380, 464870, 467503, 470787, 474275, 478026, 482314, 487210, 492700, 498847, 505528, 512354, 519233, 526852, 536253, 547989, 561910, 577710, 595437, 615539, 638629, 665309, 696084, 731328, 771181, 815250]
63544H15250M6646M5638L9207K7110J1597l493j4975k1794k4548k4102k1132j6570
63532H58834j1697p616m918l850m432o460r767j4340j9765k4760k7988k9349k9827
63519F64065l0044k9606k8050k5694k3190k0788j8432j6179j4218j2683j1630
63508D33551j0894j0012q665p200o239n793n408n071n124n217m387k613j266j378
63494C54284k240k502j938j308j003p92n75m91l40L23J493K696L604M182M327
63479C59720L957L465L529M289N106N241M540L373K202J288N23m98k120m121n707
63464C84787o081n155l677k543k043j879j852k068k285j707n1J689K302K028K198
63449C63663L391M894O099P263Q512R273R343R577J0703J2218J3346J4468J6609
$$ y = [815250, 861896, 907534, 946741, 973851, 985448, 981955, 966980, 945186, 920638, 896536, 875404, 858834, 847137, 839521, 834603, 830753, 826321, 819861, 810094, 795754, 775989, 751229, 723241, 693892, 664065, 634021, 604415, 576365, 550671, 527481, 506693, 488261, 472082, 457864, 445181, 433551, 422657, 412645, 403980, 396780, 390541, 384748, 379340, 374269, 369145, 363928, 359541, 356928, 355662, 354284, 352044, 349542, 347604, 346296, 345293, 344501, 343926, 343435, 343095, 343418, 344911, 347607, 351211, 355393, 359720, 363677, 367142, 370671, 374960, 380066, 385307, 389847, 393220, 395422, 396710, 397233, 396735, 394615, 390494, 384787, 378706, 373551, 369874, 367331, 365288, 363409, 361557, 359489, 357204, 355497, 355446, 357135, 359437, 361465, 363663, 367054, 371948, 378047, 385310, 393822, 403095, 412438, 422015, 432718, 444936, 458282, 472750, 489359]
63436D89359K0073K4509K9812L5603L9867L9560L3340K3048J2199L371k639n981
63424G42121o848n389j907L092Q975J5030K0649K5563K9826L3365L5502L5186
63412I35165L1844K5840J7985R006j40p847j2648j4462j4483j3788j2622j1096
63400I32754r836r612j0846j3626j7696k2214k6123k9061l1352l2970l3229l1831
63388F64358k9499k7062k4572k1818j9118j6885j4894j2637j0159p903n983m170
63376D69658k375o68J055K997N132P292R338J1045J2153J2854J3843J5496J7317
63363E75137J8667J9737K1303K3625K6107K7997K9212L0448L2445L4997L6677
63352H76352L5873L2091K5981J8359R892J621n222j0144j3431j5103j4810j3041
$$ y = [489359, 509432, 533941, 563753, 599356, 639223, 678783, 712123, 735171, 747370, 750741, 748102, 742121, 735273, 729884, 727977, 731069, 740044, 755074, 775723, 801286, 831112, 864477, 899979, 935165, 967009, 992849, 1010834, 1019840, 1019700, 1011853, 999205, 984743, 970260, 956472, 943850, 932754, 922918, 913306, 902460, 888834, 871138, 848924, 822801, 793740, 762388, 729418, 696189, 664358, 634859, 607797, 583225, 561407, 542289, 525404, 510510, 497873, 487714, 479811, 473828, 469658, 467283, 466615, 467670, 470667, 475799, 483091, 492429, 503474, 515627, 528481, 542324, 557820, 575137, 593804, 613541, 634844, 658469, 684576, 712573, 741785, 772233, 804678, 839675, 876352, 912225, 944316, 970297, 988656, 998548, 1000169, 994947, 984803, 971372, 956269, 941459, 928418]
63340I28418j1319j0603j0477j0554j1642j4615j8955k3393k7272l0387l2079
63329G27122l1684k9506k6366k2593j8292j4095j0562p086k468L355Q705J1087
63317E87617Q352Kj1544k1592k6517k6550k4454k2046j9191j5736j2618j0671
63305D05052r560q444o835m668k342q81j144k617l767l778l176k634k136j573
63291C51497j237j295j452j507j623j821j779j428j149j134j128j010r83r91o47
63276C32313m7Q0n61j243j132l34M93J049J425J597J471J261J360J801K153K004
63260C43690J495J303K041L498M633M564L524K510K131K206K400K803L669M974
63246C85441O400P574Q276Q569Q751R032R361R740J0485J1892J3842J6001J8182
$$ y = [928418, 917099, 906496, 896019, 885465, 873823, 859208, 840253, 816860, 789588, 759201, 727122, 695438, 665932, 639566, 616973, 598681, 584586, 574024, 566938, 564470, 567825, 576530, 587617, 595969, 595971, 584427, 562835, 536318, 509768, 485314, 463268, 444077, 428341, 415723, 405052, 395492, 387048, 380213, 375545, 373203, 372322, 371178, 368561, 364794, 361016, 357840, 355206, 353070, 351497, 350260, 348965, 347513, 346006, 344383, 342562, 340783, 339355, 338206, 337072, 335944, 334934, 333951, 332960, 332313, 332266, 332346, 331785, 330542, 329410, 329076, 329569, 330618, 332043, 333640, 335111, 336372, 337732, 339533, 341686, 343690, 345185, 346488, 348529, 352027, 356660, 361224, 364748, 367258, 369389, 371595, 373995, 376798, 380467, 385441, 391841, 399415, 407691, 416260, 425011, 434043, 443404, 453144, 463629, 475521, 489363, 505364, 523546]
63233E23546K0201K1711K2701K3820K5594K7433K8112K7252K5775K4854K4816
63222G95815K5116K4941K3869K2343K1382K1553K2362K3015K3479K4170K4802
63211A052847K4354K2168J8498J3909Q669K852l507j0401j7574k4231k9510l3215
63199A024859l5738l7319l7815l7119l5264l2231k8173k3783j9879j6571j3273
63188G07694r534n444j284K697O288R425J2298J4944J7013J8342J9405K0628K1619
63175H34091K1752K1187K0521J9862J9057J8573J8985J9721J9421J7728J5673
63164A046571J4027J2166Q955M084j777p624j2708j7054k1426k6310l1009l4305
63152I33590l5880l6359l6114l4949l2913l0465k7795k4892k2225k0349j8829
$$ y = [523546, 543747, 565458, 588159, 611979, 637573, 665006, 693118, 720370, 746145, 770999, 795815, 820931, 845872, 869741, 892084, 913466, 935019, 957381, 980396, 1003875, 1028045, 1052847, 1077201, 1099369, 1117867, 1131776, 1140445, 1143297, 1139790, 1129389, 1111815, 1087584, 1058074, 1024859, 989121, 951802, 913987, 876868, 841604, 809373, 781200, 757417, 737538, 720967, 707694, 698160, 692716, 691432, 694129, 700417, 709842, 722140, 737084, 754097, 772439, 791844, 812472, 834091, 855843, 877030, 897551, 917413, 936470, 955043, 974028, 993749, 1013170, 1030898, 1046571, 1060598, 1072764, 1081719, 1085803, 1084026, 1076402, 1063694, 1046640, 1025214, 998904, 967895, 933590, 897710, 861351, 825237, 790288, 757375, 726910, 699115, 674223, 651998, 631649, 612820]
63141F12820j6642j3822j1528j0327r517q486p451o472m957k846j184o80o50r0
63127E18168R52J818K318K604K665K620K901L545L924L766L735M341N022M979
63113E63358M317L581K782J747Q71O85R95J212J189J081P66R5o02q75p75o20n36
63096E79271o74j324k236k425j377QN74M64O35J185J255M88l87o20k50L09Q66
63079E75762J439K114L078M388N677O440O611O511O328O121O258P208Q752R938
63065F56625J0220J0300J1418J3859J6542J8290J9254K0733K3570K7128L0193
63054H58132L2549L5065L8417M2319M6132M9598N2714N5420N7694N9597O1026
63043A388663O1675O1439O0530N9144N7399N5610N4088N2656N0969M9350M8614
$$ y = [612820, 596178, 582356, 570828, 560501, 550984, 542498, 535047, 528575, 523618, 520772, 519588, 518908, 518258, 518168, 519120, 520938, 523256, 525860, 528525, 531145, 534046, 537591, 541515, 545281, 549016, 553357, 558379, 563358, 567675, 571256, 574038, 575785, 576656, 577341, 578336, 579548, 580737, 581818, 582584, 582679, 582077, 581202, 580427, 579807, 579271, 578597, 577273, 575037, 572612, 571235, 571243, 571817, 572281, 572916, 574101, 575356, 575844, 575457, 574837, 574587, 574896, 575762, 577201, 579315, 582393, 586781, 592458, 598898, 605509, 612020, 618348, 624469, 630727, 637935, 646687, 656625, 666845, 677145, 688563, 702422, 718964, 737254, 756508, 777241, 800811, 827939, 858132, 890681, 925746, 964163, 1006482, 1052614, 1102212, 1154926, 1210346, 1268040, 1327637, 1388663, 1450338, 1511777, 1572307, 1631451, 1688850, 1744460, 1798548, 1851204, 1902173, 1951523, 2000137]
63032B000137M8834M9048M8460M7122M4977M1073L4424K5147J4070J690j1825
63021B343157k6010m0090n3302o4767p3475p8984q1793q2551q1252p7720p2475
63010A610738o6367n9660n2133m3901l5493k7263j9288j1684m550K322R118J5419
62998A317258K0490K4133K6940K9645L2461L4958L6428L6584L6008L5662L5830
62987A666397L5931L5536L4923L4275L2950L0184K6028K0950J4885P403j449j1140
62975A926873k1290l1605m1303m9450n5927o1410o6166o9424p0233o8640o5713
62964A325712o2537n9309n5475n0705m5612m1273l8072l5460l2865l0349k8104
62953H45951k5928k3711k1930k1064k0707j9959j8603j7297j6552j5993j4841
$$ y = [2000137, 2048971, 2098019, 2146479, 2193601, 2238578, 2279651, 2314075, 2339222, 2353292, 2354982, 2343157, 2317147, 2277057, 2223755, 2158988, 2085513, 2006529, 1924736, 1842185, 1760933, 1683213, 1610738, 1544371, 1484711, 1432578, 1388677, 1353184, 1325921, 1306633, 1294949, 1290399, 1292721, 1301839, 1317258, 1337748, 1361881, 1388821, 1418466, 1450927, 1485885, 1522313, 1558897, 1594905, 1630567, 1666397, 1702328, 1737864, 1772787, 1807062, 1840012, 1870196, 1896224, 1917174, 1932059, 1939462, 1938013, 1926873, 1905583, 1873978, 1832675, 1783225, 1727298, 1665888, 1599722, 1530298, 1460065, 1391425, 1325712, 1263175, 1203866, 1148391, 1097686, 1052074, 1010801, 972729, 937269, 904404, 874055, 845951, 820023, 796312, 774382, 753318, 732611, 712652, 694049, 676752, 660200, 644207, 629366]
62942F29366j2835j0546q901q370q625q958q971q656p920o541m722l231k639k687
62928E25764k657k202j535j059r70j076r49m85k67r07k098k836k690k283k271
62913E01479k514k527k256j979j877j986k199k183j671r90p95j129j377j192q21
62898D75983l81K91Q41M38q98j980k032j711j895k266j980j021k7O80J169J420
62882D66631J528J859K387K420J613N91q1p91j914k725k369j270n39l97k80r0
62866D66573k07n68p60q91j388k029k088j360l21N45R26O09o7j44O81J292O59
62849D61462m31l86Q49J807J659R37J64p91j795k174j779j257r83o62k34j88o24
62832D55574r51q41o30n40l33l7m3j50M97K056L417L599L008K711L083L719M201
$$ y = [629366, 616531, 605985, 597084, 588714, 580089, 571131, 562160, 553504, 545584, 539043, 534321, 531090, 528451, 525764, 523107, 520905, 519370, 518311, 517341, 516265, 515316, 514831, 514564, 513657, 511559, 508723, 506033, 503750, 501479, 498965, 496438, 494182, 492203, 490326, 488340, 486141, 483958, 482287, 481297, 480502, 479373, 477996, 476804, 475983, 475602, 475893, 476734, 477172, 476274, 474294, 472262, 470551, 468656, 466390, 464410, 463389, 463362, 464042, 465211, 466631, 468159, 470018, 472405, 474825, 476438, 477029, 476948, 476157, 474243, 471518, 469149, 467879, 467340, 466943, 466663, 466573, 466366, 465798, 465038, 464147, 462759, 460730, 458642, 457282, 456961, 457506, 458432, 459041, 458974, 458830, 459511, 460803, 461462, 461031, 460645, 461494, 463301, 464960, 465897, 466061, 465270, 463475, 461301, 459522, 458265, 457282, 456620, 456386, 456198, 455574, 454623, 453782, 453152, 452612, 452279, 452242, 452199, 452049, 452546, 454602, 458019, 461618, 464626, 467337, 470420, 474139, 478340]
62815D78340M359M181L913L959M352M646M628M641M991N383N417N226N296N836
62801E45168O665P512Q156Q458Q477Q517Q939R936J1469J3276J5099J7050J9619
62788F88341K3011K6703L0018L2979L6229M0189M4721M9576N4781O0481O6654
62777A153683P2992P8929Q4055Q8557R2900R6829R9216R9204R6951R2754Q6015
62766B142085P5919O2733M7558L1087J3472m825k2904m0152n6262p0531q1888
62755B096292q9844r4866r7685r8641r7722r4892r0449q5172p9930p4844o9368
62744A122879o3448n7905n3127m8278m2633l6954l2447k8960k5510k2080j9528
62733F92009j7928j6373j4421j2457j0656q804p179o360n964m858k926j432j202
$$ y = [478340, 482699, 486880, 490793, 494752, 499104, 503750, 508378, 513019, 518010, 523393, 528810, 534036, 539332, 545168, 551833, 559345, 567501, 575959, 584436, 592953, 601892, 611828, 623297, 636573, 651672, 668722, 688341, 711352, 738055, 768073, 801052, 837281, 877470, 922191, 971767, 1026548, 1087029, 1153683, 1226675, 1305604, 1389659, 1478216, 1571116, 1667945, 1767161, 1866365, 1963316, 2056070, 2142085, 2218004, 2280737, 2328295, 2359382, 2372854, 2368029, 2345125, 2304973, 2248711, 2178180, 2096292, 2006448, 1911582, 1813897, 1715256, 1617534, 1522642, 1432193, 1347021, 1267091, 1192247, 1122879, 1059431, 1001526, 948399, 900121, 857488, 820534, 788087, 759127, 733617, 711537, 692009, 674081, 657708, 643287, 630830, 620174, 611370, 604191, 597831, 591867, 587009, 584083, 582651, 581449]
62720E81449j476j073K38J952L705N400P055Q797J0597J2040J2878J3679J5244
62707F70485J7561K0091K2832K6135K9715L2990L6209M0049M4223M7818N1054
62696A039162N5171O0410O5570O9872P3783P7478P9923Q0139P8176P4112O7306
62685A821102N7461M5394L1964J7198J184j5033l0173m3662n5295o4772p2111
62674A693257p7736q1620q3150q2175p9426p5539p0650o5202o0044n5280n0210
62663I12225m4890m0443l7235l4115l0266k6417k3312k0354j7017j4336j3491
62652F10349j3815j3713j2806j1822j0972r899q758p989p274n994m498l750l806
62639D95253l717k937j853r45k60J70J07n85j782l192m307m603m124l467k875
$$ y = [581449, 579973, 578900, 579138, 581090, 584795, 590195, 597250, 606047, 616644, 628684, 641562, 655241, 670485, 688046, 708137, 730969, 757104, 786819, 819809, 856018, 896067, 940290, 988108, 1039162, 1094333, 1154743, 1220313, 1290185, 1363968, 1441446, 1521369, 1601508, 1679684, 1753796, 1821102, 1878563, 1923957, 1955921, 1973119, 1974303, 1959270, 1929097, 1885435, 1830140, 1765368, 1693257, 1615521, 1533901, 1450751, 1368576, 1289150, 1213611, 1142961, 1077759, 1017715, 962435, 912225, 867335, 826892, 789657, 755542, 725276, 698859, 675547, 655193, 638176, 623840, 610349, 596534, 582821, 570015, 558193, 547221, 537322, 528564, 520575, 513301, 507307, 502809, 499059, 495253, 491536, 488599, 486746, 485801, 485541, 485711, 485818, 485233, 483451, 480259, 475952, 471349, 467225, 463758, 460883]
62624D60883j960o71K02K10J53R57K234K842K459J705J113Q48J151K147L371M152
62608D81796M395M475M674N218O433Q254J0076J1640J3560J6297J9184K1345K3079
62595F30426K5421K8673L2275L5817L9245M2327M4773M6787M8656M9865M9369
62584A073634M6707M2199L6213K8851K0268J0773P31r229j8233k5941l2861l9292
62572A133820m4308m6701m6633m5599m4782m4103m2816m0457l7209l3763l0682
62561F76767k7770k4332k0398j7012j4950j3702j2341j0769r423q359p350o507
62549E03854n998n552m891m220l714l063k172j649j804j862j110j72q1o56q97
62534D66013n85k98k26n5K66P12J735L557N246N820N882O905R069J1208J2835
$$ y = [460883, 458923, 458252, 458454, 458664, 458817, 459774, 462008, 464850, 467309, 469014, 470127, 470975, 472126, 474273, 477644, 481796, 486191, 490666, 495340, 500558, 506991, 515245, 525321, 536961, 550521, 566818, 586002, 607347, 630426, 655847, 684520, 716795, 752612, 791857, 834184, 878957, 925744, 974400, 1024265, 1073634, 1120341, 1162540, 1198753, 1227604, 1247872, 1258645, 1259376, 1250147, 1231914, 1205973, 1173112, 1133820, 1089512, 1042811, 996178, 950579, 905797, 861694, 818878, 778421, 741212, 707449, 676767, 648997, 624665, 604267, 587255, 572305, 558603, 546262, 535493, 526070, 517711, 510361, 503854, 497856, 492304, 487413, 483193, 479479, 476416, 474244, 472595, 470791, 468929, 467819, 467647, 467566, 466910, 466013, 465428, 465130, 464904, 464849, 465115, 465827, 467562, 471119, 476365, 482185, 488067, 494972, 504041, 515249, 528084]
62519E28084J4723J7296J9910K2063K4192K6761K9567L2353L5274L8395M1428
62508H30046M4132M6317M7413M6874M5056M2722L9659L4754K7618J9151J0413
62497A234155J907n859j2145j6709j9861k1576k1399j9487j6740j3636r917n738
62485A072995j973J102M461Q885J3633J7045J7818J5321R700K459l935q065j0922
62472A138524j4693k0555k8000l5643m1946m5667m6576m5690m4273m2679m0523
62461G32279l7664l4445l1124k7631k3874j9971j6216j2991j0608r003p650o060
62449D95042m289k810j905j275l16J177K709L641M001M358M858M978M594M495
62435E19258N184N696M693K430N20k43q30k463n094p685r321r733r259q707q683
$$ y = [528084, 542807, 560103, 580013, 602076, 626268, 653029, 682596, 714949, 750223, 788618, 830046, 874178, 920495, 967908, 1014782, 1059838, 1102560, 1142219, 1176973, 1204591, 1223742, 1234155, 1236062, 1230203, 1218058, 1201349, 1181488, 1159912, 1138513, 1119026, 1102286, 1088650, 1078733, 1072995, 1071022, 1072124, 1076585, 1085470, 1099103, 1116148, 1133966, 1149287, 1158987, 1161446, 1157511, 1149446, 1138524, 1123831, 1103276, 1075276, 1039633, 997687, 952020, 905444, 859754, 815481, 772802, 732279, 694615, 660170, 629046, 601415, 577541, 557570, 541354, 528363, 517755, 508752, 501102, 495042, 490753, 487943, 486038, 484763, 484447, 485624, 488333, 491974, 495975, 500333, 505191, 510169, 514763, 519258, 524442, 530138, 534831, 537261, 537781, 537538, 536708, 534245, 529151, 521466, 512145, 502412, 493153, 484446, 475763]
62420D75763q892q466p113n457m178l463l289l542l744l436k998l262m050m092
62406D09781k794j235o88r20p71R7R43J228J266J594K218K742K923K979L332L999
62390D26694M349L827K858K558L435M814N774O114O153O126O152O449P085P730
62376E00118Q032Q013P832P393O572N732N555O423Q084R927J1510J2891J4539
62363F12621J6817J9572K2359K5034K7925L1400L5553M0224M5024M9311N2450
62352I78290N4228N4747N3825N0798M5011L6510K6353J6301P918J581l496q103
62340A313963j2300j6094k0159k5053l0030l3662l5592l6751l7664l7612l5846
62329I93200l2809k9609k6851k4539k2672k1362k0604k0320k0445k0723k0711
$$ y = [475763, 466871, 458405, 451292, 445835, 441657, 438194, 434905, 431363, 427619, 424183, 421185, 417923, 413873, 409781, 406987, 405752, 405064, 404144, 403373, 403470, 404413, 405641, 406907, 408501, 410719, 413461, 416384, 419363, 422695, 426694, 431043, 434870, 437728, 440286, 443721, 448535, 454309, 460423, 466576, 472702, 478854, 485303, 492388, 500118, 508150, 516163, 523995, 531388, 537960, 543692, 549247, 555670, 563754, 573681, 585191, 598082, 612621, 629438, 649010, 671369, 696403, 724328, 755728, 791281, 831505, 876529, 925840, 978290, 1032518, 1087265, 1141090, 1191888, 1236899, 1273409, 1299762, 1316063, 1323981, 1325562, 1322066, 1313963, 1301663, 1285569, 1265410, 1240357, 1210327, 1176665, 1141073, 1104322, 1066658, 1029046, 993200, 960391, 930782, 903931, 879392, 856720, 835358, 814754, 794434, 773989, 753266, 732555]
62318G32555k0227j9606j9215j9004j8637j7864j6552j4684j2503j0507r079q202
62306E46475p569o830n796m606l637k991k291j242j93L42N59J123K137K965L155
62291E21601K958K796K733K643K486K255J945J689J578J428J101R09J220J783
62277E49125K042K031K278K858L278L369L590M269N248O423Q031J0187J2712J5546
62263F30987J8751K2061K5125K8264L2284L7314M2587M7542N2409N7383O1991
62252A056698O5614O7904O8312O5910O0228N1770M1409K9851J7951O854k779j1223
62240A518499j9054k6523l3797m1084m8086n3863n7716n9761o0386n9659n7602
62229A000968n4415n0104m4580l8437l2954k8788k5384k2066j8991j6505j4389
$$ y = [732555, 712328, 692722, 673507, 654503, 635866, 618002, 601450, 586766, 574263, 563756, 554677, 546475, 538906, 532076, 526280, 521674, 518037, 515046, 512755, 511513, 511320, 511662, 512221, 513344, 515481, 518446, 521601, 524559, 527355, 530088, 532731, 535217, 537472, 539417, 541106, 542684, 544112, 545213, 546122, 547342, 549125, 551167, 553198, 555476, 558334, 561612, 564981, 568571, 572840, 578088, 584511, 592542, 602729, 615441, 630987, 649738, 671799, 696924, 725188, 757472, 794786, 837373, 884915, 937324, 994707, 1056698, 1122312, 1190216, 1258528, 1324438, 1384666, 1436436, 1477845, 1507696, 1525647, 1532501, 1529722, 1518499, 1499445, 1472922, 1439125, 1398041, 1349955, 1296092, 1238376, 1178615, 1118229, 1058570, 1000968, 946553, 896449, 851869, 813432, 780478, 751690, 726306, 704240, 685249, 668744, 654355]
62218F54355j2434j1074j0598j0335r475q179p129o342n359m295l747l748l594
62205E58046k728j236M67J929K743K838K638K600K786L208M127N532O708P050
62191E96708P061P804R403J0779J0997J0279R518R236R228R046Q565Q070P767
62178G14461P270N921L721J620O66J123K636M822P430J0253J3335J6998K1365
62165H11621K5993L0274L3923L6859L8929M0025M0096L8688L4900K8372K0132
62154A179812J1979N153j92m503q367j2285j6464k0682k4590k8043l0960l3080
62142A017778l4133l4074l2964l0820k7819k4353k0704j6822j2719q826n734l824
62130G64986l176l501m012l806k707j354k31J027K958N346P402Q733R660J0741
$$ y = [654355, 641921, 630847, 620249, 609914, 600439, 592260, 585131, 578789, 573430, 569135, 565388, 561640, 558046, 555318, 554082, 554549, 556478, 559221, 562059, 564697, 567297, 570083, 573291, 577418, 582950, 589658, 596708, 603769, 611573, 620976, 631755, 642752, 653031, 662549, 671785, 681013, 690059, 698624, 706694, 714461, 721731, 727652, 731373, 732993, 733659, 734782, 737418, 742240, 749670, 759923, 773258, 790256, 811621, 837614, 867888, 901811, 938670, 977599, 1017624, 1057720, 1096408, 1131308, 1159680, 1179812, 1191791, 1196944, 1196752, 1192249, 1183882, 1171597, 1155133, 1134451, 1109861, 1081818, 1050858, 1017778, 983645, 949571, 916607, 885787, 857968, 833615, 812911, 796089, 783370, 774544, 768810, 764986, 761810, 758309, 754297, 750491, 747784, 746430, 746199, 747226, 750184, 755530, 762932, 771665, 781325, 792066]
62116G92066J2164J3629J4681J5205J5464J5316J3669R465L259k816o898q595
62104H86609q344o566m049k212k077l311m913o370p510p749o394l667p19J409
62090H24137K497K956L399M220N266N952N941N548N303N469O117P273Q711J0065
62076I02854J1418J3261J5607J7670J8864J9536K0233K0835K0893K0383J9562
62065A101116J8591J7843J8002J9195K0430K0634J9783J8369J6219J2720P903
62054A290805K529k660p070r969j1092j1480j2829j5822j9692k3407k6673k9711
62042A122929l2662l5348l7292l7969l7371l6205l5128l4067l2625l0815k8849
62031G44598k6502k3434k0014j7051j4731j2511j0137q105o906o369o003n630
$$ y = [792066, 804230, 817859, 832540, 847745, 863209, 878525, 892194, 901659, 904918, 902102, 895204, 886609, 878265, 871699, 867650, 865438, 863361, 860050, 855137, 848767, 841257, 833508, 827114, 823447, 822728, 824137, 826634, 829590, 832989, 837209, 842475, 848427, 854368, 859916, 865219, 870688, 876805, 884078, 892789, 902854, 914272, 927533, 943140, 960810, 979674, 999210, 1019443, 1040278, 1061171, 1081554, 1101116, 1119707, 1137550, 1155552, 1174747, 1195177, 1215811, 1235594, 1253963, 1270182, 1282902, 1290805, 1293334, 1290674, 1283604, 1273635, 1262543, 1251063, 1238234, 1222412, 1202720, 1179313, 1152640, 1122929, 1090267, 1054919, 1017627, 979658, 942287, 906082, 870954, 836887, 804262, 773447, 744598, 718096, 694662, 674648, 657597, 642866, 630355, 620218, 612113, 605207, 598838, 592835, 587205]
62019E87205n433n566n974o410o647o635o435o027n372m619l925l023j459N81
62005E20261K219K869K826K613K403K399L030M164M792M195K913J820P59r50l079
61990E53234m579n027n069n427o167p085q028q749q922q482p667o762o087n885
61976D59298n847n059l013m53J342J908J682J070J74o96j000n64K47R90J351J141
61960D52571N64K70O29J155J180Q45Q01J169J543J873K607L906N351O459P044
61945D87967P110O970P390R031J1712J4582J6968J8640J9555J9919K0281K0927
61933F61052K1236K0360J8436J6522J5271J4331J3107J1484R645P603N127K011
61921H16185j615n103p654r095r924j0361r872q098n637l193m94L068P114J0525
$$ y = [587205, 581772, 576206, 570232, 563822, 557175, 550540, 544105, 538078, 532706, 528087, 524162, 521139, 519680, 520261, 522480, 525349, 528175, 530788, 533191, 535590, 538620, 542784, 547576, 551771, 554684, 556504, 557263, 556313, 553234, 548655, 543628, 538559, 533132, 526965, 519880, 511852, 503103, 494181, 485699, 478032, 471270, 465183, 459298, 453451, 448392, 445379, 444926, 446268, 448176, 449858, 450928, 451102, 450406, 449406, 448842, 449089, 450079, 451430, 452571, 453135, 453405, 454034, 455189, 456369, 457214, 458015, 459184, 460727, 462600, 465207, 469113, 474464, 480923, 487967, 495077, 502047, 509437, 518468, 530180, 544762, 561730, 580370, 599925, 619844, 640125, 661052, 682288, 702648, 721084, 737606, 752877, 767208, 780315, 791799, 801444, 809047, 814174, 816185, 814570, 809467, 801813, 792718, 782794, 772433, 762561, 754463, 748826, 745633, 745139, 748207, 755321, 765846]
61907G65846J2918J4907J6912J8501J8977J7940J5209J0908N722O02l934p817
61895H86691j0978j3352j5174j6702j7744j7972j7458j6449j4908j2899j1036
61884G22019r807q785p376o104o162p748r696j0857j0997j0378r255p978o901
61871F09975n979m835l261j320P70K432K909K323K060L263N348O986Q113R736
61857F38520J2060J4176J5709J7419J9864K2619K5186K7680L0171L2253L3624
61846H89281L4368L4408L3417L1462K8896K5496K0645J4538Q300K560l089q817
61834A111465j3645j6492j7353j6857j5240j2415q575m179M23N055R559J3730
61822A035476J7039J8482J7259J3669Q800L319k858r651j6334k2155k6880l0531
$$ y = [765846, 778764, 793671, 810583, 829084, 848061, 866001, 881210, 892118, 897840, 898442, 894508, 886691, 875713, 862361, 847187, 830485, 812741, 794769, 777311, 760862, 745954, 733055, 722019, 712212, 703427, 696051, 689947, 683785, 676037, 666341, 655484, 644487, 634109, 624854, 616876, 609975, 603996, 599161, 595900, 594580, 595350, 597782, 600691, 603014, 605074, 608337, 613685, 620671, 628784, 638520, 650580, 664756, 680465, 697884, 717748, 740367, 765553, 793233, 823404, 855657, 889281, 923649, 958057, 991474, 1022936, 1051832, 1077328, 1097973, 1112511, 1120811, 1123371, 1120282, 1111465, 1097820, 1081328, 1063975, 1047118, 1031878, 1019463, 1010888, 1006709, 1007132, 1012187, 1021746, 1035476, 1052515, 1070997, 1088256, 1101925, 1110725, 1114044, 1111186, 1101535, 1085201, 1063046, 1036166, 1005635]
61810A005635l3101l4659l5163l4262l1823k8666k5954k3917k1911j9704j7801
61799F98674j6342j4678j2431j0146q517p568o957o470n875m927l784k999k872
61786E95108l241l855m411m344l329k021j523k027k739l062l084k966k732k655
61772E53119k904k865j907p02n71j418j712p90L13P53J087J902K646K756K743
61757E52450L097L167K304J234J083J665J842J183J83q25j944l105l930m273m280
61742E49851m077l742l424l123k699k312k379k801k777j891p67k16j52J04Q12
61727E20407J643K221K483K636L005L577L724K864J490Q63J490K546L055K870
61713E54874K291J445M89l06j037k138l535m530m873n106n470n366m518l745l904
$$ y = [1005635, 972534, 937875, 902712, 868450, 836627, 807961, 782007, 758090, 736179, 716475, 698674, 682332, 667654, 655223, 645077, 636560, 628992, 622035, 615565, 609690, 604763, 600979, 597980, 595108, 591867, 588012, 583601, 579257, 575928, 573907, 572384, 570357, 567618, 564556, 561472, 558506, 555774, 553119, 550215, 547350, 545443, 544741, 544170, 542752, 541040, 540250, 540563, 541316, 542403, 544305, 546951, 549707, 552450, 555547, 558714, 561018, 562252, 563335, 565000, 566842, 568025, 568208, 567383, 565439, 562334, 558404, 554131, 549851, 545774, 542032, 538608, 535485, 532786, 530474, 528095, 525294, 522517, 520626, 519859, 519643, 519491, 519595, 520407, 522050, 524271, 526754, 529390, 532395, 535972, 539696, 542560, 544050, 544913, 546403, 548949, 552004, 554874, 557165, 558610, 559099, 558793, 557756, 555618, 552083, 547553, 542680, 537574, 532104, 526738, 522220, 518475, 514571]
61698E14571m673n157n129m933m695m311l893l632l480l363l366l403l204k903
61684D58429l026l578l781l174k288j827j789j893k143k483k482j959j406j307
61670D25293j492j552j374r57l73r5o01j315r48O22J847J541M68O3M79Q54Q25
61653D23285P30P13O03M48N15R26J683K673L349L069K138J750K394L109K890J991
61637D52266J164M40n21j548k310k944l634m113m271m543n028m973l968k811k352
61622D10854k203j637r53p98p45J30J589K328J693L44p40j159j193j586k998n076
61606C97850o480o384n442m694m167l398k635k537l041l485l528l218k516j586
61592C44739j093j401j856j676j101q38q39o12l11n40j265j838j926j697j257
$$ y = [514571, 509898, 504741, 499612, 494679, 489984, 485673, 481780, 478148, 474668, 471305, 467939, 464536, 461332, 458429, 455403, 451825, 448044, 444870, 442582, 440755, 438966, 437073, 434930, 432447, 429965, 428006, 426600, 425293, 423801, 422249, 420875, 419918, 419545, 419450, 418849, 417534, 416586, 417208, 419055, 420596, 421064, 421127, 421606, 422460, 423285, 424015, 424728, 425331, 425779, 426294, 427220, 428903, 431576, 434925, 437994, 440132, 441882, 444276, 447385, 450275, 452266, 453430, 453870, 453349, 451801, 449491, 446547, 442913, 438800, 434529, 429986, 424958, 419985, 416017, 413206, 410854, 408651, 407014, 406061, 405263, 404518, 404648, 406237, 408565, 410258, 410602, 409862, 408703, 407510, 405924, 402926, 397850, 391370, 384986, 379544, 374850, 370683, 367285, 364650, 362113, 359072, 355587, 352059, 348841, 346325, 344739, 343646, 342245, 340389, 338713, 337612, 336774, 335935, 335323, 335012, 334472, 333207, 331369, 329443, 327746, 326489]
61577C26489o32q1J78K87K95o8p18r25l61K29J39k78m39n94j019j046p7J167J626
61558C24172J562J866K212J514j05j223j104m32l5M5N2R2L29Q44J244J106P08
61541C32847O52R85J354J709K182K674L189M041N006N061L903K832K960L329K286
61526C75010J9j835k674l215l642l297k295j766k069k275j714q84m62m93q03j256
61510C46349j444j069n43l79k32L26N42n65k218k592j484n39o35p97j88N84R00
61493C36016J236J990K471K059J308R75R15P07N33N79M50p5l65J68J120J792K175
61476C54054K501K382J260n66k047k449j862q21J61Q10J090J028O09L6j96J22
61460C56112M45J65m37n39m4L16J52rM38J401K278K541K028J085M37N35J141J822
$$ y = [326489, 325857, 325776, 325954, 326241, 326536, 326468, 325750, 324825, 324464, 324693, 324832, 324554, 324115, 323521, 322502, 321456, 321379, 322546, 324172, 325734, 327600, 329812, 331326, 331221, 329998, 328894, 328462, 328427, 328472, 328524, 328616, 328945, 329789, 331033, 332139, 332847, 333499, 334484, 335838, 337547, 339729, 342403, 345592, 349633, 354639, 359700, 363603, 366435, 369395, 372724, 375010, 375029, 373194, 370520, 367305, 363663, 360366, 358071, 356305, 354236, 351961, 350247, 349363, 348901, 348408, 347605, 346349, 344905, 343836, 343293, 342914, 342682, 343008, 343550, 342985, 340767, 338175, 336691, 336152, 335517, 334720, 334532, 335116, 336016, 337252, 339242, 341713, 343772, 345080, 346055, 346970, 347677, 348210, 348789, 349239, 349164, 348799, 348967, 350087, 351879, 354054, 356555, 358937, 360197, 359631, 357584, 355135, 353273, 352452, 352613, 353423, 354513, 355541, 356150, 356186, 355990, 356112, 356557, 356722, 356285, 355746, 355702, 356018, 356170, 356161, 356599, 358000, 360278, 362819, 364847, 365932, 366369, 366904, 368045, 369867]
61442C69867K482L035L095K650K457K950L378L012K591L299M745N360M620L440
61428D16981K474J541P89Q81J681K087J663J235J462J990K384K787L140K869J863
61413D45827P88l2j102k609l798m026l675l478l617l955m370m554m104l179k376
61398D01740j804j089m09n06j370j935j547p91m54m42k79J40P12J335J645J289
61382C96235P11Q56J816K623K692K477K417K201J644J307J621K166K368K244J979
61367D25357J543J153J348K106K583K274J777J952K833L793M274M091L573L626
61353D62283N030P435R657J1001J1618J1661J1026J0010R144Q208O482M170K459
61340E70184J933K015K242K792L356K862J047q76j787j966k173k555l084l965
$$ y = [369867, 372349, 375384, 378479, 381129, 383586, 386536, 389914, 392926, 395517, 398816, 403561, 408921, 413541, 416981, 419455, 420996, 421785, 422666, 424347, 426434, 428097, 429332, 430794, 432784, 435168, 437955, 441095, 443964, 445827, 446615, 446583, 445481, 442872, 439074, 435048, 431373, 427895, 424278, 420323, 415953, 411399, 407295, 404116, 401740, 399936, 398847, 398438, 397932, 396562, 394627, 393080, 392289, 391835, 391393, 391114, 391254, 391966, 393301, 394946, 396235, 396946, 397802, 399618, 402241, 404933, 407410, 409827, 412028, 413672, 414979, 416600, 418766, 421134, 423378, 425357, 426900, 428053, 429401, 431507, 434090, 436364, 438141, 440093, 442926, 446719, 450993, 455084, 458657, 462283, 467313, 474748, 484405, 495406, 507024, 518685, 529711, 539721, 548865, 557073, 563555, 567725, 570184, 572117, 574132, 576374, 579166, 582522, 585384, 586431, 585555, 583768, 581802, 579629, 577074, 573990, 570025]
61326E70025m811m501k825j244j121j972k460k247j847j353m66O45J478J975K454
61311E51730L065L857N018O494P921R281J1088J3342J5009J5170J4040J2251R744
61298F78010O141J857j968m500n767o374o993p827q385q144p420p012o959o448
61284F08211n097l570k644k452k720k989k484p13J530K800K851K834L460M211
61270F03228M652N163N767N575M278L055L116M302N868P757J0073J2266J3681
61257F88781J4336J4384J3517J1550Q949O179L254L49k054m086o475r050j0433
61244G29201r993q935q598q738q394p450o295m917l379k386k323k548k479k521
61230F50245k933k750j019J603L629M510M676M492M193M185M485M420L741L326
$$ y = [570025, 565214, 560713, 557888, 556644, 555523, 553551, 551091, 548844, 546997, 545644, 545178, 545823, 547301, 549276, 551730, 554795, 558652, 563670, 570164, 578085, 587366, 598454, 611796, 626805, 641975, 656015, 668266, 678010, 684151, 686008, 684040, 679540, 673773, 667399, 660406, 652579, 644194, 636050, 628630, 621618, 614659, 608211, 603114, 599544, 596900, 594448, 591728, 588739, 586255, 585542, 587072, 589872, 592723, 595557, 599017, 603228, 607880, 613043, 618810, 624385, 628663, 631718, 634834, 639136, 645004, 652761, 662834, 675100, 688781, 703117, 717501, 731018, 742568, 751517, 757696, 760950, 761299, 759245, 755159, 748684, 739634, 729201, 719208, 710273, 701675, 692937, 684543, 677093, 670798, 665881, 662502, 660116, 657793, 655245, 652766, 650245, 647312, 644562, 643543, 645146, 648775, 653285, 657961, 662453, 666646, 670831, 675316, 679736, 683477, 686803]
61216F86803L911M889N257M986M553L935L068K420K129J446J16o65J01J599K625
61201G27173L685N996R159J1697J3449J5637J8578K1116K2513K3275K3716K3024
61189I19018K0401J6243J1644P371L757J092l79q22j026k062m292o751q130q511
61175I47553r298j1202j3261j4371j4720j4976j5063j4689j4330j4621j5317j5797
61163G79908j5976j5986j5578j4681j3904j3563j2857j0878p968n151k846r12
61151F49608N97J684K773M061M955M846L790J857j232n035p999r133r257r511
61137F32004r555q402o214l946j822N93L231N557P339Q599R281R790J1125J3588
61123F71168J6088J7645J8730K0273K2197K3927K5419K6632K6989K6394K5870
$$ y = [686803, 690714, 695603, 700860, 705846, 710399, 714334, 717402, 719822, 721951, 723397, 723513, 722848, 722949, 724548, 727173, 730858, 736854, 746013, 757710, 771159, 786796, 805374, 826490, 849003, 872278, 895994, 919018, 939419, 955662, 967306, 974677, 978434, 979526, 979147, 978325, 977299, 975237, 970945, 964194, 956064, 947553, 938255, 927053, 913792, 899421, 884701, 869725, 854662, 839973, 825643, 811022, 795705, 779908, 763932, 747946, 732368, 717687, 703783, 690220, 677363, 666485, 658517, 653366, 650520, 649608, 650205, 651889, 654662, 658723, 663678, 668524, 672314, 674171, 672939, 667904, 659905, 650772, 641515, 632004, 622449, 614047, 607833, 603887, 602065, 602658, 605889, 611446, 618785, 627384, 636665, 646455, 657580, 671168, 687256, 704901, 723631, 743904, 766101, 790028, 815447, 842079, 869068, 895462, 921332]
61112I21332K6037K6009K4910K3294K1805J9779J6660J3557J1638J0053P282L535
61100A125891o4l667q044j2587j6164j9259k3136k7257k9736l0130k9778k9484
61088H96585k8805k7551k6179k4680k2698k0624j9049j7448j5027j2526j1308
61077F70690j0964r700p114m685l455l029k904l104l264k614j158L61J633K733
61063F23426L236K817K409L219M909O246P170Q532J0187J1222J1793J2947J4730
61050G22843J6332J7849K0080K2593K4028K4348K4917K6174K7074K7052K6817
61039I80107K6962K7242K7442K7581K7282K6285K5402K5524K6099K6051K5737
61028A271714K6228K7302K8055K9014L1398L4687L7027L7821L7904L7617L7070
$$ y = [921332, 947369, 973378, 998288, 1021582, 1043387, 1063166, 1079826, 1093383, 1105021, 1115074, 1122356, 1125891, 1125827, 1122160, 1114116, 1101529, 1085365, 1066106, 1042970, 1015713, 985977, 955847, 926069, 896585, 867780, 840229, 814050, 789370, 766672, 746048, 726999, 709551, 694524, 681998, 670690, 659726, 650026, 642912, 638227, 634772, 631743, 628839, 625735, 622471, 619857, 618699, 619060, 620693, 623426, 626662, 629479, 631888, 635107, 640016, 646262, 653432, 661964, 672151, 683373, 695166, 708113, 722843, 739175, 757024, 777104, 799697, 823725, 848073, 872990, 899164, 926238, 953290, 980107, 1007069, 1034311, 1061753, 1089334, 1116616, 1142901, 1168303, 1193827, 1219926, 1245977, 1271714, 1297942, 1325244, 1353299, 1382313, 1413711, 1448398, 1485425, 1523246, 1561150, 1598767, 1635837]
61017A635837L7836M1915M9186N8127O8605Q1412R5545J08911J21651J36272J54995
61006B590292J79678K13422K58664L14274L78277M52627N41451O46177P68173
60997F343035R15352J099697J329022J607415J934056K272761K508481K464538
60989B0474357K018397J231235L51882l31986o60564o40349l63536N8977M79988
60980B2618401O93460N12050r0929r26794j703107k204200k381299k307474k085335
60971A2124773j797125j500694j232205j004738q15805o60866n37305m39712l60173
60962C776150k94395k42693k04642j76879j56124j40447j27561j15298j03942
60953B214169r5015q7819q0043p1505o4176n8596n3379m8491m6026m6914m9323
$$ y = [1635837, 1673673, 1715588, 1764774, 1822901, 1891506, 1972918, 2068463, 2177374, 2299025, 2435297, 2590292, 2769970, 2983392, 3242056, 3556330, 3934607, 4387234, 4928685, 5574862, 6343035, 7258387, 8358084, 9687106, 11294521, 13228577, 15501338, 18009819, 20474357, 22492754, 23723989, 24075871, 23743885, 23083321, 22442972, 22079436, 22138413, 22618401, 23311861, 23823911, 23732982, 22806188, 21103081, 18898881, 16517582, 14210108, 12124773, 10327648, 8826954, 7594749, 6590011, 5774206, 5113340, 4576035, 4136323, 3776150, 3481755, 3239062, 3034420, 2857541, 2701417, 2560970, 2433409, 2318111, 2214169, 2119154, 2031335, 1951292, 1879787, 1815611, 1757015, 1703636, 1655145, 1609119, 1562205, 1512882]
60942A512882n1093n1796n1754n0863m9154m7062m4671m1737l8600l5985l3930
60931A016237l1968l0099k8457k6478k3676k0792j8817j7300j5117j2474j0633
60920G80426r975r721r363q967q293o943n244l789k523j210k81JM46J671K699
60905G18934K302J114O93J001O28q68k480l491m140m614m837n169o019o912p105
60890F79037o831o794o809o258n422n046m952m443l724l532l800m075m773o475
60876F06103q329q825p898o880o475o255n918n529m748l246j746j263j556j654
60862E35781j548j825j987q93J177K636K781K364J954J258K55m64p48r86j110
60847E38645o23L65J326K328L613M387L575J599j26j362l029n104o367o394o052
$$ y = [1512882, 1461789, 1409993, 1358239, 1307376, 1258222, 1211160, 1166489, 1124752, 1086152, 1050167, 1016237, 984269, 954170, 925713, 899235, 875559, 854767, 835950, 818650, 803533, 791059, 780426, 770451, 760730, 751367, 742400, 734107, 727164, 721920, 718131, 715608, 714398, 714117, 714118, 714564, 716235, 718934, 721236, 722350, 723043, 724044, 724672, 723804, 721324, 717833, 713693, 709079, 704242, 699073, 693054, 686142, 679037, 672206, 665412, 658603, 652345, 646923, 641877, 636925, 632482, 628758, 625226, 621426, 617351, 612578, 606103, 597774, 588949, 581051, 574171, 567696, 561441, 555523, 549994, 545246, 542000, 540254, 538991, 537435, 535781, 534233, 532408, 530421, 529528, 530705, 533341, 536122, 538486, 540440, 541698, 541953, 541489, 540741, 539755, 538645, 538022, 538387, 539713, 542041, 545654, 550041, 553616, 555215, 555089, 553727, 550698, 545594, 539227, 532833, 526781]
60832E26781n636m339k130m65k99q41j014q87q41n32L21J016P74p8o00n10l83
60815E10337q57k011l259l799l432k866k786k923k651k135k073k530k957l149
60801D72909l380l656l713l626l556l247k587k305l082m252m586m030l507l276
60787D24106k769j932j393j265j078q73j144j712j871j652j683j808j203J18J219
60772D05060J823K584L557L836L119K405K526L075L259K966K608K560L022L726
60758D46126L899L184K355K204K148J225j1k25L38O6j267j949r80M30Q17K72n11
60741D58121j562k984m157m640m957n609o153o039n561n184m661l674k683k382
60727C97875k728l096l023k432j579j040j205j598j332m09J82q4o01o45k91K8
$$ y = [526781, 521145, 516806, 514676, 514211, 513912, 513071, 512057, 511170, 510329, 509797, 510118, 511134, 511908, 511830, 511230, 510720, 510337, 509480, 507469, 504210, 500411, 496979, 494113, 491327, 488404, 485753, 483618, 481545, 479015, 476058, 472909, 469529, 465873, 462160, 458534, 454978, 451731, 449144, 446839, 443757, 439505, 434919, 430889, 427382, 424106, 421337, 419405, 418012, 416747, 415669, 414796, 413652, 411940, 410069, 408417, 406734, 404926, 403723, 403841, 405060, 406883, 409467, 413024, 416860, 419979, 422384, 424910, 427985, 431244, 434210, 436818, 439378, 442400, 446126, 450025, 453209, 455564, 457768, 459916, 461141, 461130, 460905, 461243, 461309, 460042, 458093, 457113, 457543, 458360, 458632, 458121, 456559, 453575, 449418, 444778, 439821, 434212, 428059, 422020, 416459, 411275, 406614, 402940, 400257, 397875, 395147, 392051, 389028, 386596, 385017, 383977, 382772, 381174, 379842, 379433, 379615, 379531, 378930, 378285, 377994, 378022]
60711C78022J48L8k79l94J50R98J266R15Q98J632K335K305J934J903K184K452
60695C96507K775L248L518L292K846K590K550K628K869L132L017K489K115K334
60681D35910K922L444L804M078M176L988L620L220K799K282J588O72l44j221j999
60666D68939k951l945m436m445m820n910o751o410n384m605l836k368p10mj10
60651D12254J69J041J545J385J357J762J877J360P72K92p22k445m011m663m531
60636D07442l934k975k052j678j597j070j40M77Q04J524K432K492J722J400J962
60621D06809K208J302Q8l80l02k90j90L02Q08Q89P17N74M04L45P51J324J230M50
60603D17039j08j55m48j164j320n46K4m89j284j224m75K39J008K198L401M037
$$ y = [378022, 378170, 378208, 377929, 377535, 377685, 378683, 379949, 380864, 381762, 383394, 385729, 388034, 389968, 391871, 394055, 396507, 399282, 402530, 406048, 409340, 412186, 414776, 417326, 419954, 422823, 425955, 428972, 431461, 433576, 435910, 438832, 442276, 446080, 450158, 454334, 458322, 461942, 465162, 467961, 470243, 471831, 472503, 472159, 470938, 468939, 465988, 462043, 457607, 453162, 448342, 442432, 435681, 429271, 423887, 419282, 415446, 413078, 412368, 412364, 412254, 412423, 413464, 415009, 416394, 417751, 419513, 421390, 422750, 423522, 423814, 423092, 420647, 416636, 411973, 407442, 403508, 400533, 398481, 396803, 395206, 394136, 393996, 394473, 395277, 396801, 399233, 401725, 403447, 404847, 406809, 409017, 410319, 410407, 410027, 409725, 409435, 409245, 409547, 410355, 411244, 411961, 412535, 412939, 413284, 414035, 415359, 416589, 417039, 416931, 416776, 416328, 415164, 413844, 413298, 413322, 412833, 411549, 410325, 409850, 410089, 411097, 413295, 416696, 420733]
60587D20733M274M446M216L283K208J603J108J22j014j475j137n06J32P54J204
60572D39951J417J674K193K829L577M807O569Q286R553J0676J2011J3376J4459
60559E31378J5119J4961J3359J0346O711K952j073n102q016r004q376o836m777
60546E51642k673j123k2J383L146M330M577M889O205Q272J0587J3397J6908K0422
60532F41940K3185K5247K6733K7038K5485K2067J7007J0447L220l151p956j1817
60520G99445j5017j6514j5588j3391j1652j0682r752q589p364n840l811j852o33
60507F78760Q4Q98J818K698M019O231Q930J1569J4436J8080K2366K6985L2238
60494H29112L8324M4393M9411N3385N6748N8916N8616N5353M9703M2468L4327
$$ y = [420733, 425007, 429453, 433669, 436952, 439160, 440763, 441871, 441993, 440979, 439504, 438367, 437861, 437993, 438747, 439951, 441368, 443042, 445235, 448064, 451641, 456448, 463017, 471303, 480856, 491532, 503543, 516919, 531378, 546497, 561458, 574817, 585163, 591874, 594826, 593753, 588651, 580635, 571631, 563255, 556419, 551642, 548969, 547846, 547824, 549207, 552353, 556683, 561260, 566149, 572354, 580626, 591213, 604610, 621518, 641940, 665125, 690372, 717105, 744143, 769628, 791695, 808702, 819149, 822369, 819218, 811262, 799445, 784428, 767914, 752326, 738935, 727283, 716601, 706849, 698260, 690896, 685056, 681245, 679393, 678760, 678844, 679742, 681560, 684258, 688277, 694508, 703438, 715007, 729443, 747523, 769889, 796874, 829112, 867436, 911829, 961240, 1014625, 1071373, 1130289, 1188905, 1244258, 1293961, 1336429, 1370756]
60483A370756K5904J7248P583l550j5220k6035l5764m5084n3862o0706o4320o4688
60471A052262o2800n9644n5578n0535m4796l9357l5047l1465k7607k3466j9984
60460F01983j7404j4863j2045r846q795q117p111o214n787n174m036l383l960
60447D95248m676m117k754k112k401k506j975j516j667k184k706l005k772j997
60433D58860j329j267j319p92R3O58Q75J059R90L36m30n66j74J16K22M77Q37J045
60415D59691J266J650J759J269P85J009J566J622J196Q43M71l23j089r06J12Q42
60399D71763P12L39N22J363K461L325L566L205K782K767L049L237L178K894K469
60384E07632K253K604L109K950K281K273L287M131L884L230L122L215K817K334
$$ y = [1370756, 1396660, 1413908, 1421491, 1417941, 1402721, 1376686, 1340922, 1295838, 1241976, 1181270, 1116950, 1052262, 989462, 929818, 874240, 823705, 778909, 739552, 704505, 673040, 645433, 621967, 601983, 584579, 569716, 557671, 547825, 539030, 530913, 523802, 517588, 511801, 506627, 502591, 499208, 495248, 490572, 486455, 483701, 481589, 479188, 476682, 474707, 473191, 471524, 469340, 466634, 463629, 460857, 458860, 457531, 456264, 454945, 454153, 454246, 454904, 455779, 456838, 457828, 458164, 457734, 457168, 456994, 457110, 457332, 457809, 458646, 459691, 460957, 462607, 464366, 465635, 466420, 467429, 468995, 470617, 471813, 472656, 473127, 472804, 471715, 470809, 470921, 471763, 472475, 472814, 473336, 474699, 477160, 480485, 484051, 487256, 490038, 492805, 495854, 499091, 502269, 505163, 507632, 509885, 512489, 515598, 518548, 520829, 523102, 526389, 530520, 534404, 537634, 540756, 543971, 546788, 549122]
60370E49122K408K475J638L03m22l98j89K65J308K335K375J667J390J962K728
60355E68967L170L414L733M434N888P826R156R402R642J0875J2252J2163J0484
60342F71406Q265N804K555j337m977p969j0372j1701j1496j0554j0114r972q975
60329F00563p200n942n590n201m418m094m571m885m348l550l131k689j626k00
60315E43118R67J748K368K934L562M459N667P104Q913J1250J3749J5787J7296
60302F38922J8726K0308K1859K3101K3474K1881J7468J0746L329l495r427j4655
60290G72237j9220k2781k4605k4118k1784j8974j6553j4237j1807r945r067q322
60278E70824o858n291m688m796m542l780l167k812k359k050k347k821k669k067
$$ y = [549122, 551530, 554005, 555643, 555946, 555524, 555126, 554937, 555202, 556510, 558845, 561220, 562887, 564277, 566239, 568967, 572137, 575551, 579284, 583718, 589606, 597432, 606588, 615990, 625632, 636507, 648759, 660922, 671406, 679671, 685475, 688030, 686693, 681716, 673747, 663375, 651674, 640178, 629624, 619510, 609538, 600563, 593363, 587421, 581831, 576630, 572212, 568118, 563547, 558662, 554314, 550764, 547633, 544944, 543318, 543118, 544085, 545833, 548201, 551135, 554697, 559156, 564823, 571927, 580840, 592090, 605839, 621626, 638922, 657648, 677956, 699815, 722916, 746390, 768271, 785739, 796485, 799814, 796319, 786892, 772237, 753017, 730236, 705631, 681513, 659729, 640755, 624202, 609965, 598158, 588213, 579146, 570824, 563966, 558675, 553987, 549191, 544649, 540869, 537702, 534890, 532531, 530481, 528134, 525313, 522644, 520577]
60264E20577j774j707j234n66n11r96j128o08P4P41J551K134J915J205Q71J068
60248E21612J364J681K038J793M63j088j646j496j752k321k127j142m70m19j66
60233E16324N73J043Q73O12P02J148K165L882N427N698M994M545M577M297L653
60218E60513L493L983M408M651N323O415P285P991R043R928R580Q380P774P879
60204F56646P320N746M487M271M219L667L127K789J826M6j491k251l061m366n315
60189F77660n407n478o032o123m949l283k225j744j467j685k545l252l152k705
60175F27613k469k077j075O7O66P66N69j50j302j951j516p80q07j442j660j023
60159F13429k1P17J002J028J026Q94L27m16l74Q57K211K492K199K694L948M654
$$ y = [520577, 518803, 517096, 515862, 515296, 514785, 513789, 512661, 512053, 512127, 512868, 514419, 516553, 518468, 519673, 520544, 521612, 522976, 524657, 526695, 528488, 528951, 527863, 526217, 524721, 522969, 520648, 518521, 517379, 516909, 516490, 516324, 516897, 517940, 518813, 519425, 520127, 521275, 523440, 527322, 532749, 538447, 543441, 547986, 552563, 556860, 560513, 564006, 567989, 572397, 577048, 582371, 588786, 596071, 604062, 613105, 623033, 632613, 640993, 648767, 656646, 663966, 669712, 674199, 678470, 682689, 686356, 689483, 692272, 694098, 694144, 692653, 690402, 687341, 682975, 677660, 672253, 666775, 660743, 654620, 649671, 646388, 644163, 642419, 640952, 639267, 636722, 633470, 630318, 627613, 625144, 623067, 621992, 622059, 622725, 623491, 624060, 623910, 622608, 620657, 619141, 618361, 617554, 616112, 614452, 613429, 613408, 614125, 615127, 616155, 617181, 618075, 618402, 617986, 617612, 618469, 620680, 623172, 625371, 628065, 632013, 636667]
60143F36667M366L983L987L959L969M750O077O668O271O134O808P185O494N619
60129G12937N427N271M240K642J120n35k539m034m016k689j073J48P66P21K60
60114G18646j71n53j160j675j442p99r25k074l172l539l743m236m504m165l723
60099F82765l564l329k812k375j951q94O74J695J835K065K978L903M265M456M754
60084F94465M764M575M921N535M921K665L68p27j455k986m925o398p688r386j1028
60069F77621j1857j2013j1791j0805r012p472o974o917o517o004n587m550k659
60056E75463j248j403k136j854p15J9J88P13J819K793L252L498L814M260M881
60041E93344N423N341M588L761L026J764j05j595k199k853m402o112o800o471
$$ y = [636667, 641033, 645016, 649003, 652962, 656931, 661681, 667758, 674426, 680697, 686831, 693639, 700824, 707318, 712937, 718364, 723635, 727875, 730517, 731637, 731102, 728563, 724529, 720513, 717824, 716751, 716899, 717665, 718386, 718646, 718475, 717922, 716762, 715087, 713645, 712846, 711921, 709847, 706675, 703136, 699393, 695157, 690653, 686488, 682765, 679201, 675872, 673060, 670685, 668734, 667840, 668514, 670209, 672044, 674109, 677087, 680990, 685255, 689711, 694465, 699229, 703804, 708725, 714260, 719181, 721846, 722214, 721487, 720032, 717046, 712121, 705723, 698035, 688649, 677621, 665764, 653751, 641960, 631155, 622143, 614671, 607697, 600780, 594263, 588259, 582672, 578122, 575463, 574215, 572812, 570676, 568822, 568107, 568126, 568314, 569027, 570846, 573639, 576891, 580389, 584203, 588463, 593344, 598767, 604108, 608696, 612457, 615483, 617247, 617142, 615547, 613348, 610495, 606093, 599981, 593181, 586710]
60027E86710n887n356m958n053n543n554m742m074m334m882m877m688m943n188
60013E16631m760m153m208m618m460l620k714k065j635j369r27J57J432J670P21
59998D86082L8N82J454J567J390J779K462K889L483M590N312M818L805L302K985
59983E26538K106J076N99J59j065k580l408l770m367m788m196k975k184j863j333
59968D97949o26k34L5O45J331J707K220L292M255M453M538N222N654M589K531
59953E37561J030L70l25j233j758j975k493l097l015k351j961k080k326k719l471
59938E10157m063l771k862k127j638r70j93M43J227K341L105L063L063M038N443
59923E17256O171O300O581O996P237P845R274J0502J0226Q813P596O743N536M123
$$ y = [586710, 580823, 575467, 570509, 565456, 559913, 554359, 549617, 545543, 541209, 536327, 531450, 526762, 521819, 516631, 511871, 507718, 503510, 498892, 494432, 490812, 488098, 486033, 484398, 483029, 482102, 482259, 483691, 485361, 486082, 486120, 486702, 488156, 489723, 491113, 492892, 495354, 498243, 501726, 506316, 511628, 516446, 520251, 523553, 526538, 528644, 529720, 530319, 530478, 529413, 526833, 523425, 519655, 515288, 510500, 506304, 503329, 501145, 499282, 497949, 497323, 497089, 497124, 497769, 499100, 500807, 503027, 506319, 510574, 515027, 519565, 524787, 530441, 535030, 537561, 538591, 538961, 538636, 537403, 535645, 533670, 531177, 528080, 525065, 522714, 520753, 518673, 516347, 513628, 510157, 506094, 502323, 499461, 497334, 495696, 494726, 494533, 494976, 496203, 498544, 501649, 504712, 507775, 511813, 517256, 523427, 529727, 536308, 543304, 550541, 558386, 567660, 578162, 588388, 597201, 604797, 611540, 617076, 621199]
59909F21199L306L003K542K063K078K097J276%p80j246k169l160l218k538k094
59894F22359j837j036K3M84O42J409K401K506J967J995K586K744K614L359M926
59879F47142O004O239O477O791O351N354M984N095M118J702n10j458k057l251
59865F92981m409m636m221l806l308k614k263k690l488m011m038l587k845k360
59851F44705k512k644j671M71K792M602N975P021P770Q551R419R350P196L322
59837G04347p04l728n218m488j334K718N466O234N733M062O64l765p148q346q183
59822F86310p860p664p427p042o193m715l270k693k719k492k037k019k347k458
59808F25374k624l413m162l662k228j304j129p13l4k68j578k688l045l484m316
$$ y = [621199, 624505, 627508, 630050, 632113, 634191, 636288, 637564, 637564, 636784, 635538, 633369, 630209, 626991, 624453, 622359, 620522, 619486, 619509, 619993, 620635, 622044, 624445, 626951, 628918, 630913, 633499, 636243, 638857, 642216, 647142, 653146, 659385, 665862, 672653, 679004, 684358, 689342, 694437, 698555, 700257, 699747, 698289, 696232, 692981, 688572, 683936, 679715, 675909, 672601, 669987, 667724, 665034, 661546, 657535, 653497, 649910, 647065, 644705, 642193, 639549, 637878, 638349, 641141, 645743, 651718, 658739, 666509, 675060, 684479, 693829, 701025, 704347, 703643, 699915, 694697, 690209, 688875, 691593, 697059, 703293, 709026, 713088, 713752, 709987, 702839, 694493, 686310, 678450, 670786, 663359, 656317, 650124, 645409, 642139, 639446, 636727, 634235, 632198, 630179, 627832, 625374, 622750, 619337, 615175, 611513, 609285, 607981, 606852, 606139, 606105, 605837, 604259, 601571, 598526, 595042, 590726]
59793E90726m556l761k892k665k560k152k008k515l059l109k949k841k522j970
59779E51167j566j262n81K98O83O81J103J950K372K278K608L688M688N048N144
59764E78299N268N209N083N372N904O049N919O176O628O509O018O084O586O494
59750F61598N779N522N934O046N579N304N309M747L563K717K260J163n74j532
59736G13415j224q87j309j737j637j714k272k403j703j179j460j705j200n60l74
59721F92051k13J61M5p89j393j248j144j519j417j90J134J369Q50N34N17N66J039
59704F90353K136L069K995K192J493J256J404J858K330K440K311K362K369J719
59690G20287N62m39j442l046m553m352k449r20j200k458l245l280k972k665l036
$$ y = [590726, 586170, 582409, 579517, 576852, 574292, 572140, 570132, 567617, 564558, 561449, 558500, 555659, 553137, 551167, 549601, 548339, 547758, 548056, 548739, 549420, 550523, 552473, 554845, 557123, 559731, 563419, 568107, 573155, 578299, 583567, 588776, 593859, 599231, 605135, 611184, 617103, 623279, 629907, 636416, 642434, 648518, 655104, 661598, 667377, 672899, 678833, 684879, 690458, 695762, 701071, 705818, 709381, 712098, 714358, 715521, 714947, 713415, 712191, 711304, 709995, 708258, 706621, 704907, 702635, 700232, 698529, 697350, 695890, 694185, 692985, 692425, 692051, 691838, 691999, 692044, 691255, 689862, 688614, 687470, 685951, 684534, 684344, 685478, 686847, 687697, 688231, 688748, 689314, 690353, 692489, 695558, 698553, 700745, 702238, 703494, 704898, 706756, 709086, 711526, 713837, 716199, 718568, 720287, 720849, 720410, 718968, 715922, 711369, 707017, 704568, 703648, 702448, 699990, 696745, 693465, 690493, 687828, 684792]
59675F84792m794p275q660q218p115o454n924m959l832k961k330k053k290k384
59661F15543j528l96l77j084o37J261K769K991L256M409N122M232K684J767J182
59646F41194K53o52j327k713n210p430q024p451o747n862m513l288k600j732j49
59631E83749J325J736J266L50j183l138m430m603m605n080n176m071k349r81j84
59616E52626j09j160k775l454k915k613l207l269j598Q50K608L598M188L995K967
59601E49732K149K169K330K150K187K410J730K47j71J139K253J742Q45Q72P87
59586E72571n05j683j298n76j327k697k704j649j355k019k420k329k270j759k63
59571E47717R27K10j522k058j256q03j082q65K5K64n26j083o73n2J16K15N32O36
$$ y = [684792, 679998, 672723, 664063, 655845, 648730, 642276, 636352, 631393, 627561, 624600, 622270, 620217, 617927, 615543, 614015, 613619, 613242, 612158, 611521, 612782, 615551, 618542, 621798, 626207, 631329, 635561, 638245, 640012, 641194, 641447, 640795, 639468, 636755, 631545, 624115, 616091, 608640, 601893, 596031, 591518, 588230, 585630, 583898, 583749, 585074, 586810, 588076, 588426, 587243, 584105, 579675, 575072, 570467, 565387, 560211, 556140, 553791, 552810, 552626, 552517, 551357, 548582, 545128, 542213, 539600, 536393, 533124, 531526, 532376, 534984, 538582, 542770, 546765, 549732, 551881, 554050, 556380, 558530, 560717, 563127, 564857, 565104, 564933, 566072, 568325, 570067, 570912, 571784, 572571, 572066, 570383, 569085, 568509, 567182, 564485, 561781, 560132, 558777, 556758, 554338, 552009, 549739, 547980, 547717, 548644, 548854, 547332, 545274, 544018, 543215, 542133, 541268, 541293, 541557, 541031, 539948, 539275, 539223, 539339, 539554, 540086, 540722]
59553E40722L58K94P98J402J518J184R58J417K670M145N235O235P941J0174J1825
59538E96876J2813J4782J9060K4744K9156K9271K2878J0484l332j2463j4516j2171
59526G17582q882n416j576J468K657K833K972K232k37l176n025o350q353j0332
59512F80397j0931j0690j1028j1727j1570j0599r634q438o451m543m008m447m520
59499E71811m031l535k843j686q92j053j023L15J875J987J153R96J494J480J075
59484E67123J331K145K628K940L664M187L777L448M522O114O477O038O597Q008
59470F28999Q280O767M759L006J045q91j632j025k12L19J278K942M629N928P141
59455F71333Q467R788J1084J2041J1827J0329Q846Q292P817O440M856L923K599
$$ y = [540722, 541080, 541374, 542172, 543574, 545092, 546276, 547234, 548651, 551321, 555466, 560701, 566936, 574877, 585051, 596876, 609689, 624471, 643531, 668275, 697431, 726702, 749580, 760064, 756732, 744269, 729753, 717582, 708700, 703284, 701708, 703176, 705833, 708666, 711638, 713870, 713633, 710457, 705432, 699082, 690729, 680397, 669466, 658776, 647748, 636021, 624451, 613852, 604218, 595780, 589329, 584786, 580778, 576331, 571811, 567780, 564245, 561402, 559716, 558824, 557771, 556748, 557063, 558938, 560925, 562078, 563074, 564568, 566048, 567123, 568454, 570599, 573227, 576167, 579831, 584018, 587795, 591243, 595765, 601879, 608356, 614394, 620991, 628999, 637279, 644046, 648805, 651811, 652856, 651965, 650333, 649308, 649096, 649415, 650693, 653635, 658264, 664192, 671333, 679800, 689588, 700672, 712713, 724540, 734869, 743715, 752007, 759824, 766264, 771120, 775043, 777642]
59442G77642n62m908q674j1476j3759j4776j3467j0646q157o350m539l073k840
59429F74415l288l101k215j173P09M244Q270J0974J2647J4833J7383J8754J8818
59416G71270J8888J9275J9117J8487J8763K0931K4639K7887K6512J6261j866j9995
59404I60169l0051l1061k7395k1848j4058m212O046J5739K3448K4756J5549j494
59392I15588j7736k6908k9427k8277k4838k0009j5681j2812j0325p398m837l324
59380G14016k367j708j720j891j014O38J465J065N27K06m02o85N08K264K468J383
59364G14753J446L206M580M630M915O332P689Q402R655J1754J3104J3043J3089
59351H16598J4314J5870J7157J8813K0602K0926J9621J8645J8750J8017J5036
$$ y = [777642, 777080, 772172, 763498, 752022, 738263, 723487, 710020, 699374, 691217, 684867, 680328, 677255, 674415, 671127, 668026, 665811, 664638, 665347, 669591, 677861, 688835, 701482, 716315, 733698, 752452, 771270, 790158, 809433, 828550, 847037, 865800, 886731, 911370, 939257, 965769, 982030, 980164, 960169, 930118, 899057, 871662, 849814, 835756, 831544, 837590, 853329, 876777, 901533, 917082, 915588, 897852, 870944, 841517, 813240, 788402, 768393, 752712, 739900, 729575, 722177, 717340, 714016, 711649, 709941, 708221, 706330, 705316, 705954, 707419, 708484, 709011, 709217, 708815, 708130, 708638, 710902, 713370, 714753, 716199, 719405, 723985, 728615, 733530, 739862, 747551, 755953, 765608, 777362, 790466, 803509, 816598, 830912, 846782, 863939, 882752, 903354, 924280, 943901, 962546, 981296, 999313, 1014349]
59340A014349J1066P582M018m23m844q184j0951j3948j6777j8789k0094k0755
59328I22250k0506j9875j9927k0247j9159j6499j4160j3182j2454j1069r827r430
59316G35915r169q419p660p234o717o156o162o323n469l852k972k938k263o12
59302F59969P19J477K971N287O753P047Q203J1434J5218J7453J7184J3558N885
59289G73158m115j2543j7023j8219j7222j4137r927o641m564j773K311N662P075
59276F82042Q016R783J1598J2883J4606J6870J7862J6831J5458J4805J3602J1144
59264H45500Q960P821N909K029k005m324n777p668r223r530r696j0651j1025r538
59250G90782p453o436n869m555l177k743k362p73J466L328N166P279Q403P684
$$ y = [1014349, 1025415, 1032997, 1037015, 1036592, 1031748, 1023564, 1012613, 998665, 981888, 963099, 943005, 922250, 901744, 881869, 861942, 841695, 822536, 806037, 791877, 778695, 766241, 755172, 745345, 735915, 726746, 718327, 710667, 703433, 696716, 690560, 684398, 678075, 672606, 668754, 665782, 662844, 660581, 659969, 660688, 662165, 665136, 670423, 677176, 684223, 692426, 703860, 719078, 736531, 753715, 767273, 773158, 769043, 756500, 739477, 721258, 704036, 689899, 679972, 673331, 668767, 666994, 669305, 674967, 682042, 690058, 699841, 711439, 724322, 738928, 755798, 773660, 790491, 805949, 820754, 834356, 845500, 854460, 862281, 868190, 870219, 868214, 863890, 858113, 850445, 841222, 831692, 821996, 811345, 800320, 790782, 783329, 776893, 771024, 766469, 763292, 760549, 758187, 757414, 758880, 762208, 767374, 774653, 783056, 790740]
59236G90740O500O264O096M625K510J117K26j044k488l794n683q307j0160j0297
59222G76305j0001j0561j1188j0888j0517j0992j1270j0193q620p770p148o035
59210F61122n278n525n433l756j687r37j088q53m63o35o95J98J275J603J899K959
59194F42706L805L382K645K958L808M045L991M390M686M276M023M622M978M155
59180F98470L324L804M698M530L710L345L130K492K292L270M232L931L341L936
59166G48505N133N574N467N545N089L176O51j243k933n289p732r454j1030j2897
59152G28562j3827j2943j1584j1162j0819r378p816p497p602o779n708n578n631
59139F12238m744l888m428n366m932l566k759k288j112K04N64O31J539K661L022
$$ y = [790740, 797240, 803504, 809600, 814225, 816735, 817852, 818078, 817034, 814546, 810752, 805069, 796762, 786602, 776305, 766304, 755743, 744555, 733667, 723150, 712158, 700888, 690695, 682075, 674305, 667157, 661122, 655844, 650319, 644886, 641130, 639443, 638506, 637418, 636565, 636102, 635467, 634772, 634970, 636245, 637848, 639747, 642706, 646511, 649893, 652538, 655496, 659304, 663349, 667340, 671730, 676416, 680692, 684715, 689337, 694315, 698470, 701794, 705598, 710296, 714826, 718536, 721881, 725011, 727503, 729795, 733065, 737297, 741228, 744569, 748505, 753638, 759212, 764679, 770224, 775313, 778489, 779140, 777897, 774964, 769675, 761943, 752489, 741459, 728562, 714735, 701792, 690208, 679046, 668227, 658849, 651033, 643536, 635934, 629155, 623447, 617869, 612238, 607494, 603606, 599178, 593812, 588880, 585314, 582555, 580267, 579155, 579359, 579923, 580554, 582093, 584754, 587776]
59124E87776L562N404P288P466O818P389R038J0319J1469J3592J5879J6529J5711
59111G18240J5019J4774J4261J3610J3105J1743Q955O554O315O844N522K476j73
59098H37245j876l618n321o122o516p432q040o997n021l731k928j633o25j208
59084G76177k547l034l230m653o730p817q137q786q987p445n355m846n432n174
59070F94004m387m767n787n529m475m831o463p025n944m953m719m273l610l738
59056F23503m169l367j630o79n04L59J678J728N59pL54J50q52j187n12j33m69
59039F14822n21n8P4j61L1N81R30J652L402N068N342N338O948R541J1141J2015
59023F76145J3892J6358J7327J6600J5655J4375J1351P182L998J854j104m916
$$ y = [587776, 591338, 596742, 604030, 611496, 618314, 625703, 634741, 645060, 656529, 670121, 686000, 702529, 718240, 733259, 748033, 762294, 775904, 789009, 800752, 809707, 816261, 822576, 829420, 834942, 837418, 837245, 835369, 831751, 826430, 820308, 813792, 806360, 798320, 791323, 786302, 782571, 779643, 778010, 777385, 776177, 773630, 770596, 767366, 762713, 755983, 748166, 740029, 731243, 722256, 714811, 709456, 704610, 699178, 694004, 689617, 684850, 679063, 673534, 669059, 664228, 657765, 650740, 644796, 639843, 635124, 630851, 627241, 623503, 619334, 615967, 614337, 613658, 613154, 613513, 615191, 616919, 617478, 617471, 617825, 617975, 617123, 615936, 615424, 615291, 614822, 614301, 614243, 614317, 614156, 614187, 614768, 615698, 617350, 620752, 625820, 631162, 636500, 643448, 652989, 664130, 676145, 690037, 706395, 723722, 740322, 755977, 770352, 781703, 788885, 792883, 794737, 793633, 788717]
59011G88717p502q105p975p567o172m263l198k607r55J499L238M505O613Q681
58997G64909Q568O801N961O308N653L620K313K400K133O96q34k225m375o567o864
58982G88497n621n203n804n027k105R15K785M444O195O934O941Q158J0811J2809
58968H24729J3218J3337J3784J3631J2988J3299J4434J4504J3092J1627J0214
58957I68857P275K853j073m069p698j2079j5380j7288j9424k1727k2033k0096
58945H38118j8366j7819j6541j3539j0474q441o342l673j830j375j056m01m13
58932G37848r10l80P91L06k048l783l907m125n055n023l753l447m780n466m375
58917F91893l430l813l712j819K44Q65R23J583K375L038M496O640P794P703Q295
$$ y = [788717, 781215, 773110, 765135, 757568, 751396, 747133, 743935, 741328, 740373, 741872, 745110, 749615, 756228, 764909, 773477, 780278, 786239, 792547, 798200, 801820, 804133, 806533, 808666, 809362, 808528, 806303, 801928, 795361, 788497, 782876, 777673, 771869, 766842, 764737, 765652, 768437, 772881, 779076, 786010, 792951, 801109, 811920, 824729, 837947, 851284, 865068, 878699, 891687, 904986, 919420, 933924, 947016, 958643, 968857, 976132, 978985, 977912, 973843, 966145, 954066, 938686, 921398, 901974, 880247, 858214, 838118, 819752, 801933, 785392, 771853, 761379, 752938, 746596, 742923, 741093, 739718, 738662, 738261, 737848, 736938, 736558, 737349, 737655, 735607, 731824, 727917, 723792, 718737, 713714, 709961, 706514, 701734, 696268, 691893, 688463, 684650, 680938, 679119, 679363, 680228, 681151, 682734, 685109, 688147, 692643, 699283, 707077, 714780, 723075]
58902G23075J0420J2682J4434J6749J9417K0361J9240J8344J8675J8584J7498
58891I09479J7385J9038K0517K0926K2141K4922K6824K5907K3299K0209J5692
58880A146339R475L678l39m014q610j3104j6743k0524k4322k5767k3958k1257
58868A000854j9494j7441j4001j0768r278q626p811p681q649r296r001r136j0081
58855H59591j0126q886q488r636r920p994o012n917o623o966q016j0188j1449
58842G49370j0798j0312j1427j2406j1753j0799j0564r430o502l913l198k613
58830F45655p43N76k80j485j014p5l45o74M46J873K196K482L837M794L986K883
58814F64112L064L309K118O68N46R34N21j03l17j110k662l049j629q31k250l973
$$ y = [723075, 733495, 746177, 760611, 777360, 796777, 817138, 836378, 854722, 873397, 891981, 909479, 926864, 945902, 966419, 987345, 1009486, 1034408, 1061232, 1087139, 1110438, 1130647, 1146339, 1155814, 1159492, 1159153, 1155139, 1146529, 1133425, 1116682, 1096158, 1071836, 1046069, 1022111, 1000854, 981360, 963919, 949918, 939150, 929872, 921246, 913435, 905754, 897105, 887809, 878808, 869672, 859591, 849465, 840579, 832091, 822455, 812535, 804541, 798529, 792612, 785989, 779023, 771007, 760819, 749370, 738572, 728260, 716833, 704427, 692674, 681875, 671311, 661881, 655379, 651466, 648268, 645655, 644912, 645488, 645208, 643723, 642709, 642634, 642289, 641615, 642061, 643934, 646130, 648612, 652449, 657243, 661229, 664112, 667176, 670485, 672603, 673271, 673817, 674751, 675272, 675169, 674852, 673742, 671080, 668031, 666402, 665571, 663321, 659348]
58798F59348m187m213n375o142n245m424n139n669m415k951k739k030P47L635
58784F11201M514M708N888O478M793K766K781L525K781J692K375L600K787K54
58770F60143j993l773n745p017o898o871p867p949n657k990j927r27J764M275
58756F06568M318L404L919M677L480J657J764K907K548J119Q70J733K236K813
58742F44013M635O667P335P487Q536R544R295R147J0564J2047J1778J1012J1437
58729G63497J1671R967P936P759Q054O324L419J735J092K40J64K147M550N289
58715H33844N390O501P233N748L496K516J485j495m790o126p062j0137j3943j5645
58701H07015j6138j8072k0763k1756k1530k2034k2381k0568j7693j5975j4401
$$ y = [659348, 655161, 650948, 645573, 639431, 634186, 629762, 624623, 618954, 614539, 611588, 608849, 606819, 607566, 611201, 615715, 620423, 626311, 632789, 637582, 640348, 643129, 646654, 649435, 651127, 653502, 657102, 659889, 660143, 658150, 654377, 648632, 641615, 634717, 627846, 619979, 612030, 606373, 603383, 601456, 600529, 602293, 606568, 610886, 614290, 618209, 622886, 626366, 628023, 629787, 632694, 635242, 636361, 637231, 638964, 641200, 644013, 648648, 655315, 662650, 670137, 678673, 688217, 697512, 706659, 717223, 729270, 741048, 752060, 763497, 775168, 785135, 793071, 800830, 808884, 815208, 818627, 820362, 821454, 821694, 821858, 824005, 828555, 833844, 839234, 845735, 852968, 858716, 862212, 864728, 866213, 864718, 859928, 853802, 846740, 836603, 822660, 807015, 790877, 772805, 752042, 730286, 708756, 686722, 664341, 643773, 626080, 610105, 595704]
58690E95704j0909o977n426n432m416l082l723n268m942l414l411m536m184k410
58676E27574j317q57L11J258N45Q9K687P101R987J1195J2750J4365J4654J4997
58662F15339J7231J9120J7032J1701O515J797m163j0014j2681j2645j2805j3257
58650F23170j2131j0271r965j0282q609n691m147l432j301J204J499P09J788L807
58636E66348L530J377L23J38j563l793l507j429q90j805j422l5j43r39M63L157
58620E59810L732K616L209N477O421O218P768J0599J1298R579Q085O698L182j144
58606F43548k610j704k113l753l163n29K87j320k164j732k674m660m304j582j7
58591F11510q9J265M288N922O101Q126J2213J4907J5419J6295J7390J5754J2003
$$ y = [595704, 584795, 577818, 572392, 566960, 562544, 559462, 555739, 550471, 545529, 542115, 538704, 534168, 529984, 527574, 526257, 525400, 525711, 526969, 527514, 527603, 530290, 537391, 547378, 558573, 571323, 585688, 600342, 615339, 632570, 651690, 668722, 680423, 686938, 688735, 684572, 674558, 661877, 649232, 636427, 623170, 611039, 600768, 590803, 580521, 571912, 566221, 562074, 558642, 557341, 558545, 560044, 560753, 562541, 566348, 569878, 571255, 571578, 571716, 570153, 566360, 562853, 561424, 560534, 558729, 557307, 557272, 557129, 556190, 556653, 559810, 563542, 566158, 569367, 574844, 581265, 587483, 595251, 605850, 617148, 626727, 634812, 641510, 644692, 643548, 640938, 639234, 637121, 633368, 630205, 629676, 629963, 628643, 626479, 624747, 622073, 617413, 613109, 611527, 611510, 611421, 612686, 616974, 622896, 628997, 637123, 649336, 664243, 679662, 695957, 713347, 729101, 741104]
58578G41104J0223J0758R712O342M329M739M495L071L955Q000J1696J3678J6751
58565H48853K1876K6191K8536L1013L3686L3627L0572K7637K5245K0221J2077
58554A139534M345j433p018j1995j3356j1582j0825j1856j1291q817q456j1260
58542A035990j3562j4104j6168k0762k4235k4719k4607k4867k3157j9445j7144
58531H13220j6789j4771j0134o430n178l768j413p53j846j169J739L059J681Q23
58517G58271J291P0k897l697j899j771m228n077l227k902n371o228l663j734k532
58502G14406k639m74L39j816l267k277k250m426m736j465J114M69J25K559M779
58487G00441M725N263Q035R995R743J0668J4226J6784J6582J7007J9459J9963
$$ y = [741104, 751327, 762085, 771797, 778139, 782468, 787207, 791702, 794773, 798728, 806728, 818424, 832102, 848853, 870729, 896920, 925456, 956469, 990155, 1023782, 1054354, 1081991, 1107236, 1127457, 1139534, 1143879, 1142446, 1135428, 1123433, 1110077, 1098495, 1087670, 1075814, 1064523, 1055706, 1047250, 1035990, 1022428, 1008324, 992156, 971394, 947159, 922440, 897833, 872966, 849809, 830364, 813220, 796431, 781660, 771526, 765096, 759918, 756150, 754737, 753984, 752138, 750969, 752708, 755767, 757448, 758271, 759562, 759632, 756735, 753038, 751139, 749368, 745140, 740063, 736836, 733934, 728563, 722335, 718672, 716938, 714406, 711767, 711293, 711632, 709816, 706549, 704272, 702022, 697596, 692860, 691395, 692509, 692978, 693103, 695662, 700441, 705166, 710429, 718464, 728459, 738202, 748870, 763096, 779880, 796462, 813469, 832928, 852891]
58475H52891J6482J2641J0491O699l12o517r433j2080j5975j7462j5001j2829
58463H09595j3173j2042p044k145k63J708O039R455R872J0694J3831J5416J2995
58450H54938J0003Q615N410j291o958q513r322j1935j3085j0580p965p529o034
58437G95754j942N79l36j50L385N467L356K041N212Q610Q398Q135J1285J4415
58423H64209J4099J3176J4012J2982P800K831J048j672q066j3174j2960j1510
58411H82775j3027j4404j2460j0799j2544j3713j0794p556p501p135l461m79j258
58398G67644j376K652O254N294L720N456O715L952J370K811M098J317j328J90
58384H08769J727o87k724k38K383P91o95K312N343L734J907M850Q423P487N730
$$ y = [852891, 869373, 882014, 892505, 899204, 898892, 892375, 882942, 870862, 854887, 837425, 822424, 809595, 796422, 784380, 777336, 775191, 774928, 776636, 782675, 792130, 802002, 812696, 826527, 841943, 854938, 864941, 873556, 878966, 877675, 870717, 862204, 852882, 840947, 827862, 817282, 809317, 801788, 795754, 793812, 794391, 794055, 793905, 797290, 802757, 806113, 808154, 813366, 821976, 830374, 838509, 849794, 864209, 878308, 891484, 905496, 918478, 926278, 929109, 930157, 928485, 920419, 907245, 894285, 882775, 869748, 855344, 842884, 832085, 819541, 805828, 795034, 787478, 779977, 772842, 769381, 768902, 767644, 766268, 768920, 775174, 780468, 784188, 789644, 796359, 800311, 801681, 804492, 808590, 809907, 808579, 808769, 810496, 809809, 807085, 806847, 809230, 810021, 809326, 811638, 816981, 820715, 822622, 827472, 835895, 843382, 849112]
58369H49112P945J0454Q769O971R910J3729J3599J2977J5788J7616J4216J0548
58357I91634J1510J2267P732K874L244M143N4m089k288Q21q13k633J376O238N136
58342A037206K593N871J1327J2080J1393J5555K1000K1322J9659K1550K3046J8623
58330A221225J3096J2879J3349P823R61N1J176k345o158l396J270K64k355P34
58316A258574N500M704K393N590R881Q158N240Q711J3728J2374R264J2308J6843
58303A373268J5088J2078J5664K0068J6540J0899J2855J7373J4919J0522J3755
58292A533029J9269J6969J2220J5766K2674K1915J7899K1329K7481K5365J9858
58281A753774K2585K9046K7399K1917K4680L1865L1550K7375L0914L8193L7739
$$ y = [849112, 857057, 867511, 876280, 883251, 893161, 906890, 920489, 933466, 949254, 966870, 981086, 991634, 1003144, 1015411, 1023143, 1026017, 1029261, 1033404, 1033458, 1029369, 1027081, 1027902, 1027089, 1024456, 1025832, 1032070, 1037206, 1039799, 1045670, 1056997, 1069077, 1080470, 1096025, 1117025, 1138347, 1158006, 1179556, 1202602, 1221225, 1234321, 1247200, 1260549, 1268372, 1269333, 1269384, 1270560, 1268215, 1262057, 1258661, 1259931, 1260195, 1257840, 1258574, 1264074, 1268778, 1271171, 1276761, 1286642, 1294800, 1300040, 1308751, 1322479, 1334853, 1344117, 1356425, 1373268, 1388356, 1400434, 1416098, 1436166, 1452706, 1463605, 1476460, 1493833, 1508752, 1519274, 1533029, 1552298, 1569267, 1581487, 1597253, 1619927, 1641842, 1659741, 1681070, 1708551, 1733916, 1753774, 1776359, 1805405, 1832804, 1854721, 1879401, 1911266, 1942816, 1970191, 2001105, 2039298, 2077037]
58270B077037L4136L9342M8439M8707M4818M9661N8428N7803N2548N6137O3423
58259B630479O0190N1576N2492N8215N3708M4008M5215N3314N2733M7815N4168
58248C203913O6834O9459O6937P5651Q9748R1619Q7342R5973J12268J16966J15258
58237D191968J26561J44922J49601J46389J56884J75567J80611J78457J92629
58228E643589K17151K27882K31115K51897K83408K99482L08093L38058L81878
58219H182553M09058M27139M68960N28326N72386O09191O75056P63167Q36756
58210A3472592R05180J010494J146953J276123J414197J616004J880707K170002
58202B4892252K513053K987875L603130M311405N134235O149630P363522Q737866
$$ y = [2077037, 2111173, 2150515, 2198954, 2247661, 2292479, 2342140, 2400568, 2458371, 2510919, 2567056, 2630479, 2690669, 2742245, 2794737, 2852952, 2906660, 2950668, 2995883, 3049197, 3101930, 3149745, 3203913, 3270747, 3340206, 3407143, 3482794, 3572542, 3664161, 3751503, 3847476, 3959744, 4076710, 4191968, 4318529, 4463451, 4613052, 4759441, 4916325, 5091892, 5272503, 5450960, 5643589, 5860740, 6088622, 6319737, 6571634, 6855042, 7154524, 7462617, 7800675, 8182553, 8591611, 9018750, 9487710, 10016036, 10588422, 11197613, 11872669, 12635836, 13472592, 14377772, 15388266, 16535219, 17811342, 19225539, 20841543, 22722250, 24892252, 27405305, 30393180, 33996310, 38307715, 43441950, 49591580, 56955102, 65692968]
58194F5692968J0345350J2339959J4779969J7663691K1137628K5460224L0763148
58187A98182937L7025979M3993437N0333800N2698286M6716724L0344237O598495
58180D65893895j7580019l5646181m4913618m6581618m3568760l8661394l3759713
58173B05182592k9661883k6206125k2906005j9603975j6499552j3753454j1347768
58166F5203830r273559p589788o273846n202328m306628l605578l076969k632796
58158B3242338k235327j918479j681140j466329j257581j096158r88992q89498
58150A1708834p82174p02191o57989o12001n51269n05212m80692m46689l95677
58141F574940l57171l38620l12213k71098k42016k31593k14580j85857j71720
$$ y = [65692968, 76038318, 88378277, 103158246, 120821937, 141959565, 167419789, 198182937, 235208916, 279202353, 329536153, 382234439, 428951163, 459295400, 465893895, 448313876, 412667695, 367754077, 321172459, 277603699, 238942305, 205182592, 175520709, 149314584, 126408579, 106804604, 90305052, 76551598, 65203830, 55930271, 48340483, 42066637, 36864309, 32557681, 28952103, 25875134, 23242338, 21007011, 19088532, 17407392, 15941063, 14683482, 13587324, 12598332, 11708834, 10926660, 10224469, 9566480, 8954479, 8403210, 7897998, 7417306, 6970617, 6574940, 6217769, 5879149, 5566936, 5295838, 5053822, 4822229, 4607649, 4421792, 4250072]
58132D250072j78414j79351j64537j55214j58468j53265j33167j19410j19735
58123B888511j15309r9666r1078r5270r3860q0680p3163p7194p5857o3423n6378
58112A966633o0527o0029m9222m3461m8409m9389m0986l7326m3354m4978l7184
58101A451768l3660l9227m0310l1997k7602l2245l3220k5646k1911k6637k7531
58090A111782k0094j6608k1525k2299j3932q862j3015j5212r932p920j4438j8842
58078I29103j5566j4357k0030k2714j7725j5051j9605k1664j6207j2612j5872
58067G37700j6999j1277p635j0773j1987o736l607o881p741j858J551k789o551
58054F44417m523m281j0139j3851j0567q152j1443j2785p430l068m889o089k301
$$ y = [4250072, 4071658, 3892307, 3727770, 3572556, 3414088, 3260823, 3127656, 3008246, 2888511, 2773202, 2673536, 2582458, 2487188, 2393328, 2312648, 2239485, 2162291, 2086434, 2023011, 1966633, 1906106, 1846077, 1796855, 1753394, 1704985, 1655596, 1614610, 1577284, 1533930, 1488952, 1451768, 1418108, 1378881, 1338571, 1306574, 1278972, 1246727, 1213507, 1187861, 1165950, 1139313, 1111782, 1091688, 1075080, 1053555, 1031256, 1017324, 1008462, 995447, 980235, 970303, 962383, 947945, 929103, 913537, 899180, 879150, 856436, 838711, 823660, 804055, 782391, 766184, 753572, 737700, 720701, 709424, 701789, 691016, 679029, 672293, 668686, 661805, 654064, 652206, 653757, 650968, 644417, 639894, 635613, 625474, 611623, 601056, 592904, 581461, 568676, 561246, 558178, 553289, 547200, 544899]
58041E44899p15n648r519p300n828r682j1842p609m021o162p531l407n33m047
58027D61055p584n842m499q202j0928p801m681o567p925l901k9j466l406j207
58013C87017N24k216m389j921J83j877k731J495M969L087J179L793N700K444l87
57998C96870K418N781M063J317K651M372J863j272q88p06m438p755o556n105p607
57983C85008r836p446m580n852p725o027m194n829o899l587k26j298l046j182
57969C17281P64j080k762j19K841J437r29K77K162R40j25K493M785K486o83j81
57953C29587Q16j756m394k789m00j739l691j940M74m46j234K277O119N167K869
57938C28920M884Q711Q999P736R805J3299J3598J2466J3999J5697J2703O907L327
$$ y = [544899, 544184, 538536, 529017, 521717, 515889, 506207, 494365, 486756, 482735, 476573, 469042, 465635, 465102, 461055, 453471, 447629, 443130, 434928, 424000, 416199, 411518, 404951, 397026, 393125, 393096, 391630, 388224, 387017, 387541, 385325, 380936, 379015, 379198, 377321, 374590, 376085, 381054, 384141, 385320, 389113, 394813, 397257, 396870, 399288, 405069, 409132, 410449, 413100, 417472, 419335, 418063, 417175, 416469, 412031, 404276, 397720, 392615, 385008, 375172, 367726, 363146, 357294, 349569, 343542, 339348, 333519, 326620, 323033, 322807, 321509, 318463, 317281, 318045, 316965, 314203, 314084, 316925, 318362, 317433, 317710, 319872, 320812, 320687, 323180, 327965, 330451, 329768, 329587, 330403, 328647, 324253, 321464, 321064, 319325, 315634, 313694, 314168, 313722, 312488, 314765, 320884, 326051, 328920, 333804, 342515, 351514, 359250, 369055, 382354, 395952, 408418, 422417, 438114, 450817, 457724, 461051]
57925D61051J141l230p927q948q075r458j1697j1057q998q908r010o060k448k039
57911C64337k751o85K211K136J129K986N473M428J945K421M062K395j120k125
57897C86842j737l698o206m881j367p91k879l331j918j664k102p60Q00m31k465
57882C53412j596L66p09l327l075r56j420m060m828l763m088n209l908j211r16
57867C14712k504k242p8J199K099N086Q578Q987P403P709R501R357P670P555Q359
57852C93391O948M213L672M733L819J065m67j080l528o927p956p115p578q947
57838C74243q364o640o909q299p415m991m601n738m727j791n64j230n87J429J745
57823C15561L12Q6J084N10j404j634j38K85m23R4J344Q14n67K18K046Q45l348
$$ y = [461051, 462192, 458962, 451035, 442087, 434012, 424554, 412857, 401800, 392802, 383894, 374884, 368824, 366376, 364337, 361586, 360901, 363112, 365248, 366377, 369363, 374836, 379264, 381209, 383630, 387692, 390087, 388967, 386842, 385105, 381407, 375201, 370320, 368953, 368162, 365283, 361952, 360034, 358370, 356268, 355508, 356308, 355877, 353412, 351816, 352182, 351473, 348146, 345071, 344115, 342695, 338635, 333807, 330044, 325956, 320747, 316839, 315628, 314712, 312208, 309966, 309888, 311087, 313186, 318272, 326850, 335837, 343240, 350949, 360450, 369807, 377477, 385032, 393391, 400339, 404552, 408224, 412957, 416776, 417841, 417374, 416294, 412766, 405839, 397883, 390768, 383190, 374243, 365879, 359239, 352330, 344031, 336616, 331625, 327024, 321286, 316559, 314768, 314204, 312974, 312387, 313816, 315561, 315873, 315959, 317043, 317553, 316149, 314515, 314377, 314662, 314239, 314333, 315677, 316491, 315924, 316142, 318188, 319033, 315685]
57806C15685o573p806r472j1451j0905q150o607o595n101j901r8k63K28J767K088
57791B44846J408K297M274M227K529K884N716P472P013O999Q243Q383P057O906
57777C20254Q475R222Q498Q421R126Q118N138K766J594m00l251m715m951o527
57763C61768r371j0684j0177j0323j1188j0343q147p688q990q796o665n630o127
57750B47639n026j777K58j30n3J842L187K890L091M509M780L258K600L869M633
57735B75570L618K758L018K623R46p2K36J54n43K7J626J585k65r69J55L28j336
57718B89459k244j488j628l621m895m266m074n527o498n910n773o885o963n122
57704B24565l849m420m617l108j884k238k389j319r07k073k704j583n74q43p85
$$ y = [315685, 309112, 301306, 291834, 280383, 269478, 261328, 254721, 248126, 243025, 241124, 241026, 240763, 240991, 242758, 244846, 246254, 248551, 252825, 257052, 259581, 262465, 268181, 275653, 282666, 289665, 297908, 306291, 313348, 320254, 328729, 337951, 346449, 354870, 363996, 372114, 377252, 380018, 381612, 381212, 377961, 373246, 368295, 361768, 352397, 341713, 331536, 321213, 310025, 299682, 291535, 283847, 274857, 266061, 259396, 253766, 247639, 242613, 240836, 241094, 240964, 240911, 242753, 245940, 248830, 251921, 256430, 261210, 264468, 267068, 270937, 275570, 279188, 281946, 284964, 287587, 288533, 288461, 288697, 288851, 288308, 288335, 289961, 291546, 291281, 290312, 290467, 290795, 289459, 287215, 285727, 284099, 280478, 275583, 271317, 267243, 261716, 255218, 249308, 243535, 236650, 229687, 224565, 220716, 216296, 211679, 208571, 206687, 204449, 202060, 200741, 199834, 197761, 195057, 193474, 192900, 192057, 191272]
57689A91272K54J15k102l799l028j279j17J416L989O103P082Q600J1272J3289
57675B33067J4156J6281K0922K6229L1123L7392M6053N5459O5197P7734R3255
57664G16868J05699J06475R0033N5577P841m1828p9843r9533j04128r9810q9695
57653E67656p5879o2151n0969m1138l1487k3780j9415j6496j2925r565p714o461
57641B09676m928m280n035n252l740k320k574l188k654j773j386n14J139J777
57627A74948O89j36M69P59m77j646j631k032l798m898l816k280k059k049j002
57612A51041p5l18n15J04L0j362j966n57Q74P50N64J486J802L02j093q79p53k027
57594A47408k730j312P5p14k070j868j366k395l667l398k820l515m052k776j294
$$ y = [191272, 191526, 191641, 189539, 185740, 182712, 181433, 181316, 182732, 186721, 192824, 199906, 208506, 219778, 233067, 247223, 263504, 284426, 310655, 341778, 379170, 425223, 480682, 545879, 623613, 716868, 822567, 929042, 1019075, 1074652, 1082493, 1040665, 960822, 861289, 757161, 657351, 567656, 491777, 429626, 378657, 337519, 306032, 282252, 262837, 246341, 233416, 223851, 216137, 209676, 204748, 200468, 195433, 190181, 186441, 184121, 181547, 178359, 175705, 173932, 172546, 172032, 173171, 174948, 175637, 175501, 175970, 176729, 176252, 174606, 172975, 170943, 167145, 162247, 158431, 156151, 154092, 152043, 151041, 150966, 150648, 150133, 150237, 150267, 148905, 146939, 146382, 147256, 148006, 148570, 150056, 151858, 152160, 151067, 150188, 149435, 147408, 144678, 143366, 143441, 142727, 140657, 138789, 137423, 135028, 131361, 127963, 125143, 121628, 117576, 114800, 113506]
57579A13506j575k172j102J03r00k795k836j538j232j790j552r18j319k051j594
57564I0235o95r39j615j179l12m97j067o89j39o16j047l5J198Q88n3J01O74M12
57546H4625N01K346M179L559J605J133J989J963J052J086K054K305J669J181N64
57531A11811j021k635k897k569l024l403k316r96j447k758k589j279j060k071
57517H1746k546k201k172k258j315J80Q50J028J896K857K605J858K140K802K233
57502H9703J037Q99J326O69n60o16j3o61k258k791k150j944k197j511j96k3j018
57485G7696j542j302j439j887j542q01r71j501p03J021J556N70k87m62r46j738
57469F5722j680q56n87j054j293j299j734j963r65K59p4j332j322%N58k49q76
$$ y = [113506, 111931, 109759, 108657, 108760, 107860, 105065, 102229, 100691, 99459, 97669, 96117, 95199, 93880, 91829, 90235, 89540, 88601, 86986, 85807, 85495, 84998, 83931, 83242, 83103, 82487, 81440, 81405, 82603, 83491, 83438, 83539, 84213, 84625, 85126, 87472, 91651, 95210, 96815, 97948, 99937, 101900, 102952, 104038, 106092, 108397, 110066, 111247, 111811, 110790, 108155, 105258, 102689, 99665, 96262, 93946, 92950, 91503, 88745, 86156, 84877, 83817, 81746, 79200, 76999, 74827, 72569, 71254, 71434, 72284, 73312, 75208, 78065, 80670, 82528, 84668, 87470, 89703, 90740, 91639, 92965, 93634, 93074, 92458, 92445, 91784, 89526, 86735, 84585, 82641, 80444, 78933, 78737, 78714, 77696, 76154, 74852, 73413, 71526, 69984, 69183, 68212, 66711, 66008, 67029, 68585, 69155, 68868, 68406, 67460, 65722, 64042, 63186, 62599, 61545, 60252, 58953, 57219, 55256, 54291, 54550, 54476, 53144, 51822, 51822, 52380, 52131, 51255]
57452E1255n48j21P3N92J152Q74K23M05J021Q02J65M71J212P78l91l54P58Q00
57434E9167p05j891j783j372j182m85O24R32K94j47j48n30j085p35J88J91p50
57417E0583j141o35l64n70l26L22L06k44j05O96Q91L68K60O24M39j62n7M87J9
57398E1391j414k221j947j625j523q81P9L10M1L64Q79K54j074j321l79K75M19
57381D1627J129K050J590l5q13k09L67L87P01J069J83j532k093j241p27j052r22
57364D0479k55n74j816j924l95P44L96q3K92N85K25J35O52Q33O40J268K541K652
57346D6395J307M45R41J332P08J39K09j83j409k094j645j358j914k188j620j302
57330C7763j668j628r53j031k110k417j225k85r00j940k078j689j345o61J86M9
$$ y = [51255, 50707, 50586, 50659, 51251, 52403, 53277, 53500, 53905, 54926, 55728, 55893, 56364, 57576, 58354, 57963, 57609, 58367, 59167, 58462, 56571, 54788, 53416, 52234, 51749, 52373, 53305, 53599, 53452, 53304, 52774, 51689, 50954, 51142, 51333, 50583, 49442, 48807, 48443, 47873, 47547, 47869, 48175, 47931, 47826, 48522, 49413, 49781, 50041, 50665, 51104, 50942, 50885, 51372, 51391, 49977, 47756, 45809, 44184, 42661, 41780, 41859, 42169, 42210, 42574, 43453, 43707, 42633, 41312, 40933, 41208, 41627, 42756, 44806, 46396, 46361, 45548, 45339, 45706, 46093, 46794, 47863, 48046, 46514, 44421, 43180, 42453, 41401, 40479, 40224, 39650, 37834, 35910, 35515, 36259, 36655, 36572, 36864, 37449, 37674, 37809, 38461, 39294, 39934, 41202, 43743, 46395, 47702, 48147, 49088, 50420, 51128, 51267, 51476, 51293, 49884, 47790, 46145, 44787, 42873, 40685, 39065, 37763, 36095, 34467, 33514, 32483, 30373, 27956, 26731, 26446, 25546, 23606, 21528, 19839, 18494, 17833, 18019, 18068]
57314A8068r63j197l70k26j298j677l81P98L67n43n35k44n22o65j76j61j250k102
57296F923j605o67l21o9M86M11o51j409j128q75a54j084J63cG55N35J351J963
57278D604J399R63J853K961L001K807L436M028L615L146L622L994L097J966K075
57263D6567K708K250P64n67j350j655j155j02K71l07m14M76P49m90j498p69K99
57246D5777j24j162j017j00J35n7M03J065R15N20Q40J092J63r91o88P09J655K110
57228E1245K992L822L345J992J452K098K790K912K854K867K993L765N482P311
57214I7920Q311Q708Q982Q755P775O896O695O314N121M267M986O592P776Q618
57200A97716R567R842Q774P583P783Q814R232R172R606J0139R741Q822Q502Q563
$$ y = [18068, 17105, 15908, 15538, 15312, 14014, 12337, 11956, 12754, 13121, 12578, 12043, 11799, 11277, 10612, 10436, 10275, 9025, 6923, 5318, 4651, 4330, 4261, 4747, 5158, 4507, 3098, 1970, 1095, -154, -1238, -1075, -3, 755, 1290, 2641, 4604, 6003, 6966, 8819, 11780, 14781, 17588, 21024, 25052, 28667, 31813, 35435, 39429, 42526, 44492, 46567, 49275, 51525, 52289, 51722, 50372, 48717, 47562, 47460, 47731, 47424, 47010, 47486, 48235, 47745, 46247, 45478, 45777, 45653, 44491, 43474, 43374, 43509, 43452, 43855, 44920, 45835, 46355, 47195, 48287, 48450, 47459, 46771, 47480, 49135, 51245, 54237, 58059, 61404, 63396, 64848, 66946, 69736, 72648, 75502, 78369, 81362, 85127, 90609, 97920, 106231, 114939, 123921, 132676, 140451, 147347, 154042, 160356, 165477, 169744, 174730, 181322, 189098, 197716, 207283, 217125, 225899, 233482, 241265, 250079, 259311, 268483, 278089, 288228, 297969, 306791, 315293, 323856]
57186C23856Q153P847Q875J0892J2552J3745J5285J6915J7633J7646J8121J9217
57174D90737K0065K0401K0603K0474J9551J8305J7584J7290J6954J7016J7998
57163F96978J9058J9021J8352J8543J9886K1333K2129K2236K1620K0445J9527
57152I19128J9383J9430J9177J9367K0664K2112K2437K2014K2062K2677K3128
57141A151579K3372K3788K4105K4006K4070K4786K5480K5493K5503K6302K7396
57130A425880K8201K9357L1309L2825L2869L2729L4296L7216L9852M2144M5408
57119A812086M9956N4921N9986O5366P0766P5985Q1869Q9004R6415J03377J11497
57108B671228J23088J38482J57167J80527K10993K49334K95393L51232M21282
$$ y = [323856, 332009, 339856, 348731, 359623, 372175, 385920, 401205, 418120, 435753, 453399, 471520, 490737, 510802, 531203, 551806, 572280, 591831, 610136, 627720, 645010, 661964, 678980, 696978, 716036, 735057, 753409, 771952, 791838, 813171, 835300, 857536, 879156, 899601, 919128, 938511, 957941, 977118, 996485, 1017149, 1039261, 1061698, 1083712, 1105774, 1128451, 1151579, 1174951, 1198739, 1222844, 1246850, 1270920, 1295706, 1321186, 1346679, 1372182, 1398484, 1425880, 1454081, 1483438, 1514747, 1547572, 1580441, 1613170, 1647466, 1684682, 1724534, 1766678, 1812086, 1862042, 1916963, 1976949, 2042315, 2113081, 2189066, 2270935, 2359939, 2456354, 2559731, 2671228, 2794316, 2932798, 3089965, 3270492, 3481485, 3730819, 4026212, 4377444, 4798726]
57099D798726N09934O21585P62527R39618J156196J411186J702362K028355K386931
57090A6317420K773192L180057L598643M016929M418641M783953N090348N310876
57082D9490059N409093N334755N029582M448967L589875K502805J276605R508
57074G7091249j212001k320229l267322m025360m583563m943240n114766n116742
57066D6508026m973814m713683m366327l963680l536197l108515k698873k320668
57058A6826269j981835j683971j425580j206330j025944q80089p60776o61061
57050G200683n76887n04979m42199l87281l40383l00474k65485k34939k09794
57041C938262j89559j72159j56861j44585j35042j26149j16809j07963j00194
$$ y = [4798726, 5308660, 5930245, 6692772, 7632390, 8788586, 10199772, 11902134, 13930489, 16317420, 19090612, 22270669, 25869312, 29886241, 34304882, 39088835, 44179183, 49490059, 54899152, 60233907, 65263489, 69712456, 73302331, 75805136, 77081741, 77091249, 75879248, 73559019, 70291697, 66266337, 61682774, 56739534, 51624768, 46508026, 41534212, 36820529, 32454202, 28490522, 24954325, 21845810, 19146937, 16826269, 14844434, 13160463, 11734883, 10528553, 9502609, 8622520, 7861744, 7200683, 6623796, 6118817, 5676618, 5289337, 4948954, 4648480, 4382995, 4148056, 3938262, 3748703, 3576544, 3419683, 3275098, 3140056, 3013907, 2897098, 2789135, 2688941]
57032B688941r2592q4435p6119o7878n9265n0132m0507k9568j6295q56J5837L2362
57020B219493M4211M2874K1957j5158n6427r0154j10939j18467j15076j05323
57010A716991r4064q3201p2183o1594n3447m7884m2999l8380l5513l4182l1996
56999A121548k8424k5872k5529k5410k3959k2389k1845k1141j9101j6583j4478
56988H76817j2082q969o158l893n25M775J0142J3205J3103R375J404r431j9252
56975H68511k5137k7436k7640k6087k3059j9944j7585j5198j2178r300p080m803
56963F53064k159J03K091N179R542J3633J7098K1465K6426K7987K2435J0418m371
56950H02911j8529k9502l5257l5636l2845k9000k4523j9663j5638j2875j0135
$$ y = [2688941, 2596349, 2511914, 2435795, 2367917, 2308652, 2258520, 2218013, 2188445, 2172150, 2171294, 2187131, 2219493, 2263704, 2306578, 2328535, 2313377, 2256950, 2166796, 2055857, 1937390, 1822314, 1716991, 1622927, 1539726, 1467543, 1405949, 1352502, 1304618, 1261619, 1223239, 1187726, 1153544, 1121548, 1093124, 1067252, 1041723, 1016313, 992354, 969965, 948120, 926979, 907878, 891295, 876817, 864735, 855766, 849608, 845715, 845190, 849965, 860107, 873312, 886415, 895790, 897194, 887763, 868511, 843374, 815938, 788298, 762211, 739152, 719208, 701623, 686425, 674247, 664947, 657867, 653064, 650905, 651008, 653099, 658278, 667820, 681453, 698551, 720016, 746442, 774429, 796864, 807282, 802911, 784382, 754880, 719623, 683987, 651142, 622142, 597619, 577956, 562318, 549443, 539308]
56939E39308o623l178k51L199P540J1506J4778J9254K6135L3710L9269M0881L6147
56926G61675K2477J166k1083l7349m5729m7976m5550l9660l2929k7797k4131k0590
56914D42524j7188j4589j2239r465p143o278o069n271m253l922l782k952j870
56901C47503j316q88j0Q71J575L146N903Q197Q823R055J0528J2739J4523J6323
56887D36972J9028K2085K4674K6979K8201K5241J6002K811r772j9351k5844k8895
56875E18131k7964k4125j9316j4262r034m592j638J141N500J1076J6334K1230
56863D72481K6985L3969M1796N0756O1047P0688P5498P1026N4446K6595o451l5655
56851I43181n4904o3960o5175n9898m9613l7750k7297j8170r133o32O639J3964
$$ y = [539308, 532685, 529507, 529256, 532455, 539995, 551501, 566279, 585533, 611668, 645378, 684647, 725528, 761675, 784152, 785318, 764235, 726886, 681157, 633181, 587631, 547971, 515042, 487245, 463114, 442524, 425336, 410747, 398508, 389043, 381900, 375622, 369553, 364282, 360029, 356107, 352325, 349373, 347503, 346187, 345299, 345289, 346160, 347735, 350881, 356784, 364981, 373804, 382859, 393387, 406126, 420649, 436972, 456000, 478085, 502759, 529738, 557939, 583180, 599182, 601993, 592221, 572870, 547026, 518131, 490167, 466042, 446726, 432464, 423430, 418838, 417200, 418341, 423841, 434917, 451251, 472481, 499466, 533435, 575231, 625987, 687034, 757722, 833220, 904246, 958692, 985287, 978836, 943181, 888277, 824317, 759142, 699244, 649631, 611881, 584584, 566414, 557281, 556649, 563288, 577252]
56839E77252K2825L2537M2197N3167O6916Q2271R7458J12134J23361J21731R7299
56828A429148N0341o916n9292r6925j16350j18890j09771r5576q0398o5172n0388
56817F79811l7188k5863j5552n851L050J1700K1064L0986M0840N1358O3852P7361
56805H95568Q7685Q8838P5054M3975O30m2872p4823r1317r5408r1125q1073o8104
56793F47028n5188m3383l2465k3145j6266j0583m216K322P381J1705J7629K5211
56781E26030L2401L8512M3965M6513M1460K6721N229j7933l8323n2230n7504n5535
56769E39306n0213m4162l7724l1277k5947k1749j7590j3559j0920r605q071n901
56757B62588m262l505k678j654j480k280k964l206l677m206l893k981k519k331
$$ y = [577252, 600077, 632614, 674811, 727978, 794894, 877165, 974623, 1086757, 1210118, 1331849, 1429148, 1479489, 1472573, 1413281, 1316356, 1200006, 1081116, 971345, 875769, 795371, 730199, 679811, 642623, 616760, 601208, 595357, 598407, 610107, 631171, 662157, 702997, 754355, 818207, 895568, 983253, 1072091, 1147145, 1191120, 1191750, 1148878, 1074055, 982738, 887330, 796205, 715132, 647028, 591840, 548457, 515992, 492847, 476581, 465998, 461782, 464104, 471485, 483190, 500819, 526030, 558431, 596943, 640908, 687421, 728881, 755602, 760831, 742898, 704575, 652345, 594841, 539306, 489093, 444931, 407207, 375930, 349983, 328234, 310644, 297085, 286165, 276560, 268489, 262588, 258326, 254821, 252143, 250489, 249009, 246729, 243765, 240559, 236882, 232676, 228783, 225802, 223283, 220952]
56743B20952j481m84n87j206o85O35Q68o5m10J79L13j93k3P59O13m02m11R48J847
56724B21167J443Q83P53L89J20J203L029L408K219J693K434K451J024J68R65J614
56708B44963P42k27K29J248J438J173J354J722J750J568J114l8j285j359n00k87
56692B53605r55j161p07r79k185k759k144j582j534r71J27L11n55q26j03L0r58
56675B36654j613j403j600k344j882J56J787K034K278L107L003J502M48O25K79
56660B43031j362k348j511o69j308k068j558q81j154j263k65N69L36N36K253L709
56644B36047L035J283L50O6m07l57Q84J960J390m4p87p87o40j70N45N26l01m46
56626B42147N98J264O14j89l97r78k022j716K46J258j22j579q72O15P02J6K3K4
$$ y = [220952, 219471, 218987, 218400, 217194, 216509, 217144, 218012, 217947, 217537, 217716, 218029, 217836, 217813, 218572, 219185, 218783, 218372, 219320, 221167, 222610, 223493, 224246, 224635, 224755, 225958, 228987, 232395, 234614, 236307, 238741, 241192, 242216, 242384, 243349, 244963, 245705, 245478, 245707, 246955, 248393, 249566, 250920, 252642, 254392, 255960, 257074, 257036, 255751, 254392, 253892, 253605, 252650, 251489, 250782, 249803, 247618, 244859, 242715, 241133, 239599, 238628, 238755, 239066, 238511, 237685, 237582, 237612, 236654, 235041, 233638, 232038, 229694, 227812, 227968, 229755, 231789, 234067, 237174, 240177, 241679, 242127, 242752, 243031, 241669, 239321, 237810, 237141, 235833, 233765, 232207, 231326, 230172, 228909, 228644, 229213, 229549, 230085, 232338, 236047, 239082, 240365, 240715, 240781, 240374, 240017, 240901, 242861, 244251, 244207, 243420, 242633, 241993, 241823, 242368, 242894, 242593, 242147, 242745, 244009, 244623, 244434, 244037, 243059, 241037, 239321, 239567, 240825, 240703, 239124, 238252, 238867, 239569, 239585, 239608, 239632]
56608B39632q87j291O4J396N99j097j282l89l90j104r47j15J1l91j32O23R42J062
56590B36304J515J513L79p70p87n00q95r67K86J463Q93m10m23N88J005P45P74
56573B40713R52O85N69J163J533J022R72K469M038L943L161L591M936N878O788
56558B82413Q599J0411J0784J0168R607Q475N989L466K453K050O98q80j134o45
56544C52454q36j185m67M59m9j547k602l437m837n792n079l905m116n028m846
56529C09187m009m086m591l933k564k099k294j782r48j114j724j220k7J55p17
56514B78234j386j795k605l157k530j723k157l026k680j565j108q81K84J494J035
56499B56434n23j222q07k84M03J554J887M49r85l90R84O81p50r57M0L83K3L04
$$ y = [239632, 238745, 237454, 237518, 238914, 239513, 238416, 237134, 236745, 236355, 235251, 234304, 234189, 234200, 233809, 233677, 234300, 235242, 236304, 237819, 239332, 239711, 238941, 238154, 237654, 236759, 235792, 236078, 237541, 238434, 238024, 237601, 238189, 239194, 239939, 240713, 241665, 242350, 242919, 244082, 245615, 246637, 247609, 250078, 254116, 258059, 261220, 264811, 269747, 275625, 282413, 291012, 301423, 312207, 322375, 331982, 340457, 346446, 349912, 352365, 354415, 355113, 354233, 353099, 352454, 351618, 350433, 349966, 350425, 350376, 348829, 346227, 342790, 337953, 332161, 327082, 323177, 319061, 314033, 309187, 305178, 301092, 296501, 292568, 290004, 287905, 285611, 283829, 282881, 281767, 280043, 278823, 278796, 278951, 278234, 276848, 275053, 272448, 269291, 266761, 265038, 262881, 259855, 257175, 255610, 254502, 253621, 253905, 255399, 256434, 255911, 254689, 253882, 253598, 254001, 255555, 257442, 257891, 256906, 256516, 257500, 258181, 257431, 256474, 256514, 256897, 256920, 257224]
56481B57224Q59L08o75m34L40k35j563j438R2J088J217J572J826R36q8M66J632
56464B63127J239j21j41R66J011r8n43k98q63j782j218L60P21j66l65K16o9j017
56446B60959p70N25Q86J26p6M60L77j26M02J625J950J557J641J475k03j878j208
56429B67722O57P99l89k30R90O09j150j366K13Q61K6M7J426K024J374J303J839
56412B76755J008r02j376l66m29j746j734r6M47p37j082K55J001L11J42R89P86
56395B73226p88j328k47O5j133j458J09J510J653K066L224L444K598K830M331
56380B90102M616L159K448L250L236J655Q85J804K053N95l30M37Q95q7p35o1L36
56363C14258j88N3J361J581K11m82K07J60j140j338J24O51n41o75J413K944K065
$$ y = [257224, 258083, 258391, 257716, 257282, 257622, 257387, 255824, 254386, 254478, 255566, 256783, 258355, 260181, 261117, 261029, 261495, 263127, 264366, 264245, 264104, 265070, 266081, 265983, 265440, 265142, 264279, 262497, 261279, 261639, 262360, 262194, 261829, 262045, 261976, 260959, 260189, 260714, 261600, 261726, 261650, 262110, 262487, 262361, 262763, 264388, 266338, 267895, 269536, 271011, 270808, 268930, 267722, 268379, 269178, 268789, 268559, 269549, 270158, 269008, 267642, 267855, 268716, 268742, 268789, 270215, 272239, 273613, 274916, 276755, 277763, 276861, 275485, 275119, 274690, 272944, 271210, 271114, 271561, 270824, 269742, 269997, 270998, 271309, 271451, 272440, 273226, 272438, 271110, 270863, 270928, 269795, 268337, 268446, 269956, 271609, 273675, 276899, 280343, 282941, 285771, 290102, 294718, 297877, 300325, 303575, 306811, 308466, 309351, 311155, 313208, 313803, 313473, 313910, 314805, 314718, 313983, 313922, 314258, 314070, 314123, 315484, 317065, 317276, 316794, 317001, 317161, 316021, 314683, 314807, 315458, 314917, 314242, 315655, 318599, 320664]
56346C20664P61P63P73o8j61J005J309L4n35O47J642J627K352L885L564J136R9
56329C39497J841L203K164J059J695K174J250J111K837L744K189O10Q97J116k05
56314C65182r88K58J472J149J116K344K484N44m22J524L724L776L494M753N767
56299C96177M903M049M754N050L411J903K235K635J777J613L323M631M193M288
56285D44942O151P205O044N441P066Q116O692N611P116Q676Q025P550R485J1467
56271E49587J1109J0453J1648J2763J2133J2222J4841J7175J7053J7469K1182
56260G07635K5531K7478K9226L3756L9242M3036M6961N3433O0442O5624P1291
56249A203655Q0188R0145R7953J04721J12339J18737J21679J23302J25617J25681
$$ y = [320664, 321425, 322188, 322961, 322893, 322732, 323737, 325046, 325080, 324545, 325192, 326834, 328461, 330813, 334698, 338262, 339398, 339497, 341338, 344541, 346705, 347764, 349459, 351633, 352883, 353994, 356831, 360575, 362764, 363374, 364271, 365387, 365182, 364194, 364452, 365924, 367073, 368189, 370533, 373017, 373561, 373139, 374663, 378387, 382163, 385657, 390410, 396177, 401080, 405129, 409883, 414933, 418344, 420247, 422482, 425117, 426894, 428507, 431830, 436461, 440654, 444942, 451093, 458298, 464342, 469783, 476849, 484965, 491657, 497268, 504384, 513060, 521085, 528635, 538120, 549587, 560696, 571149, 582797, 595560, 607693, 619915, 634756, 651931, 668984, 686453, 707635, 733166, 760644, 789870, 823626, 862868, 905904, 952865, 1006298, 1066740, 1132364, 1203655, 1283843, 1373988, 1471941, 1576662, 1689001, 1807738, 1929417, 2052719, 2178336, 2304017]
56239B304017J20376J11869J02973R1321P3797N2718L1926J0708j2639l5204n3361
56228B798501o8495q3090r4993j01424j04829j08675j11191j09356j05356j02787
56218A808305j00110r4285q7258q2429p8056p0867o2908n8226n5668n1439m6034
56207A021025m2338l9657l5745l1940l0388k9112k5535k1639k0029j8592j4856
56196G11194j1532j1560j1903q903n490o034q175p156m347l820m287k243M05k52
56182F25897k394j890k11j109k805j417J084M63j480l84K061J450m93R29M289
56167F23990M710L050L683N732N283L852N831R690J0505R075R842J2026J1616
56154G18885R965J1467J4840J5584J4977J7563K1968K3455K3565K7742L5242M0758
$$ y = [2304017, 2424393, 2536262, 2639235, 2730556, 2804353, 2857071, 2888997, 2899705, 2887066, 2851862, 2798501, 2730006, 2646916, 2551923, 2450499, 2345670, 2236995, 2125804, 2016448, 1911092, 1808305, 1708195, 1613910, 1526652, 1444223, 1366167, 1295300, 1232392, 1174166, 1118498, 1067059, 1021025, 978687, 939030, 903285, 871345, 840957, 811845, 786310, 764671, 744642, 726050, 711194, 699662, 688102, 676199, 667296, 661806, 655772, 647597, 640441, 636094, 632274, 627987, 625744, 626149, 625897, 623503, 621613, 621402, 620293, 617488, 616071, 617155, 617618, 616138, 615754, 617815, 619265, 618772, 619701, 623990, 628700, 631750, 635433, 641165, 646448, 650300, 656131, 665821, 676326, 685401, 695243, 707269, 718885, 728850, 740317, 755157, 770741, 785718, 803281, 825249, 848704, 872269, 900011, 935253, 976011]
56142I76011M4469N1073O0642O9678P9519R4177J11359J24814J33637J39995J40191
56131B025565J28428J07769Q7354P0409N4904M3462M1066M4073M2591L3395K0590
56120B699606N366j3808l2087m1064m0903l9544m0850m3745n1246o8357r1372
56109B241996j10395j22131j29819j32174j24435j09475r5752q4450p0280n4224
56099A208861m3178l7301l0077k0935j5660j4383j1361o637n542o884m191J463
56087A014175K757r6K21M097M842K402L524Q002Q667N478N668R387R420N792O142
56072A090478J0806J2161R712J0987J6282J7632J4238J3857J7401J7442J3350
56061A244346J2513J5093J3353P472O004R220Q516L703L927R779J1954R464J1303
$$ y = [976011, 1020480, 1071553, 1132195, 1201873, 1281392, 1375569, 1486928, 1611742, 1745379, 1885374, 2025565, 2153993, 2261762, 2349116, 2419525, 2474429, 2517891, 2558957, 2603030, 2645621, 2679016, 2699606, 2704972, 2691164, 2659077, 2618013, 2577110, 2537566, 2496716, 2452971, 2401725, 2333368, 2241996, 2131601, 2009470, 1879651, 1747477, 1623042, 1513567, 1417815, 1333365, 1263085, 1208861, 1165683, 1128382, 1098305, 1077370, 1061710, 1047327, 1035966, 1029329, 1023787, 1016903, 1012712, 1014175, 1016932, 1016836, 1017057, 1021154, 1025996, 1028398, 1031922, 1039924, 1048591, 1054069, 1059737, 1069124, 1078544, 1084336, 1090478, 1101284, 1113445, 1123157, 1134144, 1150426, 1168058, 1182296, 1196153, 1213554, 1230996, 1244346, 1256859, 1271952, 1285305, 1292777, 1298781, 1308001, 1316517, 1320220, 1324147, 1333926, 1345880, 1355344, 1366647]
56048A366647J7973J9786J5939J6414K2306K3391J8304J7514K2929K4456K0423
56037A586082K1028K7535K8954K3761K3639L0829L3509K8998K9277L7595M1919
56026A913126L8165L7464M3551M5566M0387L9257M5037M6133M0263M0421M9620
56015B378990N4216N0157N0805O0420O5666O2183O3261P2873P7098P2010P2568
56004C080247Q3677R0613Q8447R1868J05250J13078J11211J16349J32837J42590
55994D156167J40207J44272J60850J71059J68887J74568J95315K10789K13630
55985E735744K24931K52381K74261K83176L02626L40758L72729L89882M19090
55976H595578M71015N18985N53117O02770O79391P53016Q13600Q96366J016132
$$ y = [1366647, 1384620, 1404406, 1420345, 1436759, 1459065, 1482456, 1500760, 1518274, 1541203, 1565659, 1586082, 1607110, 1634645, 1663599, 1687360, 1710999, 1741828, 1775337, 1804335, 1833612, 1871207, 1913126, 1951291, 1988755, 2032306, 2077872, 2118259, 2157516, 2202553, 2248686, 2288949, 2329370, 2378990, 2433206, 2483363, 2534168, 2594588, 2660254, 2722437, 2785698, 2858571, 2935669, 3007679, 3080247, 3163924, 3254537, 3342984, 3434852, 3540102, 3653180, 3764391, 3880740, 4013577, 4156167, 4296374, 4440646, 4601496, 4772555, 4941442, 5116010, 5311325, 5522114, 5735744, 5960675, 6213056, 6487317, 6770493, 7073119, 7413877, 7786606, 8176488, 8595578, 9066593, 9585578, 10138695, 10741465, 11420856, 12173872, 12987472, 13883838, 14899970]
55967A4899970J140349J260768J423535J651684J912778K205377K597200L129664
55959C0221325L769992M509331N413384O518650P787052R233840J0984772J3133323
55951I1571669J5681144J8711239K2461336K7121066L2709933L9089845M5447798
55944B92794030M9261710M6422688L3815263J2576690j1550749l1697776m3925460
55937C47696396m8293917m7026356m2470591l6429324l0222671k4631392j9880830
55930I8741315j5936000j2769198j0318042q405393o862387n637698m704189l965718
55922C0142690l336973k820552k429170k111244j817589j566306j380058j225391
55914A3455407j069239r33424q40970p64881o78204o01822n56862n19259m64978
$$ y = [14899970, 16040319, 17301087, 18724622, 20376306, 22289084, 24494461, 27091661, 30221325, 33991317, 38500648, 43914032, 50432682, 58219734, 67453574, 78438346, 91571669, 107252813, 125964052, 148425388, 175546454, 208256387, 247346232, 292794030, 342055740, 388478428, 422293691, 434870381, 423319632, 391621856, 347696396, 299402479, 252376123, 209905532, 173476208, 143253537, 118622145, 98741315, 82805315, 70036117, 59718075, 51312682, 44450295, 38812597, 34108408, 30142690, 26805717, 23985165, 21555995, 19444751, 17627162, 16060856, 14680798, 13455407, 12386168, 11452744, 10611774, 9846893, 9168689, 8566867, 8010005, 7490746, 7025768]
55905G025768m14154l88644l68933l32944k97219k81260k68820k41292k14150
55896D218352k05070j99085j78898j58357j53619j51145j35190j18521j15940
55887B802527j14742j00473q5746q5242q7081p6435o3636o2211o2093n0860l9690
55876A974318m2612n0576n0508n0003n9203o7818o3877n6814n8957o2056n4484
55865A357410m4402m3617m5039l7831k9055k9259l1823k7032k1769k5199k9499
55854I92885k4546j7662j9397k3462j9888j4647j7293k1952j9337j5225j8628
55843G80848k3625k0955j6030j7721k0645j6135r778j0692j4017j1120o817r489
55831F03824j4065j1632o437o984r488o334j851l744p617n706k317n128r699q008
$$ y = [7025768, 6611614, 6222970, 5854037, 5521093, 5223874, 4942614, 4673794, 4432502, 4218352, 4013282, 3814197, 3635299, 3476942, 3323323, 3172178, 3036988, 2918467, 2802527, 2687785, 2587312, 2501566, 2416324, 2329243, 2252808, 2189172, 2126961, 2064868, 2014008, 1974318, 1931706, 1881130, 1830622, 1780619, 1721416, 1653598, 1589721, 1532907, 1473950, 1411894, 1357410, 1313008, 1269391, 1224352, 1186521, 1157466, 1128207, 1096384, 1069352, 1047583, 1022384, 992885, 968339, 950677, 931280, 907818, 887930, 873283, 855990, 834038, 814701, 799476, 780848, 757223, 736268, 720238, 702517, 681872, 665737, 655959, 645267, 631250, 620130, 613313, 603824, 589759, 578127, 571690, 564706, 555218, 548884, 547033, 543289, 535672, 529966, 527649, 522521, 512822, 504814]
55817E04814m084n786r179o432j415k153n172k566K540K501L02L378Q820R251
55803D94819P196R378J2843J0889O789P515R599N185l168p495q902j3484j8964
55790E12200j8913j5644j5703j7059j3547p456n119m578l61M145J868m515o941
55777D08377n649o276p472l909K083M305M758R881J7880K1399J9611J6422J0369
55764D91779j925j5469k1788k1481k1128k1044j7179j1794j0619j2038j0221o332
55752C20761n957q158p939o608q842j2338j1309p548p103q723o655k246j467l297
55738B22571j873J850J882j176j494N68m79l998m060o45O01r99r94N20p66m067
55722B07441m447k356k578m551l466o2M52j506o99K721L604J858K497N869P289
$$ y = [504814, 500730, 494944, 485765, 479333, 477918, 475765, 470593, 468027, 470567, 473068, 473370, 476748, 485568, 494819, 502015, 511393, 524236, 535125, 541914, 549429, 559028, 564213, 561045, 553550, 544648, 531164, 512200, 493287, 477643, 461940, 444881, 431334, 423878, 418759, 414181, 413820, 417965, 419833, 415318, 408377, 402728, 396452, 388980, 385071, 387154, 391459, 396217, 406098, 423978, 445377, 464988, 481410, 491779, 489854, 474385, 452597, 431116, 409988, 388944, 371765, 359971, 349352, 337314, 327093, 320761, 314804, 306646, 298707, 292099, 283257, 270919, 259610, 252062, 244959, 236236, 229581, 227335, 225868, 222571, 220698, 222548, 224430, 223254, 221760, 222328, 221849, 217851, 213791, 213146, 213747, 212748, 211754, 212274, 211508, 207441, 202994, 200638, 198060, 193509, 190043, 189981, 190433, 188927, 188228, 190949, 194553, 196411, 198908, 204777, 212066]
55707B12066O109N963O335L261j923l712k124k321m872n493m164n205q298q513
55693A87109n464l690l894k471M08R25l43P67L496L300J058J974N621O452M237
55678A99485M366P416Q071N191L426L762J976k215l736j607p40k614k904l32Q26
55663B20371q27j207J210K739J987K233M293M618K504J718L136L104Q51QJ091
55648B47829Q5l685n916n383o051r104j0451q469o811p212o699m305l403m951
55634A65474n311l231k163l407l735k080j725l514l737j122O74l3l29Q97O08j841
55618A35425k717r18k89k309l262j465n19k269l152r79R70R0j233p90l97j332
55602A14854j423J85O84j011j818k13R06j81r22K53Q34p38k087j604j167j682
$$ y = [212066, 218175, 224138, 230473, 233734, 231811, 228099, 225975, 223654, 218782, 213289, 209125, 203920, 195622, 187109, 181645, 177955, 174061, 171590, 171998, 172923, 172580, 173347, 176843, 180143, 181201, 183175, 188796, 195248, 199485, 203851, 211267, 219338, 224529, 227955, 231717, 233693, 231478, 227742, 226135, 225395, 222781, 219877, 219545, 220371, 219544, 218337, 219547, 222286, 224273, 226506, 230799, 235417, 237921, 239639, 242775, 245879, 246730, 246738, 247829, 247914, 244229, 238313, 232930, 226879, 217775, 207324, 198855, 192044, 184832, 178133, 173828, 170425, 165474, 160163, 156932, 154769, 151362, 147627, 145547, 143822, 140308, 136571, 135449, 136123, 136090, 135761, 136658, 137266, 135425, 132708, 131790, 131501, 129192, 125930, 124465, 123946, 121677, 118525, 117546, 118516, 118606, 117373, 116583, 116186, 114854, 113431, 113616, 114300, 113289, 111471, 111258, 112164, 111983, 111061, 111314, 112148, 111410, 109323, 107719, 106552, 104870]
55586A04870j026J171J922L89k50J245J857K21p05N76J307J33j15J929L243K061
55570A18828R99J660J597l38j179N20J658M27k57J474K624R18r65m37N31k77j152
55553A26631k72O55Q7k26R22J445J28o86M57J352O05M18J979K759J349L83J536
55536A39522K309R58q3R65J698J52j544j533j687l315m026k403j261k676m133
55521A22943l259k042k647l344k351j495k331k758j192K8r44j814n44P23p6r89
55505I7908r7O77l02p21J242K951J934L60P65J403J16j187m03L32j273k944j866
55488I8895Q3j37j279o51P12N10j62P73K006J336o6j11K00p21j372j17J128L04
55470A01331p56J70J240O9j423m49J336Q24q50o57P16O14l22L31J818J576N8l89
$$ y = [104870, 103844, 105015, 106937, 107326, 107076, 108321, 110178, 110399, 109694, 110270, 111577, 111710, 111595, 113524, 116767, 118828, 119827, 121487, 123084, 122746, 121567, 122087, 123745, 124172, 123915, 125389, 128013, 128931, 127966, 127529, 128060, 127783, 126631, 126359, 127014, 127101, 126875, 127797, 129242, 129370, 128684, 129141, 130493, 131098, 131516, 133495, 136254, 137603, 137986, 139522, 141831, 142789, 142706, 143671, 145369, 145521, 143977, 142444, 140757, 137442, 133416, 131013, 129752, 127076, 122943, 119684, 117642, 114995, 111651, 109300, 107805, 105474, 102716, 101524, 101552, 100608, 98794, 98250, 98973, 98897, 97908, 97811, 98488, 98186, 97465, 98707, 101658, 103592, 103952, 104717, 106120, 106236, 105049, 104646, 104978, 103705, 100761, 98895, 98978, 98841, 97562, 96911, 97623, 98133, 97971, 98744, 100750, 102086, 102020, 101909, 102109, 101388, 100016, 99899, 101027, 101331, 100575, 100745, 101985, 102054, 100631, 100182, 101518, 102342, 101492, 100835, 101551, 102165, 101843, 102174, 103992, 105568, 105626, 105237]
55452A05237J5n56j564j276m41q38j580p43Q43J141O43R08J176J31q39L5J241
55435A03533M61j192j287m67o79j019M25K234J598p82j900j268o65l38O36J468
55419A00758Q93J26R18K091J601N13J082K465K240Q76N54Q48l56k584l390k477
55403A06158j634j309p32m36j260j927q99N19K60o63N2J700J754K79n45l06k84
55386A00727m01L03J089O19l19k99j79j384k720k277j025j007j442k72J750K298
55370I5461J574J419J585O94l50K25J327O41j067j213QL18k83O4J023N17j155
55353A00788j674p98l54n35J01J229J059j95o17r5j42n85R3J482J634N32m9K42
55335A02116K76P4L74L15j241k871k316l45M81M5K24J014P63l10m60K17J92k60
$$ y = [105237, 105252, 104696, 103132, 101856, 101415, 100577, 98997, 98254, 99097, 100238, 100881, 101789, 102965, 103096, 102257, 102292, 103533, 103994, 102802, 101515, 101048, 100369, 99350, 99775, 102009, 103607, 102825, 100925, 99657, 98992, 98654, 99290, 100758, 101651, 101777, 102695, 104786, 106387, 106900, 107982, 110447, 112687, 113563, 114117, 114965, 114609, 112025, 108635, 106158, 104524, 103215, 102483, 102047, 100787, 98860, 97961, 98480, 98740, 98077, 98129, 99829, 101583, 101862, 101317, 101011, 100727, 100326, 100629, 101718, 102337, 102018, 101719, 101540, 100156, 97436, 95159, 94134, 93127, 91685, 91413, 93163, 95461, 97035, 98454, 100039, 100733, 100383, 100608, 101935, 102576, 101509, 100296, 100304, 100622, 100339, 100403, 101426, 101943, 100788, 99114, 98316, 97962, 97427, 97528, 98757, 99816, 99621, 99004, 98909, 98767, 98182, 98275, 99757, 101391, 101923, 101874, 102116, 102392, 102466, 102840, 103155, 101914, 99043, 96727, 96382, 96863, 96908, 97132, 98146, 98909, 98599, 98139, 98356, 98548, 98288]
55317I8288L23J339J001k00l35L37J29n33QJ020N11p79m82R41R72k60k86J025
55299A03019J357L82L9M49k04j601j388L39Q17n59j296k52Q58J094J549K330J916
55282A08849L99j30P74J176K79n32o79j155j934j835j246j690k461j326J222K119
55266A01830O52m99J89J218J439J716K201J517l07j266p43l80q57r23l07l72j144
55249A03964q85N43J107K17k65M85R19J58n85n82o61r85o30O0m16j685j648j90
55231I8921M38m77j067l91L11M68J046J853J351j46m40P12J174N10P30K126K286
55214A09405M95p19J8P40K4o12n3J14j180k136j197K84N78K70L85K89o11j262
55196A04832q73l46l96k39N18Q44K84j70j40n26j238q02Q18J686J165R39J788
$$ y = [98288, 98611, 99950, 100951, 100751, 100416, 100753, 100882, 100349, 100357, 101377, 101888, 101109, 100627, 101568, 102540, 102280, 101994, 103019, 104376, 104758, 104797, 105246, 105042, 103441, 102053, 102392, 103209, 102650, 101354, 101102, 101960, 103054, 104603, 106933, 108849, 109248, 109118, 109892, 111068, 111347, 110815, 110136, 108981, 107047, 105212, 103966, 102276, 99815, 98489, 99711, 101830, 102482, 101983, 102172, 103390, 104829, 106545, 108746, 110263, 109956, 108690, 107947, 107567, 106710, 105787, 105480, 105108, 103964, 103079, 103622, 104729, 104946, 104681, 105166, 106085, 106243, 105658, 105076, 104415, 103430, 102800, 102860, 102444, 100759, 99111, 98921, 99359, 98882, 97815, 97424, 97735, 98203, 99249, 101102, 102453, 102307, 101867, 102579, 103753, 104263, 104993, 107119, 109405, 109900, 109181, 109199, 109939, 109963, 109351, 109298, 109412, 108232, 106096, 104899, 105183, 105761, 106031, 106416, 106705, 106094, 104832, 103959, 103613, 103217, 102978, 103496, 104340, 104624, 104454, 104314, 103788, 102550, 101748, 102566, 104252, 105417, 106356, 108144]
55179A08144K171J250L62K72k15j453j737m31N48o8q14l23M05J83l35l93n28p77
55161A06261JJ648K114P66k90L35J212R56N30R34J162L42m91m35l73r70j313r41
55143A11448r10j463j161L25J145M29j95K94N11l60p64J78P55j38p38L59J432
55126A11147N68j069j424q22n90n11L9L02k41l37Q76J995J694R60J030J160M63
55109A15240j2P36J568J232N94P24P36k37r00J1J174P86l70m10N41J063J001J033
55091A24510Q88N5p03m31M33J041J511J885J282m48j727j441n57j47L45J354J662
55074A29512M73p84o36J04N5l99l18j08m02n71j25j6q57j478q86L1L48P56J721
55055A26420J942N72r52j176q50j060j077j17P06K91m13k70m3n68q71j53K98n54
$$ y = [108144, 110315, 111565, 111927, 112199, 111984, 110531, 108794, 108363, 108911, 108843, 108029, 107706, 108111, 108294, 107959, 107566, 107038, 106261, 106262, 107910, 110024, 110790, 110500, 110835, 112047, 113003, 113533, 114467, 115629, 115971, 115480, 115045, 114672, 113702, 112389, 111448, 110538, 109075, 107914, 108239, 109384, 109813, 109618, 109912, 110423, 110063, 109299, 109477, 110232, 110094, 109356, 109715, 111147, 111715, 110646, 109222, 108400, 107810, 107299, 107338, 107640, 107399, 107062, 107938, 109933, 111627, 112587, 113617, 114777, 115240, 115228, 115964, 117532, 118764, 119358, 120082, 120818, 120581, 119681, 119692, 120866, 121652, 121282, 120872, 121413, 122476, 123477, 124510, 125398, 125453, 124750, 124319, 124752, 125793, 127304, 129189, 130471, 130023, 128296, 126855, 126298, 126151, 126496, 127850, 129512, 129985, 129201, 128565, 128669, 128724, 128325, 128007, 127899, 127497, 126926, 126801, 126785, 125928, 124450, 123564, 123595, 123943, 124699, 126420, 128362, 128934, 127982, 126806, 125956, 124896, 123819, 123702, 124408, 124699, 124286, 124016, 123973, 123405, 122534, 122381, 122679, 122125]
55037A22125j271m62N23k4j002m28J133J801J601J660J638N97o74q73n63r36j420
55020A23425q33J79K62k43k60j12m92o01M00J401J162O66J256J892R27p34j084
55003A27211m33n38j335j348o05m05p44n78k5M6K7Q73J966J977J136N93K79n08
54985A27589j191q34p9m9j85O25J723J754J152J208J545Q87l79p90k48K77P20
54968A33725J404J490K55r54m02J165J672R26L42K12k45p67m10M14N10Mj84k62
54950A38895r12j529j252q53j389j838n43J844L213L054K386J501K08n23K97J523
54934A44082J367K98Q1P87J293J843L412N244N857N873O995Q762R191Q212P558
54919B10855P518O693M768K807Q44k028n268p248p929q650r355q669o707n210
$$ y = [122125, 120854, 120392, 120915, 120891, 119889, 119461, 120594, 122395, 123996, 125656, 127294, 127891, 127217, 126344, 125781, 124845, 123425, 122592, 122771, 123033, 122790, 122530, 122418, 121926, 121325, 121725, 123126, 124288, 124954, 126210, 128102, 129029, 128295, 127211, 126778, 126240, 124905, 123557, 122952, 122547, 121803, 121225, 121200, 121246, 121273, 122146, 124112, 126089, 127225, 127818, 128097, 127589, 126398, 125564, 125485, 125436, 125251, 125876, 127599, 129353, 130505, 131713, 133258, 134145, 133766, 132976, 132728, 133005, 133725, 135129, 136619, 136874, 135920, 135518, 136683, 138355, 139281, 139623, 139835, 139590, 138823, 138413, 138827, 139337, 139341, 139157, 138895, 137983, 136454, 135202, 134349, 132960, 131122, 130579, 132423, 135636, 138690, 141076, 142577, 142785, 142262, 142559, 144082, 145449, 145747, 145828, 146615, 147908, 149751, 153163, 158407, 164264, 170137, 177132, 185894, 195085, 203297, 210855, 218373, 225066, 229834, 232641, 233485, 231457, 226189, 218941, 211012, 202362, 193007, 184338, 177631, 172421]
54905A72421m758m310l522l126l040k419j567j478j670q41N83J017N43O22J265
54890A49720J185N43Q83K309L416L976M976O095O004N248N895P993R248Q670P692
54875B23853P185O093L799J242j091l962p323r705j0315r904r077p681o126n317
54861A71671m943l912k522k190k924l372l242l400l552k453n58K19l83p02k19
54846A37518j98q96r92k81k04r90j046PM67l80r64l12L10j76q93q80o19n93k62
54827A28616M74O40jl55M6L44K40N22J168R50k54r56n14JJ00P40K008K296R47
54808A37012m03l77K42K98J10L04N17M19N09R66J141R13R69J202O19n98q88J27
54790A43082Q89M69p9J76N60L87J76L70N27O57J536K953L496K823K343K862L515
$$ y = [172421, 167663, 163353, 159831, 156705, 153665, 151246, 149679, 148201, 146531, 145690, 146273, 147290, 147833, 148455, 149720, 150905, 151448, 152331, 154640, 158056, 162032, 167008, 173103, 179107, 184355, 190250, 198243, 207491, 216161, 223853, 231038, 237131, 240930, 242172, 241081, 237119, 229796, 220091, 209776, 199872, 190795, 183114, 176988, 171671, 166728, 162816, 160294, 158104, 155180, 151808, 148566, 145166, 141614, 139161, 138603, 138822, 138439, 137737, 137518, 137320, 136424, 135432, 135151, 134947, 133957, 132911, 132918, 133385, 133005, 132041, 131729, 132039, 131863, 130970, 130090, 129471, 128878, 128616, 129090, 129730, 129729, 129374, 129420, 129764, 130004, 130526, 131694, 132644, 132390, 131434, 130920, 130921, 131021, 131761, 133769, 136065, 137012, 136609, 136232, 136474, 136772, 136882, 137186, 137703, 138122, 138631, 139597, 140738, 141651, 142620, 143822, 144441, 143843, 142955, 143082, 143971, 144440, 144361, 144537, 145097, 145484, 145660, 146030, 146557, 147214, 148750, 151703, 155199, 158022, 160365, 163227, 166742]
54773A66742L734M270N333N909N845O554Q503J0032R797Q520P152N250K387o07
54759B49421l060n431p796r110r028q702q720q100o344m708m160l915l136k358
54745A64853k102j760j022o36p28j80J195J867J099L05O18J143J042J239K433
54730A69366L376L010K569L625N576O973P867Q950R624Q899P179N317K934o17
54716B44648m424o898p836q187q399q255p742p001n912m656l940l943l948l561
54702A59946l333l500l330k442j467q31r3P79R48K23m56o80j118j751j400P6J044
54685A42615O29P4M44Q39L41j81K06O53J53n14k21M98M94k8k54l25o83q91n29
54666A43320k31n87j002q55o25p11l86Q17J835J522K36j061k085k530j565P04
$$ y = [166742, 170476, 174746, 180079, 185988, 191833, 198387, 206890, 216922, 226719, 235239, 242391, 247641, 250028, 249421, 246361, 240930, 233134, 224024, 214996, 206294, 197574, 189474, 183130, 178422, 174262, 170347, 167211, 164853, 162751, 160991, 159969, 159333, 158605, 158425, 159620, 161487, 162586, 162891, 163509, 164652, 165694, 166933, 169366, 172742, 175752, 178321, 181946, 187522, 194495, 202362, 211312, 220936, 229835, 237014, 242331, 245265, 244648, 240224, 233326, 225490, 217303, 208904, 200649, 192907, 185906, 179994, 175338, 171398, 167455, 163507, 159946, 156613, 153113, 149783, 147341, 145874, 145043, 144950, 145729, 146677, 146900, 146444, 145764, 144646, 142895, 141495, 141571, 142615, 143244, 143318, 143762, 144601, 144942, 144761, 144967, 145620, 145773, 145259, 145038, 145536, 146030, 146002, 145748, 145423, 144740, 143849, 143320, 143089, 142502, 141500, 140645, 140020, 139309, 138923, 139740, 141575, 143097, 143333, 142272, 140187, 137657, 136092, 136796]
54650A36796K566K762J952J140J77r91j299l27N24J38m95r1P75R48P24Q49Q55
54633A47003P8q25j064j143j585j541l67P81P07K06M97R73M53n01n97j21j93o85
54615A42076p92p98j227j173M27K524L045J789L72k50m13l68l1J72k43p35n19
54598A43856N8J82j1O2J92n2k45Q8M50L73M81J156J291J9j379j178O4M50l04q92
54578A44661q27q31j017o05N15J487J753J441O48m59j163q96j36L40N77R33J149
54561A47570R76Q74J101R67Q9n91k13N64P64O79R24J044M94p4P6L98K35J88Q26
54542A56891J271P46K44P91J337N20p78q32j10l46j404j563n34K77L26M28P51
54525A58015N06k82o25l34j67j91L42J382J920J538P50j14j053j650j461j037
$$ y = [136796, 139362, 142124, 144076, 145216, 145393, 144402, 143103, 142776, 143300, 143438, 142943, 142852, 143627, 144575, 145299, 146148, 147003, 147081, 146256, 145192, 144049, 142464, 140923, 140556, 141337, 142044, 142250, 142747, 143720, 144173, 143672, 143075, 142954, 142761, 142076, 141284, 140486, 139259, 138086, 138513, 141037, 144082, 145871, 146243, 145993, 145580, 145212, 145181, 145353, 145110, 144375, 143856, 143914, 144096, 144085, 144147, 144339, 144287, 144042, 144130, 144580, 144953, 145434, 146590, 147881, 147900, 146521, 145343, 145407, 145857, 145553, 144661, 143834, 143003, 141986, 141381, 141896, 143383, 145136, 146577, 147225, 146766, 145603, 144707, 144571, 144911, 145488, 146421, 147570, 148546, 149420, 150521, 151488, 151577, 150986, 150773, 151337, 152101, 152780, 153704, 154748, 155242, 155168, 155244, 155642, 155877, 156065, 156891, 158162, 158908, 159152, 159943, 161280, 161800, 161022, 160190, 160080, 159734, 158330, 156767, 156233, 156510, 156836, 157264, 158015, 158521, 158239, 157614, 157280, 157113, 156922, 157264, 158646, 160566, 162104, 162854, 162740, 161687, 160037, 158576, 157539]
54509A57539j180j569j289m11K50M74M98P9r28j635j133P4Q79J168J329J053J18
54492A55316n18j8P71O34l4k46l67j090j533n75P95Q31J7K29J395J634O33K10
54474A58084J308K661K958K356J483N85J6N7J62l19q45n17J82J60l13j96J95k89
54456A67728j327j402l81L26J81P7L83L99l3j86O7Q7j53l0L43L13J17M64R11M00
54436A68284p66j299j074j086j428j312q69r87j389r56J55P42Q44J585K750K763
54420A65957J351J8m08n75p55l23M93N59m7L5R42J152J09q43q49p31j013p60N87
54401A64899J984K428K301K199J836J003K80N0q0l05k59m0l23j073j341o83L93
54384A73269J428K157J821j04k415l145k091p38K42J463K734K780J484L67K60
$$ y = [157539, 156359, 154790, 153501, 153090, 153340, 153814, 154312, 154391, 153463, 151828, 150695, 150769, 151648, 152816, 154145, 155198, 155316, 154798, 154780, 155551, 156185, 156151, 155905, 155538, 154448, 152915, 152340, 153135, 153966, 153983, 154212, 155607, 157241, 157874, 158084, 159392, 162053, 165011, 167367, 168850, 169435, 169451, 169508, 169670, 169351, 168506, 167989, 168171, 168331, 168018, 167822, 168017, 167728, 166401, 164999, 164618, 164944, 165125, 165202, 165585, 165984, 165951, 165765, 165832, 165919, 165766, 165736, 166079, 166392, 166509, 166973, 167884, 168284, 167518, 166219, 165145, 164059, 162631, 161319, 160450, 159463, 158074, 157118, 157273, 158015, 158859, 160444, 163194, 165957, 167308, 167326, 166918, 166343, 165588, 165265, 165758, 166317, 166270, 166305, 167247, 168399, 168508, 167665, 166816, 166085, 165072, 164312, 164899, 166883, 169311, 171612, 173811, 175647, 176650, 176930, 176980, 176900, 176595, 176336, 176296, 175973, 174900, 173559, 172876, 173269, 174697, 176854, 178675, 178571, 176156, 173011, 170920, 170182, 170424, 171887, 174621, 177401, 178885, 179252, 179512]
54369A79512L22k0r8M35Q41P85R19J394J536J422J959K926K881J650R14J592K570
54352B01540K807K737K653J710l36k108k568k428k559k565k014j596j864k109
54338A91300j648j003q28q29o69p35j177j243n31J82J27l99p71q29n10K28P41
54321A81406K02r42j305o43r9j78j26K49L8r42j555j340j297j916k095j030L57
54304A68784Q29L55m90j274j303JJ660J768K28q91m56K20j21n87N3J197J489Q28
54286A72290K7n04o68l37Q7j13o43l75O61J105O20N36J382J736P30k97J0R05J070
54267A78222P20P03R03R07J100J689J886J283Q00J127J466R20o3p50j277j681
54251A87955j240O4Q67M41q8K44N93lq20r23r51j740k492k066r57l04M2P39J285
$$ y = [179512, 179834, 179814, 179716, 180151, 180992, 181777, 182696, 184090, 185626, 187048, 189007, 191933, 194814, 196464, 197378, 198970, 201540, 204347, 207084, 209737, 211447, 211111, 209003, 206435, 204007, 201448, 198883, 196869, 195273, 193409, 191300, 189652, 188649, 187821, 186992, 186323, 185588, 184411, 183168, 182637, 182819, 182946, 182547, 181776, 180947, 180437, 180665, 181406, 181608, 180666, 179361, 178718, 178619, 178441, 178315, 178564, 178602, 177660, 176105, 174765, 173468, 171552, 169457, 168427, 168784, 169613, 169968, 169478, 168204, 166901, 166902, 168562, 170330, 170558, 169667, 169211, 169431, 169310, 168723, 168776, 169973, 171462, 172290, 172317, 171813, 171145, 170808, 170895, 170782, 170139, 169764, 170425, 171530, 172150, 172686, 174068, 175804, 176534, 176237, 176247, 177152, 178222, 178942, 179645, 180548, 181455, 182555, 184244, 186130, 187413, 188213, 189340, 190806, 191726, 191663, 190913, 189636, 187955, 186715, 186779, 187646, 188087, 187999, 188243, 188836, 188833, 188013, 187090, 186139, 184399, 181907, 179841, 178884, 178580, 178622, 179361, 180646]
54232A80646Q68P9N6N85O13L1m52o19o47l03M69Q58K69n72o67k09J28M65J171
54213A82769J794J691J059L55n30j560j925j197k70j45n93r13j054j091o86J2
54197A77716N7o72q38K66J297Q62l62q77o01l51j63L07O28K71k33j67J22Q1P8
54178A77421M88N89k51j225j253o52l32k25J72N35L75J41L68N47P8n36n99m09
54160A75232l65O2J126J738J019o9j65M30N99L16K01P5m01n55K59J209J117K93
54142A82121j95k36k52N4R38J541J105M04M36O82K95m9N95J348P16q06j395o54
54124A86648K42O92J038J148N82p6J91J070J432J272J557K287K455J841J265J116
54108B04760J002P61N66J33r25k090k408j789r10k10J40p2n30k33J091K271K488
$$ y = [180646, 181514, 181593, 181649, 182234, 182847, 182878, 182426, 181807, 181160, 180857, 181326, 182184, 182453, 181881, 181214, 181005, 181133, 181598, 182769, 184563, 186254, 187313, 187668, 187138, 185578, 183653, 182456, 182186, 182041, 181448, 180535, 179481, 178390, 177704, 177716, 177773, 177101, 176263, 176529, 177826, 178688, 178326, 177449, 176848, 176497, 176334, 176641, 177269, 177540, 177307, 177140, 177262, 177343, 177421, 177909, 178498, 178247, 177022, 175769, 175117, 174785, 174560, 174732, 175267, 175642, 175783, 176151, 176698, 176776, 176240, 175641, 175232, 174867, 174929, 176055, 177793, 178812, 178743, 178578, 179008, 179607, 179923, 180124, 180199, 179798, 179243, 179502, 180711, 181828, 182121, 181926, 181690, 181438, 181492, 182430, 183971, 185076, 185480, 185916, 186598, 186893, 186844, 187439, 188787, 189503, 188697, 187302, 186648, 186890, 187582, 188620, 189768, 190350, 190274, 190465, 191535, 192967, 194239, 195796, 198083, 200538, 202379, 203644, 204760, 205762, 206523, 207089, 207222, 206297, 204207, 201799, 200010, 199100, 198890, 199030, 198958, 198428, 198195, 199286, 201557, 204045]
54091B04045K638L679M875N233N472O793Q669R850J0581J1757J2517J0917O617
54078C03643J075m421r109j1798j1705r969q460p391n836m079l321l445l149k282
54064B19753k003k649l189k915k056q41N30J247P92J49N40J435J538J164J638
54049B15133K779L161K653K612L566M657N409O209P001P304P388P762P725O310
54035B89669M370L652M077M007L086K475K380J710M46l3N92J002N77K29M07L09
54019C18955l55p23n31o31j222j403j058j378k784m074m364m310m669n167n461
54004B80825n785o029n556m460l673l439l035k323k059k267j967r56l34p10j359
53989B36873j677k022k516k500j757j031p41m54j6K8m01o53n42n59o92l64K10
$$ y = [204045, 206683, 210362, 215237, 220470, 225942, 232735, 241404, 251254, 261835, 273592, 286109, 297026, 303643, 304718, 300297, 291188, 279390, 267685, 257716, 249256, 241865, 236029, 231950, 228629, 225184, 222035, 219753, 217750, 215101, 211912, 208997, 206941, 206100, 206630, 207877, 208669, 208818, 209358, 210793, 212331, 213495, 215133, 217912, 221073, 223726, 226338, 229904, 234561, 239970, 246179, 253180, 260484, 267872, 275634, 283359, 289669, 294039, 297691, 301768, 305775, 308861, 311336, 313716, 315426, 315872, 315839, 316431, 317433, 318010, 318239, 318646, 318955, 318600, 317877, 317346, 316715, 315493, 314090, 313032, 311654, 308870, 304796, 300432, 296122, 291453, 286286, 280825, 275040, 269011, 263455, 258995, 255322, 251883, 248848, 246525, 244466, 242199, 240232, 239276, 238942, 238232, 236873, 235196, 233174, 230658, 228158, 226401, 225370, 224629, 224175, 224159, 224187, 223786, 223133, 222591, 222032, 221340, 220976, 221186]
53972B21186R6o65r64n20k72n64n05L41J185J419J353J191O87K14O11J583J814
53955B28190J081O63J183J740J751J917K649L250L395L906N163O256O547O720
53941B74411P464Q462R471J1086J3592J6251J8493K0474K1688K0277J4904O512
53929D43085k424r591j3603j4302j2991j1316r581p054m018j905j142n20O94J662
53915C56994J765J916L149N048O583P370P459O887O108N812N728M729K576L69
53901D22493j122k278l313l622l121k820l280l740l562l366l961n190o509p698
53887C68911q484q490q033p866p829p058n737n193n740o042n222m062l432l020
53873B82703k401j992k061k114j994k338l281l947l918l865m084l792k613j440
$$ y = [221186, 221282, 220617, 219653, 219133, 218861, 218297, 217792, 218133, 219318, 220737, 222090, 223281, 223968, 224182, 224793, 226376, 228190, 229271, 229934, 231117, 232857, 234608, 236525, 239174, 242424, 245819, 249725, 254888, 261144, 267691, 274411, 281875, 290337, 299808, 310894, 324486, 340737, 359230, 379704, 401392, 421669, 436573, 443085, 440661, 431070, 417467, 403165, 390174, 378858, 369277, 362223, 358205, 356300, 355158, 354638, 355332, 356994, 358759, 360675, 363824, 368872, 375455, 382825, 390284, 397171, 403279, 409091, 414819, 419548, 422124, 422493, 421371, 419093, 415780, 412158, 409037, 406217, 402937, 399197, 395635, 392269, 388308, 383118, 376609, 368911, 360427, 351937, 343904, 336038, 328209, 321151, 315414, 310221, 304481, 298439, 293217, 289155, 285723, 282703, 280302, 278310, 276249, 274135, 272141, 269803, 266522, 262575, 258657, 254792, 250708, 246916, 244303, 242863]
53859B42863j043j089j173j516k002j887j093n57o55o94m14m69q94p69n4Jr79
53842B27576j660j217o21p56r76n94j94l12l52J12M27K43L12R44J252Q71P46J221
53824B27022J154Q8n71J18R60P25J78M24Q95O83L46P03J192J124J219K195L164
53807B41619L123K834L415M221L951K932K499K993L876N032O365O954O093M510
53793C00417L326K653K277K542L346L473K278Q69K93j13j187k128j946j395j735
53778C12970k701l362l855m562m814m220m013n118o118n210l230k371k852l081
53764B57463k468j782j239m71m9q89k367k945k492k198k437k486k146j891j615
53749B29988q76j49k42p20m95L65R53J264J882K369J750M40j19L16O06J68m76
$$ y = [242863, 241820, 240731, 239558, 238042, 236040, 234153, 233060, 232503, 231848, 231154, 230740, 230271, 229377, 228608, 228554, 228555, 227576, 225916, 224699, 224078, 223322, 222346, 221752, 221558, 221246, 220894, 221006, 221433, 221676, 221988, 222932, 224184, 225055, 225801, 227022, 228176, 228264, 227693, 227811, 228771, 229496, 229674, 230098, 230993, 231676, 232022, 232725, 233917, 235041, 236260, 238455, 241619, 244742, 247576, 250991, 255212, 259163, 262095, 264594, 267587, 271463, 276495, 282860, 289814, 295907, 300417, 303743, 306396, 308673, 311215, 314561, 318034, 320312, 321181, 321474, 321361, 320174, 318046, 316100, 314705, 312970, 310269, 306907, 303052, 298490, 293676, 289456, 285443, 280325, 274207, 268997, 265767, 263396, 260544, 257463, 254995, 253213, 251974, 251503, 251454, 250565, 248198, 245253, 242761, 240563, 238126, 235640, 233494, 231603, 229988, 229112, 228963, 228721, 228001, 227506, 227871, 228824, 230088, 231970, 234339, 236089, 236529, 236410, 236726, 237332, 237500, 237024]
53732B37024j039j696k002j155M43J378J117M80J44m1j87L4O88J431K033K336
53716B40988K017J220R13J592K268J882J084J283K430L218L086K637K352K195
53702B69165K271K626K696K119J688K347L684M599M889M920M405K995J488R18
53688C10810Q91K73q84j582j554j215n03P33J605J132r1o97n91o29p80l81J88
53671C06725q5r75j347j090j015j099n80L52P82P81J068J207J60j454j751m82
53655C01197N04J09o63p07l87m05n64m44j72J1J68K95L80P45J433J605O85l01
53637C03489O5J403K097J806J659K132K438K143J713J290N41k01j55M66P93R90
53621C22669J924L196L358K353J864K782M082M634M573M357L995L722M103M991
$$ y = [237024, 235985, 234289, 232287, 231132, 231575, 232953, 234070, 234550, 234694, 234653, 234466, 234500, 235188, 236619, 238652, 240988, 243005, 244225, 245138, 246730, 248998, 250880, 251964, 253247, 255677, 258895, 261981, 264618, 266970, 269165, 271436, 274062, 276758, 278877, 280565, 282912, 286596, 291195, 296084, 301004, 305409, 308404, 309892, 310810, 311701, 311974, 311090, 309508, 307954, 306739, 306236, 306969, 308574, 309706, 309615, 308918, 308327, 307698, 306918, 306537, 306725, 306640, 305665, 304318, 303228, 302213, 301114, 300534, 300886, 301668, 302449, 303517, 304724, 304884, 303430, 301679, 301197, 301701, 301810, 301147, 300440, 300053, 299648, 299084, 298640, 298468, 298479, 298647, 298942, 299322, 300067, 301500, 303105, 303790, 303489, 303554, 304957, 307054, 308860, 310519, 312651, 315089, 317232, 318945, 320235, 320776, 320575, 320420, 320886, 321679, 322669, 324593, 327789, 331147, 333500, 335364, 338146, 342228, 346862, 351435, 355792, 359787, 363509, 367612, 372603]
53607C72603N669O125O896P557P074N795N331O040O395N310L457J695o9j779k624
53592D35475k348j845j728j555j085r09j207j252q09p57j573k472k700k488k136
53577D10611j377m06k55j294k393k425j704j195j191j391j600j691j480j065p68
53562C90376o02l59j53j09K02J021J487P15m71m40P77J594J359J012J118J121
53546C98648Q91J128J743J616N93O7Q06J834K163K167K442K752K920L348L984
53531D27102M098L722L923N001N950O312O937Q174Q995Q909R038J0144J1177J1063
53517E30545J0557J0883J1792J2419J3019J4424J6444J8171J9301K0144K0806
53506F98505K1239K1600K1890K1845K1618K1789K2260K2131K1166K0277K0055
$$ y = [372603, 378272, 384397, 391293, 398850, 405924, 411719, 417050, 423090, 429485, 434795, 438252, 439947, 439878, 438099, 435475, 433127, 431282, 429554, 427999, 426914, 426005, 424798, 423546, 422737, 421980, 420407, 417935, 415235, 412747, 410611, 409234, 408828, 408573, 407279, 404886, 402461, 400757, 399562, 398371, 396980, 395380, 393689, 392209, 391144, 390376, 389774, 389415, 389262, 389153, 389355, 390376, 391863, 392578, 392107, 391667, 392444, 394038, 395397, 396409, 397527, 398648, 399539, 400667, 402410, 404026, 404619, 404686, 405492, 407326, 409489, 411656, 414098, 416850, 419770, 423118, 427102, 431200, 434922, 438845, 443846, 449796, 456108, 463045, 471219, 480214, 489123, 498161, 508305, 519482, 530545, 541102, 551985, 563777, 576196, 589215, 603639, 620083, 638254, 657555, 677699, 698505, 719744, 741344, 763234, 785079, 806697, 828486, 850746, 872877, 894043, 914320, 934375]
53495I34375K0008J9750J9746K0137K0191J9706J9573K0101K0142J8935J7530
53484A150194J7159J7433J7374J7097J7112J7033J6388J5889J6418J7396J7542
53473A337035J6730J5783J4854J3278J0858Q230N990M192K565O90j761m570p171
53460A416703r483j1866j4020j4912j4296j3313j2994j3160j3409j4110j5551
53449A269589j7077j8003j8554j9124j9421j9209j8970j9011j8784j7992j7389
53438A066055j7439j7124j5254j2290r670p861o290m682l298k107p89N43J397
53425I71191J663J718J968K724M202O199Q075R424J0400J1278J2171J3354J5114
53412A069481J7144J8795K0031K1319K2465K2756K2469K2943K4676K6581K7746
$$ y = [934375, 954383, 974133, 993879, 1014016, 1034207, 1053913, 1073486, 1093587, 1113729, 1132664, 1150194, 1167353, 1184786, 1202160, 1219257, 1236369, 1253402, 1269790, 1285679, 1302097, 1319493, 1337035, 1353765, 1369548, 1384402, 1397680, 1408538, 1416768, 1422758, 1426950, 1429515, 1430205, 1428444, 1423874, 1416703, 1407220, 1395354, 1381334, 1366422, 1352126, 1338813, 1325819, 1312659, 1299250, 1285140, 1269589, 1252512, 1234509, 1215955, 1196831, 1177410, 1158201, 1139231, 1120220, 1101436, 1083444, 1066055, 1048616, 1031492, 1016238, 1003948, 994278, 986417, 980127, 975445, 972147, 970040, 969251, 969794, 971191, 972854, 974572, 976540, 979264, 983466, 989665, 997740, 1007164, 1017564, 1028842, 1041013, 1054367, 1069481, 1086625, 1105420, 1125451, 1146770, 1169235, 1191991, 1214460, 1237403, 1262079, 1288660, 1316406]
53401A316406K8726L0376L2586L4891L7328L9874M2038M3692M5360M7135M8441
53390A746853M9347N0769N2715N3777N3357N2874N3563N4422N3722N1456M8875
53379B321730M6586M4443M2533M0919L8962L6122L2861K9809K6689K2973J8903
53368B702530J4966J1061O960K722k082q481j6582k4913l2223l8708m4564m8667
53356B522019n0085m9744m9273m9126m9122m9629n0704n1040m9417m6472m3627
53345A983780m1128l8599l6609l6020l6477l7053l7748l8778l9155l7702l5031
53334A569480l2741l1130k9210k6650k4117k1913j9735j7602j5703j3713j1478
53323A325488r933r966j0947j1713j2459j4006j5752j6102j4803j3155j1980j0936
$$ y = [1316406, 1345132, 1375508, 1408094, 1442985, 1480313, 1520187, 1562225, 1605917, 1651277, 1698412, 1746853, 1796200, 1846969, 1899684, 1953461, 2006818, 2059692, 2113255, 2167677, 2221399, 2272855, 2321730, 2368316, 2412759, 2455292, 2496211, 2535173, 2571295, 2604156, 2633965, 2660654, 2683627, 2702530, 2717496, 2728557, 2735517, 2738239, 2736157, 2727676, 2711094, 2686181, 2653958, 2615250, 2570686, 2522019, 2471934, 2422190, 2372917, 2323791, 2274669, 2225040, 2174336, 2123296, 2073879, 2027407, 1983780, 1942652, 1904053, 1867444, 1831424, 1794947, 1757894, 1720146, 1681368, 1642213, 1604511, 1569480, 1536739, 1505609, 1476399, 1449749, 1425632, 1403719, 1383984, 1366382, 1350679, 1336966, 1325488, 1315555, 1305589, 1294642, 1282929, 1270470, 1256464, 1240712, 1224610, 1209807, 1196652, 1184672, 1173736]
53311A173736r821r020q484p618o305m965l637k090o02M05J287K542L697M144
53297A133269M671O585R623J2240J3880J5358J7106J8678K0113K2083K4419K5962
53285A323987K6294K6238K6238K5629K4013K2146K0763J9562J7983J6177J4602
53274A563632J3189J1410Q815N363J564j715m048n951q158j0710j3211j5623j8084
53261A526473k0404k2451k4560k6780k8291k8509k8234k8617k9498k9902k9700
53250A229527k9461k8988k7456k5006k2868k1856k1684k1793k1878k1693k1277
53239I65567k1216k1809k2333k2046k1431k1290k1160j9968j7932j6288j5336
53228G44758j4208j2517j0777r246p722o518o263o713p038p297q224r633j0535
$$ y = [1173736, 1163915, 1154895, 1146411, 1138793, 1132488, 1127523, 1123886, 1121796, 1121194, 1121599, 1122886, 1125428, 1129125, 1133269, 1137940, 1144525, 1154148, 1166388, 1180268, 1195626, 1212732, 1231410, 1251523, 1273606, 1298025, 1323987, 1350281, 1376519, 1402757, 1428386, 1452399, 1474545, 1495308, 1514870, 1532853, 1549030, 1563632, 1576821, 1588231, 1597046, 1602409, 1603973, 1602258, 1598210, 1592259, 1584101, 1573391, 1560180, 1544557, 1526473, 1506069, 1483618, 1459058, 1432278, 1403987, 1375478, 1347244, 1318627, 1289129, 1259227, 1229527, 1200066, 1171078, 1143622, 1118616, 1095748, 1073892, 1052208, 1030415, 1008537, 986844, 965567, 944351, 922542, 900209, 878163, 856732, 835442, 814282, 794314, 776382, 760094, 744758, 730550, 718033, 707256, 698010, 690288, 683770, 677507, 670794, 663756, 656459, 648235, 638602, 628067]
53215F28067j0916j1852j3555j4879j5133j4930j4781j4177j2726j0988r589q479
53203D76062p610p298p443p388o994o870p149p049o263n787o614q280r378r103
53189C72836p812o486n879n878n584m404k925k217k485l105l653m031l850k781
53175C11746j448r02j171j375j214j232j582j712j460j319j448j422j220j381
53161B92860j929k219k129k306k894l048k243j127n49m44k95k1N4k72q56j259
53145B71323r34J72J289J594J121M22l16j080j369p38K26N35K38J78M70M14o7
53128B73478j14P26J837K459K411J801Q95L18M85R50J040J032J591K343K246J282
53112B94780N35M75M74J14k51m94j037j920k557k698k655k485j931j219q95q39
$$ y = [628067, 617151, 605299, 591744, 576865, 561732, 546802, 532021, 517844, 505118, 494130, 484541, 476062, 468452, 461154, 453711, 446323, 439329, 432459, 425310, 418261, 411998, 406211, 399597, 391317, 381939, 372836, 365024, 358538, 352659, 346781, 341197, 336793, 333868, 331651, 329166, 326061, 322408, 318377, 314527, 311746, 310298, 309396, 308225, 306850, 305636, 304404, 302822, 301110, 299650, 298331, 296883, 295461, 294241, 292860, 290931, 288712, 286583, 284277, 281383, 278335, 276092, 274965, 274416, 273972, 273677, 273656, 273710, 273438, 272582, 271323, 270389, 270561, 271850, 273444, 274565, 274987, 274671, 273591, 272222, 271484, 271710, 272245, 272483, 272661, 273131, 273545, 273478, 273364, 274090, 275927, 278386, 280797, 282598, 283493, 283811, 284296, 285246, 286286, 287318, 288909, 291252, 293498, 294780, 295315, 295790, 296264, 296378, 296127, 295633, 294596, 292676, 290119, 287421, 284766, 282281, 280350, 279131, 278236, 277397]
53096B77397m95n7j44m72j70M83K28j084k019j638o26L2K36K09n3k69K3M86K12
53077B72279p73j388j176q20o93k57O24J091N63m35j171j397j016j47L60k26j039
53060B64379n58R04J427M86k57K22P61K99k64J48Q32O20j55m96m30m46k97L11
53042B67486P01K31m59m16J03L01K73N89J021R60N79N06O95O23K87R3Q8M3K4J77
53022B73905L61N20R26J513J553O96k42k73N14J271J530J315O91j70p57o69j00
53005B82584M62O67L66k72n94p2Q34J140P53M22L25j14p25m21R44J904J457N87
52987B90247O94J564K021J679R91K50l71l50N50J603J903J478R64O35M11L59N04
52970C05132N46K65j46m92p62p23m5Q50J044N62M87J165J485O57m29o22k50l58
$$ y = [277397, 276902, 276845, 276701, 276229, 276059, 276542, 276770, 275686, 273667, 272029, 271403, 271435, 271671, 271880, 271827, 271558, 271581, 272067, 272279, 271506, 270118, 268942, 268122, 267429, 267172, 267796, 268887, 269450, 269015, 267844, 266447, 265431, 265284, 265644, 265418, 264379, 263821, 264725, 266152, 266638, 266381, 266603, 267364, 267663, 267399, 267547, 268379, 268999, 268844, 268348, 267918, 267472, 267175, 267486, 268187, 268418, 267959, 267543, 267646, 267947, 268220, 268809, 269830, 270790, 271369, 271875, 272570, 273193, 273480, 273573, 273661, 273704, 273728, 273905, 274266, 274786, 275712, 277225, 278778, 279474, 279232, 278959, 279473, 280744, 282274, 283589, 284280, 284110, 283353, 282684, 282584, 283046, 283713, 284079, 283807, 283213, 283141, 283975, 285115, 285868, 286290, 286615, 286501, 285776, 285355, 286299, 288203, 289660, 290247, 290941, 292505, 294526, 296205, 297196, 297446, 297075, 296725, 297275, 298878, 300781, 302259, 303223, 303858, 304269, 304628, 305132, 305678, 305943, 305797, 305305, 304543, 303820, 303775, 304625, 305669, 306231, 306718, 307883, 309368, 310025, 309596, 308974, 308724, 308366]
52952C08366j002j471j609j787j911j524o60J56N79N89K53j98m31m89p64j202
52936B96895j241p48k94j65KK45pp51j014l44L10Q7m22k29M51O98L27j60n53r47
52916B92140j124p58o8L37P5p15j421j300l50L20j77j017o57P38J437Q35K27M24
52898B88946M89k74q58l61K97n6q59q34qP23J188J731K116J820Q68m82k150l559
52880B88737l552j922p2P63Q85R03M94m93r51p3J132J312Q17Q59J575K332L003
52863B95749L525L111J500N6K5N19m8j367j945j736k057l171l888l578k948k623
52847B81124k386k012j735j744k017k550l079k974k134j380j215r71j35N16K18
52832B57526l15r8M46M95N75J560K714K565J238K00j1j5j1L54Q03P25M67P74J234
$$ y = [308366, 307364, 305893, 304284, 302497, 300586, 299062, 298402, 298558, 299137, 299726, 299979, 299781, 299350, 298861, 298097, 296895, 295654, 294906, 294612, 294447, 294449, 294694, 294687, 293936, 292922, 292578, 292888, 292975, 292553, 292324, 292775, 293473, 293800, 293640, 293087, 292140, 291016, 290258, 290190, 290527, 290602, 289887, 288466, 287166, 286816, 287136, 286959, 285942, 285285, 286023, 287460, 288295, 288522, 288946, 289435, 289161, 288303, 287942, 288239, 288183, 287324, 286490, 286482, 287205, 288393, 290124, 292240, 294060, 294928, 294446, 292296, 288737, 285185, 283263, 283191, 283954, 284839, 285742, 286236, 285743, 284792, 284719, 285851, 287163, 287980, 288839, 290414, 292746, 295749, 299274, 302385, 303885, 303941, 303966, 304485, 304437, 303070, 301125, 299389, 297332, 294161, 290273, 286695, 283747, 281124, 278738, 276726, 274991, 273247, 271230, 268680, 265601, 262627, 260493, 259113, 257898, 256927, 256792, 257308, 257526, 257211, 257113, 257559, 258054, 258629, 260189, 262903, 265468, 266706, 266906, 266895, 266880, 266869, 267223, 268026, 268751, 269218, 269992, 271226]
52813B71226R09K23N75K211L990N036N127L792Q47k374m067m238m328m712m392
52798B69825l158k107j718j215l18J28k52n79k14K91K65j17m76p79r17n94R6P53
52780B58914J363K025K220J457M21J90N12K32o16p61J80J023R03L31m6l72p40
52763B67236o39M7N53K90l39p38q97r95q82l99K94Q99J139P75q2q13r47o60j49
52744B63693Q62K313L213K857J962J506J194L14n91m55M22R04J002J669K848L407
52728B87120L043K498J952P81r11k086k306k132j885j296m49J35L79M69J44o29
52712B84827q52J80J285R05l15n29K21K25p50j072k00M89K87J28L92R6q56r43
52694B83518M35J778J890J545J607J440M68m44n11l64o69q61m88k96p62r51k05
$$ y = [271226, 272135, 272358, 272933, 275144, 279134, 284170, 289297, 293089, 293936, 291562, 287495, 283257, 278929, 274217, 269825, 266667, 264560, 262842, 261627, 261309, 261437, 261185, 260606, 260392, 260683, 260948, 260831, 260355, 259576, 258659, 258065, 258161, 258914, 260277, 262302, 264522, 265979, 266400, 266590, 267102, 267334, 266718, 265957, 266137, 267160, 268063, 268394, 268348, 267976, 267236, 266597, 266644, 267197, 267487, 267148, 266410, 265513, 264518, 263636, 263237, 263531, 264430, 265569, 266344, 266262, 265449, 264502, 263842, 263693, 264555, 266868, 270081, 272938, 274900, 276406, 277600, 277914, 277323, 276868, 277290, 278194, 279196, 280865, 283713, 287120, 290163, 292661, 294613, 295394, 294483, 292397, 290091, 287959, 286074, 284778, 284329, 284464, 284843, 285312, 285456, 284827, 283975, 284155, 285440, 286345, 286030, 285501, 285722, 285947, 285197, 284125, 283925, 284414, 284701, 284829, 285221, 285317, 284461, 283518, 283953, 285731, 287621, 289166, 290773, 292213, 292681, 292237, 291726, 291362, 290693, 289832, 289344, 289048, 288286, 287335, 287130]
52677B87130N15K27l57j77L72L30j29l74o35j317j823j449p11m88n34j03O18R08
52659B82003Q06Q84J170J347J599K310L234L775L780L410K645J492K66q25j876
52644C06020k696k694j780o81M8N80J018R21J76n21n93k04M14J421K648L433L667
52627C11177M069M810M864L385Q62j667l728n142n639n353m836m140k803j154
52613B94705m35j039j785j618q96l02K98J038J306P82K06K30M42L20J88L68M51
52596B94259K55M30J171J517Q94K42M75R28O07MK44J155J566J016P4o53q42k65
52578C03077P58J218N61n47j172j162o73L70J510J552J18j437j780j378j386j665
52562B97964j306m69k87j119k027j983q26O85J382O44o89j099m52j89j029j753
$$ y = [287130, 287645, 287872, 287515, 287338, 287710, 288040, 287911, 287537, 286902, 285585, 283762, 282313, 281602, 281114, 280580, 280477, 281095, 282003, 282809, 283693, 284863, 286210, 287809, 290119, 293353, 297128, 300908, 304318, 306963, 308455, 308721, 307896, 306020, 303324, 300630, 298850, 298169, 298217, 298797, 299815, 300736, 300912, 300391, 299798, 299594, 300008, 301429, 304077, 307510, 311177, 315246, 320056, 324920, 328305, 329167, 327500, 323772, 318630, 312991, 307638, 302802, 298662, 295859, 294705, 294270, 293231, 291446, 289828, 288932, 288630, 288928, 289966, 291272, 292054, 292260, 292490, 292932, 293252, 293440, 293808, 294259, 294514, 294944, 296115, 297632, 298526, 298768, 299243, 300171, 300778, 300782, 301026, 302181, 303747, 304763, 304837, 304184, 303342, 303077, 303835, 305053, 305614, 305067, 303895, 302733, 302060, 302430, 303940, 305492, 305610, 304173, 302393, 301015, 299629, 297964, 296658, 296189, 295902, 294783, 292756, 290773, 289947, 290632, 292014, 292658, 291969, 290870, 290418, 290229, 289200, 287447]
52546B87447j188o3L37J52K50N66N46M09N54M58l75j130p96J04M00L03R03K065
52528B90942K472J705P76N25O79O45K33m23r07p03Q4N92M40M34J235K174K440
52511C03343K561L352M215L992L019K610K816K322N05j812l743n105n743n384
52497C06948m359l433k793k048j200o82n28m17m26p77j007m30O30J166R17N91
52481B92152O68R79J399J936K190J634N56j16K5O02J272J945K308J986J246P84
52465C11566Q68J270J880K634L084K794K044J394P41l82j808k845l250l423l695
52450C12872m063m426m504l827k432j143n34j67M36Q03M09j16J36P39N68l70j019
52433B93362j033j151j698k006j491m20O30J250J192N37q9j32J75K91K92N76J026
$$ y = [287447, 286259, 286196, 286533, 286685, 286935, 287501, 288047, 288456, 289010, 289468, 289093, 287963, 287167, 287271, 287671, 287974, 288877, 290942, 293414, 295119, 295895, 296420, 297099, 297744, 297977, 297554, 296647, 295944, 296028, 296620, 297060, 297494, 298729, 300903, 303343, 305904, 309256, 313471, 317463, 320482, 323092, 325908, 328230, 328735, 326923, 323180, 318075, 312332, 306948, 302589, 299156, 296363, 294315, 293115, 292433, 291905, 291488, 291062, 290285, 289278, 288848, 289478, 290644, 291561, 292152, 292820, 293799, 295198, 297134, 299324, 300958, 301514, 301398, 301423, 302025, 303297, 305242, 307550, 309536, 310782, 311566, 312434, 313704, 315584, 318218, 321302, 324096, 326140, 327534, 328275, 327893, 326085, 323240, 319990, 316567, 312872, 308809, 304383, 299879, 296052, 293620, 292477, 291943, 291776, 292212, 293015, 293424, 293308, 293444, 294183, 294751, 294381, 293362, 292329, 291178, 289480, 287474, 285983, 285563, 286193, 287443, 288635, 289172, 289083, 288951, 289126, 289417, 289709, 290285, 291311]
52416B91311J252J346J603J865J981K388L427M488M919N198O174P605Q698R595
52402C51850J0925J2186J1992R824O252J631l874r035j1921j1937j0392q779p522
52389C41200o466n420l970j870J49R46N37J06L59Q18Q90O27K63j1L04J607L341
52372C33410M408M571M558M735M697M213L478K374N73j396k331j894j005m98l19
52357C59574k66m48o67l41N48J229J287J187J368J599J604J574J682J744J673
52342C73347J643J634J436J297J841L110M270M601M282M046M473N632P063Q071
52328D26746Q483Q892R820J0976J1864J2587J3316J3500J2578J1134J0330J0492
52316E60718J1197J2361J4114J5858J6778J7114J7824J9054K0066K0530K0691
$$ y = [291311, 292563, 293909, 295512, 297377, 299358, 301746, 305173, 309661, 314580, 319778, 325952, 333557, 342255, 351850, 362775, 374961, 386953, 396777, 403029, 404660, 400786, 391751, 379830, 367893, 357501, 348722, 341200, 334734, 329314, 325344, 323474, 323623, 324569, 325106, 325212, 325571, 326389, 327279, 327906, 328169, 328158, 328462, 330069, 333410, 337818, 342389, 346947, 351682, 356379, 360592, 364070, 366444, 367017, 365621, 363290, 361396, 360391, 359893, 359574, 359308, 358860, 358193, 357852, 358400, 359629, 360916, 362103, 363471, 365070, 366674, 368248, 369930, 371674, 373347, 374990, 376624, 378060, 379357, 381198, 384308, 388578, 393179, 397461, 401507, 405980, 411612, 418675, 426746, 435229, 444121, 453941, 464917, 476781, 489368, 502684, 516184, 528762, 539896, 550226, 560718, 571915, 584276, 598390, 614248, 631026, 648140, 665964, 685018, 705084, 725614, 746305]
52305G46305K0417J9474J8675J9292K1143K2530K2407K1366K0242J9005J7408
52294I68264J5619J3715J1403Q592N593K682J71j311j577j649k684m341n436n843
52280A003198o316o647n831m107l036l155l316k799k337k447k293j113O21K225
52266I62647L720N042N607N505N877P298Q898R900J0906J2726J4989J6820J8060
52253A087995J8955J9372J9151J8582J7854J6648J4716J2307R645O799M286K817
52241A249127K088Q79j196l144m197m849n751o744p586q566r671j0282j0294j0540
52227A169274j1388j1987j1630j0795j0139r486q609p957p730p239o051m898m500
52214A056865m407l810k739j659n94N36J531K389L375M146L891K887K602L572
$$ y = [746305, 766722, 786196, 804871, 824163, 845306, 867836, 890243, 911609, 931851, 950856, 968264, 983883, 997598, 1009001, 1017593, 1023186, 1025868, 1026039, 1024728, 1023151, 1021502, 1018818, 1014477, 1009041, 1003198, 996882, 990235, 984404, 980297, 977261, 974106, 970790, 967991, 965654, 963207, 960914, 959801, 960422, 962647, 966367, 971409, 977016, 982521, 988398, 995696, 1004594, 1014494, 1025400, 1038126, 1053115, 1069935, 1087995, 1106950, 1126322, 1145473, 1164055, 1181909, 1198557, 1213273, 1225580, 1235225, 1242024, 1246310, 1249127, 1251215, 1252094, 1250898, 1247754, 1243557, 1238708, 1232957, 1226213, 1218627, 1210061, 1200390, 1190108, 1179814, 1169274, 1157886, 1145899, 1134269, 1123474, 1113335, 1103849, 1095240, 1087283, 1079553, 1072314, 1066263, 1061365, 1056865, 1052458, 1048648, 1045909, 1044250, 1043656, 1044192, 1045723, 1048112, 1051487, 1055633, 1059524, 1062411, 1065013, 1068585]
52200A068585M534M622M901O403Q078Q344P555P284P853Q172P553O158M183J919
52186A156144J92n68j357l338n994p754q143q002p854p479o916o592o392n789
52172A080158m963m681n028n196m715l938l233k467j409j3J636L135L718L174
52158A056178K479K622L068K400M49j332j797j330q17l04O55J970L010L384L229
52143A073864K754J937P90l55j023j144j152j403j725j841j871j868j189Q67L809
52128A070450O253P702R102J1307J3868J5868J7156J8185J9139J9856K0179J9963
52116A249028J9270J8726J9031J9854K0012J9147J8280J8254J8628J8780J9041
52105A458051J9889K0856K1313K1518K1889K1833K0526J8288J6077J3891J0859
$$ y = [1068585, 1073119, 1077741, 1082642, 1089045, 1097123, 1105467, 1113022, 1120306, 1128159, 1136331, 1143884, 1150042, 1154225, 1156144, 1156336, 1155768, 1154411, 1151073, 1145079, 1137325, 1129182, 1121180, 1113326, 1105847, 1098931, 1092339, 1085947, 1080158, 1075195, 1070514, 1065486, 1060290, 1055575, 1051637, 1048404, 1045937, 1044528, 1044515, 1046151, 1049286, 1053004, 1056178, 1058657, 1061279, 1064347, 1066747, 1067196, 1065864, 1064067, 1062737, 1061920, 1061616, 1062271, 1064241, 1067251, 1070635, 1073864, 1076618, 1078555, 1079345, 1078990, 1077967, 1076823, 1075671, 1074268, 1072543, 1070702, 1068831, 1066963, 1065774, 1066641, 1070450, 1076703, 1084405, 1093507, 1104814, 1118682, 1134550, 1151706, 1169891, 1189030, 1208886, 1229065, 1249028, 1268298, 1287024, 1306055, 1325909, 1345921, 1365068, 1383348, 1401602, 1420230, 1439010, 1458051, 1477940, 1498796, 1520109, 1541627, 1563516, 1585349, 1605875, 1624163, 1640240, 1654131, 1664990]
52094A664990O722K168k221o373j0072j2807j4316j4751j4268j3130j2051j1777
52082A562114j2254j2727j2625j1969j1050j0189r691r562r324q540p350o177
52070A440656n045l598j590R14L627O081P848R058J0417J2380J4585J6291J7142
52057A528766J7299J7123J6861J6467J5632J4246J2637J0948Q644N426K244K97
52045A666590p33k232m422o060o615p080q099q897q901q997j0025j1344j2081
$$ y = [1664990, 1671712, 1673880, 1671659, 1665286, 1655214, 1642407, 1628091, 1613340, 1599072, 1585942, 1573891, 1562114, 1549860, 1537133, 1524508, 1512539, 1501489, 1491300, 1481609, 1472047, 1462723, 1454183, 1446833, 1440656, 1435611, 1432013, 1430423, 1431337, 1434964, 1441045, 1448893, 1457951, 1468368, 1480748, 1495333, 1511624, 1528766, 1546065, 1563188, 1580049, 1596516, 1612148, 1626394, 1639031, 1649979, 1658623, 1664049, 1666293, 1666590, 1665857, 1663625, 1659203, 1653143, 1646528, 1639448, 1631349, 1622452, 1613551, 1604554, 1594529, 1583185, 1571104]
$$ [...]
##END NTUPLES=NMR SPECTRUM
##END=
