
##TITLE=UV1283_M1_1242-1388_90_7534359_6izRPBe8Zb
##JCAMPDX= 6.0         $$ Bruker NMR JCAMP-DX V2.0
##DATA TYPE= NMR SPECTRUM
##DATA CLASS= NTUPLES
##ORIGIN= BRUKER
##OWNER= Administrator
$$ 1.72 TOPSPIN		Version 2.1
$$ 2013-02-22 04:40:42.403 -0500  Administrator@X
$$ Compression mode = diff/dup
##.OBSERVE FREQUENCY= 400.02188249412
##.OBSERVE NUCLEUS= ^1H
##.ACQUISITION MODE= SIMULTANEOUS (DQD)
##.ACQUISITION SCHEME= undefined
##.AVERAGES= 64
##.DIGITISER RES= 22
##SPECTROMETER/DATA SYSTEM= spect
##.PULSE SEQUENCE= noesygpps1d.comp
##.SOLVENT NAME= COFFEE_meoh
##.SHIFT REFERENCE= INTERNAL, COFFEE_meoh, 1, 14.9616
##AUDIT TRAIL= $$ (NUMBER, WHEN, WHO, WHERE, PROCESS, VERSION, WHAT)
$$ ##TITLE= Audit trail, TOPSPIN		Version 2.1
$$ ##JCAMPDX= 5.01
$$ ##ORIGIN= Bruker BioSpin GmbH
$$ ##OWNER= Administrator
$$ $$ E:\/data/COFFEE/nmr/UV1283_M1_1242-1388_90_7534359_6izRPBe8Zb/12/pdata/1/auditp.txt
$$ ##AUDIT TRAIL=  $$ (NUMBER, WHEN, WHO, WHERE, PROCESS, VERSION, WHAT)
(   1,<2013-02-22 04:40:36.387 -0500>,<Administrator>,<X>,<go>,<TOPSPIN 2.1>,
      <created by zg
	started at 2013-02-22 04:29:05.788 -0500,
	POWCHK enabled, PULCHK disabled,
       configuration hash MD5:
       86 BA 57 50 F2 9D 5C 9B 26 00 A9 28 5F 66 2E 89
       data hash MD5: 64K
       97 2D 3B 98 B0 32 32 53 C0 73 3C 59 36 E0 32 8F>)
(   2,<2013-02-22 04:40:39.559 -0500>,<Administrator>,<X>,<proc1d>,<TOPSPIN 2.1>,
      <Start of raw data processing
       efp LB = 0.3 FT_mod = 6 PKNL = 1 PHC0 = 0 PHC1 = 0 SI = 128K 
       data hash MD5: 128K
       1B 08 83 CC 3A 87 8E FB DD 75 8B B4 57 31 45 76>)
(   3,<2013-02-22 04:40:40.684 -0500>,<Administrator>,<X>,<proc1d>,<TOPSPIN 2.1>,
      <pk PHC0 = 250.686 PHC1 = 0 
       data hash MD5: 128K
       59 6E A4 B1 4D D9 C8 59 9E D9 EC C5 64 D1 B1 5C>)
(   4,<2013-02-22 04:40:41.387 -0500>,<Administrator>,<X>,<proc1d>,<TOPSPIN 2.1>,
      <abs ABSG = 1 
       data hash MD5: 128K
       62 E5 E6 F8 39 C7 73 C6 65 F8 E7 AF 38 B4 2A 52>)
(   5,<2013-02-22 04:40:41.575 -0500>,<Administrator>,<X>,<proc1d>,<TOPSPIN 2.1>,
      <abs ABSG = 2 
       data hash MD5: 128K
       A3 8B D8 D0 45 34 44 AD 5F 65 3C B7 7C 28 D1 0A>)
(   6,<2013-02-22 04:40:41.715 -0500>,<Administrator>,<X>,<proc1d>,<TOPSPIN 2.1>,
      <abs ABSG = 3 
       data hash MD5: 128K
       B3 19 43 02 D0 EF 39 8E 33 81 C8 C0 E7 30 62 D3>)
(   7,<2013-02-22 04:40:41.871 -0500>,<Administrator>,<X>,<proc1d>,<TOPSPIN 2.1>,
      <abs ABSG = 4 
       data hash MD5: 128K
       8F 38 1D DD DB 74 74 3E 33 75 68 38 3F C3 1F 4B>)
(   8,<2013-02-22 04:40:42.075 -0500>,<Administrator>,<X>,<proc1d>,<TOPSPIN 2.1>,
      <abs ABSG = 5 
       data hash MD5: 128K
       CD 91 85 CC 36 F6 0A D1 B4 13 CE 0C D9 72 98 B5>)
$$ ##END=
$$ 
$$ $$ hash MD5
$$ $$ 02 19 34 04 76 99 FC 19 43 A9 D4 72 D5 44 CB F5
##$RELAX= 
##$RELAX= 
##$RELAX= 
##$RELAX= 
##$RELAX= 
##$RELAX= 
##$RELAX= 
##$RELAX= 
$$ Bruker specific parameters
$$ --------------------------
##$DU= <E:\>
##$EXPNO= 12
$$ [...]
150 150 150 150 150 150 150 150
##$TP07= 0
##$TPNAME0= <>
##$TPNAME1= <>
##$TPNAME2= <>
##$TPNAME3= <>
##$TPNAME4= <>
##$TPNAME5= <>
##$TPNAME6= <>
##$TPNAME7= <>
##$TPOAL= (0..7)
0.5 0.5 0.5 0.5 0.5 0.5 0.5 0.5
##$TPOFFS= (0..7)
0 0 0 0 0 0 0 0
##$TUNHIN= 0
##$TUNHOUT= 0
##$TUNXOUT= 0
##$USERA1= <user>
##$USERA2= <user>
##$USERA3= <user>
##$USERA4= <user>
##$USERA5= <user>
##$V9= 5
##$VALIST= <valist>
##$VCLIST= <CCCCCCCCCCCCCCC>
##$VD= 0
##$VDLIST= <DDDDDDDDDDDDDDD>
##$VPLIST= <PPPPPPPPPPPPPPP>
##$VTLIST= <TTTTTTTTTTTTTTT>
##$WBST= 1024
##$WBSW= 4
##$XGAIN= (0..3)
0 0 0 0
##$XL= 0
##$YL= 0
##$YMAX_a= 6263426
##$YMIN_a= -11380920
##$ZGOPTNS= <>
##$ZL1= 120
##$ZL2= 120
##$ZL3= 120
##$ZL4= 120
##$ABSF1= 14.9616
##$ABSF2= -5.596581
##$ABSG= 5
##$ABSL= 3
##$ALPHA= 0
##$AQORDER= 0
##$ASSFAC= 0
##$ASSFACI= 0
##$ASSFACX= 0
##$ASSWID= 0
##$AUNMP= <proc_prof1d_extract.lims>
##$AXLEFT= 0
##$AXNAME= <>
##$AXNUC= <1H>
##$AXRIGHT= 0
##$AXTYPE= 0
##$AXUNIT= <>
##$AZFE= 0.1
##$AZFW= 0.1
##$BCFW= 0
##$BC_mod= 0
##$BYTORDP= 0
##$COROFFS= 0
##$CY= 15
##$DATMOD= 1
##$DC= 0
##$DFILT= <>
##$DTYPP= 0
##$F1P= 0
##$F2P= 0
##$FCOR= 0.5
##$FTSIZE= 131072
##$FT_mod= 6
##$GAMMA= 0
##$GB= 0
##$INTBC= 1
##$INTSCL= 1
##$ISEN= 128
##$LB= 0.3
##$LEV0= 0
##$LPBIN= 0
##$MAXI= 10000
##$MC2= 0
##$MEAN= 0
##$ME_mod= 0
##$MI= 0
##$NCOEF= 0
##$NC_proc= -2
##$NLEV= 6
##$NOISF1= 0
##$NOISF2= 0
##$NSP= 0
##$NTH_PI= 0
##$NZP= 0
##$OFFSET= 14.9616
##$PC= 1
##$PHC0= 250.686
##$PHC1= 0
##$PH_mod= 1
##$PKNL= yes
##$PPARMOD= 0
##$PPDIAG= 0
##$PPIPTYP= 0
##$PPMPNUM= 2147483647
##$PPRESOL= 1
##$PSCAL= 4
##$PSIGN= 0
##$PYNMP= <proc.py>
##$REVERSE= no
##$SF= 400.020009396061
##$SI= 131072
##$SIGF1= 0
##$SIGF2= 0
##$SINO= 400
##$SIOLD= 131072
##$SPECTYP= <>
##$SREGLST= <1H.CDCl3>
##$SSB= 0
##$STSI= 131072
##$STSR= 0
##$SW_p= 8223.68421052631
##$SYMM= 0
##$S_DEV= 0
##$TDeff= 65536
##$TDoff= 0
##$TI= <>
##$TILT= no
##$TM1= 0
##$TM2= 0
##$TOPLEV= 0
##$USERP1= <user>
##$USERP2= <user>
##$USERP3= <user>
##$USERP4= <user>
##$USERP5= <user>
##$WDW= 1
##$XDIM= 131072
##$YMAX_p= 463509798
##$YMIN_p= -10918
##$CURPLOT= <Network HP LaserJet P1505>
##$CURPRIN= <$Network HP LaserJet P1505>
##$DFORMAT= <normdp>
##$LAYOUT= <+/1D_H.xwp>
##$LFORMAT= <normlp>
##$PFORMAT= <normpl>
##$SURQMSG= 1
$$ End of Bruker specific parameters
$$ ---------------------------------
##NTUPLES= NMR SPECTRUM
##VAR_NAME=  FREQUENCY,     SPECTRUM/REAL,   SPECTRUM/IMAG
##SYMBOL=    X,             R,               I
##VAR_TYPE=  INDEPENDENT,   DEPENDENT,       DEPENDENT
##VAR_FORM=  AFFN,          ASDF,            ASDF
##VAR_DIM=   131072,        131072,          131072
##UNITS=     HZ,            ARBITRARY UNITS, ARBITRARY UNITS
##FACTOR=    0.0627417313425164, 1,          1
##FIRST=     8223.62146879497, 593,          -64604
##LAST=      0,             2494,            -64734
##MIN=       0,             -10918,          0
##MAX=       8223.62146879497, 463509798,    0
$$ Real data points
##PAGE= N=1
##DATA TABLE= (X++(R..R)), XYDATA
$$ [...]
61613D47999N20o42j866k371j966j481j967l475m837m869l668k504k438l282l997
61598D09156l926l357k962k980l052k784k292k107k488k978k819j873q70n63q70
61583C73235j148j108j058j257j519j560j298p16J58R35R86J94p45j121r75o52
61567C62351j29O63J184Q65J42J16J055J957J971J426J199J554K055K177J626
61552C80212N54k67o0Q65J290P73M12J136K123J967R46O88J719K744K648J967
61536C99717J773K180K656L044L410L446K840J897J097L60o39j671k182k175k161
61521D13592k294k221j861j696j984k237j859j047o12r63j592j673j040l26j81
61506C92006o06j184j615j768j402m71M20M81k10o60k98L42N80O28J045J680J905
$$ y = [447999, 448519, 447877, 446011, 443640, 441674, 440193, 438226, 434751, 429914, 425045, 421377, 418873, 416435, 413153, 409156, 405230, 401873, 398911, 395931, 392879, 390095, 387803, 385696, 383208, 380230, 377411, 375538, 374668, 374105, 373235, 372087, 370979, 369921, 368664, 367145, 365585, 364287, 363571, 363729, 364664, 365650, 365844, 365099, 363978, 363003, 362351, 362222, 362885, 364069, 364934, 365076, 365192, 366247, 368204, 370175, 371601, 372800, 374354, 376409, 378586, 380212, 380766, 380499, 380439, 381304, 382594, 383367, 383779, 384915, 387038, 389005, 389951, 390639, 392358, 395102, 397750, 399717, 401490, 403670, 406326, 409370, 412780, 416226, 419066, 420963, 422060, 422420, 421781, 420110, 417928, 415753, 413592, 411298, 409077, 407216, 405520, 403536, 401299, 399440, 398393, 397781, 396818, 395226, 393553, 392513, 392187, 392006, 391400, 390216, 388601, 386833, 385431, 384960, 385380, 385861, 385651, 384991, 384693, 385035, 385615, 386243, 387288, 388968, 390873]
61489C90873J653J446J520J608J517J335J063O65M93R96J872K183J518N48J44
61474D09434M49R99J300J004N1j023j346p64j56k88p19n04K52M63k94r87m93Q75
61456D08253J813J708J172Q93P26K97j05P5O45P99L14j62j14J64L32P36J745K861
61438D22152L254L006L035L783M672M964M549L737K787J916J342J073R40R49J232
61423D63391J628J741J577J656K207K730K684K135J411N16n94j499j658j210r14
61408D75801j246j902k290k210j924j714j572j312r19o65p55r44p97l24l9k92
61392D56896q37j252j442j469j174l94N88J202J240J154J557K573L614L899L278
61377D69433K505K482L229L959M173M159M220L991L101K031J653K011K309K075
$$ y = [390873, 392526, 393972, 395492, 397100, 398617, 399952, 401015, 401680, 402173, 403169, 405041, 407224, 408742, 409290, 409434, 409883, 410882, 412182, 413186, 413237, 412214, 410868, 410104, 409948, 409660, 408941, 408437, 408689, 409152, 408858, 407871, 407378, 408253, 410066, 411774, 412946, 413839, 414565, 414862, 414757, 414832, 415477, 416276, 416590, 416428, 416314, 416478, 416810, 417546, 419291, 422152, 425406, 428412, 431447, 435230, 439902, 444866, 449415, 453152, 455939, 457855, 459197, 460270, 461210, 462159, 463391, 465019, 466760, 468337, 469993, 472200, 474930, 477614, 479749, 481160, 481676, 481082, 479583, 477925, 476715, 475801, 474555, 472653, 470363, 468153, 466229, 464515, 462943, 461631, 460712, 460047, 459292, 458348, 457551, 457227, 457188, 456896, 456059, 454807, 453365, 451896, 450722, 450328, 450916, 452118, 453358, 454512, 456069, 458642, 462256, 466155, 469433, 471938, 474420, 477649, 481608, 485781, 489940, 494160, 498151, 501252, 503283, 504936, 506947, 509256, 511331]
61363E11331J712J768K221K711L033L229L481M117N316O633P257P077P009P860
61349E74755R131R571Q668P082N536M070K545J344R34J032Q02j16j231j908k152
61334F20063k419k959l617m154m456m494m296l985l692l422l120k779k348j617
61320E72705m19J068K373L169L537L835M431N479O741P701Q126Q474R482J1374
61306F48076J3731J5984J7709J8414J7655J5510J2553R211N575J999p59k371l439
61293G69848m726o238p555q624r593j0182r971r167q396p779o913n788m934m508
61279F65474l915k688j118L02J543K707L531L740L578L518L656L737L639L479
61265F91183L431L792M973P036R392J1306J2509J3001J2591J1183R277P454N498
$$ y = [511331, 513043, 514811, 517032, 519743, 522776, 526005, 529486, 533603, 538919, 545552, 552809, 559886, 566895, 574755, 583886, 593457, 602125, 609207, 614743, 618813, 621358, 622702, 623636, 624668, 625470, 625354, 624123, 622215, 620063, 617644, 614685, 611068, 606914, 602458, 597964, 593668, 589683, 585991, 582569, 579449, 576670, 574322, 572705, 572286, 573354, 575727, 578896, 582433, 586268, 590699, 596178, 602919, 610620, 618746, 627220, 636702, 648076, 661807, 677791, 695500, 713914, 731569, 747079, 759632, 768843, 774418, 776417, 775658, 773287, 769848, 765122, 758884, 751329, 742705, 733112, 722930, 712959, 703792, 695396, 687617, 680704, 674916, 669982, 665474, 661559, 658871, 657753, 658055, 659598, 662305, 665836, 669576, 673154, 676672, 680328, 684065, 687704, 691183, 694614, 698406, 703379, 710415, 719807, 731113, 743622, 756623, 769214, 780397, 789674, 797128, 802626]
61252H02626K718p53l797n717p046q561j0112j0983j0924j0169q832p019n346
61239G16085m558m549m446l766k933k461k190j656p82J51J018J923K979M145N240
61224G04200N905N865N313M787M567M506M624N334O672P806P939P419P283P740
61210G89960P853O856N147L660K842K685L362N149P693J0023J1525J2643J4256
61197H83654J6490J8572J9919K0911K2112K3081K2600K0146J6460J2515Q626M917
61185A090003J926nj417l022m646n784o865q896j1810j4286j5465j5923j6498
61172I87312j7083j7141j6717j6269j5994j5986j6521j7569j8306j7880j6483
61161H01363j5107j4298j3634j2358j0228p679n389l590j778N82L083M669N104
$$ y = [802626, 805344, 804591, 800794, 795077, 788031, 779470, 769358, 758375, 747451, 737282, 728450, 721431, 716085, 711527, 706978, 702532, 698766, 695833, 693372, 691182, 689526, 688744, 688895, 689913, 691836, 694815, 698960, 704200, 710105, 715970, 721283, 726070, 730637, 735143, 739767, 745101, 751773, 759579, 767518, 774937, 782220, 789960, 797813, 804669, 809816, 813476, 816318, 819003, 822365, 827514, 835207, 845230, 856755, 869398, 883654, 900144, 918716, 938635, 959546, 981658, 1004739, 1027339, 1047485, 1063945, 1076460, 1085086, 1090003, 1091929, 1091924, 1090507, 1087485, 1082839, 1077055, 1070190, 1061294, 1049484, 1035198, 1019733, 1003810, 987312, 970229, 953088, 936371, 920102, 904108, 888122, 871601, 854032, 835726, 817846, 801363, 786256, 771958, 758324, 745966, 735738, 728059, 722670, 719080, 717302, 717884, 720967, 725636, 730740]
61148G30740N410O307O962N985L165n11m099p029q619q435p101n734m482k549
61134G10010J87K660M098N163O916R410J1913J4029J5892J7578J8981K0198K1511
61121H58546K2993K4433K5641K6522K6980K7056K7103K7488K8042K8082K7155
61110A150041K5585K4121K3056K1909K0036J7395J4486J1628Q654N376J923j575
61098A322635n328r500j3666j7022j9091j9966k0026j9663j9147j8439j7265j5577
61086A127945j3758j2112j0445q487o415m492k544k97K000L931N638P511R354
61073A097829J0612J1352J2212J3395J4459J5154J5683J6033J5962J5701J5805
61062A254197J6119J5827J4805J3978J3895J4002J3846J3890J4352J4273J2846
$$ y = [730740, 736150, 742457, 749419, 755404, 758569, 758058, 753959, 746930, 738311, 729876, 722775, 717041, 712559, 710010, 710197, 712857, 716955, 722118, 729034, 738444, 750357, 764386, 780278, 797856, 816837, 837035, 858546, 881539, 905972, 931613, 958135, 985115, 1012171, 1039274, 1066762, 1094804, 1122886, 1150041, 1175626, 1199747, 1222803, 1244712, 1264748, 1282143, 1296629, 1308257, 1316911, 1322287, 1324210, 1322635, 1317307, 1307807, 1294141, 1277119, 1258028, 1238062, 1218036, 1198373, 1179226, 1160787, 1143522, 1127945, 1114187, 1102075, 1091630, 1083143, 1076728, 1072236, 1069692, 1069395, 1071395, 1075326, 1080964, 1088475, 1097829, 1108441, 1119793, 1132005, 1145400, 1159859, 1175013, 1190696, 1206729, 1222691, 1238392, 1254197, 1270316, 1286143, 1300948, 1314926, 1328821, 1342823, 1356669, 1370559, 1384911, 1399184, 1412030]
61051A412030J0907R911R920R861R369R072R127Q818P909P213P325P671P456O859
61037A533448O586O641O284N144L811L096L143L572M330N888Q418J1266J3683
61024A615310J5890J8719K2242K5479K7625K8875K9841L0962L3083L7753M5993
61013A931772N7105O9460Q2168R5327J09103J23556J39559J59155J84968K19528
61003C171701K64864L22140L91895M75275N74789O93528Q34390J000975J197762
60994H927319J426025J676662J924409K125523K219584K141315J849106J361576
60986B3651519P73723K28631j44985k88336k26892m6584J39689K17794R8074k50467
60976B4152166p74374j348391j830986k127366k217290k138349j950429j709493
$$ y = [1412030, 1422937, 1432848, 1442768, 1452629, 1461998, 1471070, 1480197, 1489015, 1496924, 1504137, 1511462, 1519133, 1526589, 1533448, 1540034, 1546675, 1552959, 1558103, 1561914, 1565010, 1568153, 1571725, 1576055, 1581943, 1590361, 1601627, 1615310, 1631200, 1649919, 1672161, 1697640, 1725265, 1754140, 1783981, 1814943, 1848026, 1885779, 1931772, 1988877, 2058337, 2140505, 2235832, 2344935, 2468491, 2608050, 2767205, 2952173, 3171701, 3436565, 3758705, 4150600, 4625875, 5200664, 5894192, 6728582, 7729557, 8927319, 10353344, 12030006, 13954415, 16079938, 18299522, 20440837, 22289943, 23651519, 24425242, 24653873, 24508888, 24220552, 23993660, 23947076, 24086765, 24304559, 24402633, 24152166, 23377792, 22029401, 20198415, 18071049, 15853759, 13715410, 11764981, 10055488]
60968A0055488j457387j220317j010686q31523o81466n57419m55423l71864l04587
60959C164816k52056k11806j80566j55792j36123j20475j07568r6374q6335p7136
60949A740585o8749o1490n5497n0392m6048m3213m2508m3134m3550m3288m2972
60938A199744m2619m1230l8415l5266l2942l1186k8963k5954k2740j9927j7750
60927H62752j6206j5040j3813j2400j1151j0235r217p763o386n765n575m771l045
60914G41385j313m86m20l71r5K7k20m92l58J18M03Jj173k828m582o189p590q771
60896G07046r641j0109j0249j0257j0167r789r075q388q135q155p895p192o458
60883E91536n930n220l978k618j820j601j442j233j425k195l035l353l074k462
$$ y = [10055488, 8598101, 7377784, 6367098, 5535575, 4854109, 4296690, 3841267, 3469403, 3164816, 2912760, 2700954, 2520388, 2364596, 2228473, 2107998, 2000430, 1904056, 1817721, 1740585, 1671836, 1610346, 1554849, 1504457, 1458409, 1415196, 1372688, 1329554, 1286004, 1242716, 1199744, 1157125, 1115895, 1077480, 1042214, 1009272, 978086, 949123, 923169, 900429, 880502, 862752, 846546, 831506, 817693, 805293, 794142, 783907, 774690, 766927, 760541, 754776, 749201, 744430, 741385, 740072, 739586, 739166, 738795, 738700, 738727, 738507, 738015, 737657, 737775, 738178, 738179, 737006, 734178, 729596, 723407, 715817, 707046, 697405, 687296, 677047, 666790, 656623, 646834, 637759, 629371, 621236, 613081, 605186, 597994, 591536, 585606, 580386, 576408, 573790, 571970, 570369, 568927, 567694, 566269, 564074, 561039, 557686, 554612, 552150]
60869E52150j833j548j786j992j171Q80L021M008L979M108M993O015O348N998
60855E83170N599N579N753N598M762L460K393K110K407K568K163J484J082J044
60841F29172Q50j84k302n034p491r093r977j0614j1040j0806r639p892o210m997
60827E34743m366m301m616m876m702m150l588l255l115l114l338l829m397m719
60813D78377m565l953l162k617k565k795k810k365j711j228r90q21o41n06l44
60798D47304Q5Q10J482J709J502J227J185J335J430J282R16N68N23Q80J431J844
60782D65513J962J815J413O84k51r65j063p30o74j365k364k701j971q59l43n21
60766D57580o26j51M52M09l38j059j054k44Q29J374Q75l52j249j055j90L23J66
$$ y = [552150, 550317, 548769, 546983, 544991, 543820, 544700, 547721, 551729, 555708, 559816, 564809, 570824, 577172, 583170, 588769, 594348, 600101, 605699, 610461, 613921, 616314, 618424, 620831, 623399, 625562, 627046, 628128, 629172, 630022, 629838, 627536, 622502, 615011, 605918, 595941, 585327, 574287, 563481, 553842, 545950, 539740, 534743, 530377, 526076, 521460, 516584, 511882, 507732, 504144, 500889, 497774, 494660, 491322, 487493, 483096, 478377, 473812, 469859, 466697, 464080, 461515, 458720, 455910, 453545, 451834, 450606, 449616, 448795, 448154, 447648, 447304, 447389, 448199, 449681, 451390, 452892, 454119, 455304, 456639, 458069, 459351, 460267, 460835, 461358, 462238, 463669, 465513, 467475, 469290, 470703, 471387, 471136, 470171, 469108, 468378, 467704, 466339, 463975, 461274, 459303, 458444, 458101, 457580, 456954, 456803, 457255, 457664, 457326, 456267, 455213, 454969, 455798, 457172, 458047, 457695, 456446, 455391, 455201, 455524, 455690]
60749D55690m7J30M42O00Q46J297J382N23r43k164k807l166l393l385l283l449
60733D38273l838l918l419k635j875j097k79L68P88J255J825J999J345K18n21
60718D28489l77M17J255J670J652J651K056K569K464J659J088J468K180K033R29
60703D51203k4j10J43j1m41n91m86n53p76p74o86j114k066k627k156j180o40o16
60685D36495m85o4K21L55R34K081K876K524J614J423K260L225L501L184K728K299
60669D65171J948J802J718J142j85j690k595k867l152l785m335m240l551k858
60655D42523k502k101r93Q93K827L981M215L937L503L043K690K444J866M27j694
60640D65059l623m648m749m210l275k294j603j087l53M73P44L44K0K38M92K51
$$ y = [455690, 455643, 455773, 456215, 456815, 457661, 458958, 460340, 460863, 459920, 457756, 454949, 451783, 448390, 445005, 441722, 438273, 434435, 430517, 427098, 424463, 422588, 421491, 421212, 421580, 422368, 423623, 425448, 427447, 428792, 429010, 428489, 428112, 428529, 429784, 431454, 433106, 434757, 436813, 439382, 441846, 443505, 444593, 446061, 448241, 450274, 451203, 451179, 451069, 451212, 451201, 450760, 450169, 449683, 449130, 448354, 447580, 446894, 445780, 443714, 441087, 438931, 437751, 437111, 436495, 436010, 435946, 436167, 436522, 437456, 439537, 442413, 444937, 446551, 447974, 450234, 453459, 456960, 460144, 462872, 465171, 467119, 468921, 470639, 471781, 471596, 469906, 467311, 464444, 461292, 457507, 453172, 448932, 445381, 442523, 440021, 437920, 436927, 437820, 440647, 444628, 448843, 452780, 456283, 459326, 462016, 464460, 466326, 466753, 465059, 461436, 456788, 452039, 447829, 444554, 442260, 440657, 439570, 439217, 439690, 440434, 440778, 440798, 441036, 441528, 441779]
60624D41779j23j1M36P65J026J378J411Q00J69K86P69P17K46K42P31Q12K20l15
60606D51338m18m97o24k78L48J84r45j650q84N76J401J468J362J070M00M4Q90
60589D53785K621M001M430M253L929L679L706L797L090J154r02j494n59N12Q24
60574D86826P92R70J302J772K702L952M716M723M853N994P895R630J0772J1516
60560E58415J2034J2282J2214J1858J1211J0217Q668O179K672j127m184o117p244
60547F27078p615o864n143l377k101q12J002K880M175N251O993R474J1960J4165
60533F57066J6604J9630K2817K5535K7587K8981K9459K8538K5911K1604J5915
60522I19647R275K273m264r363j2504j4167j5393j6567j7004j6061j4161j2218
$$ y = [441779, 441656, 441645, 442081, 442846, 443872, 445250, 446661, 447461, 447630, 447916, 448685, 449402, 449648, 449890, 450621, 451433, 451653, 451338, 450920, 450423, 449799, 449521, 449869, 450053, 449108, 447458, 446574, 447150, 448551, 450019, 451381, 452451, 452851, 452895, 453785, 456406, 460407, 464837, 469090, 473019, 476698, 480404, 484201, 487291, 488445, 487543, 486049, 485490, 486002, 486826, 487618, 488588, 489890, 491662, 494364, 498316, 503032, 507755, 512608, 518602, 526497, 536127, 546899, 558415, 570449, 582731, 594945, 606803, 618014, 628231, 636899, 643078, 645750, 644623, 640439, 634322, 627078, 619463, 612599, 607456, 604079, 601978, 601166, 602168, 605048, 609223, 614474, 621467, 630941, 642901, 657066, 673670, 693300, 716117, 741652, 769239, 798220, 827679, 856217, 882128, 903732, 919647, 928922, 931195, 926931, 917568, 905064, 890897, 875504, 858937, 841933, 825872, 811711, 799493]
60510G99493j0451q471o290m388k805j010J121L039M512O245Q933J2314J5725
60497H17967J9264K3656K9186L5351M1479M7157N2034N5750N8201N9481N9365
60486A298891N7281N3035M7201M0547L3307K5318J6565P266k477j2690k3201l3561
60474A507482m3369n2352o0085o5922o9312p0071o8314o4440n9246n3780m8721
60463H51870m4005l9189l4007k8522k3060j8338j5306j4336j4519j4315j3009
60452E93264j1193r674q455p070n528m330l680l215k587j947j645j781k267l077
60438E26815m070m682m252k853j454r82j352j729j574j066m91K30J147J851J864
60423E07402J316Q00O47O49N52M05L97N90R26J257J369J215J115J433J998K215
$$ y = [799493, 789042, 780571, 774281, 769893, 767088, 766078, 767199, 770238, 774750, 780995, 789928, 802242, 817967, 837231, 860887, 890073, 925424, 966903, 1014060, 1066094, 1121844, 1180045, 1239526, 1298891, 1356172, 1409207, 1456408, 1496955, 1530262, 1555580, 1572145, 1579411, 1576934, 1564244, 1541043, 1507482, 1464113, 1411761, 1351676, 1285754, 1216442, 1146371, 1078057, 1013617, 954371, 900591, 851870, 807865, 768676, 734669, 706147, 683087, 664749, 649443, 635107, 620588, 606273, 593264, 582071, 572397, 563942, 556872, 551344, 547014, 543334, 540119, 537532, 535585, 533940, 532159, 529892, 526815, 522745, 518063, 513811, 510958, 509504, 508522, 507170, 505441, 503867, 502801, 502310, 502540, 503687, 505538, 507402, 508718, 509518, 510165, 510814, 511366, 511771, 512168, 512758, 513684, 514941, 516310, 517525, 518640, 520073, 522071, 524286]
60407E24286J822J193P55M59O9l40m63j56M89J353K263K949L214L090K737K327
60391E46047K104K230K443K230J683J680K803M343N049M612L801L209K740K348
60377E87322K428L073L627L590L410L683L991L360J738K53j01N59J520K291K609
60362F23353K227J285N81Q51J859K676K929L231M237N674O712P122P645R095J1273
60347F90750J2902J2761J0812Q120N694L540J092j684m059n498o397p495q777
60334G11761r448r034q131p825q491r364r270p803n731m251l891m138m109l415
60320F16860k379j595j376j425r87M27K361L757M294M951O821R641J2140J3666
60306F67156J4682J5521J5590J4325J2333J0812J0151R822R451R215Q977P863
$$ y = [524286, 526108, 527301, 528056, 528515, 528584, 528244, 527781, 527625, 528114, 529467, 531730, 534679, 537893, 540983, 543720, 546047, 548151, 550381, 552824, 555054, 556737, 558417, 561220, 565563, 570612, 575224, 579025, 582234, 584974, 587322, 589750, 592823, 596450, 600040, 603450, 607133, 611124, 614484, 616222, 616475, 616374, 616933, 618453, 620744, 623353, 625580, 626865, 627446, 628297, 630156, 632832, 635761, 638992, 643229, 648903, 655615, 662737, 670382, 679477, 690750, 703652, 716413, 727225, 735345, 741039, 744579, 745671, 743987, 739928, 734430, 728033, 720538, 711761, 702313, 693279, 685148, 677323, 668832, 659468, 650198, 642395, 636664, 632413, 628522, 624384, 620275, 616860, 614481, 612886, 611510, 610085, 609098, 609525, 611886, 615643, 619937, 624888, 631709, 641350, 653490, 667156, 681838, 697359, 712949, 727274, 739607, 750419, 760570, 770392, 779843, 789058, 798035, 805898]
60294H05898N177J452k052m830p616j1174j5035j7807j8652j8041j6930j5722
60282F84668j4312j2821j1618j0688r534p953o466n676n469n226m617l871l363
60269E83054l167l015k529j597o17j78l23l86J41Q49R57M68K26P68J628K040J893
60252E80212J675J722J909J993J863J444O55m34j576k516l118l334l185k804k342
60237E72164j749q86R9P58R23J073J728K612K917K451J983K271L168M094M899
60222E98505N730O344O290N727N391N680O274O815P367P963Q243P986P575P476
60208F93366P608P643P625P768P846P367O345N342M648L929K852J702R91O92J70
60193G65894j096k957m785o081o782p075p081o832o381n767m920l853k893k443
$$ y = [805898, 811075, 812527, 810475, 805645, 798029, 786855, 771820, 754013, 735361, 717320, 700390, 684668, 670356, 657535, 645917, 635229, 625695, 617742, 611276, 605600, 600131, 594905, 590288, 586417, 583054, 579887, 576872, 574343, 572746, 572129, 571951, 571628, 571242, 571383, 572232, 573189, 573657, 573883, 574651, 576279, 578319, 580212, 581887, 583609, 585518, 587511, 589374, 590818, 591473, 591039, 589463, 586947, 583829, 580495, 577310, 574506, 572164, 570415, 569529, 569628, 570386, 571309, 572382, 574110, 576722, 579639, 582090, 584073, 586344, 589512, 593606, 598505, 604235, 610579, 616869, 622596, 627987, 633667, 639941, 646756, 654123, 662086, 670329, 678315, 685890, 693366, 700974, 708617, 716242, 724010, 731856, 739223, 745568, 750910, 755558, 759487, 762339, 764041, 765032, 765724, 765894, 764798, 761841, 757056, 750975, 744193, 737118, 730037, 723205, 716824, 711057, 706137, 702284, 699391, 696948]
60179F96948k473k509k272k007k038k222k093j426m24N38J147J339J318J312J188
60164F86326N81m24j088q08O2N81K80m32q73p47j81N87J382K088K579K760K666
60147F95339K469K209J701J046R97K222M097N032M409L459L633M730N440N306
60133G42089N137N610O451P120P402P117N932L935J842L38m86q55r33r12r85j035
60117G87767p38j65J83P9j69l53p08j349j886k020k042k378k990l622m218m693
60101G60698m691m121l538l414l352k634j362l30J63O36J486K432L095L561L966
60086G52595M026L432K481J878J932K239K145J288l47k524m795o575p489p733
60072G42553p942q642r810j1006j1695j1441j0074q000o192n378n229m734l505
$$ y = [696948, 694475, 691966, 689694, 687687, 685649, 683427, 681334, 679908, 679484, 680022, 681169, 682508, 683826, 685138, 686326, 686907, 686483, 685395, 684587, 684649, 685230, 685510, 685078, 684205, 683458, 683277, 683864, 685246, 687334, 689913, 692673, 695339, 697808, 700017, 701718, 702764, 703761, 705983, 710080, 715112, 719521, 722980, 726613, 731343, 736783, 742089, 747226, 752836, 759287, 766407, 773809, 780926, 786858, 790793, 792635, 792973, 792487, 791632, 790699, 789787, 788802, 787767, 787029, 786864, 787047, 787126, 786957, 786604, 785896, 784547, 782661, 780641, 778599, 776221, 773231, 769609, 765391, 760698, 756007, 751886, 748348, 744934, 741582, 738948, 737586, 737256, 737419, 738055, 739541, 741973, 745068, 748629, 752595, 756621, 760053, 762534, 764412, 766344, 768583, 770728, 772016, 771669, 769145, 764350, 757775, 750286, 742553, 734611, 725969, 716159, 705153, 693458, 682017, 671943, 663943, 657751, 652373, 647144, 642410, 638905]
60059F38905k264j829k035k065j559r29o42n82k20Q02K276L497L832L392L053
60044F43632L599M875N960O064N075L418J690K91q33k062l470m529m757m480m453
60029F50020m820m984m599m098m068m563n371o445p679q603q803q421p880p306
60015E62380o639o037n629n094m076k915k301k174j695n71M18N77L59O48J497
60000E28748K201K398K401K511K647K602K271J642J020J029J897K946L330L116
59986E60759K945K791K063Q51nl03q63k071l106l259k989k944k798k099j375j239
59970E46358j102r7J226J563R68Q42J805L007L744M337N071N491N356N116M939
59955E88624M280L001J866J208K17j680l657m633m706m523m022k978k084k233
$$ y = [638905, 636641, 634812, 632777, 630712, 629153, 628224, 627582, 627000, 626780, 627582, 629858, 633355, 637187, 640579, 643632, 647231, 652106, 658066, 664130, 669205, 672623, 674313, 674604, 673771, 671709, 668239, 663710, 658953, 654473, 650020, 645200, 640216, 635617, 631519, 627451, 622888, 617517, 611072, 603393, 594790, 585987, 577566, 569686, 562380, 555741, 549704, 544075, 538981, 534905, 531990, 529689, 527515, 525820, 525249, 525667, 526244, 526603, 527251, 528748, 530949, 533347, 535748, 538259, 540906, 543508, 545779, 547421, 548441, 549470, 551367, 554313, 557643, 560759, 563704, 566495, 568558, 569409, 569404, 569101, 568238, 566167, 563061, 559802, 556813, 553869, 551071, 548972, 547597, 546358, 545256, 545159, 546385, 547948, 548916, 549758, 551563, 554570, 558314, 562651, 567722, 573213, 578569, 583685, 588624, 592904, 595905, 597771, 598979, 599196, 597516, 593859, 589226, 584520, 579997, 575975, 572997, 570913, 568680]
59941E68680l144l789l961m205m441l876k281m02J005J683J583J051J168K763
59927E51834N047O301O124N776O065O174N199L597K295J295K26n03k26P15J339
59912F01258J487J944L074M215M588M192L579L262L374L556L116J745J58n09o7
59897F38972M78K59l20k63O29J650K309K897L790M711N125N090N234N922O861
59882F83344P668Q339Q943R177Q695P732O947O646O537O295N921N360M253K453
59868G78310N59n65p90q58j500k706m021n177o144o739o619n759m722m192m348
59853G24729m782m963m585l621k256p91N87K018L724N607P259Q435R218R603R260
59838G59442P987O096M157K558J606J704K972M840O374P061O825N525K930o37
$$ y = [568680, 565536, 561747, 557786, 553581, 549140, 545264, 542983, 542581, 543586, 545269, 546852, 547903, 549071, 551834, 556881, 563182, 569306, 575082, 581147, 587321, 592520, 596117, 598412, 599707, 599933, 599430, 599204, 599919, 601258, 602745, 604689, 607763, 611978, 616566, 620758, 624337, 627599, 630973, 634529, 637645, 639390, 639548, 639039, 638972, 639450, 639709, 639389, 639126, 639755, 641405, 643714, 646611, 650401, 655112, 660237, 665327, 670561, 676483, 683344, 691012, 699351, 708294, 717471, 726166, 733898, 740845, 747491, 754028, 760323, 766244, 771604, 775857, 778310, 778869, 778304, 777514, 776656, 775156, 772450, 768429, 763252, 757108, 750369, 743750, 737991, 733269, 729077, 724729, 719947, 714984, 710399, 706778, 704522, 703731, 704318, 706336, 710060, 715667, 722926, 731361, 740579, 750182, 759442, 767429, 773525, 777682, 780240, 781846, 783550, 786522, 791362, 797736, 804797, 811622, 817147, 820077, 819440]
59824H19440m174o764q198q777q842q698q593q548q354q023p941q363q896q797
59810G06472p771o278n102m729n042n426n253m428l492l043l106l234l113k940
59796F43515l041l359l486l252l008l154l506l488k894k103j404o29K31N98J07
59781F11127n62m15M26R02O40N47J425K876M049M746N135N082M553M256M866N854
59765F55507O022N201M510M773N607O251O569O704O545O056N667N720N932N927
59751G36991N973O529P353P748P560P249O994O501N805N488N742N803M827K877
59737H23440P63q20j554j362n62J01J07k34l28j48K0M17J509K857L215K156P74
59720H30351K63M41L37k83q45j055j223j500j641j632j834k277k379j711o39J95
$$ y = [819440, 815266, 808502, 800304, 791527, 782685, 773987, 765394, 756846, 748492, 740469, 732528, 724165, 715269, 706472, 698701, 692423, 687321, 682592, 677550, 672124, 666871, 662443, 658951, 655908, 652802, 649568, 646455, 643515, 640474, 637115, 633629, 630377, 627369, 624215, 620709, 617221, 614327, 612224, 610820, 610191, 610422, 611020, 611127, 610565, 610150, 610576, 611478, 612118, 612665, 614090, 616966, 621015, 625761, 630896, 635978, 640531, 644787, 649653, 655507, 661529, 666730, 671240, 676013, 681620, 687871, 694440, 701144, 707689, 713745, 719412, 725132, 731064, 736991, 742964, 749493, 756846, 764594, 772154, 779403, 786397, 792898, 798703, 804191, 809933, 815736, 820563, 823440, 824203, 823383, 821829, 820467, 819905, 820006, 820113, 819879, 819551, 819403, 819423, 819840, 821349, 824206, 827421, 829577, 830351, 830614, 831055, 831392, 831109, 830264, 829209, 827986, 826486, 824845, 823213, 821379, 819102, 816723, 815012, 814373, 814568]
59704H14568O62R89J117P29p0o03l99J61K64k67o90l05M82N75l86j541j990j933
59686H11363k119k633k980l085l388l936m225m199m576n744p095p927q381q809
59672G42266q854p933o393n224m761m461l949l439l049k470j612q89n19j29N86
59657F89170J327J774K150K656K902K494J894J836K111J742M03j196k493l784
59643G02986n336o559o767o272n988o108n907m810l094j433l08J13m4l33m31p60
59627F48949k079m219n846n916m946m188l983l673k963k402k375k468k221j918
59613E99752j984k108j587l90P96J528K013K513K876K907K734K495K034J239M36
59598F15254L1JJ26N86J753L388M536M511L548K330J244L89o3p0rk88p46q42m80
$$ y = [814568, 815230, 816219, 817336, 818065, 817995, 817392, 816993, 817154, 817418, 817151, 816461, 816156, 816638, 817213, 816827, 815286, 813296, 811363, 809244, 806611, 803631, 800546, 797158, 793222, 788997, 784798, 780222, 774478, 767383, 759456, 751075, 742266, 733412, 725479, 719086, 713862, 709101, 704640, 700691, 697252, 694203, 691733, 690121, 689232, 688713, 688584, 689170, 690497, 692271, 694421, 697077, 699979, 702473, 704367, 706203, 708314, 710056, 710459, 709263, 706770, 702986, 697650, 691091, 684324, 678052, 672064, 665956, 660049, 655239, 652145, 650712, 650404, 650517, 650473, 650140, 649709, 648949, 646870, 642651, 636805, 630889, 625943, 621755, 617772, 614099, 611136, 608734, 606359, 603891, 601670, 599752, 597768, 595660, 594073, 593683, 594479, 596007, 598020, 600533, 603409, 606316, 609050, 611545, 613579, 614818, 615254, 615285, 615286, 615412, 615998, 617751, 621139, 625675, 630186, 633734, 636064, 637308, 637697, 637634, 637564, 637555, 637267, 636521, 635679, 635199]
59579F35199j58k86p85j465k237k822k682j673m96l8l98r13j032q46o59m59l2
59562F18218N59R16Q00M80L69M25K21l48q05p74n82o99q85m57O57J743K280K510
59544F24628K892L568M572O018P788R554J1422J4040J7589K1107K3189K2968K0130
59531G89465J4700P583P65l922o149o686o067m474k617j630j918k876l898m990
59517G67286o197p254q083r047j0236j1027j0765r634q443p756p475p101o230
59504F58038m913l609k707k122j594j232j386k010k568k602k022r24M26J426J508
59489F33709Q08N3k95l60k15M02J573K834L693M104M267M356M610N270O189O845
59473F77843P006O997P144P319P233O774N914M625L156J937J066L03k65p2J111
$$ y = [635199, 635041, 634755, 633970, 632505, 630268, 627446, 624764, 623091, 622595, 622557, 622159, 621246, 620214, 619368, 618709, 618250, 618218, 618777, 619693, 620493, 620973, 621342, 621767, 621988, 621640, 620835, 620061, 619479, 618780, 617895, 617438, 618095, 619838, 622118, 624628, 627520, 631088, 635660, 641678, 649466, 659020, 670442, 684482, 702071, 723178, 746367, 769335, 789465, 804165, 811748, 812513, 808591, 802442, 795756, 789689, 785215, 782598, 780968, 779050, 776174, 772276, 767286, 761089, 753835, 745752, 736705, 726469, 715442, 704677, 695043, 686600, 678844, 671369, 664268, 658038, 653125, 649516, 646809, 644687, 643093, 641861, 640475, 638465, 635897, 633295, 631273, 630349, 630775, 632201, 633709, 634517, 634570, 634275, 633915, 633700, 634102, 635675, 638509, 642202, 646306, 650573, 654929, 659539, 664809, 670998, 677843, 684849, 691846, 698990, 706309, 713542, 720316, 726230, 730855, 734011, 735948, 737014, 737317, 737052, 736980, 738091]
59458G38091K777M384N952P564Q793R189Q946Q560Q099P303O191N029L859K487
59444H27224R07o80k165l575m834n792o387o691o750o475n628l988j763L23J664
59429G75390K352K766K889K738L213N352Q709J1622J3433J5169J7469J9191J9154
59416H99447J8126J7812J8643J9910K1461K3565K5345K4884K1071J4247N161n229
59404A104443j4802k0742k1770j9074j4499q790k244L901P764Q101M673k113j1042
59391A013806j9861k6142k8731k8180k5822k2696j9258j5745j2538j0023q113
59380G96697o187l843j581k83o3j40P5L58L08P7J45O95J576K643L822M984O033
59363H05316O958P714Q217Q611R267J0336J1557J2652J3733J5083J6678J8092
$$ y = [738091, 740868, 745252, 751204, 758768, 767561, 776750, 785696, 794256, 802355, 809658, 815849, 820878, 824737, 827224, 828131, 827451, 825286, 821711, 816877, 811085, 804698, 798007, 791257, 784782, 779154, 775166, 773403, 773726, 775390, 777742, 780508, 783397, 786135, 789348, 794700, 803409, 815031, 828464, 843633, 861102, 880293, 899447, 917573, 935385, 954028, 973938, 995399, 1018964, 1044309, 1069193, 1090264, 1104511, 1109672, 1104443, 1089641, 1068899, 1047129, 1028055, 1013556, 1004766, 1002522, 1006423, 1014187, 1022288, 1026961, 1024848, 1013806, 993945, 967803, 939072, 910892, 885070, 862374, 843116, 827371, 814833, 804810, 796697, 790510, 786667, 785086, 784803, 784740, 784600, 784675, 785033, 785341, 785418, 785563, 786258, 787834, 790477, 794299, 799283, 805316, 812274, 819988, 828205, 836816, 846083, 856419, 867976, 880628, 894361, 909444, 926122, 944214]
59351I44214J8835J8734J8098J7481J7144J6711J5600J3722J1429Q837N625J691
59339A108121k396n952q932j1774j4666j7278j9285k0769k1993k2799k2609k1168
59327I18500j9159j7729j7247j6955j6013j4552j3236j2203j1049r757q802q250
59315G53548p474o082m555l570l193l186l620m496n024m128j794O61J990K259
59301G11336K477L310M661O289Q270J0663J3136J5199J6560J6892J5593J2232
59289H36618P233J654l623q061j0945j1514r902p278m572j619J972N665Q420J0018
59275H14066J1168J2439J3706J4645J5211J5526J5747J5974J5979J5145J3121
59264I72727J0407P792N335K528o86l637n780p225q285r039r457r548r251q508
$$ y = [944214, 963049, 981783, 999881, 1017362, 1034506, 1051217, 1066817, 1080539, 1091968, 1100805, 1106430, 1108121, 1105725, 1099773, 1090841, 1079067, 1064401, 1047123, 1027838, 1007069, 985076, 962277, 939668, 918500, 899341, 881612, 864365, 847410, 831397, 816845, 803609, 791406, 780357, 770600, 761798, 753548, 746074, 739992, 735437, 731867, 728674, 725488, 721868, 717372, 712348, 708220, 706426, 707087, 709077, 711336, 713813, 717123, 721784, 728073, 736343, 747006, 760142, 775341, 791901, 808793, 824386, 836618, 843851, 845505, 841882, 833821, 822876, 811362, 801460, 794182, 789610, 787991, 789963, 795628, 804048, 814066, 825234, 837673, 851379, 866024, 881235, 896761, 912508, 928482, 944461, 959606, 972727, 983134, 990926, 996261, 998789, 998103, 994466, 988686, 981461, 973176, 964137, 954680, 945132, 935881, 927373]
59250I27373p503o482n473m467l758l542l393k681j441k01Q96K056L024L164K417
59235H99989J345J24j636l894n950p510r077j0814j1966j2045j1767j2031j2577
59222H02191j2433j1296r740q422p626p295o957n961m281k758k001j543p02K20
59208G21396L98j33m83k02K34L03J11KJ52O28J368J881J496K54q52q75k4N84J86
59189G26424r22j865k141j828j138j24R94J651J431O28l9j38L44J326K596L623
59173G30822M008M114M644N589O257O413O541O769O393M914K902J198j74j727
59159G88663l564n328o738p705q171q308q589r250r949j0223r931r000p330n335
59145F79242l977l682l813l695l615m052m602m502l865l354k993k230j026ON45
$$ y = [927373, 919870, 913388, 907915, 903448, 899690, 896148, 892755, 890074, 888633, 888432, 889328, 891384, 894408, 897572, 899989, 901334, 901458, 899822, 895928, 889978, 882468, 873391, 862577, 850611, 838566, 826799, 814768, 802191, 789758, 778462, 768722, 760300, 752674, 745379, 738422, 732461, 728180, 725422, 723421, 721878, 721176, 721396, 721794, 721661, 721178, 720976, 721210, 721513, 721624, 721626, 721778, 722406, 723774, 725655, 727151, 727405, 726553, 725678, 725654, 726238, 726424, 725502, 723637, 721496, 719668, 718530, 718406, 719400, 721051, 722482, 723110, 723071, 722933, 723277, 724603, 727199, 730822, 734830, 738944, 743588, 749177, 755434, 761847, 768388, 775157, 781550, 786464, 789366, 790564, 790390, 788663, 785099, 779771, 773033, 765328, 757157, 748849, 740260, 731010, 721061, 710838, 700907, 691907, 684577, 679242, 675265, 671583, 667770, 664075, 660460, 656408, 651806, 647304, 643439, 640085, 637092, 634862, 633836, 633842, 634387]
59130F34387Q25J063J335J969L207M541N209N302N566O176O697P298Q808J1267
59116G03650J3391J4188J4231J4682J5715J6549J6605J5874J4528J2773J0976
59105H63162R360P715N781L752K040O87n96j982l467n069o686p867q116p494o499
59090H44721n381l969k354j235j247k119k970l338l566m132n090o317p835r410
59076G85758j0238r652q016o414n453m917m535m398m452m340m014l898m093m046
59062G07292l513l175l664m471m551l694k536j531o83j53l01j037j731j919j642
59047F72691j164p19m79l69m9N12P28J57o28o25K77J227J563J446J385J797K968
59030F80718M801O602P724Q450R593J1298J2980J4340J5534J6304J5871J4046
$$ y = [634387, 635212, 636275, 637610, 639579, 642786, 647327, 652536, 657838, 663404, 669580, 676277, 683575, 692383, 703650, 717041, 731229, 745460, 760142, 775857, 792406, 809011, 824885, 839413, 852186, 863162, 872522, 880237, 886018, 889770, 891810, 892497, 891901, 889919, 886452, 881383, 874697, 866830, 858714, 851220, 844721, 839340, 835371, 833017, 831782, 830535, 828416, 825446, 822108, 818542, 814410, 809320, 803003, 795168, 785758, 775520, 765868, 757852, 751438, 745985, 741068, 736533, 732135, 727683, 723343, 719329, 715431, 711338, 707292, 703779, 700604, 696940, 692469, 687918, 684224, 681688, 680157, 679474, 679321, 679020, 677983, 676252, 674333, 672691, 671527, 670808, 670329, 669960, 669911, 670423, 671151, 671308, 670680, 670055, 670332, 671559, 673122, 674568, 675953, 677750, 680718, 685519, 692121, 699845, 708295, 717888, 729186, 742166, 756506, 772040, 788344, 804215, 818261]
59018H18261J1545Q854N612J630k324n257o911p471p000n719m305l235k288j217
59004H00175l55J22R10K701M903O190O221N903N932N965N495M694L938L095J875
58989H57764N35m13j076k139l804n237n378m086k180m95P24J607K353L301M830
58974H46306O887Q899J0453J1750J3031J4024J4415J4574J5099J5819J6043J5682
58962A002982J5264J4782J3440J0871P774M849J778k033o302j0187j3431j6380
58950A023407j8968k0434k0297j9173j8258j8182j8433j7882j5846j2677r381
58939H33876o702m687l078j804j005p23p19n59J6P00P11l22j810k825l228l592
58923H04249m144m479m402m292m321m069l381k885l009l101k354j106l10M6R37
$$ y = [818261, 829806, 838660, 844272, 845902, 843578, 838321, 831410, 823939, 816939, 811220, 806915, 803680, 801392, 800175, 799820, 799942, 800852, 803553, 808456, 814646, 820867, 826770, 832702, 838667, 844162, 848856, 852794, 855889, 857764, 858299, 857886, 856810, 854671, 850867, 845630, 840252, 836166, 833986, 833491, 834215, 835822, 838175, 841476, 846306, 853193, 862092, 872545, 884295, 897326, 911350, 925765, 940339, 955438, 971257, 987300, 1002982, 1018246, 1033028, 1046468, 1057339, 1065113, 1069962, 1071740, 1069707, 1063405, 1053218, 1039787, 1023407, 1004439, 984005, 963708, 944535, 926277, 908095, 889662, 871780, 855934, 843257, 833876, 827174, 822487, 819409, 817605, 816600, 815877, 815158, 814599, 814615, 815315, 816026, 815704, 813894, 811069, 807841, 804249, 800105, 795626, 791224, 786932, 782611, 778542, 775161, 772276, 769267, 766166, 763812, 762706, 762396, 762442, 763379]
58908G63379K740M695O170P542R350J1345J3013J4545J6417J8341J9441J9561
58896I06539J9651K0538K1875K2692K2659K2299K2193K2456K2984K3623K3944
58885A151453K3250K1143J7895J4088J0063N864J450l203p965j2334j5698j7960
58873A188046j9594k0800k1023j9773j7521j5225j3243j1351r555q179p219o445
58861A018118o118o846q485r967j0557j0625j0822j1066j0854j0105r215q532
58849I04926q244q483r226j0247j1416j2793j4146j4764j4156j2755j1530j0941
58837G66225j0637j0025q902p501o150m922l631k217r93l00J9M61J188J901K409
58822G16925K888L459L973M347M679M866M545L650K596J697Q16m5m05QO27O07
$$ y = [763379, 766119, 770814, 776984, 784526, 793876, 805221, 818234, 832779, 849196, 867537, 886978, 906539, 926190, 946728, 968603, 991295, 1013954, 1036253, 1058446, 1080902, 1103886, 1127509, 1151453, 1174703, 1195846, 1213741, 1227829, 1237892, 1243756, 1245206, 1242003, 1234038, 1221704, 1206006, 1188046, 1168452, 1147652, 1126629, 1106856, 1089335, 1074110, 1060867, 1049516, 1039961, 1031782, 1024563, 1018118, 1012000, 1005154, 996669, 986702, 976145, 965520, 954698, 943632, 932778, 922673, 913458, 904926, 896682, 888199, 878973, 868726, 857310, 844517, 830371, 815607, 801451, 788696, 777166, 766225, 755588, 745563, 736661, 729160, 723010, 718088, 714457, 712240, 711247, 710947, 710966, 711427, 712615, 714516, 716925, 719813, 723272, 727245, 731592, 736271, 741137, 745682, 749332, 751928, 753625, 754441, 754396, 753991, 753999, 754626, 755233]
58806G55233j55j042j520j540j348j324j861l019m381n453o077o239n897n311
58792G10066n130n588n879m955k901r00J53M93R14J788K894L815M289M315M125
58777G07499L919L601K984K226J770J670J249k46k677m969o184o392o293o173
58763F91984n623m347k740j379l40N86J272J406J083P58O04M75M48Q46J579K088
58747F88700K085J905J928K166K706L943N975Q077R283R354Q968R076J0167J1852
58733G76185J3116J3248J2585J2035J1833J1320R981Q130O336M794L532K708K360
58720H88163K336K770M077O070P693Q089P503O628N583M072K125J6k238m750p340
58705I30797r786j2208j4757j7184j9232k1126k3029k4313k4101k2439k0344j8656
$$ y = [755233, 755078, 754036, 752516, 750976, 749628, 748304, 746443, 743424, 739043, 733590, 727513, 721274, 715377, 710066, 704936, 699348, 693469, 688514, 685613, 684713, 684866, 685359, 686273, 688061, 690955, 694770, 699059, 703374, 707499, 711418, 715019, 718003, 720229, 721999, 723669, 724918, 724672, 721995, 717026, 710842, 704450, 698157, 691984, 686361, 682014, 679274, 677895, 677555, 678141, 679413, 680819, 681902, 682660, 683264, 683739, 684187, 685033, 686612, 688700, 690785, 692690, 694618, 696784, 699490, 703433, 709408, 717485, 726768, 736122, 745090, 754166, 764333, 776185, 789301, 802549, 815134, 827169, 839002, 850322, 860303, 868433, 874769, 879563, 883095, 885803, 888163, 890499, 893269, 897346, 903416, 911109, 919198, 926701, 933329, 938912, 942984, 945109, 945125, 942887, 938137, 930797, 921011, 908803, 894046, 876862, 857630, 836504, 813475, 789162, 765061, 742622, 722278, 703622]
58693G03622j7392j6177j4739j2912j0653q272o331n157m670m655m941n233n055
58680E87435m053k381o71M95J149J841K811L562L654L650M587O617Q916J0960
58666F28572J3001J5091J6550J6867J6268J4884J2176P918L037j273m796p840
58654G30455j0240j1624j2264j2637j2517j1416r675q176o996n387l122j007J82
58641F25576O50J126J981K970L573L442K684J726Q50N2o36j126j669k668l801
58626F34730m024k997j730j239j178o11N08J606K636L948N336O304P021P888Q398
58611F66596P540N398L177J602L38q48j500j402j133j176j282j240j515k551l867
58596F68137m500m090l067j990r67L01K122M441O842R006J1046J3235J5500J7329
$$ y = [703622, 686230, 670053, 655314, 642402, 631749, 623477, 617146, 611989, 607319, 602664, 597723, 592490, 587435, 583382, 581001, 580330, 580825, 581974, 583815, 586626, 590188, 593842, 597492, 602079, 608696, 617612, 628572, 641573, 656664, 673214, 690081, 706349, 721233, 733409, 741327, 744364, 743091, 738295, 730455, 720215, 708591, 696327, 683690, 671173, 659757, 650082, 641906, 634910, 629523, 626401, 625394, 625576, 626226, 627352, 629333, 632303, 635876, 639318, 642002, 643728, 644578, 644630, 643994, 642868, 641199, 638531, 634730, 630706, 627709, 625979, 624740, 623562, 622951, 623459, 625065, 627701, 631649, 636985, 643289, 650310, 658198, 666596, 674136, 679534, 682711, 684313, 684651, 683803, 682303, 680901, 679768, 678592, 677310, 676070, 674555, 672004, 668137, 663637, 659547, 656480, 654490, 653523, 653824, 655946, 660387, 667229, 676235, 687281, 700516, 716016, 733345]
58582G33345J8058J7218J5017J2556J1040J0461R679Q118O681O399O984P656Q767
58569H71979J1393J5592K0145K3991K6973K9240L0862L2060L2909L2658L0183
58558A157985K5331J9193J2948O907Q40n251j0667j4143j4775j3236j1519j0936
58546A142677j0928j0570j0357j1434j3624j5719j7328j9083k1018k2249k2366
58535I68001k1888k1158j9932j8203j6339j4233j1500q652o899o453o120m983
58523H11641l433k274j723j688k047k310j936j168q35j112j440j709k347l201
58509G84418l539l375l536m103m078l035j804j059m80R2j6j079k203k528k227
58494G51448j633n15J141K628L555M365N310N958O432P797J0370J2887J4328J5382
$$ y = [733345, 751403, 768621, 783638, 796194, 807234, 817695, 827374, 835492, 842173, 848572, 855556, 863212, 871979, 883372, 898964, 919109, 943100, 970073, 999313, 1030175, 1062235, 1095144, 1127802, 1157985, 1183316, 1202509, 1215457, 1222364, 1223204, 1217953, 1207286, 1193143, 1178368, 1165132, 1153613, 1142677, 1131749, 1121179, 1110822, 1099388, 1085764, 1070045, 1052717, 1033634, 1012616, 990367, 968001, 946113, 924955, 905023, 886820, 870481, 856248, 844748, 836096, 829197, 822744, 816624, 811641, 808208, 805934, 804211, 802523, 800476, 798166, 796230, 795062, 794227, 793115, 791675, 789966, 787619, 784418, 780879, 777504, 773968, 769865, 765787, 762752, 760948, 759889, 759409, 759501, 759485, 758406, 756203, 753675, 751448, 749815, 749300, 750441, 753069, 756624, 760989, 766299, 772257, 778689, 786486, 796856, 809743, 824071, 839453]
58480H39453J6915J8249J8269J7229J5928J3929J0239N211K18m196q371j1953
58468I31120j3896j4078j3562j2915j1546r019o015l369r65J806M977P983J0445
58455H70966J2447J4036J4749J3950J1522Q100M404N99l460p503j0759j2547j2639
58442I03865j1297r299p658o694n662l867j758j20J244K884M203M079L001K889
58428H75810M498O492P591Q165Q938R531R184P830N610K414j276m140n569o533
58414I28545q074r812j0815j0956j0490r296p613o659p226q264q019o132l668
58401H21521j623k92L35O18J317K755M200M738M393L787L174K505J966J763J666
58386H52823J363R56P23P98J344K471L762M598N111O041P506Q913J0205J1919
$$ y = [839453, 856368, 874617, 892886, 910115, 926043, 939972, 950211, 955422, 955640, 951444, 943073, 931120, 917224, 903146, 889584, 876669, 865123, 856104, 850089, 846720, 845755, 847561, 852538, 860521, 870966, 883413, 897449, 912198, 926148, 937670, 945770, 950174, 950773, 947313, 939810, 929051, 916504, 903865, 892568, 883269, 875611, 868917, 863255, 859388, 857630, 857510, 858754, 861638, 865841, 869920, 872921, 875810, 880308, 886800, 894391, 902556, 911494, 921025, 930209, 938039, 943649, 946063, 944787, 940647, 935078, 928545, 920471, 910659, 899844, 888888, 878398, 869102, 861489, 854830, 847604, 839340, 831321, 825189, 821521, 819898, 819606, 819941, 820559, 821876, 824631, 828831, 833569, 837962, 841749, 844923, 847428, 849394, 851157, 852823, 854186, 855142, 855865, 856663, 858007, 860478, 864240, 868838, 873949, 879990, 887496, 896409, 906614, 918533]
58372I18533J3690J4175J3052J1755J1463J1706J1766J2046J3000J3948J3991
58361A059125J3189J1941J0323Q736P911P395N525J976j199k242j936j832j835
58348A117077j140j76L01R54K876N662Q165J0348J2790J5061J6262J6574J6839
58335A221593J7171J7227J7124J6899J5836J3546J0840Q397N703K564K85j47J83
58322A347221j78p94m23Q22K147L658N501O675O679O982Q853J0947J1307J0620
58308A420017J0974J2435J3425J3653J4135J4878J5047J5002J5764J6864J7062
58297A579256J6625J6702J6981J6401J5597J6095J7507J8086J7765J8040J9127
58286A768182J9756J9745K0240K1421K2284K2685K3397K4322K4807K5510K7562
$$ y = [918533, 932223, 946398, 959450, 971205, 982668, 994374, 1006140, 1018186, 1031186, 1045134, 1059125, 1072314, 1084255, 1094578, 1103314, 1111225, 1118620, 1124145, 1126121, 1124922, 1122680, 1120744, 1118912, 1117077, 1115937, 1115761, 1116062, 1117016, 1119892, 1125554, 1133719, 1144067, 1156857, 1171918, 1188180, 1204754, 1221593, 1238764, 1255991, 1273115, 1290014, 1305850, 1319396, 1330236, 1338633, 1344336, 1346900, 1347185, 1347038, 1347221, 1347043, 1346249, 1345826, 1346648, 1348795, 1352453, 1357954, 1364629, 1371308, 1378290, 1387143, 1398090, 1409397, 1420017, 1430991, 1443426, 1456851, 1470504, 1484639, 1499517, 1514564, 1529566, 1545330, 1562194, 1579256, 1595881, 1612583, 1629564, 1645965, 1661562, 1677657, 1695164, 1713250, 1731015, 1749055, 1768182, 1787938, 1807683, 1827923, 1849344, 1871628, 1894313, 1917710, 1942032, 1966839, 1992349, 2019911]
58275B019911L0254L1887L2728L4610L7819M0870M3214M5668M8279N0257N1963
58264B467460N4490N7333N8855N8999N9191N9738N9688N8940N8081N6638N4080
58253C103493N2067N2899N6120N9389O2276O6269P1520P6634Q1477Q7165R3485
58242C862794R9277J04918J11582J18547J24321J29799J37044J45727J54105J62624
58232E150738J73014J84820J96610K09608K25841K43780K60308K76196K94972
58223G215887L17184L40684L65909L95684M30324M68041N09587N57328O10535
58214A1211163O67279P30200Q04590Q91630R89716J101526J233396J388914J570188
58205B0588602J784624K043715K357074K735821L200811L780337M502498N397802
$$ y = [2019911, 2050165, 2082052, 2114780, 2149390, 2187209, 2228079, 2271293, 2316961, 2365240, 2415497, 2467460, 2521950, 2579283, 2638138, 2697137, 2756328, 2816066, 2875754, 2934694, 2992775, 3049413, 3103493, 3155560, 3208459, 3264579, 3323968, 3386244, 3452513, 3524033, 3600667, 3682144, 3769309, 3862794, 3962071, 4066989, 4178571, 4297118, 4421439, 4551238, 4688282, 4834009, 4988114, 5150738, 5323752, 5508572, 5705182, 5914790, 6140631, 6384411, 6644719, 6920915, 7215887, 7533071, 7873755, 8239664, 8635348, 9065672, 9533713, 10043300, 10600628, 11211163, 11878442, 12608642, 13413232, 14304862, 15294578, 16396104, 17629500, 19018414, 20588602, 22373226, 24416941, 26774015, 29509836, 32710647, 36490984, 40993482, 46391284]
58197D6391284O504795P863561R510086J1489961J3871927J6735086K0150825
58190A32517525K4183224K8858642L4041082L9258901M3602545M5749269M4136688
58183C92347876L7401184K5138598Q622140r224798k4903823l5838721m1245087
58176C52297369m1926735l9460211l5458141l1167013k7298482k4032935k1214409
58169A31739443j8631812j6186688j3885309j1768500r877435q242543o866847
58162D6280309n723898m780246m010190l387174k878625k458073k111846j828568
58154A9101689j592485j391714j223209j084500r68312q68794p85229p16016o55791
58145I815639o01377n53984n12961m73672m33922l96509l63110l31341l00084
$$ y = [46391284, 52896079, 60759640, 70269726, 81759687, 95631614, 112366700, 132517525, 156700749, 185559391, 219600473, 258859374, 302461919, 348211188, 392347876, 429749060, 454887658, 463509798, 454285000, 429381177, 393542456, 352297369, 310370634, 270910423, 235452282, 204285269, 176986787, 152953852, 131739443, 113107631, 96920943, 83035634, 71267134, 61389699, 53147156, 46280309, 40556411, 35776165, 31765975, 28378801, 25500176, 23042103, 20930257, 19101689, 17509204, 16117490, 14894281, 13809781, 12841469, 11972675, 11187446, 10471430, 9815639, 9214262, 8660278, 8147317, 7673645, 7239723, 6843214, 6480104, 6148763, 5848679]
58136E848679k72214k49702k30889k14630k02499j94840j88844j82353j75763
58127C936945j68992j60512j50547j41289j33069j24045j14386j06601j01039
58118B736465r5160q8224q2441p8537p4359o9084o4734o2115n9252n5238n1959
58107A955362n0449m9080m6819m4948m4094m2834m0649l9108l8676l7529l4908
58096A486268l2652l1912l1322k9831k8424k7637k6191k3620k1471k0482j9248
58085A193478j7162j5893j6428j7273j7273j7688j9680k2050k3176k3209k2862
58074I80784k2037k1002k0775k1075k0047j7325j5020j4350j3744j1871j0048
58063G93490r685r658q373o533n633n411m956m823n889p338p809p633q033r016
$$ y = [5848679, 5576465, 5326763, 5095874, 4881244, 4678745, 4483905, 4295061, 4112708, 3936945, 3767953, 3607441, 3456894, 3315605, 3182536, 3058491, 2944105, 2837504, 2736465, 2641305, 2553081, 2470640, 2392103, 2317744, 2248660, 2183926, 2121811, 2062559, 2007321, 1955362, 1904913, 1855833, 1809014, 1764066, 1719972, 1677138, 1636489, 1597381, 1558705, 1521176, 1486268, 1453616, 1421704, 1390382, 1360551, 1332127, 1304490, 1278299, 1254679, 1233208, 1212726, 1193478, 1176316, 1160423, 1143995, 1126722, 1109449, 1091761, 1072081, 1050031, 1026855, 1003646, 980784, 958747, 937745, 916970, 895895, 875848, 858523, 843503, 829153, 815409, 803538, 793490, 783805, 774147, 765774, 759241, 753608, 748197, 743241, 738418, 732529, 725191, 717382, 709749, 701716, 692700]
58049F92700r614r513q961p894o389n252n001n108n114n463o386p134p239p295
58035E96337p594p412o576o205o717o737n352l928m085n264n964o105o449o699
58021E11250o044m799l843l147k353k084l011m272m396l386k468k172k069j991
58007D65215k172k412k301k057k166k444k409k085j674r06K87J082Q00Q2N1P85
57991D47676J692K777M326N763O088N206L806K152J16j853k967l236l444l939
57977D64163m361m484m490m317l588k320j146o24p30j063j259j215j154j353j741
57962D30318j956j845j530j028l74q1o97j784k288k108k300l356m335m284l448
57947C98904k427j181K92J289J440J606K786M721O471P714Q657R294R748J0630
$$ y = [692700, 683086, 673573, 664612, 656718, 650329, 645077, 640076, 634968, 629854, 624391, 618005, 610871, 603632, 596337, 588743, 581331, 574755, 568550, 561833, 555096, 549744, 545816, 541731, 536467, 530503, 524398, 517949, 511250, 505206, 500407, 496564, 493417, 491064, 488980, 485969, 481697, 477301, 473915, 471447, 469275, 467206, 465215, 463043, 460631, 458330, 456273, 454107, 451663, 449254, 447169, 445495, 444589, 444876, 445958, 446758, 446840, 446891, 447676, 449368, 452145, 456471, 462234, 468322, 473528, 477334, 479486, 479602, 477749, 474782, 471546, 468102, 464163, 459802, 455318, 450828, 446511, 442923, 440603, 439457, 438833, 438103, 437040, 435781, 434566, 433412, 432059, 430318, 428362, 426517, 424987, 423959, 423585, 423504, 422807, 421023, 418735, 416627, 414327, 410971, 406636, 402352, 398904, 396477, 395296, 395588, 396877, 398317, 399923, 402709, 407430, 413901, 421615, 430272, 439566, 449314, 459944]
57933D59944J2152J3388J3347J2244J0800Q932O121K548j144m758q211j0784j1856
57920E02723j1968j2224j2802j2999j2431j1218r386p049m960l907l629l213k293
57907C94644j156K0J196K033K244K054J639O09j089k327k041q08o2k4K84J255
57891C98471K294L144M216N495O324O591O922P484P650P192O681O296N258L126
57877D77144P45q20j609k403l510m560n178n281m900m156l313k543j711n86P21
57862D38040J685J721P88l02l64J088L315N050N572N053M171L686L953M531M487
57847D82474L452K021R01J64l44n18m96r54k145l120k827j567m69Q5N14Q21N49
57830D78541q6k16L55Q80R60J150J824K344J917O70o25j519k125k731l500m379
$$ y = [459944, 472096, 485484, 498831, 511075, 521875, 530807, 536928, 539476, 538332, 533574, 525363, 514579, 502723, 490755, 478531, 465729, 452730, 440299, 429081, 419695, 412646, 407686, 403779, 400150, 396937, 394644, 393488, 393508, 394704, 396737, 398981, 401035, 402674, 403283, 402194, 399867, 397826, 397018, 396956, 396932, 397216, 398471, 400765, 403909, 408125, 413620, 419944, 426535, 433457, 440941, 448591, 455783, 462464, 468760, 474018, 477144, 477889, 477069, 475460, 473057, 469547, 464987, 459809, 454528, 449628, 445472, 442159, 439616, 437905, 437319, 438040, 439725, 441446, 442234, 441932, 441568, 442656, 445971, 451021, 456593, 461646, 465817, 469503, 473456, 477987, 482474, 485926, 487947, 488848, 489012, 488668, 488150, 487654, 486700, 484555, 481435, 478608, 477041, 476572, 476657, 477171, 477992, 478541, 478455, 478239, 478594, 479474, 480434, 481584, 483408, 485752, 487669, 488339, 487714, 486195, 484070, 481339, 477839, 473460]
57814D73460n119n533n703n696n299m464l854m308n798p510q980j0387j1686j2221
57800C76902j1635j0472r434q439o945m974l285k552k643k773k248j047L25J457
57786C12237K334L017L420L615M053N084O446P554Q157Q404Q500Q565Q636Q516
57772C98538P854O670N431M342L036J357j42j035j777k938m200m896n136n386
57758D01718n397m539l092k061j780j678j383j070o28L66J728K635K785K691K664
57743C92959K484K202K229K274J349o94k646l512l655l767l681l088k531k649
57729C77274k992k690j878j450j576j435n44N08R44Q10P84J289K011K262J780
57714C75097J110J052J633J976J333L2q73p07L03J388J852J436L22j085k393l225
$$ y = [473460, 468341, 462808, 457105, 451409, 446110, 441646, 437792, 433484, 427686, 420176, 411196, 400809, 389123, 376902, 365267, 354795, 345361, 336922, 329977, 325003, 321718, 319166, 316523, 313750, 311502, 310455, 310780, 312237, 314571, 317588, 321008, 324623, 328676, 333760, 340206, 347760, 355917, 364321, 372821, 381386, 390022, 398538, 406392, 413062, 418493, 422835, 425871, 427228, 427086, 426051, 424274, 421336, 417136, 412240, 407104, 401718, 396321, 391782, 388690, 386629, 384849, 383171, 381788, 380718, 380090, 380456, 382184, 384819, 387604, 390295, 392959, 395443, 397645, 399874, 402148, 403497, 402803, 400157, 396645, 392990, 389223, 385542, 382454, 379923, 377274, 374282, 371592, 369714, 368264, 366688, 365253, 364709, 365217, 366161, 366971, 367755, 369044, 371055, 373317, 375097, 376207, 377259, 378892, 380868, 382201, 382233, 381360, 380653, 380956, 382344, 384196, 385632, 385954, 384869, 382476, 379251]
57698C79251l195k277j167q30j538k663l494l915m086l948l352k505j925j993
57684C42363k613l221l094j870J20K214M094N966Q153J0842J4186J8248K2835
57671D18223K7775L3422M0497M9304N9352O9758P9498Q7110R0350Q6471P2960
57660A114720M8742J5664k0959n4078p8120r1041r3896q9231p9925o8739n7858
57649E45279m8488m0713l3867k7350k1451j7133j4707j3139j1183q873p124o124
57637B95127n179m019l179k829k300j248l02rK6L43O83N19l4n65j105j783k238
57620B71908k080j657j673k161k477k218j663j330j492k002k431k416k121k036
57606B44151k198j990j025K26J032J236J102P58K21l36p96j284j819k133k144
$$ y = [379251, 376056, 373779, 372612, 371782, 370244, 367581, 364087, 360172, 356086, 352138, 348786, 346281, 344356, 342363, 339750, 336529, 333435, 331565, 331685, 333899, 337993, 343959, 352112, 362954, 377140, 395388, 418223, 445998, 479420, 519917, 569221, 628573, 698331, 777829, 864939, 955289, 1041760, 1114720, 1163462, 1179126, 1158167, 1104089, 1025969, 934928, 841032, 751801, 671876, 603137, 545279, 496791, 456078, 422211, 394861, 373410, 356277, 341570, 328431, 317248, 308375, 301251, 295127, 289948, 285929, 282750, 279921, 277621, 276373, 276071, 276062, 276088, 276431, 277114, 277633, 277599, 277034, 275929, 274146, 271908, 269828, 268171, 266498, 264337, 261860, 259642, 257979, 256649, 255157, 253155, 250724, 248308, 246187, 244151, 241953, 239963, 238938, 239164, 240196, 241432, 242534, 243292, 243513, 243177, 242381, 241097, 239278, 237145, 235001]
57591B35001k252k649k877k499j835j438j245r00o05q50j496j890j874j947k350
57576B08294k665k512k148k040k193k143j519m54M17M34m33j459j864j544j000
57561A87171o94o82p83q18p55p40q75r59o31O9N92N09j1m86n89j95P47K043L258
57542A86171M051M372M246L786L408L550L953L860L178K679K702K488J427J97
57528B30068k77l00q27j821k311j933j284p35J4J035J788J953J888J836J410K98
57512B30802j041j830j817j351q88o34m32J08J089J930J827O90p61j853k493k815
57496B20531k855k789k954l377l647l532l390l614m011m031l495k757k252k071
57482A75756j885j246r8R64J237Q17N85J049J594J347N39L76J446K796L013J886
$$ y = [235001, 232749, 230100, 227223, 224724, 222889, 221451, 220206, 219306, 218701, 217851, 216355, 214465, 212591, 210644, 208294, 205629, 203117, 200969, 198929, 196736, 194593, 193074, 192620, 193037, 193471, 193038, 191579, 189715, 188171, 187171, 186477, 185795, 185012, 184194, 183439, 182699, 181824, 180865, 180234, 180303, 180895, 181404, 181393, 180907, 180318, 180123, 180870, 182913, 186171, 190222, 194594, 198840, 202626, 206034, 209584, 213537, 217397, 220575, 223254, 225956, 228444, 229871, 230068, 229791, 229491, 228664, 226843, 224532, 222599, 221315, 220580, 220594, 221629, 223417, 225370, 227258, 229094, 230504, 230802, 229761, 227931, 226114, 224763, 223875, 223241, 222809, 222917, 224006, 225936, 227763, 228453, 227692, 225839, 223346, 220531, 217676, 214887, 211933, 208556, 204909, 201377, 197987, 194373, 190362, 186331, 182836, 180079, 177827, 175756, 173871, 172625, 172527, 173491, 174728, 175545, 176130, 177179, 178773, 180120, 180659, 181035, 182481, 185277, 188290, 190176]
57466A90176N50O6L52P03Q37R74J166J140Q66P10Q49Q99M90j23m06k78j69l88
57448A98414p75j027j117j230j389j287o20L97J037Q27J66j21K20P01Q56P58O97
57431A96507P69R25J058Q74J35q69j434j295q98o94n70j78N25J303J780J559O55
57414B00152j32M2Q59J174O78K62L67K16o54j311q69l9j6n89p52n75r74j871k111
57395A93857j249j08N78R45J178J082P45O77R61J092R29R45J284J447J227J140
57379B06730J556K080K235K094J889J530R24K63k29m75l41J93N99K16p07j122
57363B17435n38L79Q10P94Q24J050J297J465J566J635J741J788J408M65l98l94
57347B31327K67O01J99l60n51m58k37J57M22P2n99o04K66R97Q20K16j03k89p19
$$ y = [190176, 190726, 190792, 191144, 191847, 192684, 193658, 194824, 195964, 196830, 197540, 198389, 199288, 199778, 199655, 199249, 198971, 198802, 198414, 197639, 196612, 195495, 194265, 192876, 191589, 190969, 191366, 192403, 193230, 193396, 193275, 193495, 194196, 195052, 195810, 196507, 197276, 198201, 199259, 200133, 200268, 199399, 197965, 196670, 195772, 195078, 194508, 194330, 194855, 196158, 197938, 199497, 200152, 200020, 200062, 200921, 202095, 202773, 203035, 203402, 203618, 202964, 201653, 200784, 200745, 200729, 200140, 199388, 198813, 197839, 195968, 193857, 192608, 192500, 193078, 194023, 195201, 196283, 197028, 197705, 198666, 199758, 200687, 201632, 202916, 204363, 205590, 206730, 208286, 210366, 212601, 214695, 216584, 218114, 219038, 219301, 219072, 218597, 218256, 218449, 219048, 219264, 218557, 217435, 216897, 217276, 218086, 218880, 219704, 220754, 222051, 223516, 225082, 226717, 228458, 230246, 231654, 232119, 231721, 231327, 231594, 232195, 232394, 232034, 231483, 231025, 230788, 230945, 231367, 231439, 230840, 230236, 230502, 231499, 232319, 232535, 232432, 232143, 231424]
57328B31424j027p00m3K72K11K24M09M86L12p0o21j042p49L70J508J714R07k11
57310B33374r50j029o03k19l93q94r31k49N51R65J207J486J444Q63K28qq0k02
57292B34560L2Q10J297O64n67j134p02n2J70K6j91l16j70K80P36R52J108J353
57274B38856J372R20M08L60O27P52Q04J170J868K672L569M430M722M298M009M601
57258B75438N377N063L775K934L218L731L454K552J784J401J174R53P55O00N32
57243C12741N99O74N90M82P07J357K122K583K434J628O20K49Q91J903K340K091
57227C34011J856K042K302K180J807J754K361L298L783L459K983L292M276M857
57213C74261M633M564N463O636O864O116N408N401O045P174Q530R432R373Q762
$$ y = [231424, 230397, 229697, 229654, 229926, 230137, 230361, 230770, 231256, 231568, 231498, 230877, 229835, 229086, 229456, 230964, 232678, 233585, 233374, 232424, 231395, 230792, 230573, 230180, 229286, 228355, 228106, 228657, 229622, 230829, 232315, 233759, 234622, 234850, 234842, 234762, 234560, 234592, 235402, 236699, 237363, 236796, 235662, 234960, 234908, 235078, 235104, 234913, 234597, 234427, 234707, 235443, 236395, 237503, 238856, 240228, 241148, 241556, 241916, 242543, 243295, 244099, 245269, 247137, 249809, 253378, 257808, 262530, 266828, 270837, 275438, 280815, 285878, 289653, 292587, 295805, 299536, 302990, 305542, 307326, 308727, 309901, 310854, 311609, 312209, 312741, 313340, 314014, 314604, 315086, 315793, 317150, 319272, 321855, 324289, 325917, 326537, 326786, 327677, 329580, 331920, 334011, 335867, 337909, 340211, 342391, 344198, 345952, 348313, 351611, 355394, 358853, 361836, 365128, 369404, 374261, 378894, 383458, 388921, 395557, 402421, 408537, 413945, 419346, 425391, 432565, 441095, 450527, 459900, 468662]
57199D68662Q299P968P378O762O567O528O142N856O530P846Q522Q213P959Q546
57185E71778R495J0042J0141J0132J0222J0621J1479J2432J2905J2969J3243J3803
57173G09262J4009J3532J2819J2344J2160J2345J3107J4270J5355J6351J7716
57162H63270J9532K1371K3086K5041K7426L0019L2610L5019L6654L6907L5955
57151A186890L4503L2793L0609K8130K5890K4132K3013K3135K4691K6488K7175
57140A487449K7266K8489L1166L3879L5715L7113L8300L8769L8861M0098M3121
57129A880226M6859N0455N4554N9755O5312P0359P5188Q0292Q5318Q9943R4799
57118B653060J00674J07732J16145J26474J38794J52545J67621J84488K02975
$$ y = [468662, 476961, 484929, 492307, 499069, 505636, 512164, 518306, 524162, 530692, 538538, 547060, 555273, 563232, 571778, 581273, 591315, 601456, 611588, 621810, 632431, 643910, 656342, 669247, 682216, 695459, 709262, 723271, 736803, 749622, 761966, 774126, 786471, 799578, 813848, 829203, 845554, 863270, 882802, 904173, 927259, 952300, 979726, 1009745, 1042355, 1077374, 1114028, 1150935, 1186890, 1221393, 1254186, 1284795, 1312925, 1338815, 1362947, 1385960, 1409095, 1433786, 1460274, 1487449, 1514715, 1543204, 1574370, 1608249, 1643964, 1681077, 1719377, 1758146, 1797007, 1837105, 1880226, 1927085, 1977540, 2032094, 2091849, 2157161, 2227520, 2302708, 2383000, 2468318, 2558261, 2653060, 2753734, 2861466, 2977611, 3104085, 3242879, 3395424, 3563045, 3747533, 3950508]
57109C950508K22586K44373K70755L03051L41344L87305M44813N16859O04424
57100G286018P09704Q37931R94651J183788J409863J678747J993370K350753K745031
57091B1189856L170238L617707M074231M525815M959261N356867N696347N963641
57083E8553963O159200O274942O257341O000577N387743M351507K915431J200961
57075I7101665n99229k277210l675269m724158n433993n857385o058193o095612
57067F2380616o013970n836909n573474n232137m828296m381504l912080l441546
57059B3160700k990941k575112k200409j868692j580922j335875j128859r54351
57051H525539q08598o88434n89503n07347m39072l82613l35496k95656k62349
$$ y = [3950508, 4173094, 4417467, 4688222, 4991273, 5332617, 5719922, 6164735, 6681594, 7286018, 7995722, 8833653, 9828304, 11012092, 12421955, 14100702, 16094072, 18444825, 21189856, 24360094, 27977801, 32052032, 36577847, 41537108, 46893975, 52590322, 58553963, 64713163, 70988105, 77245446, 83246023, 88633766, 92985273, 95900704, 97101665, 96502436, 94225226, 90549957, 85825799, 80391806, 74534421, 68476228, 62380616, 56366646, 50529737, 44956263, 39724126, 34895830, 30514326, 26602246, 23160700, 20169759, 17594647, 15394238, 13525546, 11944624, 10608749, 9479890, 8525539, 7716941, 7028507, 6439004, 5931657, 5492585, 5109972, 4774476, 4478820, 4216471]
57042D216471k35006k11950j91280j72350j55386j40318j26843j15065j05174
57033B763099r6816q9389q2576p6121o9569o2683n5504m7612l7996k6183j2910
57022B105740Q14J4485K6983L5123L4448K2035j331l1186o1174q5493j00869j06930
57010A852645j05142r7710q7194p6182o6366n8070n0976m5024m0371l6844l4043
56999A154723l1717k9755k7877k5770k3419k1011j8652j6467j4710j3474j2307
56988I19564j0495p735m321p06K909O466R548J1083R678M614l381j2426k0543
56975I04255k6419k9476k9833k8349k6148k3765k0960j7520j3813j0351p204m217
56963F66200j429J123L718O673R863J2976J6023J9064K1363K1278J7211Q655l418
$$ y = [4216471, 3981465, 3769515, 3578235, 3405885, 3250499, 3110181, 2983338, 2868273, 2763099, 2666283, 2576894, 2494318, 2418197, 2348628, 2285945, 2230441, 2182829, 2144833, 2118650, 2105740, 2106554, 2121039, 2148022, 2183145, 2217593, 2239628, 2238297, 2207111, 2145937, 2060444, 1959575, 1852645, 1747503, 1649793, 1562599, 1486417, 1420051, 1361981, 1311005, 1265981, 1225610, 1188766, 1154723, 1123006, 1093251, 1065374, 1039604, 1016185, 995174, 976522, 960055, 945345, 931871, 919564, 909069, 901334, 897013, 896307, 899216, 905682, 915230, 926313, 935991, 940605, 937224, 924798, 904255, 877836, 848360, 818527, 790178, 764030, 740265, 719305, 701785, 687972, 677621, 670417, 666200, 664771, 665894, 669612, 676285, 686148, 699124, 715147, 734211, 755574, 776852, 794063, 802718, 799300]
56950G99300j6741k8382l5883l8412l6952l3388k9282k5321k1451j7332j2804
56939E03352q080l575M76M245Q251J3078J8951K5447L1597L6271L8341L6524K9572
56926G34450J7168P74j6636l1835m2567m8054m8819m6109m1266l5440k9687k4900
56914C87079k1344j8470j5580j2635j0144q438p427o946o843o701o040m878l733
56901B57900k889k164j491j171j211r11L10K066L471M340N373P271J0127J3666
56887B94687J7583K1467K4660K6322K5586K1804J5012O172l227j1795j8375k2010
56875C97886k2374k0199j6872j3367r840o029j686L295Q711J4008J8910K4045
56863C76488L0281L7455M4486N0864N7003O2437O4402N9315M5659K5106J291k1787
$$ y = [799300, 782559, 754177, 718294, 679882, 642930, 609542, 580260, 554939, 533488, 516156, 503352, 495272, 491697, 492173, 496418, 504669, 517747, 536698, 562145, 593742, 630013, 668354, 704878, 734450, 751618, 752392, 735756, 703921, 661354, 613300, 564481, 518372, 477106, 441666, 411979, 387079, 365735, 347265, 331685, 319050, 308906, 300468, 293041, 286095, 279252, 272551, 266511, 261633, 257900, 255011, 252847, 251356, 250185, 248974, 248063, 248373, 250439, 253910, 258250, 263623, 270894, 281021, 294687, 312270, 333737, 358397, 384719, 410305, 432109, 447121, 453293, 450066, 438271, 419896, 397886, 375512, 355313, 338441, 325074, 315234, 309205, 307519, 310814, 319525, 333533, 352443, 376488, 406769, 444224, 488710, 539574, 596577, 659014, 723416, 782731, 828390, 853496, 854787, 833000]
56851H33000m0545n2479n6889n4951m8808m0529l1607k2815j4263n655L292J2696
56839D80447K2552L2811M3556N5127O7814Q1099R3354J02281J05206R8929Q0399
56828A263575M9082Q995l2279o7099r0776j02176j02825r5770q4367p1197n7776
56817F17387m5004l3284k2296j1321k12J0405K0182K9881M0696N2756O4497P3261
56805G96948P6403P2003N9073L7617R247k2054n0476p0881q1281q2907p8232o9558
56793E95902n8977m8329l8508k9372k0712j2774n698P97O750J1811J6280K1456
56781D38626K8030L4570L8412L7686L1883K1130O204j0743k6615l8957m6691m9573
56769D63962m7922m3094l7234l1863k7103k2523j8218j4675j2053j0145q817q022
$$ y = [833000, 792455, 739976, 683087, 628136, 579328, 538799, 507192, 484377, 470114, 464459, 467751, 480447, 502999, 535810, 579366, 634493, 702307, 783406, 876760, 979041, 1084247, 1183176, 1263575, 1312657, 1321652, 1289373, 1222274, 1131498, 1029322, 926497, 830727, 746360, 675163, 617387, 572383, 539099, 516803, 505482, 505270, 515675, 535857, 565738, 606434, 659190, 723687, 796948, 873351, 945354, 1004427, 1042044, 1051291, 1029237, 978761, 907880, 826599, 743692, 665460, 595902, 536925, 488596, 450088, 420716, 400004, 387230, 381532, 382329, 389079, 400890, 417170, 438626, 466656, 501226, 539638, 577324, 609207, 630337, 636541, 625798, 599183, 560226, 513535, 463962, 416040, 372946, 335712, 303849, 276746, 254223, 236005, 221330, 209277, 199132, 190315, 182293]
56757A82293p549p070o373n373m078k804k040j825j471m24P98J092K26p68q93
56742A43741l76j34m62q40q94q62r61r37n87l11o11j284j614j224l48N94J253
56725A34143J331Q85O03J180K225K595J902J128J265K045K532K432K171J970J695
56710A60102J452J627K193K599K451J949J461J089Q01O28N88O36P61R41R73O48
56694A80899P9m11p52j161j587j632j192q38j120j721j782j049k46j18m98o45
56678A66226l36r1l07p31j074j654k837m132m588m140l753l997m133l163j243
56663A30047M95J285J301J082R96J239J923K961M061M855M990M390L558L199L279
56648A69661K943J819R02J398L023M362M712M618M564M244L471K811K672K494
$$ y = [182293, 174744, 167674, 161301, 155928, 151850, 149046, 147006, 145181, 143710, 143286, 144084, 145176, 145402, 144634, 143741, 143365, 143231, 142769, 141929, 141035, 140173, 139212, 138275, 137688, 137377, 136766, 135482, 133868, 132644, 132296, 132890, 134143, 135474, 136359, 136962, 138142, 140367, 142962, 144864, 145992, 147257, 149302, 151834, 154266, 156437, 158407, 160102, 161554, 163181, 165374, 167973, 170424, 172373, 173834, 174923, 175724, 176352, 176940, 177576, 178337, 179278, 180251, 180899, 180978, 180567, 179815, 178654, 177067, 175435, 174243, 173405, 172285, 170564, 168782, 167733, 167487, 167369, 166871, 166226, 165890, 165799, 165492, 164761, 163687, 162033, 159196, 155064, 150476, 146336, 142583, 138586, 134453, 131290, 130047, 130542, 131827, 133128, 134210, 135206, 136445, 138368, 141329, 145390, 150245, 155235, 159625, 163183, 166382, 169661, 172604, 174423, 175325, 176723, 179746, 184108, 188820, 193438, 198002, 202246, 205717, 208528, 211200, 213694]
56634B13694J610L21o19j180j860k583k764k445k479l221l855l562k797k687l345
56619A82228l653k868j737j463k073k496k082j313q98q78r88j261j727j925j432
56604A55434o24k48l45k40L34Q38P86M21K16L10O24J173J824K204K137J858J520
56587A68222R89M07M64J479K654K892K195J443J063O98K54K76R18J325P15m28
56571A85566r26m30L21O00M31K66M62J181K349L539M316M830N633O803P691P800
56555B30432P412P011O547N732M724L912L307K678K163K061K107J622M67p20j400
56540B78055j749k183k740l146l188k876k472k391k701k872k493k106k572l658
56526B40908m139l547k825k737k645j628p8Q17O82J23m22j029j641j945j972k140
$$ y = [213694, 215304, 215625, 215006, 213826, 211966, 209383, 206619, 204174, 201695, 198474, 194619, 191057, 188260, 185573, 182228, 178575, 175707, 173970, 172507, 170434, 167938, 165856, 164543, 163645, 162767, 161779, 160518, 158791, 156866, 155434, 154810, 154562, 154217, 153977, 154311, 155149, 155935, 156356, 156572, 156882, 157506, 158679, 160503, 162707, 164844, 166702, 168222, 169211, 169618, 170082, 171561, 174215, 177107, 179302, 180745, 181808, 182506, 182760, 183036, 183954, 185279, 185994, 185566, 184640, 184210, 184531, 185131, 185562, 185828, 186290, 187471, 189820, 193359, 197675, 202505, 208138, 214941, 222632, 230432, 237844, 244855, 251402, 257134, 261858, 265770, 269077, 271755, 273918, 275979, 278086, 279708, 280175, 279455, 278055, 276306, 274123, 271383, 268237, 265049, 262173, 259701, 257310, 254609, 251737, 249244, 247138, 244566, 240908, 236769, 233222, 230397, 227660, 225015, 223387, 223309, 224126, 224808, 224931, 224509, 223480, 221839, 219894, 217922, 215782]
56510B15782k521k666k241j480q84p99j167j588j694j650j919k366k234j374q05
56495A90394j337k266k363j605r33o28j69N02P61M68J90J21j67o52o14J64R13
56478A82779J064J023J277J461J022J57n13p14n61k51q7l00n56k12O37J070O75
56461A87971J65J95L29k7m24m3R09J447J236Q41O40M10L1r8K52P16Q39P03P49
56442A96841J102J327Q77k60j377j696j148l14L59Q66J138Q06j47r55q37k0O01
56425A97163O55O39J042J677K015J873J494J097O52J21k66j89L24Q25R51Q51R01
56408B11825J164J361J310J067P72O30R13J583K109K116K036K452K990K657J362
56393B36347J95p6N2j20l57j62R4l23j206j519q66J9L61K78L61Q07J338J703J855
$$ y = [215782, 213261, 210595, 208354, 206874, 205990, 205191, 204024, 202436, 200742, 199092, 197173, 194807, 192573, 191199, 190394, 189057, 186791, 184428, 182823, 181890, 181262, 181093, 181595, 182356, 182824, 183014, 183135, 182968, 182316, 181702, 181866, 182779, 183843, 184866, 186143, 187604, 188626, 188783, 188270, 187556, 186995, 186744, 186657, 186357, 185801, 185589, 186226, 187296, 187971, 188136, 188331, 188660, 188633, 188209, 188166, 189075, 190522, 191758, 192599, 193239, 193649, 193680, 193582, 193834, 194550, 195389, 196092, 196841, 197943, 199270, 200147, 199887, 198510, 196814, 195666, 195352, 195711, 196577, 197715, 198521, 198374, 197419, 196582, 196562, 197163, 197818, 198457, 199499, 201176, 203191, 205064, 206558, 207655, 208307, 208428, 208162, 207973, 208297, 209122, 210073, 210924, 211825, 212989, 214350, 215660, 216727, 217499, 218129, 219042, 220625, 222734, 224850, 226886, 229338, 232328, 234985, 236347, 236542, 236466, 236518, 236398, 236041, 235879, 235973, 235650, 234444, 232925, 232059, 232078, 232439, 232717, 233078, 233885, 235223, 236926, 238781]
56374B38781J694J096K25l87m12j79k13m29k17N46J195J271J214J574K045J995
56358B49799J511J104O76j50q97n41Q22J718J110l77j400j378n63N70J541J940
56342B55485J799J562J469J356J146J019R76Q66Q95J427K207K544K382K271K247
56327B79651J829J286J687L138M252M013L060K431K094J633J266J179Q56J20j03
56312C08392Q10J896J999J606J879K581K549J823J678K638L932M950N871O687
56298C49291O911O568O368O563O489N615M274L098K450K602L715N344O550O869
56284D22707O765O926P422P730P371O476N904O503Q080R477R956J0038J0500J1200
56270E37055J1667J2192J3372J4905J5919J6398J7330J9356K2122K5055K8108
$$ y = [238781, 240475, 241571, 241796, 241409, 240997, 240818, 240605, 240176, 239959, 240505, 241700, 242971, 244185, 245759, 247804, 249799, 251310, 252414, 253090, 252940, 252043, 251502, 252324, 254042, 255152, 254775, 253375, 251997, 251434, 252004, 253545, 255485, 257284, 258846, 260315, 261671, 262817, 263836, 264812, 265678, 266573, 268000, 270207, 272751, 275133, 277404, 279651, 281480, 282766, 284453, 287591, 291843, 295856, 298916, 301347, 303441, 305074, 306340, 307519, 308375, 308495, 308392, 309202, 311098, 313097, 314703, 316582, 319163, 321712, 323535, 325213, 327851, 331783, 336733, 342604, 349291, 356202, 362770, 369138, 375701, 382190, 387805, 392079, 395177, 397627, 400229, 403944, 409288, 415838, 422707, 429472, 436398, 443820, 451550, 458921, 465397, 471301, 477804, 485884, 495361, 505317, 515355, 525855, 537055, 548722, 560914, 574286, 589191, 605110, 621508, 638838, 658194, 680316, 705371, 733479]
56259G33479L1604L5870M1023M6759N2495N8164O4524P2155Q0622Q9270R8300
56248A404265J08167J18308J27525J35480J42692J49096J53594J55124J53377
56239B647628J48385J40077J28425J13346R4603P2313M7532K1731m084k9215n2636
56228C328105p3328r1028j05871j17567j25743j30810j33572j34226j32556j28923
56218B154481j24148j18666j12613j06458j00558r4482q7763q0963p4856o9058
56208A184916o2765n6501n1549m7859m4037l9524l5142l1400k7816k4306k1619
56197G42398j9871j8073j5790j3906j3043j2479j1429j0307r712r166p858o025
56185E94739m666m205m158l961l616l592m151m721m232k530r31o17r65n34O63
$$ y = [733479, 765083, 800953, 841976, 888735, 941230, 999394, 1063918, 1136073, 1216695, 1305965, 1404265, 1512432, 1630740, 1758265, 1893745, 2036437, 2185533, 2339127, 2494251, 2647628, 2796013, 2936090, 3064515, 3177861, 3272464, 3344777, 3392309, 3414040, 3409956, 3380741, 3328105, 3254777, 3163749, 3057878, 2940311, 2814568, 2683758, 2550186, 2415960, 2283404, 2154481, 2030333, 1911667, 1799054, 1692596, 1592038, 1497556, 1409793, 1328830, 1253974, 1184916, 1122151, 1065650, 1014101, 966242, 922205, 882681, 847539, 816139, 788323, 764017, 742398, 722527, 704454, 688664, 674758, 661715, 649236, 637807, 627500, 617788, 608622, 600764, 594739, 590073, 585868, 581710, 577749, 574133, 570541, 566390, 561669, 557437, 554907, 553976, 553359, 552394, 551860, 552523]
56170E52523J362J252J425K358L084K920K571K884L666M510N627P186Q716R909
56156F09993J1103J2402J3225J3363J3663J4957J7039J9304K1747K4687K8143
56145G99626L2051L6595M1996M8414N6304O6202P7949R0772J04222J18206J31824
56134A604161J42905J48969J48147J39551J24010J04590Q5304O8851N6113M7231
56124B669832M1672L7167L0441J9778O098q570k2362l3451m0537m4470m8190n4427
56112B552981o4266p7727r3947j10250j22945j30059j32099j29726j22430j10472
56102A459060r6286q2513o9820n7845m7057l8297l1353k5315j9816j5036j1086
56091I64636q088o159m785l053r87L47O03Q65K076L858N521P020Q254Q689Q459
$$ y = [552523, 553885, 555137, 556562, 558920, 562004, 564924, 567495, 570379, 574045, 578555, 584182, 591368, 600084, 609993, 621096, 633498, 646723, 660086, 673749, 688706, 705745, 725049, 746796, 771483, 799626, 831677, 868272, 910268, 958682, 1014986, 1081188, 1159137, 1249909, 1354131, 1472337, 1604161, 1747066, 1896035, 2044182, 2183733, 2307743, 2412333, 2497637, 2566488, 2622601, 2669832, 2711504, 2748671, 2779112, 2798890, 2804988, 2796418, 2774056, 2740605, 2700068, 2655598, 2607408, 2552981, 2488715, 2410988, 2317041, 2206791, 2083846, 1953787, 1821688, 1691962, 1569532, 1459060, 1362774, 1280261, 1210441, 1152596, 1105539, 1067242, 1035889, 1010574, 990758, 975722, 964636, 956548, 950389, 945604, 942551, 941564, 941911, 942514, 943379, 945455, 949313, 954834, 961854, 970108, 978797, 987256]
56076I87256Q647R757J1040J1896J2689J3605J4123J4277J4912J5940J5978J4619
56064A144739J3415J3509J3861J3040J1284R566P989O490N848O559P756Q461Q966
56051A271483R934J1160J2212J3197J4058J4235J3875J4118J5382J6652J7258
56040A423564J7891J9064K0127K0702K1507K2934K4340K5595K7555L0239L2348
56029A685866L3509L4952L7150L8909L9743M0865M2753M4066M4228M4632M6044
56018B132717M7307M7997M9621N2691N5331N6475N7718O0254O2877O4883O7897
56007B755768P2662P7140Q0070Q3342Q8511R4059R8605J03602J10055J15970J20066
55996C799850J24766J32199J40541J47691J55268J65368J76555J86874J97730
$$ y = [987256, 995903, 1005660, 1016700, 1028596, 1041285, 1054890, 1069013, 1083290, 1098202, 1114142, 1130120, 1144739, 1158154, 1171663, 1185524, 1198564, 1209848, 1219414, 1227403, 1233893, 1239741, 1246300, 1254056, 1262517, 1271483, 1281417, 1292577, 1304789, 1317986, 1332044, 1346279, 1360154, 1374272, 1389654, 1406306, 1423564, 1441455, 1460519, 1480646, 1501348, 1522855, 1545789, 1570129, 1595724, 1623279, 1653518, 1685866, 1719375, 1754327, 1791477, 1830386, 1870129, 1910994, 1953747, 1997813, 2042041, 2086673, 2132717, 2180024, 2228021, 2277642, 2330333, 2385664, 2442139, 2499857, 2560111, 2622988, 2687871, 2755768, 2828430, 2905570, 2985640, 3068982, 3157493, 3251552, 3350157, 3453759, 3563814, 3679784, 3799850, 3924616, 4056815, 4197356, 4345047, 4500315, 4665683, 4842238, 5029112, 5226842]
55987E226842K11042K25643K40355K57294K78153L00645L22849L47498L77620
55978G787941M11536M46882M85813N31349N82448O37880P01065P75745Q61061
55969A3221720R56645J068335J202960J362185J547925J769340K038354K364244
55961B5531708K760683L253474L874356M652848N620877O817663Q282351J0051422
55953G0845382J2173383J4716592J7753618K1347448K5543513L0302851L5337735
55946B28020522L9939056M2937290M2858379L8283609K8431746J3828749l391996
55939D30907355k0034363l3106415m0992342m3752554m2554834l8876248l4005065
55932A77585534k8878814k4069942j9837545j6242171j3261783j0840083q891815
$$ y = [5226842, 5437884, 5663527, 5903882, 6161176, 6439329, 6739974, 7062823, 7410321, 7787941, 8199477, 8646359, 9132172, 9663521, 10245969, 10883849, 11584914, 12360659, 13221720, 14178365, 15246700, 16449660, 17811845, 19359770, 21129110, 23167464, 25531708, 28292391, 31545865, 35420221, 40073069, 45693946, 52511609, 60793960, 70845382, 83018765, 97735357, 115488975, 136836423, 162379936, 192682787, 228020522, 267959578, 310896868, 353755247, 392038856, 420470602, 434299351, 430907355, 410872992, 377766577, 336774235, 293021681, 250466847, 211590599, 177585534, 148706720, 124636778, 104799233, 88557062, 75295279, 64455196, 55563381]
55925E5563381p323489o061711n051803m240650l579766l038884k600105k242289
55917B1424684j943122j691068j482372j309230j161004j033283r25751q33834
55909A1045020p51000o76510o12921n58481n09043m64607m27034l94037l62002
55900F289385l32165l07658k86846k65758k44832k27261k12720j98429j84568
55891D029148j73222j63525j53003j42254j33501j26067j17742j09108j02025
55882B808701r5505q7407p8721p1948o6688o1013n5745n3287n3528n4818n7450
55871B072591o2143o6487o7118o4451o1380n8417n4092m8994m5239m2637l9301
55860A462332l5564l3527l3130l2300l0630k9502k8895k7445k5464k4618k4840
$$ y = [55563381, 48239892, 42178181, 37126378, 32885728, 29305962, 26267078, 23666973, 21424684, 19481562, 17790494, 16308122, 14998892, 13837888, 12804605, 11878854, 11045020, 10294020, 9617510, 9004589, 8446108, 7937065, 7472458, 7045424, 6651387, 6289385, 5957220, 5649562, 5362716, 5096958, 4852126, 4624865, 4412145, 4213716, 4029148, 3855926, 3692401, 3539398, 3397144, 3263643, 3137576, 3019834, 2910726, 2808701, 2713196, 2625789, 2547068, 2475120, 2408432, 2347419, 2291674, 2238387, 2184859, 2130041, 2072591, 2010448, 1943961, 1876843, 1812392, 1751012, 1692595, 1638503, 1589509, 1544270, 1501633, 1462332, 1426768, 1393241, 1360111, 1327811, 1297181, 1267679, 1238784, 1211339, 1185875, 1161257, 1136417]
55849A136417k4605k4047k4691k6281k6935k6362k6025k6146k5463k3944k2909
55838H59009k2379k0952j8576j6795j6066j5201j3727j2504j1762j0688r133p820
55826F83406o832n703m869n084n650n313m548m847o005o401n774n393n507n003
55812F06477l741k851k401r01K264N743Q092R111R127Q454P810P689P269N299
55798F67441K123p43k967n686r467j3483j6755j8767j9025j7551j5627j4476j3451
55785E21566j1057p532m561k726j194J52K83r16k069k108j177N49L368P109J1031
55770E10718J4784J8222K0251J9277J4754P161l029j4733k5118l1200l2747l1831
55758D66509k9669k5898k0850j6261j3082j0566q072o042m607l020j129Q7J24
$$ y = [1136417, 1111812, 1087765, 1063074, 1036793, 1009858, 983496, 957471, 931325, 905862, 881918, 859009, 836630, 815678, 797102, 780307, 764241, 749040, 735313, 722809, 711047, 700359, 691226, 683406, 676574, 670871, 666002, 660918, 655268, 649955, 645407, 640560, 634555, 628154, 622380, 616987, 611480, 606477, 602736, 599885, 597484, 596583, 598847, 604590, 612682, 621793, 630920, 639374, 647184, 654873, 662142, 667441, 669564, 668821, 665854, 660168, 650701, 637218, 620463, 601696, 582671, 565120, 549493, 535017, 521566, 510509, 502977, 498416, 495690, 494496, 494648, 494931, 494015, 491946, 489838, 488661, 489210, 492578, 499687, 510718, 525502, 543724, 563975, 583252, 598006, 605167, 602138, 587405, 562287, 531087, 498340, 466509, 436840, 410942, 390092, 373831, 360749, 350183, 342111, 336069, 331462, 328442, 327313, 327400, 327524]
55745C27524k82n24r23j696k444k964l335l009j358O89J215r7j562k092k410l131
55729C03601l457k773j964k115l123m438n964p365p649o401m473k805j391m7R70
55714B50606J639K534L857N067N935O850P641P344N705L768K258N61j940m584
55700B97241o321p011p085o748o178n715n295m497l504l018k922k178n20J001
55686B37250J728K299L126L430K814K440L314M533M664L985L825M296M216L065
55672B84985J555L24p55j753k233j913j201o19j78M83J439K196K168J467J000
55657B86965J447K376K854K674K335J944J028n17k174l663n202o751p739p885
55643B67692p540p040o408n890n896o226o199n738n522n700n473m351k984k248
$$ y = [327524, 327242, 326718, 325795, 324099, 321655, 318691, 315356, 312347, 310989, 311678, 312893, 312796, 311234, 309142, 306732, 303601, 300144, 297371, 295407, 293292, 290169, 285731, 279767, 272402, 264753, 258352, 253879, 251074, 249683, 249636, 250606, 252245, 254779, 258636, 263703, 269638, 276488, 284129, 291473, 297178, 300946, 303204, 303765, 301825, 297241, 290920, 283909, 276824, 270076, 263898, 258183, 252888, 248391, 244887, 241869, 238947, 236769, 236249, 237250, 238978, 241277, 244403, 247833, 250647, 253087, 256401, 260934, 265598, 269583, 273408, 277704, 281920, 284985, 286540, 286864, 286109, 284356, 282123, 280210, 279009, 278390, 278212, 278695, 280134, 282330, 284498, 285965, 286965, 288412, 290788, 293642, 296316, 298651, 300595, 301623, 301106, 298932, 295269, 290067, 283316, 275577, 267692, 260152, 253112, 246704, 240814, 234918, 228692, 222493, 216755, 211233, 205533, 200060, 195709, 192725, 190477]
55629A90477k206k364k297j747q20l06r46k229k812k372j934k140k382k131j891
55614A61900k160k469k274j900j789j679j220p10n08m52m00n86r10p12Q6N36L
55597A44756q58j131q29m45j96l23j168k234k211p48P18Q40Q5l87m84o74o57N3
55579A34107Q74Q66K34o1J55L23L10M19N38M41O09J569K692K765J727P03M00M87
55561A49158N20N44N91N03L42L01J79l19q36o63J66Q11P39L49L53J028K149L222
55543A59137L795L749L310K586J476K19m66j98N29J119J545J824J450J18j517
55528A78676k608l256m035m812m944m398l813l584l672m056m633m830m169l042
55514A22824k303k199k355k490k462j931q24J91N23O23J201J830J440P1j089j349
$$ y = [190477, 188271, 185907, 183610, 181863, 181043, 180737, 179791, 177562, 174750, 172378, 170444, 168304, 165922, 163791, 161900, 159740, 157271, 154997, 153097, 151308, 149629, 148409, 147699, 147191, 146739, 146339, 145753, 144843, 144131, 144217, 144753, 144756, 143898, 142767, 141938, 141493, 141297, 140974, 139806, 137572, 135361, 134613, 135331, 136171, 136256, 135869, 135385, 134711, 134054, 134107, 134981, 135847, 136081, 136020, 136175, 136498, 136808, 137227, 137765, 138206, 138815, 140384, 143076, 145841, 147568, 148271, 148671, 149158, 149678, 150222, 150813, 151316, 151658, 151959, 152138, 151819, 150983, 150320, 150486, 151297, 152036, 152385, 152738, 153766, 155915, 159137, 162932, 166681, 169991, 172577, 174053, 174272, 173806, 173608, 174137, 175256, 176801, 178625, 180075, 180193, 178676, 176068, 172812, 168777, 163965, 159021, 154623, 150810, 147226, 143554, 139498, 134865, 130035, 125866, 122824, 120521, 118322, 115967, 113477, 111015, 109084, 108260, 108451, 108974, 109597, 110798, 112628, 114068, 114139, 113050, 111701]
55498A11701j125q46m76k90q49j831j944o74Q50J340R73Q24J346K113K603K497
55482A16212J603J24j120j344o84k8N8j70j84N8J73n5l66m50m35o88j190j459
55464A10055j186o00r4J78J93J7o1K70P29O50K5l30q0K5n50j014m22P26J249J138
55444A10918J326J850J628K83j170j765j625j166l26P62J255N88o33j337j185
55429A09403n22L71J303J819J579R51O19O51M62j86o93l71N80J230J058O07P51
55412A19612J508J985J530N07l13o81p47m88J43O96N69q1m69l45l59r71j576j269
55394A19251k09M29p6j062j321o61j02m42j082q39L83J366J145J01q13j268j490
55377A13310j545j329r67o65l26J74N54M87J55n8j76m05n20j30N71R96J031J060
$$ y = [111701, 110576, 109730, 109254, 108964, 108115, 106284, 104340, 103666, 104516, 105856, 106829, 107653, 108999, 111112, 113715, 116212, 117815, 117939, 116819, 115475, 114791, 114763, 114821, 114651, 114467, 114525, 114698, 114643, 114277, 113827, 113392, 112704, 111514, 110055, 108869, 108269, 108175, 108353, 108546, 108563, 108502, 108772, 109501, 110151, 110176, 109846, 109766, 109791, 109241, 108227, 107805, 108531, 109780, 110918, 112244, 114094, 115722, 116005, 114835, 113070, 111445, 110279, 109953, 110715, 111970, 112558, 111925, 110588, 109403, 108881, 109252, 110555, 112374, 113953, 114904, 115523, 116174, 116636, 116450, 115757, 115386, 115966, 117196, 118254, 118861, 119612, 121120, 123105, 124635, 125142, 124829, 124148, 123401, 122913, 123056, 123752, 124321, 124240, 123771, 123426, 123067, 122096, 120520, 119251, 119042, 119471, 119395, 118333, 117012, 116351, 116249, 115807, 114725, 113886, 114269, 115635, 116780, 116881, 116068, 114800, 113310, 111765, 110436, 109469, 108804, 108478, 108652, 109206, 109693, 109848, 109790, 109614, 109209, 108689, 108559, 109130, 110126, 111157, 112217]
55359A12217J112P35j34q18p50k01J41Rk94m14l58l88o18q22p22m22k54k35p2
55340A07712J80O6m78q53p16m93m99l02M01R44O75K13N75J429J451L44p33q62
55322A09054l73R3M65P31M90l90j285j492r89j75O71J397J847J995J851J215l6
55305A15069j393k041j844j401j016l44O44J169O95j67l91J24N59L42k08l65J16
55288A09548P47Q44L49q1J01O06Q08O28M34K43k13p20o38J07P59P71M89M93P73
55269A16048R36P35J37p62j585j794j263m44K17O45Q39O32Q6k56Q0Q58J350J101
55251A17560L38k95l70j07j21o60j270j459j310j077o02K54R42Q11K09J23O60
55234A13626Q45J04q42j016l69M14Q21P56L63o1l04n42j064j642j677j059k96
$$ y = [112217, 113329, 114064, 113930, 113112, 112362, 112161, 112302, 112311, 112017, 111603, 111245, 110857, 110239, 109417, 108695, 108273, 108019, 107784, 107712, 107892, 107958, 107480, 106627, 105911, 105418, 104919, 104617, 105018, 105962, 106637, 106850, 107425, 108854, 110305, 110649, 109916, 109054, 108681, 108774, 109239, 109970, 110460, 110070, 108785, 107293, 106304, 106129, 106800, 108197, 110044, 112039, 113890, 115105, 115069, 113676, 111635, 109791, 108390, 107374, 107030, 107674, 108843, 109538, 109371, 108980, 109104, 109663, 110005, 109797, 109432, 109548, 110295, 111139, 111488, 111407, 111508, 112114, 112922, 113550, 113984, 114227, 114014, 113294, 112656, 112763, 113522, 114293, 114782, 115275, 116048, 116984, 117719, 117856, 117094, 115509, 113715, 112452, 112008, 112225, 112870, 113709, 114341, 114427, 114171, 114251, 115109, 116459, 117560, 117898, 117603, 117233, 117126, 117005, 116345, 115075, 113616, 112306, 111229, 110627, 110881, 111823, 112634, 112843, 112966, 113626, 114471, 114575, 113733, 112717, 112348, 112762, 113583, 114339, 114702, 114641, 114337, 113795, 112731, 111089, 109412, 108353, 108057]
55217A08057L24J006J747K010J458M55m70j115j366j077m46K4K62P32J560K163
55201A15324K063J494Q99L34k39o57q65j035j118q28k94r1l32l97J11P92J173
55184A16334J265J099M52m74r11n92k14k85l39R1M79K21k74l00r9l01o35k86O73
55165A15904J219Q00l3m09M5J154K274K554J662K33q12j231j252q43J34J228J643
55148A24270J187M42n5k53k77j48P5K99M32K37n98j856k554j826J0J691K247J661
55130A24984O17r6j04K40K27k61n58k60Q5j94q66j236j171j051j018r71r70r74
55112A16423n12O38J711J737Q62Q9q9QJ92O60J245J324O76j60o22o03k05M11Q65
55093A24650Q56O92R17J431J595J234Q54P52O40L00l9j67j49N0N38R76P38j25
$$ y = [108057, 108381, 109387, 111134, 113144, 114602, 115057, 114587, 113472, 112106, 111029, 110583, 110607, 110869, 111601, 113161, 115324, 117387, 118881, 119780, 120114, 119875, 119218, 118353, 117318, 116200, 115372, 115078, 114987, 114655, 114258, 114369, 115161, 116334, 117599, 118698, 119150, 118676, 117765, 117173, 116959, 116674, 116335, 116426, 116905, 117126, 116852, 116552, 116453, 116152, 115517, 115231, 115904, 117123, 117923, 117890, 117481, 117526, 118680, 120954, 123508, 125170, 125403, 124591, 123360, 122108, 121265, 121399, 122627, 124270, 125457, 125899, 125844, 125591, 125314, 125166, 125241, 125540, 125972, 126209, 125611, 123755, 121201, 119375, 119385, 121076, 123323, 124984, 125601, 125505, 125401, 125641, 125868, 125607, 125049, 124789, 124874, 124680, 123814, 122578, 121407, 120356, 119338, 118367, 117397, 116423, 115911, 116549, 118260, 119997, 120859, 120948, 120859, 120867, 121059, 121719, 122964, 124288, 124964, 124804, 124182, 123579, 123374, 123785, 124650, 125506, 126198, 127115, 128546, 130141, 131375, 132229, 132981, 133621, 133921, 133882, 133715, 133566, 133616, 134154, 135130, 135868, 135743]
55075A35743p51n69M3M97P32Q76P94M64K68L83L11m19j412j838j517j014p54n64
55057A31273j73K41K73j04m23k28L04N13P2n68p60m96k77l01k66JK15R6j92k65
55037A28935L0N33Q98P92K15l41m05k22m51j116j393p72R9J97m82r44n30L67R70
55018A26380J106J140J244J110N05l27r44j143q61M0J408K354J876J51j364j455
55002A31220m20N53Q01N09M1l59m14k9L68K96k6P7O64J044P69K52Q3K32K44m8
54982A35857m15n93n47l31N6O24J233J535J277O84L40N04P74O50J97j11k0L36
54964A42050O64O98L57K5L18J201J756J354O52P24J408J479M27q28j232q41m42
54947A49770m99q73j184j087n54q0k54r50j290o47O39J749K281K450K638L016
$$ y = [135743, 134992, 134423, 134466, 134963, 135695, 136571, 137365, 137829, 138097, 138480, 138791, 138372, 136960, 135122, 133605, 132591, 131837, 131273, 131100, 131341, 131614, 131510, 131087, 130859, 131163, 131676, 131748, 131180, 130420, 129924, 129647, 129346, 129080, 129081, 129296, 129392, 129200, 128935, 128965, 129498, 130396, 131188, 131403, 131062, 130657, 130435, 129984, 128868, 127475, 126703, 126802, 126999, 126517, 125573, 125043, 125410, 126380, 127486, 128626, 129870, 130980, 131485, 131158, 130214, 129071, 128210, 128250, 129658, 132012, 133888, 134039, 132675, 131220, 130800, 131353, 132154, 132663, 132704, 132345, 131931, 131902, 132270, 132566, 132540, 132617, 133281, 134325, 135094, 135346, 135429, 135661, 135905, 135857, 135442, 134849, 134302, 133971, 134027, 134651, 135884, 137419, 138696, 139380, 139720, 140224, 140998, 141648, 141845, 141734, 141714, 142050, 142714, 143412, 143769, 143794, 144112, 145313, 147069, 148423, 149075, 149799, 151207, 152686, 153113, 152285, 151053, 150212, 149770, 149271, 148398, 147214, 146127, 145573, 145493, 145239, 144289, 142999, 142352, 142991, 144740, 147021, 149471, 152109, 155125]
54931A55125L445L627L543L680M559O012P252P766P784P783P865P725P002N526
54917B38694L455J193j007l331n890q129r133q658p464o477n994n791n576n236
54903A70656m775m218l448k309j026k62l09n08MJ060J708J510J010Q47J209K137
54887A63286L660N312O305O477O507O922P492P857Q088Q219P852O644M753K418
54873B51792l37l240n576o933p694q318q587q061o919n812n182n097n389n598
54859A69049n137l991k899k439k326k026j607j438j485j501j577j834j872j281
54845A37636m39j15l31l93k1K89J85L9K95P64R42O95L10Q2P0J70K13O5k48n35
54825A39673o19n23m82p29j211j513j203l06O76J220J159O61R4r2K80P62O92Q9
$$ y = [155125, 158570, 162197, 165740, 169420, 173979, 179991, 187243, 195009, 202793, 210576, 218441, 226166, 233168, 238694, 242149, 243342, 242335, 239004, 233114, 224985, 215852, 207194, 199730, 193253, 187259, 181468, 175892, 170656, 165881, 161663, 158215, 155906, 154880, 154618, 154309, 153801, 153805, 154865, 156573, 158083, 159093, 159940, 161149, 163286, 166946, 172258, 178563, 185040, 191547, 198469, 205961, 213818, 221906, 230125, 237977, 244621, 249374, 251792, 251455, 248215, 242639, 235706, 228012, 219694, 211107, 203046, 196127, 190315, 185133, 180036, 174647, 169049, 163912, 159921, 157022, 154583, 152257, 150231, 148624, 147186, 145701, 144200, 142623, 140789, 138917, 137636, 137197, 137082, 136751, 136358, 136337, 136626, 136811, 136850, 137145, 137909, 138851, 139546, 139856, 139938, 140008, 140178, 140391, 140456, 140208, 139673, 139054, 138531, 138049, 137320, 136109, 134596, 133393, 133087, 133763, 134983, 136142, 136803, 136897, 136805, 137085, 137847, 138539, 138628]
54807A38628k61J70Q43Q49O6p57r20m06L25Q01Q44O53O19Q56J039Q24K99j81m07
54788A43884l55M0Q08J691K299K487K434K338K251K183K211K406K783L338M106
54773A74904N115O197O971P160P071P419Q400R159Q640O835M687K810R26j340
54759B54954l715n651o912p559p666p397o990o461n689m864m470m550m551m170
54745A74309l793l711l456k514j239m12j58J09P71J602K221K505K583K730L220
54730A74767M033M843N495O241P288Q370R029Q999Q094O122L339O31j266k554
54716B43431l977n802p539q530q469p588o551n953n722n293m530l963l811l482
54702A62221k490j323p39p15p01n46m41l41j82k55o92r20m71Q4o9o18n97K7L40
$$ y = [138628, 138367, 138537, 139380, 140229, 140295, 139538, 138618, 138212, 138537, 139338, 140182, 140835, 141454, 142310, 143349, 144173, 144472, 144291, 143884, 143529, 143569, 144377, 146068, 148367, 150854, 153288, 155626, 157877, 160060, 162271, 164677, 167460, 170798, 174904, 180019, 186216, 193187, 200347, 207418, 214837, 223237, 232396, 241036, 247871, 252558, 255368, 256294, 254954, 251239, 245588, 238676, 231117, 223451, 216054, 209064, 202603, 196914, 192050, 187580, 183030, 178479, 174309, 170516, 166805, 163349, 160835, 159596, 159184, 159026, 159135, 159906, 161508, 163729, 166234, 168817, 171547, 174767, 178800, 183643, 189138, 195379, 202667, 211037, 220066, 229065, 237159, 243281, 246620, 247251, 245985, 243431, 239454, 233652, 226113, 217583, 209114, 201526, 194975, 189022, 183300, 178007, 173477, 169514, 165703, 162221, 159731, 158408, 157669, 156954, 156253, 155707, 155266, 154925, 154743, 154488, 153796, 152876, 152405, 152489, 152420, 151802, 151205, 151232, 151572]
54683A51572K5k38q5j4k79l82m6J39l13r38j014n59r8J00O2k09o68j057j161r83
54663A43854n75KM88O41P06J103J545J175j32j334j458o81K56J039J627J709J118
54646A51083M24K96M70Q9r49j748j658j100q16q24n62J63Q68J062Q16M67O1n24
54628A47618j022r12k49J71j50o71n85k6K24m2k48l8L26O42J066J555J698J408
54610A50765J127R81M89m81j125o93M20J244J440J340J128P42L85L33L20j64r35
54593A57316j170n75Q8n3r21j661j626q77J29R91J529J705J496R37K44k36l67
54576A56949l60m62n81m38m2K89L56L22L47K66j49p16r07m42L42Q88J027R75Q07
54557A58471L33l83p63l35O02J318J509J424J228P43j1n16k84N26J264J430R82
$$ y = [151572, 151597, 151359, 151274, 151260, 150981, 150599, 150553, 150692, 150379, 149441, 148427, 147868, 147770, 147870, 147932, 147723, 147055, 145998, 144837, 143854, 143279, 143281, 143769, 144410, 145116, 146219, 147764, 148939, 148807, 147473, 146015, 145334, 145590, 146629, 148256, 149965, 151083, 151507, 151803, 152273, 152362, 151413, 149665, 148007, 146907, 146091, 145267, 144705, 144868, 145736, 146798, 147614, 148081, 148142, 147618, 146596, 145684, 145435, 145606, 145456, 144785, 144200, 144174, 144398, 144356, 144108, 144070, 144396, 145038, 146104, 147659, 149357, 150765, 151892, 152873, 153362, 152881, 151756, 151063, 151483, 152727, 154167, 155507, 156635, 157377, 157762, 158095, 158415, 158251, 157316, 156146, 155571, 155659, 155606, 154685, 153024, 151398, 150521, 150650, 151641, 153170, 154875, 156371, 157308, 157552, 157316, 156949, 156589, 156127, 155546, 155108, 155066, 155355, 155711, 156033, 156380, 156646, 156497, 155781, 154874, 154432, 154774, 155662, 156689, 157664, 158471, 158804, 158421, 157658, 157323, 157925, 159243, 160752, 162176, 163404, 164147, 164136, 163620, 163336, 163862, 165126, 166556, 167538]
54540A67538K59k13o9N55J048R48M23K4K2J64M8m05q07p30k98k09r13j836j925
54521A63624r52J74N90M49L60K81k91j265j800j381n41j51l63o18n01j61J46N21
54503A58121J133J689J558N50o86j233q22J8N82N62N3o21j058r36l37K30L07r
54485A59101k21r7J9k85q32r37k27Q77J644J814J672J473J214R37Q17Q28P27N32
54467A69056O01J005J240R57N55N93R14R36N31Q3j94m56p42q84q45p02l50K79
54449A72577P47M83l72r98r36n71m26n35o34n58k45K24N13L51L0Q7M58N29J20
54430A70844k91m71q21j466j705r47L25J128J146Q28O24O51Q61J078J044P70O25
54413A74223Q05J036J038R35Q50N91J20r5J93M76J99l20l89j9K77M39P48R82N48
$$ y = [167538, 167797, 167584, 167515, 168070, 169118, 170066, 170489, 170513, 170535, 170699, 170747, 170342, 169535, 168805, 168507, 168298, 167385, 165549, 163624, 162672, 162846, 163436, 163885, 164245, 164526, 164235, 162970, 161170, 159789, 159248, 159097, 158734, 158116, 157615, 157454, 157600, 158121, 159254, 160943, 162501, 163051, 162365, 161132, 160310, 160328, 160910, 161472, 161525, 160904, 159846, 158910, 158573, 158803, 159110, 159101, 158880, 158783, 158802, 158517, 157685, 156748, 156521, 157398, 159042, 160856, 162528, 164001, 165215, 166152, 166969, 167797, 168524, 169056, 169657, 170662, 171902, 172859, 173414, 174007, 174921, 175857, 176388, 176471, 176277, 175821, 175079, 174195, 173350, 172648, 172298, 172577, 173324, 173807, 173435, 172437, 171501, 170930, 170504, 169969, 169335, 168777, 168532, 168756, 169269, 169620, 169650, 169737, 170195, 170724, 170844, 170553, 170082, 169261, 167795, 166090, 165143, 165468, 166596, 167742, 168570, 169194, 169845, 170706, 171784, 172828, 173598, 174223, 175028, 176064, 177102, 178037, 178887, 179478, 179598, 179503, 179696, 180172, 180371, 180051, 179662, 179643, 179920, 180359, 181107, 182089, 182637]
54394A82637l58p72l02K89L29K07N84J215J323Q00K65O4j20m98p06m53j48m11
54376A83945j082j284n16P29J638J959J969J828J522J298J632K628L786M474M467
54361B08993M010L558L441L496L098J889L49p65j430k236l308m045m087l767l373
54346B05823k692j689r99j130j743k234k538k746k466j403k42l7p83j354r41P3
54330A82899P62O84R3m84o77m80j28K67P42J154J124N62r3m08m08k37J36N21L20
54311A86349o41j567j546o87K18P28P81J51j213k487k577j434l2Q91J347J457
54295A79738J198Q11O62O18L22J22P73K085K822K331J340P49M39j72j082j824
54279A90932k100j781p90M36R51L82l87k39P45J479J252L45o18j299j581j300
$$ y = [182637, 182279, 181507, 181205, 181494, 181823, 182030, 182614, 183829, 185152, 185952, 186217, 186281, 186161, 185663, 184957, 184504, 184356, 183945, 182863, 181579, 181063, 181792, 183430, 185389, 187358, 189186, 190708, 192006, 193638, 196266, 200052, 204526, 208993, 213003, 216561, 220002, 223498, 226596, 228485, 228834, 228069, 226639, 224403, 221095, 217050, 212963, 209196, 205823, 203131, 201442, 200443, 199313, 197570, 195336, 192798, 190052, 187586, 186183, 185941, 185904, 185121, 183767, 182826, 182899, 183661, 184345, 184438, 183954, 183277, 182797, 182669, 182936, 183678, 184832, 185956, 186518, 186425, 186017, 185609, 185372, 185508, 186029, 186349, 185708, 184141, 182595, 181908, 182126, 182854, 183635, 183786, 182573, 180086, 177509, 176075, 176043, 176934, 178281, 179738, 180936, 181747, 182409, 183027, 183349, 183471, 184244, 186329, 189151, 191482, 192822, 193571, 194010, 193838, 192756, 190932, 188832, 187051, 186261, 186697, 187648, 188030, 187643, 187404, 188149, 189628, 190880, 191225, 190607, 189308, 187727, 186427]
54263A86427l08J226K632L067K309J161O73Q94R14J80q03j312j322j183r55n52
54247A93048j95j63l31m27m22l52n1M54O72K78k63k60J88M29L22M15R43J315Q81
54228A96481j88j063j097l52N85J129J095P16L51K58N00Q47Q42K54m92p10m17
54211A98739l67r72j682j838j634j638j817j633r37r9O16J184J381Q83j45j027
54195A89014j322j091m58N34J540J907J358L37m62o87l38L64R65J011N01j38o22
54178A92413r96j233j108o39k57j57K9N83J088R38K19m23o30n86n29m74m66o56
54160A87116r49r71n40L3L23K88K72N48J039J375J185M12n45j115j069p12n00
54143A86190n17m48o9M30O71N50L48L14L89M02M81R13J603J966J609R53P90J261
$$ y = [186427, 186119, 187345, 189977, 193044, 195353, 196514, 197187, 198081, 198995, 199175, 198372, 197060, 195738, 194555, 193600, 193048, 192853, 192690, 192359, 191932, 191510, 191158, 191107, 191561, 192233, 192511, 192248, 191988, 192176, 192605, 192927, 193342, 194285, 195600, 196481, 196293, 195230, 194133, 193781, 194366, 195495, 196590, 197306, 197657, 197915, 198415, 199262, 200104, 200358, 199866, 199156, 198739, 198372, 197400, 195718, 193880, 192246, 190608, 188791, 187158, 186221, 186122, 186738, 187922, 189303, 190186, 190041, 189014, 187692, 186601, 186143, 186677, 188217, 190124, 191482, 191819, 191357, 190670, 190332, 190696, 191661, 192672, 193173, 193035, 192413, 191417, 190184, 189076, 188437, 188180, 188023, 188052, 188635, 189723, 190661, 190880, 190457, 189827, 189241, 188712, 188238, 187772, 187116, 186167, 185196, 184656, 184689, 185012, 185300, 185572, 186120, 187159, 188534, 189719, 190131, 189586, 188471, 187402, 186690, 186190, 185673, 185225, 185156, 185586, 186257, 186807, 187155, 187469, 187858, 188260, 188741, 189654, 191257, 193223, 194832, 195785, 196575, 197836]
54125A97836J640J302N62K33N77J121J424J568J760J815J453Q95P34J265K240
54110B16425L279M245N106N792O374P090Q047R026R785J0257J0131Q622N266Q99
54096C10344k738m582n062n176n326n400n476n742n970n745n208m956n133n239
54082B38591m977m671m500l960k597r18O3jn98j138j400j277o83J24O27O29M00
54065B13714K47K16K84L84K36l85j098j167m53L59P44R67J409J864J943J745J532
54048B22541J191O34M11J167K577L571L606L128K724K520K510K881L661M530N218
54033B62870N757O135O135N747N320N039M618L833L069K854L091L180K788K192
54019C22628J822J796J902J801J237K25r18j817k405k988l947n320o623p171o723
$$ y = [197836, 199476, 200778, 201340, 201573, 202150, 203271, 204695, 206263, 208023, 209838, 211291, 212186, 212920, 214185, 216425, 219704, 223949, 229055, 234847, 241221, 248311, 256358, 265384, 275169, 285426, 295557, 304179, 309445, 310344, 307606, 303024, 297962, 292786, 287460, 282060, 276584, 270842, 264872, 259127, 253919, 248963, 243830, 238591, 233614, 228943, 224443, 220483, 217886, 216968, 217031, 217030, 216432, 215294, 213894, 212617, 211934, 212058, 212685, 213314, 213714, 213961, 214177, 214461, 214845, 215081, 214696, 213598, 212431, 211978, 212337, 213081, 214048, 215457, 217321, 219264, 221009, 222541, 223732, 224366, 224777, 225944, 228521, 232092, 235698, 238826, 241550, 244070, 246580, 249461, 253122, 257652, 262870, 268627, 274762, 280897, 286644, 291964, 297003, 301621, 305454, 308523, 311377, 314468, 317648, 320436, 322628, 324450, 326246, 328148, 329949, 331186, 331411, 330493, 328676, 326271, 323283, 319336, 314016, 307393, 300222, 293499]
54004B93499n795n109m780m337l567k933k855l022k814k231j859j944j982j457
53990B48814o36k59o02j164j344j121r71j208j672j998j966j572r13j44N09R02
53974B34655J056J064R16O32N03R79K171L585M571N066N806P508R878J1712J2204
53959C02306J1874J1741J1716J0427O875J669l665q041j1018j2231j1522r601
53947C00530p739o540n493l968k195r33m82l83K1R23J925K554K834L281M119M824
53931B93278M712L895L221L256L711L952L721L265L044L346L965M287L947L384
53917C44984L370M036M765N053N145N597O646Q002R034R130Q184O738N364M060
53903D30108K610J274M80k4q49j852k264k058k226l263m314m473m093m103m619
$$ y = [293499, 287704, 282595, 277815, 273478, 269911, 266978, 264123, 261101, 258287, 256056, 254197, 252253, 250271, 248814, 248178, 247919, 247317, 246153, 244809, 243688, 242717, 241509, 239837, 237839, 235873, 234301, 233388, 233244, 233753, 234655, 235711, 236775, 237691, 238323, 238826, 239805, 241976, 245561, 250132, 255198, 261004, 268512, 278390, 290102, 302306, 314180, 325921, 337637, 348064, 354939, 356608, 352943, 344902, 333884, 321653, 310131, 300530, 292791, 286251, 280758, 276790, 274595, 273662, 273180, 272797, 272818, 273741, 275666, 278220, 281054, 284335, 288454, 293278, 297990, 301885, 305106, 308362, 312073, 316025, 319746, 323011, 326055, 329401, 333366, 337653, 341600, 344984, 348354, 352390, 357155, 362208, 367353, 372950, 379596, 387598, 396632, 405762, 413946, 420684, 426048, 430108, 432718, 433992, 434472, 434448, 433599, 431747, 429483, 427425, 425199, 421936, 417622, 413149, 409056, 404953, 400334]
53888D00334n179n784o810q028q639q272p388o593o111n827n522n037m538m417
53874C12189m683m772m345l892m016m418m265l401k574k426k864l374l555l251
53860B60353k628k167k207k479k374j688q26l05l19p25j149j250j011o81l34J55
53844B40365N59K95o48j385j325j022j158j250l92J084J851J479R40J031J391
53829B41815J378J079Q87P94O06L97L13L12L89O28Q66O76Ko22p08l06K55O99Q18
53810B50278O86Q94J998L527M282L858L162L071L351L439L534M150N088N704N911
53795C02933O176O622O802O323N237L853K561J710J289Q82K40l16m64n30j033
53780C42285j840k394k608k904l359l594l532l587l908m083l926l924m405m810
$$ y = [400334, 395155, 389371, 382561, 374533, 365894, 357622, 350234, 343641, 337530, 331703, 326181, 321144, 316606, 312189, 307506, 302734, 298389, 294497, 290481, 286063, 281798, 278397, 275823, 273397, 270533, 267159, 263604, 260353, 257725, 255558, 253351, 250872, 248498, 246810, 245984, 245679, 245360, 244635, 243486, 242236, 241225, 240544, 240210, 240365, 240924, 241219, 240571, 239186, 237861, 236839, 235681, 234431, 234039, 235123, 236974, 238453, 239393, 240424, 241815, 243193, 244272, 245159, 245953, 246559, 246956, 247269, 247581, 247970, 248598, 249464, 250140, 250142, 249520, 248812, 248506, 248761, 249460, 250278, 250964, 251858, 253856, 257383, 261665, 265523, 268685, 271756, 275107, 278546, 282080, 286230, 291318, 297022, 302933, 309109, 315731, 322533, 328856, 334093, 337946, 340507, 342217, 343506, 344388, 344628, 344312, 343848, 343318, 342285, 340445, 338051, 335443, 332539, 329180, 325586, 322054, 318467, 314559, 310476, 306550, 302626, 298221, 293411]
53766B93411m422l555l277l984m833m808l851k664j805j352j250j480j885k202
53752B52043k352k409k225j523m72K15J29k37j90J62J97j52k86M8L41K07N1M04
53734B43951J040J225O81j41o20m78J77R52J443J552J537J565J428R41L83K54
53718B55890O37J117J290J122Q70Q16J051J341J333J103J297K400L964M965M885
53703B84081M089L147K264J574J502K308L453L953L496K808K702L012K930K183
53689C23502J437J269J341J004L66J51N38Q95P68M64L15Np21j256q32J82N96J50
53671C30174m0Q08J786J413k75j681j645p11r8j00o6M36J102J461J364Q51L4o71
53653C34142o81M9P66P36R4m66n97m32p7M62Q60O11k33q54n16O46J827K312J975
$$ y = [293411, 288989, 285434, 282157, 278173, 273340, 268532, 264681, 262017, 260212, 258860, 257610, 256130, 254245, 252043, 249691, 247282, 245057, 243534, 243062, 243277, 243406, 243169, 242979, 243141, 243338, 243186, 242900, 242948, 243289, 243496, 243547, 243951, 244991, 246216, 246897, 246756, 246136, 245658, 245835, 246787, 248230, 249782, 251319, 252884, 254312, 255253, 255636, 255890, 256527, 257644, 258934, 260056, 260926, 261742, 262793, 264134, 265467, 266570, 267867, 270267, 274231, 279196, 284081, 288170, 291317, 293581, 295155, 296657, 298965, 302418, 306371, 309867, 312675, 315377, 318389, 321319, 323502, 324939, 326208, 327549, 328553, 328919, 329070, 329608, 330503, 331271, 331735, 332050, 332055, 331334, 330078, 329246, 329428, 330024, 330174, 330134, 330942, 332728, 334141, 333866, 332185, 330540, 329829, 329731, 329631, 329565, 330001, 331103, 332564, 333928, 334779, 334813, 334142, 333461, 333510, 334276, 335012, 335106, 334640, 334043, 333611, 333534, 333996, 334856, 335467, 335234, 334380, 333864, 334510, 336337, 338649, 340624]
53634C40624J235P26P88J179J456J581J859K387K978L682M702N698N803M766L581
53619C83045L379M119M893N212N294N229M690L608K489J786J342P83J68m6L84
53604D26375J158J744J871J784J941K440K850K725K192J781J771J898J829J598
53590D53957J426J247P47p8o49l88M57Q82K34j007j818j817j479j272j237j397
53574D47808k006k970l585l335k598k087j869j518r93p41r03j064r15p29r20j447
53558D20128j844j677q52K92J128J242Q65O22Q04J067R83O04L67N83J155J649
53542D27116J627J027L00L6L67R50J456J873K279K629K968L541M479N470O011
53527D62129N984N800N951O609P613Q700R671J0434J1062J1734J2500J3066J3041
$$ y = [340624, 341859, 342585, 343373, 344552, 346008, 347589, 349448, 351835, 354813, 358495, 363197, 368895, 374698, 379464, 383045, 386424, 390543, 395436, 400648, 405942, 411171, 415861, 419469, 421958, 423744, 425086, 425869, 426037, 425991, 426375, 427533, 429277, 431148, 432932, 434873, 437313, 440163, 442888, 445080, 446861, 448632, 450530, 452359, 453957, 455383, 456630, 457377, 457299, 456650, 456262, 456719, 457601, 457835, 456828, 455010, 453193, 451714, 450442, 449205, 447808, 445802, 442832, 439247, 435912, 433314, 431227, 429358, 427840, 426847, 426106, 425203, 424139, 423224, 422495, 421575, 420128, 418284, 416607, 415755, 416047, 417175, 418417, 419282, 419904, 420708, 421775, 422758, 423362, 423729, 424312, 425467, 427116, 428743, 429770, 430070, 430106, 430473, 431423, 432879, 434752, 437031, 439660, 442628, 446169, 450648, 456118, 462129, 468113, 473913, 479864, 486473, 494086, 502786, 512457, 522891, 533953, 545687, 558187, 571253, 584294]
53514E84294J2513J2230J2936J4506J5977J6599J6652J7068J8318J9924K1036
53503G62053K1331K1261K1501K2233K3006K3281K2973K2384K1751K1151K0733
53492A003658K0761K1240K1799K2062K1953K1563K0933K0160J9436J8804J8181
53481A230550J7727J7813J8311J8386J7460J6153J5583J5969J6497J6528J6248
53470A417225J5998J5575J4590J3014J1038Q652N816K820R8k238m406o576q718
53457A482888j0761j2572j3816j4113j3573j2926j2926j3688j4757j5788j6840
53446A331128j8013j9076j9699j9862j9766j9508j9144j8913j8985j9014j8368
53435A120780j6811j4673j2249r617p022m930l442k148r19j84n8K39J429L106
$$ y = [584294, 596807, 609037, 621973, 636479, 652456, 669055, 685707, 702775, 721093, 741017, 762053, 783384, 804645, 826146, 848379, 871385, 894666, 917639, 940023, 961774, 982925, 1003658, 1024419, 1045659, 1067458, 1089520, 1111473, 1133036, 1153969, 1174129, 1193565, 1212369, 1230550, 1248277, 1266090, 1284401, 1302787, 1320247, 1336400, 1351983, 1367952, 1384449, 1400977, 1417225, 1433223, 1448798, 1463388, 1476402, 1487440, 1496092, 1501908, 1504728, 1504826, 1502588, 1498182, 1491606, 1482888, 1472127, 1459555, 1445739, 1431626, 1418053, 1405127, 1392201, 1378513, 1363756, 1347968, 1331128, 1313115, 1294039, 1274340, 1254478, 1234712, 1215204, 1196060, 1177147, 1158162, 1139148, 1120780, 1103969, 1089296, 1077047, 1067430, 1060408, 1055478, 1052036, 1049888, 1048969, 1048785, 1048727, 1048966, 1050395, 1053501]
53421A053501M315M901N532O628P987R435J1060J2770J4224J5357J6416J7452
53409A179578J8210J8633J8997J9595K0602K2161K4031K5482K6175K7061K9424
53398A429949L3025L6168L7864L8983M0809M3327M5583M7068M8034M8921N0094
53387A899825N1817N3852N5425N5978N5739N5177N4306N2990N1509N0251M9159
53376B486028M7906M6377M4487M1887L8402L4495L0759K7104K3093J8815J4814
53365B854167J1211P468K974k525r011j6170k3347k9979l6022m1578m6250m9398
53353B621540n1005n1735n2144n2286n2077n1572n0749m9480m7797m5847m3623
53342B073225m1127l8791l7281l6864l7294l8171l8964l8846l7283l4829l2641
$$ y = [1053501, 1057816, 1062717, 1068249, 1074877, 1082864, 1092299, 1103359, 1116129, 1130353, 1145710, 1162126, 1179578, 1197788, 1216421, 1235418, 1255013, 1275615, 1297776, 1321807, 1347289, 1373464, 1400525, 1429949, 1462974, 1499142, 1537006, 1575989, 1616798, 1660125, 1705708, 1752776, 1800810, 1849731, 1899825, 1951642, 2005494, 2060919, 2116897, 2172636, 2227813, 2282119, 2335109, 2386618, 2436869, 2486028, 2533934, 2580311, 2624798, 2666685, 2705087, 2739582, 2770341, 2797445, 2820538, 2839353, 2854167, 2865378, 2872846, 2875820, 2873295, 2864284, 2848114, 2824767, 2794788, 2758766, 2717188, 2670938, 2621540, 2570535, 2518800, 2466656, 2414370, 2362293, 2310721, 2259972, 2210492, 2162695, 2116848, 2073225, 2032098, 1993307, 1956026, 1919162, 1881868, 1843697, 1804733, 1765887, 1728604, 1693775, 1661134]
53331A661134l1072k9442k7322k5135k3154k0789j7649j4616j2947j2646j2604
53320A433758j2188j1910j2421j3570j4691j5313j5361j5009j4543j4114j3542
53309A281096j2604j1448j0403r381p948o055m273l008j965p02O91J894L044M502
53295A223440O117P348Q178R358J1435J4035J6411J8309J9945K1405K2574K3440
53283A401995K4045K4216K3810K3100K2502K1918K0859J9259J7634J6224J4558
53272A630120J2154R192O139L157L28j976l582n162p676j1169j4638j7197j8918
53259A580772k0483k2357k4446k6242k7215k7398k7539k8328k9454k9856k9075
53248A288379k7834k7099k6969k6799k6056k4714k3083k1674k1044k1343k2098
$$ y = [1661134, 1630062, 1600620, 1573298, 1548163, 1525009, 1504220, 1486571, 1471955, 1459008, 1446362, 1433758, 1421570, 1409660, 1397239, 1383669, 1368978, 1353665, 1338304, 1323295, 1308752, 1294638, 1281096, 1268492, 1257044, 1246641, 1237260, 1229312, 1223257, 1218984, 1215976, 1214011, 1213309, 1214000, 1215894, 1218938, 1223440, 1229557, 1236905, 1245083, 1254441, 1265876, 1279911, 1296322, 1314631, 1334576, 1355981, 1378555, 1401995, 1426040, 1450256, 1474066, 1497166, 1519668, 1541586, 1562445, 1581704, 1599338, 1615562, 1630120, 1642274, 1651466, 1657605, 1660762, 1661090, 1659114, 1655532, 1650370, 1642694, 1631525, 1616887, 1599690, 1580772, 1560289, 1537932, 1513486, 1487244, 1460029, 1432631, 1405092, 1376764, 1347310, 1317454, 1288379, 1260545, 1233446, 1206477, 1179678, 1153622, 1128908, 1105825, 1084151, 1063107, 1041764, 1019666]
53237A019666k2710k3046k3219k2993k1945k0288j8914j8337j7919j6672j4620
53226G99003j2813j1961j1517j0531q973p705p277p381p544p791q258q717q997
53213F79538r512j0766j2491j3885j4628j5067j5392j5281j4517j3320j1948j0467
53201E22264r173q627q847r036q545p749p408p564p700p657p822q415r156r594
53187D04971r398q497p327o703o869o907n786l861k550k466k762k578k238k427
53173C34602k948l094k818k675k800k676k097j620j814k487k921k692k033j507
53159C00420j448j688j760j386p58k38O3K44K42k09j104j919k027j348m52L3l7
53142B86628l27n30o49p75q65q75r51j161j140m28P93J741K001J992K131K060
$$ y = [1019666, 996956, 973910, 950691, 927698, 905753, 885465, 866551, 848214, 830295, 813623, 799003, 786190, 774229, 762712, 752181, 743208, 735503, 728226, 720845, 713301, 705510, 697252, 688535, 679538, 670026, 659260, 646769, 632884, 618256, 603189, 587797, 572516, 557999, 544679, 532731, 522264, 513091, 504464, 495617, 486581, 478036, 470287, 462879, 455315, 447615, 439958, 432136, 423721, 414565, 404971, 395573, 387076, 379749, 373046, 366177, 359270, 353484, 349623, 347073, 344607, 341845, 339267, 337029, 334602, 331654, 328560, 325742, 323067, 320267, 317591, 315494, 313874, 312060, 309573, 306652, 303960, 301927, 300420, 298972, 297284, 295524, 294138, 293380, 293142, 293205, 293449, 293691, 293482, 292378, 290459, 288432, 287084, 286632, 286665, 286628, 286301, 285771, 285122, 284347, 283482, 282607, 281656, 280495, 279355, 278927, 279720, 281461, 283462, 285454, 287585, 289645]
53126B89645J226nn91r4Q87J641K092K429K577K472K378K497K533K078J256N89
53110C13610K96N1n80j634k639k857j981p57n63j847l324l308j733j78R2n50r53
53093B91145p14l38l44p35j194j347r56j76M28M31P3k6L72Q74R46M24m42j214
53075B87207j545j378r51n20j24K24L45J32j54j59L5L3k52m65l70j31L1J71L11
53056B82440K74K9r4J01L00J64m5J78P53J078R11O20M81K48l31r58j155q65l84
53037B83745J12O48J150J388J223P97M19L65O55R82J036R31J025J163O00r47k467
53020B92825k583j191L65Q94N02Mk31l84n71o63o29n54m01m1M97J082J708K337
53002B92966K581K011Q93J18K40Q36J128R41O85O20O14O32R18J457J696J173K55
$$ y = [289645, 290871, 290866, 290275, 290181, 291068, 292709, 294801, 297230, 299807, 302279, 304657, 307154, 309687, 311765, 313021, 313610, 313906, 313957, 313377, 311743, 309104, 306247, 304266, 303509, 302946, 301099, 297775, 294467, 292734, 292556, 292648, 292098, 291145, 290431, 290093, 289749, 289014, 287820, 286473, 285517, 285341, 285769, 286200, 286273, 286247, 286619, 287493, 288439, 288863, 288421, 287207, 285662, 284284, 283333, 282813, 282689, 282913, 283258, 283390, 283236, 283077, 283112, 283145, 282893, 282428, 282058, 281927, 281958, 282129, 282440, 282714, 282743, 282649, 282750, 283050, 283214, 283169, 283347, 284100, 285178, 286089, 286709, 287190, 287438, 287107, 286149, 284994, 284129, 283745, 283857, 284505, 285655, 287043, 288266, 289063, 289482, 289847, 290502, 291484, 292520, 293451, 294476, 295639, 296239, 295292, 292825, 290242, 289051, 289416, 290310, 290812, 290816, 290585, 290201, 289630, 288967, 288338, 287784, 287383, 287342, 287839, 288921, 290629, 292966, 295547, 297558, 298451, 298569, 298809, 299645, 300773, 301714, 302399, 303019, 303633, 304265, 305183, 306640, 308336, 309509, 309764]
52985C09764j86J94Q56J135R52O10K82J0k7L83J138J928K537K820K497J502M34
52968C26829J47O93J207J054O12N51Q12Q63O32N23O03M15k33q73r84o48l28l22
52950C31553o70j315k064k503k339j743j180q81p08m75k29j46k64m15l77p3L64
52933C16535O78O46K57k51n60n85n80q21j241j483j389j152r22n16K24R50J103
52916C10893O00r4n78q73j076j028o02q3N1k99p22p47l13K44N79O41N80M80K57
52897C07910j02m16m91l23jN00J145J653J700J376J075R49P58L12k07n95r23j277
52879C13043j401r73j22N82P09L73N0J16N99J250J767K020K073K088K178K308
52863C26660K334K111J578P08n43j995l004k897j895j212j747k949l539l165k637
$$ y = [309764, 309578, 309772, 310628, 311763, 312715, 313325, 313607, 313617, 313590, 313973, 315111, 317039, 319576, 322396, 324893, 326395, 326829, 326976, 327669, 328876, 329930, 330542, 331093, 331905, 332768, 333400, 333923, 334526, 334941, 334708, 333835, 332851, 332203, 331875, 331553, 330883, 329568, 327504, 325001, 322662, 320919, 319739, 318858, 318150, 317675, 317446, 317300, 317036, 316621, 316244, 316171, 316535, 317213, 317859, 318116, 317865, 317305, 316720, 316140, 315319, 314078, 312595, 311206, 310054, 309132, 308616, 308840, 309790, 310893, 311493, 311399, 310821, 309948, 308872, 307844, 307242, 307159, 307210, 306911, 306189, 305442, 305129, 305373, 305952, 306593, 307173, 307653, 307910, 307808, 307392, 306901, 306578, 306577, 307077, 308222, 309875, 311575, 312951, 314026, 314975, 315733, 316045, 315838, 315243, 314320, 313043, 311642, 310669, 310547, 311129, 311838, 312211, 312261, 312377, 312976, 314226, 315993, 318013, 320086, 322174, 324352, 326660, 328994, 331105, 332683, 333391, 332848, 330853, 327849, 324952, 323057, 321845, 320098, 317149, 313610, 310445, 307808]
52848C07808k532k456j996j614j917k588k772k296j768j607j608j469j178o97
52834B81310J30J140J707J391M85l27o58n77k66J78O60J022J161J087Q45M18j89
52817B89517p70r31m40M26J038J135J203J913L163L945L317J353r69k708l555
52802B97637l690l376k869k468k310k165j714j081q04j132j602j578r73k17L21
52787B71979N94P10Q23J067J293J081L99m9L18R35P80k8k65N13J170O62m27q31
52769B80724m23m4k2N8K46N3n26p72l54J46J41k06m61n81n77j81O67J471J804
52750B81163J971K399K766K364J203J13k46J01Q94J906K603K235Q36l48p0J417
52734C01307K627K591J810J337J435J555J277Q15O08P17P32K16p74j609j754j485
$$ y = [307808, 305276, 302820, 300824, 299210, 297293, 294705, 291933, 289637, 287869, 286262, 284654, 283185, 282007, 281310, 281440, 282580, 284287, 285678, 286163, 285836, 285178, 284601, 284335, 284513, 285173, 286195, 287356, 288443, 289288, 289706, 289517, 288747, 287816, 287376, 287802, 288840, 289975, 291178, 293091, 296254, 300199, 303516, 304869, 303900, 301192, 297637, 293947, 290571, 287702, 285234, 282924, 280759, 279045, 277964, 277160, 276028, 274426, 272848, 271875, 271658, 271979, 272573, 273283, 274106, 275173, 276466, 277547, 277946, 277897, 278215, 279150, 279930, 279902, 279637, 280150, 281320, 281982, 281555, 280724, 280301, 280257, 280235, 280293, 280539, 280592, 280066, 279294, 278940, 279086, 279227, 279021, 278560, 277979, 277402, 277221, 277888, 279359, 281163, 283134, 285533, 288299, 290663, 291866, 291979, 291733, 291834, 292728, 294634, 297237, 299472, 300308, 299960, 299890, 301307, 303934, 306525, 308335, 309672, 311107, 312662, 313939, 314754, 315362, 316079, 316811, 317027, 316253, 314644, 312890, 311405]
52718C11405j585k182k464j855r79p40r15n57L82R09N25n0n2L66P73J193J625
52701C05799J597R36L43M53Q67Q90O82P85R67N95j73n45l97l34n44n78l24k54
52683C10765n16o95o55p27q31l96M67O71l14j480j561o57J55L35J99R8R3L11R07
52664C06169J623J909J564R32M28J94K39O00J226J899K375K611K779K990K928
52649C30466K043L31j284j830j437j112j324j467r57j50K53K11K08L72L48m2m21
52632C24208k57O81K139L574M513M854M673L845K189kk018l491m672n748o280
52617C28208n750m310k621j189k22J37j28o73j011r51o43k65J19N25R43J279J300
52600C14748Q68K45r1J3K76M74O09N93K41k26l10J1J91Q2K75J033J607J241L71
$$ y = [311405, 309820, 307638, 305174, 303319, 302340, 301600, 300685, 300128, 300510, 301419, 301944, 301894, 301842, 302208, 302981, 304174, 305799, 307396, 308332, 308675, 309128, 309995, 310885, 311567, 312352, 313319, 313914, 313741, 313196, 312799, 312465, 311921, 311343, 311019, 310765, 310249, 309554, 308899, 308172, 307341, 306945, 307412, 308083, 307769, 306289, 304728, 304071, 304226, 304561, 304760, 304858, 304951, 305262, 306169, 307792, 309701, 311265, 312197, 312625, 312819, 313058, 313658, 314884, 316783, 319158, 321769, 324548, 327538, 330466, 332509, 332840, 331556, 329726, 328289, 327177, 325853, 324386, 323429, 323279, 323532, 323743, 323951, 324323, 324671, 324629, 324208, 323951, 324632, 326771, 330345, 334858, 339712, 344385, 348230, 350419, 350417, 348399, 344908, 340236, 334488, 328208, 322458, 318148, 315527, 314338, 314116, 314253, 314125, 313452, 312441, 311490, 310847, 310582, 310701, 311226, 312169, 313448, 314748, 315616, 315861, 315770, 315783, 316059, 316533, 317142, 317735, 317976, 317750, 317440, 317451, 317642, 317724, 317999, 319032, 320639, 321880, 322251]
52581C22251L7M73R97J026N37k27q44p32J65R18O09l34o92k03J26l75j067j047
52563C21618m30n7l73j032j411j182n42q0k22p36r71o94l98o33j274j621j119
52546C08843M2R92R16j08j149j416j040n45k3P51J558J788J293O14K55K69N36
52529C13576R77J312J155N72J28J91N28P85Q92Q80O84M41N32J084J714K073K239
52512C29763K378K336J987J627J605J740J593J149P91N52r6j478l113m116m125
52497C32593l524k869k310j787j395j314j448j491j333j098q07l71k1k01q27j153
52481C10644p12P4O20J024J602K059J901J367J126J157Q39J20k63R4P72J382K101
52464C25907L014L629L558L129K806K496J885J054L08l99j355k628l949m946n214
$$ y = [322251, 322288, 322761, 323758, 324784, 325321, 325094, 324250, 323518, 323683, 324601, 325210, 324876, 324184, 323981, 324107, 323732, 322665, 321618, 321188, 321131, 320758, 319726, 318315, 317133, 316591, 316511, 316289, 315553, 314582, 313888, 313490, 312857, 311583, 309962, 308843, 308885, 309877, 310793, 310685, 309536, 308120, 307080, 306535, 306512, 307263, 308821, 310609, 311902, 312516, 312771, 313040, 313576, 314553, 315865, 317020, 317592, 317720, 317911, 318439, 319224, 320116, 320996, 321680, 322121, 322653, 323737, 325451, 327524, 329763, 332141, 334477, 336464, 338091, 339696, 341436, 343029, 344178, 344969, 345521, 345425, 343947, 340834, 336718, 332593, 329069, 326200, 323890, 322103, 320708, 319394, 317946, 316455, 315122, 314024, 313217, 312846, 312825, 312624, 311797, 310644, 309932, 310006, 310626, 311650, 313252, 315311, 317212, 318579, 319705, 320862, 321701, 321821, 321558, 321652, 322424, 323806, 325907, 328921, 332550, 336108, 339237, 342043, 344539, 346424, 347478, 347786, 347387, 346032, 343404, 339455, 334509, 329295]
52449C29295m500l052j601p79p11j167j771k037j651r07m17k79k2M51N70J8o33
52432C10807p44m65k98k79j68m4n8mK94M19j01r36j236o97K01R45J415J646J690
52413C12387J754K063K589L187L865M637N350O035P095Q708J0295J1169J1404
52400C90538J1428J0904Q870N058M30l754o811q603r258r197q874q274p073n456
52386C59928m237l879l830l215j860l41P07J102J079J010J055J031Q36Q22J440
52371C51648K475L176L260L223L435L521L023K217J676J340O83k98r14p52l31
52356C77382m59j179j649j103L18J736K417K334J930J641J696K159K781L035K636
52341C95675J970J670J870K204K497K967L676M319M746N192N777O250O508O901
$$ y = [329295, 324795, 321743, 320142, 319363, 318652, 317485, 315714, 313677, 312026, 311119, 310702, 310423, 310401, 310852, 311422, 311440, 310807, 310063, 309598, 309300, 309021, 308853, 308809, 308751, 308747, 309041, 309460, 309359, 308423, 307187, 306490, 306691, 307636, 309051, 310697, 312387, 314141, 316204, 318793, 321980, 325845, 330482, 335832, 341867, 348962, 357670, 367965, 379134, 390538, 401966, 412870, 421740, 426798, 427228, 423474, 416663, 408060, 398802, 389605, 380731, 372457, 365384, 359928, 355691, 351812, 347982, 344767, 342907, 342566, 343273, 344375, 345454, 346464, 347519, 348550, 349386, 350208, 351648, 354123, 357299, 360559, 363782, 367217, 370738, 373761, 375978, 377654, 378994, 379677, 379379, 378465, 377713, 377382, 376923, 375744, 374095, 372992, 373310, 375046, 377463, 379797, 381727, 383368, 385064, 387223, 390004, 393039, 395675, 397645, 399315, 401185, 403389, 405886, 408853, 412529, 416848, 421594, 426786, 432563, 438813, 445321, 452222]
52327D52222P637Q403Q932R483J0207J0573J0166R701J0257J1589J2272J1726
52315E73168J1145J1894J3759J5447J6359J7014J7973J9149K0204K1026K1633
52304G58771K2016K2310K2815K3665K4627K5289K5246K4198K2219K0018J8492
52293A009666J7719J6703J4500J1390Q587O886N989N135L901K265M14j261k291
52280A099603k665l015l867m842n081m411l644l571m070m427m181l347k109p42
52266A049631K82N95L87L30R06K110L766N820Q209J0694J3038J5110J6735J7688
52252A145301J8027J8202J8527J8786J8586J7809J6448J4330J1574R037P663P282
52240A321572O742N331L435J633j55k109l784m659n036n689o777p853q812j0088
$$ y = [452222, 459859, 468262, 477194, 486677, 496884, 507457, 517623, 527324, 537581, 549170, 561442, 573168, 584313, 596207, 609966, 625413, 641772, 658786, 676759, 695908, 716112, 737138, 758771, 780787, 803097, 825912, 849577, 874204, 899493, 924739, 948937, 971156, 991174, 1009666, 1027385, 1044088, 1058588, 1069978, 1078565, 1085451, 1091440, 1096575, 1100476, 1102741, 1103155, 1101894, 1099603, 1096938, 1093923, 1090056, 1085214, 1080133, 1075722, 1072078, 1068507, 1064437, 1060010, 1055829, 1052482, 1050373, 1049631, 1049913, 1050508, 1050895, 1051225, 1052131, 1054241, 1058007, 1063827, 1072036, 1082730, 1095768, 1110878, 1127613, 1145301, 1163328, 1181530, 1200057, 1218843, 1237429, 1255238, 1271686, 1286016, 1297590, 1306627, 1314290, 1321572, 1328314, 1333645, 1337080, 1338713, 1338558, 1336449, 1332665, 1328006, 1322970, 1317281, 1310504, 1302651, 1293839, 1283751]
52226A283751j1715j2956j3221j2901j2826j3190j3460j3214j2617j2000j1301
52215A144350j0182q614p074o024n337m469l171j744n64K23N01J80l02oJ481L368
52199A102616M578N080N618O403O932P047P219P559P427O481N282M328L158J131
52185A180859j329l152m015m585n281n585m901l651l068l851n370o340o205n576
52171A117950n204m959m267l253k684k750k650j730m05M87P29O95O43O03O58Q45
52155A094708R38P30L66J14J8P0M09J032J650K121K675L349L615L072K096J287
52139A118250O92Q8l55m38n21r62j260o50O89J903K785L871N275O453P371Q842
52123A152033J1298J4019J6027J7085J7441J7246J6698J6223J6045J5992J6102
$$ y = [1283751, 1272036, 1259080, 1245859, 1232958, 1220132, 1206942, 1193482, 1180268, 1167651, 1155651, 1144350, 1134168, 1125554, 1118480, 1112456, 1107119, 1102650, 1099479, 1097735, 1097171, 1097394, 1097895, 1098075, 1097773, 1097767, 1099248, 1102616, 1107194, 1112274, 1117892, 1124295, 1131227, 1138274, 1145493, 1153052, 1160479, 1166960, 1172242, 1176570, 1179728, 1180859, 1179530, 1176378, 1172363, 1167778, 1162497, 1156912, 1152011, 1148360, 1145292, 1141441, 1136071, 1129731, 1123526, 1117950, 1112746, 1107787, 1103520, 1100267, 1097583, 1094833, 1092183, 1090453, 1090048, 1090535, 1091264, 1091959, 1092602, 1093205, 1093863, 1094708, 1095646, 1096376, 1096742, 1096856, 1096874, 1096944, 1097353, 1098385, 1100035, 1102156, 1104831, 1108180, 1111795, 1114867, 1116963, 1118250, 1118942, 1119030, 1118675, 1118237, 1117716, 1116754, 1115494, 1114844, 1115533, 1117436, 1120221, 1124092, 1129367, 1135820, 1143191, 1152033, 1163331, 1177350, 1193377, 1210462, 1227903, 1245149, 1261847, 1278070, 1294115, 1310107, 1326209]
52112A326209J6870J8454K0094K0871K0752K0476K0735K1826K3607K5373K6055
52101A561322K5167K3431K1952K0923J9492J6860J3122R086N586K988J097n34
52089A720492k206l983n881p797r279r812r575r466j0133j1278j2236j2840j3353
52076A602653j3809j3935j3580j2874j1979j0976r895q674p183n450l636j674
52064A488988Q11L936P159R769J1600J2998J4268J5444J6364J6747J6389J5508
52052A629981J4682J4096J3158J1281Q789O592N167M302L696L243K751J927P82
52039A720447m44j740l341n126o522p289q017r446j1506j3418j4712j5811j7396
52026A605679j9486k1372k2464k2869k2982k2824k2134k1007j9896j8962j7891
$$ y = [1326209, 1343079, 1361533, 1381627, 1402498, 1423250, 1443726, 1464461, 1486287, 1509894, 1535267, 1561322, 1586489, 1609920, 1631872, 1652795, 1672287, 1689147, 1702269, 1711355, 1716941, 1719929, 1721026, 1720492, 1718286, 1714303, 1708422, 1700625, 1691346, 1681534, 1671959, 1662493, 1652360, 1641082, 1628846, 1616006, 1602653, 1588844, 1574909, 1561329, 1548455, 1536476, 1525500, 1515605, 1506931, 1499748, 1494298, 1490662, 1488988, 1489799, 1493735, 1500894, 1510663, 1522263, 1535261, 1549529, 1564973, 1581337, 1598084, 1614473, 1629981, 1644663, 1658759, 1671917, 1683198, 1691987, 1698579, 1703746, 1708048, 1711744, 1714987, 1717738, 1719665, 1720447, 1720003, 1718263, 1714922, 1709796, 1703274, 1695985, 1687968, 1678522, 1667016, 1653598, 1638886, 1623075, 1605679, 1586193, 1564821, 1542357, 1519488, 1496506, 1473682, 1451548, 1430541, 1410645, 1391683, 1373792]
52015A373792j6561j5389j4697j4150j3186j1833j0698j0360j1027j2508j4192
52004A229191j5373j5934j6444j7167j7492j6836j5646j4794j4267j3398j2235
51993A059605j1756j2540j4091j5711j7245j8642j9530j9716j9563j9428j9230
51982H72153j8923j8936j9560k0371k0676k0215j8960j6779j3887j1200r425q037
51970F75184n907k907j10J681K792L818M577M447L255J403o93k808m718o141o960
51955F66913p233p000o240n023l540j975m30J052K508M145O252Q947J1960J4779
51941F85115J7088J9035K0983K3065K5073K6789K8156K8998K8853K7372K4690
51930I55217K0926J5448P318l268j4467k4100l1206l5951l8499l8739l6971l4131
$$ y = [1373792, 1357231, 1341842, 1327145, 1312995, 1299809, 1287976, 1277278, 1266918, 1255891, 1243383, 1229191, 1213818, 1197884, 1181440, 1164273, 1146781, 1129945, 1114299, 1099505, 1085238, 1071840, 1059605, 1047849, 1035309, 1021218, 1005507, 988262, 969620, 950090, 930374, 910811, 891383, 872153, 853230, 834294, 814734, 794363, 773687, 753472, 734512, 717733, 703846, 692646, 683221, 675184, 669277, 666370, 666260, 667941, 670733, 674551, 679128, 683575, 686830, 688233, 687540, 684732, 680014, 673873, 666913, 659680, 652680, 646440, 641417, 637877, 635902, 635472, 636524, 639032, 643177, 649429, 658376, 670336, 685115, 702203, 721238, 742221, 765286, 790359, 817148, 845304, 874302, 903155, 930527, 955217, 976143, 991591, 998909, 995641, 981174, 957074, 925868, 889917, 851418, 812679, 775708, 741577]
51918G41577l1008k7764k4308k0738j7150j3502r964o978m612k376j26J401J540
51905E85992R35Q79J572J830P25j344l537n750q319j1022j3055j3865j3511j2332
51891E09198j0676q868p117n398l689k158q42O32K661N039P134Q619R716J0682
51877E14933J1428J1764J1687J1217J0130Q120N237K068o04k411l647m761n657
51864E69504n736m772l364k274j607j034n11k48j09K80P01L73j007k690l856m677
51848E38973n871p469q659q875q449p973p490o595n190l655k394j477p72j70M16
51833D64350J015J500J667J635J818K319K566K024J021L64J90j03p04q74rJ367
51817D80146K264K420K212J724O44r69k520l567m127m238l759k782j765j048n69
$$ y = [741577, 710569, 682805, 658497, 637759, 620609, 607107, 597143, 590165, 585553, 583177, 583051, 584452, 585992, 586927, 587806, 589378, 591208, 591933, 590589, 587052, 581302, 572983, 561961, 548906, 535041, 521530, 509198, 498522, 489654, 482537, 477139, 473450, 471292, 470450, 471082, 473743, 478782, 485916, 494535, 504251, 514933, 526361, 538125, 549812, 561029, 571159, 579279, 584516, 586584, 585980, 583569, 579922, 575161, 569504, 563768, 558996, 555632, 553358, 551751, 550717, 550206, 549958, 549849, 550129, 550830, 551203, 550196, 547506, 543650, 538973, 533102, 525633, 516974, 508099, 499650, 491677, 484187, 477592, 472402, 468747, 466353, 464876, 464104, 463934, 464350, 465365, 466865, 468532, 470167, 471985, 474304, 476870, 478894, 479915, 480279, 480469, 480366, 479662, 478788, 478779, 480146, 482410, 484830, 487042, 488766, 489410, 488441, 485921, 482354, 478227, 473989, 470230, 467448, 465683, 464635, 464066]
51802D64066j38L35R34J623K035J808J253J174J772K283J970J008R5m22o20n80
51786D78596l84k84m08n11l25OK31N20J220K253L225M058N007O080O906P279P433
51769E20902P496P112N841L806J564n33k597m730o558p478p399o908o637o598
51755D97283o471o270o313o487o176n133l917l086k389j305j23L18n1j87P17K016
51739D52426K343J336J57J35J260K409K821K872L179L452K837J234m01j134r31
51724D73995j96Q87K127K977L010K493J917J208qj412k029j349O8J224J550J066
51708D87528J66n47n29L37J691L036L902L885K879J328j38j252j995k142j462
51693D96687l03O45J232J747J945J052q93k623l201l212l681m378m275l278k461
$$ y = [464066, 463928, 464263, 465197, 466820, 468855, 470663, 471916, 473090, 474862, 477145, 479115, 480123, 480218, 479796, 479176, 478596, 478212, 477928, 477520, 477009, 476684, 476690, 476921, 477441, 478661, 480914, 484139, 488197, 493204, 499284, 506190, 513469, 520902, 528398, 535510, 541351, 545157, 546721, 546188, 543591, 538861, 532303, 524825, 517426, 510518, 503881, 497283, 490812, 484542, 478229, 471742, 465566, 460433, 456516, 453430, 451041, 449736, 449613, 449931, 449880, 449693, 450410, 452426, 454769, 456105, 456262, 456397, 457657, 460066, 462887, 465759, 468938, 472390, 475227, 476461, 476060, 474926, 473995, 473799, 474686, 476813, 479790, 482800, 485293, 487210, 488418, 488410, 486998, 484969, 483620, 483688, 484912, 486462, 487528, 487694, 487147, 486618, 486955, 488646, 491682, 495584, 499469, 502348, 503676, 503538, 502286, 500291, 498149, 496687, 496384, 497029, 498261, 500008, 501953, 503005, 502112, 499489, 496288, 493076, 489395, 485017, 480742, 477464, 475003]
51678D75003k492k837k719k131j560j271j213j198q82P9J626L270M633N664O290
51663D80262O259N590M729M022L337K492J595P40k59j324j693p08J187K919M173
51648E13321N560P240Q146P086M126M06l060n824p555q034p719p563p881p864
51634D90385o696m792l354k865k680k112j340r87j172j416j245o57j14k38j301
51619D59416k862m062m497m549m706m849m586l949l272k556j547m11K39J82m6
51604D17945K02R78J903K674L219L671M401N827P864R805J1008J1542J1924J2236
51590E05199J1772R558N291r2m761p264p598o825n638l815j132J855M499P028
51576E08077J0058J3357J5829J6819J6836J6801J7045J7253J7040J6313J5244
$$ y = [475003, 472511, 469674, 466955, 464824, 463264, 461993, 460780, 459582, 458700, 458779, 460405, 463675, 468308, 473972, 480262, 486521, 492111, 496840, 500862, 504199, 506691, 508286, 509026, 508767, 507443, 505750, 505042, 506229, 509148, 513321, 518881, 526121, 534267, 541353, 545479, 545885, 542825, 537001, 529446, 521412, 513693, 506130, 498249, 490385, 483689, 478897, 475543, 472678, 469998, 467886, 466546, 465559, 464387, 462971, 461726, 461069, 460955, 460717, 459416, 456554, 452492, 447995, 443446, 438740, 433891, 429305, 425356, 422084, 419528, 417981, 417570, 417809, 417991, 417945, 418147, 419125, 421028, 423702, 426921, 430592, 434993, 440820, 448684, 458489, 469497, 481039, 492963, 505199, 516971, 526529, 531820, 531728, 526967, 519703, 512105, 505280, 499642, 495827, 494695, 496550, 501049, 508077, 518135, 531492, 547321, 564140, 580976, 597777, 614822, 632075, 649115, 665428, 680672]
51565F80672J4082J3019J2285J2407J4115J7688K2551K7741L2580L6523L8564
51554I22227L7587L3441K7167J9968J2310M173m284j2565k0097k6410l1298l4853
51542I27366l7170l7989l7010l4555l1379k7845k3781j9366j5481j2814j1155
51531F38821r984r230q947q779q440q367r112j0234j0601r797q596p871p659p474
51517E13730p057o447n721m926m190l657l339l150l000k867k827k963l159l128
51503D57299k791k412k154j746q99J14P29P92O11L77N3k24q6N98J576K532L201
51486D57570L164K165O92l07n39o72j298k108k462k312k025j767j547j607k139
51471D44808k845l247l405l715m164m315m046l694l327k561j349m07l31o89n94
$$ y = [680672, 694754, 707773, 720058, 732465, 746580, 764268, 786819, 814560, 847140, 883663, 922227, 959814, 993255, 1020422, 1040390, 1052700, 1056873, 1052589, 1040024, 1019927, 993517, 962219, 927366, 890196, 852207, 815197, 780642, 749263, 721418, 697637, 678271, 662790, 649976, 638821, 628837, 619607, 610660, 601881, 593441, 585074, 575962, 565728, 555127, 545330, 536734, 528863, 521204, 513730, 506673, 500226, 494505, 489579, 485389, 481732, 478393, 475243, 472243, 469376, 466549, 463586, 460427, 457299, 454508, 452096, 449942, 448196, 447297, 447411, 448140, 448932, 449543, 449920, 449973, 449749, 449663, 450261, 451837, 454369, 457570, 460734, 462899, 463591, 463284, 462745, 462073, 460775, 458667, 456205, 453893, 451868, 450101, 448554, 446947, 444808, 441963, 438716, 435311, 431596, 427432, 423117, 419071, 415377, 412050, 409489, 408140, 407733, 407402, 406713, 406119]
51456D06119N3N21M44L81R38J863K487K777L408M854O842Q829J0602J2156J3310
51441D75584J3761J3465J2649J1472R904P962N972M437L636L323K824J517p80
51428E65726l907p619j1428j4335j5265j4129j2069j0341r226q295p337o419n375
51415D39981l941k405j497j416j483j018j26N84P12L88J18M95J718L241M181M229
51399D43761L885L764M037M626N417O073O136N672N497O347Q161J0370J2592J4702
51385E41040J6649J8626K1124K4350K7886L1348L5041L9436M4245M8549N1746
51374I00040N3743N4249N2513M7859M0137K9694J7354M426p871j9095k9317l8199
51362A105533m4926m9205n1671n3018n3199n1795m8839m4821m0250l5563l1151
$$ y = [406119, 406172, 406693, 407137, 407518, 408456, 410319, 412806, 415583, 418991, 423845, 430687, 439516, 450118, 462274, 475584, 489345, 502810, 515459, 526931, 536835, 544797, 550769, 555206, 558842, 562165, 564989, 566506, 565726, 561819, 554200, 542772, 528437, 513172, 499043, 486974, 476633, 467407, 459112, 451775, 445356, 439981, 436040, 433635, 432138, 430722, 429239, 428221, 428095, 428679, 429391, 429779, 429897, 430392, 432110, 435351, 439532, 443761, 447646, 451410, 455447, 460073, 465490, 471563, 477699, 483371, 488868, 495215, 503376, 513746, 526338, 541040, 557689, 576315, 597439, 621789, 649675, 681023, 716064, 755500, 799745, 848294, 900040, 953783, 1008032, 1060545, 1108404, 1148541, 1178235, 1195589, 1200015, 1192144, 1173049, 1143732, 1105533, 1060607, 1011402, 959731, 906713, 853514, 801719, 752880, 708059, 667809, 632246, 601095]
51351F01095k7082k3033j8955j5474j3204j1784j0217q169o324n285m717l914
51339D52937k811j879j206k92J057K190K283J373L15k14l64o87j406k324l184
51324D45788l868m253m162l534k574j645j042q15p20m29J32P08J105J527K198
51309D28416K782K604J563M50k5j52o77j560j889j217l93n80j816l007l235k535
51293D18729j450m15K76M39L42O24J461K123J878J102Q82J648K813L806M716N672
51277D44646O222N840M645L154J674L75l34j56M93Q12N92L72N30P32N32J03QL34
51259D70574M74j97j624l161m172m446m106l430k845k842l510m229m122l024j686
51244D27654r14p24n43l0O45J213J640K027K362K495K346K078J969K028J859J142
$$ y = [601095, 574013, 550980, 532025, 516551, 503347, 491563, 481346, 473177, 466853, 461568, 456851, 452937, 450126, 448247, 447041, 446749, 447806, 449996, 452279, 453652, 453967, 453753, 453389, 452702, 451296, 448972, 445788, 441920, 437667, 433505, 429971, 427397, 425752, 424710, 423895, 423175, 422746, 422878, 423586, 424691, 426218, 428416, 431198, 433802, 435365, 435815, 435790, 435638, 434961, 433401, 431512, 430295, 429902, 429322, 427506, 424499, 421264, 418729, 417279, 416864, 417140, 417579, 417921, 418545, 420006, 422129, 424007, 425109, 425991, 427639, 430452, 434258, 438974, 444646, 450868, 456708, 461353, 464507, 466181, 466556, 466222, 466066, 466559, 467371, 467963, 468335, 468865, 469597, 470129, 470232, 470240, 470574, 471048, 470851, 469227, 466066, 461894, 457448, 453342, 449912, 447067, 444225, 440715, 436486, 432364, 429340, 427654, 426740, 426016, 425473, 425443, 426088, 427301, 428941, 430968, 433330, 435825, 438171, 440249, 442218, 444246, 446105, 447247]
51228D47247J82l83m01l56n38o00k65j4n33j689k573k499j639o15J58O69J057
51211D37208J262J013L20r4O18K258L524L521K895K888L686M384M309L657K894
51196D74343K256J842J644J335N47n87j567k122k267j951j250p12p85j001n50
51181D69175L68P11J99k24J33Q23J270J672K215K269J274k37j376k148l038l870
51165D69216m040l645l330l078k242q17J81L8p39j192j042o87n05o10r63j341
51149D45204j345q53l17l13p57q92k19P66J086N45R3O39J843K570K371J855J595
51132D53871J467J269J232J382J154L22l26l9O56P22K74L53J180J811J712J488
51116D68528J736K103K063J791J640J433R92P49J059J441J198N70L51O71R81J206
$$ y = [447247, 447429, 447046, 446645, 446289, 445751, 445151, 444886, 444872, 444339, 442650, 440077, 437578, 435939, 435324, 435482, 436151, 437208, 438470, 439483, 439803, 439709, 440327, 442585, 446109, 449630, 452525, 455413, 459099, 463483, 467792, 471449, 474343, 476599, 478441, 480085, 481420, 481967, 481380, 479813, 477691, 475424, 473473, 472223, 471511, 470726, 469725, 469175, 469543, 470254, 470453, 470229, 470362, 471185, 472455, 474127, 476342, 478611, 479885, 479648, 478272, 476124, 473086, 469216, 465176, 461531, 458201, 455123, 452881, 452064, 452245, 452283, 451544, 450352, 449310, 448623, 448118, 447508, 446545, 445204, 443859, 443006, 442689, 442376, 441619, 440727, 440508, 441274, 442360, 442905, 442998, 443637, 445480, 448050, 450421, 452276, 453871, 455338, 456607, 457839, 459221, 460375, 460697, 460371, 460332, 460988, 461710, 461984, 462337, 463517, 465328, 467040, 468528, 470264, 472367, 474430, 476221, 477861, 479294, 480286, 481035, 482094, 483535, 484733, 485303, 485654, 486325, 487306, 488512]
51100D88512J939L240M106L613K139Q86N06O00M54j54q23r93m57L81P81L22o85
51083E04367j487j554r27p7M77N29K83J16J30J21O1L85J446K846L746L953M168
51066E18583M972O002O630P063Q091R865J1633J2907J4161J5957J7888J8919J8575
51053F71246J7168J5080J2360R194O241M235L425L447L544K886J089j393l572
51040G44950m827n428o048o967p936q579q696q171o989n451m237l986m783o100
51026F56752p254p861p814p021n386l078n79J659L533N206O906Q867J1174J3445
51012F68549J4869J5017J4452J4112J4073J3421J1528Q984O893N623M665L511
51000G95697K147O62j083l152n163o582p237p317o933n975m423k556o77J222L343
$$ y = [488512, 490451, 493691, 497797, 501410, 503549, 504435, 504941, 505541, 505995, 505841, 505018, 504025, 503568, 503949, 504730, 505052, 504367, 502880, 501326, 500399, 500322, 500799, 501328, 501611, 501727, 501857, 501978, 502039, 502424, 503870, 506716, 510462, 514415, 518583, 523555, 529557, 536187, 543250, 551341, 561206, 572839, 585746, 599907, 615864, 633752, 652671, 671246, 688414, 703494, 715854, 725048, 731289, 735524, 738949, 742396, 745940, 748826, 749915, 748522, 744950, 740123, 734695, 728647, 721680, 713744, 705165, 696469, 688298, 681309, 675858, 671621, 667635, 662852, 656752, 649498, 641637, 633823, 626802, 621416, 618338, 617759, 619418, 622951, 628157, 635063, 643930, 655104, 668549, 683418, 698435, 712887, 726999, 741072, 754493, 766021, 775005, 781898, 787521, 792186, 795697, 797844, 798506, 797423, 794271, 789108, 782526, 775289, 767972, 761039, 755064, 750641, 748085, 747408, 748630, 751973]
50985G51973N707Q079J0218J2111J3893J5672J7458J9180K0794K2377K4062K5704
50973I47228K6825K7159K7359K8735L2099L7004M2302M7239N1888N6667O1729
50962A386234O6699P0842P3622P5205P6225P6857P6448P4249P0339O5304N9316
50951B171340N2033M3540L4801K6915K0167J3984P729J404m266q329j0364j0801
50939B338153j0573j0563j1363j3221j5813j8422k0721k3180k6217k9172l0952
50928B127956l1647l2770l5585l9840m4441m8680n2358n5248n7122n8083n8403
50917A613779n8183n7435n6118n3845n0109m5206m0502l7075l4529l1761k8598
50906A120418k5818k3811k2105k0300j8626j7331j6158j4720j2909j0781q477
$$ y = [751973, 757680, 765759, 775977, 788088, 801981, 817653, 835111, 854291, 875085, 897462, 921524, 947228, 974053, 1001212, 1028571, 1057306, 1089405, 1126409, 1168711, 1215950, 1267838, 1324505, 1386234, 1452933, 1523775, 1597397, 1672602, 1748827, 1825684, 1902132, 1976381, 2046720, 2112024, 2171340, 2223373, 2266913, 2301714, 2328629, 2348796, 2362780, 2370509, 2371913, 2367647, 2359318, 2348954, 2338153, 2327580, 2317017, 2305654, 2292433, 2276620, 2258198, 2237477, 2214297, 2188080, 2158908, 2127956, 2096309, 2063539, 2027954, 1988114, 1943673, 1894993, 1842635, 1787387, 1730265, 1672182, 1613779, 1555596, 1498161, 1442043, 1388198, 1338089, 1292883, 1252381, 1215306, 1180777, 1149016, 1120418, 1094600, 1070789, 1048684, 1028384, 1009758, 992427, 976269, 961549, 948640, 937859, 929382]
50895I29382o383m943m098l397k710k289k070j561o38K10P09J241K103L004L714
50880I12274M577N803O920P609Q436R956J1593J2430J2789J3830J5788J7649J8756
50867A058410J9628K0922K2590K4484K6871K9784L2647L5190L8137M2270M7332
50856A398265N2598N8071O4350P1630P9592Q8197R7772J08297J19265J30230J40958
50845B409225J50996J59703J66817J72502J76661J78664J77806J73568J65318
50836C931260J52364J34678J13276Q9604O4807L9768J5470p024k6816m3299n6137
50825D407951o5203p0271p0825o6656n8719m8886l8724k9010k0701j5561j5100
50814C908295j9207k6558l6175m7954o1762p6807r1970j06273j18876j29125j36831
$$ y = [929382, 922999, 918056, 913958, 910561, 907851, 905562, 903492, 901931, 901293, 901503, 902212, 903453, 905556, 908560, 912274, 916851, 922654, 929574, 937183, 945619, 955575, 967168, 979598, 992387, 1006217, 1022005, 1039654, 1058410, 1078038, 1098960, 1121550, 1146034, 1172905, 1202689, 1235336, 1270526, 1308663, 1350933, 1398265, 1450863, 1508934, 1573284, 1644914, 1724506, 1812703, 1910475, 2018772, 2138037, 2268267, 2409225, 2560221, 2719924, 2886741, 3059243, 3235904, 3414568, 3592374, 3765942, 3931260, 4083624, 4218302, 4331578, 4421182, 4485989, 4525757, 4541227, 4534203, 4507387, 4464088, 4407951, 4342748, 4272477, 4201652, 4134996, 4076277, 4027391, 3988667, 3959657, 3938956, 3923395, 3908295, 3889088, 3862530, 3826355, 3778401, 3716639, 3639832, 3547862, 3441589, 3322713, 3193588, 3056757]
50803C056757j42098j44716j44071j39862j32628j23373j12954j01992r1019q0341
50793A843703o9887n9547m9602m0568l2638k5544j9011j3178q438m948k430m65
50781A517447J044J853J819J125l9j875m640p915j0568j1770j1896j2116j3141
50768A449328j4659j6010j7114j8412k0072k1630k2541k2803k2707k2234k1083
50757A230063j9284j7262j5124j2410q957n572l174j432R99M812R235J3156J6450
50744A191500J9680K3018K6179K9257L2877L7328M2082M6550N0870N5591O0769
50733A615701O5849P0378P4490P8572Q2772Q6876R0401R2657R3061R1718Q9474
50722B531949Q7011Q3939P9012P1217O0405M7020L1677J5151j621j7803l2733
$$ y = [3056757, 2914659, 2769943, 2625872, 2486010, 2353382, 2230009, 2117055, 2015063, 1924044, 1843703, 1773816, 1714269, 1664667, 1624099, 1591461, 1565917, 1546906, 1533728, 1525290, 1520342, 1517912, 1517447, 1518491, 1520344, 1522163, 1523288, 1523249, 1521374, 1516734, 1508819, 1498251, 1486481, 1474585, 1462469, 1449328, 1434669, 1418659, 1401545, 1383133, 1363061, 1341431, 1318890, 1296087, 1273380, 1251146, 1230063, 1210779, 1193517, 1178393, 1165983, 1157026, 1151454, 1148280, 1146848, 1147847, 1152659, 1161894, 1175050, 1191500, 1211180, 1234198, 1260377, 1289634, 1322511, 1359839, 1401921, 1448471, 1499341, 1554932, 1615701, 1681550, 1751928, 1826418, 1904990, 1987762, 2074638, 2165039, 2257696, 2350757, 2442475, 2531949, 2618960, 2702899, 2781911, 2853128, 2913533, 2960553, 2992230, 3007381, 3005760, 2987957, 2955224]
50711B955224m5637n5519o1538o3346o1064n5268m7121l8079k9180k0824j3399
50700B464249p693m301l100l805o768j2613k1258l1798m3164n4388o4353p2075
50688B138933p7289q0207q0690p8289p3269o6849o0120n3194m5742l7861k9975
50677A455448k2259j4603o971N43P786J4531K0543K5904L0893L5363L8530L9705
50665A625413L8941L6716L3354K9197K4999K1591J9140J7114J4987J2743J0720
50654A884915R235Q309P619O760N679M716M141L902M028M955P115J0379J4215
50641A975968J8221K2208K5943K9238L2269L5435L8850M2094M4494M5524M5097
50630B355341M3676M2030M0747L9993L9750L9883L9741L7914L2692K2837Q150
$$ y = [2955224, 2909587, 2854068, 2792530, 2729184, 2668120, 2612852, 2565731, 2527652, 2498472, 2477648, 2464249, 2456556, 2452255, 2449155, 2445350, 2438582, 2425969, 2404711, 2372913, 2329749, 2275361, 2211008, 2138933, 2061644, 1981437, 1900747, 1822458, 1749189, 1682340, 1622220, 1569026, 1523284, 1485423, 1455448, 1433189, 1418586, 1411615, 1412158, 1419944, 1434475, 1455018, 1480922, 1511815, 1547178, 1585708, 1625413, 1664354, 1701070, 1734424, 1763621, 1788620, 1810211, 1829351, 1846465, 1861452, 1874195, 1884915, 1894150, 1902459, 1910078, 1916838, 1922517, 1927233, 1931374, 1935276, 1939304, 1944259, 1951374, 1961753, 1975968, 1994189, 2016397, 2042340, 2071578, 2103847, 2139282, 2178132, 2220226, 2264720, 2310244, 2355341, 2399017, 2441047, 2481794, 2521787, 2561537, 2601420, 2641161, 2679075, 2711767, 2734604, 2742754]
50619B742754j0054k8745m4133n3626n6984n5479n0448m3053l4690k6634j9311
50608B319597j2579o626j929J453L712M461K944p51n583j0981j7581k6037l5694
50595B214406m4990n2839n9117o3981o7263o8574o7884o5958o3958o2365o0450
50584A537027n7322n3265m9336m5779m1753l6855l1853k7465k3325j8879j4525
50573A136670j0935p891m658j200J931M694P600J0733J3541J5685J7306J8522
50561A201998J9363K0245K1694K3478K4787K5549K6773K9178L2108L4387L5685
50550A495245L6530L7289L7858L8068L7851L7004L5288L2881L0438K8625K7780
50539A874857K7953K9019L0697L2728L5150L8288M2296M6715N0699N3876N6970
$$ y = [2742754, 2732700, 2703955, 2659822, 2606196, 2549212, 2493733, 2443285, 2400232, 2365542, 2338908, 2319597, 2307018, 2300392, 2298463, 2299916, 2303628, 2308089, 2311033, 2310282, 2304699, 2293718, 2276137, 2250100, 2214406, 2169416, 2116577, 2057460, 1993479, 1926216, 1857642, 1789758, 1723800, 1659842, 1597477, 1537027, 1479705, 1426440, 1377104, 1331325, 1289572, 1252717, 1220864, 1193399, 1170074, 1151195, 1136670, 1125735, 1117844, 1113186, 1111986, 1113917, 1118611, 1126211, 1136944, 1150485, 1166170, 1183476, 1201998, 1221361, 1241606, 1263300, 1286778, 1311565, 1337114, 1363887, 1393065, 1425173, 1459560, 1495245, 1531775, 1569064, 1606922, 1644990, 1682841, 1719845, 1755133, 1788014, 1818452, 1847077, 1874857, 1902810, 1931829, 1962526, 1995254, 2030404, 2068692, 2110988, 2157703, 2208402, 2262278, 2319248]
50528B319248O1376O7943P6203Q4898R3011J00181J06296J11188J14664J16450
50518C251458J16072J13098J07560R9746Q9512P6280N9969M1507K2156K667j6667
50507C963358l5524n3579p0631q6146r8839j07294j11063j10715j06824r9453
50497C083290q8712p5222n9682m2468k4092n843J0687K4734L6532M6121N2333
50486B957678N3445M8710L8776K4541O288j5570l9287o2186q2311r9087j12236
50475B718761j20869j24228j22857j18340j12145j05201r8272r1876q5788p9309
50465A659876p2267o5266n8855n2915m7081m1294l5727l0441k5366k0381j5301
50454A194982j0133n397j713J057L717O643R341J1516J3836J7013K0523K3080
$$ y = [2319248, 2380624, 2448567, 2524770, 2609668, 2702679, 2802860, 2909156, 3020344, 3135008, 3251458, 3367530, 3480628, 3588188, 3687934, 3777446, 3853726, 3913695, 3955202, 3977358, 3980025, 3963358, 3927834, 3874255, 3803624, 3717478, 3618639, 3511345, 3400282, 3289567, 3182743, 3083290, 2994578, 2919356, 2859674, 2817206, 2793114, 2787271, 2797958, 2822692, 2859224, 2905345, 2957678, 3011123, 3059833, 3098609, 3123150, 3129438, 3113868, 3074581, 3012395, 2930084, 2830997, 2718761, 2597892, 2473664, 2350807, 2232467, 2120322, 2015121, 1916849, 1824973, 1739185, 1659876, 1587609, 1522343, 1463488, 1410573, 1363492, 1322198, 1286471, 1256030, 1230664, 1210283, 1194982, 1184849, 1179452, 1177739, 1178796, 1182513, 1189156, 1198497, 1210013, 1223849, 1240862, 1261385, 1284465]
50442A284465K4212K4578K4807K4724K3891K2153J9333J5038R383L588p02k833
50430A472637l560m013m492m486l700k674k115j835q57J348M168O736R067J1880
50416A478104J5467J9396K3292K7373L1994L7073M2247M7330N2291N6872O0531
50405A891970O2847O3940O4329O4239O3101O0016N4887M8679M2262L5256K6552
50394B478078J5784L750q623k1033l3403m5240n5830o4633p1218p5091p5982p4180
50382A972379p0336o4951n8228n0272m1288l1710k2108j2887m013M672J2809J9422
50370A653489K3582K4906K3363J9061J2420M290m507j3570k2650l1152l8168m2956
50358A608108m5188m4920m2528l8737l4494l0706k7868k5851k4186k2913k2903
$$ y = [1284465, 1308677, 1333255, 1358062, 1382786, 1406677, 1428830, 1448163, 1463201, 1472584, 1476172, 1475470, 1472637, 1469077, 1465064, 1460572, 1456086, 1452386, 1449712, 1447597, 1445762, 1444905, 1446253, 1450421, 1457157, 1466224, 1478104, 1493571, 1512967, 1536259, 1563632, 1595626, 1632699, 1674946, 1722276, 1774567, 1831439, 1891970, 1954817, 2018757, 2083086, 2147325, 2210426, 2270442, 2325329, 2374008, 2416270, 2451526, 2478078, 2493862, 2497612, 2488989, 2467956, 2434553, 2389313, 2333483, 2268850, 2197632, 2122541, 2046559, 1972379, 1902043, 1837092, 1778864, 1728592, 1687304, 1655594, 1633486, 1620599, 1616586, 1621258, 1634067, 1653489, 1677071, 1701977, 1725340, 1744401, 1756821, 1761111, 1756604, 1743034, 1720384, 1689232, 1651064, 1608108, 1562920, 1518000, 1475472, 1436735, 1402241, 1371535, 1343667, 1317816, 1293630, 1270717, 1247814]
50347A247814k4969k8654l2419l5043l6305l6238l4564l1309k7291k3356j9523
50336I18143j5443j1309p705m794k279q6J522K431K827K956L096L639M729N890
50322I03617O506O620O871P666Q815R855J0307R869Q786P949P983Q388Q119P023
50308A018374O006N737N888N853N559N225M923M741N006N833O804P411P614P665
50294A102639P588P131O077M387K200j82k439m556o720q786j0151j0373r795r183
50280A067837q855q304o717l838l94K415M016N052O615Q957J1301J2965J4118
50267A105168J5301J6619J7830J8914K0149K1749K3760K6187K8940L1634L3731
50256A359982L4887L5002L3989L1811K8788K5642K3008K0839J8537J5739J2827
$$ y = [1247814, 1222845, 1194191, 1161772, 1126729, 1090424, 1054186, 1019622, 988313, 961022, 937666, 918143, 902700, 891391, 883686, 878892, 876613, 876527, 878049, 880480, 883307, 886263, 889359, 892998, 897727, 903617, 910123, 916743, 923614, 931280, 940095, 949950, 960257, 970126, 978912, 986861, 994844, 1003232, 1011351, 1018374, 1024380, 1030117, 1036005, 1041858, 1047417, 1052642, 1057565, 1062306, 1067312, 1073145, 1079949, 1087360, 1094974, 1102639, 1110227, 1117358, 1123435, 1127822, 1130022, 1129840, 1127401, 1122845, 1116125, 1107339, 1097188, 1086815, 1077020, 1067837, 1058982, 1050678, 1043961, 1040123, 1039729, 1042144, 1046160, 1051212, 1057827, 1066784, 1078085, 1091050, 1105168, 1120469, 1137088, 1154918, 1173832, 1193981, 1215730, 1239490, 1265677, 1294617, 1326251, 1359982, 1394869, 1429871, 1463860, 1495671, 1524459, 1550101, 1573109, 1593948, 1612485, 1628224, 1641051]
50245A641051J0377Q191N301R91m544j0753j7336k3825k9048l1850l2186l0876
50233A485493k8346k4453j9531j4816j1560j0381j1629j5421k0824k5790k8726
50222A274016k9708k9701k9071k7609k5530k3495k1741j9902j7814j5862j4437
50211A019146j3548j3087j3016j3102j2873j2116j1203j0662j0566j0461r914
50200H88598q987q146p742p685p744p859p934p499o182m543l753m151m718m389
50186G97266l322k307j498m80N94R84N45J17M84J464K369K922L345L841M331M611
50170H15266M567M281M013L961L958L606K796J986J785K349L274M045M527M996
50156H65410N816P181R204J1925J5076J7935J9953K1459K3409K6228K9379L2194
$$ y = [1641051, 1651428, 1659619, 1664920, 1665911, 1661367, 1650614, 1633278, 1609453, 1580405, 1548555, 1516369, 1485493, 1457147, 1432694, 1413163, 1398347, 1386787, 1376406, 1364777, 1349356, 1328532, 1302742, 1274016, 1244308, 1214607, 1185536, 1157927, 1132397, 1108902, 1087161, 1067259, 1049445, 1033583, 1019146, 1005598, 992511, 979495, 966393, 953520, 941404, 930201, 919539, 908973, 898512, 888598, 879611, 871465, 863723, 856038, 848294, 840435, 832501, 825002, 818820, 814277, 810524, 806373, 801655, 797266, 793944, 791637, 790139, 789659, 790253, 791237, 791782, 791899, 792383, 793847, 796216, 799138, 802483, 806324, 810655, 815266, 819833, 824114, 828127, 832088, 836046, 839652, 842448, 844434, 846219, 848568, 851842, 855887, 860414, 865410, 871226, 878407, 887611, 899536, 914612, 932547, 952500, 973959, 997368, 1023596, 1052975, 1085169]
50144A085169L4749L7611M1107M5176M9534N3547N6313N7416N7418N7064N6320
50133A631424N4699N2462N0729N0205N0193M8943M4738L6792K5544J2188k308
50122B055609j7597l3092m7196n8143o5532p0250p2925p3238p1011o7083o2524
50111A417018n7565n1950m5969m0520l6236l3022l0392k7976k5693k3720k2252
50100A021723k1116j9755j7766j5373j3149j1352r735q024o338n034m251l745
50088H86085l238k816k781l173l661m021m337m574m322l301j893o52M57J863L575
50073H53211N074O037O653P230P986R210J0953J2527J2926J1921J0286Q778P504
50060I70296O356N355M267K693R29OK53N47k66j781k777l021l250l605l335k228
$$ y = [1085169, 1119918, 1157529, 1198636, 1243812, 1293346, 1346893, 1403206, 1460622, 1518040, 1575104, 1631424, 1686123, 1738585, 1789314, 1839519, 1889712, 1938655, 1983393, 2020185, 2045729, 2057917, 2055609, 2038012, 2004920, 1957724, 1899581, 1834049, 1763799, 1690874, 1617636, 1546625, 1479542, 1417018, 1359453, 1307503, 1261534, 1221014, 1184778, 1151756, 1121364, 1093388, 1067695, 1043975, 1021723, 1000607, 980852, 963086, 947713, 934564, 923212, 913477, 905453, 899115, 894081, 889830, 886085, 882847, 880031, 877250, 874077, 870416, 866395, 862058, 857484, 853162, 849861, 847968, 847316, 847773, 849636, 853211, 858285, 864322, 870975, 878205, 886191, 895401, 906354, 918881, 931807, 943728, 954014, 962792, 970296, 976652, 982007, 986274, 988967, 989896, 989902, 990155, 990702, 990436, 988655, 985878, 982857, 979607, 976002, 972667, 970439]
50044I70439j177p75k10J684M733P576R326J0487J2030J4138J6127J7459J8445
50031A080282J9767K1536K3204K4490K5927K8091L0563L2328L3207L4222L6215
50020A389832L8556L9810L9403L8006L6199L3532K9330K4096J9420J6439J4875
50009A719498J3680J2154R992O608J106o908j6849k7534l7744m6283n2082n4742
49997A520896n4908n3728n1890m9300m5726m1504l7481l4327l2041l0169k8456
49986A061366k7030k5965k4898k3316k1130j8680j6331j4357j3045j2454j2066
49975H52094j1129r490p692o163m769l383k328j907j826j613j275j133j144q50
49961G97392L0J329K741M138N585P250R183J1023J2059J1800J0410Q412O184L992
$$ y = [970439, 969262, 968487, 968277, 969961, 974694, 982270, 991596, 1002083, 1014113, 1028251, 1044378, 1061837, 1080282, 1100049, 1121585, 1144789, 1169279, 1195206, 1223297, 1253860, 1286188, 1319395, 1353617, 1389832, 1428388, 1468198, 1507601, 1545607, 1581806, 1615338, 1644668, 1668764, 1688184, 1704623, 1719498, 1733178, 1745332, 1755324, 1761932, 1763038, 1756130, 1739281, 1711747, 1674003, 1627720, 1575638, 1520896, 1465988, 1412260, 1360370, 1311070, 1265344, 1223840, 1186359, 1152032, 1119991, 1089822, 1061366, 1034336, 1008371, 983473, 960157, 939027, 920347, 904016, 889659, 876614, 864160, 852094, 840965, 831475, 823783, 817620, 812851, 809468, 807140, 805233, 803407, 801794, 800519, 799386, 798242, 797392, 797422, 798751, 801492, 805630, 811215, 818465, 827648, 838671, 850730, 862530, 872940, 881352, 887536, 891528]
49947H91528K202J011N1j332l374n722p887r596j0745j1364j1625j1635j1322
49934H10190j0762j0420j0720j1415j1781j1377j0299q830p261o012n340m862
49922G01111l848k122k41J290K527L566M168M234M189M428M734M770M907N892
49908G39605P725R471J0340J0546J0759J1085J0973J0051Q688P597P069O667N663
49895H56239L670R38j908m394o539q674j0937j3018j4499j5255j5370j4779j3331
49882G42143j1259r206p715o890o655o939p386p319o450n240m184l056j490J01
$$ y = [891528, 893730, 894741, 894792, 893460, 890086, 884364, 876477, 866881, 856136, 844772, 833147, 821512, 810190, 799428, 789008, 778288, 766873, 755092, 743715, 733416, 724586, 717325, 711313, 705973, 701111, 697263, 695141, 694900, 696190, 698717, 702283, 706451, 710685, 714874, 719302, 724036, 728806, 733713, 739605, 747330, 756801, 767141, 777687, 788446, 799531, 810504, 820555, 829243, 836840, 843909, 850576, 856239, 859909, 860847, 858939, 854545, 848006, 839332, 828395, 815377, 800878, 785623, 770253, 755474, 742143, 730884, 721678, 713963, 707073, 700418, 693479, 686093, 678774, 672324, 667084, 662900, 659844, 658354, 658455]
$$ [...]
##END NTUPLES=NMR SPECTRUM
##END=
