
##TITLE=UV1284_M2_1207-1380_5_7534271_FqrwcXI66w
##JCAMPDX= 6.0         $$ Bruker NMR JCAMP-DX V2.0
##DATA TYPE= NMR SPECTRUM
##DATA CLASS= NTUPLES
##ORIGIN= BRUKER
##OWNER= Administrator
$$ 1.72 TOPSPIN		Version 2.1
$$ 2013-02-22 03:15:04.319 -0500  Administrator@X
$$ Compression mode = diff/dup
##.OBSERVE FREQUENCY= 400.02188249412
##.OBSERVE NUCLEUS= ^1H
##.ACQUISITION MODE= SIMULTANEOUS (DQD)
##.ACQUISITION SCHEME= undefined
##.AVERAGES= 8
##.DIGITISER RES= 22
##SPECTROMETER/DATA SYSTEM= spect
##.PULSE SEQUENCE= zg30
##.SOLVENT NAME= COFFEE_meoh
##.SHIFT REFERENCE= INTERNAL, COFFEE_meoh, 1, 14.98509
##AUDIT TRAIL= $$ (NUMBER, WHEN, WHO, WHERE, PROCESS, VERSION, WHAT)
$$ ##TITLE= Audit trail, TOPSPIN		Version 2.1
$$ ##JCAMPDX= 5.01
$$ ##ORIGIN= Bruker BioSpin GmbH
$$ ##OWNER= Administrator
$$ $$ E:\/data/COFFEE/nmr/UV1284_M2_1207-1380_5_7534271_FqrwcXI66w/10/pdata/1/auditp.txt
$$ ##AUDIT TRAIL=  $$ (NUMBER, WHEN, WHO, WHERE, PROCESS, VERSION, WHAT)
(   1,<2013-02-22 03:14:55.882 -0500>,<Administrator>,<X>,<go>,<TOPSPIN 2.1>,
      <created by zg
	started at 2013-02-22 03:13:49.351 -0500,
	POWCHK enabled, PULCHK disabled,
       configuration hash MD5:
       86 BA 57 50 F2 9D 5C 9B 26 00 A9 28 5F 66 2E 89
       data hash MD5: 64K
       8C 53 64 5E A7 2F DD 6C 11 D1 D6 90 B2 96 4D E4>)
(   2,<2013-02-22 03:14:59.054 -0500>,<Administrator>,<X>,<proc1d>,<TOPSPIN 2.1>,
      <Start of raw data processing
       efp LB = 0 FT_mod = 6 PKNL = 1 PHC0 = 0 PHC1 = 0 SI = 32K 
       data hash MD5: 32K
       48 F7 74 AA C1 07 0B 54 18 18 15 79 B9 1E 58 42>)
(   3,<2013-02-22 03:14:59.554 -0500>,<Administrator>,<X>,<proc1d>,<TOPSPIN 2.1>,
      <pk PHC0 = 66.91223 PHC1 = 0 
       data hash MD5: 32K
       A2 69 91 BC 14 7F 9D 1C BA AF 62 EA A5 E8 8C 0F>)
(   4,<2013-02-22 03:14:59.772 -0500>,<Administrator>,<X>,<proc1d>,<TOPSPIN 2.1>,
      <abs ABSG = 1 
       data hash MD5: 32K
       D2 14 0C A5 87 F8 19 70 EB C4 40 C4 5F BF 23 13>)
(   5,<2013-02-22 03:14:59.960 -0500>,<Administrator>,<X>,<proc1d>,<TOPSPIN 2.1>,
      <abs ABSG = 2 
       data hash MD5: 32K
       DF 84 51 3D 03 A4 6F B6 AC 4D E7 31 32 BB D9 0B>)
(   6,<2013-02-22 03:15:00.116 -0500>,<Administrator>,<X>,<proc1d>,<TOPSPIN 2.1>,
      <abs ABSG = 3 
       data hash MD5: 32K
       C2 13 25 2C C7 68 21 1D 90 47 9C 07 69 14 5A 16>)
(   7,<2013-02-22 03:15:00.288 -0500>,<Administrator>,<X>,<proc1d>,<TOPSPIN 2.1>,
      <abs ABSG = 4 
       data hash MD5: 32K
       43 7A 6C A8 7C EF 09 D3 EC 68 A0 16 53 80 06 B8>)
(   8,<2013-02-22 03:15:00.429 -0500>,<Administrator>,<X>,<proc1d>,<TOPSPIN 2.1>,
      <abs ABSG = 5 
       data hash MD5: 32K
       6F 2F D3 AA B1 82 60 66 49 6C 9B 20 B7 6E 01 75>)
$$ ##END=
$$ 
$$ $$ hash MD5
$$ $$ C5 E1 32 FB 65 B7 29 3D 50 50 5E E5 5B D0 35 9A
##$RELAX= 
##$RELAX= 
##$RELAX= 
##$RELAX= 
##$RELAX= 
##$RELAX= 
##$RELAX= 
$$ Bruker specific parameters
$$ --------------------------
##$DU= <E:\>
##$EXPNO= 10
$$ [...]
150 150 150 150 150 150 150 150
##$TP07= 0
##$TPNAME0= <>
##$TPNAME1= <>
##$TPNAME2= <>
##$TPNAME3= <>
##$TPNAME4= <>
##$TPNAME5= <>
##$TPNAME6= <>
##$TPNAME7= <>
##$TPOAL= (0..7)
0.5 0.5 0.5 0.5 0.5 0.5 0.5 0.5
##$TPOFFS= (0..7)
0 0 0 0 0 0 0 0
##$TUNHIN= 0
##$TUNHOUT= 0
##$TUNXOUT= 0
##$USERA1= <user>
##$USERA2= <user>
##$USERA3= <user>
##$USERA4= <user>
##$USERA5= <user>
##$V9= 5
##$VALIST= <valist>
##$VCLIST= <CCCCCCCCCCCCCCC>
##$VD= 0
##$VDLIST= <DDDDDDDDDDDDDDD>
##$VPLIST= <PPPPPPPPPPPPPPP>
##$VTLIST= <TTTTTTTTTTTTTTT>
##$WBST= 1024
##$WBSW= 4
##$XGAIN= (0..3)
0 0 0 0
##$XL= 0
##$YL= 0
##$YMAX_a= 569020
##$YMIN_a= -565843
##$ZGOPTNS= <>
##$ZL1= 120
##$ZL2= 120
##$ZL3= 120
##$ZL4= 120
##$ABSF1= 14.98509
##$ABSF2= -5.573092
##$ABSG= 5
##$ABSL= 3
##$ALPHA= 0
##$AQORDER= 0
##$ASSFAC= 0
##$ASSFACI= 0
##$ASSFACX= 0
##$ASSWID= 0
##$AUNMP= <proc_prof1d_extract_pilot.lims>
##$AXLEFT= 0
##$AXNAME= <>
##$AXNUC= <1H>
##$AXRIGHT= 0
##$AXTYPE= 0
##$AXUNIT= <>
##$AZFE= 0.1
##$AZFW= 0.1
##$BCFW= 0
##$BC_mod= 0
##$BYTORDP= 0
##$COROFFS= 0
##$CY= 15
##$DATMOD= 1
##$DC= 0
##$DFILT= <>
##$DTYPP= 0
##$F1P= 0
##$F2P= 0
##$FCOR= 0.5
##$FTSIZE= 32768
##$FT_mod= 6
##$GAMMA= 0
##$GB= 0
##$INTBC= 1
##$INTSCL= 1
##$ISEN= 128
##$LB= 0
##$LEV0= 0
##$LPBIN= 0
##$MAXI= 10000
##$MC2= 0
##$MEAN= 0
##$ME_mod= 0
##$MI= 0
##$NCOEF= 0
##$NC_proc= -8
##$NLEV= 6
##$NOISF1= 0
##$NOISF2= 0
##$NSP= 0
##$NTH_PI= 0
##$NZP= 0
##$OFFSET= 14.98509
##$PC= 1
##$PHC0= 66.91223
##$PHC1= 0
##$PH_mod= 1
##$PKNL= yes
##$PPARMOD= 0
##$PPDIAG= 0
##$PPIPTYP= 0
##$PPMPNUM= 2147483647
##$PPRESOL= 1
##$PSCAL= 4
##$PSIGN= 0
##$PYNMP= <proc.py>
##$REVERSE= no
##$SF= 400.02
##$SI= 32768
##$SIGF1= 0
##$SIGF2= 0
##$SINO= 400
##$SIOLD= 32768
##$SPECTYP= <>
##$SREGLST= <1H.CDCl3>
##$SSB= 0
##$STSI= 32768
##$STSR= 0
##$SW_p= 8223.68421052631
##$SYMM= 0
##$S_DEV= 0
##$TDeff= 65536
##$TDoff= 0
##$TI= <>
##$TILT= no
##$TM1= 0
##$TM2= 0
##$TOPLEV= 0
##$USERP1= <user>
##$USERP2= <user>
##$USERP3= <user>
##$USERP4= <user>
##$USERP5= <user>
##$WDW= 1
##$XDIM= 32768
##$YMAX_p= 463606888
##$YMIN_p= -680932
##$CURPLOT= <Network HP LaserJet P1505>
##$CURPRIN= <$Network HP LaserJet P1505>
##$DFORMAT= <normdp>
##$LAYOUT= <+/1D_H.xwp>
##$LFORMAT= <normlp>
##$PFORMAT= <normpl>
##$SURQMSG= 1
$$ End of Bruker specific parameters
$$ ---------------------------------
##NTUPLES= NMR SPECTRUM
##VAR_NAME=  FREQUENCY,     SPECTRUM/REAL,   SPECTRUM/IMAG
##SYMBOL=    X,             R,               I
##VAR_TYPE=  INDEPENDENT,   DEPENDENT,       DEPENDENT
##VAR_FORM=  AFFN,          ASDF,            ASDF
##VAR_DIM=   32768,         32768,           32768
##UNITS=     HZ,            ARBITRARY UNITS, ARBITRARY UNITS
##FACTOR=    0.250966925370066, 1,           1
##FIRST=     8223.43324360094, -104400,      -276129
##LAST=      0,             108492,          -73855
##MIN=       0,             -680932,         0
##MAX=       8223.43324360094, 463606888,    0
$$ Real data points
##PAGE= N=1
##DATA TABLE= (X++(R..R)), XYDATA
$$ [...]
23799 -32630 115420 -15538 234369 -255918 -222879 268823 68977 141433 194010 111117 155980
23788 155980 -57354 -463568 199717 -183093 -22511 -95758 -192203 225579 135771 -70111 237537
23776 23919 -44153 29145 -125534 34417 -76692 99453 -36629 44729 255343 -86809 -313697
23765 -313697 -245371 -407102 -76891 -329069 82670 -101235 -20258 -83157 -13624 146994 91494
23754 91494 -37979 85369 133949 -424493 -415009 -8120 156067 -149281 92111 -286092 80075
23742 -164539 -85182 -50639 108621 71812 70733 -268821 117358 -43012 108411 -215085 -179427
23731 -179427 56785 -42973 189802 124366 91566 409175 200540 -11718 -271982 170814
23720 -150158 86618 -165503 155211 108671 113194 74862 -232611 138989 27957 44055 80518
23709 80518 -28802 15882 -176294 -151825 143659 -173254 -452475 117598 24765 72565 135067
23698 135067 258061 233768 29127 -165156 251899 -181048 -160268 -275573 -123709 161517
23687 -80404 -121307 204459 -136187 -87790 63944 32486 205480 180965 43423 3195 -131601
23675 130790 288211 275518 -213851 -134944 53710 -16068 12474 39837 -356163 83085 -164620
23663 440640 -6235 -191560 -91137 353468 55478 -206 66035 -192591 98789 -24616 -44771
23652 -44771 292710 -114108 -84718 -274798 -51539 -133867 -394850 -366781 -111530 -6683 -300318
23641 -300318 -165758 27192 -78031 185512 98923 -299476 -129205 -101386 307385 -265828
23630 -118081 185660 32374 -504168 -120929 -132296 -308256 -272029 225992 -58654 133535
23619 347468 4781 225930 170184 192859 190963 153087 119515 55523 -90222 -48328 218080
23607 -224528 -91066 -151201 -64028 -247658 -290509 -89393 138594 361153 106814 -88937 -290061
23596 -290061 -94134 208988 -282390 -30624 -7093 -22667 36231 265573 129823 207399 23975
23584 172786 -79792 -175878 70316 -41193 -155330 1863 66756 -214248 238355 -2630 -347959
23573 -347959 123359 -106565 -389980 -186712 200393 -21592 -283244 270866 -312246 58303
23562 -101649 113706 -150074 -114441 369470 305974 96658 259520 -100915 259462 84694
23551 373659 -149153 -186080 -19634 -1443 216909 -14019 -16212 67991 197137 -35737 221044
23539 328881 24430 -112003 44943 165230 -229387 108591 -378372 -67754 58559 129440
23529 129440 -77328 -102163 -197369 59186 97082 49451 -80153 -53759 -147433 46832 -223067
23517 -327897 98699 56100 -214559 -182969 19722 198997 266195 -162972 -134354 61584 -76498
23505 -192025 80016 24796 -143641 -304664 -118751 57480 60404 -36457 75807 -204003 -332074
23494 -332074 126150 -141734 91086 -115478 123287 70745 -15960 -145681 -1512 -378094
23484 -378094 55958 -246481 -132124 -245575 -92150 122772 40374 -214526 191073 -130989
23473 -106960 154358 -839 -235202 230694 -34944 301016 -31327 117353 -34931 4024 -10900
23461 -58587 -337090 -32607 160827 -1156 -99615 122405 274913 134875 8748 -217825 206232
23449 -17733 218024 -13347 6138 63671 -332841 -119322 -410419 -247018 -88837 -132374 -100834
23438 -100834 291928 33886 -3723 -402109 -36052 160715 -113670 96600 47503 29812 -179182
23426 -306978 -180399 189222 -25893 -16825 -52629 -42544 79222 94639 -110080 61214 -281878
23414 -136628 -24705 -175925 -136755 50533 297238 -116590 160008 102606 43733 -12247 -23102
23403 -23102 -107416 186636 162159 -31688 -94587 44937 -395426 2473 36357 -13263 352776
23391 -55331 171083 -96598 -209214 52860 -53883 300645 -198417 -16574 -279696 155715
23380 27862 -114205 56527 -163369 213567 -92005 189456 -32219 -147472 -14906 -144482
23370 -144482 27423 -151096 275144 -11997 -173677 43129 35423 66899 10460 -98789 110135
23358 -113362 -143868 11008 -140013 -220976 153507 -118667 -217028 -142130 92021 -226924 -22535
23346 66436 60923 75184 93386 313930 12516 82799 -23413 -20564 -18834 -316855 14830 -285110
23333 -195599 63815 -14290 26124 -9978 -15089 -100780 196166 -401559 40884 -143576 -283794
23322 -283794 -68498 -174195 301218 -132774 158207 -2430 13118 -261964 -337143 85245 90680
23311 90680 80406 90939 -105118 -235632 162174 175677 -206495 -113652 121492 -151111
23300 -75011 67990 183902 61955 9741 -1152 102743 -317552 -116102 -62648 -129514 181815
23288 284981 35876 185033 25264 203883 177226 -7365 37222 99490 -151419 -136162 -102041
23277 -102041 115845 44993 -389538 63813 221069 -148888 -6244 142503 106837 -11412 29980
23265 107040 -260733 -253939 115442 126859 117190 -65696 -105090 -36938 -277349 -111734 -158416
23254 -158416 57654 277254 94258 171433 -28794 -126567 -151039 -134659 -94528 78533 37981
23242 -266693 -7933 -54664 172362 202416 -291177 12038 -117286 290350 -24006 -325700 -193168
23231 -193168 167835 218263 -69559 73767 216694 -102847 -292772 4598 -128141 -168071 -56517
23219 134904 -103749 63909 -12202 -123869 117377 41060 -266298 111105 181047 283483
23209 283483 -50936 126643 224854 -144390 -37610 -179044 170484 -153447 87951 128571
23199 128571 10600 50454 -218211 -29789 62075 15749 67941 -146113 258192 -118823 -99899
23188 -99899 53839 -43065 -59144 336317 81063 323228 -95154 -127463 -269548 52530 -52157
23176 357086 143106 235481 87913 -86855 54826 -125970 -133472 -151218 -41294 -190735 -100444
23165 -100444 -82364 -161186 -7002 -100684 84230 255438 268008 59873 -112211 235350 151920
23154 151920 -249736 146826 -248394 104199 -90707 -163873 -371742 -264167 -189808 97417
23143 -319403 -197984 -30251 105777 -197994 9606 -45495 -113624 137028 75942 37530 -265612
23131 -48479 227089 143835 -182972 -162829 16352 -26343 -134084 78811 -190232 64471 -55194
23119 11157 -286553 151581 -140065 -78221 -23489 124938 -33891 -115210 -19040 61757 264315
23108 264315 -90640 36027 216662 54287 -290673 -124628 57775 -156122 121966 43700
23097 347171 128151 109547 224582 -44653 165230 42306 -42827 238659 -188208 45653
23086 -119874 -150906 39502 -220530 245791 -389303 -318959 94837 333651 244386 160199 111558
23075 111558 51218 113589 -177361 -181804 -158253 -178837 49994 120768 -324024 -109429 -23834
23063 -17411 187502 -328617 56844 177321 48085 -55945 142633 31605 -93138 78366 -50782
23051 58517 -276389 -47104 152 160390 -136 -172435 44952 -37216 -67064 -38029 -281217 -124805
23038 -59229 -99715 262381 -212252 -100980 282802 -250363 -54052 39330 -3533 67974 -152537
23026 50421 -132832 112562 -22711 -6321 -87517 333751 151748 48853 81247 179436 21599
23014 -53948 37889 -14191 -123791 74622 -104354 -175289 -12400 26894 -651026 120791 187467
23003 187467 -94665 115750 84785 -14556 -141600 189160 -236728 147132 23506 -93495
22992 80774 -53716 -247475 237356 -207391 203693 -131612 136401 -265067 -192828 -1681
22981 6820 5700 -34314 -169674 265140 -133568 159754 -56866 -242373 270744 -191842 46390
22969 -61546 123779 196051 6488 41869 -39771 -71705 62658 64243 57944 47542 56628 -316964
22956 -85308 -18411 193814 187865 -89677 16276 -1724 -31717 184057 -22365 -186164 -226335
22945 -226335 -278943 -66616 194822 36225 -111090 -113279 -147035 -147970 -270636 32827 307317
22934 307317 354188 -296160 -78976 -96712 39478 160763 -23065 -167422 173781 -26300 -51222
22923 -51222 108255 -35357 -21071 145585 -88405 -248475 -213040 129247 -466 -65196 -312150
22912 -312150 259772 -195022 -137866 -48119 332380 -320319 -330887 -83113 186721 -95961
22901 267943 -199059 -23717 -438398 -35785 -128851 237311 365097 -183285 127782 -88578
22890 -31856 -77879 20308 -265462 239023 -65237 174055 150082 -19208 36306 9931 -286220
22878 139277 16799 111112 66633 -232990 -92463 -3586 -272695 2353 -2059 -46194 -197000
22867 -197000 1117 291607 -339770 31467 -212925 13058 -49360 -274652 -63914 139075 250112
22856 250112 163820 128674 -170620 -161635 -49479 292200 200056 109976 -136082 -101061 138894
22844 215325 -8784 204070 261691 -290387 -172515 -411373 -82576 9177 -49070 -249643 45365
22832 173046 -256041 -61224 -15740 -26290 222135 55256 36859 29396 78585 -38539 -170870
22821 -170870 108723 275931 -196537 -413106 -150537 125888 -9982 -231687 29941 194606
22811 194606 -145834 -51582 -224003 40524 143659 -67505 -114717 296282 -272411 -239396
22801 -239396 -109113 80984 173480 -14914 -132916 -14879 -141707 -7350 99939 -27069 -122068
22790 -122068 68774 -247183 216343 -3196 226583 -160414 34843 -19693 -41017 -177973 190577
22778 -66152 66005 53964 -343802 69399 -295585 -165473 -139953 -119088 -93847 -274852 263319
22766 119346 -197821 -301477 -28641 -32793 -136079 158928 -48483 -79215 190509 -185518
22755 175270 -483824 151230 145079 -335108 -44942 -57332 158023 81541 -32814 347980 99091
22743 -78152 6600 -509 99061 -2243 -121104 42800 37184 137273 -151252 324532 -29446 119000
22730 -68396 35475 -116388 5104 -133838 -386513 -295545 134638 -298844 73104 152181 -40987
22718 -8250 311086 -114078 -63992 -55894 -205687 37005 117861 -176666 125594 119246 -73112
22706 -288610 176814 158334 -49757 19856 -87862 13302 -114616 343396 -359849 -122992
22695 25157 -3154 -8545 16093 -130580 44805 120278 -76413 -138464 -116923 92162 -348764 -517895
22683 -517895 -55426 6629 -13553 -37974 -107355 -222180 321398 -102331 93346 248522 37047
22671 -63837 64284 237506 35031 -198851 -239200 324938 -153994 72457 -118920 107810
22660 -124339 -163883 -101964 179954 83669 -181748 -63163 -23376 -79976 72722 -157369 -22266
22648 -153242 -150507 116777 -220342 -4442 -68077 -77911 -149022 237682 204909 -177695 24530
22636 -509123 333101 -103097 -23202 98682 192188 -67563 163029 -92224 242980 224464 -22601
22624 -114925 -198050 -144722 91664 66295 -154381 -270087 96343 -31986 -190345 -150473 -507572
22613 -507572 -61572 -255682 -45407 47628 299464 -142678 -284605 -132946 294200 -101808
22602 -327345 137771 295424 -98541 -149416 229201 171087 -241277 164565 152481 -64993
22591 -90330 -64260 -65534 -290824 151497 164676 -116148 122404 -144528 -192385 304557 53442
22579 4019 98470 218505 -24585 -105541 -171450 40340 15208 -172908 -226368 16704 -33915
22567 153354 -204789 -188982 -138053 -158989 -21984 33601 39402 -23691 -515332 -258326 -128388
22555 131000 -179223 -94053 -156878 -51092 201813 123203 115818 89288 65233 -212850 -390902
22544 -390902 -213489 -50469 480862 -10774 14067 -99624 -83288 -270060 358077 -270554
22533 213888 125445 38489 -162804 -51537 93221 176176 56398 -219677 -434320 -41761 39296
22521 98153 -295566 -96722 20928 74182 -99598 -240191 189987 -43353 -7854 -130649 -58027
22509 309974 278843 -417697 -487525 -40480 -59810 420139 -191474 118740 -202570 48957
22498 -155565 -292919 -3026 170550 339211 -378591 23927 -387396 -255871 19698 100882
22488 100882 -181127 153289 -82051 -227452 -115271 108407 10893 155339 -276067 -217022
22478 -217022 -305599 234032 -107348 -329553 -345499 -49093 -58887 -296161 269062 78321 -151050
22466 231271 -144027 83936 -120214 -247616 -120344 75942 69269 -108708 77760 -129845
22455 178057 100977 -104671 24329 -98140 -365957 -99020 207052 156832 35966 96372 -126760
22443 108898 -481099 265618 -23709 35316 -53502 81800 -113018 -113442 -303847 -359811 -49179
22431 -66833 -7749 -344070 -137508 16717 298 -213731 279645 199260 -287682 275553 -371660
22419 -85237 -357894 112759 -25918 223410 256247 -19712 371501 -12885 -153663 -156634 -135443
22408 -135443 -140132 89864 236463 -122877 -91590 -59266 -91084 -345110 -33506 54926 290183
22397 290183 42645 36592 47035 -258283 207212 46101 -273184 -40939 -213539 -112170 229539
22385 -69384 -282051 -91953 -45656 -124488 15585 109171 263505 -41414 -267927 -97348 -252776
22374 -252776 52379 -267560 16107 -39526 -223150 -37947 113969 -30592 262807 -162813
22363 -124923 169725 -61684 -88193 -174392 227515 392104 110872 73541 139478 -56545 140929
22351 -187430 12858 -148436 172726 -444065 -68300 -70634 -172609 -201362 155088 9448 23059
22340 23059 -82088 81491 -224262 314573 -139513 247323 -20368 365244 50196 -81560 113084
22328 144045 -68021 134650 10379 -173746 166340 141558 120897 -236599 -349729 -51606
22317 177370 40135 -193541 53758 -213140 -152396 -278885 -78975 -49910 -142870 12969 -10183
22305 -35888 13168 -52301 -125485 -61933 -71653 -200295 -78768 15396 -92920 78299 -246027
22293 413923 -78126 -37416 -186165 351062 92705 70798 -141058 -93458 127667 -269950
22282 -192932 -450267 135386 -132981 -223412 -87238 -21088 -132210 -143253 -190726 23226 62867
22271 62867 -190124 -254675 -103258 108634 157248 165055 15065 14144 -75137 -156288 -44401 -192617
22259 -192617 -66535 -197836 -217437 96443 -35397 38001 -47928 180625 150869 -11024 -110628
22248 -110628 -123465 43339 -177674 -278953 -181885 -65976 -266083 65473 -222923 54430 504389
22237 504389 153328 28357 -59765 -183195 -62724 -208987 -183792 -233532 -116070 124297
22226 -112294 131861 -141582 -235565 -220891 -252903 -223974 54104 14176 -331311 407087 -307280
22214 189916 4706 -324400 130595 -243060 22214 171201 41168 -29693 -284665 49904 -377738
22202 -232907 -90389 7623 1261 -31719 -173482 73671 207430 -154761 -69742 -44938 21007
22190 -308389 -6082 -72972 -383610 -425500 -677924 157065 201283 -267134 49747 51449 -600848
22178 -34028 -298460 117538 236941 43503 -205942 422 -172191 -70443 166996 122900 285954
22167 285954 -24640 -79638 102485 -264267 -190149 -150094 -121173 -31857 -39436 -24354 -22197
22156 -22197 -255529 285304 -984 -2644 109272 -151234 173722 1888 135229 -27234 -240126
22145 -240126 74662 177041 -464662 -144657 -417287 -112297 61288 -86263 54681 -10473
22134 -131875 160537 -12022 -147753 -1604 -105922 -53103 45559 -36720 -48495 15856 113908
22123 113908 -73709 191797 -489869 -186445 -190786 282963 170198 -145614 -163434 -61411
22112 -53228 -150401 36915 -275134 108710 398230 -149495 167680 -98673 189271 74950
22101 183584 -203128 -24112 154039 -213919 -44352 51319 -126217 -201801 247706 -87638
22090 -51395 -59145 -407278 -283933 77778 43648 -404199 -73526 -169702 -106411 -79929 33799
22078 -299648 -15640 404 -292019 -154210 54774 -83526 -143170 -227634 -52521 -238066 16550
22066 -70234 18133 19501 -248260 60106 59332 -12631 30779 21554 107767 -155183 -195593 255815
22053 -14552 -321420 199513 8687 -88131 -244562 84132 21033 115531 16739 -296278 -285370
22042 -285370 -185762 350 -87890 -185518 81024 52273 9265 176307 194553 -139416 219777
22030 78117 -278265 41458 102496 -38502 -147148 -80787 -188588 -83572 107248 -113 -97627
22019 -97627 -92354 -85814 199450 -406221 -10162 -217145 -63418 -60109 -111383 19793 -16093 101794
22006 -262099 -221767 -48713 39973 26273 -19123 58836 -235297 -298981 166557 -86352 270082
21994 101968 70135 -292124 150175 -188594 -326959 -310397 59480 -127591 -235392 -132133
21984 -132133 152733 -60251 -187260 -75272 238798 -110141 33257 -73552 -356045 -229992
21974 -229992 -69655 -259860 -122334 136549 -57235 -112251 -317038 93384 54603 159376
21964 159376 -111505 -303971 -235421 256581 -123163 -294373 91444 -60627 -144496 -21413
21953 -21999 -62096 67244 -133565 -294517 198554 -183289 151669 -429450 -235336 137221
21942 187510 7723 210046 103490 -418827 137576 -144910 14319 135744 -145718 -5803
21931 -316228 255012 162595 125369 42290 -21465 272351 201557 -35816 224252 -17242 53485
21919 74007 -438546 -330196 -229709 164423 -28452 -112729 -407199 287781 -281070 -352584
21909 -352584 133411 -109098 -228976 114939 -327397 -166065 -95083 -159459 -154031 19797
21898 152270 77919 -8007 -65657 143739 -14691 -155906 -77167 216637 69624 -73321 36737
21886 -52866 -128498 -76809 -202892 -249085 -45138 8561 308975 -147396 -576774 -49715 -185653
21875 -185653 89318 -163912 -56057 149620 7323 -212078 285156 376061 2887 390345 243833
21864 243833 -172724 278756 -161943 -80570 -36268 45790 -129145 -115926 184160 -310751
21853 29351 -26997 40168 77465 -114264 -148764 -84469 -305534 -92983 61353 157105 -93182
21841 -225841 -165965 -2670 -71586 24165 153633 -98650 37481 -49565 -102198 -85445 -218487
21830 -218487 71416 -61806 -179508 -415161 -293379 -242561 -93195 -319475 85280 -236759
21819 -254260 -18756 -85495 141277 264542 -2815 -86047 -3186 -7978 -288212 8195 301411
21808 301411 129451 213417 -266838 -53516 -20355 225903 -126795 119834 -74474 195508
21797 -128833 -112163 -351181 -84385 64978 -2935 -104563 -186133 -38693 -185438 240382 84133
21785 -11703 110913 -256196 169282 -229332 -22141 -146053 -102323 56172 -143578 -165706
21775 -165706 -267782 213134 -42796 -143248 230200 -639062 293103 158093 8611 44282
21765 44282 22062 21784 -30227 -320053 16897 -43257 -132466 396042 -157722 205779 253581
21754 253581 318258 -158575 8873 -201112 128317 -54769 -119137 145742 -263768 99569 -15633
21742 -334865 9027 -2188 351931 -109081 50709 -113715 -76306 51937 105236 111532 -317750
21730 -209093 -32606 194328 -97006 43776 39905 -288472 -295076 -110444 203142 -282097 -15360
21718 -269768 -159683 -19598 -229724 64647 -42821 129007 -141583 46899 -131566 -181778
21708 -181778 209309 -855 132529 124409 -204022 -229995 16237 69264 5581 264048 -253110
21696 306949 -29995 10772 -276877 61724 -20178 -101793 -40778 -213078 -409299 -73963 15962
21684 -104067 -123121 100992 52966 -24107 -330132 -101229 -201477 198469 -122365 44144
21673 32821 -111452 -275667 73309 156946 -253613 -94442 151336 -94590 67940 -179838 -225444
21662 -225444 47303 -41033 109458 362606 78471 135740 -25456 -207825 -210562 87567 -35473
21650 179357 8030 121031 -296356 -82662 -237492 -85284 66665 25100 48912 -2637 178529
21638 218120 -108677 -148601 -39922 156058 95381 -115992 -260793 -99264 349169 -300428
21627 -191872 58726 -100468 -49303 -29558 -91726 -47177 -146634 116006 -4671 -95525 -205840
21616 -205840 -241785 3641 -261814 268647 -51112 -156977 -144641 -151531 102003 -429906 -392197
21605 -392197 -62912 -173958 -154148 -2036 182304 -8997 -111958 128621 -116179 -141770 -100487
21594 -100487 -127528 -83 -176357 -82753 -141014 -114363 -164695 -137301 162837 -412391 -364866
21583 -364866 -269134 175281 -58529 -44650 -207964 24953 -137812 -150541 339148 -4893 -55277
21572 -55277 74805 -71875 -272299 163045 -15092 871 80220 100193 116610 244727 -27268
21560 18724 -113109 45999 67717 41829 70879 -175585 -234412 161150 852 -91265 -474980
21549 -474980 329991 46720 -333733 -238249 -73482 38691 -69696 -203087 -104801 -271469 -55093
21537 233009 -17527 24733 -18233 -249354 44307 3245 -103685 13976 -68239 -66647 -85076
21526 -85076 27931 -39441 181453 -358532 44415 21089 -12799 46183 -280251 -109113 -223855
21515 -223855 -400294 -515143 108746 -53635 -92951 128856 -150750 127106 -322079 189603
21504 -122630 -267654 -149101 120918 -28105 196590 -94145 152718 -226687 -88237 -286035
21494 -286035 175516 262312 -190299 -135292 -23806 -418104 290857 -103007 207568 257050
21484 257050 -302413 236008 281086 35278 -325193 406640 -266549 -355538 -346681 98931 47645
21472 -208295 -136624 -234453 65402 -77643 225777 -13264 161223 17397 200253 34697 145437
21461 145437 28461 71819 22664 99579 -135841 -96229 -48158 130303 22017 -198697 -280781
21450 -280781 -152865 -37754 116524 -201171 129683 221626 13347 197396 -160378 219156
21439 317961 45181 219305 488797 209783 -3020 257935 200704 -162090 193251 38914
21428 60261 -1099 -144565 -300792 67626 -31772 25267 222529 73685 -219673 -303978 69509
21416 -198575 429861 393047 22864 -79025 -108335 -64622 154927 226228 -117906 125895 92268
21405 92268 -131937 -305489 647 21580 -197851 -39108 138636 153476 -65768 -477687 -122347
21393 109008 -202137 -125614 -70248 11391 -224938 109798 7422 -374811 13207 50784 -77275
21381 158479 -250852 -239218 -20543 -148073 -255969 -243456 -217089 -148130 51773 -65822 -94761
21370 -94761 83705 -35943 26635 5677 29777 241034 -138600 -57540 -61134 134278 -191158
21358 -330595 212834 -405278 -387269 186699 157126 -308553 3185 -173265 160847 88155
21348 88155 -136623 -238570 -163720 -134325 -111333 -128889 41055 -11910 -53657 38172 -305117
21336 -292709 -223568 -85100 -222384 -173991 -91528 -385896 189942 62 -141359 -79950 148013
21324 -118275 -380147 29478 253696 -166809 54641 -54694 91157 17465 -71111 -324324 183772
21312 -38607 53934 -135037 -242573 150728 -322919 -418478 158305 28232 -221220 -319174
21302 -319174 38598 -81030 -14983 -48327 50582 -232093 -208236 -175022 70700 -265087 -165563
21291 -165563 47890 -291513 95843 450 244912 -48846 208613 103973 2001 -81430 208459
21279 92494 29065 -80588 -107370 220140 155595 -16086 -362170 -296854 276245 40481 -78967
21267 -265192 137889 -91141 -31710 65080 -2634 -463337 -154656 25133 386466 -36056 -188822
21256 -188822 139160 306585 -181245 -47048 -53347 98022 74938 180513 -239570 230419
21245 37466 365183 -237939 -182356 107049 18791 -171981 215929 -297454 -244143 -183879
21235 -183879 -34325 -32529 -78522 19952 -409415 -126924 -47652 53554 -88943 179365 8014
21223 -32037 -21959 -122118 -13079 -83292 357761 -163108 310110 369249 -62559 -39830 41038
21211 -179057 -96716 -384222 174728 -103542 -53809 -58355 -229713 -31680 87159 -90221 -78968
21200 -78968 78348 -270718 -12556 -113108 295010 -72216 164683 -312128 315690 -217153
21189 227423 -230022 -260823 55854 54346 -113764 211628 -43355 -389140 -120420 -163963 -4980
21177 137147 11304 34387 -19630 125034 89190 -19571 16011 -185581 -202621 42850 167242
21166 167242 225053 -20843 26626 -84678 -8015 -133238 -142432 -51868 -190055 18749 -58900
21154 171399 -92677 -15358 -332639 -70137 294273 105505 -223659 -438803 175330 -324857
21143 -47207 -132968 -217422 201211 57673 -144366 121236 -9012 -30164 -82148 -58802 -118266
21132 -118266 -133867 -241223 -133429 186007 -305544 156408 238999 -411851 -192033 22549
21121 -99581 89859 168208 97336 -45376 63122 -294826 -208157 106038 184785 -144796 -54145
21109 44568 -101618 16969 14600 -117520 -225200 -97290 -335362 -435700 -196644 7336 151026
21098 151026 -38619 -198179 -5541 -97420 -136068 -92968 295345 -86104 32982 315816 113826
21086 1621 95208 -346134 446585 65087 -458767 175004 134158 -351295 22225 29801 -48106
21074 -200310 -202253 49900 108388 -131348 -109771 70427 248056 254134 -30118 75357 128479
21063 128479 -38849 -431612 -82753 57308 158824 -73703 73694 -380463 -187522 112419
21052 112167 148869 -531319 -134108 37805 -30701 97981 -291678 77962 112866 -224574 -4594
21040 -205638 -173297 157171 -31122 102408 43263 225818 -71937 -325231 -192530 114651
21029 19440 -197853 -197626 -128633 -66358 96809 -180434 -123324 -441762 -119114 319031 -45518
21017 -179630 -218750 143148 -267485 10578 76727 182405 -154335 -40865 -30915 -121037 25124
21005 -332283 -11564 -176536 -244569 396848 54910 -89364 135628 42812 -270148 147165
20994 314926 -66777 37492 -237589 -260976 -224447 -296003 -290162 341190 -215071 -70836 90497
20982 9743 -54857 91812 -109448 -1866 -45177 53498 175665 35759 163667 -27174 -169986
20971 -169986 -107919 -91871 5846 -201131 119797 159452 -207233 140188 177663 176757 -108339
20959 1304 -320062 -101722 -29558 -172075 20977 -166926 -233533 -142054 -215634 -154405 -142694
20948 -142694 -108331 89731 -87828 -209502 148373 146505 -65219 -209186 -85727 -259418 -239437
20937 -239437 -114432 324447 -26091 -35446 52017 105769 54599 -210835 102261 92326 68828
20926 68828 103543 -149036 120603 180309 -129411 -210340 -110327 -287459 -236173 -126867
20916 -126867 82680 38840 302605 -405916 239877 -112403 -65007 10839 -235004 -85795
20905 -150855 -33480 -112769 -107262 97034 -310909 -10439 163891 -207844 -72506 -367841 -56416
20893 19337 -52076 116687 -80489 -298588 33329 -301044 306913 -196868 -261826 249079
20882 11785 -427470 -232649 -339803 103707 46241 -183907 -1404 -21294 45026 184562 -136685
20870 -280839 -43239 -253487 -90723 -102723 -415090 113469 120737 -14955 -74216 77555 -169405
20858 -172656 -166509 -163370 -254089 -167257 -46860 -104656 -124921 -273363 -106134 61435 -412539
20846 304634 -233824 -58443 -75789 -43917 248801 -145322 -24172 21066 -101713 -257578
20836 -257578 -141882 -108329 -38211 154961 170427 -59100 -350871 41613 274509 -216124
20825 -11770 -124746 171053 -668225 71438 127667 -88229 -283323 -19610 -254597 -54790 -214253
20814 -214253 324821 -223813 -99383 82568 59520 -293322 269522 35561 77542 -188020
20803 -34960 -311418 -98808 75057 17307 150329 -86735 -63714 -225081 29825 -43742 44434
20791 -34303 -142321 45202 -136159 44296 -120174 -248288 384662 -13191 -154463 -194829
20781 -194829 54368 24277 -186996 -38288 -193394 144665 -10666 -26029 317463 111497
20770 148927 -279168 -97653 139231 -105375 -91614 97506 202376 -474081 273714 -158150
20759 -52827 144897 -241623 -194520 60276 -268176 -126300 133399 -125132 -152043 -10945
20748 -40747 -63215 -285351 -192948 -85844 -6712 -178311 132340 -304858 -69187 -110373 213529
20736 -103771 314853 160520 -80935 -168742 -162545 375714 -11244 30597 171618 -210927 -102451
20724 -55274 -42182 -163112 90478 -78353 -351450 -130697 131377 26610 -104810 -438803
20714 -438803 -99991 -6538 -249818 48697 -11442 186852 -263268 223757 -60307 40710 75680
20703 75680 -59051 116701 -49280 -27448 -95352 -214003 159905 4519 -156982 6985 -90218
20691 -36826 -150796 -17695 -21357 132153 -185077 103151 34166 151004 -99909 151976 135360
20680 135360 -84475 -139930 124491 -157309 94910 227082 -266331 148890 16022 44877
20670 44877 -251768 9144 41662 208135 -41631 -228416 -259572 -181381 -99812 -46301 219696
20658 -281001 -343583 -34786 46109 -36001 -57332 72766 -247953 28257 55358 88777 -97246
20646 -228932 -93073 54023 -284977 259858 -97892 -71782 29174 84972 -27950 -72717 -220511
20635 -220511 -106542 -178707 186496 -170095 -2086 133168 -191420 110514 -25318 22979
20624 -100018 -232127 110045 -399885 -254131 -203649 -34778 -85909 62651 55357 -188953 202686
20612 20836 -237370 -42364 -151430 130790 -40875 -197305 -110328 -406553 -268313 -5118 -105057
20601 -105057 -207040 71368 -97731 -125039 -142486 114344 50362 -46732 170237 323851 -337185
20589 63092 -167880 -93381 -142152 -67395 112694 -183580 156733 -48259 84084 40578 -341002
20577 426054 -79646 -242525 -52342 -173564 826 -233164 -1658 -376196 -127644 8400 -185137
20565 -151892 110983 -190788 -177629 201549 95080 62861 20095 116022 30425 -38162 -244903
20554 -244903 -409352 326841 -184776 -226170 134824 143342 101290 163075 145153 -218436 65071
20542 58548 146487 430910 85662 -8856 -388962 -69256 145083 -282827 -268181 -18797 158098
20530 -164517 60738 -197585 -212974 84236 12469 -96481 18627 -263323 173525 -134690 38570
20518 -170119 -221873 24371 44938 -147859 -311088 183721 88698 442677 -302174 -97442
20507 10586 373776 175568 5496 -139920 -30880 -18452 275151 -263154 -43321 -319927 -94815
20495 -211199 104332 -130883 -129611 -46577 72350 91460 351427 -299484 5206 -212192 147006
20483 24087 -381582 -443157 -383302 44256 -46635 -306547 -248691 -23075 -55400 -125624 18973
20471 120277 124041 -188071 -13252 -19732 -159893 -54185 -123712 254220 -129869 -247828 28506
20459 177860 104332 65521 137490 73997 257497 124493 10942 -46180 110473 -90114 -49615
20448 -49615 -18895 -27466 -223633 -93129 -80897 -71853 -82768 171482 -15477 -123591 -348877
20437 -348877 -81091 -349277 184473 -78576 32445 -186852 112140 58409 177554 -94697
20426 327426 121776 155389 231569 -150358 -79322 193225 96644 -320569 -162595 110919
20415 9308 -182071 75139 124160 -88871 11837 -114486 -188497 40428 -200346 102344 21769
20403 -105172 8720 67845 -248303 46247 -247920 -166033 -183922 -22012 96532 71170 51556
20392 51556 -135322 176863 151746 -128078 161509 -44431 -275729 183338 237437 -3198 -230015
20381 -230015 -43119 229317 -246686 91030 199754 102385 -286197 208414 27965 69354
20371 69354 -310301 6605 240581 -175786 -109752 -202344 -74664 -316791 337376 170297 338380
20360 338380 90046 239556 -107760 -91777 39906 -37266 -247075 -224207 56375 -413424 15806
20348 -134430 -189739 205946 117213 -420114 47877 -278849 -366132 -74842 -44680 -82093 -458397
20337 -458397 -227273 -292362 98570 -139460 -37553 48218 335658 -48637 34774 -311802 -183816
20326 -183816 -118430 81805 -50047 -99841 -23238 148594 -54744 123029 -149614 -16118 -216380
20315 -216380 34784 -112336 -431042 338831 -306416 -354591 121309 -275863 -167305 -159616
20305 -159616 -104645 -26132 88719 -104167 -223488 164609 282431 -104185 -202304 -231386
20295 -231386 -150269 17652 -6693 -306406 -196561 -125507 -409763 -142067 -211226 -230045 -106470
20283 45559 -167226 -112393 116789 34791 -153114 -144258 -30764 68880 12873 211429 -56337
20271 14391 -38907 10493 -44278 69765 24507 -61774 -125477 167654 20073 -269830 -262257
20260 -262257 46489 19183 146909 139121 -176970 10442 -353788 -291020 -86036 65849 -60279
20248 -89427 -47535 -255313 -185439 -240263 -345875 126247 -177089 -293029 -130883 -43851
20237 -30628 -133291 -75025 -110217 446263 159207 24710 -154568 -126458 -225325 -247633 -23682
20225 49571 -305679 -9929 -222365 4097 65555 34809 137584 -88674 -61885 -159177 -5694 -289673
20213 -289673 -121971 -108170 134369 -169157 207321 -259833 61183 -36141 2554 105509
20203 105509 -75392 -20565 -278717 886 -103882 -106459 -608424 119174 -172913 -13890 -142920
20192 -142920 -28800 -308612 -149037 -182562 52929 -109480 315203 126586 210646 -23653
20181 129883 -226356 -13214 153195 -29562 -142374 19275 -101209 -70798 14378 -49156 233748
20169 -376278 -213319 129013 -113894 -9159 30929 38739 -240141 -190890 278928 82417 -105714
20157 146994 -293169 63492 102917 -204919 -98851 230683 -137873 -152221 54164 93149 128020
20146 128020 15013 149964 -46049 -3001 59010 -278505 -86640 98148 129580 -194687 -125309
20135 -125309 98626 104549 -65633 -53342 -28710 168481 -74684 -121976 -139515 3389 -88203 -132410
20123 -132410 79467 -349995 208724 -10667 -209813 17682 -90324 -66032 -142613 190516 103649
20112 103649 116367 -20606 70111 152261 237620 -59671 -197738 -119257 -44034 -73068 -31194
20100 103607 -159287 -131189 -308995 -73976 -32471 -41890 -324315 202946 42654 -70804 -311985
20089 -311985 -71820 275259 -124249 -244143 -34602 -360608 95307 65389 -276982 -100411
20078 -262698 57750 -46266 263418 -22671 -183503 -136107 166441 291851 72042 7777 11773
20067 11773 -66222 -99293 114625 212400 -16495 -184336 -135863 -195794 -94865 -4539 85574
20055 22543 -393814 -104125 -178309 -216195 -33642 190726 227699 69345 -17079 -299350 -270358
20044 -270358 -258118 -33875 98840 -259520 -150065 -114440 134802 -159386 -116208 -206619 41679
20032 -44210 -110589 93811 -23646 -167267 -212400 45810 -284655 64802 16411 -347119 -239204
20021 -239204 -110222 -135669 29728 116888 -105146 245883 163860 319214 -173868 251615
20010 -15236 -224755 40437 -69265 92028 260697 -60882 46517 -156306 -279777 18036 -233604
19998 -141903 10105 102731 -312188 -104965 -445078 190461 54774 -239751 67348 202600
19988 202600 -50293 -6215 -56240 7974 -177651 -397258 193739 58263 -4281 -27091 -295552
19977 -295552 -321731 171770 8250 2361 15992 19380 341705 -144072 -90755 6667 95359 -12447
19964 -176952 -237458 167209 119551 -22907 -186816 48560 -74126 -59935 242895 -88794 -373885
19953 -373885 -291534 74449 -128515 -203012 -74426 -105487 -1103 -240145 -14271 177186 251007
19942 251007 -45610 320237 63637 80719 -151693 -168173 496097 -361550 -151214 -317152
19932 -317152 -253846 82955 -77156 65921 -56952 -176160 -190647 -119224 -191774 -82557 -26109
19920 -641 -77611 155359 220613 -541486 230802 -346705 -159016 -162789 287066 -166348 -331382
19909 -331382 -262517 -23916 -506170 -39998 319099 81132 -224483 93006 -124137 169354
19898 -163781 -187142 239408 82767 -8571 -62924 -23324 25815 -333050 67321 -166921 9316
19886 -131178 133423 -54258 -130656 -41637 -28769 91321 -117970 121239 -326143 -100117
19875 -54321 -206453 -193752 179981 -192067 -244542 23794 147136 -184650 121383 -89128
19864 -191510 -2706 -118167 98355 -432665 -255485 -297673 -297345 -39042 43234 139242 -71103
19852 88012 -383981 258940 -73000 -279913 -71892 297726 209049 14937 -191702 -356101
19842 -356101 43457 -131473 -27997 -57400 363391 -106851 -250540 -175009 193880 -164104
19831 -47526 30522 -175760 -105803 137449 -158314 -178265 110052 100975 -207216 -199153 -195397
19820 -195397 111825 -236238 -297373 179392 -80723 -94027 -55671 -39584 -217966 -35164 -27914
19809 -27914 -275341 76757 -313310 71225 168923 15886 418065 -99887 181053 -3404 -209810
19798 -209810 113451 -18483 31534 -201994 128400 -427923 -82395 269439 -69859 -222792
19788 -222792 166386 -199988 -122699 -183548 -193350 -110544 221780 48343 -108052 -31482 -38357
19777 -38357 -140407 -188802 165968 -122851 348652 12353 -163193 -181507 -268365 -120724
19766 -167874 -141028 94831 290688 91495 -112258 -71833 104911 -67841 -178762 101914
19755 -27223 -157557 -190672 -205809 -21322 -121543 115999 -214602 -126968 -74267 118934 -215053
19743 5147 -114230 -56756 168331 -216178 -25652 90410 38571 -225272 -117695 -112147 248637
19731 319680 327442 -118941 -321610 -72423 6169 -228882 42485 13157 54907 -305663 -77709
19719 -41059 283158 137588 -264466 -89148 -248907 49710 -249757 218390 -80200 23219
19708 -202092 -22302 35646 -100265 73167 18381 139242 -29348 -110356 -22819 39810 -90325
19696 49295 175651 83232 -116607 92584 153020 -167532 -115858 -317320 -131257 -335755
19686 -335755 -96613 104591 69277 49348 -86063 250375 -35683 -60029 -158204 231645 -83174
19674 238008 -115893 -101329 -152138 -218623 97478 -111082 -148492 -257833 -140754 118020
19663 223453 128917 177502 -18685 -107872 30163 -231715 -69801 10434 -386903 27382 -44669
19651 -7988 -40989 66075 41645 -379760 -95192 -85734 -203804 65508 -235468 -59266 -5412 -29858
19639 -29858 8962 -123166 20001 -71807 -49636 -292611 -61190 -150455 -164484 -52270 -205419
19628 -205419 -308995 108341 -97878 -278721 156291 58835 177550 238518 -97412 -135161
19618 -135161 -258463 -78502 80261 73988 254620 28016 48730 275609 -253652 135170 -446227
19606 -7350 -310466 -97434 90994 -168901 -229843 -424261 -19679 45535 80542 121790 -222246
19594 -157272 68640 -184310 -188523 106731 119449 -337262 -79193 -166756 -120637 -110845 -390058
19583 -390058 -126465 324150 258713 -263003 104347 -35310 -146517 257953 -174068 -54447
19572 27520 -1158 129376 -335811 -349613 -85553 -49881 17743 55543 -61279 -246932 111004
19560 -143276 8361 -28301 114868 225265 8741 -58750 -4848 -30007 57688 -166474 -266316
19549 -266316 -79533 51775 -150395 187608 -52042 -249237 -229814 -148584 -155919 71227 -60210
19537 -125806 -31600 66316 -220610 -162854 -287877 -253272 -89221 -56345 68166 -89474 -2515
19525 93723 17195 269619 145339 -216302 -78431 6745 -92574 -253957 -58434 32961 -173380
19513 121939 140460 -280285 -177702 44515 -251032 -163790 -346402 -110363 85833 -138495
19502 107055 -53193 117109 4235 -43245 -500359 3429 51453 -114355 -94801 -71325 -35954
19491 -35954 -377057 -142403 -187813 -32947 50097 -272951 -84471 172437 140761 169878 67877
19479 -11270 35674 173845 46003 -260624 -122752 12713 -86802 103602 48203 40135 95800
19468 95800 88970 -379525 -45370 203129 -394429 -117293 -150653 -98995 -127116 -6350 -83182
19457 -83182 24941 -5733 -265856 124569 100768 -150721 147480 41214 -45884 -328099 -171538
19446 -171538 -127131 140248 -264613 -193147 -164578 134069 -157092 -9180 46884 91090 76055
19435 76055 -63110 -95134 33481 -93014 -169017 -46415 107406 -43919 -90172 -98362 -215723
19424 -215723 266380 -310652 -254581 80158 -35581 -252507 -137153 -66133 18268 -63213 146599
19412 -40300 -161106 -295333 173431 -377102 20262 -115338 141681 -268100 139467 76311
19402 76311 -18812 -192415 18391 -91153 -65314 879 -61694 135173 -294003 -30161 -201713
19391 -201713 137260 279473 184137 -225952 41304 217043 -107834 -62191 132818 101294
19381 101294 -155669 -677 133916 48808 75006 -168231 27009 88236 -78617 -269277 -60950
19369 -454968 -37100 -381907 -297659 164402 38831 -351362 -32231 -165311 -233199 -7532 -10033
19358 -10033 -258536 -54982 287899 219020 87108 -125608 212670 -129015 244267 -220604
19347 -47819 -341356 -203562 72652 56462 105785 43256 -14955 -58947 -232915 -68148 -201865
19336 -201865 -127625 34891 70043 70071 -20264 -390390 -96626 -13069 45590 -133717 28772 -60009
19323 -78348 15321 -206362 -173231 79984 194322 -333781 95475 -17738 15811 131838 215946
19312 215946 -380427 -242571 -185033 -100124 -134906 -221933 -232854 -230783 148807 -233111 -144616
19301 -144616 146028 46883 20551 -563473 -198528 752 -147274 222052 -211371 81266 4302
19289 -232020 -262160 -409088 -170110 -262449 -59165 -80503 86659 -286625 -248659 -19527 -65192
19278 -65192 348298 -144595 144185 -46690 -137778 174107 37097 -269573 -9064 -119980 -163210
19267 -163210 -46969 -59191 57448 -137556 -35307 49864 69271 -200968 151035 -100408 -100483
19256 -100483 307033 -69065 -162791 116313 -10843 58394 -225033 37618 -275376 -456660
19246 -456660 -79613 -303261 -174258 -212013 -148601 -415234 -247263 57191 39178 -32990 62812
19234 35739 -156903 -94527 408402 -256190 -172484 109420 -294309 -198980 -47415 -156839
19224 -156839 -216126 -48115 146502 -103679 4010 -44154 60136 31332 -286652 95049 44834
19212 -199891 -134114 -55397 -138339 -389568 51626 -335577 -464211 -49645 146045 167304 -224508
19200 -137795 66231 -182214 -197304 -114176 37247 -295367 -120358 -271346 -19799 137744
19189 -224176 -144483 -24233 -117902 250411 -18557 -188428 184992 66052 -103401 140041
19178 167811 133291 33964 -79642 -62337 131547 -344848 -238026 -23165 204389 124373 -277203
19166 -215840 -240246 39119 33641 -228027 -101374 -161607 -62360 -260253 -162295 -137915 3104
19154 199490 -174049 -132256 -268306 -199261 -79473 183612 -98754 -14851 103654 -418812
19143 -13258 60420 -95044 31533 -161559 -310264 -153775 -178351 258 66268 -34071 -270221
19132 -270221 -39500 -371257 -177664 90135 156192 95028 199471 -146054 -93139 -9678 -16003
19121 -16003 -42991 -234548 -46368 -154199 127979 70357 -195482 -71357 -16564 -162194 -108158
19110 -108158 -188192 -75196 -164999 4107 -16918 -309350 55885 -168235 46945 -253918 173771
19098 35518 -3667 -239350 -144286 -61844 122283 20117 147859 -272257 177163 34793 91753
19087 91753 -157549 -51020 -144671 -159324 -214338 -178005 -118104 -10483 -120072 164905 128238
19076 128238 -103126 -12294 -226902 -122040 14829 -181544 -95910 -32607 -147754 -29980
19065 -90198 -198750 -19549 -106184 41127 -211312 -137692 95958 -272392 -20408 2956 -324607
19053 -515548 135698 30178 400033 -116133 -152448 -30984 -257588 -3582 80625 -208100 -124761
19042 -124761 -188188 -166226 102794 -250277 75995 141884 -93230 -224678 131320 279469
19032 279469 10285 -93318 152708 56351 -81574 -137781 -295831 -64187 -67509 -74059 186219
19020 -375254 -157383 -185509 101114 238313 262937 3982 -255344 -231898 237686 -141548
19009 1468 -146989 -151918 165492 -43187 -226225 -189053 -15155 -164000 169451 23070 -34314
18997 -134771 161400 -83450 -123449 196045 -325536 4770 -153958 -228813 -315613 -302400 -272409
18986 -272409 -59225 66 -134862 307811 133322 -55616 -316480 15789 -118287 98573 -158652
18974 60787 376505 140214 79685 344161 -112007 -156980 121368 -90950 83082 -195964
18963 -102807 -321915 -194644 342311 42300 -138498 -157672 -176891 -17744 129650 -133949
18952 -108488 157021 -250559 -529933 -191988 -159120 181631 -124986 -27803 -54205 -150513
18942 -150513 -286073 -13745 71247 -175381 -315522 -430583 -366649 124334 86489 -131964
18931 68653 55684 -50278 -221642 -2988 -188039 -82660 87219 155903 -96219 375797 182698
18919 -123837 31932 55221 -27035 225725 193640 -30203 6695 298868 -136385 26629 78220
18908 78220 29246 -306003 138444 -177730 -262578 254285 78532 -78340 -227285 -135781 107096
18896 -371660 -97056 -485066 200613 22177 3 417561 80689 -107061 37155 -267667 99957
18884 -127265 142068 -186 242416 183426 -148122 -20764 112178 -363506 -10275 163292 -338105
18872 -404601 -37131 -318256 116184 69977 -91744 54449 -260079 -63596 20964 -182394 71016
18860 85727 -41444 -52815 55885 125555 -77644 -206265 98020 -151767 145421 -117653 -294852
18849 -294852 207611 -63123 -240063 252007 58384 -59900 185008 151593 -207809 73392
18838 27203 -69492 -310733 -78451 -127936 170470 179461 71946 -10935 147560 -118601 -96011
18827 -96011 -52798 -249440 -97132 15957 27793 -14039 181890 -263075 -186568 53448 107820
18816 107820 -138730 112274 117282 -97999 -73405 143367 282587 -88128 374954 173566
18805 220901 28809 -96008 -163971 -14826 254308 -13115 -300164 -228919 7702 -146425 -369194
18794 -369194 -3293 -449481 -149181 225824 -121025 -2000 -99589 -25327 -266705 -226229 -354852
18783 -354852 159055 -82750 -113941 156353 156334 -140569 45708 180664 -377243 -11712 -331344
18772 -331344 -243278 -244711 41922 -356960 130769 35934 -11854 56645 -80620 -119673 -240741
18761 -240741 48210 -113700 -204973 -132613 -977 -231139 336302 179290 74543 -69755 -309222
18750 -309222 -261521 -57560 -301100 59080 -423905 -278272 -86878 100182 -20151 39778 -44165
18738 78002 -165144 4673 143171 128104 153367 -85395 610 -441298 -184392 133334 216135
18727 216135 -3925 395587 328044 -221257 204227 111609 71532 33568 52995 -147502 39917
18715 -4120 -147263 -49420 261306 67197 164365 152007 117995 87319 10644 177500 -189064
18703 -155699 172343 -181483 -339883 233534 -296479 -73292 -121333 -127717 -17968 151695
18692 -40779 -223746 65578 3750 -549274 -75568 -205422 -73945 -88563 -86256 33875 95224
18681 95224 -3692 -482876 -75007 -93791 1560 -183012 -101259 -206065 -353748 37178 53066
18670 53066 96105 -368311 -152117 -46221 -9406 211478 -143179 -66737 20718 -287913 115196
18658 -189826 7648 -179910 -132073 -367301 -89116 -4124 -131663 17155 -107299 -116672 -65822
18647 -65822 -105491 75977 6634 9985 63688 -288351 -96169 85894 -14363 -214607 -298886 119623
18634 8166 -150999 -27569 -29677 -140091 129539 18961 -168771 -243383 -163802 -99082 109857
18622 324837 60128 -244950 77496 101314 100921 -25360 288138 -164329 125060 -37753 72359
18610 -158846 147296 -167769 -39411 -125883 -139616 91222 90676 144197 126385 -118829 43395
18598 -21270 -244467 -165217 -115669 -22209 -533355 -48614 -135573 -117674 -97714 6538 -358455
18586 205265 -374726 136589 63538 70977 -99004 -125409 -49376 -60329 61645 183508 -100108
18574 -145429 -122550 27716 -262863 63254 -36474 -260387 279766 -60631 -178947 -459236
18564 -459236 -103795 -169949 43478 -23234 -68459 264051 -33583 -153457 -42158 111372 -95350
18552 -86515 -39845 -93371 -68758 -130674 -65148 44271 164739 217348 42190 -126522 23679
18540 -172816 -115904 -176410 122343 20493 -422089 -112751 19 -309889 -141625 114323 287988
18529 287988 -466109 -147677 -213974 -160083 32981 -121231 380593 -257726 -30180 -78289
18519 -78289 40207 -184572 366556 -6721 101742 149155 -396209 -346460 -218172 -291781 -215177
18508 -215177 -131614 19527 -151956 -10228 -8959 -74030 141622 89844 -103617 -216564 27591
18496 -16501 -1338 200800 -5470 -246145 -276884 -104776 -208485 -250498 -147439 -88632 138595
18484 -230177 217805 -134994 159887 54697 -178553 292548 -29298 46319 -57808 -3765 41784
18472 -317303 179678 152101 -191835 -207680 166602 -46149 35022 -1917 -169553 -105547 -264787
18461 -264787 -6098 -259318 114852 101516 -73745 99184 104462 -194802 -195621 -65588 39554 217672
18449 217672 -146842 -250732 -120 -371294 -103313 -93863 105218 -88811 -283885 -175354 1423
18437 -299728 72660 -383597 147203 61066 13785 144754 -158801 -106306 60344 -61097 34252
18425 -223127 90576 -30195 271997 -431516 -121936 -209849 -74486 199340 327424 60187
18414 -100624 -224138 -76754 -153239 -265005 172159 215910 36897 -74382 -208099 -41530 275908
18402 129414 11086 -40197 227459 53682 134137 58249 -257356 -17283 113338 -187430 -252095
18391 -252095 -175193 120932 -435711 122714 -117192 13649 109514 -33108 -130174 220706
18380 171079 -249752 89718 -123625 54885 129997 363136 -170526 -242827 -239099 -263188 -179081
18369 -179081 -198362 -27399 -187573 209386 -34481 180337 19364 -187168 -123734 233502
18358 38439 -58040 85648 -115501 165533 -43064 46274 -187603 70428 -128646 65268 -179674
18346 304108 72022 -127862 -226046 -93541 141036 3760 139976 44039 -266973 -220654 -19068
18334 -50805 -6227 -96560 60425 -134996 -134107 -309001 -55286 -310931 -309599 75710 -141994 1170
18321 -126926 22041 -115148 28989 -283488 131383 135500 92371 -226712 426215 87886 -104189
18309 202202 -246819 -15169 179763 -71517 -121948 -264471 -79537 -75226 -78606 -101485 120139
18297 -128367 -167778 -216456 -67779 152821 -358940 156763 37773 246522 56423 149797 -133693
18285 182069 217895 -191067 15246 -353353 2255 36254 -45766 -6843 -74035 142542 159433
18274 159433 205180 55629 -122082 169868 144987 -37398 -38166 -126444 -82967 -197241 20181
18262 67056 116926 -413957 293236 -158632 -21170 -21308 104908 -272426 -73342 25453 63476
18251 63476 -1228 -128557 -144504 112453 -59588 232326 -361386 -308961 -49959 -236389 233028
18239 -4370 -19389 50742 8844 92500 235167 -339158 -156857 192031 173138 -129125 12144
18227 75663 -105592 177299 -129833 -93136 -135676 362917 -51851 156220 -132774 -139340 64549
18215 -176424 -88494 119954 -150504 -19091 -191231 150343 -132403 161975 -10145 -7049
18205 -7049 27345 -82992 -196282 66595 420642 -70865 -359728 -238029 -98543 192101 -445606
18193 -149247 32381 -199234 -282293 -153305 -46129 100865 94167 -140904 -76280 333136 84285
18181 -125296 19173 -43310 136344 -279224 -216352 -98504 -211686 194684 28623 -135413
18170 -12462 259363 -178453 57945 173855 237367 -136727 -19497 -175746 -192059 -260527 30299
18158 -122260 -359757 -58105 -205727 20783 146654 -35662 -126159 178589 -34799 70560 105286
18147 105286 81094 -182428 -35997 108586 -134806 37952 680 -18381 30492 -151865 837
18135 174236 -51441 130311 43012 -205224 -164977 24632 75541 -80490 -104665 -370041 143562
18123 -133039 -49333 -152300 -281501 455113 -122677 -156819 -26213 -240688 78770 -169308
18112 55091 -119178 183814 -165269 105095 -143809 88762 -55944 200603 127729 120343 30384
18100 -227621 -26966 -131466 41719 -76245 -45196 294737 215786 -59715 557349 -37419 -134890
18089 -134890 -143024 -71909 22824 -236298 7085 276399 155624 -48319 121348 -160213 209574
18077 -248465 141976 -294052 -11879 -33783 -76014 -225318 -145715 -155566 34082 211198 -12705
18065 139064 -104294 90595 -26786 87153 15168 -280795 155347 124812 133112 -83191 185159
18053 -227364 -139854 -4458 15093 -48243 77348 -73613 114691 -32827 225660 -96411 89100
18041 177727 -224553 90869 -159638 -102541 92335 -113410 188511 -113187 -356161 -63219
18030 -67158 -23551 -8695 -144138 45978 -217452 -35770 70100 200149 117963 -252894 8826
18018 -320349 -136086 -46726 -252669 -108578 -185813 -106181 1102 99067 247454 2960 78886
18007 78886 202254 -227932 167992 57949 -69562 -103029 -36462 111642 49718 -225815 -40700
17995 -190747 -54664 347257 -262253 -225665 -124697 281613 -327463 38838 -114143 -76442
17985 -76442 136391 394319 -269312 -107483 -68730 113948 -79400 43248 43873 8234 -290835
17973 -11339 -199849 314045 -228771 -9892 -129862 -64070 -180830 154313 -74353 106628
17962 24326 254208 279254 214086 -251566 16310 -80752 -253841 19865 -55924 -236406 2440
17950 180963 249406 -68345 -245561 -84761 -220225 67683 31245 16906 31385 -125528 -238978
17939 -238978 -228780 -116956 31812 100488 -26939 -167117 104541 -206645 -272802 96187 92061
17928 92061 253562 53837 -282595 248321 200387 190605 94039 171867 83315 206180 151611
17917 151611 22886 111698 -176061 340640 70469 -113143 73805 78006 19645 -146508 73336
17905 23724 -88826 -24400 77954 335873 68555 276545 -200012 67235 -79956 217073 -260448
17893 -264521 11302 184947 -44392 -366780 100222 30252 177424 -152599 51903 42874 15356
17881 175662 -39150 316983 187603 14126 -12702 -205262 33835 186431 -152055 88750
17870 -392694 -148061 99151 99027 -3334 -403956 89171 -119182 15202 -157706 234725 -20636
17858 -83743 -38061 248263 -154470 -247218 -82488 155868 85520 207475 52513 22944 -2679
17846 2673 15728 -362985 -313957 -151629 1250 103342 71214 206013 -184075 -138269 -364900
17835 -364900 -459630 -7554 -99116 -399790 187748 -238667 95554 -321076 -27125 171468 66970
17823 312538 -75731 -253629 43000 -154634 151902 41580 -190434 70154 402886 -47901
17812 231613 80505 -147009 102921 -185614 -146319 76877 -134899 -125775 5194 110642 206776
17801 206776 77888 171599 81105 -172872 -190719 -59886 191796 184332 21679 175223 151730
17790 151730 -210116 29375 -163081 103129 -31201 -158407 -107637 156482 -141162 -258781
17780 -258781 -19135 53229 -118230 7369 227750 29577 266269 -200735 162932 -140582
17769 258213 -346443 -100573 67176 -228327 43954 -207855 111882 103042 -68994 -211178
17759 -211178 231125 40142 23631 43420 -278526 -286091 15984 94078 -2391 -166221 153467
17747 -81491 -83589 -35437 -108773 283160 65614 -23269 -8091 8050 58571 -39298 46302 105563
17735 105563 203118 -103114 -41411 -6199 55170 270873 3210 184814 138621 -290533 55731
17723 11482 -108229 -254488 -148221 -127314 -213384 314619 104200 -57568 222893 56570
17712 172053 -57059 320507 -87098 74439 212974 -82559 193433 199835 205920 68480 -34869
17700 -114346 110682 6219 111572 42678 92819 -324504 109376 194217 46486 417012 64520
17688 -140153 72483 182433 -134293 214890 -281575 98770 74805 -91863 -190398 17003 284322
17677 284322 -3785 -79157 222645 140350 87151 -2367 165121 11458 352555 98145 20076
17665 -1368 195274 8780 132555 -84893 658567 233477 -207186 -122290 1026 17180 -74330
17653 619357 -221702 133067 133062 205355 -34605 243274 135522 91134 12689 28590 -202374
17641 94998 213996 282483 -123365 115829 -150295 -21095 23358 179942 -223892 -247259
17631 -247259 -166682 185063 -54828 -181207 253977 -19 155270 -44880 3264 225859 317849
17620 317849 239674 -327898 438043 23492 229722 -358737 237152 138581 -77672 90924
17609 -53289 -63002 58362 -257825 90531 -20477 51431 27119 -14986 10213 48336 -6623 278658
17596 192215 -134134 74000 461340 -110495 -16346 -127903 65955 163554 -92025 248280
17585 337016 73669 -188699 177918 -164764 56265 205088 7042 66567 99810 -81081 -4859
17573 82189 -235043 -205012 5506 -202510 398604 -12903 -127838 40228 -64015 -52790 106129
17561 179260 -35184 67889 53532 264376 337778 168685 62905 -9151 29584 164565 -18328
17549 66144 64302 350176 146400 41301 -315380 33927 -79452 98631 258679 255104 71808
17537 -109005 101175 -247885 179245 262256 132271 119081 59990 -342433 123571 140965
17527 140965 263045 731 -251430 -226263 -44346 37061 357625 187442 130989 -41274 326948
17515 23738 175516 -21343 476430 -52865 85589 -6268 -151280 57018 216768 512540 332936
17504 332936 192291 228458 119609 -236767 -177636 224074 60031 37080 165592 231162
17494 231162 -22543 -229960 168702 436389 204416 59792 64986 110084 220751 -47685 245952
17482 -173689 -118254 206612 254468 74426 39721 13076 218139 335852 205468 458567
17472 458567 40248 185041 258289 158432 -103121 612229 16163 -17843 -138321 11851 294174
17461 294174 110228 200518 256807 282756 -107967 -34287 268593 -52038 111943 -31776 368017
17449 239112 283231 -3909 334711 409478 767503 375849 289471 147998 235870 494643 126617
17437 157252 222971 377335 283360 38205 243369 379358 145162 27631 -131150 1449 262861
17426 262861 159718 392203 494446 322824 247764 87022 100684 550189 366356 350255
17416 350255 312983 -26244 594701 120554 -125669 455351 512628 149017 158454 -27107 313674
17404 40364 235057 12388 78145 126010 290832 257546 162646 52548 105671 -84935 -96847
17393 -96847 202177 265747 180466 241441 191434 144753 105642 325178 84722 10085 122430
17382 122430 334207 3702 232336 -37279 233773 368999 108296 177267 339136 218469
17372 218469 351669 102228 298193 -158677 157160 249744 58923 175160 365103 237828
17362 237828 119573 174093 108406 347171 130764 62417 -36226 163600 277997 158258
17352 158258 34737 158349 -35259 170465 190240 181322 73804 296684 121814 162714 220718
17341 220718 302555 86097 43383 -37816 66659 13274 168435 131872 421916 296106 216558
17330 216558 55318 123881 456620 50066 177798 64464 -106684 193084 516855 143854
17319 258387 188085 458119 484556 334042 83470 -110337 27087 130738 210751 -61732 39337
17307 -41355 467554 215183 311321 94527 -75141 242481 145636 210618 35634 199400 272549
17296 272549 -48082 262031 128935 208367 248960 216980 47412 260411 410087 174960
17285 78386 43051 -141397 117038 164837 296425 103465 -33921 68182 422815 -7002 236592
17273 330259 106217 178479 260763 224976 56810 94763 229982 -193898 170744 326245
17263 326245 336707 419486 359094 223892 305038 42907 -71755 209836 435967 160475 306966
17252 306966 202497 -70869 291749 319192 106573 132812 140840 179683 23100 158926 -17398
17240 309195 327257 353989 503120 203616 -136477 -67498 151432 50472 395624 449694
17230 449694 371997 160160 427394 292473 274442 64932 203840 128318 54000 -75555 317955
17218 344134 354537 399253 252006 164453 193987 642643 330736 178590 372304 444717
17208 444717 578364 162851 215834 326667 188443 352677 133915 111654 199735 152822
17198 152822 343617 223941 180830 144480 312566 -14601 255849 471442 390644 150375
17187 410250 339063 428868 406039 192526 45685 24574 210900 388033 473333 294305 -122937
17175 481540 591981 288957 159369 98925 199708 428313 316252 352997 30649 358853
17165 358853 440967 224577 202976 102434 262915 409728 214212 243269 485848 310144
17155 310144 341578 331292 201878 226777 248717 83751 293610 449308 614827 177287
17144 177369 326980 282585 519872 600043 91108 117350 600693 329199 129111 500428
17134 500428 311365 172511 397301 515578 404041 322920 78157 625424 444436 425430
17124 425430 591077 239879 439504 374125 432989 307200 323752 380402 416464 379324 500746
17113 500746 187766 566529 718876 447739 239398 238714 330288 352229 165851 449627
17103 449627 289313 357369 545505 609997 104925 474044 502556 240619 571135 624030
17093 624030 209615 395969 404670 633024 2692 337115 718710 376505 370193 295481 301249
17082 301249 606150 474872 349317 694470 572608 414115 456734 515309 174397 595353
17072 595353 513257 592499 565024 299918 250268 566159 659107 556590 600058 463654 401702
17061 401702 459514 588572 394804 348020 550253 793930 507855 350755 422544 710603
17051 710603 508145 736387 321070 451373 597520 587110 596969 698981 676278 593660
17041 593660 648570 209314 657175 476484 919633 931877 456973 998703 624804 743504
17031 743504 664751 564651 359759 654154 477727 531673 702148 820497 447131 483156
17021 483156 584740 750608 663313 809181 790413 901054 690311 930394 816199 906047
17011 906047 824472 457654 827387 551099 1132541 964956 896763 701619 1128979 990354
17001 990354 794683 998916 947081 862094 810240 981656 1068417 809982 530149 707382
16991 707382 1013249 1391032 929835 912286 871631 747599 1251855 991912 689293 630659
16981 630659 1107109 947703 1025865 1119565 868954 913643 1086930 1178388 612491 1115985
16971 1115985 453404 1378325 851169 937730 1308933 1079254 1137610 1342594 1347061 1149675
16961 1149675 1145322 909981 971806 1099097 871650 1304149 1142298 1305264 1363763 1261125
16951 1261125 1226888 1416161 1308148 1271976 915332 1222790 1159965 1527308 1534237 1327486
16941 1327486 1357498 1555795 1134092 1524313 996384 1415488 1363104 1269626 1335475 1383922
16931 1383922 1378732 1296493 1953989 1452316 1437019 1498123 1710026 1142345 1780997 1664595
16921 1664595 1812265 1373157 1873001 1624734 1812616 1782254 1620140 1685236 1661058 1616801
16911 1616801 1779151 1907363 1783095 1877404 1860694 1902828 1886975 1377168 1892254 1859558
16901 1859558 1941478 2258154 2285327 1947310 1967308 2124836 2091039 2129971 2349570 1985428
16891 1985428 2196317 2419765 2235455 2535988 2361177 2373703 2053620 2579036 2418740 2593555
16881 2593555 2297800 2512316 2468601 2507147 2638384 2516486 2506021 2824618 2824700 2706409 2810718
16870 2810718 2683182 2983077 3016428 2922858 2785633 2719046 3199918 2981971 2945569 3230755
16860 3230755 3368298 3353082 3173452 3667928 3700541 3850781 3665074 3609863 3404751 3551198
16850 3551198 3739913 3835280 3731411 3808532 4138902 4410811 4152926 4338228 4178770 3878533
16840 3878533 3948450 4409594 4760241 4580937 4575996 4559598 4723126 4969384 4990126 5092544
16830 5092544 5339028 5368762 5370911 5632453 5433818 5842469 6350133 5850170 6448898 6095495
16820 6095495 6081637 6179643 6532462 6385880 6811334 7008320 7115981 7557105 7442956 7642463
16810 7642463 7778655 7703649 7930978 7950118 8207023 8548371 8724922 9031800 8950783 9356797
16800 9356797 9753801 9980242 9846006 10504573 10619885 11110857 11070513 11568724 11325586 11870553
16790 11870553 12377126 12528503 12716548 13475934 14033563 14364180 14559936 15028602 15469903
16781 15469903 15511943 16239198 16750771 17282259 17751570 18360309 19191473 19531134 20402763
16772 20402763 21008017 21695815 22605119 23500175 24302037 25124057 25992669 26881072 28050054
16763 28050054 29112142 30128818 31716196 32800032 34208440 35287507 37222453 38665751
16755 38665751 40540286 42294741 43773960 46505314 48499896 51242336 53703424 56289116
16747 56289116 59411154 62209726 65455455 69304193 72886601 76935000 81169452 85836378
16739 85836378 90498199 95659532 101292654 106853441 112794075 119121799 125293148 132143223
16731 132143223 138601103 145471987 152298078 158814556 165561682 171285226 176597511 181115908
16723 181115908 185396154 188229582 189925148 190840411 190399576 188680943 186136408 182523907
16715 182523907 177959541 172697746 166736460 160587078 153785395 147066670 140201535 133222854
16707 133222854 126416025 120140803 113372762 107310002 101494799 95765098 91014137 86013750
16699 86013750 80997039 76830185 72517568 68638379 65398423 61578818 58576522 55367403
16691 55367403 53117675 50211696 47536392 45154339 43147275 41247069 39646687 37610783
16683 37610783 35951721 34375259 32909508 31454903 30221772 28966907 27606709 26556731
16675 26556731 25570507 24600260 23752970 22518775 22153658 21005435 20454785 19411965 18839363
16666 18839363 18571846 17556809 17121161 16427091 15829357 15570448 14935820 14816500 14010101
16657 14010101 13783882 13083796 12898113 12639133 12315291 11746762 11554003 11132399 10652875
16648 10652875 10667949 10186998 10194574 9820479 9461172 9451784 9120220 8764129 8797986 8208345
16638 8208345 7904528 8155181 7866441 7579906 7218617 7199720 7088217 6551662 6891169 6701388
16628 6701388 6410629 6257653 6003627 5893737 6120616 5539219 5782508 5728300 5473955 5350201
16618 5350201 5108216 5197746 4845908 4842717 4804469 4578560 4670658 4449196 4680466 4335245
16608 4335245 4261504 3966978 4142580 4006260 4113091 4173683 3802601 3720899 3933545 3515885
16598 3515885 3982166 3873744 3209989 3588918 3284192 3284228 3653809 3143996 3245515 2790787
16588 2790787 3129756 2992850 3136712 2941681 2631709 2429961 2704101 2725468 2811590 2624104
16578 2624104 2760309 2160150 2653938 2264575 2678160 2522296 2298056 2439530 2469971 2424998
16568 2424998 2124429 2837128 1793599 2389328 2163075 2278419 2033210 2232543 2237445 1965957
16558 1965957 1826816 1886600 2227340 1965423 1733478 1998697 1631594 2257485 1841274 1554642
16548 1554642 2021041 1795544 1328586 2010010 1510540 1744817 1573456 1548574 1646558 1454617
16538 1454617 1687644 1489254 1549789 1344013 1330306 1691453 1054597 1438056 1099113 1236138
16528 1236138 1120179 1354205 1395940 1212129 1126194 1108296 1235282 1357002 1091555 1240777
16518 1240777 1111891 1097174 1283587 1269703 1699373 1477019 1280523 1243735 1148537 1201667
16508 1201667 1081284 1275565 1240365 830868 1276022 973083 794991 1131938 1044989 908902
16498 908902 922345 1018999 1098791 870404 701602 891643 891677 658816 1117980 864174 848310
16487 848310 747652 720265 872994 1107132 695959 699694 748768 883532 977913 1029589 654442
16476 654442 906503 678986 794644 748140 1227113 717707 800928 855397 447047 599444
16466 599444 694857 720531 538058 928769 630471 795067 562372 901838 991926 541105
16456 541105 568998 681979 820495 812822 781435 535692 519581 570309 309722 724515 897522
16445 897522 541166 778402 944847 471324 267970 556786 754303 436616 603696 526896
16435 526896 590221 577138 488824 650592 627131 934706 284699 624275 719217 490432
16425 490432 461395 834677 753115 506357 344977 409144 301857 841903 365003 360430
16415 360430 181914 278796 302895 373550 419705 549362 605345 654407 359118 440786 139988
16403 -55544 42452 185959 426851 414397 200329 362451 241827 458401 415856 166602
16392 382349 285655 514757 670676 278754 357043 428650 537295 516821 422853 249995
16382 249995 458286 199250 412862 246390 308608 361346 525249 394029 137198 -60620
16371 280286 384267 -118341 381909 315374 208321 327204 188310 124790 382818 494559
16361 494559 245036 476532 154136 392608 238763 288336 598787 399053 333950 122499
16350 117201 109403 592319 122986 34880 360253 618628 299879 18630 94528 25879 135645
16339 135645 350452 81670 79342 307447 319561 55651 243928 408473 232743 223164 -23910
16327 668123 378424 275858 -212061 298504 204595 141346 261384 308581 323774 378814
16317 378814 212002 85834 192596 355796 192510 357675 318984 185923 60253 252017
16307 252017 152616 212697 273191 237211 236537 -34734 257509 -114827 -38961 265875 99442
16295 510008 97777 -115923 351434 -15127 -118909 140416 254952 259390 483859 -19922
16284 -87951 151268 -75578 103875 174442 106818 123277 -91907 -78176 358738 37920 225073
16273 225073 -9402 -127916 331219 -38501 -22554 -89175 177056 -49770 223453 291366 84459
16261 -86622 -88827 54278 -63791 2298 -208065 75198 -20096 222467 -5336 -3889 176590 -242182
16248 -141748 -165435 -62031 91614 153044 145724 372856 508058 366512 23991 42887 270900
16237 270900 -78452 176747 37896 -27243 101687 415805 123350 313198 -176474 -120904
16227 -120904 -19098 -26630 46232 90441 323607 202024 196019 -173553 60166 313876 13657
16215 180368 66897 186237 160254 144591 -79745 335396 99131 73981 240747 -82616 -53191
16204 -53191 258958 94790 245069 147665 313649 -25266 143494 23015 92120 388981 -28102
16192 -144313 302765 141126 -183358 -54581 202730 -60301 69861 95973 287577 73351
16181 -95429 -181288 -35018 42985 -379512 -53697 -95325 262185 279233 -89306 -142905 61200
16169 173895 -79579 96944 182743 150677 29029 75322 139062 -214013 -82624 86028 223988
16158 223988 282672 163062 17143 173215 115346 169284 -51781 -71108 186855 159709 -344
16146 233417 -123790 -172988 -16244 -282153 266029 43009 88982 -7979 116844 -131591 -57659
16134 121988 -154417 -22098 -11068 104846 89733 -107774 243195 15684 -26403 -90649 217733
16122 -28021 -179774 -405070 -17728 -50096 227481 -86377 -103404 130971 234453 -35613 -137193
16111 -137193 44235 -20279 -67549 204787 159179 -294692 43671 243696 218231 155586 -13750
16099 -172591 -14555 40112 -95510 180463 58784 -77742 140599 31351 33185 77227 34502
16087 -174137 -142686 125333 -121985 -5398 45140 232003 -379078 155451 363224 8971 -87669
16075 132979 -98191 -536232 -50431 78030 -221262 3131 -25280 158468 -277295 -89300 10972
16063 -56051 91384 -190748 -174751 -6371 34681 212185 8841 103727 115746 -480722 -356100
16052 -356100 206759 155064 -216671 108782 -281729 350278 -78711 9826 241799 -267832
16041 -86128 -236656 -131102 -116684 456447 48467 275781 -107160 -4612 -137457 -423294
16031 -423294 -89220 -215844 -25610 193724 -121965 42127 -45190 213569 144007 193217 153501
16020 153501 -125915 175974 19708 367934 38440 183007 40211 -30399 -170554 193117
16009 -68480 79601 -114581 -119770 -45715 -387627 -29483 247954 -167753 84291 -214049 -94206
15997 30874 -210655 339552 -269281 -57706 -200499 -205970 -89785 -332374 -7750 100946 81957
15986 81957 -118871 409291 112185 261228 97950 372287 209408 129564 184011 103344
15976 103344 -18600 92998 -348882 -97000 -355522 -173444 -49308 99437 -165924 -99735 -50011
15965 -50011 43568 24412 277484 242922 349 -75988 233627 49998 124812 -79486 45688 -173813
15952 182672 -310542 -176986 -88152 -228248 -176799 -131626 -36219 280025 -270153 -123106
15941 -108737 -49845 -114802 -51577 -53181 65864 -142663 -25212 -119541 -114977 -119723 -182129 -281430
15929 -281430 -198071 -197832 -230023 227641 -49776 -206884 -321666 98343 -236977 20420 141396
15918 141396 -134601 35456 117337 -60483 -411094 81605 305302 1305 79093 -223306 -164036
15907 -164036 -257199 341028 -224706 -232234 19710 -140136 113455 71068 60507 -63188 237540
15895 56511 112492 211119 211515 -70460 -144109 310717 110636 -319885 -432347 -4650 -27828
15884 -27828 135567 229572 -9330 78531 342257 32004 -45401 -35807 115313 -229747 351320
15872 -265121 131212 -365656 -173581 -106360 -206609 -332223 27417 163030 -190298 -212084
15862 -212084 164122 -139957 30403 -126049 27481 -204546 -147366 189752 -27450 36623
15851 -170598 -167926 40535 -75455 -57415 107264 -67808 321401 -97217 93447 -27783 -85419
15840 -85419 -46507 266621 -193341 -191828 319289 256936 100891 -122259 -389147 122447
15829 7178 10340 93592 186984 -98274 -312687 28950 60772 1272 -209799 134216 -148556
15817 111864 24327 21324 -315960 -266438 -80074 -890 -93076 -424173 -367953 -92817 -84814 -97893
15805 -97893 238877 -156732 227406 255039 -171462 -211410 -217599 34367 -95340 14714 -66727
15793 -23306 -7796 -216983 -138111 164758 128037 297330 -118775 -10857 47903 -316289 154555
15781 152973 292135 -256343 -117908 -99067 219204 -98145 65029 -217553 -123971 -70274
15771 -70274 3310 -177039 -50890 -72276 -79980 -78066 217119 -26613 -233016 -12153 -92625 193310
15758 168165 122978 57210 -49039 -35667 164145 77215 349189 -184419 -31934 16638 -11301
15746 41038 -171296 -43402 -125095 82492 180170 -86733 224517 -341183 -251866 -76213 122551
15734 -239825 -240065 -372672 -361772 73736 9114 19966 -929 -104067 178539 -73403 2048 -76579
15721 27866 34558 -98160 104334 -269244 51257 -365382 -167854 -53688 -39550 326692 95287
15709 172818 256083 -124052 -113178 234927 -164227 17192 22421 130998 51513 -286604 413098
15697 -69802 -358467 12914 114545 6919 227108 328663 -128262 359485 -143752 255683
15686 77322 -2890 -132328 184816 40387 -47488 -4984 -186534 3293 220076 -199826 -202276
15675 -202276 -200249 -63234 -149452 -19872 -55332 116761 271789 -170675 -3176 176527 63433
15663 -215453 -50845 21520 50341 -149789 40966 -168133 107643 46462 45667 -65396 -135397
15652 -135397 -20587 -6733 -120697 54369 433006 315736 -2004 110838 -20850 -68064 335503
15640 201545 295569 -214298 44515 -63346 -185956 -339484 -233152 -312856 -32702 -2714 122580
15628 -13423 -290791 41151 -119307 372791 150644 -32334 -214243 -251088 260238 -241455
15617 169922 68341 -337722 72144 148845 -103668 -27401 164790 23564 -64240 -125014 278476
15605 -436416 123995 -434304 -75431 47998 77078 -202340 -73234 -14237 -35393 228475 112323
15593 311678 -429024 437489 251983 41307 146973 31112 12191 451374 -37926 -22671
15583 -22671 -168658 -283707 68156 -113949 -272696 -235725 30316 245718 -96428 -7644 37915
15571 96901 -9624 -266448 112272 -73680 74560 -25391 -101251 -447112 86655 192500 314755
15560 314755 120328 -101717 199199 -175673 153825 -142142 148093 184524 144923 114372
15550 114372 -141245 -146699 89894 -147021 -200507 -191329 297170 -265971 -243290 162852 93633
15539 93633 -112504 297315 -33032 -336856 111758 -64267 248425 112667 -147441 -296500
15529 -296500 87345 46442 -452930 95328 -114431 33769 32768 149521 363828 76926 49314
15518 49314 322037 101435 201179 -175645 66831 62816 -178945 6680 -176147 -289393 -46929
15506 -80335 315721 -155043 -142910 110706 -196081 27839 -89749 -59344 146975 -66934 84274
15494 -22557 -312327 126076 -69948 -190131 -283867 -72521 -29477 -193640 61303 373667 196989
15483 196989 -252519 92918 -16871 -237054 37317 235541 215471 -277271 24229 -312915
15472 181948 252789 120182 113577 13836 -5404 -158792 -183866 106300 24314 -200739 140969
15460 67743 -32206 -8374 -257048 232399 -473674 66674 -229800 67929 231369 136213 -158563
15448 -264847 40633 90096 -55069 -234299 251618 -113323 61084 196677 119254 11987 -59895
15436 -194034 -297754 -131930 144449 -33788 -57141 83605 -31336 -61652 65775 -126363 210943
15424 209074 103333 -290868 109149 43056 -2599 143010 -254304 34946 29156 66979 175074
15413 175074 -116721 339493 -39063 -141811 10938 124347 -55793 491038 -33110 -119605
15403 -119605 -81070 252337 142533 -98600 -10490 116866 383005 -108947 -170183 -67165
15392 -33423 317 -110110 98665 114786 123807 22224 138595 336602 -222514 -241711 278966
15380 310821 300597 -125035 73003 37498 -128713 -106026 99087 -182398 -253862 -126538 -299977
15369 -299977 39543 -282261 69851 -350897 104789 409175 -60546 -153736 138849 50861
15358 202012 83055 123238 71497 155624 137138 19789 30497 -82332 155670 189388 135079
15347 135079 11983 36102 278267 -176813 -124996 182824 99188 7090 105366 -159471 102958
15335 119930 174840 231286 -19940 119930 429384 256064 37667 141463 41957 -214752
15324 -83893 14214 -107014 204602 -137208 231813 90294 26640 -127898 10237 146169
15314 146169 115813 -340899 191564 -290877 354602 247428 7057 171558 -51114 -225646
15304 -225646 -40665 -163093 268586 -111009 -27871 -64391 -80880 -108613 4400 57661 222593
15293 222593 105130 237094 92235 349649 113453 229779 264616 268523 208944 85451 -118786
15281 159742 66524 -63921 -68423 -186430 -136846 -353476 209084 13671 22110 -142429 -89330
15270 -89330 71220 16250 52169 231745 31219 63302 -210357 60061 -63800 -124526 235107
15258 41187 133482 -12334 95750 -31266 -86416 67073 286075 223609 444122 162676 497766
15247 497766 1427060 1541274 1053278 1942794 1311206 491683 47006 121153 113436 141236
15237 141236 -173562 -94673 -151848 292391 316338 131662 -152375 17801 205708 -173681
15226 295162 187593 102959 505075 -100058 -219034 114110 216690 -63794 -108145 121771
15215 -262820 482073 282732 -122364 353165 15625 11356 344485 201328 301381 211715
15205 211715 -234889 132890 -48120 -160362 128567 348621 488030 129591 -44983 39693
15194 157157 275075 -18445 297365 50203 -63073 29222 157869 -177004 75424 60370 15839
15182 327885 109284 198235 -296916 164551 -68442 80860 149065 163847 186427 124739 104117
15171 104117 -262207 106230 66751 -14415 16528 337317 -37524 347609 57178 208212
15161 208212 37695 119340 -52600 170982 26680 164189 146912 -29451 65176 83927 -385900
15149 120512 131472 -41139 112244 -40080 239981 -65910 -73105 -124416 57715 252508 -241183
15137 270831 184169 243085 64738 17222 260181 229703 147177 91027 5442 136239 36709
15125 -171112 154230 47016 80357 325780 -59706 304674 119221 354112 420312 219505
15115 219505 177146 -30318 22519 157480 118829 7646 210847 179247 224855 -170770 90991
15103 144994 310462 -71228 68212 4123 467010 106157 -41745 618314 134010 172088 220312
15092 220312 186410 20437 -21125 60660 -104425 141394 222347 313487 182 323536 164798
15081 164798 164322 243908 103216 425665 249501 247437 145798 148127 214377 173211 495493
15070 495493 279528 292094 86968 476772 268171 143800 103892 -10759 270214 -114840
15059 148435 170906 250191 120123 599934 162474 -23331 -4485 -15881 23720 412155 118443
15047 -8635 222247 333337 132582 30783 351163 351315 488525 328099 200377 392568 -17732
15035 240018 4203 377868 391154 -4157 233067 491124 355767 296313 267308 253188 118593
15023 269147 -22088 -6196 278133 -9288 219214 317389 448404 453613 280694 -229641 245709
15011 219804 217862 28089 276317 144909 114533 243789 -4535 191360 612463 266726 522300
15000 522300 367786 251099 347929 455750 123717 147863 479829 62445 256459 301086
14990 301086 144075 -245458 327088 69894 58433 367176 174933 248194 476126 188559
14979 78724 32904 343074 251983 466007 373925 407236 261190 44513 82558 381520 218330
14968 218330 43203 120282 8084 431604 566011 146508 98603 101400 244965 317937 263601
14957 263601 249682 267395 365308 87208 57470 72854 208145 142613 18363 553592 427626
14946 427626 32135 5481 375560 305248 253828 398123 492097 282875 404458 -57871 330338
14934 587659 90173 241612 320209 67520 498039 69036 409131 194313 411553 572850
14924 572850 484262 380949 215017 480333 107940 -16749 344047 580187 411787 202865
14913 180607 82380 144366 184420 382390 365667 269462 508873 587011 286860 318782 226087
14902 226087 638453 373301 565923 213986 280962 747180 367502 647999 225253 458532
14892 458532 316062 391255 435363 497373 438415 241739 422406 431126 160190 274586 363771
14881 363771 206601 459296 339557 6021 486882 411072 248939 276862 253797 333052 459426
14870 459426 161489 523678 290253 189643 341387 542247 403241 642770 610754 371536
14860 371536 611124 -44959 479285 470942 321328 474077 500979 272838 260240 280331 423819
14849 423819 489887 498709 680227 367709 557998 123245 356989 855283 383932 177778
14838 478282 853032 633902 591096 549649 623416 817327 801810 403154 431845 601292
14828 601292 605155 514085 519320 592754 477951 411047 554679 81378 658288 673116 187024
14816 493118 505390 590882 529527 605422 524994 254382 400554 411366 490987 453708 384560
14805 384560 337131 652519 453943 664843 513738 560491 659471 501904 236666 500203
14795 500203 585495 735753 664410 695496 588135 799316 478066 540068 859060 446886
14785 446886 732481 744503 624200 464998 766751 665092 801192 768923 574533 531964
14775 531964 500806 762279 446831 747239 391180 515858 943927 743379 476079 952472
14765 952472 600714 854079 844115 526048 798336 799269 588639 758419 884676 485332
14755 485332 832077 644806 602542 480148 589990 890605 743557 758453 677000 505094
14745 505094 1037729 922972 482179 727603 653827 953678 428567 1108656 915786 933080
14735 933080 1035076 799705 553657 1041550 995496 941115 654587 1147207 877739 787708
14725 787708 639986 1060981 811227 533605 734066 985616 1109764 923745 612296 1024466
14715 1024466 736147 1405036 1011916 1182566 624307 912256 719448 934048 1201062
14706 1201062 932646 953989 1026597 986394 1050052 890251 879584 832644 1046677 872643
14696 872643 795384 776092 1100428 825905 1278317 1012339 974141 695243 1298744 1000406
14686 1000406 1242719 1147105 1041077 977806 1224670 1033463 1081327 1242486 947189 1096790
14676 1096790 1238064 1115869 634695 870317 947548 1003999 970174 1236879 1113693 1059041
14666 1059041 1240289 1453921 871067 1147282 1202400 1132586 1342489 1166324 906559 1001382
14656 1001382 1141433 1293433 1127840 1536807 1403780 1107730 1271973 1388070 1256630
14647 1256630 1253231 1261775 1553002 642425 1553198 1262345 1317263 1380183 1476189 1233548 1356994
14636 1356994 1393800 1165394 1272881 1210320 1300365 1322980 1257150 1574385 1433810 1602397
14626 1602397 1494836 1763369 1433892 1578462 1693984 1681440 1466763 1624957 1796238 1501245
14616 1501245 1733252 1310633 1625607 1677224 1301430 1568257 1857614 1816876 1795405 1518204
14606 1518204 1397745 1823638 1591353 1850644 1688420 2154748 1699013 2021364 2023712 1851064
14596 1851064 1943170 1507201 2049918 1732358 1875136 1911236 2173913 2136476 2136954 1603224
14586 1603224 2073646 2184993 2068918 1783798 2302823 2398648 2035900 2223051 1938161 2189539
14576 2189539 2018372 2195500 2300504 2472516 2488898 2204880 2397265 2400891 2379482 2389642
14566 2389642 2584087 2595018 2715931 2629020 2954375 2777895 3058890 2845173 2993284 3132701
14556 3132701 3322089 3221993 3752681 3950642 4358436 5078906 5904625 7745223 11865137
14547 11865137 20897157 41307362 51956975 22511926 10698001 6413418 2986070
14539 2435340 2336392 2057908 2218195 2292856 2068554 2205153 2281172 2466139 2142861 2173937
14529 2173937 2454317 2445086 2366931 2225717 2725908 2802711 2635927 2550692 2868404 2970280
14519 2970280 2806883 2314839 2828137 2811378 2879934 2808069 3060053 3136493 2582147 3260598
14509 3260598 3308667 3288292 3168234 2888580 2975177 3325095 3267863 3311288 3233186 3823330
14499 3823330 3178414 3281253 3689519 3874608 3385860 3672294 3650370 3742000 3429476 3662807
14489 3662807 3930404 3891475 3918145 4073667 3941384 4310970 3931726 4131751 3844127 4128220
14479 4128220 4144235 4398655 4721765 4533406 4259139 4282148 4735852 4473804 4820729 4761954
14469 4761954 4689204 4788666 4684215 5001876 4881507 5245030 5026633 5119989 5180106 5126449
14459 5126449 5659878 5277920 5343470 5844243 5757954 5892887 5374830 5422685 5826711 5589600
14449 5589600 5826076 5927169 6063514 6122868 6165297 6297683 6642641 6394535 6429562 6574211
14439 6574211 6387990 6511771 7117579 6965103 6936148 7151361 7086867 7257809 7301306 7358027
14429 7358027 7979827 7532228 7632305 7918512 8045770 8399826 8042724 8192578 8499681
14420 8499681 8502032 8682489 8820525 8947621 8855576 8892838 9650256 9387622 9536688 9504906
14410 9504906 9971480 10198423 10301203 10520301 10549876 10524519 10889013 10934783 11468464 11399783
14400 11399783 11303080 11757041 11890491 12032848 12074547 12547968 12497772 12807005 13049147 13414559
14390 13414559 13855542 13693954 14186611 14059890 14463480 14988064 15271945 15454685 15684113
14381 15684113 15930345 16126127 16518335 16794147 17502436 17528510 17542525 18280549 18147616 18842806
14371 18842806 19300543 19150769 19745783 20494157 20735520 21170914 21271159 21949391 22656546
14362 22656546 22960699 23413190 23865821 24881121 25047720 25698893 26521117 26836284 27610504
14353 27610504 28344864 28375714 29266938 30218447 30875952 31849738 32451889 33030879 34188470
14344 34188470 35010741 36127350 36770619 37852766 38599925 39856275 41096341 42137649
14336 42137649 43571544 44778578 45992986 47258550 48560247 50444427 51620649 53305297
14328 53305297 54936023 56794823 58513583 60494085 62559979 64846320 66849056 68881267
14320 68881267 71479541 73772017 76641892 79719591 82232155 85612482 88774329 91858193
14312 91858193 95726109 99273303 103647362 107801636 112168045 117168303 122140687 127528934
14304 127528934 132889412 138779948 145361565 151762223 159250686 166270881 174333835 182282941
14296 182282941 191276178 200754464 210484290 220951793 231706941 243019083 254735969
14289 254735969 267155038 280239637 293495254 307498778 321630165 336207473 350822884
14282 350822884 365364452 379766378 394047218 407345247 420053796 432192697 442528490
14275 442528490 451535994 458480125 462821000 463606888 463584135 461843110 459709154 455707182
14267 455707182 452078903 445626717 436349626 425455326 413199959 399649619 385642398
14260 385642398 370819903 356416498 341560626 327061381 312562368 298280967 284605591
14253 284605591 272625032 259865614 247621902 235717654 224802976 214201886 203842315
14246 203842315 194521950 185432448 177628731 169314804 161431507 154302613 147360976 140858756
14238 140858756 134967084 129561367 123939141 118915290 113806072 109024281 105045291 101426896
14230 101426896 97215318 93097730 89305629 86187652 83175612 79951576 77272469 74150224
14222 74150224 71794027 69248250 67251746 64944411 62635368 60608045 58566973 56471948
14214 56471948 55298810 54026947 51727001 50383726 48742039 47238676 46205394 45040678
14206 45040678 43972679 42659328 41294640 40128726 39024503 38193298 37308459 36306397
14198 36306397 35573575 34141224 33298881 32562587 32119761 30938129 30313957 29680930 29037097
14189 29037097 28259801 27300562 27080191 26218578 25628571 25198093 24598226 24302945 23765905
14180 23765905 23275660 22576011 22280920 21964272 21206739 20928997 20448624 19877308 19557425
14171 19557425 19035674 18790471 18756813 17925066 17907969 17338442 17202971 17016216 16639763 16097006
14161 16097006 16073850 15914403 15574125 15431436 14944802 14562999 14707943 14251389 14221907 13563045
14151 13563045 13659716 13274484 13202909 12999340 12755905 12765221 12289290 11928181 11610222 11475473
14141 11475473 11596820 11476174 11275878 11016915 10728527 10973984 10795713 10338790 10418595
14132 10418595 10274926 9807873 9828214 9603913 9555548 9573982 9160692 9356368 9137963 8948831
14122 8948831 8612600 8677172 8627100 8161435 8375904 8248845 8437936 7919091 7743330 7871308
14112 7871308 7906623 7763036 7539264 7694163 7364648 7221113 7264068 7104177 7048443 6701417
14102 6701417 6809853 6922469 6496173 6701184 6587560 6625249 6172307 6301256 6210851 6134886
14092 6134886 5714329 6019876 5885713 5901376 5993561 5431231 5737920 5483398 5578002 5645505
14082 5645505 5442673 5194817 5386326 5327926 5686830 5283375 5001868 5108248 4964896 4896801
14072 4896801 5036012 4838828 4863811 4674763 4657024 4758073 4748626 4470859 4608816 4340396
14062 4340396 4529426 4268751 4451508 4640589 4174687 4530186 4161998 4318983 4695553
14053 4695553 4158456 4370159 4169331 3646525 3899606 4114021 3684795 3700729 3854777 3598917
14043 3598917 3645725 3524341 3802001 3122613 3536478 3278674 3428740 3437746 3291728 3653337
14033 3653337 3420484 3801305 3625075 3337600 2842095 3716846 3390853 3293314 3368048 2879118
14023 2879118 2874874 3215623 3044367 2941401 2898577 2808822 3225100 3031891 2796257 2728188
14013 2728188 2692916 2870969 2742077 2779043 2432537 2519351 2577349 2335372 2358246 2177908
14003 2177908 2432812 2513102 2379922 2105366 2256368 2254590 2398649 2168464 2627425 2328455
13993 2328455 2281448 2629438 2432687 2695492 3395997 6171891 12424656 32152359 53636391
13984 53636391 30076775 13953868 8628293 5812292 4688603 4343155 4217184 3996306
13976 3996306 3361688 3100528 3212359 3007385 3024242 3008772 2440082 2680125 2539737 2704583
13966 2704583 2622334 2448556 2834514 2199514 2272614 2362828 2495170 2610869 2295321 2212650
13956 2212650 2132590 2192120 1954569 1964925 2393216 2014602 1769759 2086008 1973419 2073236
13946 2073236 2207817 2058805 1853491 2054753 2165625 2056005 1786594 1896557 1978562 1719077
13936 1719077 1986667 1883463 1857435 2051932 1858396 1891711 1614243 1375572 2058914 1757811
13926 1757811 1754661 1434963 1709258 1826944 1958673 1746287 1693026 1734078 1637733 1683309
13916 1683309 1538610 1688147 1372820 1428412 1794819 1583803 1760125 1648401 1542962 1312053
13906 1312053 1649281 1535428 1356574 1267357 1483095 1567241 1409346 1379736 1357063 1494286
13896 1494286 1462268 1328606 1317517 1357798 1141616 1067888 1332273 1416570 1486835 1528191 1313724
13885 1313724 1368618 1263679 1482019 1584354 1480274 1301061 1356142 1436727 1121052 1330158
13875 1330158 1173241 1406234 1017687 1364009 1488504 1517668 1149387 1539729 1347670 1099936
13865 1099936 1175218 1168445 920137 1162032 1345020 980286 1167795 1153368 1065189 1238086
13855 1238086 1264853 730579 1662016 1388392 1387589 1268472 1100466 910521 1140957 1181303
13845 1181303 1162581 1068508 550309 1132569 919688 962640 978679 970018 1163784 933623
13835 933623 882724 1267263 1192559 1002506 1088099 897447 957679 1111993 878829 1103973
13825 1103973 979935 813175 1052568 1470530 1120096 1105446 850587 890665 839021 745857
13815 745857 919550 764778 1254881 966768 732057 621126 869590 1227971 644044 892199
13805 892199 654393 792037 820307 850307 743778 864608 931217 741048 916190 528785
13795 528785 909071 1011505 1105975 747378 945975 733291 965061 762637 655486 897172
13785 897172 565426 814921 858215 593733 845844 1087812 929095 568516 872370 593539
13775 593539 854750 548774 792018 629066 699481 561235 1003805 304721 615381 911691
13765 911691 896025 811733 893814 700519 757924 798254 877405 780631 989887 720055 927876
13754 927876 848661 834160 396652 951225 734588 730613 593036 727179 855686 862687 452371
13743 452371 977738 340386 772803 494973 698114 849407 647418 518528 486460 857502
13733 857502 507917 455735 560159 643212 554424 517132 765779 633225 800992 680388
13723 680388 624680 1043488 1074603 714624 445971 321790 745333 492164 997502 235117
13712 640535 573372 447274 565275 731740 718732 770998 689992 540000 451006 245301
13702 245301 205331 646317 879222 623429 623182 357674 243619 529747 433071 676904
13692 676904 554352 462099 465255 479412 514012 611239 552286 558279 716468 416639 459019
13681 459019 516365 432977 606185 525566 540086 691127 408265 656590 234182 804085
13671 804085 581507 432440 606876 672958 520664 640798 162000 410795 800092 243269
13660 444000 476103 367033 594413 313178 505955 251701 300875 544641 376657 300457
13650 300457 747081 417176 342730 247770 316945 726141 265136 395703 258003 350841
13640 350841 422673 384577 466729 395448 465560 655920 -49738 721501 413027 324914 290734
13629 290734 24265 489163 269873 679107 306826 283391 298118 361222 121831 349330
13619 349330 868272 419022 285211 -14568 262611 118083 709244 208518 -99690 -8693
13608 458413 147024 409705 556666 711849 183044 154430 549288 278855 491700 251225
13598 251225 451414 697306 623503 304474 318482 599256 489942 370287 453345 -81524
13587 146069 707541 -186991 258525 399459 238509 494909 450991 196859 229037 544526
13577 544526 492918 270360 500123 282831 360563 325673 434363 459266 533981 22714 365251
13566 365251 527682 577263 54833 426166 84012 480978 194281 387087 559799 248040
13555 -115222 711837 255678 289397 212617 382081 -32332 240434 115572 309587 339162
13545 339162 569773 509913 -18583 383258 395294 374576 684433 273026 453976 341582
13535 341582 218381 103628 293391 341853 132330 277117 -37023 282767 337950 62599
13524 628198 563101 752182 -88452 229520 48930 242407 -70831 390038 605280 38357
13513 280495 56260 408284 55479 389951 347794 170328 104114 267606 242924 260016 239101
13502 239101 461247 466160 324448 477711 237749 505143 404309 98981 194357 129294
13492 129294 306322 379535 395133 429500 145946 614688 360393 632067 168893 325112
13482 325112 192845 243433 -71631 92496 332055 209228 614729 481855 205334 255451
13472 255451 136486 337603 290032 96098 276272 545343 48564 319921 96418 347864
13462 347864 182964 344504 293201 250795 317187 -80243 352506 198013 -319041 90300
13451 133852 246997 61020 331216 -72771 372635 299011 282959 177640 254287 115834
13440 324457 231702 135928 440138 -133540 74343 182508 332119 245045 550993 215475
13429 463266 149823 379888 276168 407863 56948 339091 333060 40883 327785 199956
13419 199956 173164 197827 157960 222079 432355 135976 343779 139563 187056 411858
13409 411858 -30318 199694 17533 161672 -178920 222547 174455 480311 204164 191030
13399 191030 -59041 -198598 -793 88967 359335 181777 92586 170168 206703 125085 376944
13388 376944 258298 214603 -90030 -170313 472631 35994 324823 415967 60406 10351 214171
13377 214171 101006 473993 156379 298025 264117 230317 -12088 217439 228780 309977
13367 309977 148191 211254 333268 200663 250907 40863 68030 692393 404952 299586
13357 299586 282679 266660 361398 320607 67623 298630 417447 89522 156533 -175893 665526
13345 288540 72026 -30600 127405 483629 331431 301756 513774 595534 241966 260713
13335 260713 531481 152188 163150 309307 245663 189244 27742 480740 124871 114766
13325 114766 207344 603792 144001 119189 603527 266161 219423 363010 134034 274592
13315 274592 373249 188277 700357 -120529 168971 276592 -8008 241517 390774 116704
13304 -42364 -180585 370736 -102593 15909 -2460 257078 101129 -109168 137586 223983
13294 223983 -31846 -5073 197458 139686 -80423 340483 284021 100944 219159 28819 5794
13282 -69763 45809 169447 137711 265811 177290 203740 4064 523009 -112787 -230492 32484
13270 476622 117930 -9775 275416 -73560 165225 55572 440510 68392 101129 314565 368354
13259 368354 -56570 170807 395986 -226968 -45901 43929 -216265 72231 -149920 329724
13248 251790 19561 351923 162924 123743 68136 146007 22638 50551 275468 167085 365774
13237 365774 67978 49110 417367 -271281 -11411 154745 10836 117591 46624 -12440 -9436
13226 -9436 -38011 135642 -356579 99629 -65105 114374 57567 503454 -16133 -277556 419096
13214 300267 239378 -28130 334471 56078 -33548 223174 244267 -70525 -87833 398568 68442
13202 304600 -183129 222626 311734 119794 65245 165672 231049 297349 -68144 -3045 152674
13190 261347 -201349 252208 -72158 233001 193141 80175 -71840 97276 199976 516885
13180 516885 10840 43299 -127539 191621 66948 104158 -29079 89487 339684 142828 164819
13169 164819 188416 -42297 38857 68181 265884 274388 -123097 117350 -5107 385009 -89675
13157 194233 -133714 86890 23529 -4722 211592 270686 207338 277559 -58634 -55666 387997
13145 -84 -271419 -101523 82732 -116452 -163465 198578 298954 300416 124724 -105132 -53149
13134 -53149 262534 -444797 5232 -201790 -128344 379008 -108011 246 118100 41819 182038
13123 182038 25383 -302275 116666 -53999 59284 73628 53030 118869 -225468 -87520 -58139
13112 -58139 229859 71618 280878 452775 45317 237653 43334 240215 -63341 6223 175155
13101 175155 -48032 -227009 198092 41726 -8342 105578 -23207 54178 -64572 -186224 -100471
13090 -100471 -240341 420416 423771 -231804 259234 60386 -135853 114307 -138543 129319
13079 -187327 227124 146299 310753 -25971 279304 314853 342243 34266 404612 -10235 87968
13067 10166 -73728 -10234 4630 2433 211358 -203471 176558 87188 443750 137131 -143270
13055 192789 233000 -50515 192907 417724 54061 139988 175440 23985 474003 -154418 61877
13043 248977 35750 156059 13581 -2790 468493 295917 227157 201361 203170 -245281 65522
13031 387062 169358 63418 -52625 489937 271540 271674 -113046 204252 2590 201854 -3079
13019 -89685 -144374 -20717 208557 36061 241305 122355 225493 -3837 107829 394268 283865
13008 283865 173029 -149838 201424 214696 352510 -73505 31003 75944 316859 52731
12997 -62520 -280633 47809 144493 -140752 141093 53021 -20237 -60937 -97805 250777 -104288
12985 18073 18671 123908 266061 261136 -196487 118138 -53744 95049 75457 170735 -216287
12973 -5783 25799 208750 243227 -108736 130918 -25204 24706 213142 -119113 5990 67654
12962 67654 11769 138527 323220 82358 72846 213728 309759 -67468 123601 -163535 -109588
12951 -109588 328233 -89989 104704 99278 -78572 56633 -65713 -134386 168522 224501 -213564
12939 131588 -12139 -32331 3147 111853 52121 87295 108075 -247946 286605 -84142 150567
12927 66436 -35134 -206653 119585 99560 201165 -14926 274930 109660 35781 17485 8592
12915 33526 83661 260910 -247415 -109605 -131503 223608 126587 -17504 -18991 48230 279611
12904 279611 170064 -94746 36767 -6730 -66080 -124359 -150281 439302 52761 -36984 -241232
12893 -241232 -156033 149357 98237 88695 445659 -33882 -18486 94924 -124200 -205545 161052
12881 407814 221170 -135419 -147617 2269 153945 12024 -27619 27893 102922 52221 218675
12870 218675 116253 203897 40030 -28250 -184375 106738 301243 -219493 169842 129973
12860 129973 262629 208743 -23564 -161849 127234 77365 201466 44951 -17790 -372660
12850 -372660 262660 -236673 -226537 -157627 70457 19590 156837 -63496 58716 160511 -58848
12838 313910 -201289 144605 -294056 -120480 39580 74774 -36842 27198 26953 -9280 -40636
12827 -40636 163642 186222 -139075 -195632 60445 87557 373413 -21588 285334 124537 -169584
12815 -62202 -165310 -124605 154375 -44672 -57338 -30584 185528 -116131 -41429 -87418 179140
12803 192233 210581 51213 -118495 -17923 343281 119928 -347343 52929 -41856 -14404 142280
12791 5946 -67270 124340 115847 -15507 332289 -84933 116243 234895 -57846 -73458 172221
12779 176607 21510 -118878 177689 51397 65636 26711 -213980 195226 -170134 175061
12768 -297089 -72140 -82602 191900 51543 -37132 -11606 -196309 -291886 -255002 112513 33897
12756 -177847 248744 154818 18873 32806 -342263 67678 -301955 -25614 29534 -206948 -8908
12744 -18778 129034 44076 -95101 -93732 121866 -125933 188970 62826 35863 17195 23074
12733 23074 405012 306492 4005 87206 186 -21689 31158 -109191 93419 202745 64456 38836
12721 38836 101870 -71692 151570 4629 152149 162025 30714 -39436 8801 -123445 136159
12709 33967 119887 -58070 104421 304234 520009 44715 354454 -79943 37543 -57066 437517
12697 215958 222179 -201310 -96523 149834 -132429 348512 269796 -184194 128120 55844
12686 219722 -128033 -378577 12624 -142302 -221467 73030 -146946 -92107 -19217 63470 121853
12675 121853 166294 -156810 233245 293990 -10550 -120098 195945 -50996 134495 3799 -115833
12663 362082 71553 105277 -275772 377914 -221151 167872 518506 180996 38810 225224
12653 225224 -96919 331408 -94586 -133923 -10104 127382 94319 -76419 80014 -28253 -855
12641 68057 193992 176261 76748 126749 115942 -99784 110088 -236110 199809 196855 30555
12629 199411 197567 294910 211583 215283 3075 -164107 243033 284732 55474 212507 576216
12618 576216 -580 256704 82515 85976 35112 87509 -77821 -282398 -165123 312500 106346
12606 -101271 12565 10260 55781 12922 70360 -144794 239602 -31275 189339 -5995 341781
12594 5296 -3941 39343 140727 -212154 77492 -167121 105300 -104433 -23891 195645 -141765
12582 87508 -69123 230131 -63637 -10503 22556 83779 235615 -63630 50088 48204 -131612
12570 -31654 225735 -5170 -5265 67174 65483 -188938 37238 26694 278623 -5244 251041 253494
12558 253494 -121513 107452 54861 95514 21474 209841 -4651 -134528 21772 215316 -30160
12546 10804 234272 109201 -164976 144514 -269983 992 76700 -90484 160822 -89477 -127913
12535 -127913 309673 250878 -167948 -323718 205076 -19173 -75994 -43971 41507 107019 -32361
12523 26540 152989 226659 -81430 -157178 154920 15023 -171072 114744 21554 6892 110790
12512 110790 101895 173982 -249130 156973 108985 15585 -23200 196924 119703 209449 194412
12501 194412 -100093 -4561 141770 244800 -43923 328070 176284 -202072 -128888 219759
12490 -11701 -56698 -51640 304925 83747 87834 13268 -312856 -71080 -157696 -209568 96584 9592
12477 57812 68366 4982 20709 20826 -65930 -336015 193101 69314 -74105 25280 -186485 -59958
12464 -241019 88641 46655 162407 246349 -278489 -286186 -302128 -101349 223006 245174 -132786
12452 -55611 -69094 39473 131396 52447 25303 106976 -143979 137658 231194 15152 353507
12441 353507 126318 -38815 140014 23387 233796 17483 -224398 -104062 49668 -20105
12430 6001 183017 171366 -308975 130775 123208 111933 -3895 275354 85511 -282385 -216342
12419 -216342 -392889 -35403 107616 14371 57830 79763 -206644 123951 152340 -116294
12408 29223 -83540 173450 -150428 -22705 341224 -90627 -124386 -37736 53051 232106 149423
12397 149423 53503 -207666 -51137 17064 87010 -30627 -337517 -205588 89383 -65602 -87307
12386 -87307 145378 -263279 91095 -27389 175915 -91921 314353 163145 -276641 250836
12375 -130246 83117 188654 123178 -17186 -134358 178674 -62934 49138 -156789 -54540 -8735
12363 -276291 -83925 -51577 47540 -51152 92437 -16083 148451 214632 -47502 172504 -298767
12351 33669 -120970 185266 54268 -176841 -161109 137899 157397 -129562 19888 35678 -94219
12339 101046 138250 -103990 111890 93198 -56882 -32632 -41010 162054 -140531 24927 289146
12328 289146 20054 -205232 -135356 143194 -12676 189255 17432 60639 -98943 -282949 95610
12316 243197 58523 217530 -255596 321659 -3698 -75055 -200770 64333 13560 -12077 -158594
12305 -158594 -201199 176970 127428 -116817 209625 -50794 69715 -169835 -51583 -172805
12295 -172805 -134787 -192298 -222021 -103096 182071 365411 167731 8564 10924 198676 -15639
12283 -44345 -191726 29623 -61619 -193260 -190538 -153619 246021 223196 417071 246302 -146175
12271 -57964 205005 247106 -19630 149673 137879 -160056 -47907 91878 -114559 154352 59003
12259 219484 -30756 124866 371156 -55446 300883 20597 -171202 194411 483866 330763
12249 330763 345548 271767 182097 -219206 304149 217659 -59797 116628 35057 -77455 135440
12237 102895 29705 88482 29156 34112 -2947 338376 -77446 360513 232539 372685 529974
12226 529974 122755 574869 274311 159985 -31724 108086 338582 164601 87058 117921
12216 117921 433252 329265 351728 145295 27598 148349 -218757 53509 270328 160375
12206 160375 481292 97373 15610 235829 81374 50907 75256 376337 227255 356764
12196 356764 206600 187906 294581 247896 -158855 16025 169213 199062 250318 118429
12185 300771 38052 101654 52329 -113068 61587 379215 146482 248403 2054 -226064 149925
12173 -58107 -134205 34965 -109552 161003 108139 -103208 -16272 -19844 156923 171285 209877
12162 209877 -70029 245011 -95221 -150921 118941 250771 197087 5111 -105407 46891 461376
12151 461376 -70591 96506 -184842 162625 40938 -25844 15365 262927 45926 995 128547
12140 128547 -178157 66743 204287 -77113 171259 84065 371866 -310871 -56065 395888
12129 57101 -120632 18203 233797 338762 392063 151852 221423 148191 -157094 107935
12118 124415 -183699 -146930 -46926 -189651 -5398 -128634 140481 -256048 53763 -179890
12107 -62718 -317484 88172 125006 -65034 119342 203385 52160 -162956 -248554 -73218 309773
12095 278715 89812 -87206 69485 -159446 -124080 194483 163494 -178387 35486 -116786 12605
12083 -50189 22799 61573 8742 -58960 830 81395 -207972 -63918 84211 213980 233525 752062
12071 752062 2039487 996278 450610 -41218 360440 147806 -106848 72957 169728 -77901
12060 2190 302112 -106142 282879 -19033 240445 -30162 188667 -202796 -30345 6545 61830
12049 61830 30958 138784 85632 -119020 -196683 -237531 115891 -123813 -213053 -106087 116144
12037 -244514 -7344 -79112 160477 202003 61427 -43705 -19894 -44025 82273 18698 295114
12026 295114 244174 -136998 -310896 93345 110703 -49066 -241122 -60047 160978 -378217
12015 218393 -133153 95057 162855 261935 -23210 30906 105046 -104171 12873 -42652 156912
12003 18530 -7344 -172937 76418 -339747 -43537 -38236 27832 102617 -68787 -208703 -262408
11992 -262408 -236400 -60272 -42633 -164169 -55843 -189734 -223280 370000 -252146 230927
11981 81577 -208550 -373696 200071 -7480 -38478 8722 -109758 30549 65432 -49357 301227
11969 -170598 -83156 -42970 -308120 -31558 105012 -23813 284421 85220 -179568 111091
11958 -97470 306055 -133572 120245 42904 -63664 -23588 -84866 2666 -115495 -29659 116376
11946 385801 -15543 234159 20514 99930 29705 -58172 -18004 115293 7850 3821 -51211
11934 -170770 11740 -226169 75585 10872 62884 -103544 -101602 233735 157530 196019 -38491
11922 -104316 -9831 -44058 -83286 -65996 97930 -435312 -329767 318090 321668 -250296 173517
11910 -118628 127493 191745 37984 20725 -223769 225154 121514 63913 -276235 253182
11899 96025 151821 -286066 -22159 109382 -8916 -168398 142031 -156877 318146 -488135
11888 -411872 91143 81180 -111129 -86782 104429 27787 -109189 -226931 13584 -21641 176492
11876 -127337 -205093 -86046 -17724 -249468 -115636 8528 -4818 -16903 -290980 117998 -499137
11864 -178698 76109 126348 204270 140685 281931 -321268 23930 -233250 -154450 -75589 204351
11852 -417871 -3352 94892 -37327 -113517 -292724 413393 41061 290865 37176 104496 -148983
11840 -12282 -360203 73297 54125 437770 130280 -6282 -85628 -141697 -141295 122246 23463
11828 -52590 -12820 241129 -26227 90578 338384 -87410 -122383 -62365 49460 -345434 -195052
11817 -195052 -67433 162506 -33865 476895 -96234 228528 -86694 -8519 6658 221175 -125066
11805 155622 278125 115739 -127477 -253923 -156395 -280287 92685 -177060 57914 -34500
11794 143902 170217 54927 -252107 -123995 -181866 29210 -163606 -145279 277876 131430
11783 76222 -106178 -57367 209203 -167939 -53909 191900 -109850 -51543 -236945 -26440
11772 -90405 -163600 -94942 -183956 -14499 -271486 -92000 -223743 22985 88993 -338312 -184005
11761 -184005 -204796 212559 146400 130996 -19016 76441 -206500 283468 20970 -8384 -270604
11750 -270604 -81215 31 -43850 -246902 121693 -2511 -187478 146507 -278739 107760 -14745
11738 -250059 270627 177922 -235231 152465 -82650 90251 17590 -95582 -134990 -169152 -47966
11726 -136493 -297674 80464 -56011 -321161 265465 -12407 -109833 209334 7776 -33903 30649
11714 491999 -244407 34905 -58413 -94833 -191306 -145230 -39080 14071 -163749 -29375 19002
11702 66424 25052 121821 204236 161572 338850 -38906 89287 -75394 284462 -29124 215763
11690 47152 170841 464311 110494 160108 90984 -79780 101050 174972 -270288 106880
11679 122014 323932 -146330 314034 -71914 155143 152637 16934 321228 69442 -232506
11668 79512 35085 217473 -292330 4919 240 -25665 321065 62695 92251 -15221 -88007 -191339
11656 -191339 -144405 13309 126612 150699 49031 14836 17428 -13634 35938 -11324 41030
11644 -55119 -12084 -56330 -179519 103275 -61505 47643 -239918 27896 -106957 277412 -229412
11632 -123587 -282216 -9059 -58512 90223 235923 -33467 30228 335705 -38965 8304 44617
11621 44617 -122336 -380522 104980 -10034 -249663 218524 372862 323908 76506 -30036
11610 35866 188504 -81931 -186087 -106256 245883 66126 71272 125134 -313160 64684 17314
11598 -38270 199821 47127 85309 68254 148541 -62605 54525 153829 -12634 -14669 -268560
11587 -268560 149319 29151 11542 46591 -29801 110727 433785 -3465 36622 100170 -99400
11575 -30235 182512 243718 -109987 348495 323083 77499 375557 36931 -27402 164416 -17848
11563 61278 44496 -40604 383135 44284 364612 115381 111679 416515 -174216 -338564 -16011
11551 -260764 259643 -169408 51465 240349 167022 154794 109448 98423 29408 -104646 -37309
11539 171561 -67260 -81911 383005 6140 102399 68865 -15549 180480 154270 185119 251480
11528 251480 -61818 101050 -55091 -259698 244136 143232 -23991 -106137 114818 246402
11518 246402 60321 111415 97661 97982 36015 -213369 324797 480260 82008 310813 264865
11507 264865 -100468 244661 96572 -4342 140021 -35189 228885 253036 8690 33601 211284
11496 211284 294421 -208120 275703 8165 -13246 206997 379962 313511 97311 366801 72119
11484 76197 482640 -23751 352046 256487 398437 105874 259542 -8410 -281727 -155441
11474 -155441 104057 151831 92703 416909 251932 131460 100069 72979 110187 69771 3461
11462 -30321 362990 318629 -30857 210476 513563 -136671 189662 69245 -171542 393070
11451 320095 -10391 65285 -213107 401603 128661 -119181 420092 220587 195010 294539
11441 294539 244147 5348 311904 -270 170033 167213 -35057 -64637 -52338 197801 -52810 80423
11428 -147178 438640 179087 -91742 130551 92969 313490 120150 -6689 47920 -133452
11417 -13791 -68460 -93059 -164440 70296 -282848 -135989 231878 -256260 -117071 -259682
11407 -259682 238372 182900 -33191 -297246 -58580 -55841 -13669 14964 254836 298717 -186283
11395 2625 -101695 -121314 325216 97654 230717 -125550 10495 -51783 81210 -305753 54119
11383 -270759 -229971 -120556 -248284 255322 120378 -25870 65062 -33719 130242 -177925
11372 139252 -72502 418176 347060 -257266 6674 229917 -58663 -67236 197040 7195 152338
11361 152338 121890 200299 -292443 323941 -144741 66689 -162914 -61742 132446 203680
11351 203680 -65740 -82064 141288 -230890 137082 308547 99546 -165584 -106941 76061
11340 322881 -204791 -18897 138431 -127476 126124 -174035 -156361 361010 -394097 -97934
11329 211112 93945 -121926 -116511 93985 12263 127030 -46054 -12918 -162755 -155739 187871
11317 -61198 95 150351 30375 194036 -58396 -53525 37076 30799 -10970 -20044 -65137 -154229
11305 -154229 -257319 -40630 18918 58252 15393 -289382 -891 -315271 -370535 -294403 161816
11293 -302773 198015 3063 35756 147186 21628 -41949 157837 143947 172175 -15923 21917
11281 -313732 -76169 -87783 106638 68802 -103080 15600 60421 156670 93695 -284746 20233
11269 24436 -279085 8438 117997 -389607 152753 -144123 -54608 -32333 197108 -244138
11258 -17667 -252424 -280311 -149926 -96084 -123681 -177080 -162644 -303010 263018 231651 242559
11247 242559 151445 -221312 -29999 -34431 -56061 80271 88626 -222930 203685 47043 -73274
11235 165048 -224309 -91528 80418 196002 -86327 39348 -71386 -188668 136156 305161
11225 305161 51980 -209360 2777 339075 -132280 -111698 -469897 145518 38899 945 -158936
11213 -28266 -150605 -114517 -192499 246342 -128013 57357 281507 70696 110657 -57558 -39397
11202 -39397 -174290 330159 -20580 -160959 -111387 96255 -514512 69209 -171674 38933 87688
11191 87688 80804 -342149 119320 63427 106159 5061 -144146 43630 -22135 -60403 75576
11179 -8491 164011 123307 -169239 -242943 76019 -25121 -90705 -261329 215002 76803 193234
11168 193234 -92981 -331956 361575 135263 -50202 -241748 -185895 93170 105897 -157640
11157 53038 -103603 345786 -124693 -402524 -157016 -304697 87370 -217411 146283 87789
11147 87789 -50220 -32644 163111 -152105 -308754 -83350 -93369 221094 -210929 351167
11136 317793 128293 13738 -101128 302458 -11452 -223369 206067 219314 165189 160418 175280
11125 175280 -13051 13522 218530 -109184 -651 49582 -83465 -38670 -288039 -178899 -107580
11114 -107580 -59657 -73647 -175055 -14319 9599 -19891 2696 285166 204035 190098 230846
11103 230846 -62146 199904 11598 301147 -77239 354573 27611 538849 168033 290873
11093 290873 -20566 302956 170537 74648 83989 69766 353358 237031 238521 267188 120401
11081 147671 218748 636177 176322 220920 137432 388083 276475 111461 515457 43091
11070 554126 377823 284172 206045 133174 162836 492280 220455 556856 269811 915384
11060 915384 688885 122231 844769 516056 469292 566129 620726 338866 739502 709967
11050 709967 712113 949175 692966 663177 743025 431385 809866 771903 683199 962745 934603
11039 934603 569601 1130324 944137 734332 643335 738993 919637 462926 1039530 1051198
11029 1051198 699090 525555 1015842 883110 589338 780634 658796 743853 827973 936055
11019 936055 628739 728558 409671 532408 567365 447031 720486 1050838 437880 612050
11009 612050 768496 696443 746687 626103 459399 954842 960166 689718 422719 801075
10999 801075 533605 841906 606185 940316 864611 765145 883412 500052 761224 801778
10989 801778 787970 1059316 1185044 857837 940560 1094336 1293685 1352303 1063584 1458858
10979 1458858 1345409 1572192 1577946 1719784 1869457 2518015 2632108 2941328 3030340 3305559
10969 3305559 3121149 2989086 3056431 2927952 2550567 2173011 1686522 1948913 1761594 1715011
10959 1715011 1696875 1802678 1979451 2107961 2193578 2184382 1573094 1294208 1349527 1126321
10949 1126321 864732 1019194 597030 388763 581265 265079 489627 30906 271291 59296
10938 412961 257261 128290 -204541 -2949 88603 -14003 345296 332877 265098 89332 729086
10927 729086 143319 58351 36876 -350033 -243277 44509 -172585 136109 36812 106803
10917 106803 -76085 -68889 76822 29688 189985 -245220 223762 -79789 165765 -368857 -113767
10905 -21485 4647 89529 -129485 264101 75976 -18964 -103156 -285730 222431 113502 23486
10893 -229626 -39966 138376 6448 48544 12761 -86351 117786 86369 -184985 -53407 156966
10881 16699 -195523 160906 -26520 4735 -20796 96091 219269 -132000 236125 216725 187824
10870 187824 55648 -162649 -144270 -182012 -206098 81472 -227265 -353662 -370951 141257 119474
10859 119474 -4867 -3943 -229062 213474 -510636 78838 -26389 131239 81025 -248064 -193674
10848 -193674 -145954 12606 226934 41395 -317550 101375 -8753 -186109 104476 -122282
10837 -93736 288335 206117 234860 -423571 -22520 139786 -255249 187487 -211072 -185701
10827 -185701 88632 124688 -118172 -218750 245924 38458 -7983 -171825 363529 157265
10816 329391 -1005 -49590 -85102 -206297 -207478 -148610 10670 -86414 112173 148344 -84595
10804 -2660 -26077 -108934 -398928 -147061 159255 98449 29862 -155766 -16709 -149228 -52049
10792 -26159 -135815 12983 -121739 349253 -88214 161339 195527 36542 -151574 -134169 -203718
10781 -203718 -173604 -21938 -9491 -93964 128679 270833 -321660 3640 -226828 -260202 -394594
10770 -394594 -45238 242586 -20285 306484 223331 4678 -215832 -131985 -255525 -158857 1278
10758 -207364 -151394 8022 134742 108284 -104802 -573302 310594 -241501 3215 -320827 -99688
10746 -42447 12376 141375 138527 -121079 -158247 49043 132111 -262229 -104543 290159 -187783
10734 -57952 -46330 161621 2777 -208118 -442129 -183444 1396 29118 -293168 369062 -117543
10722 377565 -174964 -444597 355092 70394 -35968 73230 -108075 -158412 6629 159980 -99492
10710 53388 -49630 22797 -463794 -91705 336399 -151096 -226593 -94263 -97435 106427 -22757
10698 222402 67430 223978 -59749 -198780 367847 162026 219101 168894 286874 -218387
10687 -182882 -226941 -15567 107551 225225 -234263 13676 -73989 -24406 58706 -128093 199566
10675 -31135 23292 259703 115013 62839 -61743 364393 -125882 -199829 -56976 13897 -57104
10663 134452 278158 300097 -67472 -147335 -286872 -231997 -93112 -414713 -245361 -253486 -216535
10652 -216535 -136533 37254 -10922 -178928 122249 6031 82179 -50748 -76170 79169 43239
10641 43239 33195 -246683 -122313 -299077 -156989 -31993 -313587 70021 -215547 2470 159171
10630 159171 2847 -40655 16842 -20961 -10576 -93307 55706 -350332 321849 -59895 -184769
10619 -184769 -300738 -70180 -231849 -338897 8249 -101958 40871 -199835 -97093 341643
10608 342188 -218155 106199 -39643 -44013 -116319 2839 -197586 -126835 -338042 -407200 36006
10596 -30589 -369031 -126879 -160610 261042 189446 -188311 -82088 242112 65059 -67786 -72137
10585 -72137 121352 -61487 -260567 10945 229853 -116866 47395 -173297 -103338 -194087 -360159
10574 -360159 137324 -270554 26680 -263922 131080 -95317 -67688 -359314 144774 80193
10564 80193 -155601 -84147 92185 -141023 74081 84940 69996 298165 -1717 139276 -317370
10552 -4495 -221901 75575 -152305 -51012 106292 -204618 194687 -200444 150766 -495453
10541 -258769 -239517 -193518 249510 56588 -160802 -172198 142562 -343249 -77053 88329 242954
10530 242954 6547 74230 118680 -127485 -418447 -9499 218230 93606 -328198 -164843 -91789
10519 -91789 73100 -166678 -464012 -386688 94855 -221998 -122652 -328885 36617 -31346 23067
10507 38926 -245639 131759 -31947 -249458 82744 225449 -91386 59248 -112548 29524 -226308
10495 126388 -336216 -13063 -180736 -51228 -116959 -14405 54269 -17274 231669 -50494 162987
10483 -303747 -217047 242245 450176 313708 204739 208026 227668 256679 158315 -19184 -45392
10472 -45392 301983 120649 82428 -130550 36014 -221690 80542 -35322 39944 -26096 190466
10460 -336288 -113302 91012 125502 -42351 107926 -24200 133429 -122102 -15707 27831 36106
10449 36106 118976 -100100 145495 21677 -34196 -107058 -224062 -105892 -235753 -246080 -130258
10438 -130258 12284 141020 -179211 -260536 10779 6189 175356 96567 -205710 -18796 -309954
10427 -309954 69249 -142930 166261 155326 -281498 113263 -158907 293568 -130247 83459
10416 -166969 -70476 189183 -71238 304689 93860 34501 310395 -231643 400133 -328780
10405 -121115 226039 -333487 -248811 -325019 -84823 -143867 128488 101639 -302353 70804 -10619
10393 123505 -17808 -11376 113911 53198 329748 305764 221105 115110 -8900 373563 256871
10382 256871 -9492 117785 -21823 30353 62830 215305 187145 248233 252564 -203910 66748
10370 452581 453291 347171 545051 232952 294914 496845 353251 493349 543578 -55852 -8497
10358 141665 323217 390466 162819 50354 361619 157462 99089 149322 848043 783037
10348 783037 283408 501126 397791 527223 586074 483830 345982 686321 146851 506915
10338 506915 265489 278406 22041 -128961 110315 155753 109212 48863 231030 146944 293828
10327 293828 77185 -132443 -59040 32138 154463 83871 81636 402907 96343 282362 57302
10315 2716 226363 -194183 93726 63893 -99661 343959 -91961 -106816 181651 -126481 -47317
10303 217486 156525 -198198 34285 -43599 -9082 -75103 67510 7459 -135787 90050 -286478
10291 324301 -36254 200009 -56035 -150686 -184283 -322852 201317 -378747 51650 -49853 -151430
10280 -151430 -127762 214283 215793 12182 -78202 -76484 -349276 -125010 12738 51466 -102775
10268 -112065 106385 -288832 53519 -48023 -56131 -205428 1680 -198425 215550 282986 451802
10257 451802 569042 529669 304901 165261 94022 -46 148977 11020 -188169 -2497 -163974
10246 -163974 -165467 -125427 27185 161594 -193895 -22621 -62508 239137 -113834 -234777 -242352
10235 -242352 48771 103123 -57074 -13597 104875 -43979 -186797 -168395 -195683 74469 182999
10224 182999 174247 -181257 -60176 183391 27055 -524273 -79713 -145754 93157 142653 -5488
10212 -69319 153333 22760 -173396 -145768 -31972 -309397 -72501 368806 -6746 -133241 64759
10200 175520 -200574 -106761 -159470 -318069 -140958 -260543 -260483 -16015 -35540 58048 335684
10189 335684 -283016 -215313 -66830 -243665 -76420 -306898 216306 -344325 -35764 -58367
10179 -58367 66383 18257 -80992 -180441 11070 8272 -101786 208012 -186861 -364838 -137497
10167 93260 -172056 56277 -373449 -430412 -198713 111619 -123777 -19926 -258985 -66756
10156 83844 -39789 -106612 -143905 -200031 120119 -288383 77240 -69620 -1562 -175641 -70857
10144 263470 -329077 202162 -307753 -86226 -7945 -205475 -109226 -64707 -77795 -174657 -100907
10133 -100907 22869 -9762 305484 -318967 -201297 -101329 -71879 26888 15850 -187398 -174559
10122 -174559 246839 180744 -77242 204469 20091 38345 151253 85806 -195923 -151370 38205
10110 -17771 -33786 -341964 233319 197415 -61908 43333 -221094 -998 -177244 45822 15028
10098 -342481 -170590 -50721 -177351 -210764 8424 -173105 -70838 -210972 -190816 119749 -314529
10086 -16180 -305871 79841 -47782 -176395 106754 98966 -252759 -274880 -284781 126450 -17043
10074 -57467 -33397 249680 -402233 30292 341448 -57978 -2778 39625 -91125 -192466 -367881
10063 -367881 -21482 314222 -202863 108090 40410 -167135 -104182 -36579 231481 -388539
10052 -67023 76764 -1759 -19703 169 358738 -85445 -118418 239348 -220415 -82984 -239099
10041 -239099 -24716 -86083 30285 -384770 7237 -371595 -363209 177012 991 104361 -200342
10029 154081 -549539 -199471 -277204 -342158 10765 -70432 -206325 -23062 -58648 -41324 251700
10017 138998 -368398 -127296 -155430 152254 -281326 -317467 83829 446169 66240 248617
10007 248617 -212214 -257370 -148519 45224 95516 -263884 3251 -93457 -143880 253937 -97564
9995 10363 138055 70655 -4198 59084 -133573 26851 -58032 276798 5461 -112761 -72840
9984 -72840 -97114 277610 76440 -83936 -256470 -49981 -247672 155761 -60736 -124867 -36478
9972 -160353 -55867 146985 57610 83720 121051 -89280 -490016 81724 333114 -172306 -312019
9961 -312019 86372 -7591 -19570 -449273 -107156 76590 -186515 103092 48796 -179332 119779
9949 -208195 -108991 -34484 33605 -232293 38679 -274399 -81644 175670 73367 -301500 56038
9937 -206032 166940 -88972 -365500 -76887 13233 44420 -67954 -30859 -14825 39278 -113374
9925 -129691 277734 -160666 139041 62326 -64437 -159628 60856 -127171 -215903 -72180 -351948
9914 -351948 -110864 -272325 125991 215309 -14706 -16362 -245698 -404784 93538 79383 92751
9903 92751 203704 47077 -273393 23856 -81897 -328478 -307808 -190173 212562 -109458 -329247
9892 -329247 -258672 123888 188352 -284223 63410 -132297 -223080 3776 -80743 -100050 -332914
9881 -332914 -9383 -273783 -273035 449404 -140291 -235280 -135328 -222013 -25700 -126195 -80978
9870 -80978 -216013 -334646 -220115 -5619 -222108 -151287 67783 92524 -166589 -178667 -42389
9858 125849 -26989 78970 283523 -246626 61334 -79910 -47831 -171759 -40078 5403 217684
9847 217684 -215573 -434765 240966 -201050 124055 -47440 138136 -57729 -20259 -32950
9837 -32950 -34147 -267304 -277055 39257 -44380 308030 -196044 -312147 -258254 -14036 -129065
9826 -129065 -205475 -55377 -34821 -109751 169540 3655 -302268 112181 -180642 -124588 -431666
9815 -431666 -155068 -59011 -65143 -72934 229497 -130922 -100503 -139142 -144236 163506 -84920
9803 -63030 -116034 -328825 77637 91612 -124809 -21004 -41620 79658 225581 526659 -399660
9791 -166429 -29489 -169421 -390815 6087 -222896 143951 -218793 -486079 -188537 -401108
9781 -401108 -54429 -237154 57339 -46644 -205320 5804 192438 -324485 17667 -241575 67156
9769 -128570 27587 -230900 -433724 125198 -4983 -163322 -79278 -42390 165837 87026 277128
9758 277128 -396806 -100347 -295104 185588 -190404 169085 -99665 7044 -116922 -135678
9748 -135678 -417598 -225191 -220990 -242724 79572 -450298 -29240 -263791 37829 -164937 -78872
9736 -17142 175911 -212094 -361269 -61316 -162715 -74642 -258516 -87066 44401 -73596 -16825
9724 -83488 -106315 -216328 -120989 -165575 14696 -229102 178751 -288201 -72892 -296221 -85243
9712 -258721 -298373 -69585 -159254 281423 -64987 227084 -88830 -23949 -208584 -87231 -88513
9701 -88513 -228230 -170268 116921 -204028 2269 -281413 315446 9547 179045 -98698 -385287
9690 -385287 -197079 -34481 -36930 112106 -322992 20314 -161384 -21546 -31793 -159272 -406843
9679 -406843 -148110 -186465 -111662 -317031 226680 47741 -107959 140458 -22736 -52251 -80990
9668 -80990 -153755 -125735 -268693 -168064 -54978 -350618 -283874 -17786 -181065 -240494 -158019
9657 -158019 -73614 14813 122213 -91465 18293 -149314 -38972 -247404 122358 -120943 101479
9645 -262039 -97533 37299 -87011 157227 30952 -18079 130114 116275 140259 3396 222515
9634 222515 -129746 51948 -215174 51326 -197285 -362566 -53878 -226362 158678 92675
9624 92675 32655 52886 72057 22973 60209 -32887 -2472 -457434 -189490 -90191 -167197 -205390
9612 -205390 123012 108436 -77787 -18800 -160105 -95693 30742 150268 49398 -132222 105617
9600 -368038 190349 127040 -108445 28349 -274891 179495 -158094 -392844 -39619 22375
9589 432130 -300948 51042 157832 -68526 7292 -64098 119184 155238 -176306 -60945 -168714
9578 -168714 -209931 -9708 61525 164321 251711 -33026 23036 89000 -231416 -78686 146818
9566 266703 294904 -298618 -262667 -301120 -337961 25424 -68153 226682 -384163 -140870 288133
9554 270662 33635 -12245 -104340 -270593 -236016 -81384 124234 -68336 -132009 -272208 -204551
9543 -204551 -173766 -104467 120712 -45017 -29907 98607 -107227 -187931 8696 -186910 -216909
9532 -216909 -96350 -195386 -241274 -215172 6710 53008 157286 -247390 83591 174713 300904
9521 300904 -160287 284096 -146487 -242694 108447 -258141 358766 47467 86233 -64943
9510 37661 -212839 78736 -71854 -361096 65985 7118 194065 46850 4668 61063 -66709 -171516
9498 -171516 -152082 117438 149881 -101672 -245241 119810 -186650 -17442 116268 111757 45190
9486 -6424 38056 -40026 126743 -100276 -21373 -234928 -162452 -299624 -244871 -2546 -283652
9475 -283652 -26731 -258413 -8555 -278474 16358 -136312 207146 -90040 -23562 -166525 114771
9463 -166158 108379 -167567 -122299 -101041 -228325 -961 -252360 -222910 -145237 -423487 -155129
9451 -181217 151056 56134 -212903 38395 -24132 -348259 -324759 -73663 58851 -226080 -245348
9440 -245348 -123690 2454 -171714 189357 67300 149435 -39853 -226668 -110145 35499 -94268
9428 -89190 -115767 -417106 -46896 -183121 -183493 46545 58271 329523 303022 240071 -5584 93346
9415 -66204 -176084 -32438 18040 -280686 -123165 166884 60123 -53463 -180377 133438 -193272
9403 105489 -375901 114392 -67572 -390724 7515 -92782 133178 -125985 -158931 -129488 -243146
9392 -243146 33357 164211 -45964 -92015 52590 -127799 -145555 -120429 -38777 -176235 -271879
9381 -271879 -34792 -285373 -231856 -196404 -297587 54703 -89890 139743 -43494 -77748 72416
9369 102367 -98327 -39462 401253 16222 93166 -197042 -153503 -383671 206539 -98449 82104
9357 87157 148532 -37812 -373688 1592 -100134 -22060 237957 -219383 108120 3321 -128097
9345 36879 -85716 -130793 107877 25706 -93951 -290685 209589 -35684 158859 -68963 51171
9333 109628 -22455 -247306 67416 -356678 132237 -268965 -164456 -291623 -89890 -40648
9322 228600 5372 -27578 -246734 174050 85263 -151672 -223924 -59357 -162024 1943 206548
9311 206548 280696 -77950 333864 40957 217557 121567 -315517 127566 -216031 246132
9300 -108768 14964 235433 -86329 168456 -260941 -311353 -99409 236600 -217292 91535 -208455
9288 116789 -102258 -241150 25445 -147650 78029 154148 -137742 92387 -314295 -142602
9277 -31023 -121420 -150308 -237448 -165814 -160960 -134255 7490 11002 -309922 -100932 151546 16799
9264 -84442 -224030 307447 -54990 42597 13496 -69224 -192761 -56559 -45304 -220743 -281444
9253 -281444 248837 144719 -13425 209036 -365704 -357038 -40407 -89561 -198851 128639 371891
9242 371891 118842 309342 15222 69004 -316882 3768 75188 4568 -57720 -376850 -3010
9230 57779 -384326 -46911 -220897 142764 -173211 -7309 -151529 -170500 34202 15850 -133787
9218 117123 96321 -68507 -94570 124300 -9827 -230990 366210 -110342 -8158 -74 -15575 -321475
9206 -321475 -26638 659 -59843 -82206 88722 -180144 -324222 25647 116170 -55013 10985 134475
9194 134475 81531 -414105 272983 74895 269584 -364 -152696 -51133 -222925 221988 -15982
9182 42772 -362837 -26320 -185678 -185196 -244410 68492 168024 -268947 -116277 -126057 181954
9170 -242802 94538 116421 -257113 -111966 36962 -522426 -77275 -65716 -189900 21761 -222859
9158 201177 -185951 -127948 -133032 -84486 -16547 -119759 -16534 -161586 273543 76866 -277057
9146 -189666 -94437 -97479 -38564 -236982 -288461 222023 -73466 92631 -456068 -238409 -112762
9134 -314971 -92879 -420825 57009 -8889 195254 76854 -106284 -158165 20625 -228921 66685
9122 261067 -58373 -55516 -176347 -204793 -195895 -74258 -261735 -5656 -166680 -148396 -581611
9111 -581611 124670 28400 -5179 45859 -330407 -134494 -163555 -369655 92742 -39119 -481799
9100 -481799 -254929 50198 -512095 -374740 -20946 -24395 -243695 -224901 -95006 -261981 -422620
9089 -422620 -284191 -33016 10461 -71611 262505 106522 225415 -165932 -103831 -395369
9079 -395369 -365645 -118701 102790 68153 -414247 -88091 -57168 -202057 -19662 111012 93263
9068 93263 4868 -199149 -59408 -202055 -132295 -100944 -60795 92019 -36525 -181750 51970
9056 -108116 -190741 -239363 33380 3705 -141623 83509 -334069 -10104 108087 15673 190895
9045 190895 161765 351404 -130781 -101712 -17487 -162041 -335781 8349 -182253 -92740 -307342
9034 -307342 101515 156857 -321142 -98150 -352244 19488 -160473 87851 47362 -10778 -13565
9023 -13565 -23146 15102 6157 277335 107143 -16195 -13588 -55928 82135 -92164 157358 11072
9010 -147112 -324304 -56634 59564 9607 -50389 -80829 273422 274798 -114280 -86485 -239049
8999 -239049 -308357 -62871 -89872 -10099 359552 31578 -111281 51309 92704 -158209 -33635
8987 -73078 55505 5758 -27025 -217703 -54169 -83058 -216947 98812 -104196 -16320 28117
8975 312037 -251664 216291 -121266 24930 -80850 -133242 62876 -119330 -76413 -56653 -122176
8964 -122176 -153152 66079 92789 188724 -306735 -246619 -95502 -171952 73763 -198211 316738
8952 40310 118476 -158128 -5594 -216654 74988 303212 -13620 34458 143181 -204487 86530
8940 51672 199845 23965 -64696 121705 80407 34719 139961 71268 -256822 -141729 26237
8928 -111691 -331492 -67310 328785 247922 464572 1275208 3246847 11959903 6716639 1506510
8917 589000 313166 279177 201839 -25957 234049 292432 -66583 -11184 149189 351330 456825
8906 456825 131987 153152 -235107 -113292 10085 57755 195639 56479 -355920 -345563 -239424
8895 -239424 -7308 123523 -74969 -233256 -178095 -76484 -236616 44019 -46204 -71456 -122130
8884 -122130 -176596 -416875 32508 -222622 -168128 -64677 24999 90924 -344733 -70797 -35789
8873 -35789 -232433 -178253 -321901 -3306 114432 -57984 -222055 -23592 -250823 228618 -69806
8861 -301162 -53280 22457 257125 -3058 108319 -168435 229148 15090 -155530 -43068 78296
8849 -35045 -37328 104996 -43292 -306228 13552 -104570 -286793 -139560 -113302 -172462 -25991
8837 3331 -126198 -127048 -189112 20373 293901 75533 -30282 -23424 -107347 -46554 -34183 154031
8824 -260197 -184041 -11763 46257 -42963 322358 2974 -170098 -266153 -57467 -60628 -77839 158968
8811 193068 -193602 70113 -24485 112533 10205 121040 -151069 -236252 -117239 89430 94666
8800 94666 -349324 1294 -82290 -498304 -268380 -19593 -120580 268500 224666 242932 -386507
8788 22100 -207001 -237352 -80259 110412 -200198 -240452 -176276 -58032 90830 -379644 -78152
8776 -179839 -56078 40430 -245223 -148950 -287941 167658 -127269 1586 42411 -271670 -55757
8764 -347239 73971 -356636 185340 321691 -433354 -193843 -351608 -86207 136773 196501
8754 196501 -292001 4250 -23942 -290884 -360440 -20541 -71917 -110240 -77064 -43596 -120371
8743 -120371 -313800 -132859 -193173 48155 295724 -220424 -167887 -2702 -341005 -299531 -4665
8731 -72627 82670 -116586 195440 -71565 -104075 19421 181121 -228339 101503 50609 -181338
8719 33090 -109244 -79541 -438325 208250 179737 -169281 -46229 78528 114000 83942 -131187
8707 224943 39707 -104158 -276129 -28067 -118816 -144138 -46822 -110078 -317011 -149723 214370
8695 -85206 -20077 -280627 219414 -176136 7492 30036 33786 63396 3419 185616 243561 -120086
8682 5967 -63430 -133618 -90322 -174613 -154263 -134335 -11457 16551 78051 -55532 -181907 154462
8669 167453 -38019 -72656 196946 -68928 24149 -82623 170000 354131 -165528 62539 -43041
8657 121801 -175904 -144181 -248572 -342605 -280917 -126691 -344631 31853 -51145 -222415 -278689
8646 -278689 -243084 -263558 -132174 25885 222089 -192611 56023 122271 -106010 235372 150153
8635 150153 -6649 -280541 86749 -15345 -247094 91560 191119 61855 140023 -244088 75071
8623 -113568 -177119 -119241 -197185 -51381 22723 72018 -236602 -63321 -238198 18714 -4596
8611 -155727 83413 -296243 -166275 -156602 -39745 -36065 -216298 60880 -183460 -132858 -247616
8600 -247616 -141350 -208943 46443 -255604 18250 -122656 -134169 -98098 59476 -198369 -277293
8589 -277293 -115098 -175082 -47698 239334 -316472 -46314 -23721 -227299 -236280 11150 -224596
8577 -31330 -154465 191991 17052 -121339 -177631 -238560 212029 44412 2903 273183 -195227
8565 -47615 -82837 48064 1053 -93326 18463 177290 13351 -35947 -48531 -193702 -152775 11103
8552 299650 203400 -109239 33464 46879 -148661 155347 163645 -128255 -201871 188301 108488
8541 108488 77371 32640 37800 -213583 -186893 99976 123813 -67423 -34035 -138275 -4570 -138679
8529 -138679 285997 -275418 -78948 -38763 48789 -267039 -14526 -68356 -244533 205364 -230309
8517 133867 -235670 -78586 -39606 -140603 -193368 -51242 75316 -161830 -130342 -232771 -114143
8505 -75384 -300684 24429 -259036 9618 33981 -117705 -73394 -38684 216981 -180578 -19965
8493 -116956 129612 -110438 223995 -57165 28899 -197040 147718 -170777 -143595 90034
8482 -353233 -478826 -148660 9093 211965 193523 -54716 -157685 -7228 171094 -516738 -70991
8470 69234 91598 126037 -363111 -192546 -19468 -92013 -114712 -331803 208663 148752 -35070
8458 -265458 -7217 -23707 -73327 -170883 -74428 180145 214355 69515 210714 369323 -240082
8446 -247852 -41716 -124961 -140704 -90830 -323206 142213 105214 -129040 -384525 396031 -248585
8434 99026 -208583 95328 -175001 36394 163791 -105722 23131 -254205 148551 43641 -273554
8422 -210339 228885 -24277 -122320 -17780 -17891 -82551 43085 -121092 77810 25373 77755 -19604
8409 -295914 -356325 77447 -74887 -82080 48468 -209583 174658 -83297 -157214 264275 -93469
8397 244734 -132601 -263453 -31647 -301581 -55317 -157903 -59007 171296 166362 -241823 -62458
8385 -173543 -255030 153643 -255181 -40272 126293 226761 149407 -408521 249027 28811
8374 -53325 -98987 -90854 -256901 -99284 -54638 -131085 -129512 -154273 -233857 -136433 -389030 -17968
8361 -366281 -237434 -70595 -161072 67328 -55897 -161056 -71432 -124445 -196106 31230 -44785
8349 70224 -45758 -29067 -93464 -82626 -156359 -84097 -148280 113336 -69573 -82536 -192103
8338 -192103 60479 -176824 -58982 59602 218170 -471438 -6695 -393234 -252921 111869 88991
8327 88991 -202828 136039 121048 5826 -139190 -234162 -79142 126812 -137967 -57278 -93697
8316 -93697 -99226 -200106 -185934 -132296 111751 -260012 20811 41944 122699 -61967 150067
8304 -248684 88958 -238072 164059 -114766 6988 -53794 29309 163127 76711 2339 113009
8293 113009 -242900 221968 61716 -192592 29846 -225769 76325 161319 231914 -276697 -169162
8282 -169162 17462 -148128 233725 1372 -325398 210341 -44778 60337 -47375 218343 -84538
8270 88301 115085 -221563 -343179 -60871 164597 -153582 -142269 176239 113969 -339597 -191213
8259 -191213 15623 -130303 -130820 295397 -82109 -124390 -281001 46768 120022 -52459 147987
8247 -204688 112010 -140807 58633 110719 -29684 64907 -394409 -26083 10424 188600 178270
8236 178270 -203517 -221556 -12540 -50610 172299 -227708 -40254 20133 72664 13568 40150
8225 40150 -56865 -135203 50160 -130156 -219925 -159318 -126676 -109836 -213942 146807 251864
8214 251864 208080 -99129 -38348 -254025 -26021 -300324 339 74322 146934 -33941 129504
8202 -85027 288273 212910 149277 -287358 -241168 -315841 -315741 -67877 -98872 84838 -37003 33606
8189 -323910 -104382 -24844 73326 -180690 -361999 11860 -209723 -150150 -271589 21738 -187321
8177 -241319 189 5680 116343 -56842 -88720 128748 -182003 9112 -17355 34004 -2205 434319
8164 -18589 268913 -94336 113139 -162788 67691 -135881 -156419 -64566 -17126 10828 52072
8153 52072 -421242 -171346 -184650 -46842 -48373 -194157 -124423 -118881 -49843 59578 105499 179248
8141 179248 -221440 186718 -4948 158634 267427 -105029 23501 172164 1988 -116724 12558
8129 -483909 -112923 79483 -233619 -45692 -213500 -327428 229234 65972 -112274 -131777
8119 -131777 -30912 79648 242700 260054 10280 -354630 59397 -89947 147815 221802 -357046
8107 25949 -48497 -478646 -41715 -170677 -267756 -75264 175932 -53815 -10354 -259072 112580
8095 -183188 -93114 -198861 225465 79022 -91091 -183473 35891 200519 -92834 -24733 -245723
8084 -245723 158177 -163378 113658 234527 -233942 10901 -490393 4209 -116691 61636
8073 -162491 33050 -44053 -143239 -76116 -282178 -209516 -454048 128017 -93158 112815 29800
8061 -4399 165156 215743 -152788 187252 78581 -193648 -48549 -18302 -177369 80302 -19797
8049 -174219 6751 -147162 100694 221596 24590 -16323 -93158 -121910 -282246 -89596 353328
8037 61775 -383227 252692 -304209 -151581 93688 6431 150416 -5299 369788 62011 -273615
8025 -379531 -102720 -118324 -31974 -248049 51876 -369794 210424 -79826 -158540 -88161 212686
8013 216020 -230418 146631 -85557 -23317 -66232 172535 62339 71897 -183341 87239 474912
8002 474912 -454078 -36497 -99053 234260 -119746 -168693 -107385 -221644 75078 -331964 102318
7990 -2592 20826 139154 -129067 -165706 -154257 94877 -185424 -206784 446745 -83290 -97432
7979 -97432 -59012 114547 379265 -63609 45126 36355 -13381 -225367 -291996 332193 -90275
7967 -204902 -221736 64945 -398271 -412086 -115046 -239451 -245382 -55894 223367 -10690 40544
7955 -293567 202600 242980 304421 -277117 38192 36918 117792 -298691 -92834 -3324 176962
7943 -282832 200610 -127139 -402317 21303 -116321 275277 147142 134947 -289843 -140519
7932 349507 -38063 28032 124363 -20918 -6481 23517 106048 -311312 -126783 116558 -71857
7920 110340 46450 -303307 -220934 -139015 -182493 21571 120062 218910 -144112 -80510 -370300
7909 -370300 193305 -293296 -222639 126803 -34348 -42254 -149058 -9243 -141545 -69693 -42502
7898 -42502 -36541 155582 -299660 -152076 -100135 -14569 140418 25987 22813 -149813 244871
7886 -96700 -153006 -268456 58492 39630 303105 -107486 3959 -88035 36666 200266 108460
7875 108460 30635 117560 -40042 111235 283762 -127222 -191969 -265271 -74622 -70323 241739
7863 -76319 142006 -418710 -158859 279109 -60152 55341 -312509 50312 113819 20925 -369952
7851 -204702 -85934 136179 195750 -141296 -261943 10558 207238 -70954 -200705 38229 15691
7839 -275653 246985 -209595 -36826 -237828 -277173 -351344 -172763 -154910 53928 203482 196824
7828 196824 66567 -119514 11535 -334260 116196 -82449 -131333 135656 -98076 -180524 -231142
7817 -231142 -57824 -229684 163135 -36007 202520 84232 -235197 -350372 229209 -43298
7806 -16436 -163376 -221485 -117254 6613 -235758 -152599 -23732 -68552 -32221 -355582 215904
7794 38036 -29265 -69679 282328 -131569 -176607 -137843 -6422 -27291 -226832 46241 -28416
7782 -17764 -26260 -133059 145000 77844 314155 -96163 431650 319954 -38729 -68337 -47872
7771 -47872 7652 122629 -269848 103109 -29682 -63728 83919 -20997 -235267 16360 87075
7760 87075 228563 -423954 -102524 -64631 -259610 -35425 29216 -274614 -71333 -153124 -231547
7749 -231547 -20348 -123482 -73302 -228726 -91323 -6598 -182505 109518 -97781 289041 48514
7737 73106 -318082 -74708 88874 -2751 -9210 127789 -209016 -37818 -32264 -266079 -315982 -102814
7724 -101391 -235529 -251967 82530 -384675 -33863 -62128 -105827 156003 -54357 220968 -457992
7712 117895 -158732 -132706 -99183 152846 795 -93927 40623 -181696 128335 104063 -27308
7700 -10733 135044 -42970 111108 18261 21897 -117827 -52125 123927 99852 92531 -30408
7688 241285 -278215 34623 -58832 860 167667 246028 -6681 -104135 243182 -185144 -52351
7676 -101431 822 -392037 103466 -108271 -125367 -462269 228818 -35743 66718 -274494 -82128
7664 54067 127747 119128 -156287 -183387 120315 -168694 58819 107992 -274684 -63564 147425
7652 165670 132228 128713 137794 -169960 -176696 -64238 -335953 203591 18340 -20069 -367530
7641 -367530 -137927 215169 -107907 -29287 252557 -32815 -265682 -54716 18159 -236548
7630 212394 -63448 -175920 -164222 -19565 184729 178963 -158341 -85055 138291 -181308 181407
7618 202915 -135678 -74089 -78175 -78271 -244824 -124872 45085 -11861 116189 -136166 24665
7606 177973 125967 -26596 -219437 -56981 417685 302050 -174093 58691 -30817 -12350 -33491
7595 -33491 74434 -21128 -3169 240967 -207850 -81624 -140107 59691 144933 -135736 -199984
7584 -199984 -38866 149637 126946 -56466 -129684 129918 1133 -66706 211750 -211418 -134678
7573 -134678 158006 26346 -138556 144476 -70485 -363816 383335 204868 -73788 -162202
7563 -162202 167924 -542179 -110643 -83213 -128686 209984 -36544 -323849 43313 154452
7553 154452 239375 -6593 72200 94565 191616 4693 -8312 -223722 -126564 -256157 -133780 -119906
7541 -119906 19668 -30431 -58219 65588 33263 -281036 -204916 -66917 10519 -99957 229670
7529 123980 186778 -12315 98524 93417 34759 -314887 255041 -276945 242703 165936 -158840
7517 112327 -30464 191348 -51185 -113239 -73766 -130765 -298066 -18745 -24148 -4641 -273561
7506 -273561 -249698 -28639 -25439 19011 -68751 47870 -396090 -373778 70945 60623 -177806
7494 -86745 8005 -61082 -54229 118045 -152240 -151570 -301087 333679 196027 89227 -448896
7482 -371435 163435 -172303 -404308 57954 144820 208287 102430 -226 43862 52312 34520
7471 34520 -189847 189412 -120836 -46512 28424 -71581 -332478 -91405 -19787 166556 -47106
7459 -25384 -165763 -193084 -176315 -293783 184544 25869 66830 22080 87808 -263705 -26567
7447 -205029 285474 36509 164311 54250 -35929 300464 67273 103754 -184001 -157248 -138535
7436 -138535 -28635 -367398 -14363 -221589 -1286 -84783 -272655 -98744 -87545 -37660 -181 389700
7423 190407 547811 -89435 116839 111776 -385699 107148 -147847 -56062 138220 71732 -287288
7411 126081 214509 -353353 183377 -2575 -150290 -218489 174573 103530 151408 97227 83736
7400 83736 -313602 145861 -287059 6850 -67932 -475745 -58442 -30713 -315555 -60207 184754
7388 128193 -138556 89988 331708 -129346 -205259 -54696 94970 202573 -53285 -131797 -19583
7376 -90413 95721 -90208 -13251 -83075 -50864 -119657 325091 -50715 -125332 312894 -36447
7364 -317226 -171309 -246504 12121 -152765 193168 -195764 136718 3965 -99047 209997 -107729
7352 118663 280572 118232 131413 24204 94716 22704 143958 -34975 -409414 -102882 -154149
7341 -154149 149948 244263 -94228 -157585 227920 -42385 -161693 -46133 -514656 46008 -153623
7329 -161305 -84896 -196707 -64939 -189306 -201809 -223487 154591 -136872 -194791 57148 27263
7317 102 40338 328507 318873 43855 -111241 -53910 173276 29675 -66850 136476 187791 67752
7304 -145138 -96382 -301062 -343118 349225 -29681 98452 39985 -200905 59338 -143896 41539
7292 -176158 -104880 59880 59885 -31688 -121332 -340627 -58531 -60916 -2525 -27886 -301947 181887
7279 -46327 87041 121222 56969 -46426 -33923 73922 2586 230122 -187653 -169659 -180876 45072
7266 267425 93457 -45167 42128 39464 86734 44960 -269115 -86088 120046 -174585 -164358
7255 -164358 -60065 -70008 144218 -35997 2169 -68078 79992 -165074 22750 124906 -85943
7243 -165405 127945 125962 1434 -41334 -103486 -254915 118944 -100652 -129001 130675 136862
7232 136862 -218120 -77148 167033 -99254 -204310 69056 162848 28789 14719 37069 -81639
7220 -224904 -52737 -227198 -6899 40619 -206575 -101053 -205613 164488 8144 -239174 -367485
7209 -367485 9045 54732 342865 134195 63795 81255 28148 -188196 -380983 -157914 85756
7197 -77224 -93319 267352 40468 103845 19535 -346974 -61454 78554 -139665 231369 120453
7186 120453 -177485 125369 -181197 -219589 -43684 -144660 156003 88717 -174090 -149116
7176 -149116 23306 -118521 93127 48188 17026 -160559 12712 2082 43181 223985 -32679
7164 18861 92100 -23834 -114602 -70069 -173898 -113194 79128 38940 -22086 -5184 79326 -72411
7151 -90928 -251257 67611 -86397 -37697 48030 -43111 -168276 175843 174727 9444 -209299
7139 -176552 -276435 -117725 -93124 -42091 -159624 43574 -125351 -179041 -40994 148053 194846
7128 194846 136706 -252609 86188 3005 -213376 244076 -286984 244136 -161521 -51013 179478
7116 -126110 -202545 -20145 134528 12523 64305 -235802 59682 -17840 -54597 83188 403468
7105 403468 -221508 -132158 -51015 -4098 135025 37893 45394 -374821 -223955 37318 -353252
7093 4247 -163215 -121247 21953 -51049 -211368 -70997 -110710 -181891 188027 186313 345436
7082 345436 -82376 154211 -55874 80521 97731 -18904 195254 11691 57275 -38467 -83268
7071 -83268 80572 -92996 -54458 -133344 -61923 -300330 -173328 121241 -28421 439313 -83399
7059 89518 145655 -110084 -258855 29235 58351 78924 -167312 -182254 180700 -93602 132633
7047 66207 -266414 -27909 -181231 -159315 -29615 198347 98879 213125 26714 5782 154573
7036 154573 1882 -106523 -96360 233659 -147427 141480 -69935 -39475 -41211 142233 127057
7025 127057 -131093 134877 17650 -103765 -123837 -90016 -305586 -161171 -91883 -71826 145075
7013 -286634 -43420 -239871 195779 61977 84266 -224498 336114 -175500 1494 -278613 -250446
7002 -250446 -272073 -275630 -127329 -43483 -196536 -71655 98995 -110926 -169169 6605 36221
6991 36221 248237 104421 342801 5433 -310039 108097 -436248 226399 -71176 -435300
6981 -435300 -350867 -249347 143917 -381087 -129734 164315 -111329 16416 -43238 -91102
6971 -91102 -59512 -80212 -32696 81932 68176 134474 -374669 51938 -226528 -68774 -314653
6960 -314653 -209454 -165150 -222980 304308 -259592 139399 -288602 -185178 -50329 185385
6949 -148343 -295481 153946 -108292 -258865 58936 76594 -27214 103956 233595 210504
6939 210504 -189239 64607 356470 135353 101044 50973 -286005 -215027 191886 9800 -29916
6927 26907 -62479 102580 -223783 109074 -213421 -43193 -304724 -26703 -220462 142277
6916 1297 137876 235335 -42329 -263590 132034 374697 4194 -101741 26120 5720 -4964 -67093
6904 -67093 116628 -44474 82737 -61960 217241 -161506 -239915 105747 -570949 -25230 -193065
6893 -193065 -219457 -247879 -136891 -58612 123604 188440 31725 88569 -133250 31717 -163012
6881 80637 201770 64991 -479870 45505 24864 -382562 -276835 2584 147215 -49838 -114698
6870 -114698 -324412 244795 -114293 -138580 86995 119462 -173331 28493 54661 156895 -35371
6858 -136112 -256860 -20861 208245 284156 279935 61164 -30757 -58600 165152 -31220 64273
6846 11292 120817 171103 300720 -32221 -162697 120622 -3820 213711 -76876 236631 -196993
6834 -71603 13947 -138458 118076 140063 -284524 316276 -248430 244847 -37836 5659 -2633
6822 -7737 9203 -325976 207485 77971 -52289 -355318 53969 -147458 -81842 83302 64505
6811 64505 19560 -115333 -40884 305887 139872 81181 -131915 51404 264951 -381144 -137828
6799 -40180 -27386 -106383 58432 -88149 17868 63284 166666 75760 96367 153524 -102598
6787 -84575 -171470 311383 15937 -11663 75813 -91043 -21560 -336678 1253 307269 -105148
6775 125096 300292 2411 398293 -85392 -287533 -67247 -85073 -137805 -10999 324 -123910
6763 35772 136244 66348 -23682 12969 -144243 -159945 35791 116678 129562 -160841 -40037
6751 -18163 -106741 -71724 -156805 87256 -152292 -183493 -183174 -218372 -15670 -259455 -216257 310972
6738 12620 98950 154389 -44832 -337323 -66369 229836 -54302 -39250 -81705 -183537 39171
6726 56702 124536 79429 -233342 68303 -1392 205348 58675 -216093 98514 -55690 -121350
6715 -121350 185397 4084 -124152 153508 26131 -29023 155719 6375 -54353 -34542 -224098
6704 -224098 5049 -28199 -211069 -37363 71000 -45026 -160114 196149 35854 24636 -71425
6692 -47305 -185825 297391 154223 -150210 -21840 -162489 -101160 -43034 -173942 64545 -8783
6680 -97009 342179 255445 10882 380139 5951 -156913 -215667 132831 -154581 243427 -184754
6668 -29489 38090 -127962 13494 165049 -184736 -152761 20886 162530 -152349 26804 -154494
6656 -226634 -111666 -114746 186444 -150136 -54420 60560 167925 189503 -238476 138653 -324999
6644 -10846 83948 248097 -34206 -68231 30269 -167811 -4439 118609 -575010 -361984 -235921
6633 -235921 247208 10204 -246568 -7817 25135 -39707 38973 -513662 -470107 -34164 -30450
6622 -30450 -23666 -171849 -62156 74819 -177237 -5778 -34338 -277572 -64028 67786 345119
6611 345119 164661 45907 418263 197081 132653 -220038 -330761 -18848 8077 143028 464272
6600 464272 535588 126809 -204237 22453 -115643 57291 -116441 211606 28134 -5171 -198145
6589 -198145 5918 -220828 -14856 19098 -374282 -17012 9822 14709 3728 -130470 46079 -146419
6576 -61549 -149939 339967 153487 -158871 -75759 62644 -127588 77854 -344297 -73611 25929
6564 129970 -56477 38440 86300 249615 137441 160167 -214640 302123 -224277 341604
6553 18324 -136791 121017 26029 -39068 -209988 -89533 -32255 -43720 133003 -162565 -12729
6541 -208863 74156 -25358 192079 432030 207917 -256779 -118807 42934 -140840 202098
6530 212520 103810 120928 283159 -295752 357 -127884 -139142 -204353 244520 -44254 272573
6518 115007 258350 -14075 -44517 88139 60491 208868 -310513 -122980 -88106 -211098 92902
6506 -179952 -31526 -202128 148865 46231 16638 -147408 427874 -33129 -77008 75457 151738
6495 151738 124909 60227 -339016 -371252 59145 -230304 32450 -250380 -207194 133619 -22636
6483 13755 -137726 151088 -166909 135843 45391 -299523 -169470 -19827 -108424 -73239 48364
6471 -31027 49595 250279 -19736 -107934 -12115 219593 -153006 128596 89960 9998 -91747
6459 49714 -92608 -357386 -338775 163148 20691 -146564 -53163 175859 91545 -117121 -309620
6448 -309620 64338 34823 -680932 -198423 -351909 -48974 -119326 -6779 144528 -142391 -362993
6437 -362993 -85347 -74495 265783 161451 -99154 33192 37582 -75193 -185132 237977 -36238
6425 -79620 -162362 -206643 -353291 47490 -121021 153855 -112936 226766 22909 -161197 103515
6413 170385 4659 39073 270771 324856 -181047 -42276 202983 185803 69487 110737 502773
6402 502773 -138410 100122 -223353 292474 -155933 227550 -110235 240607 -74279 2187
6391 266264 68453 -429186 -510926 158913 -151547 -425906 -102382 -186948 -123002 -194024 219639
6379 -268464 3640 22726 -73927 138288 -283774 340182 198356 94473 124262 -115091 -254479
6368 -254479 256315 -39425 208952 126716 104193 -437153 102031 -258925 116532 112959 212232
6357 212232 118774 203782 278569 14113 -184149 -57288 -193182 42019 -246859 176511 -53140
6345 18501 -135017 -29512 -31395 205127 228956 190843 -163828 252671 -433016 81284 43822
6334 43822 -77408 56634 -56955 -42279 -168702 -143592 33624 26959 -235550 14489 -51505 -320915
6322 -320915 -85 -16250 200094 -175785 6667 -97693 230860 38188 49710 -59877 -98518 -69334
6310 -69334 32831 -151994 8628 128272 -201476 22666 -157797 -198145 29636 -13735 -35566
6299 -35566 -45477 30253 2951 -303394 -190420 427302 -186887 -123380 -150227 270365 -118825
6287 28501 366809 -11939 140977 87198 179697 -263430 266719 -165658 -79065 -153871 20638
6275 66748 58992 244309 -54222 -197268 182113 -127538 -166564 28773 -118855 54826 -193919
6263 318957 -66274 -8368 54055 -104003 -313020 39855 340 -239075 127275 77949 32994
6251 -127014 131104 -19475 -111576 100805 -59919 -302884 -127456 -146257 -460309 145762
6240 -202336 75741 173258 -14301 -128646 -27450 -205324 227134 -144369 -228483 90207 -27335
6228 59686 279643 -155990 -115695 44831 95968 -18788 57935 -51374 -279496 126051 844
6216 -98981 -137110 -269675 194970 -131915 -177071 -20320 148554 146369 -153450 -257809 -39161
6204 -240418 -140224 -155283 -200406 -192283 -162872 -184316 -65274 -3729 189510 -381808 -154503
6192 -6678 116748 216934 -133960 -390083 117085 -137263 158477 36282 -72442 139294
6181 -52108 -47040 -111771 -25567 -341238 -63507 -96299 -85934 -359473 102400 46415 -143849
6169 49135 -71329 -86490 -55490 83846 324606 4456 -119385 36653 46763 -189356 276280
6157 170404 41474 -284098 -198814 -108113 -134171 -113007 9577 -18519 182392 -11306 54650
6145 -319428 102832 28279 -366374 -192577 154233 -37132 -124955 -120787 58039 -144523 -42750
6133 186187 93685 -219576 149166 81131 15352 -55585 -84140 -192326 -934 64028 -148267
6121 93781 42362 -99366 -115238 64210 122147 -18896 71978 -45573 73263 -171234 -71018 -1136
6108 179756 264374 41896 -74332 -123102 121667 -176925 255389 149233 59065 -43616 288323
6096 264994 294769 -201401 -27934 -164215 -51195 -33848 10634 143738 66412 75118 -72575
6084 -139144 40128 -43536 55731 18807 -167537 191011 -225671 -6078 -14545 120867 -67965
6072 -542948 -229637 74853 -177478 308610 -144595 -103973 181046 108684 -120622 -162842
6062 -162842 194945 -252027 185250 128958 91442 -85449 -37453 203184 413399 -105220
6051 237510 -188785 -167276 230803 -270753 136407 -47841 -101311 273228 -23922 130790
6040 103579 85350 -55986 -146384 -4653 104344 199209 -69142 65344 -208005 -50490 89675
6028 184146 85683 18005 -15235 17979 14011 -85079 270213 46907 156823 52052 7572 365109
6016 365109 -275353 148386 -87686 84217 -6248 -117953 19075 26172 84825 243627 -124639
6004 -280104 -44627 -108633 9931 22636 -97542 -36588 -369036 -159366 283905 98995 -304011
5992 44098 -106922 113767 122825 78889 144247 -35858 71421 -132670 115913 201846 -84614
5980 181300 11144 -122004 -89991 230458 254638 28180 100829 -60956 -16667 -46856 -189657
5969 -189657 -301730 249239 51846 -64000 -286292 -201015 155280 -364110 -106100 -319971
5959 -319971 143896 265565 191010 -54472 94646 -212643 -228563 -152359 183142 -95075 -37174
5947 -137142 165596 6900 -80381 272758 -210324 4619 -60272 -343947 11178 -93936 -177509
5936 -177509 -264340 72108 -28757 55952 152948 -19769 -359750 -122517 -243872 -80917 -247296
5925 -247296 272898 45115 60426 164536 -46440 -137437 80179 -62649 73360 27045 187375
5914 187375 -77820 -96160 -167214 57079 21379 99664 -354876 108397 -41850 -48193 -105782
5903 -105782 -10901 6610 -74171 65035 50622 -277962 133340 39614 84967 85345 306120 29396
5890 -199028 129371 126478 121472 -118268 314351 299805 -90999 130751 -39520 350344 -97876
5878 -21712 144694 14396 -148823 218900 42012 -193341 212339 -113106 179168 52874
5867 -280218 16581 72171 -152849 -19602 -115601 70032 35637 485602 303351 -3053 6146
5855 396020 -35986 -42291 -284407 -99307 -88712 293007 -208647 -126825 -173315 -51697 134490
5843 349859 -27138 23415 207823 137663 -9249 -149332 -17670 -315613 -31183 -26531 -192149
5832 -192149 -48710 -118902 -24216 -100535 -20303 121461 52823 -205552 -176938 -229031 78531
5820 -135221 -55101 -73321 -32934 275967 130572 -11183 12888 101856 35408 209631 18336
5808 28340 -62556 -78888 -1480 19022 -76366 -101934 7623 14875 -62622 -31407 -192247 112398
5795 -243758 -272559 62306 108534 1806 -489227 133824 -291677 -121864 190800 185834 112247
5784 112247 130437 291663 -18970 11199 -71620 17102 217089 -91006 -191188 -21969 276283
5772 208665 144351 137971 131107 206419 197525 -58234 -145384 47770 172389 -4945 108945 -84827
5759 140274 -96315 -97672 -237823 781 -116975 268 12385 -2370 -156449 -482095 -262768 -12547
5746 37924 43085 251362 -33535 -63086 8772 -66810 219714 54844 -105864 57316 -137882
5734 -43213 302970 85179 -156260 -283378 -174817 149251 176258 -55378 54942 352539 178200
5723 178200 -155191 -32386 11861 6420 -17806 -216765 56640 -6694 -337179 -89918 -187333
5712 -187333 3009 101091 -369755 238565 -18914 -319361 -269470 13046 4289 38587 -168211
5700 316346 95664 -84017 357394 179426 35521 173462 150749 -24632 190737 66346 -182292
5688 -200268 -212160 175891 -99820 202718 124511 57011 119581 -131510 -237948 364946 36182
5676 150972 67261 83380 -191708 26980 124743 -63697 211524 52911 -2678 -6165 -128681
5665 -128681 -111182 -144050 355305 -2955 1920 -524545 16163 -102058 261095 95051 292320
5654 292320 290779 -263099 176156 -48185 337316 -121657 38273 -110481 -346451 -60815 39698
5642 -121666 59574 116370 165273 -444879 -117788 121208 -56369 -58776 -212713 11263 -157056
5630 -90839 -56311 26111 -17084 164018 -252873 306955 -124995 28123 335242 57199 -90802
5618 331502 178154 -261518 138613 -4737 84647 -132558 92327 -367046 -135813 -23071 105259
5606 104951 -47265 187469 48608 73763 -134808 322019 -232694 -78015 -13208 -349890 -56585
5594 207970 -160897 87808 454423 -19343 124328 -201582 -58026 116032 113126 -227935 -294806
5583 -294806 15843 -17798 -79701 202772 -231868 -284201 294092 149529 117490 -196899 303004
5571 302762 87638 -173029 501901 49962 63372 -122647 188150 -138405 43411 30158 124754
5560 124754 165852 -156801 11800 1301 -1316 -50990 326564 94606 266230 154080 25197
5548 26508 2658 149987 -178414 -267789 -81910 -582 -245470 92907 78306 -264236 44727 -73210
5535 -10887 -179810 304584 -151734 10543 126444 173082 -106662 -87438 110029 359249
5525 359249 107982 10336 200752 -230891 52150 -310626 -537263 -79096 79603 296790
5515 296790 -66972 -80882 -195041 58156 98378 -198508 -97118 -39733 -288157 172746 -69553
5503 -219427 -63964 -322115 -546736 23625 -165063 -155164 -242448 -205194 82807 73749 52947
5492 52947 -151957 131502 -145296 90241 172060 323847 -58361 76757 244049 129135 344255
5481 344255 -339347 -102133 -11825 103422 -6225 264098 -348374 65373 -221033 -29426 211771
5469 402740 2448 109786 -121015 -43101 -118954 64025 65851 -63636 422832 -225824 -8442
5457 -132230 155464 -126445 -275213 -17124 -23668 -50192 -127920 -161970 12717 165911 17109
5445 136063 -46299 -76754 -293895 3482 237746 -177852 -51550 172179 617029 302350 -160135
5433 -62587 156764 87166 -20799 9758 -26808 78337 210251 -50919 29752 90165 301999
5422 301999 -113817 70475 154215 9160 -33111 205841 138217 -58100 136257 274148 -98403
5410 -10698 296430 -128858 428538 126971 44240 12595 138343 -66121 49112 12754 132517
5399 132517 -90495 135519 -177642 -91968 -166805 -126232 -196923 -25388 -139030 149403 107053
5388 107053 434865 -125025 -178533 46925 -134031 -339529 26977 188222 185977 -439 41641
5376 -338441 -21486 44152 219665 -224829 -483893 178590 -282524 69661 -324156 -9169 -226653
5365 -226653 -95378 -4451 38431 41546 -106498 98784 61150 39142 -30999 34825 -64970 282345
5352 56665 -113113 -133765 -87244 -180369 -36052 -29546 148526 -99660 -134387 33789 89637 -353682
5339 43974 -59655 -15825 245181 152650 -432670 -247371 92189 -119444 397991 -118960 -120221
5328 -120221 -53229 219119 334330 -285120 -252417 134115 -56360 -373225 -357863 13086 320489
5317 320489 -39337 61037 80400 161820 101842 -306908 -63125 -77205 213030 135454 -151696
5305 -168221 -270232 254754 42528 -32608 162389 -141056 -52191 104769 -19507 -170541
5295 -170541 264629 536931 -505158 -187797 -216686 -421769 -53628 -138177 -57336 77070 -86902
5283 112137 145996 -161712 -356441 290343 159890 -75612 -49591 153991 93468 -314917
5272 -185477 213298 -280664 -168393 -381362 81725 247388 88432 -121043 -148300 -234769
5262 -234769 54941 -173734 42982 -3106 142683 -7621 -152579 219154 67372 -78864 70756
5250 -222103 -175275 -267748 -137983 364861 21819 -159548 -230743 -309031 11699 197782 -165046
5238 271054 -331327 499685 165445 -56071 -102791 22303 -95805 169776 -73595 -90049 -46602
5227 -46602 157200 127629 71002 468530 121036 120009 127516 -206038 -168377 44075 -112382
5215 -39690 175347 -126293 438026 135112 85070 211479 110878 52015 -158468 -88743
5205 -88743 330044 -42630 122763 -137066 -449025 -14755 -181180 16954 141280 212022 -112497
5193 102685 -61609 -219832 242779 -26444 10707 -295707 -90842 266532 -20964 30759 -37779
5181 220005 -37771 -150508 -14243 144094 -79536 33567 -95548 238905 -101033 141721 141620
5170 141620 244816 92660 -117481 -18689 -90785 -248646 36115 240363 -86144 133345 -16106
5158 -172352 -305790 -24941 -164674 125966 -192893 -42535 85310 97176 -223710 41239 261915
5147 261915 -88995 -82239 -97190 -158636 -4834 239330 27806 -368638 -77868 110932 -103289
5135 381050 -48074 93950 309329 -455069 -129873 117984 -46102 -102283 384602 -175755
5124 264834 135906 52784 98245 -27715 -63738 278871 159071 204609 -90018 -27210 -94352
5113 -94352 285358 147001 -289581 63561 -83326 240486 -258029 -270490 -226313 65749 324853
5102 324853 36933 230855 199995 -8955 -70682 156759 -172077 224980 18863 -298571 -203103
5091 -203103 -72419 275855 116249 -45140 19116 -510517 3914 -2469 -259525 205397 -28564
5079 -327894 103327 -74944 216026 -71623 262304 -52181 176378 -107427 -83886 -141781 135496
5067 240205 -79144 343896 -55283 226494 -127498 139230 -49168 162480 -232910 104641
5056 -30350 -38180 106510 -356357 -126609 -33290 132246 -71868 125701 -94528 187415 124367
5045 124367 36483 -254819 519083 -52589 130466 212360 575941 195407 -196844 252838
5034 251379 -95027 -6695 55309 -21012 164923 -98460 -110771 196338 158930 58501 -128284
5022 -72625 -108689 29273 145907 -57087 170819 33409 -94175 24533 -104715 -153768 65408
5010 69803 -149627 -49929 26135 46918 -177057 39657 -272744 -54959 -78199 -90983 77427
4998 46439 150756 44446 -330799 237248 -80306 5629 -207231 190963 52620 40188 -301567
4986 -7315 -227850 44329 31881 145403 300066 114522 254317 19423 -171164 -128728 -383933
4975 -383933 -188240 -96557 -62175 -18375 150616 -156892 -39032 -42967 -15601 -124834 312361
4963 -38536 190501 -109546 167985 -321078 116484 295975 -144485 -66949 134766 -204939
4952 -332717 -222868 -78751 -181408 -84809 27189 -78877 -71899 -249765 -339625 -225346 -34491
4940 -43190 106127 118197 28103 55265 -18473 260758 166035 78077 138817 -134003 -149756
4929 -149756 -37603 158564 -187104 -289567 254439 217138 -16970 13661 15592 458757 182624
4917 371722 83868 3059 -121823 92608 -9137 -10952 -241545 170097 55017 -322349 -195907
4906 -195907 -19062 -295550 -2612 -9169 104856 -157459 223268 213664 47107 257104 -2132
4894 258139 52312 -47066 235535 31381 204979 125422 660545 -96671 -187633 -88839 -118895
4883 -118895 -90657 49688 -9953 206192 -195082 -139888 90665 231313 -271587 -194162 157933
4871 77485 177688 -310395 -75269 -52012 198263 181813 -17724 -18577 -347582 -237327 -12937
4859 -188610 119376 -200826 49375 -70666 -108904 13547 70348 -252790 -168247 -99907 -22129
4847 296629 68708 -451607 248072 161681 -181414 445636 -133507 166768 86019 -106441
4836 195182 85622 3188 -148347 231113 -274937 -193282 11880 143755 24965 217926 149502
4825 149502 -176291 -101042 -6945 -316441 127442 42764 248226 -14731 118028 -192837 124522
4813 -4609 301938 -229989 94073 -291985 128923 10155 -37937 48280 270831 -113985 104289
4801 -228679 254787 -68472 55225 -224183 46997 281223 154160 -18896 82732 -155803 339283
4789 -58863 57017 23850 -7177 190646 -124196 -104778 -60965 -242351 254831 96386 35464
4777 -263785 6157 68738 191116 -58322 9178 -192708 -8114 110539 19588 -148693 -45944
4765 -197480 -61162 64558 -389337 -234689 77684 -149029 -219032 -12357 -101610 -16910 -20309
4754 -20309 -105703 -157212 171779 10673 -107698 4491 91689 -60458 347756 -95645 378410
4742 -85882 168196 104417 266485 -140899 -274994 85257 117128 247922 -34254 -140139 -200265
4731 -200265 -313955 149793 -155875 56405 34330 75203 -150215 227870 288284 -229762
4720 -169337 237393 162168 34947 274552 205592 96676 -38202 218523 -10660 144659 -73336
4708 -12083 47188 339728 233075 -37505 201055 16414 172280 -60548 163108 145212 260199
4697 260199 306050 149554 -21728 -239050 42039 203792 12017 -10014 -118881 271739 39554
4685 186386 53581 116175 286276 -3242 139097 -504391 -156941 -34969 -195112 -182234 -207894
4674 -207894 -194071 -99416 305754 149720 309913 -126451 15604 -167786 -173306 -39335 163170
4662 -395316 196455 -74648 -18414 87621 4858 120579 154163 -40553 -148142 107300 50550
4650 103864 -23260 -133631 178320 -143576 59901 -40183 -17503 -135939 -113467 189048 113894
4639 113894 -7646 -144692 19941 74354 -12131 -22932 191254 -28832 -28216 -55300 16892 -80917
4626 -142791 59933 108359 103360 224900 49421 -30275 74995 -346914 391912 272341 -37 104756
4613 91045 292703 -128716 -62829 117615 47373 -246054 -66628 10702 -106803 125226 -108611
4601 -16528 -182103 187065 -13323 -120649 174276 -29402 11408 66249 23604 219279 -230611
4589 314429 -5066 273707 -440812 151950 -266803 -49078 -8260 37817 38967 -7369 262031
4577 -234956 -54582 211392 -8733 -49698 -181549 -41871 109425 -73403 236228 -19859 -76004
4566 -76004 156574 35576 276467 82079 -72904 -189027 158415 -276055 -74122 -197463 -188422
4555 -188422 101235 23538 -152017 13089 251087 -293038 323197 -80251 -266189 51145
4544 -10533 195603 -218692 -104864 -109091 74890 -5516 30713 43883 -217106 129384 -27690
4532 178068 185743 -48443 172221 62378 354353 39582 109436 33471 187116 26665 -5305
4520 27931 134475 70419 52592 75064 -185951 209772 -185976 10569 -220473 -83806 -504097
4509 -504097 25278 91196 -144115 -260700 415075 389280 -337494 -205671 -50888 -52609 9564
$$ [...]
##END NTUPLES=NMR SPECTRUM
##END=
