
##TITLE=UV1284_M2_1207-1380_5_7534271_FqrwcXI66w
##JCAMPDX= 6.0         $$ Bruker NMR JCAMP-DX V2.0
##DATA TYPE= NMR SPECTRUM
##DATA CLASS= NTUPLES
##ORIGIN= BRUKER
##OWNER= Administrator
$$ 1.72 TOPSPIN		Version 2.1
$$ 2013-02-22 03:28:07.526 -0500  Administrator@X
$$ Compression mode = diff/dup
##.OBSERVE FREQUENCY= 400.02188249412
##.OBSERVE NUCLEUS= ^1H
##.ACQUISITION MODE= SIMULTANEOUS (DQD)
##.ACQUISITION SCHEME= undefined
##.AVERAGES= 64
##.DIGITISER RES= 22
##SPECTROMETER/DATA SYSTEM= spect
##.PULSE SEQUENCE= noesygpps1d.comp
##.SOLVENT NAME= COFFEE_meoh
##.SHIFT REFERENCE= INTERNAL, COFFEE_meoh, 1, 14.96138
##AUDIT TRAIL= $$ (NUMBER, WHEN, WHO, WHERE, PROCESS, VERSION, WHAT)
$$ ##TITLE= Audit trail, TOPSPIN		Version 2.1
$$ ##JCAMPDX= 5.01
$$ ##ORIGIN= Bruker BioSpin GmbH
$$ ##OWNER= Administrator
$$ $$ E:\/data/COFFEE/nmr/UV1284_M2_1207-1380_5_7534271_FqrwcXI66w/12/pdata/1/auditp.txt
$$ ##AUDIT TRAIL=  $$ (NUMBER, WHEN, WHO, WHERE, PROCESS, VERSION, WHAT)
(   1,<2013-02-22 03:28:01.541 -0500>,<Administrator>,<X>,<go>,<TOPSPIN 2.1>,
      <created by zg
	started at 2013-02-22 03:16:30.788 -0500,
	POWCHK enabled, PULCHK disabled,
       configuration hash MD5:
       86 BA 57 50 F2 9D 5C 9B 26 00 A9 28 5F 66 2E 89
       data hash MD5: 64K
       17 9E BE 70 C2 58 BC 84 66 85 EB 6A 5A C3 F3 5D>)
(   2,<2013-02-22 03:28:04.651 -0500>,<Administrator>,<X>,<proc1d>,<TOPSPIN 2.1>,
      <Start of raw data processing
       efp LB = 0.3 FT_mod = 6 PKNL = 1 PHC0 = 0 PHC1 = 0 SI = 128K 
       data hash MD5: 128K
       4A 94 EC 94 EE FD 46 38 31 01 09 1F E2 F1 E5 47>)
(   3,<2013-02-22 03:28:05.745 -0500>,<Administrator>,<X>,<proc1d>,<TOPSPIN 2.1>,
      <pk PHC0 = 249.7632 PHC1 = 0 
       data hash MD5: 128K
       BE 90 2E 2A F1 A3 58 F8 81 2B 79 12 46 13 37 54>)
(   4,<2013-02-22 03:28:06.510 -0500>,<Administrator>,<X>,<proc1d>,<TOPSPIN 2.1>,
      <abs ABSG = 1 
       data hash MD5: 128K
       BF A9 C8 08 71 6E A3 92 78 36 81 0F AA 9F E5 BE>)
(   5,<2013-02-22 03:28:06.682 -0500>,<Administrator>,<X>,<proc1d>,<TOPSPIN 2.1>,
      <abs ABSG = 2 
       data hash MD5: 128K
       BB 46 D1 E6 5F DD 56 77 FD E2 73 6C E7 E3 77 92>)
(   6,<2013-02-22 03:28:06.838 -0500>,<Administrator>,<X>,<proc1d>,<TOPSPIN 2.1>,
      <abs ABSG = 3 
       data hash MD5: 128K
       D5 FF 18 B1 44 E1 6C B5 18 4C E0 AC D8 F9 0A 0D>)
(   7,<2013-02-22 03:28:07.010 -0500>,<Administrator>,<X>,<proc1d>,<TOPSPIN 2.1>,
      <abs ABSG = 4 
       data hash MD5: 128K
       CD 68 D4 5A 4F D0 94 43 3D EB 85 4C 5D 2A 5D CC>)
(   8,<2013-02-22 03:28:07.213 -0500>,<Administrator>,<X>,<proc1d>,<TOPSPIN 2.1>,
      <abs ABSG = 5 
       data hash MD5: 128K
       8F D7 66 A0 4D 54 E6 CC A0 21 65 D7 8F 6C BF 1F>)
$$ ##END=
$$ 
$$ $$ hash MD5
$$ $$ A8 AC 72 6B 98 80 4F 7F 8E D7 E9 C4 09 A2 8E 5A
##$RELAX= 
##$RELAX= 
##$RELAX= 
##$RELAX= 
##$RELAX= 
##$RELAX= 
##$RELAX= 
##$RELAX= 
$$ Bruker specific parameters
$$ --------------------------
##$DU= <E:\>
##$EXPNO= 12
$$ [...]
150 150 150 150 150 150 150 150
##$TP07= 0
##$TPNAME0= <>
##$TPNAME1= <>
##$TPNAME2= <>
##$TPNAME3= <>
##$TPNAME4= <>
##$TPNAME5= <>
##$TPNAME6= <>
##$TPNAME7= <>
##$TPOAL= (0..7)
0.5 0.5 0.5 0.5 0.5 0.5 0.5 0.5
##$TPOFFS= (0..7)
0 0 0 0 0 0 0 0
##$TUNHIN= 0
##$TUNHOUT= 0
##$TUNXOUT= 0
##$USERA1= <user>
##$USERA2= <user>
##$USERA3= <user>
##$USERA4= <user>
##$USERA5= <user>
##$V9= 5
##$VALIST= <valist>
##$VCLIST= <CCCCCCCCCCCCCCC>
##$VD= 0
##$VDLIST= <DDDDDDDDDDDDDDD>
##$VPLIST= <PPPPPPPPPPPPPPP>
##$VTLIST= <TTTTTTTTTTTTTTT>
##$WBST= 1024
##$WBSW= 4
##$XGAIN= (0..3)
0 0 0 0
##$XL= 0
##$YL= 0
##$YMAX_a= 6304120
##$YMIN_a= -11757545
##$ZGOPTNS= <>
##$ZL1= 120
##$ZL2= 120
##$ZL3= 120
##$ZL4= 120
##$ABSF1= 14.96138
##$ABSF2= -5.596802
##$ABSG= 5
##$ABSL= 3
##$ALPHA= 0
##$AQORDER= 0
##$ASSFAC= 0
##$ASSFACI= 0
##$ASSFACX= 0
##$ASSWID= 0
##$AUNMP= <proc_prof1d_extract.lims>
##$AXLEFT= 0
##$AXNAME= <>
##$AXNUC= <1H>
##$AXRIGHT= 0
##$AXTYPE= 0
##$AXUNIT= <>
##$AZFE= 0.1
##$AZFW= 0.1
##$BCFW= 0
##$BC_mod= 0
##$BYTORDP= 0
##$COROFFS= 0
##$CY= 15
##$DATMOD= 1
##$DC= 0
##$DFILT= <>
##$DTYPP= 0
##$F1P= 0
##$F2P= 0
##$FCOR= 0.5
##$FTSIZE= 131072
##$FT_mod= 6
##$GAMMA= 0
##$GB= 0
##$INTBC= 1
##$INTSCL= 1
##$ISEN= 128
##$LB= 0.3
##$LEV0= 0
##$LPBIN= 0
##$MAXI= 10000
##$MC2= 0
##$MEAN= 0
##$ME_mod= 0
##$MI= 0
##$NCOEF= 0
##$NC_proc= -2
##$NLEV= 6
##$NOISF1= 0
##$NOISF2= 0
##$NSP= 0
##$NTH_PI= 0
##$NZP= 0
##$OFFSET= 14.96138
##$PC= 1
##$PHC0= 249.7632
##$PHC1= 0
##$PH_mod= 1
##$PKNL= yes
##$PPARMOD= 0
##$PPDIAG= 0
##$PPIPTYP= 0
##$PPMPNUM= 2147483647
##$PPRESOL= 1
##$PSCAL= 4
##$PSIGN= 0
##$PYNMP= <proc.py>
##$REVERSE= no
##$SF= 400.020009483311
##$SI= 131072
##$SIGF1= 0
##$SIGF2= 0
##$SINO= 400
##$SIOLD= 131072
##$SPECTYP= <>
##$SREGLST= <1H.CDCl3>
##$SSB= 0
##$STSI= 131072
##$STSR= 0
##$SW_p= 8223.68421052631
##$SYMM= 0
##$S_DEV= 0
##$TDeff= 65536
##$TDoff= 0
##$TI= <>
##$TILT= no
##$TM1= 0
##$TM2= 0
##$TOPLEV= 0
##$USERP1= <user>
##$USERP2= <user>
##$USERP3= <user>
##$USERP4= <user>
##$USERP5= <user>
##$WDW= 1
##$XDIM= 131072
##$YMAX_p= 442893102
##$YMIN_p= -12413
##$CURPLOT= <Network HP LaserJet P1505>
##$CURPRIN= <$Network HP LaserJet P1505>
##$DFORMAT= <normdp>
##$LAYOUT= <+/1D_H.xwp>
##$LFORMAT= <normlp>
##$PFORMAT= <normpl>
##$SURQMSG= 1
$$ End of Bruker specific parameters
$$ ---------------------------------
##NTUPLES= NMR SPECTRUM
##VAR_NAME=  FREQUENCY,     SPECTRUM/REAL,   SPECTRUM/IMAG
##SYMBOL=    X,             R,               I
##VAR_TYPE=  INDEPENDENT,   DEPENDENT,       DEPENDENT
##VAR_FORM=  AFFN,          ASDF,            ASDF
##VAR_DIM=   131072,        131072,          131072
##UNITS=     HZ,            ARBITRARY UNITS, ARBITRARY UNITS
##FACTOR=    0.0627417313425164, 1,          1
##FIRST=     8223.62146879497, -254,         -64184
##LAST=      0,             1999,            -64359
##MIN=       0,             -12413,          0
##MAX=       8223.62146879497, 442893102,    0
$$ Real data points
##PAGE= N=1
##DATA TABLE= (X++(R..R)), XYDATA
$$ [...]
63852A069710J1036Q340M870O66l670p812j1878j5912j9681k3012k5942k8383
63840I58332k9942l0432l0394l0696l1604l2537l2834l2432l1633l0611k9416
63829F15801k8183k6884k5182k2968k0854j9430j8191j6085j3230j1136j0767
63818D02891j1158j0740r381q263q057q129p586o258m558l003k054j951k392k723
63804C16638k554j982j289p67p69j379k114k363k222k321k801l131l060l060l436
63789B83390l693l322k712k594k938l061k700k291k169k106j846j554j481j485
63775B49438j263q27m39j65J82O26Q41N78J34Q0N41R71Q40K77k27n00p26r32r01
63756B48528o83o11o82m33K75Q29O79J88J51O88J270J656K117K651K706K039J349
$$ plain form
63852 1069710 1080746 1089086 1093956 1094622 1090952 1083140 1071262 1055350 1035669 1012657 986715 958332
63840 958332 928390 897958 867564 836868 805264 772727 739893 707461 675828 645217 615801
63829 615801 587618 560734 535552 512584 491730 472300 454109 438024 424794 413658 402891
63818 402891 391733 380993 371612 363349 355292 347163 339577 333319 328761 325758 323704 321753 319361 316638
63804 316638 314084 312102 310813 310046 309277 307898 305784 303421 301199 298878 296077 292946 289886 286826 283390
63789 283390 279697 276375 273663 271069 268131 265070 262370 260079 257910 255804 253958 252404 250923 249438
63775 249438 248175 247348 246909 246744 246926 247552 248393 248971 249105 249185 249726 250697 251537 251814 251587 251087 250361 249429 248528
63756 248528 247845 247234 246552 246119 246394 247223 247902 248090 248241 248929 250199 251855 253972 256623 259329 261368 262717
63739B62717J497K447L380L699L445K774J648K47p31o60K90J351K078K664L287
63724B90133L641L552L592M462N884O809O775O379O130N675M662L620L151K705
63710C57170J258r98k670l011k767k860l169l136k799k513k153j358k86N25R10
63695C32143J113J255J295J419J951K832L587L771L246K165J033N24Q33J370J449
63680C59986J060M92l28j452k181j715m68K23r5m03J71J083J313Q80O47J053J738
63663C62004K233K377K129J444M07p51j754k385k615k747l156l830m427m805n042
63648C39082m976m311l311k712k639k369j495n50K5O85J810K755K839K651L216
63633C30700M300M778M400M011M046M061L918M159M877N288N025M926N942P853
$$ plain form
63739 262717 264214 266661 270041 273740 277185 279959 281607 281854 281123 280463 280753 282104 284182 286846 290133
63724 290133 293774 297326 300918 305380 311264 318073 324848 331227 337357 343032 347694 351314 354465 357170
63710 357170 358428 357430 354760 351749 348982 346122 342953 339817 337018 334505 332352 330994 330708 331233 332143
63695 332143 333256 334511 335806 337225 339176 342008 345595 349366 352612 354777 355810 356334 357167 358537 359986
63680 359986 361046 361538 361210 359758 357577 355862 355394 355617 355522 355119 355290 356373 357686 358566 359213 360266 362004
63663 362004 364237 366614 368743 370187 370594 369843 368089 365704 363089 360342 357186 353356 348929 344124 339082
63648 339082 334106 329795 326484 323772 321133 318764 317269 316719 316744 317429 319239 321994 324833 327484 330700
63633 330700 335000 339778 344178 348189 352235 356296 360214 364373 369250 374538 379563 384489 390431 398284
63619C98284R662J0752J1265J1779J3002J5280J8051K0241K1456K2363K3664K5292
63607F01091K6905K8497L0078L1345L2092L2399L1965K9826K5342J9080J2175
63596I00795N319j108o404r858j1484j1915j1649j0947j0230j0067j0820j2597
63584G99035j5368j8677k1618k3504k4452k4927k4973k4266k2638k0159j7002
63573E61451j3626j0761q694o869m658k228r9J699L399M726N216N174N453O229
63559E46412O780O621O268O617P990R958J1818J3148J4249J5946J8710K2113K5461
63546G12091K8699L2250L6308M0718M5095M8203M7669M1542L0395J7135M583n938
63534A078750j3840j8448j9649j8437j6100j3311j0468q336p714q828j1459j5311
$$ plain form
63619 398284 407946 418698 429963 441742 454744 470024 488075 508316 529772 552135 575799 601091
63607 601091 627996 656493 686571 717916 750008 782407 814372 844198 869540 888620 900795
63596 900795 906114 905006 898602 888744 877260 865345 853696 842749 832519 822452 811632 799035
63584 799035 783667 764990 743372 719868 695416 670489 645516 621250 598612 578453 561451
63573 561451 547825 537064 528370 521501 516843 514615 514516 516215 519614 524340 529556 534730 540183 546412
63559 546412 553192 559813 566081 572698 580688 590646 602464 615612 629861 645807 664517 686630 712091
63546 712091 740790 773040 809348 850066 895161 943364 991033 1032575 1062970 1080105 1084688 1078750
63534 1078750 1064910 1046462 1026813 1008376 992276 978965 968497 960161 952447 943619 932160 916849
63522I16849j9871k4347k8228l1568l4393l6170l6338l5010l2768l0055k7113
63511E80988k4219k1610j9359j7544j6153j4711j2548r828p715o979o968o565
63499D16789n665m989m805m700m391l946l264k190j120p35r70r96m46J24K35K75
63483C79206Q08J649K178K232K160K275K713L602M869N921O065N305M312L528
63469D26823K690J434m8j268k159l075m158n022n234m798m044l290k763k626k764
63454C89698k699k012p97N24J770K991M045M604M704M868N452O268P052P965R267
63439D43700J0734J1895J2756J3899J5781J8299K1220K4677K8923L3448L6590
63428F71922L6393L2153K5057J7232J0284M900J502N21J912M993R127J4169J9919
$$ plain form
63522 916849 896978 872631 844403 812835 778442 742272 705934 670924 638156 608101 580988
63511 580988 556769 535159 515800 498256 482103 467392 454844 445016 437301 430322 423354 416789
63499 416789 411124 406135 401330 396630 392239 388293 385029 382839 381719 380984 380014 379018 378572 378696 378931 379206
63483 379206 380014 381663 383841 386073 388233 390508 393221 396823 401692 407613 413678 418983 423295 426823
63469 426823 429513 430947 430899 429631 427472 424397 420239 415217 409983 405185 401141 397851 395088 392462 389698
63454 389698 386999 384987 384190 384714 386484 389475 393520 398124 402828 407696 413148 419416 426468 434433 443700
63439 443700 454434 466329 479085 492984 508765 527064 548284 572961 601884 635332 671922
63428 671922 708315 740468 765525 782757 793041 797941 799443 799964 801876 806869 815996 830165 850084
63415H50084K5581L0291L3931L6779L8553L8315L5354K9777K2202J3443M591l144
63403A155757r057j3252j6113j7650j7645j6355j4824j4325j5470j7904k0937
63392I82225k4326k8171l2066l4880l5811l5301l4374l3246l1206k7977k4417
63381F40450k1507j9157j6576j3569j0761q535o406l812j082R11J992L009M733
63368E49690O952Q994J0761J2625J4524J5930J6838J8018J9913K1989K3724K5622
63356G45580K8507L2134L5375L7601L9072L9951L9745L7928L4389K9055K1775
63345A121112J3018M138l544r529j3746j5969j6242j5453j4802j4763j5089j5731
63333A003400j7174j9810k3385k7213l0554l2743l3339l2379l0366k7761k4629
$$ plain form
63415 850084 875665 905956 939887 976666 1015219 1053534 1088888 1118665 1140867 1154310 1158901 1155757
63403 1155757 1146700 1133448 1117335 1099685 1082040 1065685 1050861 1036536 1021066 1003162 982225
63392 982225 957899 929728 897662 862782 826971 791670 757296 724050 692844 664867 640450
63381 640450 618943 599786 583210 569641 558880 550345 543939 540127 539045 539956 541948 544957 549690
63368 549690 556642 565636 576397 589022 603546 619476 636314 654332 674245 696234 719958 745580
63356 745580 774087 806221 841596 879197 918269 958220 997965 1035893 1070282 1099337 1121112
63345 1121112 1134130 1138268 1134724 1125195 1111449 1095480 1079238 1063785 1048983 1034220 1019131 1003400
63333 1003400 986226 966416 943031 915818 885264 852521 819182 786803 756437 728676 704047
63322G04047k0810j6414j1960q035m822k086J96J239k15m683j1133j7544k2228
63309E85552k4563k4733k3149k0272j6651j2978r967q106p401p368p324o728n411
63296D10901l669k201j628j932k523k934l199l458l559l387l228l385l655l652
63282C68491l427l282l071k331j152k90k63q02j364j675j535p02N77J414J240
63267C51828O11N32J169J765J779J520J535J886K239K358K264K115K093K346K831
63252C78871L291L485L455L511L904M562N140N430N678O284P254Q180Q870R638
63238D57553J0772J2055J3179J4350J5967J7870J9477K0697K2076K3841K5381
63227F53218K6047K6065K6176K6627K6971K6750K5995K5064K4348K4152K4578
$$ plain form
63322 704047 683237 666823 654863 646828 642006 639920 640116 641355 641140 636457 625324 607780 585552
63309 585552 560989 536256 513107 492835 476184 463206 453239 445133 437732 430364 423040 416312 410901
63296 410901 407232 405031 403403 401471 398948 396014 392815 389357 385798 382411 379183 375798 372143 368491
63282 368491 365064 361782 358711 356380 355228 354938 354675 353873 352509 350834 349299 348597 349174 350588 351828
63267 351828 352439 352971 354140 355905 357684 359204 360739 362625 364864 367222 369486 371601 373694 376040 378871
63252 378871 382162 385647 389102 392613 396517 401079 406219 411649 417327 423611 430865 439045 447915 457553
63238 457553 468325 480380 493559 507909 523876 541746 561223 581920 603996 627837 653218
63227 653218 679265 705330 731506 758133 785104 811854 837849 862913 887261 911413 935991
63216I35991K5364K5980K6048K5657K5230K5055K4863K3893K1491J7625J2712
63205A189909O987L32p122j4564k0996k6020k9974l3280l5845l7036l6192l3347
63193I22852k9539k6116k3482k0809j7236j2985q820m821m53M225Q315J1301J3774
63180H16206J6536J9505K2079K4090K5716K6730K6618K5520K4402K3995K4063
63169A075460K3979K3629K3305K2947K1988K0036J7292J4124J0452N843J95o004
63157A253246j2168j8234k4481l0833l6529m0628m2772m3396m3187m2449m1018
63146H77551l8728l5837l2821k9780k6387k2604j9163j6905j5708j4542j2654
63135F12422j0314q199o542n168m024l139k298j244j70M89P08R40J476K210L084
$$ plain form
63216 935991 961355 987335 1013383 1039040 1064270 1089325 1114188 1138081 1159572 1177197 1189909
63205 1189909 1196896 1197228 1190106 1175542 1154546 1128526 1098552 1065272 1029427 992391 956199 922852
63193 922852 893313 867197 843715 822906 805670 792685 783865 779044 778591 782816 791131 802432 816206
63180 816206 832742 852247 874326 898416 924132 950862 977480 1003000 1027402 1051397 1075460
63169 1075460 1099439 1123068 1146373 1169320 1191308 1211344 1228636 1242760 1253212 1259055 1259250 1253246
63157 1253246 1241078 1222844 1198363 1167530 1131001 1090373 1047601 1004205 961018 918569 877551
63146 877551 838823 802986 770165 740385 713998 691394 672231 655326 639618 625076 612422
63135 612422 602108 593909 587367 582199 578175 575036 572738 571494 571324 571813 572521 573461 574937 577147 580231
63120E80231M284N724O778O858O080N090M460M435M873N145M457K788J255J003
63106F43461J807K341J803O82j99p00j140j593j929k158k295k091j387o10l98
63091F35594p74j120j011o05j98K04O38Q23M78j70m32J73J396K439K736K520K554
63074F45245L245M210M847N095N355N824O387P074Q120R456J0672J1687J3038
63061G40255J5055J7207J8727J9787K1473K4521K8468L2188L5068L7508M0365
63050A030622M3997M7892N1256N3943N6581N9676O2779O4813O5196O4429O3566
63039A664750O3211O3025O2205O0380N8060N6129N5022N4577N4594N4932N4970
63028B301855N3415M9239M2645L4707K6105J6463N008q401k2917l7200n0183o1433
$$ plain form
63120 580231 584515 590239 597017 603875 609955 615045 619505 623940 628813 633958 638415 641203 642458 643461
63106 643461 645268 647609 649412 650094 649895 649195 648055 646462 644533 642375 640080 637989 636602 635992 635594
63091 635594 634820 633700 632689 632084 631886 632090 632728 633551 634029 633859 633427 633600 634996 637435 640171 642691 645245
63074 645245 648490 652700 657547 662642 667997 673821 680208 687282 695402 704858 715530 727217 740255
63061 740255 755310 772517 791244 811031 832504 857025 885493 917681 952749 990257 1030622
63050 1030622 1074619 1122511 1173767 1227710 1284291 1343967 1406746 1471559 1536755 1601184 1664750
63039 1664750 1727961 1790986 1853191 1913571 1971631 2027760 2082782 2137359 2191953 2246885 2301855
63028 2301855 2355270 2404509 2447154 2481861 2507966 2524429 2529437 2521036 2498119 2460919 2410736 2349303
63016B349303p0816p7975q2449q4218q3689q1055p6178o9295o1359n3183m4727
63005A564359l5728k6630j8134j0134j851O923J5425K2757K8595L3067L6519L9483
62993A654651M2311M4762M6395M7354M8168M8814M8760M8047M7450M7220M6381
62982B170313M3845L9552L4006K7240J8975R435p70j1484k3084l5632m8310n9795
62970B164291o8989p5522p9759q2363q3711q3798q2604q0223p6647p1818o6135
62959A312722o0403n5111n0155m5461m1389l8116l5219l2360k9980k8663k8096
62948H67769k7283k5698k3700k1894k0589j9762j9124j8262j7066j5886j4914
62937F43591j3704j1826r784q557q285q119p428o492n762n136m356l632l376l490
$$ plain form
63016 2349303 2278487 2200512 2118063 2033845 1950156 1869101 1792923 1723628 1662269 1609086 1564359
63005 1564359 1528631 1502001 1483867 1473733 1471882 1478805 1494230 1516987 1545582 1578649 1615168 1654651
62993 1654651 1696962 1741724 1788119 1835473 1883641 1932455 1981215 2029262 2076712 2123932 2170313
62982 2170313 2214158 2253710 2287716 2314956 2333931 2343366 2342596 2331112 2308028 2272396 2224086 2164291
62970 2164291 2095302 2019780 1940021 1857658 1773947 1690149 1607545 1527322 1450675 1378857 1312722
62959 1312722 1252319 1197208 1147053 1101592 1060203 1022087 986868 954508 924528 895865 867769
62948 867769 840486 814788 791088 769194 748605 728843 709719 691457 674391 658505 643591
62937 643591 629887 618061 608277 599720 591435 583316 575888 569396 563634 558498 554142 550510 547134 543644
62923E43644l409k809j991j542j776k445k963k937k489k028j800j781j948k417
62909E11309l179l905m194l972l588l412l429l296k891k540k516k470j866q71
62895D69180l00m30n43m6N54M05l39p17l86l0k76q57j109q53m00k5K67O03J055
62876D65753J540J805J656J196P39M54K62O7q0j10j53n48j559k928l771l310j816
62859D59197m83j51m54n03k9N00N99K07l09l41M91J669K016J137J24K30J199J685
62841D66784J052j19j141j817j971j360l40K11m4n59q34r08p43RJ189J914J725
62824D63048J280J347J720J810J749K097K769L129L046L080L567M121M286M215
62810E01264M450N123N696N528M653L847L828M544N466O347P341Q403R161R446
$$ plain form
62923 543644 540235 537426 535435 533893 532117 529672 526709 523772 521283 519255 517455 515674 513726 511309
62909 511309 508130 504225 500031 496059 492471 489059 485630 482334 479443 476903 474387 471917 470051 469180
62895 469180 468880 468450 467907 467861 468415 468820 468481 467764 467378 467348 467072 466215 465106 464253 463853 463828 464095 464698 465753
62876 465753 467293 469098 470754 471950 472689 473143 473405 473472 473392 473282 473129 472581 471022 468094 464323 461013 459197
62859 459197 458714 458563 458109 457606 457577 458077 458676 458883 458574 458233 458724 460393 462409 463546 463670 463900 465099 466784
62841 466784 467836 467717 466576 464759 462788 461428 461088 461299 461255 460696 459862 458954 458211 458220 459409 461323 463048
62824 463048 464328 465675 467395 469205 470954 473051 475820 478949 481995 485075 488642 492763 497049 501264
62810 501264 505714 510837 516533 522061 526714 530561 534389 538933 544399 550746 558087 566490 575651 585097
62796E85097R532R730J0175J1035J2421J3974J5108J5929J7305J9759K2849K6038
62784G68952K9505L3637L8236M2922M7903N3607N9813O5829P1415P6923Q2578
62773A371320Q8127R3185R7437J00460J01685J00733R7449R1676Q3205P1994N8288
62762B355559M2529K5298P217j1184k9385m6564o1727p4261q4131r1424r6074
62751A935853r8217r8394r7043r4263r0312q5875q1359p6415p0662o4535n8715
62740A020063n3192m7551m1958l7053l2967k9199k5533k2323j9781j7619j5554
62729F77333j3616j1813j0029q437p436o923o118m510k554j098l43K77J356K975
62715F09064M835O653Q352J0020J1730J3461J5168J6876J8666K0693K3198K6373
$$ plain form
62796 585097 594629 604359 614534 625569 637990 651964 667072 683001 700306 720065 742914 768952
62784 768952 798457 832094 870330 913252 961155 1014762 1074575 1140404 1211819 1288742 1371320
62773 1371320 1459447 1552632 1650069 1750529 1852214 1952947 2050396 2142072 2225277 2297271 2355559
62762 2355559 2398088 2423386 2430603 2419419 2390034 2343470 2281743 2207482 2123351 2031927 1935853
62751 1935853 1837636 1739242 1642199 1547936 1457624 1371749 1290390 1213975 1143313 1078778 1020063
62740 1020063 966871 919320 877362 840309 807342 778143 752610 730287 710506 692887 677333
62729 677333 663717 651904 641875 633438 626002 619079 612961 608451 605897 604799 604456 604733 606089 609064
62715 609064 613899 620552 628904 638924 650654 664115 679283 696159 714825 735518 758716 785089
62703G85089L0130L4223L8647M3637M9049N4189N8571O2585O7055P2340P8180
62692A373695Q4148Q9735R4250R7105R8112R7124R3638Q7215P8015O6279N1663
62681B310979L3939J4242n329k3528m0572n6684p0987q2371r0693r6442r9683
62670A792871j00117r8013r4384r0188q5769q0986p5615o9523o2819n5969m9658
62659I29830m4460m0462l7192l3960l0432k6874k3702k0969j8533j6538j5251
62648F21457j4444j3503j2257j1250j0887j0751j0053q544o624m815l408k493
62636E12428j996j703j375r08l57P8R3m49j247j844k201k743l662m562m917m635
62620D80000l933k945j745n52M76J497K704L849M380M181L888M224N133N818N714
$$ plain form
62703 785089 815219 849442 888089 931726 980775 1034964 1093535 1156120 1223175 1295515 1373695
62692 1373695 1457843 1547578 1641828 1738933 1837045 1934169 2027807 2115022 2193037 2259316 2310979
62681 2310979 2344918 2359160 2353831 2330303 2289731 2233047 2162060 2079689 1988996 1892554 1792871
62670 1792871 1692754 1594741 1500357 1410169 1324400 1243414 1167799 1098276 1035457 979488 929830
62659 929830 885370 844908 807716 773756 743324 716450 692748 671779 653246 636708 621457
62648 621457 607013 593510 581253 570003 559116 548365 538312 529768 523144 518329 514921 512428
62636 512428 510432 508729 507354 506446 506089 506167 506260 505811 504564 502720 500519 497776 494114 489552 484635 480000
62620 480000 476067 473122 471377 470825 471301 472798 475502 479351 483731 487912 491800 496024 501157 506975 512689
62605E12689N163M928N273N975P105R178J2192J5212J7401J9061K1112K3919K7368
62592F86576L1574L6511M1132M4090M5515M6939M9084N0742N0442M8213M4869
62581A175687M0373L3988K5607J5945N652m792j4553k2773k9490l5337m0323m3737
62569A106247m5417m6204m6677m6244m4074m0521l6920l4161l1982k9652k6867
62558F77528k3882k1149j8959j7270j5718j3900j1800r811q230o856n415m198
62546E20340l819m145m026k640p30J67l71j235j326p00J2N62R31R22N26L08P25
62529E05501J416J774J938K593L965N726P682R894J2159J4164J6152J8746K1906
62516F23616K4785K6928K8936L1633L5078L8804M2608M6599N0750N4776N8252
$$ plain form
62605 512689 517852 522780 528053 534028 541133 550311 562503 577715 595116 614177 635289 659208 686576
62592 686576 718150 754661 795793 839883 885398 932337 981421 1032163 1082605 1130818 1175687
62581 1175687 1216060 1250048 1275655 1291600 1297252 1292460 1277907 1255134 1225644 1190307 1149984 1106247
62569 1106247 1060830 1014626 967949 921705 877631 837110 800190 766029 734047 704395 677528
62558 677528 653646 632497 613538 596268 580550 566650 554850 545039 536809 529953 524538 520340
62546 520340 516521 512376 508350 505710 504980 505147 504776 503541 502215 501515 501527 502089 503020 503942 504468 504776 505501
62529 505501 506917 508691 510629 513222 517187 522913 530595 540489 552648 566812 582964 601710 623616
62516 623616 648401 675329 704265 735898 770976 809780 852388 898987 949737 1004513 1062765
62505A062765O0621O1333O0309N8015N4722M9987M3221L4629K5133J5502O057
62494A532294k757r943j4373j5596j4145j1145p570l663R78O694J3147J9519K5169
62481A518609K9983L4103L7497L9663L9486L5516K6992J5020K513p730j5340k2654
62469A733658l2417m5088n8357o9197p6141p9675q0938q0568p8696p5479p1204
62458I85898o6028n9960n3222m6391m0103l4598k9590k4632j9683j5333j2295
62447E84063j0594r376p737n672l953l047k489j507mJ422K314K811L207L419L187
62432E56044K597K073J785J334J83j675l609m984n766o409p183p819p925p553
62418E11093p057o537n829n015m527m579m888n141n321n329m750l519k423k306
$$ plain form
62505 1062765 1123386 1184719 1245028 1303043 1357765 1407752 1450973 1485602 1510735 1526237 1532294
62494 1532294 1529537 1519594 1505221 1489625 1475480 1464335 1456765 1453102 1454080 1460774 1473921 1493440 1518609
62481 1518609 1548592 1582695 1620192 1659855 1699341 1734857 1761849 1776869 1779382 1771652 1756312 1733658
62469 1733658 1701241 1656153 1597796 1528599 1452458 1372783 1291845 1211277 1132581 1057102 985898
62458 985898 919870 859910 806688 760297 720194 685596 656006 631374 611691 596358 584063
62447 584063 573469 564093 556356 550684 546731 543684 541195 539688 539684 541106 543420 546231 549438 552857 556044
62432 556044 558641 560714 562499 563833 564016 562341 558732 553748 547982 541573 534390 526571 518646 511093
62418 511093 504036 497499 491670 486655 482128 477549 472661 467520 462199 456870 452120 448601 446178 443872
62404D43872k914l210k677j738q44PP86J162J071R39J030J190J537K618M344N473
62388D52646N027L694K899K840K527J684J387K450M189N424O007O579P302P667
62374E12322P487P280P577Q311R097R719J0054R946R462R248J0095J2138J4740
62361F37476J7355K0271K4110K8807L3459L7378M0934M5114N0370N6031O0764
62350A052069O3491O3931O2371N8918N3107M4517L3819K2788J2966M565l014r990
62338A459538j5998k1023k5776l0901l6103m0374m2976m3993m4031m3511m2333
62327A072519m0192l7213l4030l1217k8754k6397k4323k3042k2681k2678k2362
62316G59630k1551k0449j9273j8173j7334j6805j6271j5271j3706j1960j0404
$$ plain form
62404 443872 440958 437748 435071 433333 432489 432496 433282 434444 435515 436454 437484 438674 440211 442829 447173 452646
62388 452646 457673 461367 464266 467106 469633 471317 472704 475154 479343 484767 490774 497353 504655 512322
62374 512322 519809 527089 534666 542977 552074 561793 571847 581793 591255 600503 610598 622736 637476
62361 637476 654831 675102 699212 728019 761478 798856 839790 884904 935274 991305 1052069
62350 1052069 1115560 1179491 1241862 1300780 1353887 1398404 1432223 1455011 1467977 1472542 1469528 1459538
62338 1459538 1443540 1422517 1396741 1365840 1329737 1289363 1246387 1202394 1158363 1114852 1072519
62327 1072519 1032327 995114 961084 929867 901113 874716 850393 827351 804670 781992 759630
62316 759630 738079 717630 698357 680184 662850 646045 629774 614503 600797 588837 578433
62305E78433q952p320n612m363l878l782l468k771j862p68M97J433J433Q02P13
62290E40535J706K833K885J949J106R50J227J696K401L034K949K054J075O45O78
62275E67723R39J497K307K861K884K927L722N203O728Q011R276J0633J1936J3321
62261F49968J5346J8366K2122K6181L0520L5355M0589M5765N0598N5249N9840
62250A049899O3874O6379O6643O4526O0003N2876M3292L2279K1213J0801J019
62239A532804q051j5950k2527k8290l3724l8742m3134m7045n0452n2538n2275
62228A140076m9581m5415m0782l6196l2078k8932k6801k5011k2870k0431j8264
62217G93715j6720j5759j5309j5292j5311j4807j3718j2600j1878j1293j0485
$$ plain form
62305 578433 569481 562161 556549 552186 548308 544526 541058 538287 536425 535657 536154 537587 539020 539822 540535
62290 540535 542241 545074 547959 549908 551014 551964 553191 554887 557288 560322 563271 565325 566400 567045 567723
62275 567723 568662 570159 572466 575327 578211 581138 584860 590063 596791 604802 614078 624711 636647 649968
62261 649968 665314 683680 705802 731983 762503 797858 838447 884212 934810 990059 1049899
62250 1049899 1113773 1180152 1246795 1311321 1371324 1424200 1467492 1499771 1520984 1531785 1532804
62239 1532804 1524753 1508803 1486276 1457986 1424262 1385520 1342386 1295341 1244889 1192351 1140076
62228 1140076 1090495 1045080 1004298 968102 936024 907092 880291 855280 832410 811979 793715
62217 793715 776995 761236 745927 730635 715324 700517 686799 674199 662321 651028 640543
62206F40543r722r453r307q257o054l753k454j943j165L76K212L688M526M793
62192F04030M886N473O778Q023Q252P719P766R071J0828J1940J2309J2459J2491
62179G22025J2157J1550J0984J0299Q901O587L935J854J011J649L659O704J0451
62166H11766J4608J8901K3235K7907L3231L8820M3625M6898M8623M8770M6741
62155A203125M2118L5487K7894J9860J1512L391l702r544j4496j8816k2621k6416
62143A247792l0745l5141l8227l9183l8516l7140l5222l2367k8511k4201k0159
62132H88380j6822j4115j1570q847o237m369l394k817k167j379m72O85K099L525
62118H22500M819O028P060P745Q360R521J1252J2689J3088J2509J1089Q285L745
$$ plain form
62206 640543 630821 621368 612061 603804 597750 593997 591543 589600 588435 588811 591023 594711 599237 604030
62192 604030 608916 614389 621167 629190 637442 645161 652927 661998 672826 684766 697075 709534 722025
62179 722025 734182 745732 756716 767015 775916 782503 786438 788292 789303 790952 794611 801315 811766
62166 811766 826374 845275 868510 896417 929648 968468 1012093 1058991 1107614 1156384 1203125
62155 1203125 1245243 1280730 1308624 1328484 1339996 1343387 1339685 1330141 1315645 1296829 1274208 1247792
62143 1247792 1217047 1181906 1143679 1104496 1065980 1028840 993618 961251 932740 908539 888380
62132 888380 871558 857443 845873 837026 830789 826420 823026 820209 818042 816663 816191 816876 818975 822500
62118 822500 827319 833347 840407 848152 856512 866033 877285 889974 903062 915571 926660 934945 938690
62105I38690j431n227o562o039m779l211j274O62J654R48j161l346m252l583k122
62090H98967o40P97K339L721M650N503O864Q445R245Q958Q643R534J1631J3836
62076I92493J5286J6140J7149J8755K0652K2112K2649K2337K1473K0195J8615
62065A207856J7174J6430J6520J7211J8486K0534K3021K4885K5284K4314K2374
62054A434089J9238J4471Q569K894j740n751r842j3984j7809k1605k6184l1755
62042A350591l7450m2117m5241m6983m7660m7474m6546m4956m2736m0081l7423
62031H71924l5164l3203l0970k7944k4138k0084j6483j3843j2257j1352j0564
62020F35922r612q703q229q299q580q567p925o715n395m538m318m276l723k485
$$ plain form
62105 938690 937259 932032 925470 919431 914652 911441 910167 910829 912483 913431 912270 908924 904672 901089 898967
62090 898967 898327 899124 901463 905184 909834 915337 922201 930646 939891 948849 957492 967026 978657 992493
62076 992493 1007779 1023919 1041068 1059823 1080475 1102587 1125236 1147573 1169046 1189241 1207856
62065 1207856 1225030 1241460 1257980 1275191 1293677 1314211 1337232 1362117 1387401 1411715 1434089
62054 1434089 1453327 1467798 1476367 1479261 1477521 1471770 1461928 1447944 1430135 1408530 1382346 1350591
62042 1350591 1313141 1271024 1225783 1178800 1131140 1083666 1037120 992164 949428 909347 871924
62031 871924 836760 803557 772587 744643 720505 700421 683938 670095 657838 646486 635922
62020 635922 626310 617607 609378 601079 592499 583932 576007 569292 563897 559359 555041 550765 547042 544557
62006E44557j055J17J261K975N272P349Q429Q620Q668Q980R238Q946Q019O705
61992F28081N177L472J619l73k490m490n906o628p298q693j0671j2214j2650j2344
61978E54592j1958j1499j0595r389q484p998p308n935m267l073k587k445k341
61965D66713k320k373k217j704j194j188j688k178k190j584l79J248K696L257
61951D54899L008K958L808M942N326N143N660P443R583J1043J1950J3038J4436
61938E53237J5754J6873J7918J8694J8885J8712J8708J8881J8757J8176J7341
61927G51936J6133J4169J1633R375P741O041L541M79k416m886p061q822r834j0073
61913G77956r728q698o654l588M9L739P147J0074J2499J4604J6433J7552J7370
$$ plain form
62006 544557 543502 543619 544880 547855 553127 560476 568905 577525 586193 595173 604411 613357 621376 628081
61992 628081 633258 636730 638349 637976 635486 630996 625090 618462 611164 602471 591800 579586 566936 554592
61978 554592 542634 531135 520540 511151 502667 494669 487361 481426 477159 474086 471499 469054 466713
61965 466713 464393 462020 459803 458099 456905 455717 454029 451851 449661 448077 447698 448946 451642 454899
61951 454899 457907 460865 464673 469615 474941 480084 485744 493187 502770 513813 525763 538801 553237
61938 553237 568991 585864 603782 622476 641361 660073 678781 697662 716419 734595 751936
61927 751936 768069 782238 793871 803246 810987 817028 820569 821048 818632 813746 806685 797863 788029 777956
61913 777956 768228 759530 752876 749288 749337 753076 760223 770297 782796 797400 813833 831385 848755
61900H48755J5812J3345J0360O822K647j823n858q814j0621j1894j3377j5096
61888H30258j6201j5965j4750j3593j2952j2337j1272j0130r688j0162j1006j1572
61876F80630j1682j1577j1471j1252j0641r644q610p750o767n284l503k014r22
61863E79513L55K251M364O010P141Q319R853J1408J2629J3840J5821J8843K2141
61850G12488K4588K5982K7301K9495L2238L4228L4657L3876L2529L0630K7747
61839A045759K3720J8788J3295P597K121k898p516j1614j4580j5874j5737j4769
61827A028292j2872r306m053J566O052R148J1577J3597J4447J3275J0155N928
61815A087806J312l599r069j5144k1283k6531l0128l2050l2921l3269l2992l1746
$$ plain form
61900 848755 864567 877912 888272 895094 897741 895918 890060 881246 870625 858731 845354 830258
61888 830258 814057 798092 783342 769749 756797 744460 733188 723058 713370 703208 692202 680630
61876 680630 668948 657371 645900 634648 624007 614363 605753 598003 591236 585952 582449 580435 579513
61863 579513 579868 582119 586483 592493 599634 607953 617806 629214 641843 655683 671504 690347 712488
61850 712488 737076 763058 790359 819854 852092 886320 920977 954853 987382 1018012 1045759
61839 1045759 1069479 1088267 1101562 1109159 1111280 1108382 1100866 1089252 1074672 1058798 1043061 1028292
61827 1028292 1015420 1006114 1002061 1003627 1009679 1018827 1030404 1044001 1058448 1071723 1081878 1087806
61815 1087806 1089118 1085519 1076450 1061306 1040023 1013492 983364 951314 918393 885124 852132 820386
61803H20386k9686k7535k5808k4289k2480k0356j8323j6559j4728j2493j0020
61792E98109p893o604o167o115n822n074m290m041m266m269l588k571j868j619
61778E33922j508j318j077p28j83L52M54K5n66r55j061q16n7J113K162K649K713
61761E35121K793L039L267L349L331L274L295L607M188M496L900K469Q88m47j787
61746E74783l312m513m790m391m187m550m964m794m066l248k577j966j415j135
61732E24875j202j251p97J97J181J574J448J467K054K860L258L165L008K944K677
61717E47458K149J892K317L045L354L087K600K031J194J61o37j015j357k058l045
61702E61176l980m640m868m545l852l312l245l440l581l741m023m046l380k433
$$ plain form
61803 820386 790700 763165 737357 713068 690588 670232 651909 635350 620622 608129 598109
61792 598109 590216 583612 577445 571330 565508 560434 556144 552103 547837 543568 539980 537409 535541 533922
61778 533922 532414 531096 530019 529291 529108 529460 529914 529939 529373 528418 527357 526541 526484 527597 529759 532408 535121
61761 535121 537914 540953 544220 547569 550900 554174 557469 561076 565264 569760 573660 576129 577017 576570 574783
61746 574783 571471 566958 562168 557777 553590 549040 544076 539282 535216 531968 529391 527425 526010 524875
61732 524875 523673 522422 521625 521822 523003 524577 526025 527492 529546 532406 535664 538829 541837 544781 547458
61717 547458 549607 551499 553816 556861 560215 563302 565902 567933 569127 569288 568651 567636 566279 564221 561176
61702 561176 557196 552556 547688 543143 539291 535979 532734 529294 525713 521972 517949 513903 510523 508090
61688E08090k266l272m501m713l796k753k371k397k182j690j445j653j877j744
61674D71430j504j586j908k123k316k843l458l293k025n21J37j02n12p24r31j136
61658D46585r27k20M10N02M12Q13J716K474K637K422K265K209J996J571J255J450
61642D67570K221L181L741L556K871K393K525K784K254P81o67j142q64q68j636
61627D88700k714l505l881l820l244k438k082k360k534j914q81l44m86o82n47
61612D57268m45q58j749k764l648m347m914n445n973o389o591o646o616o395n874
61597C88614n136m303l414k639k346k619k983k999k821k748k568j960j241r90
61583C49847j106j008p21q68j528j979j790j388j203j074p93n73n06k92Pk87j358
$$ plain form
61688 508090 505824 502552 498051 493338 489542 486789 484418 482021 479839 478149 476704 475051 473174 471430
61674 471430 469926 468340 466432 464309 461993 459150 455692 452399 450374 449853 449990 449888 449376 448652 447721 446585
61658 446585 445658 445438 445848 446350 446762 447575 449291 451765 454402 456824 459089 461298 463294 464865 466120 467570
61642 467570 469791 472972 476713 480269 483140 485533 488058 490842 493096 493877 493210 492068 491204 490336 488700
61627 488700 485986 482481 478600 474780 471536 469098 467016 464656 462122 460208 459327 458983 458497 457815 457268
61612 457268 456823 455965 454216 451452 447804 443457 438543 433098 427125 420736 414145 407499 400883 394488 388614
61597 388614 383478 379175 375761 373122 370776 368157 365174 362175 359354 356606 354038 352078 350837 349847
61583 349847 348741 347733 347012 346144 344616 342637 340847 339459 338256 337182 336389 335816 335310 335018 335025 334738 333380
61566C33380k204j820n56M41P03N82L32k0j34M25J386J950J809J405J174J172
61550C40025J429J988K439K180J326P23Q17J059Q20L10J98O90J421J978K169J955
61534C61527J558J459K028L150M349N077M877L601J761K22p16j658l061m265m230
61519C75679l086k161k328l030l218k650j801j032m72l90q83j325q60M24J423
61504C54290J361O16o7n60j117j602j649j274p59o1J022K147K532J908Q83J87
61488C57857l4q5k10m43o16m57O4M94M29K15O28J683K455K279J598J224J298J453
61470C69832J562J722J733J226K64o43j063r33m53k6j28q68j749k096j720r15
61454C65745p4M95O19N10P08J395J970J749R75N66R44J633K086K339K649K876
$$ plain form
61566 333380 331176 329356 328800 329241 329944 330526 330858 330838 330704 331129 332515 334465 336274 337679 338853 340025
61550 340025 341454 343442 345881 348061 349387 350110 350927 351986 352806 353116 353314 354004 355425 357403 359572 361527
61534 361527 363085 364544 366572 369722 374071 379148 384025 387626 389387 389609 388893 387235 384174 379909 375679
61519 375679 372593 370432 368104 365074 361856 359206 357405 356373 355901 355511 354628 353303 352443 352867 354290
61504 354290 355651 356267 356200 355640 354523 352921 351272 349998 349239 349178 350200 352347 354879 356787 357670 357857
61488 357857 357823 357738 357528 357085 356469 356012 356076 356570 356999 357214 357842 359525 361980 364259 365857 367081 368379 369832
61470 369832 371394 373116 374849 376075 376339 375696 374633 373700 373247 373221 373093 372225 370476 368380 366660 365745
61454 365745 365671 366166 366785 367295 368003 369398 371368 373117 374092 374658 375602 377235 379321 381660 384309 387185
61438C87185K636J909J248J363K446L930M948N098M713M259L804L186K473J905
61424D31103J504J127Q20P99J129J695K383L042L351L049K280J406N85k13q90
61409D53170j295j549j910k353k627k743l003l484l904m017l899l713l472l129
61395D12072k673k069j304n52j08j14n13j132j649j597p62M31J218J227P73M57
61379D03705P26J599K613L076K787K324K330K656K710K466K536L118L498K948
61365D39092J696O70N04J108K022K937L726M183M021L326K880L537N204O844P821
61350D89571Q684J0135J1715J2226J1265R575P997O732N642M661L763L041K754
61337E87761K927L018K615K164K207K169R23j338k979l060k523k676l438l867
$$ plain form
61438 387185 389821 391730 392978 394341 396787 400717 405665 410763 415476 419735 423539 426725 429198 431103
61424 431103 432607 433734 434554 435353 436482 438177 440560 443602 446953 450002 452282 453688 454273 454060 453170
61409 453170 451875 450326 448416 446063 443436 440693 437690 434206 430302 426285 422386 418673 415201 412072
61395 412072 409399 407330 406026 405474 405366 405252 404739 403607 401958 400361 399599 400030 401248 402475 403248 403705
61379 403705 404431 406030 408643 411719 414506 416830 419160 421816 424526 426992 429528 432646 436144 439092
61365 439092 440788 441458 441962 443070 445092 448029 451755 455938 459959 463285 466165 469702 474906 481750 489571
61350 489571 498255 508390 520105 532331 543596 553171 561168 567900 573542 578203 581966 585007 587761
61337 587761 590688 593706 596321 598485 600692 602861 603784 602446 599467 596407 593884 591208 587770 583903
61323E83903l746l607l558l037j748k03Q19J045R12J200K315L853N079N808O514
61308E95549P526Q541R195R655J0353J1419J2574J3222J2546R992N974J744j728
61295G06562m452o862q989j0432j0845j0236r095q233q073q103p526o431n634
61282F01651n338m849l737k393j154J28J311J826J860K580M419O181O709O466
61268F15660O481O698O548O368O816P478P501P293Q100J0119J2277J3833J4822
61255G29994J4935J3384J0203O601L591J221p35k214l280m178m813m989n155n878
61241G48687o535n854m033k976l724m939m840l623k854l193l875m032l499k424
61227F92286r77M79J532K160K599K920K955K634K069J519J386K008L218M329M796
$$ plain form
61323 583903 580157 576550 572992 569955 568207 568004 568823 569868 570780 571980 574295 578148 583227 589035 595549
61308 595549 603075 611616 620811 630466 640819 652238 664812 678034 690580 700572 706546 708290 706562
61295 706562 702110 695248 686259 675827 664982 654746 645651 637418 629345 621242 613716 607285 601651
61282 601651 596313 591464 587727 585334 584180 584308 585619 587445 589305 591885 596304 602485 609194 615660
61268 615660 622141 628839 635387 641755 648571 656049 663550 670843 678943 689062 701339 715172 729994
61255 729994 744929 758313 768516 775117 778708 779929 779194 776980 773700 769522 764709 759720 754565 748687
61241 748687 742152 736298 732265 729289 725565 720626 715786 712163 709309 706116 702241 698209 694710 692286
61227 692286 691309 691788 693320 695480 698079 700999 703954 706588 708657 710176 711562 713570 716788 721117 725913
61212G25913M698M382L987L404K451Q60j349l353l863k473k94J275K147L537O414
61197G47736J0364J3939J6023J6889J7931K0036K2381K3204K1870J9394J6816
61186I46583J3840R762N121J522K1K51J007J112j42k643n409p345q263q915j0005
61171I36497j1471j2771j3579j3984j4200j4273j4094j3717j3505j3784j4381
61160G86738j4708j4380j3479j2221j0698r073p614o226m353j684J231L493M800
61147G01826N544O044N972M668J906j705n116p770r967j2031j3353j2914j0766
61134F52338q222o299m687k691m27J612L504N578P483Q569R080J0045J1965J4356
61120G02204J6658J8828K0784K2079K2541K2740K3423K4745K6288K7483K7807
$$ plain form
61212 725913 730611 734993 738980 742384 744835 745695 744346 740993 737130 734657 734363 735638 737785 741322 747736
61197 747736 758100 772039 788062 804951 822882 842918 865299 888503 910373 929767 946583
61186 946583 960423 970185 975306 976828 976849 977100 978107 979219 979077 976434 971025 963680 955417 946502 936497
61171 936497 925026 912255 898676 884692 870492 856219 842125 828408 814903 801119 786738
61160 786738 772030 757650 744171 731950 721252 712179 704565 698339 693986 692302 693533 697026 701826
61147 701826 707370 713414 719386 724054 725960 724255 719139 711369 701402 689371 676018 663104 652338
61134 652338 644116 637817 633130 630439 630012 631624 635128 640706 648189 656758 665838 675883 687848 702204
61120 702204 718862 737690 758474 780553 803094 825834 849257 874002 900290 927773 955580
61109I55580K6966K5239K3318K1625J9991J8241J6646J5367J3701J0549N658j3
61097A152868n303r911j4168j8096k1169k3091k4373k5796k7441k8657k8949k8481
61085H97433k7559k6109k4034k1798k0136j9182j8299j6845j4831j2753j1003
61074F84884r610q393p221o106n037l846k359p46N09J089J164J103J102J288J910
61059F49731L054M322N163N565O091P209Q802J0394J1683J2808J4139J5804J7498
61046G72263J8897K0161K1637K3066K3695K3503K3629K5051K7187K8557K8540
61035A036186K7789K7140K6914K7188K7879K8463K8363K7848K7885K8895L0375
61024A344925L1940L3986L6872M0047M2432M3381M3019M2267M2695M5692N1340
$$ plain form
61109 955580 982546 1007785 1031103 1052728 1072719 1090960 1107606 1122973 1136674 1147223 1152881 1152868
61097 1152868 1147565 1137654 1123486 1105390 1084221 1061130 1036757 1010961 983520 954863 925914 897433
61085 897433 869874 843765 819731 797933 777797 758615 740316 723471 708640 695887 684884
61074 684884 675274 666881 659660 653554 648517 644671 642312 641566 642075 643164 644328 645431 646533 647821 649731
61059 649731 652785 657107 662270 667835 673926 681135 689937 700331 712014 724822 738961 754765 772263
61046 772263 791160 811321 832958 856024 879719 903222 926851 951902 979089 1007646 1036186
61035 1036186 1063975 1091115 1118029 1145217 1173096 1201559 1229922 1257770 1285655 1314550 1344925
61024 1344925 1376865 1410851 1447723 1487770 1530202 1573583 1616602 1658869 1701564 1747256 1798596
61013A798596N8624O6971P6810Q8287J00446J12533J25322J40455J59364J83787
61003B911195K16462K59869L14843L81734M62470N60635O81042Q31198J020742
60994G640190J254376J524497J814007K102779K357312K505247K436138K063278
60986B3697824J412344O48636k287l79515m50918k82883J8499L25851M85172L52294
60976B5825017j21692q34050j573814k138679k429393k459688k304551k046869
60968A1916281j752819j466940j212502r95624q13731o62765n38847m37663l55354
60959C680036k89617k38639j99671j69638j46434j28590j14209j01341q9163p7951
60949B124783o7949n8901n0523m2785l5911l0578k7828k8093l0398l3068l5066
$$ plain form
61013 1798596 1857220 1924191 2001001 2089288 2189734 2302267 2427589 2568044 2727408 2911195
61003 2911195 3127657 3387526 3702369 4084103 4546573 5107208 5788250 6619448 7640190
60994 7640190 8894566 10419063 12233070 14335849 16693161 19198408 21634546 23697824
60986 23697824 25110168 25758804 25756517 25377002 24926084 24643201 24661700 24987551 25472723 25825017
60976 25825017 25703325 24869275 23295461 21156782 18727389 16267701 13963150 11916281
60968 11916281 10163462 8696522 7484020 6488396 5674665 5011900 4473053 4035390 3680036
60959 3680036 3390419 3151780 2952109 2782471 2636037 2507447 2393238 2291897 2202734 2124783
60949 2124783 2056834 1997933 1947410 1904625 1868714 1838136 1810308 1782215 1751817 1718749 1683683
60938A683683l6213l6395l5381l3474l1559l0330k9794k9598k9378k8815k7813
60927A334933k6693k5786k4975k4097k3570k3912k4671k4771k3942k2988k2406
60916A067122k1704k0514j9347j8623j7784j6259j4637j3884j3827j3445j2357
60905H84741j1057r879q741p936q043q837r245q764q155q325r167r935j0185r834
60891G56638q907p774p139p200p147o171m679l883m265n123n593n530n284n148
60877F72795n340o046p159q163q565q403q114p940p673o993n977n100m690m467
60863E78165l884k895k076j803j688j135j98M91N70K18k98q27j067p46k78n74
60847E61975j728k464j575L57J497R41l75j160j376j989l502n392o809p331p014
$$ plain form
60938 1683683 1647470 1611075 1575694 1542220 1510661 1480331 1450537 1420939 1391561 1362746 1334933
60927 1334933 1308240 1282454 1257479 1233382 1209812 1185900 1161229 1136458 1112516 1089528 1067122
60916 1067122 1045418 1024904 1005557 986934 969150 952891 938254 924370 910543 897098 884741
60905 884741 873684 863805 855064 847128 839085 830248 821003 812239 804084 795759 786592 776657 766472 756638
60891 756638 747731 739957 732818 725618 718471 712300 707621 703738 699473 694350 688757 683227 677943 672795
60877 672795 667455 661409 654250 646087 637522 629119 621005 613065 605392 598399 592422 587322 582632 578165
60863 578165 574281 571386 569310 567507 565819 564684 564486 564977 565547 565765 565467 564640 563573 562827 562549 561975
60847 561975 560247 557783 556208 556565 558062 559003 558628 557468 556092 554103 550601 545209 538400 531069 524055
60832E24055o124m926l638k420j438q45o55p21r18j189j294q82MP15P03K32l4
60815E00625j0j97p13j024q14n46p18j077j057p08n89r26j406j744j932j981j865
60798D83318j793k040k446k477k060j816k282l153l692l669l571l946m755n388
60784D40230n183m032k576j674j610j915k018j857j781k056k617l053k778j477
60770D05603L29J511J434O57K50N88J197J597J807K063K489L086L798M434M817
60755D35660M870M511L566K231J241J117J376J139M67K69Q70J520J568J244Q35
60740D62484m1j649l358m451n196o219p253p519p019o454n994n140l923l094k958
60725C92216k912k487k019j830j551q65k92n27j421k156k220j747j160p91p20
$$ plain form
60832 524055 517931 513005 509367 506947 505509 504664 504009 503288 502370 501181 499887 499005 499009 499724 500427 500659 500625
60815 500625 500615 500418 499705 498681 497867 497321 496603 495526 494469 493761 493172 492246 490840 489096 487164 485183 483318
60798 483318 481525 479485 477039 474562 472502 470686 468404 465251 461559 457890 454319 450373 445618 440230
60784 440230 435047 431015 428439 426765 425155 423240 421222 419365 417584 415528 412911 409858 407080 405603
60770 405603 405932 407443 408877 409534 409784 410372 411569 413166 414973 417036 419525 422611 426409 430843 435660
60755 435660 440530 445041 448607 450838 452079 453196 454572 455711 456178 456447 457317 458837 460405 461649 462484
60740 462484 462443 460794 457436 452985 447789 441570 434317 426798 419779 413325 407331 402191 398268 395174 392216
60725 392216 389304 386817 384798 382968 381417 380552 380260 379733 378312 376156 373936 372189 371029 370238 369518
60710C69518o75l11L19Q37J111J319J438J288J114J368J757J411L83j11N13J234
60694C82513J058N77P88J280J084O14J110K441L163K773K312K502K861L120L895
60679D12091N254N934N126L886L722M480M838M261L377K739K217J615J023N10
60665D61073K4m47j015j954l226m176m242l757l498l671l774l354k437j306l82
60650D23858j20n61j047q13K01J392K160K196J368j26j690k881l849m807n310
60635D09971m683l083j496o89o86j215j942k213j330M86J963K086J217N67P12
60620C99665J156J149O16P8n7J01K33K65L48M63M19K28K02M37N83L53q9m91r01
60601D04758j320j324n73M54R01N91J37O9L64Q79J602K368K824K901K891K934
$$ plain form
60710 369518 368843 368532 368851 369688 370799 372118 373556 374844 375958 377326 379083 380494 380877 380766 381279 382513
60694 382513 383571 384148 384936 386216 387300 387914 389024 391465 394628 397401 399713 402215 405076 408196 412091
60679 412091 417345 423279 428405 432291 436013 440493 445331 449592 452969 455708 457925 459540 460563 461073
60665 461073 461097 460650 459635 457681 454455 450279 446037 442280 438782 435111 431337 427983 425546 424240 423858
60650 423858 423738 423177 422130 421317 421518 422910 425070 427266 428634 428508 426818 423937 420088 415281 409971
60635 409971 405288 402205 400709 400020 399334 398119 396177 393964 392634 393120 395083 397169 398386 398953 399665
60620 399665 400821 401970 402586 402664 402607 402708 402941 403206 403554 404017 404436 404664 404866 405303 405886 406239 406150 405659 404758
60601 404758 403438 402114 401541 401995 402896 403487 403624 403693 404057 404936 406538 408906 411730 414631 417522 420456
60585D20456K803K386J949J748J724J733J674J305M13n95p62K86J701K376K267
60570D41464K248K855L838M910O265Q033R741J0802J1347J2066J3179J4047J3969
60557E54764J3017J1668R862P049L263m42k981m338n236o038o482o326n695m737
60543E57348l393j689J41J961L824N657P228Q656J0532J3143J5916J8014J9372
60530F56710K0581K1738K1932K0156J6412J1609O517J379l490p312r474j0280
60518G46478j0569j0699j0376r499q575q024p590o806n747m860m186l246j681
60505F54620K67K034L306M353N816Q056J0748J3321J5852J9118K3562K8639L3570
60492H23262L8295M3238M8308N2683N5437N6048N4506N1287M7040M1918L5437
$$ plain form
60585 420456 423259 425645 427594 429342 431066 432799 434473 435778 436191 435596 434834 435120 436821 439197 441464
60570 441464 443712 446567 450405 455315 461580 469613 479354 490156 501503 513569 526748 540795 554764
60557 554764 567781 579449 589311 596360 599623 599181 596200 591862 586626 580588 574106 567780 562085 557348
60543 557348 553955 552266 552407 554368 558192 563849 571077 579733 590265 603408 619324 637338 656710
60530 656710 677291 699029 720961 741117 757529 769138 775655 777034 773544 766232 756758 746478
60518 746478 735909 725210 714834 705335 696760 688736 681146 674340 668593 663733 659547 656301 654620
60505 654620 654887 656921 660227 664580 670396 678452 689200 702521 718373 737491 761053 789692 823262
60492 823262 861557 904795 953103 1005786 1061223 1117271 1171777 1223064 1270104 1312022 1347459
60481A347459K7330J8119Q300k478j4561k6978l7944m6650n3571n8947o2056o2305
60469A035718o0122n6292n1253m5526m0131l5802l2300k9025k5925k3220k0697
60458F15425j7956j5162j2875j1306j0144r063p988o927n967n330n169n273n231
60445D97034m824m098l229k495k115j954j594r48n09p08j255j522j360j154j157
60430D68112j159q66k77L26O24M54o1n83q58q79p29m34q9Q9P8K17Q51J837K643
60411D69296K870K553J974J379P99J12o93j266j090q1J149J853J904J928K613
60396D85300L933N002M845L421J803J149J553K237K689L092L613L840L351K459
60382E28287J945K182K796L114K746J859J053Q74J283J721J770J576J513J660
$$ plain form
60481 1347459 1374789 1392908 1401208 1398730 1384169 1357191 1319247 1272597 1219026 1160079 1098023 1035718
60469 1035718 975596 919304 868051 822525 782394 746592 714292 685267 659342 636122 615425
60458 615425 597469 582307 569432 558126 547982 538919 530931 524004 518037 512707 507538 502265 497034
60445 497034 492210 488112 484883 482388 480273 478319 476725 475777 475268 474560 473305 471783 470423 469269 468112
60430 468112 466953 466087 465810 466136 466760 467214 467153 466570 465712 464833 464104 463670 463581 463670 463748 463965 464816 466653 469296
60411 469296 472166 474719 476693 478072 478871 478983 478290 477024 475934 475853 477002 478855 480759 482687 485300
60396 485300 489233 494235 499080 502501 504304 505453 507006 509243 511932 515024 518637 522477 525828 528287
60382 528287 530232 532414 535210 538324 541070 542929 543982 544856 546139 547860 549630 551206 552719 554379
60368E54379J769J625J268R77J053J508J974K055J780J406R39K97j17L93J854
60353E73160L363M129M338M667N372O328P542R091J0665J1664J1732J0909R359
60340F72319P260M820K228l95k851m858o323p405q191q553q509q366q226p760
60326F15190o810n874n495n438m981l997l150k998l230l097k350j544j348j632
60312E63246j466j92J700L188M046N040O724Q724J0491J2203J4396J7161K0126
60299F65387K2958K5409K7019K7194K5426K1348J4936O927j322q791j5237k0466
60287G90788k3784k4715k3805k2036j9806j7114j4406j2376j1057r870q603p642
60275E95574p206o986o677o354o209o262o426o464n911m538k916k022k097k338
$$ plain form
60368 554379 556148 557773 559041 560018 561071 562579 564553 566608 568388 569794 570733 571030 570913 571306 573160
60353 573160 576523 580652 584990 589657 595029 601357 608899 617990 628655 640319 652051 662960 672319
60340 672319 679579 684399 686627 686232 683381 678523 672200 664795 656604 648051 639542 631176 622950 615190
60326 615190 608380 602506 597011 591573 586592 582595 579445 576447 573217 570120 567770 566226 564878 563246
60312 563246 561780 561588 563288 566476 570522 575562 582286 591010 601501 613704 628100 645261 665387
60299 665387 688345 713754 740773 767967 793393 814741 829677 836604 835282 826491 811254 790788
60287 790788 767004 742289 718484 696448 676642 659528 645122 632746 621689 611819 603216 595574
60275 595574 588368 581382 574705 568351 562142 555880 549454 542990 537079 532541 529625 527603 525506 523168
60261E23168j930j047n84j036j961k508k321j703j010j87P36J128M72n10m01R68
60245E11274K101J910J193J232J785J685Q37K36K15N4n84j004n97L98J591K901
60229E25227M040M431M096L926M480N193N257M719M168L906L944M350N007N462
60215E88206N503N646O440P590Q317Q470Q661R319J0072J0323J0021R588R232
60202F97388Q651P498N971M709M116L989L825L272K255R17l81j332k088l141m545
60187G31104n746o373o769p258p479p038o398o296o570o460n869n395n166m608
60173F43679l565k728k594k750k551j912j138m97k83p29j541j994j780j266p84
60158F17567k05M91Q29M60k17m97p5Q21J720K129J932J745K377L720M635M253
$$ plain form
60261 523168 521238 520191 519607 518571 516610 514102 511781 510078 509068 508881 509617 510745 511217 510707 510306 511274
60245 511274 513375 515285 516478 517710 519495 521180 522017 522253 522468 522522 521938 520934 520337 520735 522326 525227
60229 525227 529267 533698 537794 541720 546200 551393 556650 561369 565537 569443 573387 577737 582744 588206
60215 588206 593709 599355 605795 613385 621702 630172 638833 648152 658224 668547 678568 688156 697388
60202 697388 706039 713537 719508 724217 728333 732322 736147 739419 741674 742591 742210 740878 738790 735649 731104
60187 731104 725358 718985 712216 704958 697479 690441 684043 677747 671177 664717 658848 653453 648287 643679
60173 643679 640114 637386 634792 632042 629491 627579 626441 625944 625661 624932 623391 621397 619617 618351 617567
60158 617567 617362 617853 618682 619142 618925 618428 618353 619174 620894 623023 624955 626700 629077 632797 637432 641685
60142F41685L015K063K025K632L215L351L309L898N511P338Q144P850P564P875
60128G09475Q036P213N781M675M076L459K534J521P25L79O41J356K005K267K282
60113G56425K158J646O48m37j291k129l158m006m256m088l915l795l752m170n214
60098G20666o191o221n373m493m067l871l573l100k378j320j02R24J607K071K422
60083F87001K664K725K376J472M36M4L59L78p14k421l731m607n822p526q887r226
60067F54521q769q075p369o686o190n976n868n553m871l924l058k621k501k138
60053E80922j241k94O9KK63J201K411L413M238N220O513P897Q842Q868Q057P060
60037F43441O376N805M881L581K125L64j952m454o225o889p013p305p744p789
$$ plain form
60142 641685 644700 646763 648788 651420 654635 657986 661295 665193 670704 678042 686186 694036 701600 709475
60128 709475 717511 724724 730505 735180 739256 742715 745249 746770 747495 747874 748515 749871 751876 754143 756425
60113 756425 758583 760229 760877 760440 759149 757020 753862 749856 745600 741512 737597 733802 730050 725880 720666
60098 720666 714475 708254 702881 698388 694321 690450 686877 683777 681399 680079 679977 680901 682508 684579 687001
60083 687001 689665 692390 694766 696238 696674 696718 697077 697455 696741 694320 690589 685982 680160 672634 663747 654521
60067 654521 645752 637677 630308 623622 617432 611456 605588 600035 595164 591240 588182 585561 583060 580922
60053 580922 579681 579387 579456 579458 579721 580922 583333 586746 590984 596204 602717 610614 619456 628324 636381 643441
60037 643441 649817 655622 660503 664084 666209 666573 664621 660167 653942 647053 640040 632735 624991 617202
60023F17202p198o406o112o605p461p968p826p276o621n922n274m907m779m447
60009E28400l731l124l143l574l807l551k809j471L69J959K494K134J837K151
59995E14134K707K933K763K539K598L031L581L889M006M391N073N256M367L057
59981E64325K394K331J843N13j031k336l714n292o337o164n141m240l908l825
59967E29418l468k625j531p11m72m20J60J356K415K690K378K130K219K404K338
59952E38281J841J033L06R5M50J005J382J395R48L5j058j885k211k105j660j007
59936E36845m62k86k88l1N12R35R75Q00O93Q95J687L175M923O309P221P926Q395
59919E80224Q360Q066Q161Q740R169R026Q457P455N649L161Q94n24j368j979k160
$$ plain form
60023 617202 610004 603598 597486 590881 583420 575452 567626 560350 553729 547807 542533 537626 532847 528400
60009 528400 524669 521545 518402 514828 511021 507470 504661 503190 503559 505518 508012 510146 511983 514134
59995 514134 516841 519774 522537 525076 527674 530705 534286 538175 542181 546572 551645 556901 561268 564325
59981 564325 566719 569050 570893 571406 570375 568039 564325 559033 552696 546532 541391 537151 533243 529418
59967 529418 525950 523325 521794 521083 520611 520191 520351 521707 524122 526812 529190 531320 533539 535943 538281
59952 538281 540122 541155 541461 541556 542006 543011 544393 545788 546736 546771 545713 543828 541617 539512 537852 536845
59936 536845 536383 536097 535809 535778 536290 537225 538200 539000 539693 540588 542275 545450 550373 556682 563903 571829 580224
59919 580224 588584 596650 604811 613551 622720 631746 640203 647658 653307 656468 657362 656838 655470 653491 651331
59904F51331j988k257l308m165l867l031k969l659l891l203k374j867j049N66
59890F14269K297L189L288L346L777M414N045N631O160O613O996P209P049O564
59876F85847O166O138O220N904N013L730K243O13j010k394l478m406n262n924
59862F99400o267o377o467o623o717o545o008n182m287l562l110k774k220j213
59848F32048J52J564K857M119N441O700P785Q882J0200J1380J1475R838O861L622
59834G22924R42q45j373j99K375M906N822M738K358o54m035p235r257r649r131
59819G01687q686q401p665o263m635l245k190j489j245j426j873k588l685m898
59805F43398n520n044l738k456j950k312k950l145k755k346k451k910l202l189
$$ plain form
59904 651331 649343 647086 643778 639613 635746 632715 629746 626087 622196 618993 616619 614752 613703 614269
59890 614269 616566 619755 623043 626389 630166 634580 639625 645256 651416 658029 665025 672234 679283 685847
59876 685847 692013 698151 704371 710275 715288 719018 721261 721874 720864 718470 714992 710586 705324 699400
59862 699400 693133 686756 680289 673666 666949 660404 654396 649214 644927 641365 638255 635481 633261 632048
59848 632048 632200 633764 636621 640740 646181 652881 660666 669548 679748 691128 702603 712441 719302 722924
59834 722924 723866 723021 721648 721449 723824 728730 734552 739290 741648 740994 736959 729724 720467 710818 701687
59819 701687 693001 684600 676935 670672 666037 662792 660602 659113 657868 656442 654569 651981 648296 643398
59805 643398 637878 632834 629096 626640 624690 622378 619428 616283 613528 611182 608731 605821 602619 599430
59791E99430l108k919k259j185m31o15j495k282k476k151j584r51l29J71L79J87
59775E78382k30l97J01J200K458L465M015M014L514K838K373K278K566L298M309
59760F14184M921M499L310K346K186K560L099L831M638M908M288L364K977L158
59746F64269L327L336L614M278M739M418L425K295J351N91j8m29p07j082j736
59731F91671k544l096k983k153r86l5L98M38M51O46R14J088J236J531J810J578
59715F89964O35m77q97k08J318L066M349M626L864K723K064K237K982L896M628
59700G24770M819M380L828L866M498N034N063M953N228N891O536O647N636L143
59686G94292j81k822l819l773l833m158m078l505l246l768m579n165n773o772
$$ plain form
59791 599430 596322 593403 591144 589959 589528 588913 587418 585136 582660 580509 578925 577974 577645 577816 578195 578382
59775 578382 578152 577755 577856 579056 581514 584979 588994 593008 596522 599360 601733 604011 606577 609875 614184
59760 614184 619105 623604 626914 629260 631446 634006 637105 640936 645574 650482 654770 658134 661111 664269
59746 664269 667596 670932 674546 678824 683563 687981 691406 693701 695052 695643 695625 695196 694489 693407 691671
59731 691671 689127 686031 683048 680895 679909 679874 680272 680710 681161 681807 682721 683809 685045 686576 688386 689964
59715 689964 690599 690122 689225 689017 690335 693401 697750 702376 706240 708963 711027 713264 716246 720142 724770
59700 724770 729589 733969 737797 741663 746161 751195 756258 761211 766439 772330 778866 785513 791149 794292
59686 794292 794111 791289 787470 783697 779864 775706 771628 768123 764877 761109 756530 751365 745592 738820
59672G38820p782q167q053q049q088p373n671l935l163l209l237k894k351j485
59658F65363K4J756K658K496K389L316M687N171M561L896L815L683K612O55j485
59643G05597l449n434p437q861r004p890o414n557n506n678n489m810l764k507
59629F23797j477j258j888k642k913k983l406m061m403m396m391m325l743k712
59615E79199j958j958k438k911l107k806j801l12J005J673J748J537J372J562
59601E70805K149K624K474J877J365Q99N1r50j265p12q8R6L04R57J588J675J607
59584E85456J919K184J450l65k297l499l934l960l780l487l256l285l531l652
59570E55963l334k777k575k933l241k900k244j916j633n43J134J999J339J55k65
$$ plain form
59672 738820 731038 722871 714818 706769 698681 691308 685637 681702 678539 675330 672093 669199 666848 665363
59658 665363 665387 667143 669801 672297 674686 678002 682689 687860 692421 696317 700132 703815 706427 707082 705597
59643 705597 702148 696714 689277 680416 671412 663522 657108 651551 646045 640367 634878 630068 626304 623797
59629 623797 622320 621062 619174 616532 613619 610636 607230 603169 598766 594370 589979 585654 581911 579199
59615 579199 577241 575283 572845 569934 566827 564021 562220 561908 562913 564586 566334 567871 569243 570805
59601 570805 572954 575578 578052 579929 581294 582193 582244 581294 580029 579317 579229 579325 579629 580586 582174 583849 585456
59584 585456 587375 589559 591009 590644 588347 584848 580914 576954 573174 569687 566431 563146 559615 555963
59570 555963 552629 549852 547277 544344 541103 538203 535959 534043 532410 531867 533001 535000 536339 536494 536229
59555E36229R6N03P25J008J370J729K286L032L369K876K115J974K550L381M409
59540E67652N909P773R578J1321J3331J5694J8280K1083K3687K4504K1547J4372
59528G54731M996l278p860q203n821l045j280l59L97R80R26K63n76j597l300n808
59512G21166q459j0414j1312j1432j1402j1658j1902j1365r864q164o946n916
59500F02332m563l276k856l128l037k078q83k24j12o6K52Q06J267J275R19Q34
59484E87462J438K331K986L627M679N615N432M352L959N217P233Q548Q945R194
59470F61018R490Q991O975L814O22j713k920l102k448j314j83O87J593L009M890
59455F89409O710Q192R576J0911J1632J1226J0004Q768P868P002N781M153K405
$$ plain form
59555 536229 536325 536828 537553 538561 539931 541660 543946 546978 550347 553223 555338 557312 559862 563243 567652
59540 567652 573561 581334 590912 602233 615564 631258 649538 670621 694308 718812 740359 754731
59528 754731 759727 756449 748589 740386 734565 731520 730240 729881 730278 731258 732184 732447 731871 730274 726974 721166
59512 721166 712707 702293 690981 679549 668147 656489 644587 633222 623358 615194 608248 602332
59500 602332 597769 594493 591637 588509 585472 583394 582511 582287 582175 582109 582361 583167 584434 585709 586628 587462
59484 587462 588900 591231 594217 597844 602523 608138 613570 617922 621881 627098 634331 642879 651824 661018
59470 661018 670508 679499 686474 690288 690910 689197 686277 683175 680727 679413 679230 679917 681510 684519 689409
59455 689409 696119 704311 713887 724798 736430 747656 757660 766428 774296 781298 787079 791232 793637
59442G93637R36j73j517l887p248j0498j2489j2874j1850r782p473n958n411m842
59428G00571l587k373k092k257j713l41J193K968N642Q894J1442J2793J3766J5001
59414G59907J6164J7077J8329K0179K1875K2850K3549K3964K2091J5324L590r705
59402I55194k0126k5170k4915k0708j3955n911K204R304J4250J5332J0703L63
59390H96565j2368k2590k7589k8208k6478k3178j8488j3622j0136q111o344m201
59378F95252k018L7K178M047M874M756M666M973N060M625M320M617N085N248N314
59363G53034N644O212O997Q186R524J0171R643Q422P359P001P596R075J0769J1826
59349H71459J2194J2626J3553J4654J5567J6223J6357J5621J4380J3415J2529
$$ plain form
59442 793637 794573 794400 792883 788996 781748 771250 758761 745887 734037 724255 716782 710824 705413 700571
59428 700571 696984 694611 692519 690262 688549 688208 689401 692369 698011 706905 718347 731140 744906 759907
59414 759907 776071 793148 811477 831656 853531 876381 899930 923894 945985 961309 964899 955194
59402 955194 935068 909898 884983 864275 850320 844409 846613 855917 870167 885499 896202 896565
59390 896565 884197 861607 834018 805810 779332 756154 737666 724044 713908 705797 699453 695252
59378 695252 693234 693271 695449 699496 704370 709126 713792 718765 723825 728450 732770 737387 742472 747720 753034
59363 753034 758678 764890 771887 780073 789597 799768 809411 817833 825192 832193 839789 848864 859633 871459
59349 871459 883653 896279 909832 924486 940053 956276 972633 988254 1002634 1016049 1028578
59338A028578J0508O863K626j099m394p696j0699j2898j4447j5662j6359j6436
59326I48885j6418j6637j6466j5229j3377j1891j0938r853q223o297m588l573
59314H15395l519m089m392l986l399l287l501l555l452l472l527l406l264l246
59300G65300k981k086p82O05K358M887P820J0388J2392J4057J4947J3777R565
59287H50247K619n497j2692j7313j8996j8554j6852j4009j0039n717k112N42K868
59274G34495N340P731R621J0934J1883J2674J3304J3488J2848J1289R074O476
59262H59157L699J073j113l093n447q114j0242j1237j1467j1494j1245j0440r304
59249G70733q223p140n869m612l559k344o23J164K288K840L600M932O323P091
$$ plain form
59338 1028578 1039086 1045949 1048575 1047476 1043082 1035386 1024687 1011789 997342 981680 965321 948885
59326 948885 932467 915830 899364 884135 870758 858867 847929 838076 829853 823556 818968 815395
59314 815395 811876 807787 803395 799409 796010 792723 789222 785667 782215 778743 775216 771810 768546 765300
59300 765300 762319 760233 759451 760056 762414 767301 775121 785509 797901 811958 826905 840682 850247
59287 850247 852866 847369 834677 817364 798368 779814 762962 748953 738914 733197 731085 731627 734495
59274 734495 739835 747566 757187 768121 780004 792678 805982 819470 832318 843607 852681 859157
59262 859157 862856 863929 862816 859723 854276 846162 835920 824683 813216 801722 790477 780037 770733
59249 770733 762510 755370 749501 744889 741330 738986 738363 739527 741815 744655 748255 753187 759510 766601
59235G66601P073O633O255O065N634M442K659R95l08j805l791n623o582o835o917
59220G74496o762n964m634l273k097j058k76R3J04k59j192k432l080k692j972
59205G39002j676j509r23l85o76j428j585j126j041j588j843j154m7P07R58Q29
59189G26515L23k87l48M33J607K581L227L703M086M396M566M369L750L205L350
59174G65476M098M734M846M746M921N537O515P627Q499Q944R232R600R684Q952
59160H63411P570O141M693K686L6k655n066p515j0128j2336j3599j4072j4180
59147H04986j3996j3446j2678j1875j1005j0078r366r116r188r272r154q674p672
59134F69466o256m903m085l870l933l823l201k003m93J001K351L589M671N534
$$ plain form
59235 766601 773674 780307 786562 792627 798261 802703 805362 806357 806049 804244 800453 794830 788248 781413 774496
59220 774496 767734 761770 757136 753863 751766 750708 750432 750525 750629 750370 749178 746746 743666 740974 739002
59205 739002 737326 735817 734894 734509 733833 732405 730820 729694 728653 727065 725222 724068 724021 724728 725686 726515
59189 726515 726838 726551 726203 726636 728243 730824 734051 737754 741840 746236 750802 755171 758921 762126 765476
59174 765476 769574 774308 779154 783900 788821 794358 800873 808500 816999 825943 835175 844775 854459 863411
59160 863411 870981 877122 881815 884501 884537 881882 876816 869301 859173 846837 833238 819166 804986
59147 804986 790990 777544 764866 752991 741986 731908 722542 713426 704238 694966 685812 677138 669466
59134 669466 663210 658307 654222 650352 646419 642596 639395 637392 636899 637900 640251 643840 648511 654045
59120F54045O292P129Q055Q969R850J0713J1544J2413J3486J4631J5263J4949
59108G87339J3987J3068J2481J1985J1229R998Q203O087M254L084K196R06r44
59095H83873k917m567n662o030n634m802l969l237k449j633j077j082j837l286
59081H35691m981o350p299q197r116r695r930j0272j0555r796p777n920n606o363
59067G23834o779o546o292o027n236m262m034m444m412l708l304l626l840l347
59053F57977k797k980l632l958l619k709j420j59O25R69J203J101J29j330j980
59038F37420j219J25R76J125Q22K35j67M22K148M156N745P095Q508R769J0850
59023F88010J2324J4377J6168J6961J7131J7192J6558J4340J0882P429M576J965
$$ plain form
59120 654045 660337 667466 675521 684490 694340 705053 716597 729010 742496 757127 772390 787339
59108 787339 801326 814394 826875 838860 850089 860087 868290 874377 878631 881715 883911 884817 883873
59095 883873 880956 876389 870727 864697 859063 854261 850292 847055 844606 842973 841896 840814 838977 835691
59081 835691 830710 824360 817061 808864 799748 790053 780123 769851 759296 749500 741723 735803 730197 723834
59067 723834 717055 710509 704217 698190 692954 688692 684658 680214 675802 672094 668790 665164 661324 657977
59053 657977 655180 652200 648568 644610 640991 638282 636862 636703 637328 638297 639500 640601 640730 639400 637420
59038 637420 636201 636326 637302 638427 639249 639484 639317 639739 641887 646043 651788 658883 667391 677160 688010
59023 688010 700334 714711 730879 747840 764971 782163 798721 813061 823943 831372 835948 837913
59011H37913n85k665l975m663m810m300l248k070r19M62K171L810M934N580O064
58996H33699O415O208N082L339J772P46k70j931l981n489o098o448p194q095q401
58981H09354p794o617n379m187k707o75J482K908L510M426O591R277J0979J1560
58967H32728J2309J3748J4694J4131J2848J2353J2808J3014J1988R757O799L419
58955I70596k79m226q179j1588j3949j5451j6799j8203j9036j8723j7506j5961
58943H10696j4287j2458j0614q896p220n546l980k398n02J393K282J699M53m06
58929G50216q76j689l071m490n368n539n161m660m551m895n132m742l823k762
58915F93457j701p20n7K73O79J405K091K398K672L420M535N579O558P820R449
$$ plain form
59011 837913 837328 834663 830688 826025 821215 816915 813667 811597 810678 811140 813311 817121 822055 827635 833699
58996 833699 840114 846322 851404 854743 856515 857261 856991 855060 851079 845590 839492 833044 825850 817755 809354
58981 809354 801560 794943 789564 785377 782670 781995 783477 786385 789895 794321 800912 810189 821168 832728
58967 832728 845037 858785 873479 887610 900458 912811 925619 938633 950621 960378 967177 970596
58955 970596 970317 966091 957912 946324 932375 916924 900125 881922 862886 844163 826657 810696
58943 810696 796409 783951 773337 764441 757221 751675 747695 745297 744795 746188 748470 750169 750622 750216
58929 750216 749340 747651 744580 740090 734722 729183 724022 719362 714811 709916 704784 700042 696219 693457
58915 693457 691756 691036 690979 691252 691931 693336 695427 697825 700497 703917 708452 714031 720589 728409 737858
58900G37858J1333J3508J5885J7792J8504J8117J7378J6784J6366J6163J6307
58889I15995J6652J6940J7382J8514K0308K1871K2171K0788J7923J4022R577N053
58877A117196P75l078o484r614j2736j5856j8547k0295k0974k0761j9738j7844
58865I52044j5233j2473j0260q929q292q010q044q561r351r698r205q341p834
58852H27813p715p550p342p497p958q164p947p719p663p501p266p465q127q516
58838G19383q187p629p368p170o658o079n778n484m773l830l049k329j387m12
58824F49250K45P16J366K112K600K803K953L054L016K975L044K969K541K075J925
58809F83644J802J169J57n31n83l97m77r48j692k503l117l423l642m055m544m730
$$ plain form
58900 737858 749191 762699 778584 796376 814880 832997 850375 867159 883525 899688 915995
58889 915995 932647 949587 966969 985483 1005791 1027662 1049833 1070621 1088544 1102566 1112143 1117196
58877 1117196 1117971 1114893 1108409 1098795 1086059 1070203 1051656 1031361 1010387 989626 969888 952044
58865 952044 936811 924338 914078 905149 896857 888847 880803 872242 862891 853193 843988 835647 827813
58852 827813 820098 812548 805206 797709 789751 781587 773640 765921 758258 750757 743491 736026 727899 719383
58838 719383 711196 703567 696199 689029 682371 676292 670514 665030 660257 656427 653378 651049 649662 649250
58824 649250 649495 650211 651577 653689 656289 659092 662045 665099 668115 671090 674134 677103 679644 681719 683644
58809 683644 685446 686615 686772 686241 685658 685261 684784 683836 682144 679641 676524 673101 669459 665404 660860 656130
58793F56130m501m151l912l583k799j591n39j24K7Q49K606M339N079N115N388
58778F58333N944N989N384M950N048M917L801J872m49l109n886p987q867q824
58764F61116q298p220n596l957k629j297J60J111J140Q34Q91J060Q02L56K80M46
58748F39199L66P2o0M5N30J964M440O784P748P623P679Q284Q692Q618Q723R376
58732G20083R927R753R208R042R247R031P791N734L491J384o27k295l000k591
58718G86178j873j586j294j61J557K883L676M468M807L535J032o47p23j037l339
58703G97476o747r302j0725j2078j3732j5321j6896j8479j9130j8018j5935j4273
58691F26840j3028j1256r024p250o011m659l401l149l832m316m160m034m307m470
$$ plain form
58793 656130 651629 647478 643566 639983 637184 635593 635054 634930 634957 635806 638412 642751 647830 652945 658333
58778 658333 664277 670266 675650 680600 685648 690565 694366 696238 695789 692680 686794 678807 669940 661116
58764 661116 652818 645598 640002 636045 633416 632119 632279 633390 634530 635364 636255 637315 638117 638473 638753 639199
58748 639199 639565 639637 639577 639622 640152 642116 646556 653340 661088 668711 676390 684674 693366 701984 710707 720083
58732 720083 730010 739763 748971 758013 767260 776291 784082 789816 793307 794691 794064 791769 788769 786178
58718 786178 784305 782719 781425 781264 782821 785704 789380 793848 798655 802190 803222 802575 801852 800815 797476
58703 797476 790729 781427 770702 758624 744892 729571 712675 694196 675066 657048 641113 626840
58691 626840 613812 602556 593532 586282 580271 575612 572211 569062 565230 560914 556754 552720 548413 543943
58677E43943m131l483k611j394j07Q27J631K818M175N102N781O928Q580J0231
58663E78290J1944J3996J5620J5386J2938R212N020O44l252n767p020q118r598
58650F29295j0925j1518j1249j0021p961o025n126m827m057k921k337k101j068
58637E49159O63J660J541J621K504K948K062R35Q79J394J244M74O2K35L94L17
58621E68092L55P47J468K561L970N293O173O711P123P335P192O704N844M520K909
58606F36997J452L37n49j099r67k64K54oq48j583j789j651j717k154k189q62J521
58589F24883L461M299N113O856Q705R585J0247J2077J4516J5655J5050J4029J3210
58576G57686J1747R342P153O144O054O483P511Q871R945J1165J3897J8319K2819
$$ plain form
58677 543943 539812 536329 533718 532324 532217 533044 534675 537493 541668 546770 552551 559479 568059 578290
58663 578290 590234 604230 619850 635236 648174 657386 662406 663050 659798 654031 647011 638893 629295
58650 629295 618370 606852 595603 585582 577621 571596 566470 561643 557586 554665 552328 550227 549159
58637 549159 549822 551482 553023 554644 557148 560096 562158 563093 563972 565366 566610 567084 567146 567381 567775 568092
58621 568092 568447 569194 570662 573223 577193 582486 588659 595370 602493 609828 617020 623724 629568 634088 636997
58606 636997 638449 638786 638237 637138 636171 635907 636161 636155 635307 633724 631935 630284 628567 626413 624224 623362 624883
58589 624883 628344 632643 637756 644612 653317 662902 673149 685226 699742 715397 730447 744476 757686
58576 757686 769433 778775 785928 792072 798126 804609 812120 820991 830936 842101 855998 874317 897136
58563H97136K6128K8720L1374L3704L4922L4893L3637L0735K6070K0286J3982
58552A211587P342R99l767o321p410q058q621r168r897j0776j1692j3172j6018
58539A115028k0016k4076k7643l0776l2838l2765l0833k8593k6585k3828j9919
58528H17156j5992j2905j0212p643n919n190m365k927j875j787j562l18R56J004
58514G48421K46k09m13j061k081k913l402l436k636j328p39j281j743j130j82
58499G26113k4n00r23j312j775j747j011l45p2P71K718M690N762O802Q867J1284
58483G59298J2968J4444J6788J9573K1736K3484K5456K6766K5907K3024J9394
58472I88838J5095R184J951m964j0648j5379j8938k0304j9287j7040j4495j1528
$$ plain form
58563 897136 923264 951984 983358 1017062 1051984 1086877 1120514 1151249 1177319 1197605 1211587
58552 1211587 1218929 1219928 1216161 1209840 1202430 1194372 1185751 1176583 1166686 1155910 1144218 1131046 1115028
58539 1115028 1095012 1070936 1043293 1012517 979679 946914 916081 887488 860903 837075 817156
58528 817156 801164 788259 778047 770404 764485 759295 754930 752003 750128 748341 746779 746461 747417 748421
58514 748421 748667 748458 748045 746984 744903 741990 738588 735152 732516 731188 730449 729168 727425 726295 726113
58499 726113 726089 725589 724666 723354 721579 719832 718821 718476 718404 719175 721893 726583 732345 739147 748014 759298
58483 759298 772266 786710 803498 823071 844807 868291 893747 920513 946420 969444 988838
58472 988838 1003933 1013117 1015068 1010104 999456 984077 965139 944835 925548 908508 894013 882485
58460H82485p953m208o08L119P085J0705J3276J4665J5241J5325J4750J2817Q976
58447I85675L610k209p775j2877j6896j8915j9015j8307j7158j4677j0672o720
58435H44064m200k490l81J823L079L580M446N978P673R427J1500J3535J4806J5179
58421I28019J4870J3663J1216P738L624j043n852r665j1719j2541j2959j2944
58409I12407j2257j1376j0821j0315r512q804q474p860o304m203k217l04J607
58396H21567K966L571M146N030N393M795M253M531M558K988L24j910l134l532
58382H55546k940j405N5O37Q44J250J333Q23R65K778N230O758P570Q733J0073
58367H98250J0807J1277J2185J3051J3243J3655J5290J7104J7305J6174J5385
$$ plain form
58460 882485 874532 870324 869716 872835 879920 890625 903901 918566 933807 949132 963882 976699 985675
58447 985675 989285 987076 979301 966424 949528 930613 911598 893291 876133 861456 850784 844064
58435 844064 839864 837374 836993 838816 841895 845475 849921 855899 863572 872999 884499 898034 912840 928019
58421 928019 942889 956552 967768 975506 979130 978087 972235 962570 950851 938310 925351 912407
58409 912407 900150 888774 877953 867638 858126 849322 840848 832988 826684 822481 820264 819960 821567
58396 821567 824533 828104 832250 837280 842673 847468 851721 856252 860810 863798 864122 862212 859078 855546
58382 855546 852606 851201 851256 851893 852737 853987 855320 856143 857108 859886 865116 871874 879444 888177 898250
58367 898250 909057 920334 932519 945570 958813 972468 987758 1004862 1022167 1038341 1053726
58356A053726J5087J3688J0388O035J771j581l102k476q73K31P67J437K175K643
58342A099916L481N399P745R477J0787J2365J4002J5367J7060J9261K0544J9823
58330A255227J8288J7528J6948J5150J2500J0072P316L321o54k577k770l013l347
58317A343989k412l61J325K529M369O682Q156Q813R918J1557J2579J2832J3319
58304A433295J4278J5036J5534J6151J6485J6118J5885J6620J7398J6973J5920
58293A609693J5500J5529J5485J6285J8538K0558K0730K0431K1778K3918K4632
58282A823077K4232K4614K5687K6167K6706K8802L1560L3039L3873L6036L8970
58271B152763M0549M0986M2093M3693M4484M5513M8797N3318N6443N8467O1586
$$ plain form
58356 1053726 1068813 1082501 1092889 1098924 1100695 1099114 1096012 1093536 1092663 1092894 1093661 1095098 1097273 1099916
58342 1099916 1103397 1108796 1116541 1126018 1136805 1149170 1163172 1178539 1195599 1214860 1235404 1255227
58330 1255227 1273515 1291043 1307991 1323141 1335641 1345713 1353029 1356350 1355696 1353119 1350349 1347336 1343989
58317 1343989 1341577 1341216 1342541 1345070 1349439 1356121 1364277 1373090 1383008 1394565 1407144 1419976 1433295
58304 1433295 1447573 1462609 1478143 1494294 1510779 1526897 1542782 1559402 1576800 1593773 1609693
58293 1609693 1625193 1640722 1656207 1672492 1691030 1711588 1732318 1752749 1774527 1798445 1823077
58282 1823077 1847309 1871923 1897610 1923777 1950483 1979285 2010845 2043884 2077757 2113793 2152763
58271 2152763 2193312 2234298 2276391 2320084 2364568 2410081 2458878 2512196 2568639 2627106 2688692
58260B688692O5232O6767O6259O6018O5981O4049O0709N8799N8874N9194N9961
58249C380535O3128O8237P2865P7015Q2713Q9694R5837J01365J08136J15513J21518
58238D376556J27204J35116J44475J52809J61068J71748J83450J93119K02329
58229E847874K15114K30959K46306K61652K80296L01555L22416L44618L72559
58220H423349M05426M39226M75202N18120N67679O20221O77440P44388Q20734
58211A3691785R03533R96781J108206J239046J387830J561780J773133K027533
58203B4689627K328772K691856L139061L688504M360445N187132O200110P418433
58195E9703940Q871622J0629510J2798215J5506604J8897339K3047317K7809290
$$ plain form
58260 2688692 2753924 2820691 2886950 2952968 3018949 3082998 3143707 3202506 3261380 3320574 3380535
58249 3380535 3443663 3511900 3584765 3661780 3744493 3834187 3930024 4031389 4139525 4255038 4376556
58238 4376556 4503760 4638876 4783351 4936160 5097228 5268976 5452426 5645545 5847874
58229 5847874 6062988 6293947 6540253 6801905 7082201 7383756 7706172 8050790 8423349
58220 8423349 8828775 9268001 9743203 10261323 10829002 11449223 12126663 12871051 13691785
58211 13691785 14595318 15592099 16700305 17939351 19327181 20888961 22662094 24689627
58203 24689627 27018399 29710255 32849316 36537820 40898265 46085397 52285507 59703940
58195 59703940 68575562 79205072 92003287 107509891 126407230 149454547 177263837
58188A77263837L2772094L7455158M1411588M3838515M3048795L6833138K4054008
58181D36677133O215969j2704193k8312411l8007486m1635719m0594500l6656058
58174B44982735l1408986k6168180k1869854j8887495j7019857j5744674j4562278
58167I9321411j3212589j1688775j0114193q611592p252374o071418n081500m268584
58159C3020386l599341l045651k592792k224890j919536j661063j445389j267649
58151A5264075j117191r88052q82232p98382p27750o64848o12001n69621n31331
58142H372667m92486m54945m20006l84701l48397l15440k88005k63089k39215
58133E166383k19301k04458j91686j80182j73174j70855j67961j61131j52812
$$ plain form
58188 177263837 210035931 247491089 288902677 332741192 375789987 412623125 436677133
58181 436677133 442893102 430188909 401876498 363869012 322233293 281638793 244982735
58174 244982735 213573749 187405569 165535715 146648220 129628363 113883689 99321411
58167 99321411 86108822 74420047 64305854 55694262 48441888 42370470 37288970 33020386
58159 33020386 29421045 26375394 23782602 21557712 19638176 17977113 16531724 15264075
58151 15264075 14146884 13158832 12276600 11478218 10750468 10085620 9473619 8903998 8372667
58142 8372667 7880181 7425236 7005230 6620529 6272132 5956692 5668687 5405598 5166383
58133 5166383 4947082 4742624 4550938 4370756 4197582 4026727 3858766 3697635 3544823
58124C544823j45324j37016j27029j18133j11788j05441r7499r0274q5362q0706
58114B446251p4792o9402o5797o2234n7592n3553n1078m8604m5612m4179m4952
58103A828456m5367m3816m2002m1386m0845l9628l9031l9341l8524l5792l3118
58092A389606l1506k9206k5394k2218k1136k0458j8587j6741j6381j6676j6492
58081A154811j6480j7295j8095j8440j9358k1112k2248k2097k1867k2050k1316
58070I34453j9261j7607j7286j6889j5392j3863j3078j1979j0082q828r013r166
58058G72009q130p023p022p429p479q028r699j1277j1495j0708r525p678n476
58045F61040m406m922n497n086m612m802m699l769l431m793o695p509p315o820
$$ plain form
58124 3544823 3399499 3262483 3135454 3017321 2905533 2800092 2702593 2612319 2526957 2446251
58114 2446251 2371459 2302057 2236260 2174026 2116434 2062881 2011803 1963199 1917587 1873408 1828456
58103 1828456 1783089 1739273 1697271 1655885 1615040 1575412 1536381 1497040 1458516 1422724 1389606
58092 1389606 1358100 1328894 1303500 1281282 1260146 1239688 1221101 1204360 1187979 1171303 1154811
58081 1154811 1138331 1121036 1102941 1084501 1065143 1044031 1021783 999686 977819 955769 934453
58070 934453 915192 897585 880299 863410 848018 834155 821077 809098 799016 790188 781175 772009
58058 772009 763879 756856 749834 742405 734926 726898 717199 705922 694427 683719 674194 666516 661040
58045 661040 656634 651712 646215 641129 636517 631715 627016 623247 619816 615023 608328 600819 593504 586684
58031E86684n872m554m149n404p189q211q772r500r870r234q069o982n712m181
58017D88985l213l156l163k753k663l221l469k908k545l076l540k985k013j514
58003D48766j249p57l09L1R48K513L746M355N320O795P226N711L535K078Q89q19
57987D88779k345k800k784l239l880m208m803o138p265p183o457o104n912n185
57973D20476m168l404k648j634r77j128j395j107p87j037j336j087q16j147j592
57958C96213j487j170j135j042o10n03j184j945k108k069k207j906p96K92P93
57943C79136J538L147M625M949M875N669P132Q391R613J1329J3032J3974J4499
57930D81909J5116J5055J3372J0603P865N096J752j589m035o012q365j0456j0912
$$ plain form
58031 586684 580812 576258 572109 566705 559516 551305 542533 533033 523163 513929 505860 498878 493166 488985
58017 488985 485772 482616 479453 476700 474037 470816 467347 464439 461894 458818 455278 452293 450280 448766
58003 448766 447517 446760 446451 446482 447430 449943 453689 458044 463364 470159 477385 483096 486631 488709 489598 488779
57987 488779 486434 483634 480850 477611 473731 469523 464720 458582 451317 444134 437677 431573 425661 420476
57973 420476 416308 412904 410256 408622 407645 406517 405122 404015 403228 402191 400855 399768 398952 397805 396213
57958 396213 394726 393556 392421 391379 390769 390266 389082 387137 385029 382960 380753 378847 378051 378343 379136
57943 379136 380674 383821 388446 393395 398270 403939 411071 419462 429075 440404 453436 467410 481909
57930 481909 497025 512080 525452 536055 543920 549016 550768 549179 545144 539132 530767 520311 509399
57917E09399r934r036q775q371p504o840o723o586n875m566k879j335p85j496
57903D28694k520k830k667k903l649m436n167n837n844m763l240k139j257M6J545
57888C83033K567L090L391L269K746K770L846M730L930J960N47Q7m90j647k652
57873D11177l043l198l363l321l036k656j935o54P01J587K340L397M151L848L122
57858D09117L241M158M760M780M925N317N291M743M258L834K891J512L88n25j887
57843D56803l558m609m926n358o211o900p289p893q491q007o282m606l901l590
57829C75182k821j780j043n66J4O87J238J528J394Q57N29J032J925K066J210K29
57813C81681l24q59j597j972j662j241j243j510j980l211n285o995p030n503l668
$$ plain form
57917 509399 499465 490429 481654 473283 465779 458939 452216 445630 439755 435189 432310 430975 430190 428694
57903 428694 426174 423344 420677 417774 414125 409689 404522 398685 392841 388078 384838 382699 381442 381488 383033
57888 383033 385600 388690 392081 395350 398096 400866 404712 409442 413372 415332 415879 415966 415476 413829 411177
57873 411177 408134 404936 401573 398252 395216 392560 390625 389971 390672 392259 394599 397996 402147 405995 409117
57858 409117 412358 416516 421276 426056 430981 436298 441589 446332 450590 454424 457315 458827 459215 458690 456803
57843 456803 453245 448636 443710 438352 432141 425241 417952 410059 401568 393561 387279 382673 378772 375182
57829 375182 372361 370581 369538 368972 368986 369673 370911 372439 373833 374690 375219 376251 378176 380242 381452 381681
57813 381681 381357 380498 378901 376929 375267 374026 372783 371273 369293 366082 360797 353802 346772 341269 337601
57798C37601k402j691j272j086j057q39OJ516L052L700L352L030L675M843N360
57783C57788N125N218O152P038O976O374O164O377O265N544M753M374M130L357
57769D35635J827Oj505k724m146n880p307p936q174q725r534r873r382q334p027
57754C46921n539m083l031k432j988j439n88Q36K724M157M198L135K250K275K793
57739C50189L150L171K817J990J066Q46J414J666O41j155k334k347j915j780j765
57724C55654j325o34m93j193k024k214k010k260l118l792l627k809j898j320j482
57709C25455k612m122m899m737m664n327n841n128l617k586k335k174j851j815
57695B73747k123k109j373k94N33P70L13n99j308j340r04l62M02J496K409K708
$$ plain form
57798 337601 335199 333508 332236 331150 330093 329254 329260 330776 333828 337528 340880 343910 347585 352428 357788
57783 357788 362913 368131 374283 381321 388297 394671 400835 407212 413477 419021 423774 428148 432278 435635
57769 435635 437462 437468 435963 433239 429093 423213 415906 407970 399796 391071 381537 371664 362282 353948 346921
57754 346921 341382 337299 334268 331836 329848 328409 327821 328657 331381 335538 339736 342871 345121 347396 350189
57739 350189 353339 356510 359327 361317 362383 363229 364643 366309 366950 365795 363461 361114 359199 357419 355654
57724 355654 354329 353695 353202 352009 349985 347771 345761 343501 340383 336591 332964 330155 328257 326937 325455
57709 325455 322843 318721 313822 309085 304421 299094 293253 288125 284508 281922 279587 277413 275562 273747
57695 273747 271624 269515 268142 267848 268381 269151 269464 268865 267557 266217 265313 264951 265353 266849 269258 271966
57679B71966K933L884N388O808Q343J0709J3775J6803K0013K4670L1396L9503
57667D56191M8136N7026O5838P3597P8751P8805P0122M9967J9803j4119m4158
57656I39959o5197p5777p7163p2213o4179n5363m6688l8459l1100k4951k0047
57645C68822j6309j3514j1079q549o315n183n174n419n219m501l340j911q82q89
57631B80538j497j612j024n39n83o83n52n02o21o11p26j644l052l671l099k441
57615B57681k509k705k423k218k620k872j969k04J420K561L372L663L283K766
57601B57226K654K600K071J344R25M39p75k332l107k749j950j314q59o21q74j542
57585B51136k032j929j458j134j186j449j590j458j262j321j605j799j839k038
$$ plain form
57679 271966 274899 278783 284171 290979 299322 310031 323806 340609 360622 385292 416688 456191
57667 456191 504327 561353 627191 700788 779539 858344 928466 978433 998236 984117 939959
57656 939959 874762 798985 721822 649609 585430 530067 483379 444920 413820 388869 368822
57645 368822 352513 338999 327920 319371 313056 307873 302699 297280 292061 287560 284220 282309 281427 280538
57631 280538 279041 277429 276405 275866 275283 274600 274048 273546 272925 272314 271588 269944 266892 263221 260122 257681
57615 257681 255172 252467 250044 247826 245206 242334 240365 240161 241581 244142 247514 251177 254460 257226
57601 257226 259880 262480 264551 265895 266820 267259 266484 264152 261045 258296 256346 255032 254173 253552 252678 251136
57585 251136 249104 247175 245717 244583 243397 241948 240358 238900 237638 236317 234712 232913 231074 229036
57571B29036k535k995l067k803k441k125j913j762j506j201j366k245l022k574
57557A97481j078Q5J70j22lL29M27M94Q54J318J726K428L562M512M705M306L607
57540B24801K464R62j02k25L8J4j3M42R07N55m79j278j376r73k84N64J219J473
57522B28709J675K127K380J820O70k74o31n34q7O27J248J540J770K127K150J386
57506B46703K26o47j221j838k285k087j444j004r34r20r52j264j636j576j156
57491B27965r05r50q73m26K30Q68J239R88J03p04p79m76o38j278j542r80j50J33
57473B21825l47j185j775j791j556j698k223k319j527n18j52l03l57l06m31l48
57457B04989M43J338J152j00j051q25l4L11J09n5J45M54L87k71j105j364q25j01
$$ plain form
57571 229036 226501 223506 220439 217636 215195 213070 211157 209395 207889 206688 205322 203077 200055 197481
57557 197481 196403 196488 196658 196536 196533 196862 197289 197783 198637 199955 201681 204109 207671 212183 216888 221194 224801
57540 224801 227265 228227 228125 227900 227938 227952 227939 228381 229288 229843 229364 228086 226710 225737 225453 226017 227236 228709
57522 228709 230384 232511 234891 236711 237381 237107 236476 235942 235855 236482 237730 239270 241040 243167 245317 246703
57506 246703 246929 246282 245061 243223 240938 238851 237407 236403 235469 234549 233597 232333 230697 229121 227965
57491 227965 227060 226110 225237 224811 225041 225909 227148 228136 228239 227535 226756 226280 225642 224364 222822 221842 221692 221825
57473 221825 221478 220293 218518 216727 215171 213473 211250 208931 207404 206886 206734 206431 206074 205768 205337 204989
57457 204989 205432 206770 207922 207822 206771 205946 205912 206223 206332 206277 206422 206876 207263 206992 205887 204523 203698 203597
57439B03597K41L57N37N23J51L9O95J437J305O40N37J023J160Q40J013J879K307
57422B18281J586N79M36J061J543J363O14m12j264j463r95l22K38P33J108J159
57406B24245R91R15P82J58p66j269j189j120j248r81l9R78J477J542J324O68j51
57389B26317k45P31J917K412K364K372K496K583K832L266L237K372J480J563K282
57374B57979K352J373L02O1M12M78k18j406k444k808k427j669r78n42l67l93m39
57357B49266k65J01L46K90J52K45O69J372K227K879K944K520K181K277K597K785
57341B72586K738K385J601N40k82n42m11p6N23J253J576J174M27q5k14j14O5M3
57323B83187n02j292j368k82J092J528R78M80O91J207J336R60M39O9j09j71j34
$$ plain form
57439 203597 203838 204195 204732 205255 205406 205445 206140 207577 208882 209522 210059 211082 212242 213082 214095 215974 218281
57422 218281 219867 220446 220882 221943 223486 224849 225463 225051 223787 222324 221329 221007 221245 221978 223086 224245
57406 224245 225236 226151 226933 227091 226325 225056 223867 222747 221499 220518 220479 221457 222934 224476 225800 226468 226317
57389 226317 226072 226803 228720 231132 233496 235868 238364 240947 243779 247045 250282 252654 254134 255697 257979
57374 257979 260331 261704 262006 262067 262479 262957 262739 261333 258889 256081 253654 251985 251007 250465 250098 249705 249266
57357 249266 249001 249102 249448 249738 249890 250135 250804 252176 254403 257282 260226 262746 264927 267204 269801 272586
57341 272586 275324 277709 279310 279850 279568 279026 278615 278539 279062 280315 281891 283065 283492 283407 283193 283079 283144 283187
57323 283187 282685 281393 280025 279743 280835 282363 283341 283821 284512 285719 287055 288015 288454 288523 288414 288243 288109
57306B88109N0K88K58k42q27q31j50O47J151J548J959K009J584J442K289L567
57290C02851L956L080J970J715K292K940L203L195L133K991K652K249K192K730
57276C41149L558M086M152M142M254M121L487K843K804L066K656J309J3j46P47
57261C82241J622J684J107O41P23J203J717K181K740L403L885L920L580L165K919
57246D16731K917L125L392L448L146K711K637L182M032M632M822M986N428N843
57232D71032N705N092M622M579M616M548M850N856O989P431P332P524Q240Q868
57218E57284R009Q962R046R150R254R708J0606J1383J1433J0833J0199J0109J0751
57205F87727J1779J2400J2094J1359J1273J2128J3142J3697J4162J5023J5907
$$ plain form
57306 288109 288159 288447 288705 288463 287636 286805 286655 287302 288453 290001 291960 293969 295553 296995 299284 302851
57290 302851 306807 309887 311857 313572 315864 318804 322007 325202 328335 331326 333978 336227 338419 341149
57276 341149 344707 348793 352945 357087 361341 365462 368949 371792 374596 377662 380318 381627 381640 381494 382241
57261 382241 383863 385547 386654 387295 388018 389221 390938 393119 395859 399262 403147 407067 410647 413812 416731
57246 416731 419648 422773 426165 429613 432759 435470 438107 441289 445321 449953 454775 459761 465189 471032
57232 471032 476737 481829 486451 491030 495646 500194 505044 510900 517889 525320 532652 540176 548416 557284
57218 557284 566293 575255 584301 593451 602705 612413 623019 634402 645835 656668 666867 676976 687727
57205 687727 699506 711906 724000 735359 746632 758760 771902 785599 799761 814784 830691
57194H30691J6071J5518J4977J4976J5464J6183J6960J7650J8051J7913J7038
57183A011492J5667J4732J5227J7055J8933J9715J9440J8892J8605J8646J8908
57172A207312J9149J9079J8816J8938J9777K0946K1922K2640K3161K3245K2669
57161A437654K1659K0594J9657J9153J9657K1267K3079K4047K4141K4139K4535
57150A679582K5209K5980K6773K7360K7475K7254K7201K7621K8357K9002K9287
57139A981101K9449L0197L1948L3969L4954L4684L4478L5559L7715M0140M2826
57128B367020M6155M9707N2654N5113N8130O2290O7273P2747P8874Q5797R3448
57117C089208J02023J11899J22864J34098J45180J56692J69643J84801K02783
$$ plain form
57194 830691 846762 862280 877257 892233 907697 923880 940840 958490 976541 994454 1011492
57183 1011492 1027159 1041891 1057118 1074173 1093106 1112821 1132261 1151153 1169758 1188404 1207312
57172 1207312 1226461 1245540 1264356 1283294 1303071 1324017 1345939 1368579 1391740 1414985 1437654
57161 1437654 1459313 1479907 1499564 1518717 1538374 1559641 1582720 1606767 1630908 1655047 1679582
57150 1679582 1704791 1730771 1757544 1784904 1812379 1839633 1866834 1894455 1922812 1951814 1981101
57139 1981101 2010550 2040747 2072695 2106664 2141618 2176302 2210780 2246339 2284054 2324194 2367020
57128 2367020 2413175 2462882 2515536 2570649 2628779 2691069 2758342 2831089 2909963 2995760 3089208
57117 3089208 3191231 3303130 3425994 3560092 3705272 3861964 4031607 4216408 4419191
57108D419191K24245K49652K79347L14100L55400M04975M64420N35638O21622
57099G868590P26608Q55536J013471J205350J435749J708090K023429K379778
57091A9216601K772592L195422L639359M091508M533771M942581N290536N552125
57083E3234495N712349N769085N720225N542376N183252M581708L702366K558026
57075I2003882J207911k57828j733898l114406m309290n258524n936387o345045
57067F6256415o504543o445286o204046n821633n340840m803633m247655l703304
57059B3185475l192462k728618k317870j960854j655118j396551j179550r97570
57051G756882q44763p17091o11493n24449m52068l91336l40465k98046k62381
$$ plain form
57108 4419191 4643436 4893088 5172435 5486535 5841935 6246910 6711330 7246968 7868590
57099 7868590 8595198 9450734 10464205 11669555 13105304 14813394 16836823 19216601
57091 19216601 21989193 25184615 28823974 32915482 37449253 42391834 47682370 53234495
57083 53234495 58946844 64715929 70436154 75978530 81161782 85743490 89445856 92003882
57075 92003882 93211793 92953965 91220067 88105661 83796371 78537847 72601460 66256415
57067 66256415 59751872 53306586 47102540 41280907 35940067 31136434 26888779 23185475
57059 23185475 19993013 17264395 14946525 12985671 11330553 9934002 8754452 7756882
57051 7756882 6912119 6195028 5583535 5059086 4607018 4215682 3875217 3577171 3314790
57042C314790k31835k05362j82405j62487j45077j29837j16745j05883r7019q9520
57032A848620q2717p6259o9965o3539n6656m9204m1116l1937k0938p712P487K4166
57020A380230M2037O0462P6691Q4460P5579M5404j769n3241r5245j20520j29529
57009A364559j26407j15438j00561q5329p1839o0306n0335m1978l5313k9860k5072
56998F22121k0869j7366j4490j2233j0662r547q414p259o460n867m670k499O0
56985E01845K432M841P616J0300J1862J1325P895J310p392j5918k2249k5831k7093
56972D60943k6463k4321k1349j8198j5104j2135r408o745l656o5L586P231J1450
56959C45766J6180K0078K1996K2421K2430K1588J8005J0455l21j2207k2802l0118
$$ plain form
57042 3314790 3082955 2877593 2695188 2532701 2387624 2257787 2141042 2035159 1938140 1848620
57032 1848620 1765903 1689644 1619679 1556140 1499484 1450280 1409164 1377227 1356289 1348577 1356064 1380230
57020 1380230 1422267 1482729 1559420 1643880 1719459 1764863 1763094 1709853 1614608 1494088 1364559
57009 1364559 1238152 1122714 1022153 936824 864985 804679 754344 712366 677053 647193 622121
56998 622121 601252 583886 569396 557163 546501 536954 528540 521281 514821 508954 504284 501785 501845
56985 501845 504277 509118 516734 527034 538896 550221 558116 559426 552034 536116 513867 488036 460943
56972 460943 434480 410159 388810 370612 355508 343373 333965 327220 323564 323499 327085 334316 345766
56959 345766 361946 382024 404020 426441 448871 470459 488464 498919 498598 486391 463589 433471
56947D33471l3267l2837l0133k5999k0825j5458j1160q357o106l211N12M461Q409
56934B59500J2845J8140K3771K8711L2285L4122L3140K7482J6296J390j3709k6274
56922D47699l5286m0244m0617l7038l1742k6849k2781j9053j5757j3297j1357
56911A53678r309p341o139n633n060m187l536l334l087k365j383n74q4K16O13
56896A02475J494K984M681O097P284Q652J0370J2392J4775J7471J9954K1635K2408
56883B52672K2122J9789J4199N552m180j2624j8351k0924k0519j7890j4263j0734
56871A94849p734m990j870K075O613J0987J4905J9090K4409L0697L7061M3072
56859C69164M8768N3302N4353M9403L7490J9834o06k0040l5053m3778m6309m4082
$$ plain form
56947 433471 400204 367367 337234 311235 290410 274952 263792 255435 249329 246118 246630 251091 259500
56934 259500 272345 290485 314256 342967 375252 409374 442514 469996 486292 487682 473973 447699
56922 447699 412413 372169 331552 294514 262772 235923 213142 194089 178332 165035 153678
56911 153678 144369 137028 130889 125256 120196 116009 112473 109139 106052 103687 102304 101730 101646 101862 102475
56896 102475 103969 106953 111634 117731 125015 133667 144037 156429 171204 188675 208629 230264 252672
56883 252672 274794 294583 308782 314334 310154 297530 279179 258255 237736 219846 205583 194849
56871 194849 187115 182125 180255 182330 188943 199930 214835 233925 258334 289031 326092 369164
56859 369164 417932 471234 525587 574990 612480 632314 631708 611668 576615 532837 486528 442446
56847D42446l8892l2189k4775j6936q914j080O384J3724K1281K9264L8090M8408
56835D76811O0159P1927Q1776Q8371R0316Q4715O7981L9163K399l4487o3995q2201
56823H82935q9216q7563q0239o9794n8219m6790l5780k4939j4525n439K066R197
56811C81694J7485K7176L7307M6904N5356O1844O5022O2996N3312L4029O339k4049
56799H25415m9612o5724p2372p1935o6745n8756m9775m0866l2156k3801j6420
56788B77253j0247m655R73O504J1725J6974K2507K7786L1898L4111L3501K8650
56776D76980J8647M321j1770k6460l7133m2523m3158m0853l7341l3420k9244k4871
56764A73175k0364j5920j2182r889q897q116o754n105l784k857k123j684j608
$$ plain form
56847 442446 403554 371365 346590 329654 320740 319660 326044 339768 361049 390313 428403 476811
56835 476811 536970 608897 690673 779044 869360 954075 1022056 1061219 1063618 1029131 965136 882935
56823 882935 793719 706156 625917 556123 497904 451114 415334 390395 375870 370431 372497 381694
56811 381694 399179 426355 463662 510566 565922 627766 692788 755784 809096 843125 849464 825415
56799 825415 775803 710079 637707 565772 499027 440271 390496 349630 317474 293673 277253
56788 277253 267006 262351 263324 269828 281553 298527 321034 348820 380718 414829 448330 476980
56776 476980 495627 499948 488178 461718 424585 382062 338904 298051 260710 227290 198046 173175
56764 173175 152811 136891 124709 114820 105923 97807 91053 85948 82164 79307 77184 75500 73892
56751G3892j581j404j402j793k092j745r85m79m20n29o17o05k72L78P53L03o54
56734F0748j234j045m28J75N52N74K69J6K01O95J100J326J590J881K001J985K045
56717G2451K103J906J618J746K366K905K897K554K352K369K278J847J247R42J350
56702A02931K405L404L520K663J619J140J053O38k53r03p10qM45N16O57R72R96
56685A21085N32L9j05j46k84o3Q73J837J782P28l24q48j260j889k346k279k038
56668A15294k130k519k840k880k579j871r08o5M31O47O11K89l5J28Q00J479J888
56651A05740K260K664K698K202J735J842K301K487K148J455O40l9l09j37J64L19
56635A28170J89m73j815l279l886l489k986k937k701j621l53l4n65p67j48L97
$$ plain form
56751 73892 72311 70907 69505 67712 65620 63875 62890 62411 61991 61462 60845 60240 59968 60346 61099 61402 60748
56734 60748 59514 58469 58041 58216 58768 59342 59611 59627 59828 60523 61623 62949 64539 66420 68421 70406 72451
56717 72451 74554 76460 78078 79824 82190 85095 87992 90546 92898 95267 97545 99392 100639 101581 102931
56702 102931 105336 108740 112260 114923 116542 117682 118735 119373 119120 118217 117507 117499 117944 118460 119117 120089 121085
56685 121085 121617 121656 121551 121405 121121 121058 121931 123768 125550 126278 125954 125106 123846 121957 119611 117332 115294
56668 115294 113164 110645 107805 104925 102346 100475 99567 99502 99933 100580 101191 101480 101445 101573 102373 103852 105740
56651 105740 108000 110664 113362 115564 117299 119141 121442 123929 126077 127532 128172 128133 127824 127687 127851 128170
56635 128170 128359 127886 126071 122792 118906 115417 112431 109494 106793 105172 104819 104785 104220 103453 103305 103702
56619A03702l6j040j406o18N80J154J020R63J379J637J076K00J43J039J819J666
56603A13278Q53Ko10p52j54Q12J202P52K78L53M18o9n70l95K8r9m58j7J343K555
56583A18750K649J625J64q47p35L96J609K135K169K270K437K333J998J690J419
56568A40062J285J773L020M233M683M840N629O967Q036Q688R573J0959J2354J3196
56554B35298J3089J1555Q471M662J289j358l599n242n665n034m340m185m296m309
56540B36336m162l738k993k494k834l576l695l177l074l820m553m479l923l498
56526A86320l175k675k076j461n65P04J871K420K297J613M38q35j514j486j527
56511A80349k328l640m707n136m945m222l138k070j314q04l61%J31m0m49q09o63
$$ plain form
56619 103702 103666 102626 101220 100602 101182 102336 103356 104319 105698 107335 108411 108611 108754 109793 111612 113278
56603 113278 114131 114133 113523 112771 112617 113429 114631 115383 115661 116014 116432 116363 115793 115398 115426 115327 114869 114852 116195 118750
56583 118750 121399 123024 123188 122341 121606 122002 123611 125746 127915 130185 132622 134955 136953 138643 140062
56568 140062 141347 143120 146140 150373 155056 159896 165525 172492 180528 189216 198789 209748 222102 235298
56554 235298 248387 259942 268413 273075 274364 273006 269407 264165 258500 253466 249126 244941 240645 236336
56540 236336 232174 228436 225443 222949 220115 216539 212844 209667 206593 202773 198220 193741 189818 186320
56526 186320 183145 180470 178394 176933 176368 177072 178943 181363 183660 185273 185711 184876 183362 181876 180349
56511 180349 178021 174381 169674 164538 159593 155371 152233 150163 148849 148045 147684 147684 147815 147775 147326 146517 145854
56494A45854J12R59J202R21P71J006J199J030P13N24M33L90M99O99P10M60J85
56477A57667M7k5k6J42L92N40O76J034J496J752J769J658J218L15m73l85L12N16
56459A68625j53q30o98J2O53J055J359J486J307R33N71L11K73N36Q44Q33O28P53
56441A78498J314J823J888J539Q59j23j045j420j272j061q44l04L33K75o23j445
56425A78392j403p86l45l30m82n28k77L05Q88J082J030J139J248Q51K03K28J039
56408A82254J530R47o8n57n59n89n35P0J147K148K798L096K919K167J163L60j44
56391A98147m82o44n38k10K30O94R84R37P93J055J772K350K241J461M53k07k1
56374B09015R25J701J407L24n03p29r34j339j377p82q0L73R44J822K470K502K358
$$ plain form
56494 145854 145966 146925 148127 149048 149819 150825 152024 153054 153767 154291 154724 155114 155613 156312 157022 157482 157667
56477 157667 157714 157689 157663 157805 158197 158737 159413 160447 161943 163695 165464 167122 168340 168655 168182 167797 168109 168625
56459 168625 168472 167642 166944 166956 167609 168664 170023 171509 172816 173749 174320 174631 174904 175440 176284 177117 177745 178498
56441 178498 179812 181635 183523 185062 185921 185798 184753 183333 182061 181000 180156 179852 180185 180460 179837 178392
56425 178392 176989 176203 175858 175528 175046 174518 174241 174546 175434 176516 177546 178685 179933 180784 180987 181215 182254
56408 182254 183784 184731 184663 184106 183547 182958 182423 182493 183640 185788 188586 191682 194601 196768 197931 198291 198147
56391 198147 197665 197021 196483 196273 196503 197197 198181 199118 199911 200966 202738 205088 207329 208790 209243 209036 209015
56374 209015 209940 211641 213048 213372 212869 212140 211206 209867 208490 207708 207628 208001 208945 210767 213237 215739 218097
56357B18097K544K832K696K016R59j64p24k00R10J459J229J165J717K035J450
56342B38021O17M11O35O91P09J111J713K106K331K499K364J953J963K793L794
56327B63711M144L819L243K650K401K925L700L323J504j13j32N84L87n97r00j53
56311B90496N12L70k8O8O73J347J710J621J431J814K804L563L649L904N183O834
56295C25951P451O638N104L474K091J536K109L021L188K688K484K923L495L924
56281C76077M404M893N184N609O664P940Q356P655O792O733P531Q636R501R864
56267D75839J0012J0744J2515J4680J6111J6502J6669J7703K0194K3954K8040
56256F62963L1436L4166L7386M1965M7549N3457N9755O6724P3974Q0918Q7624
$$ plain form
56357 218097 220641 223473 226169 228185 229144 228980 228256 228056 228966 230425 231654 232819 234536 236571 238021
56342 238021 238638 239049 239684 240375 241084 242195 243908 246014 248345 250844 253208 255161 257124 259917 263711
56327 263711 267855 271674 274917 277567 279968 282893 286593 289916 291420 291307 291175 291759 292146 291549 290649 290496
56311 290496 291008 291378 291350 291418 292091 293438 295148 296769 298200 300014 302818 306381 310030 313934 319117 325951
56295 325951 333402 340040 345144 348618 350709 352245 354354 357375 360563 363251 365735 368658 372153 376077
56281 376077 380481 385374 390558 396167 402831 410771 419127 426782 433574 440307 447838 456474 465975 475839
56267 475839 485851 496595 509110 523790 539901 556403 573072 590775 610969 634923 662963
56256 662963 694399 728565 765951 807916 855465 908922 968677 1035401 1109375 1190293 1277917
56245A277917R4294J00431J05391J09225J12075J13304J12082J08429J02624R4155
56235B329927Q2300O7435N0756L3061J4696l702k1408l8154n3583o6602p6320
56224B318406q3195q8255r1668r3171r3284r2795r1444q8463q4181p9738p5490
56213A356722p0913o6036o1565n7701n3956n0216m6785m3491l9828l5987l2662
56202G97582k9918k7231k4522k2123j9851j7313j4927j3477j2727j1631r893q215
56190E85754o983n911m934m337l942l237k362j977k058j898j283p71p11q73r94
56175E43483q98k41R82J960K042J842K391L502M109L946L799M211N024N967O763
56160E88882P026O927P474R101J0696J1296J1821J3665J6249J7923J8728K0296
$$ plain form
56245 1277917 1372211 1472642 1578033 1687258 1799333 1912637 2024719 2133148 2235772 2329927
56235 2329927 2412227 2479662 2530418 2563479 2578175 2574473 2553065 2514911 2461328 2394726 2318406
56224 2318406 2235211 2146956 2055288 1962117 1868833 1776038 1684594 1596131 1511950 1432212 1356722
56213 1356722 1285809 1219773 1158208 1100507 1046551 996335 949550 906059 866231 830244 797582
56202 797582 767664 740433 715911 693788 673937 656624 641697 628220 615493 603862 593969 585754
56190 585754 578771 572860 567926 563589 559647 556410 554048 552071 550013 548115 546832 546061 545350 544477 543483
56175 543483 542585 542344 543326 545286 547328 549170 551561 555063 559172 563118 566917 571128 576152 582119 588882
56160 588882 595908 602835 610309 619410 630106 641402 653223 666888 683137 701060 719788 740084
56148G40084K3247K6664L0156L4470L9962M6236N3513O2714P3938Q6303R9367
56137A316654J13183J26874J38680J47416J52364J51873J44024J29100J10029
56128B530197R0289P2782O0146N3704N1414M8645M1717K9865J4180l299j9376
56117B970264l0945l7555m1727m6547n4161o6159q3239j03781j24193j40994j51642
56106B089321j54078j47801j35398j20846j05992r0477p4850o1237n0523m1385
56096A106734l2797k5394j9698j5095j1261q699p147n379l203j777j376p63O35
56083I74780J882K403K833L473L783L967N040O917Q238Q595Q938R566R835J0108
56069A060358J1530J3538J4109J3135J2955J4768J6997J8038J8221J8121J7370
$$ plain form
56148 740084 763331 789995 820151 854621 894583 940819 994332 1057046 1130984 1217287 1316654
56137 1316654 1429837 1556711 1695391 1842807 1995171 2147044 2291068 2420168 2530197
56128 2530197 2620486 2693268 2753414 2807118 2858532 2907177 2948894 2978759 2992939 2989640 2970264
56117 2970264 2939319 2901764 2860037 2813490 2759329 2693170 2609931 2506150 2381957 2240963 2089321
56106 2089321 1935243 1787442 1652044 1531198 1425206 1334729 1259879 1198642 1148119 1106734
56096 1106734 1073937 1048543 1028845 1013750 1002489 993790 986643 981264 978061 976284 974908 974145 974780
56083 974780 976662 979065 981898 985371 989154 993121 998161 1005078 1013316 1021911 1030849 1040415 1050250 1060358
56069 1060358 1071888 1085426 1099535 1112670 1125625 1140393 1157390 1175428 1193649 1211770 1229140
56058A229140J6104J5352J5081J4050J2248J1169J1132J0942J0727J2195J5260
56047A373400J7404J7521J7422J8354J9010J8454J8163J9444K1401K2981K4666
56036A588220K6694K7998K8298K8905L0333L1471L2026L3254L5368L7023L8220
56025A937810M0710M4526M7284M7991M8364M9378M9928N0039N1730N5339N8511
56014B481610O0383O3083O7575P1669P3836P5507P8026Q0861Q4173Q9373R5794
56003C321890J00701J03865J08067J14061J19603J24495J31461J40662J48738
55994D413543J54885J62370J72296J81771J90187K01122K15785K30858K45260
55985F168077K62430K83459L04790L25574L50109L80064M11749M44280M82624
$$ plain form
56058 1229140 1245244 1260596 1275677 1289727 1301975 1313144 1324276 1335218 1345945 1358140 1373400
56047 1373400 1390804 1408325 1425747 1444101 1463111 1481565 1499728 1519172 1540573 1563554 1588220
56036 1588220 1614914 1642912 1671210 1700115 1730448 1761919 1793945 1827199 1862567 1899590 1937810
56025 1937810 1978520 2023046 2070330 2118321 2166685 2216063 2265991 2316030 2367760 2423099 2481610
56014 2481610 2541993 2605076 2672651 2744320 2818156 2893663 2971689 3052550 3136723 3226096 3321890
56003 3321890 3422591 3526456 3634523 3748584 3868187 3992682 4124143 4264805 4413543
55994 4413543 4568428 4730798 4903094 5084865 5275052 5476174 5691959 5922817 6168077
55985 6168077 6430507 6713966 7018756 7344330 7694439 8074503 8486252 8930532 9413156
55976I413156N29106N79942O33810O95501P67490Q46748R33711J035308J155523
55967A6590295J293015J451755J643572J876935K155133K489100K900031L407389
55959C3807225M028837M792777N733648O875303Q242098R891032J1917759J4441211
55951I9729890J7598753K1498646K6074249L0982984L5743107L9920519M2895921
55944C14444069M3277933L8891570K8052524J1334634p954449k5338380l7506063
55937C65201838m3517872m4337169m1656911l7078947l1831863k6716076k2127572
55930A17935428j8184948j4888571j2193824j0016375q256524o837377n702617
55923D1855192m792676m050788l443336k951427k549738k211387j924507j686095
$$ plain form
55976 9413156 9942262 10522204 11156014 11851515 12619005 13465753 14399464 15434772 16590295
55967 16590295 17883310 19335065 20978637 22855572 25010705 27499805 30399836 33807225
55959 33807225 37836062 42628839 48362487 55237790 63479888 73370920 85288679 99729890
55951 99729890 117328643 138827289 164901538 195884522 231627629 271548148 314444069
55944 314444069 357722002 396613572 424666096 436000730 428046281 402707901 365201838
55937 365201838 321683966 277346797 235689886 198610939 166779076 140063000 117935428
55930 117935428 99750480 84861909 72668085 62651710 54395186 47557809 41855192
55923 41855192 37062516 33011728 29568392 26616965 24067227 21855840 19931333 18245238
55915A8245238j486161j312394j162709j038884r34084q39194p54902o85591o27357
55906I403962n73134n23780m83184m47929m12125l77642l49624l26265l02261
55897E608018k78350k58607k41926k24513k07476j94133j82922j70296j57646
55888C692149j48408j41150j32110j21968j13884j07387j00011r2342q6019p9455
55878B569415p0836o2516n7308n3507m8766m5645m7730n3117n7378o0283o3965
55867A948364o6963o6053o2154n8838n6432n2704m8000m4652m2461l9419l5850
55856A374838l3573l2152l0037k8126k8154k8864k7802k5612k4748k5191k5251
55845A065328k5212k6285k7268k6089k3606k2198k1728k0470j8841j8479j8719
$$ plain form
55915 18245238 16759077 15446683 14283974 13245090 12311006 11471812 10716910 10031319 9403962
55906 9403962 8830828 8307048 7823864 7375935 6963810 6586168 6236544 5910279 5608018
55897 5608018 5329668 5071061 4829135 4604622 4397146 4203013 4020091 3849795 3692149
55888 3692149 3543741 3402591 3270481 3148513 3034629 2927242 2827231 2734889 2648870 2569415
55878 2569415 2498579 2436063 2378755 2325248 2276482 2230837 2183107 2129990 2072612 2012329 1948364
55867 1948364 1881401 1815348 1753194 1694356 1637924 1585220 1537220 1492568 1450107 1410688 1374838
55856 1374838 1341265 1309113 1279076 1250950 1222796 1193932 1166130 1140518 1115770 1090579 1065328
55845 1065328 1040116 1013831 986563 960474 936868 914670 892942 872472 853631 835152 816433
55834H16433j7637j5634j4495j3861j2142r989r313r625q834o983n924n948n932
55821F80116o145p757j0106j1419j1681j1985j1900j0370q389p801q157p568n913
55808E60925m399k850l93K028K864K909M092O108P189P374P898Q109O260K790
55794F10904l24k922o241r742j1687j2469j3918j5566j5055j2247r534p841n643
55781D87715k426L9N36k32j712m193o877p797o415m050j371K294O814J0887J4134
55766D87346J7101J8678J6142Q681j180j0371j7532k2051k3223k1407j8313j5229
55754D18642j2254r617q102p760p725p701q139q807q738p835p033o760o640o649
55740C04882o954o841n517l778k998k717j350P74J448r6k087k874k654k168j643
$$ plain form
55834 816433 798796 783162 768667 754806 742664 732675 723362 713737 704903 697920 691996 686048 680116
55821 680116 673971 666214 656108 644689 633008 621023 609123 598753 590364 582563 574406 566838 560925
55808 560925 556526 553676 553283 555311 558175 561084 565176 571284 578473 585847 593745 601854 608114 610904
55794 610904 610580 607658 601417 591675 579988 567519 553601 538035 522980 510733 501199 493358 487715
55781 487715 485289 485328 485864 485632 483920 479727 472850 465053 458638 454588 453217 455511 462325 473212 487346
55766 487346 504447 523125 539267 547948 546768 536397 518865 496814 473591 452184 433871 418642
55754 418642 406388 396771 388669 380909 373184 365483 357344 348537 339799 331964 324931 318171 311531 304882
55740 304882 297928 291087 285570 281792 278794 276077 274727 275501 276949 276853 274766 271892 269238 267070 265427
55725B65427j567k622m284n125m895m649m645m003k720j959j895j264L51J748
55711B27898K200K521L350M214M943O177P650P768N817L026N85j810m575o956
55697B62808q168q555q656q287p300o156n092l744k159j021m48J94R52J092P22
55682B06182J094K701M423N205N249M988M285L321K919L142K846J399l03j270
55668B46181j694k111k420k487k577k581j880n94K43K84M26J136J592J292J077
55653B35887J603K069J540N39J33K07k04j474l168m785o030o714o889o740o155
55638A99819n006l810l256l051k373j499j659k971m043m030l630l418k772j296
55624A57005O1L36j17n77j137j976k536k413k135k151j995j311p39q46j127r97
$$ plain form
55725 265427 263860 261238 256954 251829 246934 242285 237640 233637 230917 228958 227063 225799 226150 227898
55711 227898 230098 232619 235969 240183 245126 251303 258953 266721 272538 275564 276149 274339 269764 262808
55697 262808 254640 246085 237429 229142 221842 215686 210594 206850 204691 203670 203222 203416 204368 205460 206182
55682 206182 207276 209977 214400 219605 224854 229842 234127 237448 240367 243509 246355 247754 247451 246181
55668 246181 244487 242376 239956 237469 234892 232311 230431 229837 230080 230364 230790 231926 233518 234810 235887
55653 235887 237490 239559 241099 241638 241771 241978 241774 240300 237132 232347 226317 219603 212714 205974 199819
55638 199819 194813 191003 187747 184696 182323 180824 179165 176194 172151 168121 164491 161073 158301 157005
55624 157005 157066 157402 157285 156708 155571 153595 151059 148646 146511 144360 142365 141054 140315 139469 138342 137345
55608A37345q77j229j490j015l88n72j417j997j925j351l80O14P43k57j239j123
55592A23442n74j010k314k864j823k27M27j35j023j359j044n05mO17J361J646
55576A14611J025J46J11R20J463J255J134J785K632K816K460K287K501K692K386
55561A40224J366o7r16l01J303K338J949O89o63j926k821k688j515l27L7k45p36
55544A35701j262j302j80J556K228J274J53J41N29J40p00r75p62o97o00kN84L65
55526A36191k63l51k2k67j428k991m512n638n675m365k745k086k307k447k258
55511I8836k095j707n75P04Q95O6l75K02P51K93n87o59K39J145J265Q11O20J146
55493A00975J912K078J500Q31M79J29m30p09l92m8k70o91o85n11p41j072p71l5
$$ plain form
55608 137345 136468 135239 133749 132734 132346 131774 130357 128360 126435 125084 124704 125318 126061 125804 124565 123442
55592 123442 122868 121858 119544 116680 114857 114630 115057 114922 113899 112540 111496 110991 110987 111604 112965 114611
55576 114611 115636 115782 115893 116813 118276 119531 120665 122450 125082 127898 130358 132645 135146 137838 140224
55561 140224 141590 141523 140607 140306 141609 143947 145896 146585 145922 143996 141175 138487 136972 136645 136682 136437 135701
55544 135701 134439 133137 132957 134513 136741 138015 138168 138309 138838 138978 138278 137303 136541 135844 135244 135242 135826 136191
55526 136191 135928 135577 135555 135288 133860 130869 126357 120719 115044 110679 107934 105848 103541 101094 98836
55511 98836 96741 95034 94459 95163 96058 96124 95749 95951 96702 96995 96408 95749 95988 97133 98398 99209 99829 100975
55493 100975 102887 104965 106465 107296 107775 107904 107474 106765 106373 106325 106055 105364 104679 104168 103427 102355 101584 101549
55475A01549K23j86n44n03m53n64m35L7K94k9n50p33n53l27k51l30m43l96j36
55456I5670R8J23R3J65R9l66r96j313j212q60k39P01J613J990J709R65r8j249
55438I6893j927j703q83j23L02M53K81j81m52p5O67J134J228J318J386R65J2q00
55420I8495q45j83O05R67P47K65k7p7k65o81q42m08K07L85R7l52r05j563j930
55401I3690j618r36n31n07m79l56m53q10j050r34o62m84l78j81J24L50K90N6J06
55382H5237O65J148P65l35j138j142r39j125j418j293q11l16J05L60K67J37P41
55365H0908K129L271L459L202L117K864K074J381J411J546R19k7k55J38J83l29
55349A05991q31j262k053k940l080k334j403p06j34K44K37J85N28Q76N32k09m26
$$ plain form
55475 101549 101772 101586 101042 100539 100086 99522 99087 99124 99418 99389 98839 98106 97553 97226 96975 96645 96202 95806 95670
55456 95670 95768 95891 95984 96149 96248 95882 94886 93573 92361 91501 91262 91963 93576 95566 97275 98240 98142 96893
55438 96893 94966 93263 92380 92257 92559 93012 93293 93112 92660 92585 93252 94386 95614 96932 98318 99283 99295 98495
55420 98495 97650 97467 98072 99039 99786 100051 100024 99947 99682 99001 98159 97751 97958 98343 98440 98088 97183 95620 93690
55401 93690 92072 91136 90605 90098 89619 89263 88810 88000 86950 86016 85354 84870 84492 84311 84435 84785 85075 85131 85237
55382 85237 85902 87050 87815 87480 86342 85200 84261 83136 81718 80425 79614 79298 79403 79763 80030 80167 80908
55365 80908 83037 86308 89767 92969 96086 98950 101024 102405 103816 105362 106281 106254 105999 106137 106320 105991
55349 105991 105160 103898 101845 98905 95825 93491 92088 91382 91248 91492 91729 91914 92442 93318 93850 93641 93215
55332I3215j5L40N00Q13R19J5j466j911o82R79J626J160L78q2O3O78J058O27p7
55313I8138k0O97R31K95l81n78p21q74l23Q92J415M75p88r31j44M62O13P13O26
55294A00497n3q58q26P8Q41P83K26k77o58j031j225r40k22N08Q21O58L44J47p
55275I8806k85n93p65r09j122j056l00Q77J724J912J684J206M31l74o97n74n65
55258I9400q49j001q92r64j312j349p49r2j2k97l45k8M09Q89J401J704J584J183
55240I8680P72M39K23K39M66O51O22M12J5n65r90q05j50K94K48J66M02O68O27
55221A02414N34P54J089R81K59o80j251j181p69o52r97j122l53Q35J260O05k10
55204A01516l74j10J7p4k46o29j246j623j263l05N73P55J01q49j159m22N33N34
$$ plain form
55332 93215 93200 93540 94040 94853 95772 95787 94321 92410 91728 92707 94333 95493 95871 95789 95852 96530 97588 98215 98138
55313 98138 98118 98815 99746 100041 99660 99082 98361 97487 97164 98056 99471 99946 99158 98227 98083 98545 99158 99871 100497
55294 100497 100444 99586 98760 98838 99679 100462 100688 100411 99753 98722 97497 96557 96335 96843 97664 98322 98666 98813 98806
55275 98806 98521 97928 97163 96254 95132 94076 93776 94653 96377 98289 99973 101179 101610 101236 100539 99965 99400
55258 99400 98551 97550 96658 95694 94382 93033 92284 92192 92180 91883 91538 91510 91919 92808 94209 95913 97497 98680
55240 98680 99452 99891 100114 100353 100819 101470 102092 102504 102519 101954 100964 100159 100009 100303 100551 100717 101119 101787 102414
55221 102414 102948 103702 104791 105772 106031 105351 104100 102919 102150 101498 100501 99379 99026 99861 101121 101726 101516
55204 101516 101142 101032 101049 100975 100729 100100 98854 97231 95968 95663 96236 96991 97092 96243 95084 94662 95195 95729
55186I5729m10j117q62j15M99J050J702K102J927J390Q08J90l76o16o46r51j445
55169I8859j286j19J261J954J940J545P61k77r01o43J22Q49J456J807J425M40
55153A09193r0L81R11N01l03l74J03L5p16j205r92o22n28n08m38m97n38j20O34
55134A04827R79N94m5m54o92r32j074j025q91p30n10l78n31p35m04N98J610J788
55116A01995R69j03l81M82J638J809Q02k25k65K75L67r0k96J30P20J035J234J554
55098A11650J802J617R51R7n59q24q59q90p33M7J241J870J388N57M63J055J379
55081A20252R75K70k89p22j154j576j975k186j769o71K61J62o17r54n39o4Q1L19
55063A09804Q54J199J093J046J408J663J166R1r13j501j631j264n74q8r4k39r9
$$ plain form
55186 95729 95319 94202 93340 93225 93724 94774 96476 98578 100505 101895 102703 102893 102517 101901 101255 100304 98859
55169 98859 97573 97454 98715 100669 102609 104154 104915 104638 103737 103094 103216 104065 105521 107328 108753 109193
55153 109193 109103 109484 110395 110896 110593 110219 110322 110357 109641 108436 107444 106822 106294 105786 105348 104851 104313 104193 104827
55134 104827 105806 106400 106355 105901 105209 104277 103203 102178 101287 100557 100047 99669 99138 98403 97999 98597 100207 101995
55116 101995 102964 102861 102480 102962 104600 106409 107211 106986 106721 106996 107363 107273 106977 107107 107827 108862 110096 111650
55098 111650 113452 115069 116020 116117 115558 114734 113875 112985 112252 112299 113540 115410 116798 117355 117818 118873 120252
55081 120252 121227 121497 121208 120486 119332 117756 115781 113595 111826 111155 111416 111578 110961 110007 109468 109404 109485 109804
55063 109804 110658 111857 112950 113996 115404 117067 118233 118324 117411 115910 114279 113015 112441 112353 112259 112020 111921
55046A11921J34J5m16p51p75n26lO53R47M51n35j195j073m32K39O85Q61P73M90
55027A11463J64n8q2J05L50L64J00p3J77N99O38K70Q7M49R40R59N22J10m8p0M8
55006A17014M00O92L97m05q96n22L07R14J281J689J914J544R17Q47J404J735J320
54989A30552O29J73l36j375k599l154k693j592l51P19J346J313P08j39r44j504
54973A20753j569r25L02J611K368K214J354M69J18K05K72K29M11Q89J235J080
54957A31016N16j58o94q31m72j1L0j68N1O45P09j21r86r84l74P8K34L21J92l11
54937A28682p24n56j58j88n33n82k13L24J179K541L769L930L251L017L899N281
54921A52919O376P143P813Q278Q289P765O655M914K787O53j429l608n702p250
$$ plain form
55046 111921 112055 112070 111654 110903 110128 109602 109599 110252 111199 111650 111115 109920 108847 108415 108654 109339 110200 110973 111463
55027 111463 111627 111569 111487 111592 111942 112306 112406 112333 112510 113109 113747 114017 114104 114553 115493 116452 116974 117084 117036 116966 117014
55006 117014 117414 118106 118503 118098 117202 116680 116987 117901 119182 120871 122785 124329 125246 126093 127497 129232 130552
54989 130552 131181 131354 131018 129643 127044 123890 121197 119605 119254 119973 121319 122632 123340 123201 122257 120753
54973 120753 119184 118259 118561 120172 122540 124754 126108 126577 126695 126900 127172 127401 127812 128701 129936 131016
54957 131016 131532 131374 130680 129849 129377 129366 129396 129228 129279 129924 130633 130512 129526 128542 128168 128246 128480 128801 128993 128682
54937 128682 127958 127402 127244 127056 126523 125941 125728 126052 127231 129772 133541 137471 140722 143739 147638 152919
54921 152919 159295 166438 174251 182529 190818 198583 205238 210152 212939 213592 212163 208555 202853 195603
54907A95603q045q169p614o541n608n326n143m091k354j272j561k451k823k383
54893A32222j386j02J051J527J339J125J227J294J141J197J730K395L012M065
54879A51837N700O997P054O344O117O761P417P079N447K859L7k256l773m935o091
54864A96594o977p270p296p483p509o676n061l501k514j874j321r56q06n82j86
54849A36582L0j86n79q07r20j116j292j209r66r32j233j540j429q58k42q3m70
54832A22750r15p99q2N51L72n61j422j469p41J17N64N79M72N20Q17J247J488J208
54814A24696M06m11o39j71M30M29l74j382j723j153l65j53m07k75O46J719K120
54797A23393J806J294Q87N76M47N54N87K57j00J65R89J591J548J284J235J132
$$ plain form
54907 195603 187558 179389 171775 165234 159626 154300 149157 145066 142712 141440 139879 137428 134605 132222
54893 132222 130836 130734 131785 133312 134651 135776 137003 138297 139438 140635 142365 144760 147772 151837
54879 151837 157537 164534 171588 177932 184049 190810 198227 205306 210753 213612 213649 211393 207620 202685 196594
54864 196594 189617 182347 175051 167568 160059 153383 148322 144821 142307 140433 139112 138156 137350 136768 136582
54849 136582 136612 136426 135847 135040 134120 133004 131712 130503 129537 128605 127372 125832 124403 123545 123303 123220 122750
54832 122750 121835 121036 120954 121505 121877 121316 119894 118425 117684 117801 118365 118944 119416 119936 120753 122000 123488 124696
54814 124696 125102 124691 124052 123881 124311 124740 124366 122984 121261 120108 119743 119590 119183 118908 119554 121273 123393
54797 123393 125199 126493 127380 127956 128403 128957 129544 129801 129701 129866 130855 132446 133994 135278 136513 137645
54781A37645N60k01m34J23J053J869K435K842L135L227K969K359J791J937L179
54766A64489N180P141Q470R003Q760P745O159M450K871J136j174l753n604o205
54752B08668o190o472o941o782n901n220n249n270m422k960j745r93l26K81M15
54737A50893L5l57m21k48M1M04O47O30O62J174K028K726L251M022M992N612N789
54720A81880O114O843P309O759N230L195R17j419l363m562n195n674o105o393
54706A85536o544o529o050m910l488k542k479k970l285k909j933r19l29j86l49
54691A40114p91j300j274m19N36N38l64j079j018p78j004j415j399r90n81k88
54675A28488j22l28r52j405j129m00J28L85P88J251J087Oj324j870j195K72J613
$$ plain form
54781 137645 138205 138004 137570 137693 138746 140615 143050 145892 149027 152254 155223 157582 159373 161310 164489
54766 164489 169669 176810 185280 194283 203043 210788 216947 221397 224268 225404 224230 220477 214873 208668
54752 208668 202478 196006 189065 182283 176382 171162 165913 160643 156221 153261 151516 150523 150197 150478 150893
54737 150893 150928 150571 150150 149902 149943 150347 150994 151624 152286 153460 155488 158214 161465 165487 170479 176091 181880
54720 181880 187994 194837 202146 208905 214135 217330 218247 216828 213465 208903 203708 198034 191929 185536
54706 185536 178992 172463 166413 161503 158015 155473 152994 150024 146739 143830 141897 140978 140649 140463 140114
54691 140114 139323 138023 136749 136330 136866 137404 137040 135961 134943 134165 133161 131746 130347 129357 128776 128488
54675 128488 128366 128038 127086 125681 124552 124152 124280 124665 125453 126704 127791 127797 126473 124603 123408 123680 125293
54658A25293K094J661Q93L80K23K16K64L84M43K44j71m71l51J98Q52J126P38l0
54640A33986m81j95N37J002Q20K79K3L69Q89P86j63j226j539j128p18o82p16n04
54622A31339j10L43Q28J102P98P7m18m26m02o78r13p40m03k20K7O68J422J684
54604A33978J316P16K75J79N18J163J627J427N63m77j080q68m4N84L71k99m35
54587A39514J13L93j90r58j035n82k35NM77Q80O17j05m18j3M70L43l86j124j200
54568A36566l87P26J153O51R2K60Q17J050J025J166J202O29j17j24M72O39J30
54551A45950j29L71R08P07K7m53n64l46L40J343J962J801J408J454J672J291K40
54534A57982p23r87p29n07n45n12J3Q66J264O92l05p21m13k10o11j103j135r75
$$ plain form
54658 125293 127387 129048 129941 130321 130544 130760 131024 131408 131851 132095 131924 131453 131102 131300 132152 133278 134016 133986
54640 133986 133505 133310 133847 134849 135669 135948 135971 136340 137229 138015 137852 136626 135087 133959 133241 132559 131843 131339
54622 131339 131229 131572 132400 133502 134300 134377 133959 133533 133131 132453 131540 130800 130397 130177 130204 130872 132294 133978
54604 133978 135294 136010 136285 136464 136982 138145 139772 141199 141762 141285 140205 139337 139293 139877 140248 139949 139514
54587 139514 139627 140020 139830 138872 137837 137255 137020 137025 137502 138382 138999 138894 138476 138463 138933 139276 138890 137766 136566
54568 136566 136179 136905 138058 138709 138801 139061 139878 140928 141953 143119 144321 144950 144833 144709 145181 145820 145950
54551 145950 145821 146192 147100 147807 147834 147381 146817 146471 146811 148154 150116 151917 153325 154779 156451 157742 157982
54534 157982 157259 156272 155543 155036 154491 153979 153992 154858 156122 156814 156509 155788 155375 155165 154554 153451 152316 151341
54516A51341j082j182p63j29p5o31q91k19R39J622J350M18m62o85k42K38J32m15
54498A49264p31n98n68j005j331p25N96J451J098J63k36J45N50L61j80m48k45
54481A47561J18L11K74J90L18P92J392J662J389Q94O48P65J071J485K042K591
54465A63503K796K478J681N61n83j239j126o74o38j064j154m12N24O92J18k91
54449A65172l2L81K92k24o01n48j53M33R76J054M56l64p32o31o54j003j197r47
54431A61678o58o45n17J03P55P88M25L37M45J02o24q64l11K83K62p4j86p3Q3L97
54411A61706Q71J103Q55M18Mo40j534k018j595o58K28J178K345L073K599J338
54395A69273M89N70J078J521J888K108J873J148K85m42r65j141q85n43n57q11
$$ plain form
54516 151341 150259 149077 148314 148185 148110 147479 146588 146369 147308 148930 150280 150698 150236 149551 149309 149547 149679 149264
54498 149264 148533 147935 147367 146362 145031 144306 144902 146353 147451 147614 147378 147523 148073 148434 148254 147806 147561
54481 147561 147679 147990 148264 148454 148772 149564 150956 152618 154007 154901 155549 156314 157385 158870 160912 163503
54465 163503 166299 168777 170458 171019 170436 169197 168071 167397 166759 165695 164541 164129 164653 165345 165463 165172
54449 165172 165140 165521 165813 165589 164988 164440 164287 164720 165696 166750 167206 166842 166110 165479 164825 163822 162625 161678
54431 161678 161020 160375 159858 159961 160716 161504 161929 162266 162711 162813 162189 161325 161014 161297 161559 161485 161299 161226 161309 161706
54411 161706 162577 163680 164535 164953 164957 164317 162783 160765 159170 158512 158740 159918 162263 165336 167935 169273
54395 169273 169762 170332 171410 172931 174819 176927 178800 179948 180233 179791 178826 177685 176800 176257 175700 174889
54379A74889q50o59o45q83r78o83j07O23J334J538R39J48J20Q48J308R28L38L72
54361A78580R92J509J414P59J20K90J441K597K538J404O01R30J641J706J194P60
54345A98476M50j62j059j809k281k681k991k944k552k138j847j574j326j260j289
54330A73013j059m96n5j97p43j049p67k12J22J78J97J52j67n55m40K09N89J37
54312A68857o07q29o48p66j195j289r42p41q20n39L03Q86N27k42m74j50l9m83
54294A60809j017j087o53n0M09O28P63R82J198J133P81N42P32J143J235P02k14
54277A68036q75p28Q5P49O46R5j56k7j00n51q62p01m12k80oO58J327J575J620
54258A70093J821J936J537Q92P03J050J264R03K96l4n6j11m07q58j254j416j259
$$ plain form
54379 174889 174039 173380 172735 171852 170874 170191 170084 170707 172041 173579 174518 174666 174786 175634 176942 177870 178208 178580
54361 178580 179572 181081 182495 183254 183374 183664 185105 187702 190240 191644 192245 193175 194816 196522 197716 198476
54345 198476 198926 198764 197705 195896 193615 190934 187943 184999 182447 180309 178462 176888 175562 174302 173013
54330 173013 171954 171458 171403 171206 170463 169414 168647 168435 168557 168735 168932 169084 168917 168362 167922 168131 168720 168857
54312 168857 168250 167421 166773 166007 164812 163523 162581 161840 161020 160481 160784 161670 162197 161955 161481 161331 161292 160809
54294 160809 159792 158705 158052 158002 158411 159039 159802 160784 161982 163115 163896 164438 165170 166313 167548 168250 168036
54277 168036 167161 166433 166518 167267 167913 168008 167852 167825 167725 167174 166312 165611 165199 164919 164913 165571 166898 168473 170093
54258 170093 171914 173850 175387 176279 176982 178032 179296 180199 180495 180461 180405 180294 179887 179029 177775 176359 175100
54241A75100q55m19j61j34k76n02p09o57j18P12J080M48o49r97k26O06L57p29
54223A71871j492j368p67j74K76M05M2m23k70N19J126J016N50K63J66J06J86L86
54205A72418L05k25o80m91J44N26L43o8k64k00j89m94r39j028n82k6J73R3L0r1
54185A68755l65l92J61O90L23o67j133p05j18J72N14R76R51L26r8J07L58K69L55
54166A70479Q26Q83R8o05m04M3k00o87m70J23P3n32p27l66k16n30q24r96j348
54147A64620j566r58K23Q74O60M56R14J609J899J731J275O21J36L33J051J432
54131A75310J033L38j02l47n79o99o72p39q98p63k26K38L12L42P63J384J709J678
54113A78082J699K037K413K241J253o8q11o18q6R3M3L06Q07Q93L49l32p26r36
$$ plain form
54241 175100 174245 173826 173665 173531 173255 172753 172044 171387 171269 171981 173061 173509 172860 171863 171637 172243 172600 171871
54223 171871 170379 169011 168244 168070 168346 168751 168793 168370 168100 168619 169745 170761 171311 171574 171740 171846 172032 172418
54205 172418 172723 172498 171818 171327 171471 171997 172340 172272 172008 171808 171619 171125 170186 169158 168576 168550 168723 168816 168846 168755
54185 168755 168390 167998 168159 168849 169172 168505 167372 166667 166549 166721 167235 168211 169162 169488 169390 169497 169855 170124 170479
54166 170479 171305 172188 172286 171681 171277 171320 171120 170433 169963 170086 170159 169627 168900 168534 168318 167788 166964 165968 164620
54147 164620 163054 162096 162319 163193 163853 164309 165223 166832 168731 170462 171737 172358 172494 172827 173878 175310
54131 175310 176343 176681 176579 176232 175653 174954 174282 173543 172645 171882 171656 171894 172206 172548 173311 174695 176404 178082
54113 178082 179781 181818 184231 186472 187725 187657 186846 186228 186142 186235 186278 186584 187391 188284 188633 188301 187575 186639
54095A86639j132j154p18K62J543K450K199Q34m78p07k39j35m04n6J204K478L041
54078A95627L191L413L709M168N249O876Q069Q088P264O147M533K043r19l549
54064B53909n547o957p534o999n708m386l401k798k695k994k949j822J9J313J351
54049B02802O86L22N90J063J248J119J101J625K613L467L658L310L046L345M153
54034B34148N059N721O088O353O671O912O781O224N603N340N438N439M860L745
54020C14382K755K570L108L488L017K015J311J137R51L55l56p22q37j272k476
54005C29426m309o067o957o832o425o556p201p653p504o970o285n361m220l186
53991B43900k502k107j991k241k612k565k018j558j578j743j596j257j058r53
$$ plain form
54095 186639 185507 184353 183635 183897 185440 187890 190089 190923 190445 189738 189499 189364 188960 188904 190108 192586 195627
54078 195627 198818 202231 205940 210108 215357 222233 230302 238390 245654 251801 256334 258377 257458 253909
54064 253909 248362 241405 233871 226872 221164 216778 213377 210579 207884 204890 201941 200119 200138 201451 202802
54049 202802 203488 203810 204400 205463 206711 207830 208931 210556 213169 216636 220294 223604 226650 229995 234148
54034 234148 239207 244928 251016 257369 264040 270952 277733 283957 289560 294900 300338 305777 310637 314382
54020 314382 317137 319707 322815 326303 329320 331335 332646 333783 334734 335089 334733 334011 333174 331902 329426
54005 329426 325117 319050 312093 305261 298836 292280 285079 277426 269922 262952 256667 251306 247086 243900
53991 243900 241398 239291 237300 235059 232447 229882 227864 226306 224728 222985 221389 220132 219074 218121
53977B18121q05q01j072j185o46K96Q99Q73O28N79P18Q04N78j56j223j906j571
53960B14131m80M36P17P94J146J550J528J218J242J785K260K054J307P77J021
53945B31486J891K821L366L462L368L420L828M501N150N609N974O452P128P923
53931B96379Q681R169R221Q962Q790R037R763J0963J2658J4554J5765J5183J2139
53918D41264O798K56n624r036r446p865n698l553j423N60K163L449M475M816M088
53903D25224K738J534N22p26k001k594k586k932l945m696m414l662l495m071m792
53888C90104n299n703o131o559o972p371p672p810p726p253o381n574n298n228
53874B99127m630l616l221l904m798m934m391l750l155k607k508l046l573l354
$$ plain form
53977 218121 217316 216515 215443 214258 213612 213908 214807 215680 216308 216887 217605 218409 218987 218831 217608 215702 214131
53960 214131 213651 214087 214804 215598 216744 218294 219822 221040 222282 224067 226327 228381 229688 230465 231486
53945 231486 233377 236198 239564 243026 246394 249814 253642 258143 263293 268902 274876 281328 288456 296379
53931 296379 305060 314229 323450 332412 341202 350239 360002 370965 383623 398177 413942 429125 441264
53918 441264 448062 448318 442694 433658 424212 416347 410649 407096 405673 406233 408396 411845 416320 421136 425224
53903 425224 427962 429496 430018 429292 427291 424697 422111 419179 415234 410538 406124 402462 398967 394896 390104
53888 390104 384805 379102 372971 366412 359440 352069 344397 336587 328861 321608 315227 309653 304355 299127
53874 299127 294497 290881 287660 283756 278958 274024 269633 265883 262728 260121 257613 254567 250994 247640
53860B47640k628k160k040j738j128o91p41j127j618k044k161j864j444j190r20
53845B24146m12N1N9j51j2M74P75O74M34J66k69p31p89m03n9p5k44k74k20l26
53825B22814p07j220j480j075j08O95Q01O03Q61J583K095K114K013K000J791J276
53809B34056Q71Q31Q65P96J171K588M668O241O539N882N154M954N251N681N941
53794B91489N896N489M732L794K933K244J645J174J104J548K090K112J414L47
53780C28011o05j215j565j869k285k817l481m404n510o145n631m291l428l849
53766B80916m887n291m682l655k781k226k066k323k693k734k330j679r69m82o55
53751B41463j533k345k303j627j183j261j394j276j101j008q99q49r92r46j90
$$ plain form
53860 247640 245012 242852 240812 239074 237946 237255 236514 235387 233769 231725 229564 227700 226256 225066 224146
53845 224146 223734 223785 223844 223693 223681 224155 224930 225604 226038 226204 225935 225204 224415 224012 223953 223878 223634 223360 223140 222814
53825 222814 222107 220887 219407 218332 218224 218919 219720 220323 221184 222767 224862 226976 228989 230989 232780 234056
53809 234056 234927 235758 236623 237419 238590 241178 245846 252087 258626 264508 269662 274616 279867 285548 291489
53794 291489 297385 302874 307606 311400 314333 316577 318222 319396 320500 322048 324138 326250 327664 328011
53780 328011 327406 326191 324626 322757 320472 317655 314174 309770 304260 298115 292484 288193 284765 280916
53766 280916 276029 270738 266056 262401 259620 257394 255328 253005 250312 247578 245248 243569 242600 242118 241463
53751 241463 239930 237585 235282 233655 232472 231211 229817 228541 227440 226432 225533 224684 223692 222746 222556
53736B22556R58J530J293J017J141J147P67P56J641K547K276J090K74K47K22k38
53720B39224m72J03R32J038L15n31r46q89l95O03J904K921L247L088K920K921
53704B55983K991L141L433L663L515L152L134L573L876L690L569M116M835M638
53690C07309L410K244J939K051J753J031M29P6m01j052j351r32j53L27L29K72
53674C17281M67O49L82k37o49o43p07j321k172k421j686m18O49J070Q21J64n10
53657C10719r59j248j525j676j430p13K48J125J556J247L11o12r24p08m33j94
53641C04784K73R16J225R44N02M73R20J441J660J526J297J253J318J085M54K7
53625C20098M11J328J959K129K453L205L784L622L052K828L159L698M143M422
$$ plain form
53736 222556 223514 225044 226337 227354 228495 229642 230409 231165 232806 235353 237629 238719 238993 239240 239462 239224
53720 239224 238752 238855 239787 240825 241140 240609 239663 238774 238379 238982 240886 243807 247054 250142 253062 255983
53704 255983 258974 262115 265548 269211 272726 275878 279012 282585 286461 290151 293720 297836 302671 307309
53690 307309 310719 312963 314902 316953 318706 319737 320166 320242 319841 318789 317438 316506 316353 316680 317009 317281
53674 317281 317748 318397 318779 318542 317893 317250 316543 315222 313050 310629 308943 308525 309174 310244 311065 311229 310719
53657 310719 309760 308512 306987 305311 303881 303168 303416 304541 306097 307344 307655 307043 306119 305411 304978 304784
53641 304784 305057 305973 307198 308142 308644 309117 310037 311478 313138 314664 315961 317214 318532 319617 320071 320098
53625 320098 320509 321837 323796 325925 328378 331583 335367 338989 342041 344869 348028 351726 355869 360291
53611C60291M470M275M113M335M920N434N475N104M791M972N565O013N935N580
53597D31273N394N311M883M024L082K165J006l44j290j492j400j542j814j857
53583D47399j794j980k283k247j883j754k150k704k925k778k528k215j646q40
53569D17672k40l32j055j782j910j391o18N4M64N48L86K84M68P16N82L1m88o16
53551D12773m62l40m09o27p82n57R9P49R07P23P81J190J504J576J967L086M447
53534D26625N097M667L691L147L709N200O657P348P666Q540R997J1034J1138J1056
53520E25572J1596J2436J2814J2803J3079J3862J4800J5659J6431J7006J7482
53509F83540J8525K0596K2955K4279K4389K4508K5610K7151K7902K7485K6585
$$ plain form
53611 360291 364761 369036 373149 377484 382404 387838 393313 398417 403208 408180 413745 419758 425693 431273
53597 431273 436667 441978 446861 450885 453967 456132 457138 456794 455504 454012 452612 451070 449256 447399
53583 447399 445605 443625 441342 439095 437212 435458 433308 430604 427679 424901 422373 420158 418512 417672
53569 417672 417432 417100 416045 414263 412353 410962 410344 410398 410862 411410 411796 412080 412548 413264 413846 413877 413389 412773
53551 412773 412311 411971 411562 410935 410153 409596 409695 410444 411351 412074 412855 414045 415549 417125 419092 422178 426625
53534 426625 431722 436389 440080 443227 446936 452136 458793 466141 473807 482347 492344 503378 514516 525572
53520 525572 537168 549604 562418 575221 588300 602162 616962 632621 649052 666058 683540
53509 683540 702065 722661 745616 769895 794284 818792 844402 871553 899455 926940 953525
53498I53525K5896K5371K4518K3199K1911K1263K1275K1427K1397K1398K1635
53487A202815K1813K1530K0883K0282J9854J9466J9155J9065J9067J8874J8534
53476A421338J8408J8665J9092J9342J9054J7846J5677J3066J0606Q272N687K924
53464A589977M60j682m103p140j0329j2971j4836j6021j6540j6367j5728j5046
53452A459674j4723j5060j6133j7640j9074k0215k1184k1974k2279k1987k1488
53441A247917k1224k1161k1020k0688k0044j8600j5887j2278q937o767n627m757
53429A070927l719k696j980j550j061o1J751M165O382P627Q011Q508R889J2013
53415A118206J4296J6373J7965J8673J8693J9207K1177K3859K5629K6254K7156
$$ plain form
53498 953525 979421 1004792 1029310 1052509 1074420 1095683 1116958 1138385 1159782 1181180 1202815
53487 1202815 1224628 1246158 1267041 1287323 1307177 1326643 1345798 1364863 1383930 1402804 1421338
53476 1421338 1439746 1458411 1477503 1496845 1515899 1533745 1549422 1562488 1573094 1581366 1587053 1589977
53464 1589977 1590437 1588755 1584652 1577512 1567183 1554212 1539376 1523355 1506815 1490448 1474720 1459674
53452 1459674 1444951 1429891 1413758 1396118 1377044 1356829 1335645 1313671 1291392 1269405 1247917
53441 1247917 1226693 1205532 1184512 1163824 1143780 1125180 1109293 1097015 1088078 1081311 1075684 1070927
53429 1070927 1067208 1064512 1062532 1060982 1059921 1059860 1061611 1065776 1072158 1079785 1087796 1096304 1106193 1118206
53415 1118206 1132502 1148875 1166840 1185513 1204206 1223413 1244590 1268449 1294078 1320332 1347488
53404A347488K9204L1462L2824L3621L4757L6230L7645L9415M2132M5348M8217
53393A758343N0953N4184N7195N8484N8111N7895N8868O0035O0264N9970O0031
53382B394333O0166N9505N7934N5807N3010M9404M5742M2999M0988L8621L5428
53371B933937L1905K8418K4650K0347J5845J1547P262K339l838j1510k0351k9494
53359C011057l7941m5012n0373n3922n5957n7191n8152n8687n8392n7394n6247
53348B421789n5124n3594n1269m8370m5675m4035m3811m4473m5073m5371m6054
53337A898940m7323m7830m5991m2126l8206l5472l3313l0733k7781k4956k2264
53326A502945j9585j7307j5695j4276j2694j1676j2128j3669j5026j5741j6353
$$ plain form
53404 1347488 1376692 1408154 1440978 1474599 1509356 1545586 1583231 1622646 1664778 1710126 1758343
53393 1758343 1809296 1863480 1920675 1979159 2037270 2095165 2154033 2214068 2274332 2334302 2394333
53382 2394333 2454499 2514004 2571938 2627745 2680755 2730159 2775901 2818900 2859888 2898509 2933937
53371 2933937 2965842 2994260 3018910 3039257 3055102 3066649 3073911 3076250 3072412 3060902 3040551 3011057
53359 3011057 2973116 2928104 2877731 2823809 2767852 2710661 2652509 2593822 2535430 2478036 2421789
53348 2421789 2366665 2313071 2261802 2213432 2167757 2123722 2079911 2035438 1990365 1944994 1898940
53337 1898940 1851617 1803787 1757796 1715670 1677464 1641992 1608679 1577946 1550165 1525209 1502945
53326 1502945 1483360 1466053 1450358 1436082 1423388 1411712 1399584 1385915 1370889 1355148 1338795
53315A338795j6990j6927j5830j4400j3241j2008j0230q241o589n077l196j108
53303A214958N68J718K718L710M544N401O706Q484J0401J2521J5185J8053K0121
53290A325088K1104K2063K4073K6772K8957L0145L0762L0984L0323K8527K6162
53279A624960K3972K2125K0415J8793J7278J5574J3266J0335P145L930O17k814
53267A775596o072q835j1086j3035j4873j6825j9230k2266k5491k8019k9291k9599
53255A550974k9733l0234l1048l1790l2105l1894l1324l0665k9959k8956k7590
53244A215676k6332k5772k5837k5856k5486k5150k5317k5699k5636k5070k4632
53233I34889k4686k4773k4206k2926k1390j9798j7872j5510j3209j1520j0324
$$ plain form
53315 1338795 1321805 1304878 1289048 1274648 1261407 1249399 1239169 1230928 1224339 1219262 1216066 1214958
53303 1214958 1215526 1217244 1219962 1223672 1228216 1233617 1240323 1248807 1259208 1271729 1286914 1304967 1325088
53290 1325088 1346192 1368255 1392328 1419100 1448057 1478202 1508964 1539948 1570271 1598798 1624960
53279 1624960 1648932 1671057 1691472 1710265 1727543 1743117 1756383 1766718 1773863 1777793 1778410 1775596
53267 1775596 1769524 1760689 1749603 1736568 1721695 1704870 1685640 1663374 1637883 1609864 1580573 1550974
53255 1550974 1521241 1491007 1459959 1428169 1396064 1364170 1332846 1302181 1272222 1243266 1215676
53244 1215676 1189344 1163572 1137735 1111879 1086393 1061243 1035926 1010227 984591 959521 934889
53233 934889 910203 885430 861224 838298 816908 797110 779238 763728 750519 738999 728675
53222G28675r115p979p673q524r711j0202j0106j0506j1979j3929j5430j6170
53210E97351j6350j6141j5623j4936j4095j2840j1065r239q112p966q355q558
53198D54071q182p409o753o559o728p085p696q522q932q299p086o568p100p491
53184C49661o605m919l700l262k994k700k712k825k296j143m02o42j158j164j030
53169C12109j512k388k752k405k053k118k110j494o05k60p19j381j542j133o25
53154B89012l77l28l00l67p31j359j884j914j331l90L66M33j64q17r21m86l0P2
53136B78484j32l70l81L7Q65J729K168K052J608J086O50M18L64K40q3l16j66J42
53118B88395K13K06O19J418J983K078K167K493K476J494k37j926l005l307k874
$$ plain form
53222 728675 719560 711581 703908 695384 685673 675471 665365 654859 642880 628951 613521 597351
53210 597351 581001 564860 549237 534301 520206 507366 496301 487062 478950 470984 462629 454071
53198 454071 445889 438480 431727 425168 418440 411355 403659 395137 386205 377906 370820 364252 357152 349661
53184 349661 343056 338137 334437 331175 328181 325481 322769 319944 317648 316505 316103 315461 314303 313139 312109
53169 312109 310597 308209 305457 303052 300999 298881 296771 295277 294672 294412 293693 292312 290770 289637 289012
53154 289012 288635 288307 288007 287640 286909 285550 283666 281752 280421 280031 280397 280830 280666 279849 278928 278442 278412 278484
53136 278484 278352 277982 277601 277638 278503 280232 282400 284452 286060 287146 287796 288214 288578 288818 288735 288419 288253 288395
53118 288395 288608 288814 289433 290851 292834 294912 297079 299572 302048 303542 303305 301379 298374 295067 292193
53103B92193k056j494j514j737j662j337j089r00n63k34k61n61p02n22k64q6M9
53086B77260O9j81n21n70l29k30m36n31j76L41N59N29O23P98N65j79p57n10K08
53067B76532L46n03j528j779j357j025r63o65p1J31l08n26K24J279J332K65p36
53050B70648q04l06L3J55L85P26Q54N85K1n49p38l76J31J11n06j065j081q02o04
53031B66818l58J21M73L07m4nK34n7r03j445j108k13P58J735K548K632J870J086
53013B74449R59R99M20l84l30N58J023M43k69j50L91M13rk6N92J176J184O92m6
52994B82085p91j042l81O97J004J53p72n23P61J808J810J187Q04R43J260J461
52978B90464J672K181K945L558L694L432L032K521J765Q15l5n84q54q64n24J08
$$ plain form
53103 292193 290137 288643 287129 285392 283730 282393 281304 280404 279841 279607 279346 278785 278083 277561 277297 277211 277260
53086 277260 277329 277148 276627 276057 275728 275498 275062 274531 274355 274696 275255 275784 276407 277205 277770 277591 276834 276324 276532
53067 276532 276878 276375 274847 273068 271711 270686 269723 269058 268987 269118 268810 268284 268508 269787 271119 271384 270648
53050 270648 269844 269538 269571 269726 270111 270837 271691 272276 272297 271748 271010 270634 270765 270876 270370 269305 268224 267422 266818
53031 266818 266460 266581 267054 267361 267317 267312 267546 267489 266586 265141 264033 263820 264578 266313 268861 271493 273363 274449
53013 274449 275408 276407 276827 276443 276113 276671 277694 278137 277868 277718 278109 278522 278513 278487 279079 280255 281439 282131 282085
52994 282085 281294 280252 279871 280568 281572 281725 280953 280430 281191 282999 284809 285996 286800 287743 289003 290464
52978 290464 292136 294317 297262 300820 304514 307946 310978 313499 315264 316079 316044 315460 314606 313742 313218 313326
52962C13326P09R37O53oo96j026r66j011j586k349k520k000j527j594j779j538
52946B97027j114j093j399j376p31J18O36O35J93m46q72p54k67P5k7m11p63q39
52928B88592n19P8M93L95R2J25L77J41p30j366j019j46K51M5j5L61N71K19j22
52909B87823J03L23l97j754k357j641o55m97q12o51j18r8n67n15L50R19L65n04
52891B79317l71P10J502J330P04K93J66K17N23Q98O93m64j963k720k298j268m50
52874B76819q6J99P12J253J424J286J333J827K392K587K553K785L360L766L546
52859C05756K795J963J333Q91N07J51j64o25j605l092m283m263l272k697l405
52844B89990m612m984m420l929l984l934l129j782m84L98O22K9r80j503j074j62
$$ plain form
52962 313326 314035 314972 315625 315619 314923 313897 312931 311920 310334 307985 305465 303465 301938 300344 298565 297027
52946 297027 295913 294820 293421 292045 291314 291432 292068 292703 292896 292450 291578 290824 290557 290632 290605 290194 289431 288592
52928 288592 288073 288151 288644 289039 289131 289256 289633 289774 289044 287678 286659 286513 286764 286809 286794 287155 287726 287945 287823
52909 287823 287926 288249 287852 286098 283741 282100 281445 280948 280136 279485 279367 279269 278702 278187 278537 279456 279821 279317
52891 279317 278946 279656 281158 282488 283192 283485 283651 283868 284391 285289 285982 285518 283555 280835 278537 277269 276819
52874 276819 276733 276932 277644 278897 280321 281607 282940 284767 287159 289746 292299 295084 298444 302210 305756
52859 305756 308551 310514 311847 312738 313245 313396 313232 312607 311002 307910 303627 299364 296092 293395 289990
52844 289990 285378 280394 275974 272045 268061 264127 260998 259216 258732 259130 259752 259781 258801 257298 256224 256062
52828B56062N38Q85J035R89Q35Q63R89N63o32j685j579o05M5j06m20k97J50O62
52810B58292J300K026K489K510K343K181J830J152L54m42j460k681l464l237k306
52795B60887j508j219j176j066r09q35r13j142j324j096l98K22K35j23j99R5K08
52778B49739j6J4O75J399J470J087J033J469J707J230L54k89n52p10q89q52l81
52761B56488L00O24K53n47j176j337j209r56m42L86J104J214P95L83L09N20R41
52744B57650J519J943J888J616J747K241K244J362M76O44J585K031J465O46L48
52729B79405L16o4o43o11M09J840K752K689J877Q26q0p23j109j246j164r21n83
52712B82970k58k16p45j661k168j615l88L75J09n27n92o1L62L59K82L73L48O3
$$ plain form
52828 256062 256600 257485 258520 259509 260344 261207 262196 262759 262127 260442 258863 258258 258303 258197 257777 257480 257630 258292
52810 258292 259592 261618 264107 266617 268960 271141 272971 274123 274477 274035 272575 269894 266430 263193 260887
52795 260887 259379 258160 256984 255918 255009 254174 253261 252119 250795 249699 249301 249523 249758 249635 249436 249531 249739
52778 249739 249723 249737 250412 251811 253281 254368 255401 256870 258577 259807 260161 259872 259320 258610 257721 256869 256488
52761 256488 256788 257412 257665 257118 255942 254605 253396 252440 251998 252384 253488 254702 255497 255880 256189 256709 257650
52744 257650 259169 261112 263000 264616 266363 268604 270848 272210 272686 273330 274915 276946 278411 279057 279405
52729 279405 279721 279657 279014 278403 278812 280652 283404 286093 287970 288796 288716 287993 286884 285638 284474 283553 282970
52712 282970 282712 282496 281751 280090 277922 276307 275919 276294 276403 275876 275284 275223 275585 275944 276226 276599 276947 277010
52694B77010L0P15J658J906J261N22L44M52K54k59o30o99o64n94l09J51M37L23
52676B81908J6j75k26l59p26j220j493j246o14j06QO3M31Q38P69L88L46O63N43
52657B79808l45j147q65M09J769K609K893K741K357K126K164J942R34m79j381
52642B95535j431j045n82n6L01K3q34j502j360n26N65J663K545K870K595K215
52626C00976K188K413K457K058J141l08k026l398l939l748l221k600k013j663
52612B88317j531j133n8J319K124J952J208N02Q7j03j40k6K86Q18J373J470Q07
52595B97272j76n72j7Q67J262J085Q41P96P48N49M04M75N49L77J25K10P41J416
52577C06952J858J839J259K75n95q68o71n82p94q98o68m86o59q21o02m35r47j731
$$ plain form
52694 277010 277040 277755 279413 281319 282580 283102 283446 283898 284152 283893 283263 282564 281900 281306 280997 281148 281585 281908
52676 281908 281924 281749 281523 281164 280438 279218 277725 276479 275865 275759 275767 275830 276261 277099 277868 278256 278602 279265 279808
52657 279808 279463 278316 277451 277860 279629 282238 285131 287872 290229 292355 294519 296461 297395 296916 295535
52642 295535 294104 293059 292477 292421 292722 292745 291911 290409 289049 288523 289088 290751 293296 296166 298761 300976
52626 300976 303164 305577 308034 310092 311233 310925 308899 305501 301562 297814 294593 291993 289980 288317
52612 288317 286786 285653 285595 286914 289038 290990 292198 292700 292787 292684 292544 292518 292804 293622 294995 296465 297272
52595 297272 297096 296524 296507 297374 298636 299721 300562 301358 302106 302655 303059 303534 304083 304460 304585 304795 305536 306952
52577 306952 308810 310649 311908 312183 311588 310720 310049 309467 308673 307775 307107 306621 305962 305141 304539 304104 303157 301426
52559C01426j695o54K87K09m86q99q63p84p71o15l98m53p87j093j229j221r00
52542B89074j29O58P62K16j70O5L54M5m88l30N69J216R46L72N18J373J908J505
52524B98464P66O56J235J760J760J505J339J129O43J08pM60J311K296L187L667
52508C20279L638L484L653L953L689K578J133p4j087k232l426m247m520m428m098
52493C18295l496k752k198j939j679j176n74j09K51O07P71N37J16m0J32L12M61
52476C07519R13J686K182J971J469J277J214O59k43m39O89K418L494L512L082
52461C31403K921L171L514L511K817J379m45k089l153l602l637l545l592l847
52447C24806m089m016l585l008k475k016j605j294j147j095r46n36M6M05J35p00
$$ plain form
52559 301426 299731 299077 299364 299573 299087 298188 297325 296541 295770 295155 294757 294304 293517 292424 291195 289974 289074
52542 289074 288945 289603 290365 290581 290411 290476 290830 290875 290387 290057 290626 291842 292788 293160 293678 295051 296959 298464
52524 298464 299230 299886 301121 302881 304641 306146 307485 308614 309257 309365 309358 309818 311129 313425 316612 320279
52508 320279 323917 327401 331054 335007 338696 341274 342407 342333 341246 339014 335588 331341 326821 322393 318295
52493 318295 314799 312047 309849 307910 306231 305055 304481 304372 304623 305230 306001 306538 306654 306614 306746 307058 307519
52476 307519 308432 310118 312300 314271 315740 317017 318231 318890 318647 318208 318897 321315 324809 328321 331403
52461 331403 334324 337495 341009 344520 347337 348716 348271 346182 343029 339427 335790 332245 328653 324806
52447 324806 320717 316701 313116 310108 307633 305617 304012 302718 301571 300476 299530 298994 299040 299445 299580 298880
52431B98880j482j615j081k92M71J199J812K014J659R58J81n35r59o89L23J379
52415C02223J616R97L61M63J226K045K483K535K503K853L982N861P976R773J1175
52400C58072J2438J3536J3810J2334Q726L672j456n599q583j0583j1303j0341
52388C74723q255o555o155o379n933m443k476n33J136K025J705P52M98J498K909
52373C44517L664L710L714M060M600N043N199N071M865M647L894K023m92k219
52359C92296k400j861j748j972j647n73N79J293J644J702J330O48J07o1n3m2J31
52342C89373O94J665K769L497L466K961K829L481M336M787N288O659Q588R712
52328D50105R370Q511Q594J0107J2361J4205J4874J4539J4232J4830J6029J6742
$$ plain form
52431 298880 297398 295783 294702 294410 294881 296080 297892 299906 301565 302523 302704 302169 301210 300521 300844 302223
52415 302223 303839 304836 305197 305660 306886 308931 311414 313949 316452 319305 323287 329148 337124 346897 358072
52400 358072 370510 384046 397856 410190 418916 422588 421132 415533 406950 396367 385064 374723
52388 374723 366468 359913 353758 347379 341446 337003 334527 333994 335130 337155 338860 339612 340110 341608 344517
52373 344517 348181 351891 355605 359665 364265 369308 374507 379578 384443 389090 392984 395007 394515 392296
52359 392296 389896 388035 386287 384315 382668 382095 382674 383967 385611 387313 388643 389291 389398 389337 389284 389242 389373
52342 389373 390067 391732 394501 397998 401464 404425 407254 410735 415071 419858 425146 431805 440393 450105
52328 450105 459475 467986 476580 486687 499048 513253 528127 542666 556898 571728 587757 604499
52316F04499J6433J5631J5115J5213J5839J6688J7248J7284J7356J8250J9853
52305G89409K1257K2053K2684K3368K3572K3040K2467K2492K2624K1939K0342
52294A035247J8547J7002J5422J3231J0094O255K646K83p89j582k871m300n175
52281A104010n652o370p251p484o793n957n791n992n450l678j515k28L3M01J786
52266A044069L717N174O112P270Q719R685R977J0484J1831J3389J4318J4826J5734
52253A175305J7284J9053K0543K1348K1152K0029J8444J6516J3912J0759P984
52242A362329O151M698K957J155l04j741l487m941n495n745o682q116r179r926
52228A321674j1015j2016j1622r793q233q256r238r715r077p698o218n208m872
$$ plain form
52316 604499 620932 636563 651678 666891 682730 699418 716666 733950 751306 769556 789409
52305 789409 810666 832719 855403 878771 902343 925383 947850 970342 992966 1014905 1035247
52294 1035247 1053794 1070796 1086218 1099449 1109543 1115798 1118444 1118727 1117938 1116356 1113485 1109185 1104010
52281 1104010 1098358 1091988 1084737 1077253 1070460 1064503 1058712 1052720 1047270 1043592 1042077 1041849 1041882 1042283 1044069
52266 1044069 1047786 1052960 1059072 1066342 1075061 1084746 1094723 1105207 1117038 1130427 1144745 1159571 1175305
52253 1175305 1192589 1211642 1232185 1253533 1274685 1294714 1313158 1329674 1343586 1354345 1362329
52242 1362329 1368480 1373178 1376135 1377290 1376986 1375245 1371758 1366817 1361322 1355577 1348895 1340779 1331600 1321674
52228 1321674 1310659 1298643 1287021 1277228 1268995 1260739 1251501 1241786 1232709 1225011 1218793 1213585 1208713
52215A208713m673l767k148p60k61k45KO41J491K512L659M769N754O536O693N896
52199A234812M750M438N256O272O781P227Q194R389J0256J0880J1451J1376R864
52186A340946P132M230J815k38k121l709m959o103p303q389r145r603r906j0027
52172A282620r742q909p824p085o895o621n466l549j819r00m86M0R14K094L387
52157A229759M212L873K444R09m3p66j779k728k907k373j726j110k19Q86J756
52142A230188K319K898L365L037J647j59j558k296k508k242j591q56j58Q82K724
52127A235692N230P832J0284J2888J5801J8502K0228K0887K1227K2021K3302K4521
52115A438415K5203K5210K4535K3253K1760K0649K0156J9901J9414J8716J8234
$$ plain form
52215 1208713 1204040 1200273 1198125 1197365 1197104 1196859 1196861 1197502 1198993 1201505 1205164 1209933 1215687 1222223 1228916 1234812
52199 1234812 1239562 1244000 1249256 1255528 1262309 1269536 1277730 1287119 1297375 1308255 1319706 1331082 1340946
52186 1340946 1348078 1352308 1354123 1353885 1351764 1348055 1343096 1336993 1329690 1321301 1312156 1302553 1292647 1282620
52172 1282620 1272878 1263969 1256145 1249060 1242165 1235544 1230078 1226529 1224710 1223810 1223324 1223364 1224278 1226372 1229759
52157 1229759 1233971 1237844 1240288 1241197 1241154 1240388 1238609 1235881 1232974 1230601 1228875 1227765 1227546 1228432 1230188
52142 1230188 1232507 1235405 1238770 1241807 1243454 1243295 1241737 1239441 1236933 1234691 1233100 1232244 1232086 1232968 1235692
52127 1235692 1240922 1248754 1259038 1271926 1287727 1306229 1326457 1347344 1368571 1390592 1413894 1438415
52115 1438415 1463618 1488828 1513363 1536616 1558376 1579025 1599181 1619082 1638496 1657212 1675446
52104A675446J8263J8744J9415J9988K0191J9904J9224J8239J6719J4270J0922
52093A871325P373M296J438k230p137j2138j5510j6871j7507j8531j9413j9015
52081A756080j7489j6214j5920j5854j4986j3282j1364r649q262p247o308m695
52069A614810k044R23L047M054M827O354Q797J1502J3637J4807J5344J6021J7283
$$ plain form
52104 1675446 1693709 1712453 1731868 1751856 1772047 1791951 1811175 1829414 1846133 1860403 1871325
52093 1871325 1878698 1882994 1884432 1882202 1875065 1862927 1847417 1830546 1813039 1794508 1775095 1756080
52081 1756080 1738591 1722377 1706457 1690603 1675617 1662335 1650971 1641322 1633060 1625813 1619505 1614810
52069 1614810 1612766 1613689 1616736 1620790 1625617 1631971 1640768 1652270 1665907 1680714 1696058 1712079 1729362
$$ [...]
##END NTUPLES=NMR SPECTRUM
##END=
