
##TITLE=UV1285_M2_1207-1380_10_7534799_Uo5lkCNWQY
##JCAMPDX= 6.0         $$ Bruker NMR JCAMP-DX V2.0
##DATA TYPE= NMR SPECTRUM
##DATA CLASS= NTUPLES
##ORIGIN= BRUKER
##OWNER= Administrator
$$ 1.72 TOPSPIN		Version 2.1
$$ 2013-02-21 20:36:17.605 -0500  Administrator@X
$$ Compression mode = diff/dup
##.OBSERVE FREQUENCY= 400.02188249412
##.OBSERVE NUCLEUS= ^1H
##.ACQUISITION MODE= SIMULTANEOUS (DQD)
##.ACQUISITION SCHEME= undefined
##.AVERAGES= 8
##.DIGITISER RES= 22
##SPECTROMETER/DATA SYSTEM= spect
##.PULSE SEQUENCE= zg30
##.SOLVENT NAME= COFFEE_meoh
##.SHIFT REFERENCE= INTERNAL, COFFEE_meoh, 1, 14.98509
##AUDIT TRAIL= $$ (NUMBER, WHEN, WHO, WHERE, PROCESS, VERSION, WHAT)
$$ ##TITLE= Audit trail, TOPSPIN		Version 2.1
$$ ##JCAMPDX= 5.01
$$ ##ORIGIN= Bruker BioSpin GmbH
$$ ##OWNER= Administrator
$$ $$ E:\/data/COFFEE/nmr/UV1285_M2_1207-1380_10_7534799_Uo5lkCNWQY/10/pdata/1/auditp.txt
$$ ##AUDIT TRAIL=  $$ (NUMBER, WHEN, WHO, WHERE, PROCESS, VERSION, WHAT)
(   1,<2013-02-21 20:36:09.062 -0500>,<Administrator>,<X>,<go>,<TOPSPIN 2.1>,
      <created by zg
	started at 2013-02-21 20:35:02.655 -0500,
	POWCHK enabled, PULCHK disabled,
       configuration hash MD5:
       86 BA 57 50 F2 9D 5C 9B 26 00 A9 28 5F 66 2E 89
       data hash MD5: 64K
       57 BF 0D FA EC 6B AD 98 BE 0A CA E1 35 63 EA 6F>)
(   2,<2013-02-21 20:36:12.234 -0500>,<Administrator>,<X>,<proc1d>,<TOPSPIN 2.1>,
      <Start of raw data processing
       efp LB = 0 FT_mod = 6 PKNL = 1 PHC0 = 0 PHC1 = 0 SI = 32K 
       data hash MD5: 32K
       77 14 41 70 17 25 42 E3 14 CA 68 83 45 46 A0 68>)
(   3,<2013-02-21 20:36:12.702 -0500>,<Administrator>,<X>,<proc1d>,<TOPSPIN 2.1>,
      <pk PHC0 = 66.17615 PHC1 = 0 
       data hash MD5: 32K
       67 A5 BE DB D1 AE 45 63 E8 85 F2 E8 36 35 E7 B4>)
(   4,<2013-02-21 20:36:12.937 -0500>,<Administrator>,<X>,<proc1d>,<TOPSPIN 2.1>,
      <abs ABSG = 1 
       data hash MD5: 32K
       57 4E 44 4A E0 86 A4 AD A4 38 E6 A7 58 77 F1 14>)
(   5,<2013-02-21 20:36:13.109 -0500>,<Administrator>,<X>,<proc1d>,<TOPSPIN 2.1>,
      <abs ABSG = 2 
       data hash MD5: 32K
       AC 91 A8 8A C9 64 29 4A FE 8B C7 32 AB B5 D4 9B>)
(   6,<2013-02-21 20:36:13.249 -0500>,<Administrator>,<X>,<proc1d>,<TOPSPIN 2.1>,
      <abs ABSG = 3 
       data hash MD5: 32K
       77 9A 40 46 F3 83 89 A2 20 DC FB D5 DF C5 BE 08>)
(   7,<2013-02-21 20:36:13.390 -0500>,<Administrator>,<X>,<proc1d>,<TOPSPIN 2.1>,
      <abs ABSG = 4 
       data hash MD5: 32K
       6D 7A 98 F2 3B 6B 13 35 81 F0 88 86 5B D0 F9 D7>)
(   8,<2013-02-21 20:36:13.546 -0500>,<Administrator>,<X>,<proc1d>,<TOPSPIN 2.1>,
      <abs ABSG = 5 
       data hash MD5: 32K
       5A B9 55 FA 7E 43 91 3F F7 21 25 1B 93 34 BF 80>)
$$ ##END=
$$ 
$$ $$ hash MD5
$$ $$ C7 36 89 D2 A1 BB 09 CC 06 86 E6 29 8F 6F F3 1F
##$RELAX= 
##$RELAX= 
##$RELAX= 
##$RELAX= 
##$RELAX= 
##$RELAX= 
##$RELAX= 
$$ Bruker specific parameters
$$ --------------------------
##$DU= <E:\>
##$EXPNO= 10
$$ [...]
##$TP= (0..7)
150 150 150 150 150 150 150 150
##$TP07= 0
##$TPNAME0= <>
##$TPNAME1= <>
##$TPNAME2= <>
##$TPNAME3= <>
##$TPNAME4= <>
##$TPNAME5= <>
##$TPNAME6= <>
##$TPNAME7= <>
##$TPOAL= (0..7)
0.5 0.5 0.5 0.5 0.5 0.5 0.5 0.5
##$TPOFFS= (0..7)
0 0 0 0 0 0 0 0
##$TUNHIN= 0
##$TUNHOUT= 0
##$TUNXOUT= 0
##$USERA1= <user>
##$USERA2= <user>
##$USERA3= <user>
##$USERA4= <user>
##$USERA5= <user>
##$V9= 5
##$VALIST= <valist>
##$VCLIST= <CCCCCCCCCCCCCCC>
##$VD= 0
##$VDLIST= <DDDDDDDDDDDDDDD>
##$VPLIST= <PPPPPPPPPPPPPPP>
##$VTLIST= <TTTTTTTTTTTTTTT>
##$WBST= 1024
##$WBSW= 4
##$XGAIN= (0..3)
0 0 0 0
##$XL= 0
##$YL= 0
##$YMAX_a= 574272
##$YMIN_a= -568890
##$ZGOPTNS= <>
##$ZL1= 120
##$ZL2= 120
##$ZL3= 120
##$ZL4= 120
##$ABSF1= 14.98509
##$ABSF2= -5.573092
##$ABSG= 5
##$ABSL= 3
##$ALPHA= 0
##$AQORDER= 0
##$ASSFAC= 0
##$ASSFACI= 0
##$ASSFACX= 0
##$ASSWID= 0
##$AUNMP= <proc_prof1d_extract_pilot.lims>
##$AXLEFT= 0
##$AXNAME= <>
##$AXNUC= <1H>
##$AXRIGHT= 0
##$AXTYPE= 0
##$AXUNIT= <>
##$AZFE= 0.1
##$AZFW= 0.1
##$BCFW= 0
##$BC_mod= 0
##$BYTORDP= 0
##$COROFFS= 0
##$CY= 15
##$DATMOD= 1
##$DC= 0
##$DFILT= <>
##$DTYPP= 0
##$F1P= 0
##$F2P= 0
##$FCOR= 0.5
##$FTSIZE= 32768
##$FT_mod= 6
##$GAMMA= 0
##$GB= 0
##$INTBC= 1
##$INTSCL= 1
##$ISEN= 128
##$LB= 0
##$LEV0= 0
##$LPBIN= 0
##$MAXI= 10000
##$MC2= 0
##$MEAN= 0
##$ME_mod= 0
##$MI= 0
##$NCOEF= 0
##$NC_proc= -8
##$NLEV= 6
##$NOISF1= 0
##$NOISF2= 0
##$NSP= 0
##$NTH_PI= 0
##$NZP= 0
##$OFFSET= 14.98509
##$PC= 1
##$PHC0= 66.17615
##$PHC1= 0
##$PH_mod= 1
##$PKNL= yes
##$PPARMOD= 0
##$PPDIAG= 0
##$PPIPTYP= 0
##$PPMPNUM= 2147483647
##$PPRESOL= 1
##$PSCAL= 4
##$PSIGN= 0
##$PYNMP= <proc.py>
##$REVERSE= no
##$SF= 400.02
##$SI= 32768
##$SIGF1= 0
##$SIGF2= 0
##$SINO= 400
##$SIOLD= 32768
##$SPECTYP= <>
##$SREGLST= <1H.CDCl3>
##$SSB= 0
##$STSI= 32768
##$STSR= 0
##$SW_p= 8223.68421052631
##$SYMM= 0
##$S_DEV= 0
##$TDeff= 65536
##$TDoff= 0
##$TI= <>
##$TILT= no
##$TM1= 0
##$TM2= 0
##$TOPLEV= 0
##$USERP1= <user>
##$USERP2= <user>
##$USERP3= <user>
##$USERP4= <user>
##$USERP5= <user>
##$WDW= 1
##$XDIM= 32768
##$YMAX_p= 469172679
##$YMIN_p= -700171
##$CURPLOT= <Network HP LaserJet P1505>
##$CURPRIN= <$Network HP LaserJet P1505>
##$DFORMAT= <normdp>
##$LAYOUT= <+/1D_H.xwp>
##$LFORMAT= <normlp>
##$PFORMAT= <normpl>
##$SURQMSG= 1
$$ End of Bruker specific parameters
$$ ---------------------------------
##NTUPLES= NMR SPECTRUM
##VAR_NAME=  FREQUENCY,     SPECTRUM/REAL,   SPECTRUM/IMAG
##SYMBOL=    X,             R,               I
##VAR_TYPE=  INDEPENDENT,   DEPENDENT,       DEPENDENT
##VAR_FORM=  AFFN,          ASDF,            ASDF
##VAR_DIM=   32768,         32768,           32768
##UNITS=     HZ,            ARBITRARY UNITS, ARBITRARY UNITS
##FACTOR=    0.250966925370066, 1,           1
##FIRST=     8223.43324360094, -6865,        77084
##LAST=      0,             95833,           -183488
##MIN=       0,             -700171,         0
##MAX=       8223.43324360094, 469172679,    0
$$ Real data points
##PAGE= N=1
##DATA TABLE= (X++(R..R)), XYDATA
$$ [...]
$$ plain form
19536 -95922 -191897 -160282 215856 -20804 -317645 71620 154794 -38910 -29559 -182515 185688
19524 102592 -223516 -46648 86540 -146367 -94472 -355848 -25412 246270 -100746 -369529
19514 -369529 -5613 -949 -233574 -15751 303372 88178 -90528 87074 22874 -41178 -62405 73135
19501 144595 -537454 10624 -236433 -297751 -121925 -47663 97004 167429 109173 -77616 13508
19489 -32157 -58439 63774 -154344 -131897 48141 -153869 -19463 -152874 92055 151239 -159849
19477 -43309 -52288 -134738 -44025 -15795 -68772 188894 168617 -182856 -119421 -64763 207542
19465 110903 -36197 -185020 80737 -30304 -215012 -103653 -136538 22005 -167473 -328067
19455 -328067 -101957 -164336 -8852 108430 -127948 159962 -273753 -47689 200970 -203160
$$ packed form
19536i5922r5975L1615B15856b0804k96841G1620Q3174c8910R351j52956A85688
19524A02592b23516d6648H6540a46367N1895k61376b5412B46270a00746k68783
19514c69529e613i49k32625a5751C03372H8178i0528H7074B2874d1178k1227G3135
19501A44595e37454A0624b36433o1318a21925d7663I7004P0425n8256g7616A3508
19489c2157k6282F3774a54344K2447D8141a53869a9463j33411I2055N9184a59849
19477d3309q979q2450d4025a5795n2977A88894k0277a82856O3435N4658B07542
19465A10903c6197j48823H0737c0304j84708a03653l2885B2005a67473j60594
19455c28067a01957o2379h852A08430a27948A59962b73753d7689B00970b03160
$$ plain form
19444 -332612 -38144 329720 -138693 -93584 280777 -152243 116202 -199125 -166469 213844
19433 -133219 72747 -12960 -160470 -285433 226179 106651 -194577 16889 -100975 187312
19422 -118798 -34076 164120 -31937 3784 -28075 -383915 -71608 187552 -184627 -90025 -146311
19411 -146311 -73378 -13136 -29054 -157241 -65613 -135247 -346143 174669 1529 -323967 202617
19399 -177534 -73761 12800 -94197 -59290 69345 -117491 -232241 -97901 139368 -92819 -47694
19388 -47694 70157 -50285 4652 34559 -204070 64121 16999 39148 128793 -217658 28665
19376 -275757 -200093 75037 -142782 -318595 -124187 301672 376258 -81187 246612 106390
19365 -167157 -231630 -388109 -22762 -9471 -80175 1642 52518 14576 104521 173670 -88125 -212860
$$ packed form
19444c32612c8144C29720a38693M5109B80777a52243A16202a99125L2656B13844
19433a33219G2747a2960j47510j24963B26179A06651a94577A6889a00975A87312
19422a18798c4076A64120c1937C784b8075l55840g1608A87552a84627i0025n6286
19411a46311P2933a3136j5918j28187f5613o9634k10896A74669A529c23967B02617
19399a77534g3761A2800i4197L4907F9345a17491j14750i7901A39368i2819M5125
19388d7694G0157e0285D652K9907b04070F4121A6999K2149Q9645b17658B8665
19376b75757P5664G5037a42782j75813a24187C01672P4586h1187B46612A06390
19365a67157o4473j56479b2762i471p0704A642N0876A4576Q9945O9149h8125j24735
$$ plain form
19353 -212860 -259462 105034 353710 -121184 111880 147645 -330591 -440509 194887 -74607
19342 -338844 215525 -229730 167460 152983 -53998 -106858 -369304 18838 -49282 112564
19331 -45280 -196207 -567 -123397 -147847 -40767 -193512 -57963 -140547 -7844 -179410 -360643
19320 -360643 -98597 2618 -107108 -111385 16987 -50218 255098 -393349 71552 135350 -227644
19308 -125474 -107812 172984 -134412 -111169 137991 124359 -164319 -3050 166675 1198 -133489
19296 -19907 121746 192914 45188 51865 183428 62909 -233653 -61767 9240 -301524 188414
19284 245291 86901 -103161 84225 -107523 -126151 404 -331561 -191436 99962 -137007 -173672
19273 -173672 18480 -180137 -385230 -239644 75660 123290 -184449 100348 158709 163892 -118126
$$ packed form
19353b12860m6602A05034K48676a21184A11880L5765c30591j09918A94887g4607
19342c38844B15525b29730A67460j4477e3998n2860k62446A8838d9282A12564
19331d5280j50927e67j22830k4450d0767j52745e7963q2584g844j71566j81233
19320c60643i8597B618a07108m277A6987e0218B55098c93349G1552O3798b27644
19308a25474J7662A72984a34412K3243A37991j3632a64319c050A66675A198a33489
19296a9907A21746P1168D5188O677J31563F2909b33653f1767I240c01524A88414
19284B45291H6901a03161H4225a07523j8628D04c31561J40125I9962a37007l6665
19273a73672A8480a80137k05093J45586G5660M7630a84449A00348N8361N183a18126
$$ plain form
19261 -216821 -388878 -516768 -78277 -87942 -114329 102391 18586 47867 269847 -270998 -230170
19250 -230170 -59867 100912 -299844 -215663 120642 129556 -15582 181565 -302522 -129791
19239 94639 70978 -499587 -202673 -42817 -16729 -250813 -233494 -101479 -93428 -93278 -47866
19228 -47866 -213294 -135504 -148410 -137421 -66404 -190429 -373757 -290349 -188507 118999 24933
19216 -40535 59498 186035 55155 -362980 -161102 -377721 -268766 57569 94641 7993 -138179
19204 -115938 -49054 -95194 129555 -128132 -12126 -9093 -356910 -46073 139988 -319706 26461
19192 -76394 13106 96257 140031 -994 -72647 -293465 -343564 -389416 -259381 -140312 -59562
19180 -311574 -10714 110254 -22513 10988 -81832 -23344 -176467 115573 314631 4420 -525909
$$ packed form
19261b16821j72057j27890g8277r665k6387A02391A8586K9281K21980b70998M0828
19250b30170e9867A00912b99844Q4181A20642Q914a5582A81565c02522a29791
19239I4639k3661d99587b02673d2817a6729k34084J7319a01479Q051J50M5412
19228d7866j65428P7790j2906J0989f6404j24025j83328Q3408J01842A18999B4933
19216d0535E9498J26537E5155c62980a61102k16619J08955E7569L7072G993a38179
19204a15938d9054m6140A29555a28132a2126L033l47817d6073A39988c19706B6461
19192g6394A3106Q3151M3774i94p1653k20818n0099m5852J30035J19069e9562
19180c11574a0714A10254b2513A0988h1832b3344j53123A15573J99058D420e25909
$$ plain form
19168 -57393 -204383 -64779 -76733 -148572 -32418 -159828 35977 65263 355119 -456306 122734
19156 -211358 37977 -107073 -135521 106542 54760 -288786 -14334 -206983 -84250 164855
19145 -110389 -446180 -30309 -192638 140401 -131870 18884 -358211 -254637 94240 136012
19135 136012 -143498 -337193 -173765 78651 125957 117307 -102677 -178397 -7360 -203410 24319
19123 -32208 -125139 -101768 241181 -383884 70160 89866 -131402 297118 162710 -206744
19112 22445 -213993 136598 -262463 -164019 278880 -113188 -321659 -10623 -42088 -161884
19102 -161884 -58360 -99991 11452 -72232 -89400 -210493 -382616 -31268 172868 308879 253836
19091 253836 -49169 127237 102441 -198601 -116795 116274 -105537 -56964 240372 -304057
$$ packed form
19168e7393j46990f4779j1954p1839c2418j27410C5977K9286K89856d56306A22734
19156b11358C7977a07073k8448A06542n1782b88786a4334j92649h4250A64855
19145a10389l35791c0309j62329A40401a31870A8884c58211J03574I4240M1772
19135A36012a43498j93695J63428G8651M7306q650a02677p5720g360j96050B4319
19123c2208r2931K3371B41181c83884G0160J9706a31402B97118j34408b06744
19112B2445b13993A36598b62463R8444B78880a13188k08471a0623l1465j19796
19102a61884e8360m1631A1452g2232j7168j21093j72123c1268A72868J36011n5043
19091B53836d9169A27237k4796a98601Q1806A16274a05537M8573B40372c04057
$$ plain form
19080 -116485 -127740 -82126 93405 -545818 -311923 -88234 26708 -217879 120219 64217 302248
19069 302248 -190215 -210428 -10210 46011 42506 -319095 190733 106224 -86938 -193167 47434
19057 -359398 93056 -206444 119233 179894 -356070 65537 -66701 -275131 -6774 -171465 84502
19045 -40976 -189469 205568 -219671 -200556 128889 260207 186373 169808 400318 25326
19034 -54651 80735 132956 -72473 -100259 123806 418345 126755 -89191 -95291 151875 169825
19023 169825 -259173 188586 208197 179104 -96518 -133699 -22101 200171 -77227 -101685 -35533
19011 15702 262880 306784 -57329 88138 -5727 -211836 -47827 243968 125535 -157665 166704
18999 -389981 56476 199350 114899 -124868 2207 -60338 -99439 -118678 95189 -145234 177190
$$ packed form
19080a16485j1255M5614I3405e45818K33895h8234B6708b17879A20219n6002K38031
19069C02248a90215k0213a0210D6011l505c19095A90733q4509h6938j06229D7434
19057c59398I3056b06444A19233O0661c56070F5537f6701k08430f774j64691H4502
19045d0976j48493B05568b19671J9115A28889J31318p3834j6565K30510B5326
19034e4651H0735N2221g2473k7786A23806K94539A26755h9191o100A51875J7950
19023A69825b59173A88586J9611k9093i6518l7181b2101B00171g7227k4458c5533
19011A5702K47178M3904e7329H8138e727k06109d7827B43968j18433a57665A66704
18999c89981E6476J42874q4451a24868B207f0338l9101j9239I5189a45234A77190
$$ plain form
18987 132895 -312307 147580 110310 117361 -100700 -130461 -281715 -264413 -401682 -106919
18976 -394805 -274117 -104650 114973 -42685 -113917 -179322 -61452 -133736 -218548 -78467 25389
18964 -256464 216286 -20962 409 -178320 -140216 -8188 64010 -5996 -167831 27519 -160329
18952 99332 170633 -248457 -147119 -71478 -147068 292572 -645 43281 -212474 184354 -80650
18940 97721 109393 -80529 -400592 -202335 53819 -75367 -109726 144095 239740 47596 92491
18929 92491 -114171 -311253 -240606 73966 34436 -353221 59867 270574 -154866 -138586 -350764
18918 -350764 -285453 224193 142668 -112974 16188 83754 52715 -327595 134586 32226 -2965
18906 -36548 -95266 240897 -36364 -314580 -170777 -275934 -402827 51214 -188759 177106
$$ packed form
18987A32895c12307A47580l7270P051a00700k9761j51254J7302j37269a06919
18976c94805J20688a04650A14973d2685p1232o5405f1452p2284q4812g8467B5389
18964b56464B16286b0962D09a78320L8104h188F4010e996j61835B7519a60329
18952I9332P1301b48457J01338g1478p5590B92572f45D3281b12474A84354h0650
18940I7721J1672h0529l20063J98257E3819g5367l4359A44095R5645D7596M4895
18929I2491a14171j97082P0647G3966C4436c53221E9867K10707a54866J6280k12178
18918c50764O5311B24193q1525a12974A6188O7566l1039c27595A34586C2226b965
18906c6548n8718B40897c6364k78216J43803j05157j26893E1214a88759A77106
$$ plain form
18895 -72836 159625 160681 194199 230759 120740 -124551 58114 207190 -73371 166965 -377224
18883 282561 -313352 -81778 12804 32561 960 -317699 -272397 -188792 -149024 -114109 -216111
18872 -216111 -47216 -21917 73224 -175210 80078 217588 -103906 228455 -304058 -288390
18862 -288390 39357 -29283 16038 36403 -89795 -61766 -55072 185400 -138466 -1288 -89167
18851 -89167 -104363 20583 92554 443606 -252142 239262 -283143 -258189 -105341 37719 -261215
18839 -216817 76550 -24049 -190042 -195830 17217 -375686 199299 55223 -86059 -132322 -220203
18828 -220203 -236673 -208696 83870 -199236 44031 4616 -223372 16400 -125357 103309 324916
18817 324916 118500 143485 -51677 247118 128810 493452 109626 19859 187557 238851
$$ packed form
18895g2836A59625J056L3518L6560j10019a24551E8114J49076g3371A66965c77224
18883B82561c13352h1778A2804J9757I60c17699M5302Q3605L9768L4915j02002
18872b16111d7216b1917G3224a75210H0078J37510a03906B28455c04058J5668
18862b88390C9357b9283A6038K0365h9795K8029O694A85400a38466a288q7879
18851h9167j5196B0583P1971L51052b52142B39262b83143K4954a05341C7719b61215
18839b16817G6550b4049j65993n788A7217c75686A99299E5223h6059m6263q7881
18828b20203j6470K7977H3870a99236D4031D616b23372A6400a25357A03309K21607
18817C24916A18500K4985e1677B47118j18308L64642A09626A9859J67698N1294
$$ plain form
18807 238851 354207 259620 -314532 195738 30870 193245 -248699 -212564 172634 -26117
18796 -233736 -66981 -144264 185177 144494 20143 -200431 -224696 -211816 -168249 47682 7583
18784 -251520 13496 93797 66030 152389 -97622 136017 -91914 193398 22632 -259426 -116864
18772 -246285 56680 -220767 -213256 -145533 -7481 -308152 -16239 40261 21153 -120173 -158020
18761 -158020 -151715 86128 11615 -454885 70873 114171 -156454 47812 137010 177010 -154697
18749 -89481 -49211 28991 30104 89920 -264570 -307442 -231731 239524 106280 198135 -313401
18737 -204017 103265 -124156 223362 -204048 76929 -21891 313129 224200 -129319 -89263
18727 -89263 -8888 -978 -418684 -17314 -381754 149223 -237014 -234688 318459 216761 -152368
$$ packed form
18807B38851J15356r4587c14532A95738C0870J62375b48699L6135A72634b6117
18796b33736f6981p7283A85177m0683B0143b00431k4265J2880M3567D7682G583
18784b51520A3496Q0301k7767Q6359i7622A36017i1914A93398B2632b59426a16864
18772b46285E6680b20767P511O7723g481l00671a6239D0261j9108a20173l7847
18761a58020O305H6128A1615d54885G0873M3298a56454D7812Q9198M0000a54697
18749h9481M0270B8991J113N9816b64570m2872P5711B39524A06280R1855c13401
18737b04017A03265a24156B23362b04048G6929b1891C13129q8929a29319M0056
18727h9263h888i78m17706a7314l64440A49223b37014K326C18459j01698a52368
$$ plain form
18715 -110926 -147465 -136308 -151309 -99938 -250469 -76741 222811 -187851 205479 -234744
18704 -23857 -134754 -188850 -268863 112043 -16182 -203091 167477 -58008 62115 -174428 98234
18692 -316801 34847 -39982 -289989 -385372 -56255 -273127 136183 -450045 -346505 105250
18681 -22740 -77227 -219705 158070 164170 75806 -60341 40703 -555656 573234 -198648 -190936
18670 -190936 -194171 93277 -135363 5083 -137515 -275046 -447436 -41287 -9462 -22706 -519373
18659 -519373 -410274 108893 -95841 138784 75006 -89938 87495 181371 2308 3003 -126702
18647 -63547 -106394 179714 -74809 -64728 -325133 32907 178087 -143912 -178122 256147 84685
18635 -265190 -25870 -169897 -323484 29148 -51012 -3764 72912 -129901 75452 -33116 93519
$$ packed form
18715a10926l6539J1157j5001N1371j50531g6741B22811a87851B05479b34744
18704b3857j10897n4096q0013A12043a6182j86909A67477e8008F2115a74428I8234
18692c16801C4847c9982k50007r5383e6255k16872A36183d50045J03540A05250
18681b2740n4487j42478A58070O100G5806f0341D0703e55656E73234a98648P712
18670a90936l235I3277a35363E083a37515j37531j72390d1287i462j3244m96667
18659e19373J09099A08893i5841A38784o3778h9938H7495R3876B308O95a26702
18647f3547m2847A79714g4809J0081k60405C2907J45180a43912l4210B56147H4685
18635b65190b5870j44027j53587B9148e1012c764G2912a29901G5452c3116I3519
$$ plain form
18623 -541645 142798 -273320 -75124 -13321 -75595 -215073 5152 -152626 -179326 -301421 108427
18611 -232061 -182827 109380 -287663 -120458 -59410 96556 42613 104335 40652 -209187 -306331
18600 -306331 7236 99216 -5214 -211339 124609 -51682 50808 46430 -189449 96308 -167294
18588 -89848 -302290 -456081 127371 243735 -266717 -325072 45303 -185376 -302382 -414792
18578 -414792 165140 -101922 -30261 -70300 -89318 -57042 -39571 156215 37574 240865 -68118
18566 144154 220552 -130815 36448 128542 -96540 -254696 -226334 89827 -260969 173402 -68852
18554 -363411 147840 -44872 -102170 125767 -268706 140406 401715 -105253 -302226 171223
18543 -102458 -4761 47376 140710 -242399 -49782 -31261 85069 -385827 147456 -74770 93776
$$ packed form
18623e41645A42798b73320g5124a3321o2274j39478E152a52626k6700j22095A08427
18611b32061M9234A09380b87663a20458e9410I6556D2613O1722D0652b09187r7144
18600c06331G236R1980e214k06125A24609e1682E0808m378a89449I6308a67294
18588h9848k12442j53791A27371J16364b66717n8355D5303a85376j17006j12410
18578d14792A65140a01922c0261m0039j9018L2276J7471A56215C7574K03291f8118
18566A44154P6398a30815C6448R2094i6540j58156K8362H9827b60969A73402f8852
18554c63411A47840d4872n7298A25767b68706A40406K61309a05253j96973A71223
18543a02458d761D7376R3334b42399d9782J8521H5069c85827A47456g4770I3776
$$ plain form
18531 -57038 -99830 -100213 2747 -137978 185931 -78855 -40286 24383 -61633 -30606 50833 -110446
18518 -227999 -40930 -215792 -26511 -126271 -1670 88206 77395 -143102 199008 -88795 403418
18506 -14967 177297 342772 -203000 108899 -195280 294433 -79555 -125745 86420 -195426
18495 76438 -110696 129015 58840 28172 46284 -168222 1140 63234 65589 -287234 222809
18483 46689 -210364 177668 25213 -174086 -1628 -136341 26549 -141852 -49994 256178 -278579
18471 -149501 -116192 85544 -72449 -126967 220164 348695 -173617 93975 -75397 -126240 130339
18459 225588 195592 -244185 71594 122457 -330021 -178840 -6117 108564 -217780 266150
18448 -161104 106090 -128317 100555 -15097 -117237 116025 -9043 -89989 -271933 158661
$$ packed form
18531e7038m2792l83B747a37978A85931g8855L8569B4383f1633c0606E0833a10446
18518b27999d0930j74862b6511r9760a670H8206j0811a43102A99008h8795D03418
18506a4967A77297J65475b03000A08899a95280B94433g9555m6190H6420a95426
18495G6438a10696A29015E8840B8172J8112a68222A140O2094K355b87234B22809
18483D6689b10364A77668B5213a74086a628j34713B6549a41852d9994B56178b78579
18471a49501L3309H5544g2449n4518B20164J28531a73617I3975g5397n0843A30339
18459B25588k9996b44185G1594N0863c30021J51181f117A08564b17780B66150
18448a61104A06090a28317A00555a5097j02140A16025i043q0946j81944A58661
$$ plain form
18437 63238 -60711 -301474 6250 19122 162637 136789 -92843 50069 122713 220478 -144913
18425 339028 -99494 -62454 -203009 -336998 203205 49317 -63425 -228309 -340987 30313
18414 -264202 76147 64743 -304844 208595 226703 -178470 -123776 13914 -140634 17070 -16012
18402 -32810 48412 -151642 -110824 -86179 -73400 -203558 -7303 -94529 -162605 -26451 -242189
18391 -242189 -10209 -386250 186429 -60423 104465 16242 -122374 -217570 -200657 -132264 171165
18379 233327 266664 -243560 -202751 53387 -15346 212642 -27804 -181954 70378 -136198 162408
18367 50914 197251 -104906 6641 -56437 -258177 112619 -108539 99256 -154093 121836
18356 87355 129220 -49786 -41945 -355861 224326 -73918 -85931 -116008 -21001 -210089 165386
$$ packed form
18437F3238f0711k40763F250J2872J43515k5848i2843E0069P2644R7765a44913
18425C39028i9494L7040j40555j33989B03205D9317f3425j64884j12678C0313
18414b64202G6147j1404c04844B08595J8108a78470N4694A3914a40634A7070a6012
18402c2810D8412a51642M0818K4645J2779j30158g303q7226o8076b6451k15738
18391b42189a0209l76041A86429f0423A04465A6242a22374r5196J6913O8393A71165
18379B33327L3337b43560M0809E3387a5346B12642b7804j54150G0378a36198A62408
18367E0914J46337a04906F641e6437k01740A12619a08539I9256a54093A21836
18356H7355M1865d9786P841l13916B24326g3918j2013l0077b1001j89088A65386
$$ plain form
18344 121376 -128003 -17048 -266530 -162172 -269873 -67 -415091 -3644 63899 -278797 -175191
18333 -175191 -128365 87796 -66504 168542 -292428 207912 -141734 191335 155553 151423 82489
18322 82489 -178446 -194351 195722 231886 63689 55365 -171520 -42601 -142760 -200792 -81055
18310 26706 -162780 -35972 -190467 -60583 174419 -346493 98383 -132921 155186 -364870
18299 81651 216010 170511 7757 120074 -125800 -50234 -332011 -211983 -40405 -30837 -82971
18288 -82971 -113381 137854 -167390 131384 -186387 35950 27604 -73215 71039 134132 -128941
18276 189349 -132801 -243557 125023 -1797 -43884 -272405 -81387 -20928 -21466 275372 157468
18265 157468 -91181 -136183 -141383 -210461 188165 -33947 -249494 129867 32117 -45790 -212717
$$ packed form
18344A21376a28003a7048k49482J04358j07701f7m15024c644F3899b78797J03606
18333a75191M6826H7796f6504A68542b92428B07912a41734A91335l5782m130o8934
18322H2489a78446j5905A95722L6164F3689q324a71520d2601j00159n8032h1055
18310B6706a62780c5972j54495f0583A74419c46493I8383a32921A55186c64870
18299H1651J34359m5499G757J12317a25800e0234k81777J20028d0405R568n2134
18288h2971l0410A37854a67390A31384a86387C5950q346g3215G1039O3093a28941
18276A89349a32801j10756A25023a797m2087k28521h1387b0928n38B75372j17904
18265A57468i1181m5002n200o9078A88165c3947k15547A29867C2117d5790j66927
$$ plain form
18254 -212717 125667 -178454 -31958 -1891 -10314 -23536 -469768 -42761 262013 159783 -134294
18242 169719 -187434 18730 -35314 -142307 -28505 54838 183079 -59660 42119 193871 235728
18231 235728 -120707 -46947 -220748 17018 -41510 -259468 390955 243360 36884 -114941
18220 237203 -323239 -161233 -189787 -84962 106996 -510757 49447 -24680 -53464 140816
18209 46689 27283 -159956 35756 112733 11754 22583 -182150 -151022 -102455 -85844 150058
18197 -194729 4432 -141045 41877 -285597 -473318 -21524 -44896 66051 171260 -315023 -23991
18185 -115220 -17783 -28744 149144 39118 -178952 276309 -85866 246585 333914 -44388 -148393
18174 -148393 -247422 372865 -235203 72577 -164842 107612 -112305 -64968 34412 205516
$$ packed form
18254b12717A25667a78454c1958a891q423j3222m46232d2761B62013j02230a34294
18242A69719a87434A8730c5314j06993b8505E4838J28241e9660D2119J51752M1857
18231B35728a20707d6947j73801A7018d1510k17958C90955j47595C6884a14941
18220B37203c23239a61233k8554h4962A06996e10757D9447b4680k8784A40816
18209D6689j9406a59956C5756P6977A1754J0829a82150L1128M8567J6611A50058
18197a94729D432a41045D1877b85597j87721b1524k3372F6051J05209c15023b3991
18185a15220a7783j0961A49144C9118a78952B76309h5866B46585Q7329d4388j04005
18174a48393r9029C72865b35203G2577a64842A07612a12305M7337C4412J71104
$$ plain form
18164 205516 -92001 122539 -26107 37275 57752 13581 143657 -173565 72359 -65766 -36416
18153 -36416 31123 -73340 233938 208853 76606 190078 -30992 -78940 100872 -19795 -43689
18142 -43689 -64111 -50165 -135397 -113490 68364 -193974 -144789 -293368 -96974 -52133 -197731
18131 -197731 49211 -219675 -117749 -110622 5026 -220389 164210 -276124 -86993 -35647 -139133
18120 -139133 -242105 62873 11720 313596 219849 -351698 -39393 -258326 -211544 -139997 67530
18108 -276633 -146948 187307 -164123 -295488 -84547 47098 -217976 70015 -221678 -74925
18097 122944 -218980 -501554 -58418 -220760 -149784 -197804 124682 -37091 -141155 -112651
18087 -112651 335901 -240851 -157589 29217 -10873 21498 -298519 111499 -16976 -28441 77109
$$ packed form
18164B05516i2001A22539b6107C7275K0477A3581J30076a73565G2359f5766K9350
18153c6416C1123g3340B33938k5085G6606J13472c0992m7948A00872a9795k3894
18142d3689k0422J3946q5232K1907F8364a93974M9185j48579i6974M4841j45598
18131a97731D9211b19675J01926P127E026b20389A64210b76124h6993c5647j03486
18120a39133j02972F2873A1720L01876r3747c51698c9393k18933M6782P1547F7530
18108b76633J29685A87307a64123j31365h4547D7098b17976G0015b21678g4925
18097A22944b18980k82574e8418j62342P0976m8020A24682c7091j04064K8504
18087a12651C35901b40851Q3262B9217a0873B1498b98519A11499a6976j1465G7109
$$ plain form
18075 -249702 -32915 359990 -140768 5864 -154107 224455 -263886 -71008 96286 110406 315320
18064 315320 -7642 -50621 12600 107532 -218982 182685 -36490 -185032 240829 20082 167955
18053 167955 365225 251875 -167613 168537 156896 86076 12320 -96490 21550 212591
18043 212591 22866 -290275 996 -72127 -75354 -206330 124385 38521 -13470 3560 -161707
18031 -593596 194875 -69389 -12928 -223436 143879 -30828 203436 334648 192779 108871
18021 108871 -273067 -457523 -47378 -83752 307829 20471 -7923 203684 -44158 60192 -166099
18009 -87143 -135199 -360931 -80152 -180719 -253192 -156571 -281745 66425 -47202 -331826 -332317
17998 -332317 166107 21652 -46800 -150840 311377 19743 -66067 -50893 -4121 -53442 -355936
$$ packed form
18075b49702c2915C59990a40768E864a54107B24455b63886g1008I6286J4120K04914
18064C15320g642m2979A2600R4932b18982A82685c6490j48542B40829B0082J47873
18053A67955J97270j13350a67613A68537j1641p0820A2320i6490B1550J91041
18043B12591B2866b90275I96g2127l227j30976A24385C8521a3470C560a61707
18031e93596A94875f9389a2928k10508A43879c0828B03436J31212j41869q3908
18021A08871b73067j84456d7378l6374C07829B0471g923B03684d4158F0192a66099
18009h7143m8056k25732h0152j00567p2473R6621j25174F6425d7202k84624m91
17998c32317A66107B1652d6800j04040C11377A9743f6067J5174d121m9321l02494
$$ plain form
17987 -355936 207125 -171509 -50028 -93047 -147556 -5253 110392 187445 6083 -211515 -19169
17975 263018 -10237 88317 -72921 -58333 240980 -30985 56987 79423 -108843 26417 103400
17964 103400 43865 -104263 -198583 -179500 252430 -225738 79831 -210339 78769 167486 -86610
17952 18120 56624 -131067 346490 -79679 34796 -18393 224523 -403757 -9510 69970 -181862
17940 90715 222574 120981 14457 -21494 -40860 -265607 13811 105456 -77065 16612 -365253
17928 -66337 -235900 -45459 97323 -59248 117982 -59174 159553 -236733 71370 -241978 -38131
17916 -182503 -48494 -221919 50920 68420 -89991 151577 -20580 216430 -222473 19572 161136
17905 161136 -222902 -92971 208636 201242 44240 -72791 62990 -260474 -125522 193863 5535
$$ packed form
17987c55936B07125a71509e0028m3019n4509e253A10392P7053F083b11515a9169
17975B63018a0237H8317g2921J4588B40980c0985E6987K2436a08843B6417P6983
17964A03400D3865a04263r4320J9083B52430b25738G9831b10339G8769Q8717h6610
17952A8120L8504a31067C46490g9679C4796a8393B24523d03757i510F9970a81862
17940I0715J31859j01593A4457b1494j9366k24747A3811R1645g7065A6612c65253
17928f6337j69563d5459I7323e9248A17982e9174A59553b36733G1370b41978c8131
17916a82503d8494j73425E0920J7500h9991A51577b0580B16430b22473A9572J41564
17905A61136b22902i2971B08636p394D4240g2791F2990b60474a25522A93863E535
$$ plain form
17893 -52318 34847 348940 16469 190419 -125944 181840 145629 313621 41915 62904 -277528
17881 292211 67720 -221605 -23271 -55460 -90334 74630 47946 113734 367681 77534 271901
17870 271901 124617 120747 277368 -5561 -41121 -170868 -351604 75564 -179040 -481693 -162907
17858 201601 -66333 -204932 -361598 76696 -36443 156693 -255574 275618 -110590 144648
17847 -174331 238661 -130278 239734 -250375 112426 -85760 -68939 455907 97879 81379
17837 81379 -181706 113319 151197 -173203 -289371 -224498 34168 -4827 -156159 -354913 -143324
17825 104505 82298 238352 -69970 -250552 -147201 193813 -297432 -113814 -60136 36597
17814 -149558 -116701 2683 108497 -27959 227425 -206248 21412 76131 74138 -134244 80565
$$ packed form
17893e2318C4847L14093A6469J73950a25944A81840l6211J67992D1915K0989b77528
17881B92211F7720b21605b3271l2189l4874G4630k6684O5788K53947G7534J94367
17870B71901A24617l870J56621e561l5560j29747j80736G5564a79040l02653a62907
17858B01601f6333j38599j56666G6696c6443A56693b55574B75618a10590A44648
17847a74331B38661a30278B39734b50375A12426h5760J6821D55907I7879j6500
17837H1379a81706A13319L7878a73203j16168O4873C4168d827j51332j98754a43324
17825A04505k2207J56054f9970j80582J03351A93813b97432a13814N3678C6597
17814a49558L2857B683J05814b7959B27425b06248B1412N4719j993a34244H0565
$$ plain form
17802 -124113 148118 -79304 109321 88932 90419 -144306 14563 -23157 -49574 74573 238376
17791 238376 -86591 180500 -192267 172367 -57284 -204599 224603 -31704 -37512 8910 -113139
17779 -303750 -142529 -84458 188743 -42582 316360 -103528 -257380 204750 99826 -358754
17768 -189113 -18774 287811 206402 -247666 36384 244452 -45665 -22106 -119847 -291209 313234
17756 -110668 -1283 189856 120470 77177 -165829 196055 -93197 213888 30191 -218217 18091
17744 -73484 71644 69082 238205 112962 -133663 348348 187487 -155041 -272545 -282170 -20801
17732 8756 255820 199329 80826 -117601 62977 -120763 36251 111292 -133862 134740 196058
17721 196058 59700 78146 153941 -167906 75443 172447 -4741 469760 174817 105456 -13826
$$ packed form
17802a24113A48118g9304A09321k0389J487a44306A4563b3157k6417G4573J63803
17791B38376h6591A80500a92267A72367e7284j47315B24603c1704n808H910a13139
17779c03750a42529N8071A88743d2582C16360a03528j53852B04750I9826c58754
17768a89113a8774B87811q1409b47666C6384K08068d5665b2106r7741j71362C13234
17756a10668a283A89856o9386m3293a65829A96055i3197B13888C0191b18217A8091
17744g3484G1644k562J69123A12962a33663C48348j60861a55041j17504r625b0801
17732H756K47064n6491H0826a17601F2977a20763C6251P5041a33862A34740O1318
17721A96058E9700J8446P5795a67906G5443R7004d741D69760A74817o9361a3826
$$ plain form
17709 -111167 317912 -58784 -62336 -47678 305921 -43613 68481 -200171 -241212 -27578 -185493
17698 -185493 -248096 49974 18210 -153424 101104 142485 -107511 -118051 -77261 217245 -52288
17686 -21158 -167175 8501 -93034 76479 68581 -196270 -69360 140453 159402 -227293 -71121
17674 -52861 178610 99197 253467 149325 -5254 34966 16124 6034 -110423 -58318 106729
17662 22143 76167 22137 173429 42983 -138795 -81569 -146871 485740 139324 -3449 9756
17650 -216779 -109916 -8327 89583 419037 -251038 -21657 21320 225447 159830 -4512 -181713
17639 -181713 -55270 -169623 199303 311489 -83029 -167374 -63965 69414 -130186 166661
17628 -51049 -35503 -70468 256294 88557 -134530 160812 123211 -292842 -219103 -176845 212250
$$ packed form
17709a11167C17912e8784l552J4658C05921d3613F8481b00171m1041b7578j57915
17698a85493o2603D9974A8210a53424A01104M1381a07511j0540M0790B17245e2288
17686b1158j46017H501i3034G6479p898a96270f9360A40453J8949b27293g1121
17674e2861A78610p9413J54270j04142e254C4966A6124F034a10423N2105A06729
17662B2143N4024B2137J51292D2983a38795N7226o5302D85740A39324c449I756
17650b16779J06863h327H9583L29454b51038b1657B1320K04127o5617d512j77201
17639a81713e5270j14353A99303J12186h3029q4345f3965F9414a30186A66661
17628e1049J5546l4965B56294H8557a34530A60812l7601b92842P3739M2258B12250
$$ plain form
17616 -35619 -104848 -81760 184279 162019 -42948 34574 251770 -19907 385044 -176249 129718
17604 -269085 14561 -189104 127625 -28345 -164237 -425433 -189759 6062 -28217 324379
17593 84203 -189935 161836 -188584 47531 239541 127212 -42373 46477 -148896 165321
17582 213552 -45261 216529 -296050 167942 90145 302588 96153 115559 -48209 -241844
17572 -241844 -203889 -86809 255675 277145 -87003 -88370 313152 226095 263299 66903 113383
17561 113383 280554 21992 238621 393945 208105 69206 -247830 -123996 98105 67166
17551 67166 43955 -14761 60041 -40058 -133337 95888 325031 118529 -168467 -111209 1906
17539 -68193 -135840 6929 126510 407591 11966 134445 331040 348051 171918 209316 -175218
$$ packed form
17616c5619o9229K3088A84279k2260d2948C4574K17196a9907C85044a76249A29718
17604b69085A4561a89104A27625b8345j35892k61196a89759F062b8217C24379
17593H4203a89935A61836a88584D7531J92010j12329d2373D6477a48896A65321
17582B13552d5261B16529b96050A67942p7797K12443I6153J9406d8209j93635
17572b41844L7955h6809B55675K1470h7003j367C13152q7057L7204F6903M6480
17561A13383J67171B1992K16629J55324j85840F9206b47830J23834I8105l0939
17551F7166k3211a4761F0041d0058r3279I5888K29143A18529a68467N7258A906
17539f8193o7647F929J19581K81081A1966J22479J96595J7011A71918L7398a75218
$$ plain form
17527 176888 182997 184711 448559 -109699 66565 -18188 124985 18172 176246 21049 108593
17516 108593 11068 247677 129139 -156251 446308 98126 124463 92857 -287017 209615
17505 -27370 158794 -113555 136925 69290 154106 -283587 94301 307259 -222767 224347
17494 149953 85601 34505 -13575 27231 283240 36117 -15619 29500 -85998 306972 167265
17483 167265 407756 115698 209813 96785 -113415 171947 201496 26997 105154 -69730 189860
17471 1227 275561 232233 152279 186923 185661 384780 190737 -36463 98936 26392 -299129
17459 199008 -10463 218643 66454 252818 438160 163638 -65612 169630 -129797 110932
17448 550649 310734 283937 437997 95399 207669 268039 551185 337634 356577 292140
$$ packed form
17527A76888O109J714K63848a09699F6565a8188A24985A8172J58074B1049Q7544
17516A08593A1068K36609j18538a56251D46308I8126K6337l1606b87017B09615
17505b7370A58794a13555A36925o7635Q4816b83587I4301K12958b22767B24347
17494A49953o4352C4505a3575B7231K56009C6117a5619B9500h5998C06972j39707
17483A67265K40491A15698R4115I6785a13415A71947K9549B6997P8157f9730A89860
17471A227K74334m3328p9954L4644j262J99119A90737c6463I8936B6392b99129
17459A99008a0463B18643F6454J86364J85342A63638f5612A69630a29797A10932
17448E50649k39915k6797J54060I5399J12270O0370K83146k13551J8943o4437
$$ plain form
17438 292140 173317 312908 12109 419048 32522 315317 151233 297169 431560 304678
17428 304678 63958 309758 83528 337275 201132 273207 473726 151359 29519 478284
17418 478284 393109 555052 238166 409827 432376 161625 300733 354069 149318 306458
17408 306458 337219 393162 -346620 191348 84803 89309 121860 311002 419331 297829 576790
17397 576790 84736 285504 -194692 260660 220226 46071 186648 378034 168949 121355
17387 121355 93993 259511 200629 91153 -202228 99221 20045 58275 245062 68490 351500
17376 351500 140477 173494 -2239 135914 316687 313020 344083 -64344 383426 109027 145400
17365 145400 246588 69664 -226399 189062 193066 296146 60873 206352 356761 194493
$$ packed form
17438B92140j18823J39591A2109M06939C2522K82795A51233J45936J34391j26882
17428C04678F3958K45800H3528K53747j36143P2075K00519A51359B9519M48765
17418D78284q5175J61943B38166J71661K2549A61625J39108N3336A49318J57140
17408C06458L0761N5943c46620A91348H4803M506L2551J89142J08329j21502K78961
17397E76790H4736K00768a94692B60660m0434D6071J40577J91386A68949m7594
17387A21355k7362J65518n8882I1153b02228I9221B0045L8230J86787F8490K83010
17376C51500A40477L3017b239A35914J80773l667L1063f4344C83426A09027L6373
17365A45400J01188F9664b26399A89062M004J03080F0873J45479J50409j62268
$$ plain form
17355 194493 188888 24971 -101076 173237 67598 363754 80882 211326 316488 -108904
17344 236840 -386756 372295 201125 163878 292057 82655 26461 233428 -19717 -244253
17334 -244253 -32428 112336 79653 119749 156913 131107 334017 336347 287855 32978 -3227
17322 495321 335671 -249775 4815 342352 -413 156156 273232 -155570 -51080 211765 48198
17310 114571 67135 280297 48683 -37151 500339 7613 303643 408962 667640 308374
17299 99888 182509 555569 441565 210201 213565 22707 176350 101077 172227 -54810 -141313
17288 -141313 102013 339767 276478 221666 268296 244234 192383 221405 72162 208442 48397
17276 -420092 226420 274789 484269 317923 -13546 -30945 236289 231376 214078 195288 13513
$$ packed form
17355A94493n605B4971a01076A73237F7598K96156H0882J30444J05162a08904
17344B36840c86756C72295j71170l7247J28179H2655B6461K06967a9717k24536
17334b44253c2428A12336l2683M0096L7164k5806K02910K330m8492C2978c227
17322D95321j59650b49775D815L37537d13A56156J17076a55570e1080B11765D8198
17310A14571m7436K13162D8683c7151E00339G613K96030J05319K58678C08374
17299I9888Q2621L73060j14004B10201L364B2707J53643p5273P1150e4810q6503
17288a41313A02013K37754o3289n4812M6630k4062n1851K9022G2162J36280D8397
17276d20092B26420M8369K09480j66346a3546j7399B36289m913j7298j8790A3513
$$ plain form
17264 208957 424158 147330 368694 99468 668858 70311 177852 130781 74832 260744
17254 260744 129025 468797 -177427 333982 305856 137488 246881 422535 -18755 336100
17243 187951 126711 316856 229858 194196 314486 289470 100699 167696 254643 66579 467507
17232 467507 226561 288227 40520 93572 145685 119943 -3365 200161 255913 198698 479093
17221 479093 -176932 259527 103368 164891 404964 -21381 244212 431017 258520 131507
17211 131507 176933 394038 319451 455033 179174 252279 351393 331694 190252 67747 191033
17200 191033 194639 670054 43620 87137 -210931 242216 164428 99662 -85000 388835 175915
17188 388445 565353 179674 288832 156183 209827 108673 187924 174655 217102 635814
$$ packed form
17264B08957K15201A47330K21364I9468N69390G0311J07541m7071n5949J85912
17254B60744A29025L39772a77427C33982k8126A37488J09393J75654a8755C36100
17243A87951o1240J90145q6998l5662J20290k5016A00699O6997Q6947F6579M00928
17232D67507B26561O1666D0520N3052N2113k5742c365B00161N5752n7215K80395
17221D79093a76932B59527A03368O1523K40073b1381B44212J86805j72497j27013
17211A31507M5426K17105p4587J35582A79174P3105R9114j9699j41442F7747J23286
17200A91033L606M75415D3620M3517b10931B42216p7788o4766h5000C88835A75915
17188C88445J76908A79674J09158j32649N3644j01154P9251j3269M2447M18712
$$ plain form
17178 635814 621808 410759 259170 210125 453989 -154847 405444 307248 640299 170816
17167 230758 -107505 569357 286368 227602 148836 269408 95063 103577 206877 184282 147739
17156 147739 255260 217808 321383 520898 347991 641612 247887 299522 503879 -42 316880
17144 359477 176737 653393 187430 235207 372072 307052 392771 155147 46381 518437
17134 518437 425292 188769 13064 569123 234044 394736 282128 181888 292145 366881
17124 366881 557282 245459 639603 163765 535120 589006 501359 411139 188869 310465
17114 310465 561684 205770 379903 542114 658553 462339 223078 447018 672171 213153
17103 333313 483479 602411 182132 693763 458293 458962 376775 705245 672917 372724
$$ packed form
17178F35814j4006k11049j51589m9045K43864a54847D05444r8196L33051A70816
17167B30758a07505E69357k82989n8766p8766J20572I5063Q514J03300k2595l6543
17156A47739J07521l7452J03575J99515j72907K93621B47887N1635K04357d2C16880
17144C59477A76737M76656A87430M7777J36865o5020Q5719A55147D6381M72056
17134E18437r3145A88769A3064N56059B34044J60692j12608j00240J10257P4736
17124C66881J90401B45459L94144A63765L71355N3886q7647r0220A88869J21596
17114C10465K51219B05770J74133J62211J16439j96214B23078K23940K25153B13153
17103C33313J50166J18932A82132N11631k35470O69q2187L28470l2328l00193
$$ plain form
17093 372724 253933 709390 457281 376690 615551 787938 417381 437141 452564 253664
17083 253664 772326 604898 387549 841400 585642 242560 688416 704237 350509 152814
17072 442995 513029 602584 408710 504653 511745 617879 775579 550744 547509 543300 578698
17061 578698 756888 424962 160195 462350 743963 522239 613349 630364 688394 551136
17051 551136 503302 960946 759342 262874 695917 705917 491807 406627 569454 330450
17041 330450 823200 505510 600043 428801 255697 665186 738975 607898 672677 580916
17031 580916 751839 722417 873752 726210 363240 626321 673830 939006 617044 863946
17021 863946 532676 1151914 410807 564737 432720 793349 745480 633192 870220 694278
$$ packed form
17093C72724j18791M55457k52109q0591K38861J72387l70557J9760J5423j98900
17083B53664N18662j67428k17349M53851k55758B42560M45856J5821C50509A52814
17072D42995P0034Q9555j93874R5943P092J06134J57700k24835l235m209L5398
17061E78698J78190l31926A60195L02155K81613k21724R1110J7015N8030j37258
17051E51136m7834M57644k01604B62874M33043J0000k14110q5180J62827k39004
17041C30450M92750l17690R4533j71242j73104M09489P3789j31077O4779r1761
17031E80916J70923k9422J51335j47542l62970K63081M7509K65176l21962K46902
17021H63946l31270O19238D10807J53930j32017L60629m7869j12288K37028j75942
$$ plain form
17011 694278 686382 778248 562084 651976 778374 777981 805571 753713 881024 996607 899606
17000 899606 825654 532662 1046095 736496 965865 1121067 617733 934666 684259 1093116
16990 1093116 1081764 956128 981409 859232 995195 908571 1126521 1003541 1249789 777492
16980 777492 723518 1276801 1135434 1091177 1097445 952542 890294 1145227 1061853 933984 879091
16969 879091 1444499 1237199 1129130 1234331 1075987 1215334 1031123 976011 1295950 1112095
16959 1112095 1357367 1293638 888948 1150559 1471685 1216899 1392233 1478348 1115956 1325595
16949 1325595 1030744 941818 982437 1471433 1348747 1161790 948923 1048020 1113129 1453678
16939 1453678 1297780 1188622 1622550 1212460 1400143 1246015 1344363 1564438 1327732 1038078
$$ packed form
17011F94278p896R1866k16164Q9892J26398l93K7590n1858J27311J15583r7001
17000H99606p3952k92992N13433l09599K29369J55202n03334L16933k50407M08857
16990A093116j1352j25636K5281j22177J35963q6624K17950j22980K46248m72297
16980G77492n3974N53283j41367m4257O268j44903o2248K54933q3374j27869n4893
16969H79091N65408k07300j08069J05201j58344J39347j84211n5112L19939j83855
16959A112095K45272o3729m04690K61611L21126k54786J75334Q6115l62392K09639
16949A325595k94851q8926M0619M88996j22686j86957k12867R9097O5109L40549
16939A453678j55898j09158M33928m10090J87683j54128R8348K20075k36706k89654
$$ plain form
16929 1038078 1424659 1649325 1556866 1479335 1335494 1480179 1632400 1265314 1458552 1547394
16919 1547394 1581034 1638692 1732502 1738881 1818655 1823224 1767700 1476633 1498329 1655289 1738705
16908 1738705 1770548 1868837 1685918 1637769 1844179 1661156 1970424 1592854 1863502 2098424
16898 2098424 2172690 2224356 1768493 2073969 1930937 2497486 2365275 2320434 2001336 2240667
16888 2240667 2436442 2318244 2215634 2520871 2256768 2261659 2668293 2583204 2426848 2358159
16878 2358159 2702706 2485314 2849502 2809068 2422989 2836263 2486577 3019424 2407094 2572734
16868 2572734 2840894 2944866 3108246 2993603 3434297 3066952 3195524 3049418 3271734
16859 3271734 3146241 3141597 3071902 3663522 3453737 3357051 3564061 3621265 3442258 3551149
$$ packed form
16929A038078L86581K24666r2459p7531j43841J44685J52221l67086J93238Q8842
16919A547394L3640N7658R3810O379P9774M569n5524k91067K1696J56960Q3416
16908A738705L1843R8289j82919m8149K06410j83023L09268l77570K70648K34922
16898B098424P4266N1666m55863L05476j43032N66549j32211m4841l19098K39331
16888B240667J95775j18198j02610L05237k64103M891M06634q5089j56356o8689
16878B358159L44547k17392L64188m0434l86079M13274l49686N32847o12330J65640
16868B572734K68160J03972J63380j14643M40694l67345J28572j46106K22316
16859C271734j25493m644o9695N91620k09785r6686K07010N7204j79007J08891
$$ plain form
16849 3551149 3711380 3794752 3741869 4026543 4038425 4183263 4082421 4405767 4439282 4404903
16839 4404903 4244548 4721565 4529466 4593893 4558868 4693587 4810423 5210529 4796395 5180504
16829 5180504 5309597 5519791 5365761 5604263 5355520 5945807 6090857 6036032 6260377 6309209
16819 6309209 6369757 6367714 6481573 6966645 6845896 7003594 7111570 7408952 7207806 7472368
16809 7472368 7825038 7893367 8207867 8282832 8403923 8650062 9090970 8688588 9217227 9280058
16799 9280058 9501698 10035739 10330088 10194938 10503411 11007172 11230113 11515396 11956465
16790 11956465 12103238 12408901 12744712 13205442 13508285 13998980 14456242 14589138 15228449
16781 15228449 15849980 15975846 16839825 17222571 17381272 18380842 18970143 19357354 20187623
$$ packed form
16849C551149J60231Q3372n2883K84674J1882J44838j00842L23346L3515l4379
16839D404903j60355M77017j92099O4427l5025J34719J16836M00106m14134L84109
16829E180504J29093K10194j54030K38502k48743N90287J45050n4825K24345M8832
16819F309209O0548k043J13859M85072j20749J57698J07976K97382k01146K64562
16809G472368L52670O8329L14500P4965J21091K46139M40908m02382N28639O2831
16799I280058K21640N34041K94349j35150L08473N03761K22941K85283M41069
16790A1956465J46773L05663L35811M60730L02843M90695M57262J32896O39311
16781A5228449O21531J25866Q63979L82746J58701R99570N89301L87211Q30269
$$ plain form
16772 20187623 20830969 21359148 22478152 23254370 23952962 24900557 26017535 26904134 27876125
16763 27876125 29075953 29988983 31345910 32733844 33886747 35690734 37044362 38631487
16755 38631487 40601616 42317449 44606796 46699728 48970075 51255947 54143908 57008316
16747 57008316 59823100 62963049 66151468 69978932 73953200 78002126 82472570 87386009
16739 87386009 91995954 97583013 103178967 109520947 115345599 121848727 128513055 135818507
16731 135818507 142493605 149750070 157256652 164062269 170879436 176835887 182889263 187577055
16723 187577055 191158775 194197952 195735830 196414957 195617538 193487525 190683736 186670610
16715 186670610 181452523 175575809 169109036 162492133 155767195 148151544 141000172 133469269
$$ packed form
16772B0187623O43346N28179J119004P76218O98592R47595J116978Q86599R71991
16763B7876125J199828R13030J356927J387934J152903J803987J353628J587125
16755C8631487J970129J715833K289347K092932K270347K285872K887961K864408
16747E7008316K814784L139949L188419L827464L974268M048926M470444M913439
16739H7386009M609945N587059N595954O341980N824652O503128O664328P305452
16731A35818507O675098P256465P506582O805617O817167N956451O053376M687792
16723A87577055L581720L039177J537878O79127p97419k130013k803789m013126
16715A86670610n218087n876714o466773o616903o724938p615651p151372p530903
$$ plain form
16707 133469269 126620947 119906989 113297207 106678202 100709526 94982958 89624434 84586531
16699 84586531 79889674 75414228 70892739 67425622 63735640 60102957 57442626 54170803
16691 54170803 51603200 48712280 46566542 43953646 41920580 39828698 38353131 36387628
16683 36387628 34715134 33074429 32198975 30353545 29447155 28176566 26915186 25540390
16675 25540390 24652153 23552346 22729128 22068393 21197928 20666023 19613629 18886162 18522856
16666 18522856 17691847 17167278 16201245 16119538 15463818 14720308 14669373 14541537 13488460
16657 13488460 13057651 12993527 12334982 12375191 11659066 11179266 11250243 10915325 10816921 10134014
16647 10134014 10470158 9541312 9410963 8980247 9073201 8807865 8514996 8306478 7940345
$$ packed form
16707A33469269o848322o713958o609782o619005n968676n726568n358524n037903
16699H4586531m696857m475446m521489l467117l689982l632683k660331l271823
16691E4170803k567603k890920k145738k612896k033066k091882j475567j965503
16683C6387628j672494j640705q75454j845430r06390j270589j261380j374796
16675B5540390q88237j099807q23218o60735q70465n31905j052394p27467l63306
16666A8522856q31009n24569r66033q1707o55720p43510n0935j27836j053077
16657A3488460m30809o4124o58545M0209p16125m79800P0977l34918r8404o82907
16647A0134014L36144r28846j30349m30716R2954k65336k92869k08518l66133
$$ plain form
16638 7940345 7698726 7681264 7214636 7660986 6973619 7129417 6846798 6992485 6574824 6404306
16628 6404306 6198189 6236939 6093701 5856335 5536636 5869462 5746152 5481251 5222240 5118171
16618 5118171 5097190 4923458 4826618 4534908 4686208 4110057 5015757 4576819 4538288 4241773
16608 4241773 4056920 3740467 3999352 3848252 4001961 3726524 3240026 3578277 3372891
16599 3372891 3484322 3604229 3206947 3378698 3476297 3378108 3306450 3178980 3059558 2952210
16589 2952210 3067591 2827324 3202939 2896872 2743247 2755808 2882220 2457317 2433474 2614452
16579 2614452 2555613 2389482 2440262 2573602 2641767 2620637 2228186 2104800 2434749 2172269
16569 2172269 2339721 2244810 2338636 2242123 1946697 2147154 1846555 1995476 1870575 1984793
$$ packed form
16638G940345k41619j7462m66628M46350o87367J55798k82619J45687m17661j70518
16628F404306k06117L8750j43238k37366l19699L32826j23310k64901k59011j04069
16618E118171k0981j73732r6840k91710J51300n76151R05700m38938l8531k96515
16608D241773j84853l16453K58885j51100J53709k75437m86498L38251k05386
16599C372891J11431J19907l97282J71751R7599r8189p1658j27470j19422j07348
16589B952210J15381k40267L75615l06067j53625J2561J26412m24903k3843J80978
16579B614452n8839j66131N0780J33340O8165k1130l92451j23386L29949k62480
16569B172269J67452r4911R3826r6513k95426K00457l00599J48921j24901J14218
$$ plain form
16559 1984793 1883435 2098618 1745979 1811792 1653754 1746410 1725733 1800250 1698716 1454429
16549 1454429 1989377 1717425 1499434 1324267 1782104 1352186 1533290 1588553 1621040 1603483
16539 1603483 1452489 1200759 1395957 1650414 1455260 1430715 1688180 1297676 1217549 1526719
16529 1526719 1700465 1140219 1420973 1038040 1024224 1280594 1004055 1133951 1101622 1347346
16519 1347346 1247847 1203941 1163144 754193 1348578 1053176 1448783 1109478 1250900 1110633
16509 1110633 1023486 1041894 964604 1064293 1107270 1142717 1096950 1161451 984204 1070791 862490
16498 862490 1085390 765352 855922 911363 984287 818529 984658 869539 885304 854299
16488 854299 1079275 629966 1166560 927066 1090171 610616 769670 880391 691454 573159
$$ packed form
16559A984793j01358K15183l52639O5813j58038R2656k0677P4517j01534k44287
16549A454429N34948k71952k17991j75167M57837m29918J81104N5263L2487j7557
16539A603483j50994k51730J95198K54457j95154k4545K57465l90504q0127L09170
16529A526719J73746n60246K80754l82933j3816K56370k76539J29896l2329K45724
16519A347346r9499m3906m0797m08951N94385k95402L95607l39305J41422j40267
16509A110633q7147J8408p7290R9689M2977L5447m5767O4501j77247Q6587k08301
16498H62490K22900l20038R0570N5441P2924j65758J66129j15119J5765l1005
16488H54299K24976m49309N36594k39494J63105m79555J59054J10721j88937j18295
$$ plain form
16478 573159 455622 807159 613201 911793 555668 569105 825416 660444 701321 897574
16468 897574 630159 753369 605440 421235 630270 784458 610214 680479 615968 783974
16458 783974 545484 461852 958335 445201 561142 572991 640261 639415 535306 780700 606239
16447 606239 801354 530584 838222 461864 614729 748730 651039 529277 345208 617973
16437 617973 458063 726121 403542 537961 445087 165178 924068 352898 682211 519579
16427 519579 592462 499506 649201 613970 588937 200619 566251 411224 397804 520949
16417 520949 128366 383885 572758 109186 361425 423532 668587 490069 289041 225952
16407 225952 365035 643674 416147 496980 130485 519525 149677 261900 428976 438071
$$ packed form
16478E73159j17537L51537j93958K98592l56125J3437K56311j64972M0877J96253
16468H97574k67415J23210j47929j84205K09035J54188j74244P0265o4511J68006
16458G83974k38490q3632M96483D45201J15941J1849O7270q46j04109K45394j74461
16447F06239J95115k70770L07638l76358J52865J34001r7691j21762j84069K72765
16437F17973j59910K68058l22579J34419r2874A65178P58890C52898L29313j62632
16427E19579P2883r2956J49695l5231k5033B00619L65632j55027j3420J23145
16417E20949A28366K55519J88873A09186K52239O2107K45055j78518k01028o3089
16407B25952J39083K78639k27527Q0833A30485L89040A49677J12223J67076R095
$$ plain form
16397 438071 153238 495185 257717 626415 405521 421031 357806 365197 474436 519507
16387 519507 440223 121155 365045 279675 585942 392223 494803 260247 237878 405294
16377 405294 466482 301763 466164 443722 130326 453655 317310 469806 216370 184449
16367 184449 125428 198901 665378 332518 247479 -60614 438204 489410 348243 -68534 66033
16355 552884 303165 395828 253323 304278 269575 140356 230894 72072 233791 243869 -165639
16343 62236 464576 381360 565817 100733 162830 -317550 333433 -80512 31360 457020
16333 457020 115712 384136 96297 -156365 143883 38373 187895 202331 114698 108774 435894
16322 435894 16565 238152 109610 223099 -67401 -30214 210283 -16372 556367 363047
$$ packed form
16397D38071A53238L41947k37468L68698k20894J5510o3225P391J09239M5071
16387E19507p9284A21155K43890q5370L06267j93719J02580k34556k2369J67416
16377D05294O1188j64719J64401k2442A30326L23329j36345J52496B16370l1921
16367A84449n9021P3473M66477C32518q5039f0614D38204N1206j41167f8534F6033
16355E52884k49719R2663j42505N0955l4703j29219R0538G2072J61719J0078a65639
16343F2236M02340q3216J84457A00733O2097c17550C33433h0512C1360M25660
16333D57020A15712K68424I6297a56365A43883C8373J49522J4436q7633n924L27120
16322D35894A6565K21587A09610J13489f7401c0214B10283a6372E56367j93320
$$ plain form
16312 363047 62829 32623 115701 93349 -187476 168956 169275 99833 60241 219388 -110432
16300 -56853 14819 87919 227640 -160946 -162496 11903 -27861 449225 302642 15216 290101
16289 290101 -9743 88304 149718 45736 254142 -5173 156189 21214 13482 185206 -2337 137858
16276 82421 34356 340753 -230970 192087 -16997 313364 229664 -2408 115553 -212851 398361
16264 149495 -22821 38409 553384 -270103 15389 367238 183848 -45941 496059 -149099
16253 78739 129602 216903 -82442 -142906 -51904 52305 -2210 20813 304414 -40277 125397
16241 148218 58185 282065 237599 -161985 89327 -104461 39173 -297217 187234 194150 -68169
16229 235529 169014 131356 45541 -93488 236732 418382 75983 248873 145334 312711
$$ packed form
16312C63047F2829l0206Q3078k2352a87476A68956L19o9442l9592J59147a10432
16300e6853A4819P3100J39721a60946j550A1903b7861D49225j46583A5216K74885
16289B90101i743H8304O1414D5736K08406e173A56189B1214p732J71724b337A37858
16276H2421C4356L06397b30970A92087a6997C13364q3700b408A15553b12851C98361
16264A49495b2821C8409N14975b70103A5389L51849j83390d5941D96059a49099
16253G8739N0863Q7301h2442o0464e1904E2305b210B0813K83601d0277A25397
16241A48218E8185K23880m4466a61985H9327a04461C9173b97217A87234O916f8169
16229B35529o6515l7658D5541i3488B36732J81650G5983J72890j03539J67377
$$ plain form
16219 312711 -298841 8232 -119684 184338 26492 46691 -180365 -59809 -175469 112669
16208 160459 369820 273002 19018 138875 -84224 486108 272825 -128614 -171778 170889
16197 -17963 328736 32663 3595 -236293 -169641 -261752 -15684 149421 1408 17471 -237846
16185 -45324 -133827 350613 218169 -29176 121316 202047 -54520 529603 80752 -102218 -110749
16174 -110749 335360 160182 71313 191537 -24053 260848 253082 -223189 319262 171731
16164 171731 -134411 239135 -9772 47151 -172645 54564 -65299 353263 148681 276851
16154 276851 173598 -107187 -173102 175199 215873 -160961 105895 -31084 303758 -47303
16143 77876 -31671 109387 281337 -75509 -150900 -90343 352884 111568 -61068 229679 -156778
$$ packed form
16219C12711b98841H232a19684A84338B6492K0199a80365e9809j15660A12669
16208A60459K09361r6818A9018J19857h4224D86108k13283a28614m3164A70889
16197a7963C28736C2663C595b36293O6652r2111a5684A49421A408J6063b37846
16185d5324q8503C50613j32444b9176A21316Q0731e4520E29603H0752a02218q531
16174a10749C35360A60182G1313J20224b4053B60848p766b23189C19262j47531
16164A71731a34411B39135i772D7151a72645E4564f5299C53263A48681J28170
16154B76851j03253a07187o5915A75199M0674a60961A05895c1084C03758d7303
16143G7876c1671A09387J71950g5509p5391O0557C52884A11568f1068B29679a56778
$$ plain form
16131 -254366 151863 -38411 -68379 36462 -129240 237545 -205836 -164127 -88418 -129221 -76390
16120 -76390 -96821 54963 -171951 71974 14206 -460842 -5846 -150787 -85882 310554 -340292
16108 129488 193925 -6553 -131163 281116 158947 178318 29089 277040 48945 443087 -81116
16096 90252 48295 -204799 263430 227181 318466 14053 -262961 -401880 16030 66317 -24428
16084 -24629 45147 57382 143417 23534 -34583 -13769 12493 355663 -211780 -312021 201755
16072 226754 -56612 -40265 273661 234921 -147443 69119 205778 128159 -311208 30375 265020
16061 265020 222708 110459 -42083 -74388 15063 22421 126027 -142068 -100964 -166048 -133269
16050 -133269 151004 188718 -204440 -103949 65636 -284663 -280501 -254909 -170964 30987 -147363
$$ packed form
16131b54366A51863c8411k9968C6462a29240B37545b05836M1709P5709m0803N2831
16120g6390k0431E4963a71951G1974A4206d60842e846j44941O4905C10554c40292
16108A29488O4437f553j24610B81116j22169J9371B9089K47951D8945L94142h1116
16096I0252m1957b04799B63430l6249R1285A4053b62961j38919A6030N0287b4428
16084b4629D5147J2235Q6035B3534c4583a3769A2493L43170b11780j00241B01755
16072B26754e6612J6347B73661l8740a47443F9119J36659p7619c11208C0375K34645
16061B65020m2312A10459d2083l2305A5063P358J03606a42068M1104o5084L2779
16050a33269A51004L7714b04440J00491F5636b84663M162K5592Q3945C0987a47363
$$ plain form
16038 -37000 -122528 -174580 42447 199823 133478 215589 -321944 8530 -40594 13434 101240
16027 101240 72003 -160404 282053 12634 -299759 -399692 -127700 114485 197071 -17117
16016 75351 -117122 107664 -72324 148577 85956 26572 199652 14499 328424 -300513
16005 60087 -195924 154879 -103487 226157 -197858 -6592 15716 -67589 40298 -78725 12154
15993 57934 22814 -86767 412837 134303 -39608 -125881 1316 107989 124343 254290 341116
15982 341116 288208 159722 498678 149196 177920 161911 -97238 235587 -69360 -298485
15972 -298485 -80994 -177545 374536 -334262 76136 200133 122619 -113264 -128353 -19165 -119319
15961 -119319 157949 252325 -186385 48422 129794 -400951 -38230 9432 -304447 219793 -261769
$$ packed form
16038c7000q5528n2052D2447J57376o6345Q2111c21944H530d0594A3434Q7806
16027A01240k9237a60404B82053A2634b99759r9933a27700A14485Q2586a7117
16016G5351a17122A07664g2324A48577o2621B6572J73080A4499L13925c00513
16005F0087a95924A54879a03487B26157a97858f592A5716f7589D0298g8725A2154
15993E7934B2814h6767D12837A34303c9608q6273A316J06673J6354J29947Q6826
15982C41116n2908j28486L38956A49196K8724j6009i7238B35587f9360k29125
15972b98485h0994r6551C74536c34262G6136J23997p7514a13264j5089a9165j00154
15961a19319A57949R4376a86385D8422Q1372d00951c8230I432c04447B19793b61769
$$ plain form
15949 -124503 33430 57799 38947 -53517 219457 -74291 127749 90769 84644 70980 143120
15938 143120 -537095 -78470 17087 -81207 -51692 325055 -74339 -9356 -42971 -256788 -9842
15926 -53954 138223 -221288 -70021 -132639 11038 -166153 -286735 -363765 -212641 -111674
15916 -111674 -225790 -116995 302516 -175463 55665 170378 -174206 28381 -67542 29926
15905 156216 -143935 35005 -130430 -5405 -194400 351294 -298592 -178190 -102035 151570
15894 -221318 -246225 -32452 -194964 -143151 -103846 307152 130604 13546 -81654 -233279 -89264
15882 -13582 7928 -63507 -10268 -224457 -46139 257021 62040 -145670 123047 29589 7468
15870 -437644 -72146 -106740 63098 178166 -154159 99526 52512 -180092 -220757 42442 -224373
$$ packed form
15949a24503C3430K4369j8852e3517B19457g4291A27749l6980o125j3664P2140
15938A43120e37095g8470A7087h1207K9515C25055g4339i356l3615k13817i842
15926e3954A38223b21288g0021o2618A1038a66153j20582p7030J51124J00967
15916a11674j14116J08795C02516a75463E5665J14713a74206B8381f7542B9926
15905A56216a43935C5005a30430e405j88995C51294b98592J20402P6155A51570
15894b21318k4907c2452j62512N1813L9305C07152A30604A3546h1654j51625h9264
15882a3582G928f3507a0268k14189d6139B57021F2040a45670A23047B9589G468
15870d37644g2146l4594F3098J15068a54159I9526m7014a80092m0665D2442b24373
$$ plain form
15858 -21976 5167 -82793 -59613 395567 97699 -123722 -2499 177710 -179454 24820 -114675
15846 -371669 186663 174654 -74478 20952 -114379 26409 60984 58794 -2304 311638 37761
15834 55823 -87834 16873 -64736 -76274 367215 -109413 -210889 -119139 -102315 -59514 195636
15822 -299642 201706 248042 -145646 130088 232541 -325267 -158423 -17397 -108699 47368
15811 72666 264596 65451 -11352 8047 42324 -119918 211355 -348618 -88002 -18523 131520
15799 172312 52630 7286 1214 -101306 223297 -137093 141633 15040 314491 -53538 -144782
15788 -144782 234812 -325469 16965 -192845 -14811 -38004 -173949 -192556 -80630 41779 176892
15777 176892 -168215 2442 279264 -107548 -143520 -258791 -353136 105095 -76106 -335904
$$ packed form
15858b1976E167h2793K3180C95567I7699a23722b499A77710a79454B4820a14675
15846c71669A86663j2009g4478B0952a14379B6409L4575k190b304C11638C7761
15834E5823h7834A6873f4736j1538C67215a09413j01476R1750J6824M2801A95636
15822b99642B01706M6336a45646A30088J02453c25267a58423a7397r1302D7368
15811G2666J91930F5451a1352H047L4277a19918B11355c48618h8002a8523A31520
15799A72312E2630G286A214a01306B23297a37093A41633A5040K99451e3538r1244
15788a44782B34812c25469A6965a92845a4811k3193j35945j8607h0630D1779J35113
15777A76892a68215B442K76822a07548l5972j15271r4345A05095g6106k59798
$$ plain form
15767 -335904 -191532 -155328 53016 -146992 234723 -48178 -371605 -78717 -1428 64165 213111
15756 213111 242713 -135263 86930 -153752 114824 93431 -26220 178989 -132983 -114958
15746 -114958 -134477 217831 -31416 60166 -14473 470378 -53439 -42568 22680 34282 -23328
15734 -139859 -292418 -133553 -156801 -162213 461089 -120902 68723 -164360 -79763 52573 269148
15723 269148 208718 56849 369111 -160249 -32234 16564 144960 -135361 -180460 -5388 269961
15711 -14405 -72166 -79548 -182444 53425 64253 196994 8978 208648 -71926 184390 -36767
15699 -372534 -201665 107911 -16239 -194944 -76129 -1582 251169 94432 46281 -152275 70736
15687 -67087 88497 57225 -114936 33512 240476 188766 160576 -146574 -151275 -194733 -374 10349
$$ packed form
15767c35904J44372L6204E3016a46992B34723d8178l23427g8717a428F4165J48946
15756B13111K9602a35263H6930a53752A14824k1393b6220A78989a32983J8025
15746a14958j9519B17831c1416F0166a4473D70378e3439J0871B2680J1602b3328
15734a39859j52559a33553k3248n412D61089a20902F8723a64360g9763E2573K16575
15723B69148o0430E6849L12262a60249c2234A6564J28396a35361m5099e388B69961
15711a4405n7761p382j02896E3425J0828J32741H978J99670g1926A84390c6767
15699c72534J70869A07911a6239j78705g6129a582B51169I4432D6281a52275G0736
15687f7087H8497l1272a14936C3512K06964n1710k8190a46574m701m3458c74A0349
$$ plain form
15674 -138851 18142 38343 194196 178291 173225 -103609 296785 86770 -32585 -82260 -300766
15663 -300766 -165311 38463 284267 -209982 143178 -37030 -316135 36546 32715 -262166
15652 -102446 -195787 30601 -229435 55170 188378 75717 156109 -24636 -326531 -54747 329582
15640 -273677 -383773 -224579 -314120 236990 147951 -154461 -45913 36508 -39478 94087 -212070
15628 -196077 128245 -127875 263603 -64625 4476 -141035 185019 -198054 146799 326088
15618 326088 248458 24743 177340 -169544 -168564 -46462 -78144 163661 -104308 -284421 -43916
15606 103570 178519 -170361 -48379 -222503 -130591 120770 -282032 -327747 192926 47045
15595 83977 180522 -118767 200678 -287717 98186 -107034 5493 -270457 -14302 -264235 -44717
$$ packed form
15674a38851A8142K0201J55853j5905n066a03609B96785H6770c2585m9675k18506
15663c00766J35455C8463K45804b09982A43178c7030k79105C6546l831b62166
15652a02446r3341C0601b29435E5170J33208G5717Q0392b4636l01895e4747C29582
15640b73677j10096J59194q9541B36990q9039a54461d5913C6508c9478I4087b12070
15628a96077A28245a27875B63603f4625D476a41035A85019a98054A46799J79289
15618C26088p7630B4743J52597a69544R80d6462l1682A63661a04308j80113d3916
15606A03570P4949a70361d8379j74124R1912A20770b82032m5715A92926D7045
15595H3977R6545a18767B00678b87717I8186a07034E493b70457a4302k49933d4717
$$ plain form
15583 251412 -238535 103830 -151115 137389 -245616 46532 -74859 -64899 -144890 -201980 -8877
15571 85102 124207 -99895 -365872 12517 106719 -285283 157706 194965 -97248 14366 -114131
15559 16061 -3057 22308 -299264 116218 41356 48154 -109 -58761 27236 -116047 89276 251408
15547 251408 -237073 -249262 168401 26533 15574 67620 -3129 -52269 -278559 -234049 -81732
15535 -4688 -71236 68028 70692 -67473 -128498 360950 179335 -45033 258211 205414 91434
15523 164995 -201791 66700 -103853 74141 142957 -292885 9866 -97697 61329 139667 -259732
15511 -83524 -105368 110284 -23236 125463 133679 -391340 59665 -355131 277623 -56427 189584
15499 -55746 95437 -139855 165113 -105049 -201179 19936 93716 11479 41707 -127321 -290609
$$ packed form
15583B51412b38535A03830a51115A37389b45616D6532g4859R960p9991n7090h877
15571H5102L9105i9895k65977A2517R4202b85283A57706L7259i7248A4366a14131
15559A6061c057B2308b99264A16218D1356O798a09n8652B7236a16047H9276J62132
15547B51408b37073j2189A68401B6533j0959N2046c129m9140k26290M4510h1732
15535d688o6548F8028K664f7473o1025C60950A79335d5033B58211n2797I1434
15523A64995b01791F6700a03853G4141O8816b92885I866i7697F1329P8338b59732
15511h3524k1844A10284b3236A25463Q216c91340E9665c55131B77623e6427A89584
15499e5746I5437a39855A65113a05049r6130A9936P3780A1479L0228a27321j63288
$$ plain form
15488 -290609 71956 170417 70103 303313 70450 -133074 56991 -201882 -7696 -7466 -19208
15477 -19208 -123212 117445 278224 -59395 -297826 -28285 -119389 -188139 -118577 -140903 -83466
15466 -83466 -213298 -67861 -99594 33005 -70813 218967 -140163 -323204 88856 -89588 -116711
15455 -116711 -156850 -230781 -95990 151555 -201430 50079 72833 101973 -66406 -109471 -257546
15444 -257546 16900 39977 -76974 233619 -128975 244267 144105 -118612 331477 178973
15434 178973 103304 -107452 111494 2267 -110819 -210831 -114326 -48956 -277014 -183117 -65844
15422 -97057 165449 -263329 -220962 122081 -280168 298115 29148 61813 235052 -104266
15411 -104716 156414 -181212 -103667 -55577 67609 -277844 221342 -179193 268476 172811
$$ packed form
15488b90609G1956R8461G0103K33210G0450a33074E6991b01882g696K30j1742
15477a9208j04004A17445J60779e9395k38431b8285r1104o8750O9562k2326N7437
15466h3466j29832f7861l1733C3005g0813B18967a40163j83041H8856h9588k7123
15455a16711m0139p3931i5990A51555b01430E0079K2754K9140f6406m3065j48075
15444b57546A6900K3077g6974B33619a28975B44267j00162a18612C31477j52504
15434A78973p5669a07452A11494B267a10819j00012R6505d8956k28058R3897f5844
15422i7057A65449b63329M2367A22081b80168B98115B9148L2665J73239a04266
15411a04716A56414a81212P7545M8090F7609b77844B21342a79193B68476r5665
$$ plain form
15401 172811 -103419 63072 -148388 -157355 -74270 87405 90519 135485 -92390 -32199 -225811
15390 -225811 -145972 185763 -223132 -133195 -101188 -312850 147849 -135474 -210553 -251968
15380 -251968 -119023 -211421 -83376 -61919 138638 109979 -306077 61517 297226 92474 147949
15369 147949 146655 63488 18025 -7842 -294441 -240727 104980 63680 -2156 14432 -390087
15357 173463 -77591 -41854 120168 94267 20437 153050 -147441 238945 -164988 32552
15346 -87399 4595 -135904 -49812 358715 -179561 -11547 106003 -84239 -41397 -188111 162229
15334 76104 -93964 78966 10092 130036 60389 391563 28178 6102 192146 30966 198781
15323 198781 -209753 -182237 -93642 -52890 516617 58235 -30713 34722 166741 214045 190952
$$ packed form
15401A72811a03419F3072a48388q967g4270H7405L114M4966i2390c2199j93612
15390b25811P9839A85763b23132Q9937L2007k11662A47849a35474p5079m1415
15380b51968a19023r2398h3376K1457A38638k8659c06077F1517K35709I2474N5475
15369A47949j294F3488A8025g842k86599N3714A04980m1300b156A4432c90087
15357A73463g7591L5737A20168k5901B0437J32613a47441B38945a64988C2552
15346h7399D595a35904d9812C58715a79561a1547A06003h4239d1397j46714A62229
15334G6104i3964G8966A0092J19944F0389L31174B8178F102J86044C0966J67815
15323A98781b09753K7516Q8595M0752E16617E8235c0713C4722J32019M7304k3093
$$ plain form
15312 190952 25528 24857 35127 -89325 115098 105265 20499 32399 -73638 -66535 -69294 54657
15299 337602 -169248 213363 181232 40191 108777 93526 167127 15727 7704 119980 -80577
15287 45531 226318 -136388 -82603 39416 267167 -142642 -203311 -19698 -123127 215490
15276 112809 -176005 43035 85675 -71070 806 8807 -40169 -81418 246162 -66911 43199 102015
15264 102015 34936 -120652 -39522 -116288 -109642 11655 28564 321163 -141470 425864 262384
15253 262384 107493 33255 85266 102127 394808 473794 870615 1831319 1262375 1526401
15243 1526401 1402579 525907 -8589 329591 282404 217589 216974 -144316 292708 132921 21218
15231 132251 61643 78784 -157871 330508 182147 -202577 58322 -63697 -68082 -56309 100348
$$ packed form
15312A90952B5528o71J0270h9325A15098r833B0499J1900g3638P103k759E4657
15299C37602a69248B13363l2131D0191O8586j5251P3601A5727G704J12276h0577
15287D5531J80787a36388N3785C9416K27751a42642o0669a9698j03429B15490
15276A12809a76005D3035M2640g1070H06Q001d0169m1249B46162f6911D3199N8816
15264A02015C4936a20652c9522p6766O646A1655J6909K92599a41470D25864j63480
15253B62384A07493C3255N2011J6861K92681P8986L96821R60704n68944K64026
15243A526401j23822E25907h589C29591m7187o4815o15a44316B92708A32921B1218
15231A32251F1643J7141a57871C30508j48361b02577E8322f3697m385J1773A00348
$$ plain form
15219 39011 -311545 88047 163588 66157 92549 56072 122046 288586 -69779 98191 139164
15208 139164 171925 219461 254552 -113209 -15286 110668 -188071 8921 4729 -38477 -142660
15197 -142660 -5948 88387 18491 120544 108730 -86720 481916 162097 183221 -25242 43269
15185 373518 219839 105368 55661 136079 88461 227116 -164387 2379 32411 145162 -177434
15173 -37082 99378 259776 -135952 198059 243450 152802 -7111 -156441 58822 56090 -107659
15161 75139 -86747 4605 221064 66143 375348 346962 425682 125440 -60054 -21074 94791
15149 318549 162265 75305 180820 -78422 114097 173619 -45289 23296 -101306 -125875 419034
15137 -21615 113694 -283758 276950 -27922 -142213 -229585 217933 186921 195122 156772 245926
$$ packed form
15219C9011c11545H8047P5541F6157K6392l6477O5974J66540f9779I8191M0973
15208A39164L2761M7536L5091a13209a5286A10668a88071H921m192c8477j04183
15197a42660e948H8387A8491J02053j1814h6720D81916A62097K1124b5242D3269
15185C73518j53679A05368m9707Q0418m7618J38655a64387B379L0032J12751a77434
15173c7082I9378J60398a35952A98059M5391r0648g111j49330E8822k732a07659
15161G5139h6747D605K16459F6143L09205k8386P8720A25440f0054b1074I4791
15149C18549j56284G5305J05515g8422A14097N9522d5289B3296a01306k4569D19034
15137b1615A13694b83758B76950b7922j14291q7372B17933l1012Q201l8350Q9154
$$ plain form
15126 245926 107094 361226 53318 -200185 85794 215151 249104 280586 128465 255724
15116 255724 -220117 -7194 368938 183210 115547 158573 -113411 62713 30818 -45090 133045
15104 201546 32911 175920 53716 384602 176642 356883 181531 440386 130553 -4678
15093 316919 42357 45316 225787 -17557 195335 6400 323788 -80787 206030 344852 64522
15081 -35621 -233772 115178 129263 292606 107649 130058 74091 324725 -57829 272741
15070 212706 -123893 -72445 132939 28939 23461 259312 -23515 241457 143886 323506 272913
15059 272913 457810 -20370 -116737 330807 11967 132936 194798 246644 212712 188893 354687
15048 354687 316388 121497 309770 593149 269368 27181 -6348 119365 14840 253978
$$ packed form
15126B45926A07094K54132E3318b00185H5794J29357L3953L1482A28465J27259
15116B55724b20117g194C68938A83210o7663M3026a13411F2713C0818d5090A33045
15104B01546C2911J43009E3716L30886A76642J80241j75352K58855A30553d678
15093C16919D2357K959J80471a7557A95335F400L17388h0787B06030J38822F4522
15081c5621j98151A15178J4085J63343A07649K2409n5967K50634e7829B72741
15070B12706a23893N1448A32939B8939n478K35851b3515B41457r7571J79620n0593
15059B72913J84897b0370r6367C30807A1967J20969O1862N1846l3932k3819J65794
15048C54687l8299A21497J88273K83379B69368B7181f348A19365A4840K39138
$$ plain form
15038 253978 -10929 -20207 184268 -44145 166555 244942 118742 319633 97762 345003 76987
15026 120309 303225 171415 99238 -222374 274144 382694 182116 155527 -86861 -216506
15016 -216506 303049 461108 251291 312135 362591 591227 385211 533830 107593 146391
15006 146391 240242 -105548 431139 128750 326128 157210 356904 71442 -164457 447475
14995 158022 141422 341406 155158 360216 387098 13378 45169 260578 112311 43103
14984 5373 63918 333944 241734 32578 137376 -20669 60555 206217 286488 255670 503397
14973 503397 281660 215416 247009 414806 204741 549624 594417 202309 37620 16764
14962 458369 576767 336388 283755 24294 268423 190049 283737 234044 378835 435159 390875
$$ packed form
15038B53978a0929r278A84268d4145A66555P8387A18742K00891I7762K47241G6987
15026A20309J82916j31810p2177b22374B74144J08550A82116k6589h6861j29645
15016b16506C03049J58059k09817O0844N0456K28636k06016J48619A07593L8798
15006A46391R3851a05548D31139A28750J97378A57210J99694G1442a64457D47475
14995A58022j6600J99984A55158K05058K6882A3378L1791K15409A12311D3103
14984E373N8545K70026r2210C2578J04798b0669F0555J45662Q0271l0818K47727
14973E03397k21737o6244L1593J67797B04741L44883M4793B02309C7620A6764
14962D58369J18398k40379n2633B4294K44129p8374R3688m9693J44791N6324m4284
$$ plain form
14951 390875 -16015 -20214 200241 348369 212754 356675 70691 406320 258293 72264
14940 392134 511522 480317 88087 365951 338191 276117 564818 169644 334164 265568
14930 265568 216758 -92711 278273 398178 454362 250078 300625 201653 346901 442356 406494
14919 406494 363757 299287 203817 523137 225572 205330 216858 608157 442774 184254
14908 498539 514726 559526 313028 296366 167052 513322 483835 526218 379870 194066
14898 194066 327068 512211 58305 353106 478669 447291 553522 391886 586744 577609
14888 577609 260931 155315 625086 167499 429225 523711 328958 -87960 620041 842347
14878 842347 361956 428238 580000 261048 65527 286033 286358 386215 398220 364874 317183
$$ packed form
14951C90875a6015m199B00241J48128j35615J43921G0691L35629j48027G2264
14940C92134J19388l1205H8087K77864k7760o2074K88701A69644J64520o8596
14930B65568m8810i2711B78273J19905N6184k04284N0547r8972J45248R5455l5862
14919D06494m2737o4470r5470L19320B25572k0242J1528L91299j65383A84254
14908D98539J6187M4800k46498j6662j29314L46270k9487M2383j46348j85804
14898A94066J33002J85143E8305K94801J25563l1378J06231j61636J94858r135
14888E77609B60931j05616M69771A67499K61726R4486j94753h7960F20041K22306
14878H42347C61956O6282J51762B61048F5527K20506L25R9857J2005l3346m7691
$$ plain form
14867 317183 623846 448696 628321 614588 502602 366907 263511 466412 451203 379075
14857 379075 392880 216089 169183 398592 467323 377155 511174 487582 507341 300454 520255
14846 520255 527075 578224 464292 578810 285728 614131 739410 619894 610962 499198
14836 499198 579959 362363 495456 744553 360272 795174 502631 523579 488998 859953
14826 859953 230586 412208 319046 551147 527776 620985 527309 459832 612624 791951
14816 791951 358495 227267 539169 733033 502598 99404 536898 600839 1071121 511405
14805 411005 526502 793484 348753 569599 592894 773282 656016 517255 292636 476846
14795 476846 383921 701866 211734 576972 647624 470048 862960 632898 624902 460024
$$ packed form
14867C17183L06663j75150J79625j3733j11986j35695j03396K02901j5209p2128
14857C79075J3805j76791m6906K29409O8731r0168J34019k3592J9759k06887K19801
14846E20255O820N1149j13932J14518B85728L28403J25279j19516q932j11764
14836D99198Q0761k17596J33093K49097C60272M34902k92543K0948l4581L70955
14826H59953B30586J81622r3162K32101k3371R3209r3676o7477J52792J79327
14816G91951C58495j31228L11902J93864k30435I9404M37494O3941M70282E11405
14805D11005J15497K66982C48753K20846K3295J80388j17266j38761k24619J84210
14795D76846r2925L17945B11734L65238P0652j77576L92912k30062p996j64878
$$ plain form
14785 460024 788396 578634 178501 699582 237853 624235 367785 714242 770242 627643
14775 627643 543318 513855 712072 954479 706278 602660 843281 652425 659899 607045
14765 607045 1044302 410700 498189 784675 862253 385565 925464 813407 900272 671791
14755 671791 598199 531787 545563 839678 780553 944684 954361 828096 854661 660943 820490
14744 820490 916804 446075 773986 561205 508737 961424 790402 956191 929157 1051430
14734 1051430 684718 731303 757599 880133 925184 490916 789930 960743 1118795 654069
14724 654069 521472 748099 955324 972962 892552 1018303 1221727 883716 756969 716762
14714 716762 1084217 596144 878470 1096058 963124 729301 694105 1028382 908681 1037944
$$ packed form
14785D60024L28372k09762A78501N21081B37853L86382k56450L46457N6000j42599
14775F27643q4325k9463J98217K42407k48201j03618K40621j90856P474n2854
14765F07045M37257D10700Q7489K86486P7578C85565N39899j12057Q6865k28481
14755F71791p3592o6412J3776K94115n9125J64131R677j26265K6565j93718J59547
14744H20490R6314D46075L27911k12781n2468M52687j71022J65789k7034J22273
14734A051430l66712M6585K6296J22534M5051m34268K99014J70813J58052m64726
14724F54069j32597K26627K07225J7638q0410J25751K03424l38011j26747m0207
14714G16762L67455m88073K82326K17588j32934k33823l5196L34277j19701J29263
$$ plain form
14704 1037944 873174 1120893 1116943 921615 721007 1099646 889094 768114 1077027 982759
14694 982759 1191223 868262 1023226 981177 1132364 827540 884546 1149989 884800 1102859
14684 1102859 1062692 1114246 1170817 1022302 1097477 1221625 943833 1113569 1241605 981899
14674 981899 1018829 1036412 850077 1014172 938911 1372579 1451572 666190 1976318 1201743
14664 1201743 1635173 1238925 1367222 1013800 977299 1100466 1337062 1147366 923116 1193148
14654 1193148 1216325 1134640 1180430 1265686 1444891 1160449 1315588 1000922 1415784 1033103
14644 1033103 1493712 1203992 1102711 1460868 1449687 1477444 1282999 1341149 1383381 1220425
14634 1220425 1291414 1501737 1326304 1410218 1463385 1395938 1332032 1849639 1689066 1790375
$$ packed form
14704A037944j64770K47719l950j95328k00608L78639k10552j20980L08913r4268
14694I82759K08464l22961J54964m2049J51187l04824N7006K65443k65189K18059
14684A102859m0167N1554N6571j48515P5175J24148k77792J69736J28036k59706
14674I81899L6930J7583j86335J64095p5261M33668P8993F66190J310128p74575
14664A201743M33430l96248J28297l53422l6501J23167K36596j89696k24250K70032
14654A193148K3177q1685M5790Q5256J79205k84442J55139l14666M14862l82681
14644A033103M60609k89720j01281L58157j1181K7757j94445N8150M2232j62956
14634A220425P0989K10323j75433Q3914N3167o7447o3906N17607j60573J01309
$$ plain form
14624 1790375 1741011 1452841 1297234 1228422 1456070 1797201 2092842 1765782 1931611 1814137
14614 1814137 1781374 1665106 1301913 1694479 1608351 1911913 1837012 1602308 1716112 1941561
14604 1941561 1894151 1826449 1633072 2101024 1815122 1912872 1780351 1823804 1833659 2080485
14594 2080485 2161088 1945439 2025091 1836495 2051497 2057487 1931287 2196873 1981436 1927056
14584 1927056 1911986 2231472 2140349 2129384 2454988 2095677 2185620 2298835 2458730 2480100
14574 2480100 2146221 2322278 2386630 2653744 2598847 2275955 2496163 2903551 2288247 2715501
14564 2715501 2706020 2456671 2911177 2993120 2953813 2974106 3224551 3048304 3433836 3071279
14554 3071279 3485453 3952601 4061373 4905799 5812931 7390715 11234434 20120736 40965871
$$ packed form
14624A790375m9364k88170j55607o8812K27648L41131K95641l27060J65829j17474
14614A814137l2763j16268l63193L92566q6128L03562p4901k34704J13804K25449
14604A941561m7410o7702j93377M67952k85902R7750j32521M3453R855K46826
14594B080485Q0603k15649P9652j88596K15002N990j26200K65586k15437n4380
14584A927056j5070L19486r1123j0965L25604l59311Q9943J13215J59895K1370
14574B480100l33879J76057O4352K67114n4897l22892K20208M07388o15304M27254
14564B715501r481k49349M54506Q1943l9307K0293K50445j76247L85532l62557
14554C071279M14174M67148J08772Q44426R07132J577784L843719Q886302K0845135
$$ plain form
14545 40965871 49451707 25730590 12095625 7250446 4125983 2812477 2218596 2465658
14537 2465658 2188899 2184269 2099243 2098254 2208784 2172964 2374064 2089095 2384579 2404381 2290133
14526 2290133 2448490 2449847 2573322 2710020 2647208 2649726 2875009 2651177 2871756 2785850
14516 2785850 2867810 2874340 3094465 3123252 3139040 3038600 3149644 3212113 3064592 3521497
14506 3521497 3062863 3043449 3381171 3448101 3321025 3265672 3625325 3523916 3390176 3292294
14496 3292294 3638312 3653053 3685817 3543353 3670625 3600612 3687777 3848479 3966631 3846029
14486 3846029 4139726 4299981 4158217 3941203 4288756 4431801 4406117 4321247 4407356 4678800
14476 4678800 4380678 4119916 4690796 4652031 4477872 4862993 4712904 4840829 4567853 4826442
$$ packed form
14545D0965871Q485836k3721117A2095625m845179l124463j313506n93881K47062
14537B465658k76759m630q5026r89J10530l5820K01100k84969K95484J9802j14248
14526B290133J58357J357J23475J36698o2812K518K25283k23832K20579q5906
14516B785850Q1960O530K20125K8787J5788j00440J11044O2469j47521M56905
14506C521497m58634j9414L37722O6930j27076n5353L59653j01409j33740r7882
14496C292294L46018J4741L2764j42464J27272p0013Q7165J60702J18152j20602
14486C846029K93697J60255j41764k17014L47553J43045k5684q4870Q6109K71444
14476D678800k98122k60762N70880l8765j74159L85121j50089J27925k72976K58589
$$ plain form
14466 4826442 4749294 4900731 5198024 5185581 5047466 4972602 5376344 5656942 5472701 5457446
14456 5457446 5535625 5290326 5872008 5484789 5869153 5691953 6139519 6307412 5542294 6192245
14446 6192245 6302585 6374084 6348047 6349479 6116013 6683772 6699555 6777621 6756126 7025403 6733003
14435 6733003 6990126 7138700 7368982 7508260 7403467 7409542 7735855 7414053 7814909 8108816
14425 8108816 7917420 8146559 8538150 8477784 8461012 9029319 8946030 8608183 9037907 9054102
14415 9054102 9252805 9246970 9316664 9628698 9761191 10074580 9806096 9982482 10448154 10848587
14405 10848587 10980347 10805401 11331800 11423498 11740898 11760093 11921350 11765607 12181092 12298734
14395 12298734 12479756 12921133 12959510 13473932 13043245 14065578 13814136 14241202 14424261
$$ packed form
14466D826442p7148J51437K97293j2443j38115p4864M03742K80598j84241j5255
14456E457446P8179k45299N81682l87219L84364j77200M47566J67893p65118O49951
14446F192245J10340P1499k6037J432k33466N67759J5783P8066k1495K69277k92400
14435F733003K57123J48574K30282J39278j04793O075L26313l21802M00856K93907
14425H108816j91396K29139L91591o0366j6772N68307q3289l37847M29724J6195
14415I054102J98703n835O9694L12034J32493L13389k68484J76386M65672M00433
14405A0848587J31760j74946N26399R1698L17400J9195J61257j55743M15485J17642
14395A2298734J81022M41377L8377N14422m30687J022333k51442M27066J83059
$$ plain form
14386 14424261 14732997 15190902 15259114 15434280 15802697 16164319 16499917 16747478 16828749 17192363
14376 17192363 18055660 17953514 18304421 18815254 19200518 19071866 19769022 20234543 20442332
14367 20442332 20878759 21329315 21772344 22482229 22886132 23238818 23637348 24273939 24478442
14358 24478442 25404220 26074291 26086188 27200481 27570441 28335410 29288474 29606164 30228200
14349 30228200 30665322 31874627 32554651 33816856 34806418 35217246 36223704 36784500 38055465
14340 38055465 38963655 40242990 41148378 42021233 43285431 45113799 46378761 47496482
14332 47496482 48902127 50357290 51896949 53666541 55716891 56993175 58946746 61017393
14324 61017393 63379553 65208728 67643261 69592287 72257017 74874580 77294757 80256600
$$ packed form
14386A4424261L08736M57905O8212J75166L68417L61622L35598K47561Q1271L63614
14376A7192363Q63297j02146L50907N10833L85264j28652O97156M65521K07789
14367B0442332M36427M50556M43029P09885M03903L52686L98530O36591K04503
14358B4478442R25778O70071J1897J114293L69960P64969R53064L17690O22036
14349C0228200M37122J209305O80024J262205R89562M10828J006458N60796J270965
14340C8055465R08190J279335R05388Q72855J264198J828368J264962J117721
14332D7496482J405645J455163J539659J769592K050350J276284J953571K070647
14324F1017393K362160J829175K434533J949026K664730K617563K420177K961843
$$ plain form
14316 80256600 83369357 86346423 89930214 93140242 96843755 101114673 105362847 109312331
14308 109312331 114380423 118773916 123995071 129272755 134823774 141042202 147538152 154102276
14300 154102276 161336280 169133123 177114214 185370653 194675717 203953991 213928283 224418070
14292 224418070 235716652 247161118 259317606 271866187 284921968 298538963 312840678
14285 312840678 327101706 341811832 356600605 371393338 385967555 400169653 414105038
14278 414105038 426681673 438209152 448853910 457316880 464210156 468611941 469172679 467083064
14270 467083064 463061450 460197428 457189983 451993985 445760803 437017455 425981974 413872945
14262 413872945 400377434 386217035 371628275 356657085 341539588 326815632 312431103
$$ packed form
14316H0256600L112757K977066L583791L210028L703513M270918M248174L949484
14308A09312331N068092M393493N221155N277684N551019O218428O495950O564124
14300A54102276P234004P796843P981091Q256439R305064R278274R974292J0489787
14292B24418070J1298582J1444466J2156488J2548581J3055781J3616995J4301715
14285C12840678J4261028J4710126J4788773J4792733J4574217J4202098J3935385
14278D14105038J2576635J1527479J0644758Q462970O893276M401785N60738k089615
14270D67083064m021614k864022l007445n195998o233182q743348j1035481j2109029
14262D13872945j3495511j4160399j4588760j4971190j5117497j4723956j4384529
$$ plain form
14255 312431103 297835923 283954851 271600777 258928257 246443231 234889543 223528541
14248 223528541 212965015 202953134 193298629 184340650 176265024 168201136 160383571 153506556
14240 153506556 146427412 139837861 134245392 128411071 123229225 117946563 113245033 108438979
14232 108438979 104179586 100601622 96914739 92949985 89333667 85786836 82623019 79541489
14224 79541489 77088858 73913356 71424386 69072810 66794756 64740228 62574393 60407435
14216 60407435 58485032 56698854 55334575 53618417 52098909 50518607 48557735 47393201
14208 47393201 46093928 45296743 43929587 42520277 41220157 39952916 38853519 38205871
14200 38205871 37256147 36685389 35536594 34564487 33673288 32846416 32227299 31017213 30485497
$$ packed form
14255C12431103j4595180j3881072j2354074j2672520j2485026j1553688j1361002
14248B23528541j0563526j0011881r654505q957979q075626q063888p817565o877015
14240A53506556p079144o589551n592469n834321n181846n282662m701530m806054
14232A08438979m259393l577964l686883l964754l616318l546831l163817l081530
14224G9541489k452631l175502k488970k351576k278054k054528k165835k166958
14216F0407435j922403j786178j364279j716158j519508j580302j960872j164534
14208D7393201j299273p97185j367156j409310j300120j267241j099397o47648
14200C8205871r49724n70758j148795r72107q91199q26872o19117j210086n31716
$$ plain form
14191 30485497 29760088 28905813 28271582 27422868 26927167 26188373 25707699 25025111 24758363
14182 24758363 23947429 23558684 23115824 22511975 21817617 21568270 21105021 20788299 20452985
14173 20452985 19729252 19730948 18959407 18838476 18268272 17930901 17588370 17449523 17072884 16788165
14163 16788165 16486618 16091478 16073836 15545581 15864238 15203687 14857082 14420990 14352097 13970412
14153 13970412 13400595 13703824 13431988 13455726 12881856 12948502 12705714 12717535 12230581 12064610
14143 12064610 11798358 11805827 11703638 11456782 11242625 11112253 11085913 10792453 10538397 10731973
14133 10731973 10138773 10165541 10305689 9968485 9650085 9406890 9343692 9367603 9249368 9407378
14123 9407378 8989392 8892245 8776513 8725084 8413491 8320255 8077458 8198195 8048242 8116521
$$ packed form
14191C0485497p25409q54275o34231q48714m95701p38794m80674o82588k66748
14182B4758363q10934l88745m42860o03849o94358k49347m63249l16722l35314
14173B0452985p23733J696p71541j20931n70204l37371l42531j38847l76639k84719
14163A6788165l01547l95140j7642n28255L18657o60551l46605m36092o8893l81685
14153A3970412n69817L03229k71836K3738n73870O6646k42788J1821m86954j65971
14143A2064610k66252P469j02189k46856k14157j30372k6340k93460k54056J93576
14133A0731973n93200K6768J40148l37204l18400k43195o3198K3911j18235J58010
14123I407378m17986r7147j15732n1429l11593r3236k42797J20737j49953O8279
$$ plain form
14113 8116521 7918326 7698316 7757025 7402563 7534657 7089146 7316059 7276058 7037386 6922521
14103 6922521 6873607 7206800 6852043 6571659 6734849 6298387 6659971 6385632 6320887 6153622
14093 6153622 6366117 6236684 6082997 5888988 6055172 5954327 5868023 5823101 5907847 5471854
14083 5471854 5557079 5260824 5438783 5006322 5161655 5535805 4911672 5307506 5118822 5110530
14073 5110530 5076897 4963862 4823227 5008627 4732061 4671625 4874468 4743623 4551027 4563055
14063 4563055 4550896 4658867 4504825 4668803 4773459 4312450 4254994 4301184 4353920 3986734
14053 3986734 3800875 4041731 3957810 4220360 3836864 3805365 4202085 3805662 3925347 3946391
14043 3946391 3691426 3595509 3844161 3816831 3443679 3488767 3326301 3572527 3254496 3256282
$$ packed form
14113H116521j98195k20010N8709l54462J32094m45511K26913m0001k38672j14865
14103F922521m8914L33193l54757k80384J63190m36462L61584k74339o4745j67265
14093F153622K12495j29433j53687j94009J66184j00845q6304m4922Q4746m35993
14083E471854Q5225k96255J77959m32461J55333L74150o24133L95834j88684q292
14073E110530l3633j13035j40635J85400k76566o0436K02843j30845j92596J2028
14063D563055j2159J07971j54042J63978J04656m61009n7456M6190N2736l67186
14053C986734j85859K40856q3921K62550l83496l1499L96720l96423J19685K1044
14043C946391k54965r5917K48652k7330l73152M5088j62466K46226l18031J786
$$ plain form
14033 3256282 3328318 3532110 3612901 3433370 3378603 3259503 3739721 3197060 2956153 3207499
14023 3207499 3157499 2852608 3337572 3492336 2834261 2744484 2746368 2843750 2776763 2731825 2887179
14012 2887179 2718102 2916367 2587713 2619301 2543128 2596316 2600899 2514391 2695347 2322081
14002 2322081 2211065 2453197 2413917 2096406 2268169 2271849 1960387 2196008 2366826 2142071
13992 2142071 2125167 2194530 2428883 2946672 5111688 12185487 32049144 49681700 32552820
13983 32552820 16018255 9818828 6331627 5237809 4548126 3957513 4153203 3639782
13975 3639782 3485851 3145064 3130382 3039895 2897357 2557019 2641326 2553367 2255997 2386806
13965 2386806 2788651 2645515 2573156 2170725 2129395 2517491 2495785 2168416 2468854 2524341
$$ packed form
14033C256282P2036K03792Q0791j79531n4767j19100M80218n42661k40907K51346
14023C207499n0000l04891M84964J54764o58075q9777J884R7382o6987m4938J55354
14012B887179j69077J98265l28654L1588p6173N3188M583q6508J80956l73266
14002B322081j11016K42132l9280l17511J71763L680l11462K35621J70818k24755
13992B142071j6904O9363K34353N17789K165016P073799J9863657J7632556j7128880
13983C2552820A6018255o199427l487201j093818o89683n90613J95690n13421
13975C639782j53931l40787j4682r0487j42538l40338Q4307q7959k97370J30809
13965B386806M01845j43136p2359m02431m1330L88096k1706l27369L00438N5487
$$ plain form
13955 2524341 2105150 2132985 2062998 2400288 2008361 2534877 2137853 2224135 1961666 1768674
13945 1768674 2132350 2206195 2158368 1982167 1958109 2012701 1826158 1774396 1818508 1901997 2073077
13934 2073077 1923705 1590378 1752229 1864566 1597207 1745260 1579630 1622782 1632124 1859274
13924 1859274 1785787 1708116 1468905 1479527 1918081 1474702 1189067 1466415 1261646 1650237
13914 1650237 1754413 1626361 1711847 1884322 1365626 1457405 1593232 1499338 1596382 1392794
13904 1392794 1223705 1831687 1873304 1468615 1699420 1377936 1623290 1828823 1616362 1623971
13894 1623971 1443913 1332330 1517474 1315228 1680928 1487758 1332879 1464073 1320900
13885 1320900 1265497 1274811 1195622 1320324 1215559 1136489 1470582 1361525 1299417 1387530 1284351
$$ packed form
13955B524341m19191K7835o9987L37290l91927N26516l97024Q6282k62469j92992
13945A768674L63676P3845m7827j76201k4058N4592j86543n1762M4112Q3489J71080
13934B073077j49372l33327J61851J12337k67359J48053j65630M3152R342K27150
13924A859274p3487p7671k39211J0622M38554m43379k85635K77348k04769L88591
13914A650237J04176j28052Q5486J72475n18696R1779J35827r3894R7044k03588
13904A392794j69089O07982M1617m04689K30805l21484K45354K05533k12461P609
13894A623971j80058j11583J85144k02246L65700j93170j54879J31194j43173
13885A320900n5403R314p9189J24702j04765p9070L34093j09057o2108Q8113j03179
$$ plain form
13874 1284351 1250123 1118922 1285848 1190967 1262429 1508326 1096899 1097644 1260996 1143962
13864 1143962 1231691 1091135 1256243 977967 1364778 1002469 1245241 947763 1293962 1301570
13854 1301570 1034527 927421 1509389 980869 1259259 1207727 1013562 923320 1215990 1467525
13844 1467525 1264409 971463 1191621 928177 1091121 1023544 1166329 919499 1089818 859594
13834 859594 950211 1240917 1208230 1262889 948721 774111 1126470 977717 1148744 758723
13824 758723 698864 586778 874861 1062716 1115255 881557 941637 922597 947675 937726 656659
13813 656659 1118360 1162036 883192 670849 1127851 787611 883322 756190 927505 781143
13803 781143 913628 613330 839205 1065333 772253 576148 952433 942830 842469 1002972
$$ packed form
13874A284351l4228j31201J66926r4881P1462K45897m11427P45J63352j17034
13864A143962Q7729j40556J65108k78276L86811l62309K42772k97478L46199P608
13854A301570k67043j07106N81968n28520K78390n1532j94165r0242K92670K51535
13844A467525k03116k92946K20158k63444J62944o7577J42785k46830J70319k30224
13834H59594R0617K90706l2687N4659l14168j74610L52359j48753J71027l90021
13824G58723n9859j12086K88083J87855N2539k33698O0080j9040K5078r949k81067
13813F56659M61701M3676k78844k12343M57002l40240R5711j27132J71315j46362
13803G81143J32485l00298K25875K26128k93080j96105L76285r603j00361J60503
$$ plain form
13793 1002972 776294 809184 479684 872617 711974 942627 1062318 992367 691450 882630
13783 882630 744555 204484 672182 789231 753251 788170 1120896 1071781 734560 538490
13773 538490 684841 1090803 1009304 1188753 1026149 753085 776292 729900 754570 683673
13763 683673 1084386 674126 733280 800658 470454 598203 639205 769191 411530 1057753
13753 1057753 583571 641635 989338 519612 529104 770975 565717 691707 774412 852745
13743 852745 686075 805800 227177 554469 511234 715970 512227 928365 497932 681527
13733 681527 378612 766948 506026 668174 253586 1142304 783921 367610 316259 503317
13723 503317 195278 679427 303345 434240 738399 633744 956060 524679 572508 600430
$$ packed form
13793A002972k26678L2890l29500L92933j60643K30653J19691o9951l00917J91180
13783H82630j38075B04484M67698J17049l5980L4919L32726m9115l37221j96070
13773E38490J46351M05962q1499J79449j62604k73064K3207m6392K4670p0897
13763F83673M00713m10260N9154O7378l30204J27749M1002J29986l57661O46223
13753A057753m74182N8064L47703m69726R492K41871k05258J25990Q2705P8333
13743H52745j66670J19725B27177L27292m3235K04736k03743M16138m30433J83595
13733F81527l02915L88336k60922J62148B53586Q88718l58383C67610n1351J87058
13723E03317A95278M84149C03345J30895L04159j04655L22316m31381M7829K7922
$$ plain form
13713 600430 750568 827520 744191 603857 575354 889390 673782 524536 617354 477392
13703 477392 1056115 703581 640994 587449 820311 643567 312956 696183 405376 748238
13693 748238 865899 743416 805494 498446 668938 416757 410411 810844 677318 292018
13682 264328 675221 608284 360477 732034 711446 472061 454067 336629 651982 643383
13672 643383 469540 234992 165211 250803 465005 395814 410158 710218 469966 353422
13662 353422 303772 680274 723391 469430 515792 536400 577010 410112 573571 436913
13652 436913 153926 295111 424955 422988 316413 343083 429226 255660 752463 427135
13642 427135 597470 371786 482854 423713 559180 367962 539394 627371 693517 884361
$$ packed form
13713F00430J50138P6952q3329j40334k8503L14036k15608j49246R2818j39962
13703D77392N78723l52534o2587n3545K32862j76744C12956L83227k90807L42862
13693G48238J17661j22483O2078l07048J70492k52181o346M00433j33526B92018
13682B64328M10893o6937k47807L71557k0588k39385j7994j17438L15353q599
13672F43383j73843k34548o9781Q5592K14202o9191J4344L00060k40252j16544
13662C53422m9650L76502M3117k53961M6362K0608M0610j66898J63459j36658
13652D36913A53926J41185J29844j967j06575K6670Q6143j73566M96803l25328
13642D27135J70335k25684J11068n9141J35467j91218J71432Q7977O6146J90844
$$ plain form
13632 884361 649019 614794 109430 337722 612943 706254 431223 573615 754057 550251
13622 550251 446713 323095 412886 601120 551217 260533 528313 276405 265776 406229
13612 406229 529664 526497 500089 540959 250866 323792 175400 418791 9340 135091 508702
13601 508702 353061 380854 494191 121936 44896 583987 668653 422324 378877 359220
13591 359220 343549 210039 486559 214339 170920 383007 557911 259599 163490 352579
13581 352579 642681 278942 434889 269176 603134 445100 420727 105888 141896 254126
13571 254126 268974 329842 254287 8201 435194 374534 441592 440844 461820 260323 600329
13560 600329 339132 645849 444744 333633 291274 80382 275834 389412 -18542 387106
$$ packed form
13632H84361k35342l4225A09430K28292K75221R3311k75031J42392J80442k03806
13622E50251j03538j23618Q9791J88234m9903B60533K67780k51908j0629J40453
13612D06229J23435l167k6408M0870B50866P2926j48392K43391I340J25751L73611
13601E08702j55641K7793J13337A21936D4896N39091Q4666k46329m3447j9657
13591C59220j5671j33510K76520B14339m3419K12087J74904B59599r6109J89089
13581C52579K90102B78942J55947j65713L33958j58034k4373A05888L6008J12230
13571B54126J4848O0868p5555H201M26993o0660O7058p48K0976k01497L40006
13560F00329k61197L06717k01105j11111m2359H0382J95452J13578a8542C87106
$$ plain form
13549 189105 309568 159999 475375 378668 211172 399479 85148 396832 20351 92501
13539 92501 328982 105029 460830 315903 683578 46921 514209 479762 276643 -126553
13528 514351 324828 324283 429365 312555 430420 473464 450335 535162 288092 221260 142337
13517 142337 343265 71817 298737 504548 500439 508556 613170 -60889 485852 423403 591117
13506 591117 271516 390458 235650 320443 171047 416146 182116 126693 89939 121219
13496 121219 308462 138330 370112 462043 488446 376949 435809 78532 46123 199364
13486 199364 211436 249709 241215 36425 256150 245486 293074 222698 130163 215413 38362
13474 284913 498517 307474 342412 345681 261925 37992 254757 189865 307742 201864 413226
$$ packed form
13549A89105J20463j49569L15376r6707j67496J88307H5148L11684B0351P2150
13539I2501K36481A05029L55801j44927L67675D6921M67288l4447k03119a26553
13528E14351j89523n45J05082j16810J17865M3044k3129Q4827k47070o6832p8923
13517A42337K00928G1817K26920K05811m109Q117J04614f0889D85852o2449J67714
13506E91117B71516J18942j54808Q4793j49396K45099A82116n5423l6754L1280
13496A21219J87243A38330K31782R1931K6403j11497N8860G8532l2409J53241
13486A99364J2072L8273q494C6425K19725j0664M7588p0376r2535Q5250C8362
13474B84913K13604j91043L4938L269q3756C7992K16765o4892J17877j05878K11362
$$ plain form
13463 413226 178091 127459 329564 233376 311351 560550 78979 135883 357147 272385 424162
13452 424162 156397 244052 196846 353411 520888 189682 541491 283192 164052 -57217
13441 582885 69136 94680 148223 380252 87094 45253 346867 272197 193000 470472 102093
13429 246188 -141664 167617 215879 398456 226553 318465 524375 327895 201706 372651
13419 372651 -67342 14155 -39455 140814 176920 235549 9956 305917 144262 250890 348738
13408 348738 301102 307504 406158 323885 228630 480951 -114361 201532 383743 496233 346925
13397 346925 -222903 91067 -33394 -42339 159222 233498 107566 195965 360416 200607 262752
13386 262752 253036 440886 113269 133740 32372 -124481 721945 160648 516308 163463
$$ packed form
13463D13226A78091n0632K02105r6188P7975K49199G8979N6904K21264q4762J51777
13452D24162A56397Q7655m7206J56565J67477A89682L51809k58299j19140e7217
13441E82885F9136K5544N3543K32029H7094m1841L01614p4670p9197K77472A02093
13429B46188a41664A67617M8262J82577j71903R1912K05910j96480j26189J70945
13419C72651f7342A4155c9455A40814L6106N8629I956K95961A44262J06628R7848
13408C48738m7636O402R8654q2273r5255K52321a14361B01532J82211J12490j49308
13397C46925b22903I1067c3394q945A59222P4276A07566Q8399J64451j59809O2145
13386B62752r716J87850A13269K0471C2372a24481G21945A60648L55660A63463
$$ plain form
13375 155609 267507 269401 451841 340435 -276672 269073 -19657 476124 89351 -1603 284511
13363 575622 -45771 752098 -62902 144373 163883 277321 -207889 327381 118152 -55808
13352 253614 199971 394519 301584 204151 406657 154415 328167 216586 353524 362404
13342 362404 32757 484370 396862 362504 -124913 174098 167404 342050 623555 132054
13331 243376 39255 230361 408542 51979 162857 341277 -71747 45796 148400 283227
13321 283227 399031 578194 122497 336255 285825 415440 307800 36767 114273 117059
13311 117059 250166 146231 191281 89834 392276 108364 -201074 214397 331853 197482
13301 197482 136295 104798 245299 319600 212373 207917 41481 131284 154204 296949 307349
$$ packed form
13375A55609J11898J894J82440j11406b76672B69073a9657D76124H9351a603B84511
13363E75622d5771G52098f2902A44373J9510J13438b07889C27381A18152e5808
13352B53614n3643J94548r2935r7433K02506A54415J73752j11581J36938Q880
13342C62404C2757M51613q7508l4358a24913A74098o694J74646K81505A32054
13331B43376C9255J91106J78181E1979J10878J78420g1747D5796J02604J34827
13321B83227J15804J79163A22497K13758n0430J29615j07640C6767P7506K786
13311A17059J33107j03935M5050H9834L02442A08364b01074B14397J17456j34371
13301A97482o1187l1497J40501P4301j07227m456D1481Q9803K2920J42745J0400
$$ plain form
13290 307349 89336 -104463 221156 248737 -90957 130505 62652 -217588 264475 -9888 107225
13278 379611 -153325 262313 147606 121842 284667 346545 104509 117079 -92767 190001
13267 -84611 285181 212379 -160517 77950 104078 53680 160097 136607 100322 457084 182372
13255 218186 90621 145742 -60130 -45542 114140 70347 124696 207712 312516 223619 13996
13243 107588 317694 48267 60662 216183 35804 187219 7797 44144 208302 148747 395640
13232 395640 264085 103064 110046 357324 471408 267064 79922 -31138 405 82322 361243
13221 361243 570480 99681 264489 147331 100584 -105432 -166901 -155688 6513 45097 139625
13210 139625 -162657 -16030 95158 288475 80407 172784 44589 192311 56961 72868 85042
$$ packed form
13290C07349H9336a04463B21156K7581i0957A30505F2652b17588B64475i888A07225
13278C79611a53325B62313j14707k5764J62825O1878A04509J2570i2767A90001
13267h4611B85181p2802a60517G7950K6128n0398J06417k3490l6285L56762A82372
13255B18186I0621N5121f0130J4588A14140m3793N4349Q3016J04804q8897A3996
13243A07588K10106D8267J2395J55521C5804J51415G797L6347J64158n9555K46893
13232C95640j31555A03064O982K47278J14084k04344G9922c1138D05Q1917K78921
13221C61243K09237I9681J64808j17158m6747a05432o1469J1213F513L8584R4528
13210A39625a62657a6030I5158J93317H0407R2377D4589J47722E6961J5907J2174
$$ plain form
13199 85042 135582 292918 155574 -145979 348603 118832 -195752 358131 141684 -10351
13188 169670 70001 -25651 379332 478832 117655 487387 125172 -10221 -164146 -27250
13177 54292 118099 248665 275715 -388042 52275 13049 -249278 -149114 89279 138737 -161860
13165 -76 393140 184253 80356 -220614 354490 -80456 82063 -25116 -51781 145386 106585
13154 106585 228375 130908 -178691 388754 190466 299755 415828 183397 -188794 117460
13143 -140064 -237611 -212033 -128613 125086 373681 -54364 184643 122925 145042 116922 282990
13132 282990 495185 225371 168202 57989 -122416 49760 110005 -1468 -116441 -177382 175855
13120 11031 -79614 47846 317844 211368 13713 48254 152855 28259 147934 202720 192831
$$ packed form
13199H5042N0540J57336j37344a45979C48603A18832a95752C58131A41684a0351
13188A69670G0001b5651C79332R9500A17655L69732A25172a0221j53925b7250
13177E4292O3807J30566K7050c88042E2275A3049b49278J00164H9279M9458a61860
13165g6C93140A84253H0356b20614C54490h0456H2063b5116k6665A45386l8801
13154A06585J21790r7467a78691C88754A90466J09289J16073A83397a88794A17460
13143a40064r7547K5578Q3420A25086K48595e4364A84643o1718K2117k8120J66068
13132B82990K12195B25371n7169E7989a22416D9760O0245a468j14973o0941A75855
13120A1031g9614D7846K69998j06476A3713L4541J04601B8259J19675N4786r889
$$ plain form
13109 192831 -32222 11680 327631 85520 -116329 -334547 162746 -322318 363142 -36637
13098 -184301 -58939 28609 72616 606109 198416 21885 41890 55591 429986 140397 -27371
13086 392131 -73998 97123 -203083 100208 134027 274642 -98374 92840 -155310 81070 363430
13075 363430 214371 -179106 225367 157960 339308 195218 -170782 112329 19811 90660
13065 90660 103932 57990 280119 131866 220908 -289752 489202 191822 -109864 465181
13054 74801 338114 304696 -178128 197355 223547 43643 -101941 230963 142719 -124989
13043 -22755 283628 306103 254905 33958 20438 10829 51072 236944 -7352 -5691 267119 -282112
13030 -55926 274006 288996 248505 187852 194917 64191 -83320 81527 163217 247563 154205 195093
$$ packed form
13109A92831c2222A1680L15951H5520a16329k18218A62746c22318C63142c6637
13098a84301e8939B8609M4007N33493A98416B1885K0005J3701L74395A40397b7371
13086C92131g3998I7123b03083A00208L3819J40615i8374I2840a55310H1070K82360
13075C63430j49059a79106B25367o7407J81348j44090a70782A12329A9811P0849
13065I0660J3272m5942K22129A31866Q9042b89752D89202A91822a09864D65181
13054G4801K63313l3418a78128A97355K6192D3643a01941B30963q8244a24989
13043b2755B83628K2475n1198C3958j3520r609M0243J85872g352J661B67119b82112
13030e5926B74006J4990m0491o0653P065F4191h3320H1527Q1690Q4346r3358M0888
$$ plain form
13018 195093 153543 -48773 -178532 -131637 300469 247984 96876 75242 103713 -48103 247354
13006 -196883 98139 -218600 362126 430006 153910 -2236 46519 216490 -255476 52974 282709
12995 282709 -156127 321672 432102 22767 270969 -232819 334085 307222 219339 236861
12985 236861 15583 279212 173653 -121007 309693 110201 -58816 -915 -60157 -47729 90360
12973 -341013 167738 134938 -144389 -118434 -179334 211749 -51200 -73482 210254 10140 73219
12962 73219 167309 111952 141082 28282 313139 119495 77660 -85914 -274282 394272 -57841
12950 152511 -32473 -142784 -59623 -51216 -22649 -74598 22686 110124 -160762 119862 4096
12938 179078 43141 110177 -345091 -59940 -17360 -32385 115826 123627 177710 196305 457081
$$ packed form
13018A95093m1550d8773j29759M6895C00469n2485I6876k1634K8471d8103B47354
13006a96883I8139b18600C62126O7880A53910b236D6519J69971b55476E2974K29735
12995B82709a56127C21672J10430B2767K48202b32819C34085k6863q7883J7522
12985B36861A5583K63629j05559a21007C09693A10201e8816i15n9242J2428I0360
12973c41013A67738l2800a44389K5955o0900B11749e1200k2282B10254A0140O3079
12962G3219R4090n5357K9130B8282K84857A19495m1835h5914j88368C94272e7841
12950A52511c2473j10311e9623Q407b2649n1949B2686Q7438a60762A19862D096
12938A79078D3141O7036c45091e9940a7360j5025A15826P801N4083J8595K60776
$$ plain form
12927 457081 182211 -147374 177872 253767 246912 -41160 -8057 -117849 -9042 -120985 -134093
12916 -134093 -2151 -204620 -80387 177977 130607 -139763 21656 172078 -260934 474571
12905 17836 41613 -95946 76283 44894 -24987 350545 151844 -177416 -5920 237566 194198
12894 194198 128978 255578 226726 -48206 307416 151291 204175 46625 -260297 102559
12883 143886 -241948 201394 449379 -58553 41826 202928 16981 -163167 49453 70288
12873 70288 85057 32561 186573 -25382 -146438 -145561 218920 121028 -7544 380851 28317
12861 -42667 269888 191430 45632 -225794 91744 184096 -217289 -32996 207415 128011 91823
12850 91823 150918 -35169 -94441 285655 310760 85148 -29277 -61951 318948 -45544 -19859
$$ packed form
12927D57081A82211a47374A77872P5895o855d1160h057j09792i042j11943j3108
12916a34093b151k02469h0387A77977m7370a39763B1656J50422b60934D74571
12905A7836K3777i5946G6283l1389b4987C50545A51844a77416e920B37566m3368
12894A94198o5220J26600k8852d8206C07416A51291N2884D6625b60297A02559
12883A43886b41948B01394K47985e8553D1826J61102A6981a63167D9453K0835
12873G0288J4769C2561J54012b5382j21056Q77B18920r7892g544C80851B8317
12861d2667B69888p8458D5632b25794I1744R2352b17289c2996B07415p9404l6188
12850I1823N9095c5169n9272B85655K5105H5148b9277l2674C18948d5544a9859
$$ plain form
12838 -93480 -6759 -177421 -219428 -6889 124504 56367 224338 -129735 -279252 442614 -87045
12826 -323974 65291 256786 -271166 38018 29660 -234691 166122 -33189 183956 76538 303355
12815 303355 -141336 -50839 -209049 51084 -36138 -160112 303726 -180018 -78210 576384
12804 68398 -213552 -196382 3827 15370 -66567 39750 60415 121783 206448 50389 5741 129063
12792 129063 146373 261871 -87196 214571 31693 -250920 190265 28849 337671 25990
12781 -57287 -189406 -134635 75472 118681 -264795 115283 -158717 -123287 181548 -105464
12770 -162772 152235 5482 56388 87061 -15907 -147593 -130500 269416 -5632 -61875 -245006
12759 -245006 -11906 247265 108302 -10956 233464 213462 24374 -185451 -290638 -47234
$$ packed form
12838i3480f759j70662m2007f889A24504E6367J67971a29735j49517D42614h7045
12826c23974F5291J91495b71166C8018q358b34691A66122c3189A83956G6538K26817
12815C03355a41336e0839j58210E1084c6138j23974C03726a80018g8210E76384
12804F8398b13552J7170C827J1543f6567C9750K0665O1368Q4665E0389E741J23322
12792A29063J7310J15498h7196B14571C1693b50920A90265B8849L08822B5990
12781e7287j32119N4771G5472M3209b64795A15283a58717L5430A81548a05464
12770a62772A52235E482N0906L0673a5907j31686J7093B69416e632n6243j83131
12759b45006a1906B47265A08302a0956B33464k0002B4374a85451j05187d7234
$$ plain form
12748 -54828 10731 71933 1343 94562 17956 -61034 256530 75093 -224722 43920 263020
12737 263020 43373 88251 74238 218526 345698 194000 98529 269586 -96875 -41888 121227
12725 -271952 200286 -19533 -20555 -262378 -294103 109472 -483770 -128084 213431 -41218
12714 169886 39602 298152 39257 15903 50319 129189 374443 196759 147289 79847 261702
12703 261702 263164 529887 302171 414743 51491 -66633 187417 106812 -78529 275841 -376796
12691 -39327 -44546 79367 -509076 -53533 170871 -45135 233088 -133922 -278553 124427 -181329
12679 124212 480387 90456 169088 160303 -153518 93667 246358 19958 87422 83104 -150927
12667 144918 42564 143080 -101210 90319 122249 69964 -231081 201591 12690 350502
$$ packed form
12748e4828A0731O1202A343R3219A7956f1034B56530G5093b24722D3920K19100
12737B63020D3373M4878j4013J44288J27172j51698r5471J71057i6875d1888A21227
12725b71952B00286a9533j022k41823l1725A09472d83770a28084B13431d1218
12714A69886C9602K58550C9257A5903L4416P8870K45254j77684m9470o7442J81855
12703B61702J462K66723k27716J12572E1491f6633A87417q0605g8529B75841c76796
12691c9327n219G9367e09076e3533A70871d5135B33088a33922j44631A24427a81329
12679A24212L56175I0456P8632q785a53518I3667J52691A9958O7464m318a50927
12667A44918D2564J00516a01210I0319L1930n2285b31081B01591A2690L37812
$$ plain form
12657 350502 302914 481141 335148 466949 154687 -77714 67770 -79824 -56370 107744
12646 434401 -956 70467 -51539 -77920 117181 197729 -59210 -89451 -166045 143264 -17206
12634 -11625 257747 33231 96273 -56076 84346 131918 -230970 272658 551895 306594 291875
12623 291875 -2821 42339 205585 88170 4731 110808 279437 173849 36467 -4430 193729
12611 284847 195280 182497 160323 210833 -198483 -22986 145164 385 60222 63676 220166
12600 220166 156247 -77444 145473 235131 58617 335180 140921 137359 153909 146440 102130
12589 102130 91167 353527 42764 21193 -135846 73784 81025 -79398 6371 70693 12119
12577 59056 27994 -97347 -137727 65719 16771 -5715 265367 -25743 47461 198994 -54951
$$ packed form
12657C50502m7588J78227j45993J31801A54687g7714F7770g9824K3454A07744
12646D34401i56G0467e1539k6381A17181Q0548e9210l0241p6594A43264a7206
12634a1625B57747C3231O3042e6076H4346M7572b30970B72658K79237k45301j4719
12623B91875b821D2339J63246H8170D731J06077J68629j05588C6467d430A93729
12611B84847q9567j2783k2174N0510a98483b2986A45164C85N9837L454J56490
12600B20166o3919g7444A45473Q9658E8617K76563A40921l562J6550p469m4310
12589A02130j0963K62360D2764B1193a35846G3784P241g9398F371O4322A2119
12577E9056B7994i7347m0380F5719A6771e715B65367b5743D7461J51533e4951
$$ plain form
12565 -69107 320020 -90163 54595 123864 153839 68642 42964 187831 49957 12742 152534
12554 152534 296673 -15915 294242 -48416 235845 -68169 124403 197370 195743 -68706 -138879
12543 -138879 64738 -19326 -72382 -217986 99840 56922 -428440 19709 154564 -116310 -192526
12532 -192526 -95037 138748 -23310 5729 404186 -167645 -30706 33704 81769 -235779 278445
12520 476993 -29094 47080 70057 -177640 112952 61375 -166980 -105703 194230 -52676 122586
12508 -112816 172286 -7868 84514 146654 153011 137604 -21681 8140 12651 269510 -25383 270018
12495 154157 42996 -84014 179760 -6414 5615 125436 177812 151080 -187865 -3530 -22058
12484 -22058 -380544 242476 -111926 152352 52055 72440 -204800 -9306 286958 112688
$$ packed form
12565f9107C20020i0163E4595O9269K9975F8642k5678J44867D9957A2742J39792
12554A52534J44139a5915B94242d8416B35845f8169A24403P2967j627f8706p0173
12543a38879F4738a9326n3056j45604I9840m2918d28440A9709J34855a16310p6216
12532a92526i5037A38748b3310E729L98457a67645c0706C3704M8065b35779B78445
12520D76993b9094D7080K2977a77640A12952n1577a66980O1277A94230e2676A22586
12508a12816A72286g868H4514O2140O357j5407b1681H140M511K56859b5383B70018
12495A54157D2996h4014A79760f414E615J19821N2376k6732a87865c530j8528
12484b2058l58486B42476a11926A52352E2055K0385b04800i306B86958A12688
$$ plain form
12473 -164645 -117131 -30441 39379 39872 -89861 111594 78810 202456 -87777 -165246 242121
12461 -232258 263528 -82276 -33876 -322526 73846 -40435 71629 387035 35669 169086 -29131
12449 19791 -215400 -180278 374268 24563 63581 198697 189027 -58007 377684 37754 -451886
12437 324107 -142210 123305 -5526 -55257 -333895 -65710 -56375 -32909 86425 -156783 -93745
12426 -93745 -72709 20593 -219957 -2799 -130713 -175399 -171976 44863 -87587 267775 -77123
12414 -637633 -207565 27944 -36367 22521 -45119 179452 -65820 235263 205141 291197 44590
12402 21910 210467 -47945 -82862 1278 -66537 255054 34193 44940 -10759 62056 -42977
12390 464868 44411 9362 3842 -159581 208694 -223726 -39676 115171 94613 70943 74785
$$ packed form
12473a64645M7514c0441C9379M93h9861A11594l2784J23646h7777p7469B42121
12461b32258B63528h2276c3876k88650G3846d0435G1629L15406C5669J33417b9131
12449A9791b15400L5122C74268B4563L9018J35116r670e8007C77684C7754d51886
12437C24107a42210A23305e526m9731k78638f5710R335K3466H6425a56783O3038
12426i3745K1036B0593b19957b799j27914m4686L423D4863h7587B67775g7123
12414f37633b07565B7944c6367B2521d5119A79452f5820B35263l0122Q6056D4590
12402B1910J88557d7945l4917A278f6537B55054C4193J0747a0759F2056d2977
12390D64868D4411I362C842a59581B08694b23726c9676A15171k0558k3670L842
$$ plain form
12379 74785 -208542 58935 51895 -102345 204329 113178 -203270 8980 -268731 -215408 233545
12367 -197322 -172716 -5289 46251 133441 -62838 151627 -33161 118771 -237497 -14408 -301213
12356 -301213 -225674 -185050 149585 -150037 -121517 18241 94871 -1536 22166 86772 93098
12345 93098 630 124270 48200 -61168 -2865 -139662 -61157 242430 209632 -34547 -49597 -204909
12333 -204909 28245 -43267 32102 106338 87830 70021 293430 -270612 -195364 72957 -229055
12321 123660 -98017 -4990 -138015 65342 -103586 213075 18497 180510 90955 314525 -84517
12309 242126 -132772 4373 -135583 39334 -388523 -102148 31182 40765 124325 -145448 -68105
12297 -13047 83337 -196988 -103321 203144 21549 159485 245149 252334 -126991 139206 33813
$$ packed form
12379G4785b08542E8935p040a02345B04329r1151b03270H980b68731N3323B33545
12367a97322K4606e289D6251Q7190f2838A51627c3161A18771b37497a4408k86805
12356c01213P5539M0624A49585a50037K8520A8241P6630a536B2166O4606O326
12345I3098F30J23640D8200f1168b865j36797f1157B42430l2798c4547j5050j55312
12333b04909B8245d3267C2102P4236j8508j7809K23409b70612P5248G2957b29055
12321A23660i8017d990j33025F5342a03586B13075A8497J62013q9555K23570h4517
12309B42126a32772D373a35583C9334c88523a02148C1182R583Q3560a45448f8105
12297a3047H3337a96988R3667B03144B1549J37936Q5664P185a26991A39206C3813
$$ plain form
12285 50102 412236 -166029 183402 17617 330362 35400 37881 134870 498090 260515 -159932
12273 355590 144721 231940 11655 -30774 314942 -30069 80475 -16811 1725 2005 107807
12262 107807 313435 119171 331808 81958 -309733 -12573 -71172 -39786 -149165 59716
12251 -47350 172545 128118 120700 17057 539893 507694 140090 -37251 -109144 61222 214206
12240 214206 -116705 256204 263823 120530 338970 -91612 207056 46343 227791 298134
12230 298134 168246 81054 274535 46699 77855 21922 393203 -41067 108527 213286
12220 213286 -60017 295464 -88965 134729 92257 333755 31004 -55443 27663 -96705 199642
12208 122387 64406 265663 -189691 34822 88352 374346 349078 226855 349142 -60199
$$ packed form
12285E0102L62134a66029A83402A7617L12745C5400K481R6989L63220k37575a59932
12273C55590A44721Q7219A1655c0774C14942c0069H0475a6811A725K80J05802
12262A07807K05628A19171K12637H1958c09733a2573n8599L1386j09379E9716
12251d7350A72545m4427p418A7057N22836l2199A40090c7251p1893F1222J52984
12240B14206a16705B56204P619A20530K18440i1612B07056D6343J81448P0343
12230B98134j29888H1054J93481D6699L1156B1922L71281d1067A08527J04759
12220B13286f0017B95464h8965A34729m2472K41498C1004e5443B7663i6705A99642
12208A22387n7981K01257a89691C4822N3530K85994k5268j22223J22287f0199
$$ plain form
12197 -34660 49460 88548 374753 620165 493761 219854 -65607 224588 380409 332892
12187 332892 295600 210509 151971 56568 15760 315726 220117 47333 -91190 57428 187374
12176 187374 482436 27642 229497 -220226 159940 181994 281098 142480 358348 47535
12165 -86212 386639 121548 -151813 135782 -32902 -29774 217269 9394 -34195 97995 -26684
12153 266641 4618 114273 168869 -273747 487154 -287107 -363749 -160600 99197 202483
12143 202483 -49939 -133573 -90218 74357 140669 194307 536153 68364 -200378 -191700 -206393
12132 -206393 46460 -57682 180157 71949 -192650 -8339 161620 -279924 -218035 437205 273845
12121 273845 -6631 -164442 -63037 112554 14782 119554 -120676 -157055 7101 -176442 6799
$$ packed form
12197c4660D9460L9088K86205K45412j26404B19854f5607B24588J55821m7517
12187C32892l7292q5091n8538E6568A5760K99966r5609D7333i1190E7428J29946
12176A87374K95062B7642K01855b20226A59940K2054R9104j38618K15868D7535
12165h6212C86639A21548a51813A35782c2902L128B17269I394c4195I7995b6684
12153B66641D618J09655N4596b73747D87154b87107p6642a60600I9197J03286
12143B02483d9939q3634M3355G4357O6312N3638L41846F8364b00378Q678j4693
12132b06393D6460e7682A80157G1949a92650h339A61620b79924O1889D37205j63360
12121B73845f631j57811f3037A12554A4782J04772a20676l6379G101a76442F799
$$ plain form
12109 -70281 -168691 75022 -461246 -157896 -351828 -147203 -190350 -10611 97037 -172271 -130220
12098 -130220 -236371 139357 -64886 -251940 107645 -108290 15427 -92415 -59572 -183361
12088 -183361 -189936 264703 120468 -194670 -287786 -350705 -2762 26669 68985 -53660 73965
12076 64510 -176546 -105046 59674 360005 889311 1937229 1425430 551903 168566 343899
12066 343899 221364 -52805 160884 -199959 104188 -75393 -140202 189050 -40094 -130524
12056 -130524 327323 142199 215024 161968 -40734 285436 432039 154866 159226 -161091
12045 -248625 -375169 -75445 157931 -28256 139064 -110652 -90798 277012 24134 188621
12035 188621 58173 235824 -88032 -75121 -258228 43349 -223368 -37117 306610 -130839
$$ packed form
12109g0281r8410G5022d61246a57896j93932a47203m3147a0611I7037a72271M2051
12098a30220j06151A39357f4886j87054A07645a08290A5427i2415L2843j23789
12088a83361o575B64703A20468a94670r3116o2919b762B6669M2316e3660G3965
12076F4510a76546P1500E9674L00331N29306J047918n11799E51903A68566J75333
12066C43899j22535e2805A60884a99959A04188g5393o4809A89050d0094r0430
12056a30524C27323A42199P2825n3056d0734B85436J46603A54866M360a61091
12045b48625j26544g5445A57931b8256A39064a10652J9854B77012B4134J64487
12035A88621E8173J77651h8032J2911j83107D3349b23368c7117C06610a30839
$$ plain form
12024 -15245 -114357 -26603 146768 -30823 225670 -57464 -214094 -63619 -258527 138445 300047
12013 300047 -1678 79292 258289 -217446 -289203 81605 -144867 -375014 -230080 -25615 -5480
12001 -221364 88666 -196248 -114455 -170598 -183174 -104899 -6676 -221463 161585 73392 -49913
11989 38358 -71119 -99977 259829 -40589 157321 -141343 48904 409307 -144204 73703 19762
11977 -28198 -152043 234222 -137801 -227146 178817 110103 -69478 91394 180577 -155051 248606
11965 44254 95042 20442 -225363 -195421 -113955 33039 -192509 270484 210924 31078 106806
11954 106806 128056 7980 84981 -137263 184506 -168410 -19981 -82321 -126110 187059 206109
11943 206109 -89944 -264107 85311 -59320 -59658 -38085 13751 132210 -274971 -105800 307505
$$ packed form
12024a5245r9112b6603A46768c0823B25670e7464j56630f3619j94908A38445J61602
12013C00047a678G9292J78997b17446p1757H1605a44867k30147J44934b5615e480
12001b21364H8666a96248Q1793n6143j2576P8275f676k14787A61585G3392d9913
11989C8358g1119k8858B59829d0589A57321a41343D8904L60403a44204G3703A9762
11977b8198j23845B34222a37801q9345A78817o8714f9478I1394Q9183a55051B48606
11965D4254N0788B0442b25363K9942Q1466C3039a92509B70484n9560C1078P5728
11954A06806K1250G980P7001a37263A84506a68410a9981o2340m3789A87059J9050
11943B06109h9944j74163H5311e9320l38K1573A3751J18459b74971a05800C07505
$$ plain form
11931 19769 50352 -200620 -243641 -45144 283447 258177 -8806 -264622 16825 225254 -48594
11919 -12761 87346 13663 184943 84974 -188997 -245319 -122331 291834 -158935 171548
11908 -113332 61011 -21207 -370656 41535 -41573 -297710 -244154 400434 98877 -304208 -206961
11897 -206961 -153106 64979 21199 -9786 -268401 -310572 85990 -36202 -207743 85879 42452
11885 -87530 372049 -353771 -99583 282232 -43212 -158052 -207011 85647 -296270 -84405 -5872
11873 -57332 -230895 -219751 126381 155681 52313 -213221 -182136 -93236 62341 -110922 -231563
11862 -231563 -146372 203176 58414 -23837 -169778 132439 87616 159663 81481 6233 109635
11851 109635 -203398 24108 145396 83995 -58328 94081 -71536 -221865 -153966 25071 -91440
$$ packed form
11931A9769L0583b00620m3021d5144B83447k5270h806k55816A6825K08429d8594
11919a2761H7346A3663J71280H4974a88997n6322a22331B91834a58935A71548
11908a13332F1011b1207l49449D1535d1573k56137N3556D00434I8877c04208R7247
11897b06961N3855F4979B1199i786k58615m2171H5990c6202j71541H5879D2452
11885h7530C72049c53771i9583B82232d3212j14840m8959H5647b96270h4405e872
11873e7332j73563J1144A26381K9300E2313b13221L1085Q8900F2341a10922j20641
11862b31563Q5191B03176E8414b3837j45941A32439m4823P2047p8182F233J03402
11851A09635b03398B4108J21288o1401e8328I4081g1536j50329O7899B5071i1440
$$ plain form
11839 -79870 -114064 29111 -63078 -55716 -104745 269551 330884 -31849 -212053 -252936 17171
11827 89700 135538 89840 -513 -444897 281020 -194799 17986 155818 -26177 -37333 96741
11815 -229509 40333 -125660 334518 -93310 -16056 21565 155013 -21273 -68615 -495583 36721
11803 -184824 221857 24762 -95147 -101640 -185768 21197 -65893 57526 -86104 -34151 -155222
11792 -155222 85156 -12247 17512 153364 -14615 104806 211402 43594 270588 317210 -195351
11780 -24499 -19468 231179 87377 45015 45911 52479 -61732 -53009 -327044 -99566 -67851 -106257
11768 -106257 -227795 -148064 21645 -49528 -150647 306957 -236584 -346495 -79351 -181717
11758 -181717 -170211 -60171 142181 385483 -198504 -202639 -103720 -269682 154391 44884 176978
$$ packed form
11839g9870l4194B9111f3078P362m9029B69551O1333c1849j80204m0883A7171
11827H9700M5838m5698e13m44384B81020a94799A7986J37832b6177j1156I6741
11815b29509D0333a25660C34518i3310a6056B1565J33448b1273m7342m26968C6721
11803a84824B21857B4762i5147o493q4128B1197f5893E7526h6104c4151j21071
11792a55222H5156a2247A7512J35852a4615A04806J06596D3594K26994M6622a95351
11780b4499N031B31179H7377m2362Q96O568f1732Q723k74035i9566L1715l8406
11768a06257j21538P9731B1645d9528j01119C06957b36584j09911g9351j02366
11758a81717J1506f0171A42181K43302a98504m135R8919j65962A54391D4884J32094
$$ plain form
11747 176978 -128126 138948 -298840 421843 26079 133000 -5495 79549 74123 224080 -4717
11735 -247509 -18801 -13126 114550 119974 -191280 170669 -117015 184748 129085 -4170 -23078
11724 -23078 378600 -87775 31228 -36349 81796 72334 -224575 211121 132512 -70711 175343
11712 -332121 243166 -135218 -37215 256960 -50944 268952 192116 -204108 73438 -89008
11701 -100352 491049 298042 118242 204875 -126589 366125 264114 156432 -93976 54497
11690 -2533 256195 -73569 -191043 15878 222099 159050 9170 -40809 267003 -29721 301434
11678 -157384 131911 198104 -66875 162112 -212136 -53794 157834 -34555 -287251 -79790
11667 97995 135601 -87855 287474 -501178 52643 -88849 -203563 -200470 93058 -73196 228418
$$ packed form
11747A76978a28126A38948b98840D21843B6079J06921e495G9549n426J49957d717
11735b47509a8801N675A14550N424a91280A70669a17015A84748n5663d170j8908
11724b3078C78600h7775C1228c6349H1796r462b24575B11121p8609g0711A75343
11712c32121B43166a35218c7215B56960e0944B68952p6836b04108G3438h9008
11701a00352D91049j93007A18242Q6633a26589C66125j02011j07682i3976E4497
11690b533B56195g3569j17474A5878K06221o3049I170d0809B67003b9721C01434
11678a57384A31911O6193f6875A62112b12136e3794A57834c4555k52696g9790
11667I7995L7606h7855B87474e01178E2643h8849j14714L093I3058g3196B28418
$$ plain form
11655 -166049 384546 22384 222029 -259596 71136 -57367 -154799 104533 221885 869 80577
11644 80577 -81201 168830 -172813 -38360 227758 45890 54766 40864 7234 -64346 -48005
11633 -48005 51735 -217768 131265 78617 171103 -8301 55740 -122239 -25191 38004 103103
11622 103103 -389492 193705 93268 61049 -247040 32336 -32471 51279 227579 29358 -98098
11610 266753 252104 -38769 211671 -253278 -125612 73136 210998 -144358 11559 -54625
11599 111433 236772 182614 122659 148441 65840 271163 138019 142608 -209688 271085 88505
11587 294449 -166187 214875 -88496 28555 122238 173328 296926 174749 311747 21040
11576 153998 235041 242414 -308684 -25527 -14802 160517 -62884 21668 481353 189434 -169123
$$ packed form
11655a66049C84546B2384J99645b59596G1136e7367r7432A04533J17352H69P9708
11644H0577h1201A68830a72813c8360B27758D5890Q876j3902G234f4346J6341
11633d8005E1735b17768A31265n2648R2486h301E5740a22239b5191C8004O5099
11622A03103c89492A93705I3268l2219b47040C2336c2471E1279J76300B9358i8098
11610B66753j4649c8769B11671b53278a25612G3136J37862a44358A1559e4625
11599A11433J25339n4158n9955K5782F5840K05323j33144M589b09688B71085H8505
11587B94449a66187B14875h8496B8555R3683N1090J23598j22177J36998B1040
11576A53998Q1043P373c08684b5527J0725A60517f2884B1668M59685A89434a69123
$$ plain form
11564 202966 -58689 -6196 284177 229321 23321 -30901 -48654 128663 25617 -110690 12143
11552 142510 232818 159592 17491 198007 34338 -92321 115733 -90831 61907 424439 139741
11540 193064 -10122 60580 -169959 258141 412369 -35711 151889 -49003 -40077 98674 104
11528 208629 -230887 85840 -40072 147425 16538 -189681 134713 31695 224351 -37586
11517 210875 209471 213481 146056 76776 -6874 -124875 224504 -175764 374986 194977 93359
11505 272674 96909 156898 194692 45036 8867 3238 164028 55372 275627 156423 212495
11494 212495 295520 150819 291467 314846 71667 74113 -105462 28065 54089 51530 295204
11483 295204 12561 -3859 -77145 73840 -225849 233856 -46672 27419 43432 19731 204916
$$ packed form
11564B02966e8689f196B84177n4856B3321c0901j7753A28663B5617a10690A2143
11552A42510R0308p3226A7491J80516C4338i2321A15733i0831F1907L62532A39741
11540A93064a0122F0580a69959B58141J54228c5711A51889d9003Q926I8674A04
11528B08629b30887H5840d0072A47425A6538a89681A34713C1695J92656c7586
11517B10875j404M010o7425o9280f874j18001B24504a75764C74986j80009I3359
11505B72674I6909N9989L7794D5036H867C238J60790E5372K20255j19204N6072
11494B12495Q3025j44701J40648K3379G1667K446a05462B8065K6024k559K43674
11483B95204A2561c859p3286G3840b25849B33856d6672B7419J6013A9731J85185
$$ plain form
11472 204916 260425 222452 225361 190212 297196 322806 -61966 210354 183943 315215 321986
11461 321986 309857 -212688 -329782 -215963 282102 114842 124577 88457 218888 -36723
11450 62333 -93608 -236603 147923 221533 -253290 251690 -187707 469653 -63781 -109101
11440 -109101 203876 -73458 191802 -84998 91423 280987 160421 139102 103567 -217130
11429 12133 98423 -245272 -363219 25847 -136624 340133 -36633 121233 328201 -149956
11418 73363 133902 -196295 -155050 -26459 -145816 -391983 109745 74108 585940 212138
11407 -202919 244201 202365 264587 76284 214097 9468 -115883 -151301 -40808 -68910 15285
11395 169648 -15313 154572 -199494 -150120 -162452 54018 -119569 178158 -7797 250419 84643
$$ packed form
11472B04916N5509l7973K909l5149J06984K5610f1966B10354k6411J31272O771
11461C21986j2129b12688j17094J13819B82102A14842R735l6120J30431c6723
11450F2333i3608j42995A47923P3610b53290B51690a87707D69653f3781m5320
11440a09101B03876g3458A91802h4998I1423J89564j20566k1319l5535b17130
11429A2133Q6290b45272j17947B5847a36624C40133c6633A21233K06968a49956
11418G3363O0539a96295M1245b6459j19357k46167A09745l5637N11832B12138
11407b02919B44201m1836O2222G6284J37813I468a15883l5418d0808k8102A5285
11395A69648a5313A54572a99494M9374j2332E4018a19569A78158g797B50419H4643
$$ plain form
11383 -137918 55231 -125489 -116899 292244 -207992 173595 189479 40529 4256 -128817 30621
11371 -70153 -93493 229260 180372 151660 290025 -132235 -343559 -80277 -154939 102566 -3936
11359 172002 -117499 90644 32147 71801 -49606 464269 -146990 199929 87341 -52526 -321088
11348 -321088 -9116 -168443 90832 192565 -100943 159855 -223022 -149995 81114 -82645 -331699
11337 -331699 225038 -80667 -86517 192962 -35351 -86313 49144 -241791 -67501 -37956 -57034
11326 -57034 -1876 -166377 -3430 25636 -49078 -25843 347709 324120 -14985 -78820 -251960
11315 -251960 -356059 -7712 76061 -177803 -141141 -94423 29389 14551 190963 321683 82676
11303 44462 94790 -70756 -125493 -89895 -330818 14116 69934 -114938 93982 -3321 -85517
$$ packed form
11383a37918E5231a25489Q590B92244b07992A73595J5884D0529D256a28817C0621
11371g0153k3340B29260m8888k8712J38365a32235k11324h0277p4662A02566c936
11359A72002a17499I0644C2147L9654d9606D64269a46990A99929H7341e2526k68562
11348c21088i116j59327I0832J01733a00943A59855b23022P3027H1114h2645k49054
11337c31699B25038h0667n850A92962c5351n0962D9144b41791f7501K9545j9078
11326e7034a876j64501c430B5636d9078K3235C47709k3589a4985o3835j73140
11315b51960j04099g712G6061a77803L6662M6718B9389A4551J76412J30720H2676
11303D4462N0328g0756n4737L5598k40923A4116N5818a14938I3982c321q2196
$$ plain form
11292 -85517 -335896 -103576 70744 197758 -149951 156281 -236121 7301 49023 -139056
11281 -76247 -14513 -88822 160583 -473729 300184 -31333 -178595 19005 -203301 1685 88772
11270 88772 90121 29184 -21312 -116869 40111 104738 29214 -65925 -257963 82728 18648 -453387
11257 -11908 255742 -39338 -131015 -54827 176611 -62313 19895 -106664 -220459 128277 -336488
11245 -21325 328503 139178 98056 -146096 351390 -365016 -77038 -99481 -98171 -132982 263756
11233 205801 -24686 -7319 159808 -137315 147798 -166529 -142683 -177710 -93509 -82028 -85277
11222 -85277 191766 -313256 75678 -53205 156627 9792 40220 -100188 -94467 -52718 -27043
11211 -27043 2241 94603 46510 -339148 65233 -194882 26320 -376122 172109 116793 -49102
$$ packed form
11292h5517k50379a03576G0744J27014a49951A56281b36121G301M1722a39056
11281g6247a4513p4309A60583d73729C00184c1333j47262A9005b03301A685Q7087
11270H8772J349B9184b1312r5557D0111O4627B9214f5925j92038H2728A8648d53387
11257a1908B55742c9338r1677e4827A76611f2313A9895a06664j13795A28277c36488
11245b1325C28503A39178m1122a46096C51390c65016g7038k2443J310l4811B63756
11233B05801b4686g319A59808a37315A47798a66529K3846l5027Q4201J1481l249
11222h5277A91766c13256G5678e3205A56627I792L0428a00188N721M1749K5675
11211b7043B241R2362D6510c39148F5233a94882B6320c76122A72109n5316d9102
$$ plain form
11199 -228588 82184 312560 -178861 -113242 216958 -87596 -144315 20441 -28130 -79387 -109934
11188 -109934 -88417 -147350 -298751 175816 109340 -50515 -129865 -89204 -267592 -211055 -277503
11177 -277503 130934 -221671 157024 -216772 169440 175990 -114783 -35725 152349 36587
11166 -202707 -81845 47206 173378 128217 -302337 -150666 73405 135768 174669 34279 -135220
11154 8076 169783 64086 -37003 29202 46218 -167091 380306 110752 -164278 -50702 -57221
11143 -57221 -201580 142969 250370 168841 50138 128764 60557 -13957 -249576 213293 -139571
11131 -146555 -133960 -95620 -223226 63244 -135102 173040 334865 -91390 167827 243897
11121 243897 -87213 268136 93981 167895 109773 137046 -231756 -66406 -157177 -109250 227778
$$ packed form
11199b28588H2184K30376a78861O5619B16958h7596n6719B0441b8130n1257l0547
11188a09934K1517n8933j51401A75816o6476e0515p9350M0661j78388N6537o6448
11177b77503A30934b21671A57024b16772A69440O550a14783c5725A52349C6587
11166b02707h1845D7206J26172m5161c02337a50666G3405O2363L8901C4279a35220
11154H076J61707F4086c7003B9202J7016a67091C80306A10752a64278e0702o519
11143e7221j44359A42969J07401q1529E0138P8626F0557a3957k35619B13293a39571
11131a46555J2595L8340j27606F3244a35102A73040J61825i1390A67827P6070
11121B43897h7213B68136I3981P3914n8122K7273b31756f6406r0771M7927B27778
$$ plain form
11109 123904 31800 112390 203858 -306005 102634 260510 230494 145853 -112942 94798 166886
11098 166886 25968 10381 -6996 -16278 -15799 651765 102281 268857 -57135 -72592 75343 274325
11086 274325 319306 176847 311901 329260 264406 203391 261057 197481 140494 133066 369674
11075 369674 409685 357573 286737 264866 154522 112719 137948 280466 398476 398026 163971
11063 318599 343639 658920 580592 458068 488136 565598 277338 442094 555193 729355
11053 729355 612146 1039406 700846 811006 842784 909676 851856 770585 1015418 912325
11043 912325 639452 629822 1096017 983689 762389 977810 636784 808214 695124 864897
11033 864897 641323 808138 450629 769411 530389 853940 865279 455204 658565 802862
$$ packed form
11109A23904C1800Q0590R1468c06005A02634J57876l0016q4641a12942I4798P2088
11098A66886B5968A0381f996r282M79F51765A02281J66576e7135j5457G5343J98982
11086B74325M4981j42459J35054J7359o4854o1015N7666o3576n6987p428K36608
11075C69674M0011n2112p0836k1871j10344m1803K5229J42518J18010m50A63971
11063C18599K5040L15281p8328j22524L0068P7462B77338J64756J13099J74162
11053G29355j17209M27260l38560J10160L1778O6892n7820q1271K44833j03093
11043I12325k72873r630M66195j12328k21300K15421l41026J71430j13090J69773
11033H64897k23574J66815l57509L18782k39022L23551J1339m10075K03361J44297
$$ plain form
11023 802862 710792 651080 685115 643405 836269 731972 806618 961642 762611 646205
11013 646205 806319 729558 607998 698835 670635 311386 500542 900840 723684 887182
11003 887182 679016 630882 821905 513527 364331 407950 408554 707267 822858 907257 1204483
10992 1204483 753907 641084 623265 528956 851213 1082312 862572 1592603 1014050 1263282
10982 1263282 1158339 852643 1311177 1310466 1351089 1424681 1983660 2056001 2267770 2845847
10972 2845847 2757934 3203798 3083847 3467591 3040353 3161579 2568154 2239808 2148648 1929124
10962 1929124 2086506 1630828 2227342 1815219 2401417 1950448 2177145 1997786 2033651 1417028
10952 1417028 1411155 1188982 1228671 1093899 715533 721829 528412 451951 415772 355261 556538
$$ packed form
11023H02862r2070n9712L4035m1710J92864j04297P4646J55024j99031j16406
11013F46205J60114p6761j21560R0837k8200C11386J89156M00298j77156J63498
11003H87182k08166m8134J91023l08378j49196M3619O04K98713J15591Q4399K97226
10992A204483m50576j12823j7819r4309L22257K31099k19740P30031n78553K49232
10982A263282j04943l05696M58534p11M0623P3592N58979P2341K11769N78077
10972B845847q7913M45864j19951L83744m27238J21226n93425l28346r1160k19524
10962A929124J57382m55678N96514m12123N86198m50969K26697j79359L5865o16623
10952A417028n873k22173L9689j34772l78366O296j93417p6461l6179o0511K01277
$$ plain form
10941 556538 372414 -68697 319122 260281 420284 -149246 419803 -12375 -344884 159630
10930 387902 -421701 54896 4679 -395603 66230 -67319 23339 146533 -160035 228559 43562
10918 133188 -138344 85177 -106465 106719 132292 -154677 221877 110753 72444 -39631
10907 265863 -66069 122969 40103 204964 -9800 -103709 -174271 -62907 15009 158662 121442
10896 121442 98882 271457 -212196 -69490 -320649 235217 414821 -13232 -321483 108435
10885 -183598 184815 47881 6861 -90829 22522 105054 -105399 165285 -238840 -298405 -75037
10873 -93735 58299 -68573 127782 -259848 -79201 210179 -91029 113491 67348 -291921 202738
10861 26394 82850 112398 36511 19264 -77073 -89994 199464 -103852 -218228 150299 121821
$$ packed form
10941E56538j84124f8697C19122n8841J60003a49246D19803a2375l32509A59630
10930C87902d21701E4896D679c95603F6230f7319B3339J23194a60035B28559D3562
10918A33188a38344H5177a06465A06719K5573a54677B21877A10753l8309c9631
10907B65863f6069A22969D0103J64861i800r3909p0562f2907A5009J43653l7220
10896A21442k2560J72575b12196f9490k51159B35217J79604a3232l08251A08435
10885a83598A84815D7881F861i0829B2522Q2532a05399A65285b38840n9565g5037
10873i3735E8299f8573A27782b59848g9201B10179i1029A13491m6143b91921B02738
10861B6394N6456K9548C6511j7247g7073j2921A99464a03852j14376A50299k8478
$$ plain form
10850 121821 -137915 -3129 -19988 -334216 -81068 99371 56743 -57767 -236112 -42504 160392
10838 -167757 -341437 -60507 -51222 -230595 -248770 -97883 12773 -112699 -48510 -111896 57765
10826 -409761 123407 -175337 88539 9645 -35588 -50231 1329 -270892 -543475 -363908 -224269
10815 -224269 -21813 -38967 111765 -120215 -14082 383598 -202639 -199442 -35581 -81737 -122668
10804 -122668 -115862 153103 69757 -19810 -136330 151459 -108206 196 -46157 -8408 -74898
10793 -74898 110376 113105 51274 -197983 -46746 76430 -132543 77269 -423547 -230403 -226020
10782 -226020 -36395 236647 198283 -446965 -106115 -36176 361117 -224683 189128 84546
10771 -46457 192455 436761 244555 -77142 73945 -87652 -28721 50418 62542 -260122 21
$$ packed form
10850A21821a37915c129j6859l14228h1068I9371m2628e7767j78345d2504A60392
10838a67757j73680f0507R285j79373j8175i7883A2773a12699d8510o3386E7765
10826d09761A23407a75337H8539I645c5588j4643A329b70892k72583J79567J39639
10815b24269b1813j7154A11765a20215a4082C83598b02639L197c5581m6156m0931
10804a22668O806A53103F9757a9810j16520A51459a08206A96d6157h408o6490
10793g4898A10376K729E1274a97983d6746G6430a32543G7269d23547J93144M383
10782b26020c6395B36647l8364d46965a06115c6176C61117b24683A89128H4546
10771d6457A92455K44306j92206g7142G3945h7652b8721E0418J2124b60122B1
$$ plain form
10759 102158 306786 187151 20321 80531 -14259 298230 -32168 -58476 321766 -163275
10748 -45348 -171284 74199 -97591 28244 -289077 -115970 -80883 44157 -13707 29448 -61979
10736 151152 95762 -388257 121725 -270921 -252352 244566 22935 -98917 -18095 245161
10725 157603 2506 8672 116742 -138804 -42932 -104862 -122503 -276863 -109172 -350989 70663
10713 -291415 -212793 7244 914 -82059 95887 70815 -141197 -219700 -12187 58939 -209956 38415
10700 -120184 -197986 301532 -263823 -61671 154673 -40551 -49936 -10432 -137797 -171656 -143580
10689 -143580 -34502 162018 -110750 -73902 150699 -247146 -122612 144835 -58205 138328
10678 274844 -449136 241707 89710 163118 201872 -347583 -279937 -23813 -120617 111731 -5182
$$ packed form
10759A02158K04628j19635B0321O0210a4259B98230c2168k6308C21766a63275
10748d5348j25936G4199i7591B8244b89077a15970L5087D4157a3707B9448f1979
10736A51152n5390c88257A21725b70921J8569B44566B2935i8917a8095B45161
10725A57603B506O166J08070a38804d2932o1930j7641j54360a09172k41817G0663
10713b91415P8622G244I14h2059I5887k5072a41197p8503a2187E8939b09956C8415
10700a20184p7802C01532b63823f1671A54673d0551r385a0432j27365l3859K8076
10689a43580c4502A62018a10750L6848A50699b47146a22612A44835e8205A38328
10678B74844d49136B41707H9710P3408L8754c47583O7646b3813r6804A11731e182
$$ plain form
10666 -213013 -83677 105262 91239 -315255 -360867 -176975 149151 104729 -35668 66735 27678
10654 -101785 -235036 102665 -132784 -326101 -271702 216286 64979 36811 89730 -17144
10643 -6517 44631 145593 -171738 -298470 19437 85022 -234620 -112753 -98066 -118966 -285699
10632 -285699 -69337 -137723 -73746 69035 -382725 -182515 -314131 285223 93484 -177757
10621 -134381 50465 74069 -269809 -52568 271825 -230654 -35909 -205917 -295712 -157603
10611 -157603 18639 63939 -201670 -1516 -90702 18729 -93291 -264052 -16308 282237 -21739
10599 28548 239527 -10395 68131 311206 -151157 -73624 -119425 60536 -33815 -56348 -267029
10588 -267029 -199386 -290440 -81035 -194458 -161918 -314841 33201 81752 203180 -108467 53749
$$ packed form
10666b13013h3677A05262j4023c15255m5612a76975A49151m4422c5668F6735B7678
10654a01785j33251A02665a32784j93317N4399B16286F4979k8168N2919a7144
10643f517D4631J00962a71738j26732A9437O5585b34620a12753J4687k0900j66733
10632b85699f9337o8386O3977F9035c82725a82515j31616B85223I3484a77757
10621a34381E0465K3604b69809e2568B71825b30654c5909j70008q9795J38109
10611a57603A8639M5300b01670a516q9186A8729i3291j70761a6308B82237b1739
10599B8548K10979a0395F8131K43075a51157g3624m5801F0536c3815k2533k10681
10588b67029O7643r1054h1035j13423L2540j52923C3201M8551J21428a08467E3749
$$ plain form
10576 222454 -108727 -36928 -541106 -25508 -156837 77352 -13296 -228760 23359 -237408
10565 -236994 -41305 -104372 -212979 -238711 -92487 -19666 -288099 -69928 21230 -304303 -279575
10554 -279575 88179 -227832 -107684 -25400 -82333 -17972 301656 143431 206959 -7304 53478
10542 -27348 101895 -191034 -105487 33680 -158693 -277816 -262912 174163 184592 -270190
10531 -89697 88017 106055 125871 -124135 -159570 6155 -229294 122604 -33904 8100 -109609
10519 371499 -126131 113662 -361498 -108409 -194338 -29000 -329623 -107519 42238 -57448
10508 -152815 171077 -23645 -264661 -128326 -267090 180744 178965 109581 14805 59871 317086
10497 317086 27757 104666 -5772 -133096 214955 -156680 -251274 238712 -12448 -77883 -344638
$$ packed form
10576B22454a08727c6928n04178b5508j31329G7352a3296k15464B3359b37408
10565b36994d1305o3067j08607k5732i2487a9666k68433f9928B1230c04303K4728
10554b79575H8179b27832a07684b5400n6933a7972C01656A43431O3528g304E3478
10542b7348A01895a91034Q5547C3680a58693j19123J4904A74163J0429b70190
10531h9697H8017J8038J9816a24135l5435F155b29294A22604c3904H100a09609
10519C71499a26131A13662c61498a08409q5929b9000l00623a07519D2238e7448
10508a52815A71077b3645k41016a28326j38764A80744j779o9384A4805M5066K57215
10497C17086B7757P6909e772j27324B14955a56680r4594B38712a2448o5435k66755
$$ plain form
10486 -344638 140424 -20181 3234 72834 -51179 -107750 503490 402160 500223 326544 189985
10475 189985 275370 431289 327139 160034 267407 15654 142014 -94392 156019 -15716
10464 -104792 -34523 69022 -395127 -128477 -108426 -139894 -50359 -197079 7995 240002 26266
10452 -36888 -428940 590324 -62372 -72909 174164 -59216 258293 287035 129550 -23271 378560
10440 372126 -33395 235516 -43507 99778 -209557 114693 18889 -226417 -332765 260598
10429 -124399 -186565 -14395 373592 -96028 -354259 144800 -183873 16601 -163165 -111746
10419 -111746 -40876 -298783 -224766 295976 -61204 18866 172676 261598 -5201 -262064 -40495
10407 -152857 117223 -238666 -39035 -68343 -97206 -45419 159301 -133443 -21477 -381760
$$ packed form
10486c44638A40424b0181C234O9600e1179n6571E03490j01330R8063j73679j36559
10475A89985Q5385J55919j04150A60034J07373A5654J26360i4392A56019a5716
10464a04792c4523F9022c95127a28477K0051l1468e0359j46720G995K32007B6266
10452c6888l92052E90324f2372j0537A74164e9216B58293K8742A29550b3271C78560
10440C72126c3395B35516d3507I9778b09557A14693A8889b26417j06348B60598
10429a24399o2166a4395C73592i6028k58231A44800a83873A6601a63165N1419
10419a11746d0876k57907P4017B95976f1204A8866J53810Q8922e201k56863d0495
10407a52857A17223b38666c9035k9308k8863d5419A59301a33443b1477l60283
$$ plain form
10397 -381760 115513 -9753 39703 183305 270223 19519 294848 19752 73767 -187755 18074
10385 438233 311104 -70567 293444 23074 201350 -37412 155389 13752 328482 450256
10375 450256 408863 77954 519550 385001 101151 302083 265395 532925 767192 229542
10364 502441 708408 529994 242707 367893 81285 438620 135075 321558 144314 151488
10354 151488 -7115 121220 432444 478387 667945 880428 787453 319242 315672 402434 375840
10343 375840 368965 330724 -196346 146675 347126 777678 155189 -23455 135789 -94383
10332 -165422 80898 222194 215906 47887 90938 -104534 -74722 67614 222193 185399 257964
10321 257964 168547 243558 401699 335602 114090 87330 429475 371009 85334 -75383 175898
$$ packed form
10397c81760A15513i753C9703J43602Q6918A9519K75329A9752N4015a87755A8074
10385D38233j27129g0567B93444B3074J78276c7412A55389A3752L14730J21774
10375D50256m1393G7954M41596j34549A01151K00932l6688K67530K34267B29542
10364E02441K05967j78414B42707J25186H1285L57335A35075J86483A44314P174
10354A51488g115A21220L11224M5943J89558K12483r2975C19242l570Q6762k6594
10343C75840o875l8241a96346A46675K00451M30552A55189b3455A35789i4383
10332a65422H0898J41296o288D7887M3051a04534K9812F7614J54579l6794P2565
10321B57964q9417P5011J58141o6097A14090k6760L42145n8466H5334g5383A75898
$$ plain form
10309 103067 328343 255352 -256218 83484 -61881 -115417 170312 -48070 -75820 74907 -4115
10297 149254 87375 -277966 46484 -51212 -318340 224532 56830 -313698 6914 -32870 113231
10285 -19989 15698 89600 42950 -67658 164433 186628 68702 24734 25898 -116730 242900
10273 37173 -272592 310607 -901 54265 -179036 102355 -144899 66256 222327 57847 146283
10262 146283 -57743 -73692 149318 264096 192899 303659 605236 355154 231925 50255
10251 97776 365711 165686 -102658 -277029 -54237 -128436 -93441 -73241 -197647 -55053 -186586
10240 -186586 -151043 -198961 10538 -13705 -5991 164579 -206669 -29867 -149711 -94575 -289517
10229 -289517 32841 -294584 363445 -406047 -326874 95353 23612 84151 -307658 10104 -115868
$$ packed form
10309A03067K25276p2991b56218H3484f1881n3536A70312d8070k7750G4907d115
10297A49254o1879b77966D6484e1212k67128B24532E6830c13698F914c2870A13231
10285a9989A5698P3902D2950f7658A64433K2195F8702B4734J164a16730B42900
10273C7173b72592C10607i01E4265a79036A02355a44899F6256J56071E7847Q8436
10262A46283e7743j5949A49318J14778p1197J10760L01577k50082j23229E0255
10251I7776K67935A65686a02658j74371e4237p4199L4995K0200j24406e5053j31533
10240a86586L5543m7918A0538a3705e991A64579b06669b9867j19844N5136j94942
10229b89517C2841b94584C63445d06047P9173I5353B3612O0539c07658A0104a15868
$$ plain form
10217 -334988 -152319 -63707 82504 16068 52952 -15835 -146397 281162 -318776 -92145 -141087
10206 -141087 -162990 -35702 11279 84526 -179123 324395 89571 -335570 -76669 -13499 108532
10194 -561260 29753 6825 -79950 -156420 -202092 -36073 197650 -151213 -175506 -354020 -36618
10182 48322 73466 -55317 85253 -245338 -61973 -17579 225717 98203 -112124 -38801 -251747
10171 -251747 -41037 -214901 -1239 -140431 -44515 -15656 -43110 54258 -147857 -340025 68780
10159 -105977 -101409 -259669 -223639 -155161 -71630 -103336 -148419 214673 26296 -565216 219842
10147 -173664 -23316 222989 -385043 52469 430528 -87123 1140 -140499 123291 -128256
10136 -95170 -19188 -360917 165863 12844 -226800 69207 -335163 18612 -266915 -71052 53422
$$ packed form
10217c34988a52319f3707H2504A6068L6884a5835j30562B81162c18776i2145m8942
10206a41087k1903c5702A1279P3247a79123C24395H9571c35570g6669a3499A08532
10194e61260B9753F825g9950p6470m5672c6073A97650a51213k4293j78514c6618
10182D8322K5144e5317H5253b45338f1973a7579B25717I8203a12124c8801k12946
10171b51747d1037j73864a239j39192d4515a5656k7454E4258a47857j92168F8780
10159a05977M568j58260L6030O8478g1630l1706m5083B14673B6296e65216B19842
10147a73664b3316B22989c85043E2469L78059h7123A140a40499A23291a28256
10136i5170a9188l41729A65863A2844b26800F9207c35163A8612b66915g1052E3422
$$ plain form
10124 85239 113017 -36432 -199928 -219095 178507 -388888 329534 25250 142522 -296219
10113 -150117 91860 -29160 -138628 -132720 -231319 -253655 -59961 -254000 -267795 -153236 363885
10101 53743 221014 160649 93751 164734 -110751 -34701 -390301 353637 -239337 246647
10090 -244261 -258439 242105 459020 15662 47902 -36220 25673 16582 -77602 272436 122469
10078 -65261 11245 513701 91558 -223399 -65798 167612 -98552 -30400 -103190 41182 -292219
10066 -53682 72677 25372 1680 51637 -89879 -59731 -78559 48992 7924 -169896 -129982 -111635
10054 -111635 -190863 282555 85080 -15269 -83072 24543 23752 -387071 -131556 342631 73668
10042 73185 -141742 302006 734 -13645 105123 304777 132485 -28789 -246339 -136429 70793
$$ packed form
10124H5239K7778c6432j63496j9167A78507c88888C29534B5250J17272b96219
10113a50117I1860b9160j09468N908r8599k2336e9961j94039j3795J14559C63885
10101E3743J67271o0365o6898P0983a10751c4701l55600C53637b39337B46647
10090b44261j4178B42105K16915A5662L2240c6220B5673r091g7602B72436A22469
10078f5261A1245N02456I1558b23399f5798A67612i8552c0400p2790D1182b92219
10066e3682G2677B5372A680M9957h9879L0148j8828D8992G924a69896L9914J8347
10054a11635p9228B82555H5080a5269o7803B4543p91c87071a31556C42631G3668
10042G3185a41742C02006G34a3645A05123J99654A32485b8789k17550J09910G0793
$$ plain form
10030 74583 -74822 53330 -233221 126385 -30128 177583 178848 -394760 27541 -117986 -203653
10019 -203653 -109619 52996 -88880 -89552 162737 -34706 -230149 57885 26048 75529 121064
10008 121064 -204981 -28568 -205007 -3676 -161666 -98377 -149560 -105810 -28829 -88308 -120786
9997 -120786 -180284 -265760 -244088 142507 -55413 -45574 -171784 157453 -198011 336629 -8546
9985 -166088 -375042 -21582 264343 140798 72946 6600 113134 -308388 18487 169522 -51408
9973 -264587 26365 148521 -193927 53718 -51346 214684 -32345 48955 -45218 -138274 36457
9961 -61016 -80283 36184 163049 -239409 20587 -157007 -97726 -78754 -30382 -341425 -181720
9950 -181720 340 -96806 -111945 -93095 -88215 73478 -197823 351098 -261336 39616 -139161
$$ packed form
10030G4583g4822E3330b33221A26385c0128A77583J265c94760B7541a17986q5667
10019b03653R4034E2996h8880o72A62737c4706j95443E7885B6048M9481M5535
10008A21064b04981b8568j76439c676j57990O3289n1183M3750b8829n9479l2478
9997a20786n9498q5476K1672A42507e5413R839j26210A57453a98011C36629h546
9985a66088k08954b1582B64343j23545o7852F600J06534c08388A8487J51035e1408
9973b64587B6365J22156a93927E3718e1346B14684c2345D8955d5218r3056C6457
9961f1016j9267C6184J26865b39409B0587a57007N9281J8972c0382l11043J59705
9950a81720C40i6806j5139J8850M880G3478a97823C51098b61336C9616a39161
$$ plain form
9938 23556 -326116 -21217 -194684 -191373 -377444 -10088 -56298 -211223 -64563 -101548 -247450
9927 -247450 -369376 -158693 -21952 -252795 216386 16495 -125925 122283 -162029 -117385
9917 -117385 47047 -95655 140599 -2345 -29475 258195 -339237 -217150 -229711 2330 6416
9906 6416 114592 -478564 182545 -21102 -92752 -34419 -367825 -55303 -151312 -331651 -4976
9894 -145074 -116974 -2643 -318427 -78398 -141256 -74921 121004 -330247 126352 -605 -242208
9883 -242208 -48490 286584 -80657 -234798 97767 -299440 -164353 -404311 -101855 -185841
9873 -185841 -3742 190547 153101 43941 28710 -121290 -317927 -298591 -241479 330302 151642
9861 98829 34181 106473 -251253 -131908 -263562 -279205 -67240 -148436 28771 -291454 -519161
$$ packed form
9938B3556c26116b1217j73467L311j86071a0088m6210j54925f4563l6985j45902
9927b47450j21926a58693b1952k30843B16386A6495a25925A22283a62029M4644
9917a17385D7047i5655A40599b345k7130B58195c39237J22087j2561B330M086
9906F416J08176d78564A82545b1102p1650c4419l33406e5303r6009j80339d976
9894a45074K8100b643l15784g8398o2858O6335A21004c30247A26352f05k41603
9883b42208d8490B86584h0657j54141I7767b99440J35087k39958a01855q3986
9873a85841c742A90547l7446D3941j5231a21290j96637J9336N7112C30302A51642
9861I8829C4181P2292b51253J19345j31654j5643f7240q1196B8771b91454k27707
$$ plain form
9850 -519161 -404804 -229172 67248 24448 -87233 -274603 127380 -61933 -283490 -36625 -74708
9839 -74708 23032 -26082 88160 92075 42302 -12274 4923 -148718 -86209 7880 -15019 -291192
9827 -291192 -181077 -243114 -41131 -195217 -44518 -161554 122844 -296318 99649 67223 -243874
9815 -56075 -48482 -403438 146530 -285910 -48878 -288832 154698 -165332 -231909 -174250 281445
9803 -203027 41563 -315917 -38067 -105764 -129443 -490092 -88662 157349 -155199 217615 88520
9791 -94807 -97280 161664 -53267 100379 -309494 15214 30797 -199432 -376706 38598 198778
9780 198778 -88221 -276989 -274701 -15994 -181627 -342898 -5475 -76716 -193193 31040 29962
9769 29962 64378 -263752 -46122 -157512 -141738 33471 121934 -99485 -183387 -17809 -424455
$$ packed form
9850e19161J14357J75632F7248B4448h7233j87370A27380f1933k21557c6625l8083
9839g4708B3032b6082H8160L915D2302a2274D923a48718O2509G880a5019k76173
9827b91192J10115o2037d1131j54086d4518j17036A22844b96318I9649l2426b43874
9815e6075P593l54956A46530b85910d8878k39954A54698a65332o6577N7659B81445
9803b03027D1563c15917c8067o7697k3679l60649h8662A57349a55199B17615H8520
9791i4807k473A61664e3267A00379c09494A5214J5583a99432j77274C8598J60180
9780A98778h8221j88768K288a5994j65633j61271e475p1241j16477C1040j078
9769B9962L4416b63752d6122j11390J5774C3471Q8463i9485q3902a7809m06646
$$ plain form
9758 -424455 -107610 164059 136583 143919 16471 -546028 179020 -231138 -53533 -113562 246628
9746 -341164 47083 -221265 -192291 -34838 -159955 -392034 -179608 -74754 -104528 101056 158588
9735 158588 -134886 162579 -145530 -103498 -355128 -28908 -88690 -101430 -447595 142673
9724 18973 -50328 342335 -177207 -99207 240432 232123 -100390 -146262 354860 -309709 -190838
9713 -190838 45373 66608 -213325 17539 -301222 25941 105344 -161368 -185996 -20970 -441229
9702 -441229 52992 -10221 20505 -180280 676 17122 160823 95905 -104963 -374515 -231504
9691 -231504 94970 72181 -48064 219030 -161720 55178 -505817 185734 -43982 -190738 -177946
9680 -177946 48405 198620 -75259 163014 -188441 90410 182567 27764 132826 124470 -479392
$$ packed form
9758d24455a07610A64059k7476P336A6471e46028A79020b31138e3533o0029B46628
9746c41164D7083b21265K8974c4838j25117k32079a79608g4754k9774A01056N7532
9735A58588a34886A62579a45530M2032k51630b8908n9782j2740l46165A42673
9724A8973e0328C42335a77207P8000B40432q309a00390m5872C54860c09709J18871
9713a90838D5373K1235b13325A7539c01222B5941P9403a61368k4628b0970m20259
9702d41229E2992a0221B0505a80280F76J6446J43701o4918a04963k69552J43011
9691b31504I4970k2789d8064B19030a61720E5178e05817A85734d3982j46756J2792
9680a77946D8405J50215g5259A63014a88441I0410R2157B7764J05062q356d79392
$$ plain form
9668 -92147 298092 -40226 -84408 104698 90274 173899 88775 -207321 39383 17533 -38167
9656 79519 51843 154932 -204311 -40680 -98407 51563 -29634 -205723 150132 39902 -137488
9644 -287051 34096 55046 290814 54413 -199857 -104845 36207 106618 -301590 -2188 -138907
9633 -138907 -265481 -156695 91280 75083 -55108 -117506 -349859 -200907 266608 -124057
9622 -268023 -322855 -24462 -259232 299251 28009 -125342 -120650 -215655 -53329 24562 81181
9611 81181 -275743 54505 270338 34831 -38505 111645 -213046 -415456 -143850 -67688 78056
9599 -95843 69402 25015 144151 -224434 -285814 2053 -207930 -213609 -216847 225913 -123089
9587 -115285 82353 -261074 -294132 -346723 -98869 -27849 -139226 332021 301807 -11518 54508
$$ packed form
9668i2147B98092d0226m4182A04698j4424Q3625q5124b07321C9383A7533c8167
9656G9519k7676J03089b04311d0680n7727E1563b9634j76089A50132C9902a37488
9644b87051C4096K0950K35768E4413a99857R5012C6207P0411c01590b188j36719
9633a38907j26574J08786I1280j6197e5108o2398k32353J48952B66608a24057
9622b68023n4832b4462k34770B99251B8009a25342M692r5005e3329B4562N6619
9611H1181b75743E4505K15833C4831c8505A11645b13046k02410a43850f7688G8056
9599i5843F9402B5015J19136b24434o1380B053b07930n679l238B25913a23089
9587a15285H2353b61074l3058n2591i8869b7849j11377C32021l0214a1518E4508
$$ plain form
9575 87518 -138791 -81062 -123531 -138910 -220474 -134878 -13195 -1203 -153536 -19032 -369573
9564 -369573 -144079 120797 204218 -248924 -149237 -109829 -20214 102641 -178076 -108062 -162752
9553 -162752 -67743 2401 2114 -209707 -2200 103283 80161 76125 -4067 -77671 -128221 52163
9540 87632 13960 -39112 -101537 114207 159424 -228087 31554 32137 -329691 -104047 78049
9528 82045 -107847 15448 -134068 -11393 -214235 381753 -80438 -414684 58246 -120794 100414
9516 -28296 -71964 -210100 -217839 -193262 -128460 33007 -262710 -684 -265681 -95237 -262651 -143488
9504 -143488 21651 1871 314412 3645 267788 -157120 -183291 44671 57087 -123467 10481
9492 -211544 -122282 -4585 -151452 -355726 167527 -358174 13547 -277498 151658 -53772 -475914
$$ packed form
9575H7518a38791N7729m2469j5379q1564Q5596a3195a203j52333a9032l50541
9564c69573a44079A20797Q3421b48924R9687L9408b0214A02641a78076P0014n4690
9553a62752f7743B401k87b09707b200A03283k3122m036d067p3604n0550E2163
9540H7632A3960c9112o2425A14207M5217b28087C1554N83c29691a04047G8049
9528H2045a07847A5448a34068a1393k02842C81753h0438l34246E8246a20794A00414
9516b8296m3668j38136p739K4577O4802C3007b62710f84k64997i5237j67414J19163
9504a43488B1651A871L12541C645K64143a57120k6171D4671J2416a23467A0481
9492b11544Q9262d585j46867k04274A67527c58174A3547b77498A51658e3772m22142
$$ plain form
9481 -475914 -46144 -15348 -83919 25746 -33789 -57600 -320027 104582 -227876 414537 -150715
9469 -235314 -313454 115585 -57837 -117724 40508 -309130 -24526 63351 69728 -114465 -164634
9458 -164634 -213902 -192893 -252239 144484 79815 -203849 90214 40164 -145412 -194546 -12947
9446 -83835 80273 63583 -448536 231696 347482 -51253 -377411 -225315 50948 -353615 155304
9434 -64712 -52498 30390 -14659 145157 -136243 -28376 86924 92438 -64201 -113425 85583 -199208
9421 -125095 -23226 -33596 -10511 43313 112996 4168 250830 -230118 -94109 147253 -23854
9409 275988 -224778 -167742 -140992 47907 -12333 -387890 293390 -158553 -189426 -7826 -249970
9398 -249970 -148389 -399794 59768 -40744 -59672 -81311 -59729 -35011 -195546 -99659 -42637
$$ packed form
9481d75914d6144a5348o8571B5746c3789k3811k62427A04582b27876D14537a50715
9469b35314p8140A15585e7837n9887D0508c09130b4526F3351O377a14465n0169
9458a64634m9268K1009n9346A44484o4669b03849I0214D0164a45412m9134a2947
9446h3835H0273j6690d48536B31696J15786e1253l26158J52096E0948c53615A55304
9434f4712J2214C0390a4659A45157a36243b8376H6924N514f4201m9224H5583a99208
9421a25095b3226j0370a0511D3313O9683D168K46662b30118i4109A47253b3854
9409B75988b24778N7036K6750D7907a2333l75557B93390a58553l0873g826k42144
9398b49970J01581k51405E9768d0744j8928k1639K1582K4718j60535R5887d2637
$$ plain form
9386 -94892 53113 -81052 31663 -136113 -228098 -194616 -27826 -206863 54603 -314295 86864
9374 -319649 -214276 -375425 -45859 -152967 -189275 262853 -209629 156665 193836 -35431
9363 -124460 -43459 -129983 -243298 139699 -121979 377275 -217928 -111054 -180418 -8712 227814
9351 -66105 82626 -155 -31154 -234413 147418 97769 -19549 -264883 -219951 -69938 408901
9339 36696 -50800 -258135 10771 18325 -2028 -73120 -58801 -153695 -347200 87903 109108 -101595
9326 -239192 162107 -121452 272484 154580 -197433 -1912 -419057 50616 -101714 180824
9315 67708 162215 -84517 17347 -36968 -74849 -237460 -185597 -103747 133010 -156977 -4406
9303 157513 -106812 -301273 18723 -259015 -143594 93413 -53121 -193283 -155883 -274692
$$ packed form
9386i4892E3113h1052C1663a36113r1985L3482b7826j79037E4603c14295H6864
9374c19649J05373j61149d5859j07108l6308B62853b09629A56665L7171c5431
9363a24460d3459q6524j13315A39699a21979C77275b17928J06874o9364h712B27814
9351f6105H2626a55l0999k03259A47418m9649a9549k45334M4932f9938D08901
9339C6696e0800k07335A0771P554b028p1092J4319r4894j93505H7903K1205a01595
9326b39192A62107a21452B72484j17904a97433a912m17145E0616a01714A80824
9315F7708R4507h4517A7347c6968l7881j62611N1863Q1850A33010a56977d406
9303A57513a06812j94461A8723b59015J15421I3413e3121j40162L7400j18809
$$ plain form
9293 -274692 -88221 303669 44678 -72733 -171567 421117 -172522 -289536 286038 173206
9283 173206 -178030 15781 97606 -41500 35789 250153 194961 19424 -195221 -42369 -198190
9272 -198190 -196505 25335 -235698 -361034 -79063 -47636 -195630 18839 46984 -233021 -32454
9260 -227247 -175485 27925 -72209 -136751 -265012 -221998 -41203 -122981 305031 -267990 77352
9248 436386 49696 -177529 159491 5876 -112672 -272646 -245651 3256 -244481 -97405 152466
9236 -47207 13535 -233938 -69916 -120556 -352416 -148976 -174090 -41474 -59523 134248 -376874
9224 -180465 34580 -95393 -175755 -155908 162934 760 -127551 -170300 55219 200913 -231485
9212 -106415 -79544 -426432 -11112 -29916 -105841 92317 42159 66555 340020 -181174 -74624
$$ packed form
9293b74692h8221C03669D4678g2733r8834D21117a72522j17014B86038j12832
9283A73206a78030A5781Q1825d1500C5789K14364n5192A9424a95221d2369j55821
9272a98190J685B5335b35698j25336g9063L1427j47994A8839K8145b33021c2454
9260b27247N1762B7925g2209o4542j28261M3014d1203q1778C05031b67990G7352
9248D36386D9696a77529A59491E876a12672j59974K6995C256b44481i7405A52466
9236d7207A3535b33938f9916n0640k31860a48976k5114d1474j8049A34248c76874
9224a80465C4580i5393q0362J9847A62934G60a27551m2749E5219J45694b31485
9212a06415K6871l46888a1112j8804p5925I2317D2159K4396K73465a81174g4624
$$ plain form
9200 -279263 35244 -183958 -76955 318971 137500 -103076 -164203 2762 -158398 -147713 155284
9188 109524 -159751 63817 -132000 -205839 95293 -22516 -3651 -220809 -239676 -142410 -299874
9177 -299874 -104889 87581 -168069 -325572 62100 201626 -165268 72042 237605 -3673 -570938
9166 -570938 -75258 -260394 -312578 -132236 -247601 103555 -60306 -113037 44327 -303671 -82509
9154 -371774 64983 108751 33034 38901 123632 258010 -267751 -257852 144093 182112 -59758
9142 -86586 120161 15714 -201525 -234338 40202 -51627 173543 231130 -136858 116070 -183744
9130 -518266 -28875 234907 7954 -331048 -227630 33444 -63203 -395902 -211116 147748 -307406
9118 44757 -39216 -196788 -88963 -104080 -1599 9995 60352 -272654 -111515 -16620 80522 -66128
$$ packed form
9200b79263C5244a83958g6955C18971A37500a03076o1127B762a58398J0685A55284
9188A09524a59751F3817a32000p3839I5293b2516c651k17158j8867R7266j57464
9177b99874a04889H7581a68069j57503F2100J39526a65268G2042J65563c673n67265
9166e70938g5258j85136n2184a32236j15365A03555f0306n2731D4327c03671h2509
9154c71774F4983M3768C3034N867Q4731J34378b67751R899A44093L8019e9758
9142h6586A20161A5714b01525l2813D0202e1627A73543N7587a36858A16070a83744
9130e18266b8875B34907G954c31048J03418C3444f3203l32699J84786A47748c07406
9118D4757c9216j57572h8963j5117a599I995N0357b72654a11515a6620H0522f6128
$$ plain form
9105 -37338 -471600 96253 71914 417188 143641 -434 -118746 -104478 251092 -514461 96442
9093 90122 -201587 -324520 -73890 -148505 -88778 73781 -104555 84663 117067 -54986 45811
9081 -123506 -167353 -85439 131444 -209269 25728 52714 -24008 2161 -194694 180827 -161423
9069 -430936 13176 -95330 91278 71684 139436 -126048 37410 -108851 -353560 -4082 -198465
9058 -198465 -372076 -121678 350168 -227617 -383649 -143572 -117736 -339556 -53536 149901
9047 11505 -209465 21195 -101889 113728 31814 -310595 45293 -297540 178546 3505 109942
9036 109942 187873 -233604 -236658 -60489 676 -4781 61799 -69958 60093 -55532 50677 101738
9024 101738 -141921 -82695 -25414 -64643 -241120 76538 98931 -37314 -194929 338667 -134998
$$ packed form
9105c7338m34262I6253k4339L45274A43641d34j18312J4268B51092e14461I6442
9093I0122b01587j22933g3890p4615N9727G3781a04555H4663L2404e4986D5811
9081a23506m3847Q1914A31444b09269B5728K6986b4008B161a94694A80827a61423
9069d30936A3176i5330I1278j9594O7752a26048C7410a08851k44709d082j94383
9058a98465j73611a21678C50168b27617j56032a43572K5836k21820e3536A49901
9047A1505b09465B1195a01889A13728C1814c10595D5293b97540A78546C505J06437
9036A09942P7931b33604l054f0489F76d781F1799f9958F0093e5532E0677N1061
9024A01738a41921N9226b5414l9229j76477G6538K2393c7314j57615C38667a34998
$$ plain form
9012 -45391 1328 251514 79225 -253761 -155443 -3400 19284 -290147 -174399 -193685 94232
9000 -38314 95912 -29817 -117260 59624 -84250 235140 1506 -131225 -37651 51735 9038 -134727
8987 -439921 -64093 -78261 -39651 -138901 108047 -200105 -34115 -72475 -175535 -159543 -183654
8976 -183654 -42814 112008 -80861 -74642 -49274 4128 200422 23455 -36675 -19112 -61297 -171700
8964 -171700 -159887 85177 -44846 111815 -322816 -136221 66264 105280 261382 41685 -87856
8952 -242788 199931 -141142 -381083 91571 247018 -39526 269280 157259 -218899 38015
8941 298822 28805 136590 -151032 94538 58709 195149 45243 217274 84609 -107198 -31852
8929 -12244 3510 -231029 184096 270690 220057 412283 747928 3568175 10788985 7730508
$$ packed form
9012d5391A328K50186G9225b53761R8318c400A9284b90147J15748j9286I4232
9000c8314I5912b9817q7443E9624h4250B35140A506a31225c7651E1735I038a34727
8987d39921f4093j4168L8610r9250A08047b00105c4115l8360j03060J5992k4111
8976a83654d2814A12008h0861O219K5368D128J96294B3455c6675J7563m2185j10403
8964a71700J1813H5177d4846A11815c22816a36221F6264L9016J56102D1685h7856
8952b42788A99931a41142k39941I1571J55447c9526B69280j12021b18899C8015
8941B98822B8805J07785a51032I4538l5829J36440D5243J72031H4609a07198c1852
8929a2244C510b31029A84096Q6594n0633J92226L35645K820247P220810l058477
$$ plain form
8919 7730508 1934143 765766 336183 262771 508500 -93795 13965 -141513 -196783 121942
8908 -235017 448393 143077 -186618 -178812 -287571 40701 -80063 -106292 -190754 135207 118417
8897 118417 185219 150767 409047 -259895 -85429 -184048 -293880 -142211 -106098 -157767 4638
8885 194885 -3325 -23060 -346962 -161899 -178841 86001 20399 180320 -127886 284308 -194467
8873 -242474 -349789 -245499 -204771 -125174 28100 -303950 197796 1137 -334524 115085 -500561
$$ packed form
8919G730508A934143G65766C36183p3412K45729i3795A3965a41513n5270A21942
8908b35017D48393A43077a86618P806j08759D0701h0063k6229q4462A35207j6790
8897A18417O6802l4452K58280b59895h5429r8619j09832a42211L6113n1669D638
8885A94885c325j9735l23902a61899j6942H6001B0399J59921a27886B84308a94467
8873b42474j07315J04290M0728P9597B8100c03950A97796A137c34524A15085e00561
$$ [...]
##END NTUPLES=NMR SPECTRUM
##END=
