
##TITLE=UV1285_M2_1207-1380_10_7534799_Uo5lkCNWQY
##JCAMPDX= 6.0         $$ Bruker NMR JCAMP-DX V2.0
##DATA TYPE= NMR SPECTRUM
##DATA CLASS= NTUPLES
##ORIGIN= BRUKER
##OWNER= Administrator
$$ 1.72 TOPSPIN		Version 2.1
$$ 2013-02-21 20:49:21.725 -0500  Administrator@X
$$ Compression mode = diff/dup
##.OBSERVE FREQUENCY= 400.02188249412
##.OBSERVE NUCLEUS= ^1H
##.ACQUISITION MODE= SIMULTANEOUS (DQD)
##.ACQUISITION SCHEME= undefined
##.AVERAGES= 64
##.DIGITISER RES= 22
##SPECTROMETER/DATA SYSTEM= spect
##.PULSE SEQUENCE= noesygpps1d.comp
##.SOLVENT NAME= COFFEE_meoh
##.SHIFT REFERENCE= INTERNAL, COFFEE_meoh, 1, 14.96138
##AUDIT TRAIL= $$ (NUMBER, WHEN, WHO, WHERE, PROCESS, VERSION, WHAT)
$$ ##TITLE= Audit trail, TOPSPIN		Version 2.1
$$ ##JCAMPDX= 5.01
$$ ##ORIGIN= Bruker BioSpin GmbH
$$ ##OWNER= Administrator
$$ $$ E:\/data/COFFEE/nmr/UV1285_M2_1207-1380_10_7534799_Uo5lkCNWQY/12/pdata/1/auditp.txt
$$ ##AUDIT TRAIL=  $$ (NUMBER, WHEN, WHO, WHERE, PROCESS, VERSION, WHAT)
(   1,<2013-02-21 20:49:15.647 -0500>,<Administrator>,<X>,<go>,<TOPSPIN 2.1>,
      <created by zg
	started at 2013-02-21 20:37:45.642 -0500,
	POWCHK enabled, PULCHK disabled,
       configuration hash MD5:
       86 BA 57 50 F2 9D 5C 9B 26 00 A9 28 5F 66 2E 89
       data hash MD5: 64K
       6C F4 B6 D8 94 00 57 3F EA 1B DE 3E FC F2 F3 69>)
(   2,<2013-02-21 20:49:18.803 -0500>,<Administrator>,<X>,<proc1d>,<TOPSPIN 2.1>,
      <Start of raw data processing
       efp LB = 0.3 FT_mod = 6 PKNL = 1 PHC0 = 0 PHC1 = 0 SI = 128K 
       data hash MD5: 128K
       A3 90 B4 CD 50 34 C8 1A 95 4D DD 6B 42 72 79 B8>)
(   3,<2013-02-21 20:49:19.928 -0500>,<Administrator>,<X>,<proc1d>,<TOPSPIN 2.1>,
      <pk PHC0 = 248.4119 PHC1 = 0 
       data hash MD5: 128K
       73 2F AD 40 4C E9 F7 AA 96 C9 46 A7 15 5B 91 77>)
(   4,<2013-02-21 20:49:20.631 -0500>,<Administrator>,<X>,<proc1d>,<TOPSPIN 2.1>,
      <abs ABSG = 1 
       data hash MD5: 128K
       6D 9D 34 0F 03 9D BB 8D AD D5 B0 22 6F 44 60 98>)
(   5,<2013-02-21 20:49:20.803 -0500>,<Administrator>,<X>,<proc1d>,<TOPSPIN 2.1>,
      <abs ABSG = 2 
       data hash MD5: 128K
       6B 98 46 9A 3E BC A7 E4 B0 F1 A8 A8 39 95 0D FC>)
(   6,<2013-02-21 20:49:20.990 -0500>,<Administrator>,<X>,<proc1d>,<TOPSPIN 2.1>,
      <abs ABSG = 3 
       data hash MD5: 128K
       E9 1C AC A5 A3 7E CD 90 04 1A 77 F7 9F AA 23 5C>)
(   7,<2013-02-21 20:49:21.178 -0500>,<Administrator>,<X>,<proc1d>,<TOPSPIN 2.1>,
      <abs ABSG = 4 
       data hash MD5: 128K
       82 FE 9C 55 24 24 84 B1 39 1C 74 B8 49 62 0E 3D>)
(   8,<2013-02-21 20:49:21.365 -0500>,<Administrator>,<X>,<proc1d>,<TOPSPIN 2.1>,
      <abs ABSG = 5 
       data hash MD5: 128K
       94 D9 3D 42 D7 C6 F6 A1 8C 84 A7 6B 43 DF E1 AC>)
$$ ##END=
$$ 
$$ $$ hash MD5
$$ $$ 3B 72 A6 22 95 67 49 80 6F 4F 7F 53 D6 53 4F 2C
##$RELAX= 
##$RELAX= 
##$RELAX= 
##$RELAX= 
##$RELAX= 
##$RELAX= 
##$RELAX= 
##$RELAX= 
$$ Bruker specific parameters
$$ --------------------------
##$DU= <E:\>
##$EXPNO= 12
$$ [...]
150 150 150 150 150 150 150 150
##$TP07= 0
##$TPNAME0= <>
##$TPNAME1= <>
##$TPNAME2= <>
##$TPNAME3= <>
##$TPNAME4= <>
##$TPNAME5= <>
##$TPNAME6= <>
##$TPNAME7= <>
##$TPOAL= (0..7)
0.5 0.5 0.5 0.5 0.5 0.5 0.5 0.5
##$TPOFFS= (0..7)
0 0 0 0 0 0 0 0
##$TUNHIN= 0
##$TUNHOUT= 0
##$TUNXOUT= 0
##$USERA1= <user>
##$USERA2= <user>
##$USERA3= <user>
##$USERA4= <user>
##$USERA5= <user>
##$V9= 5
##$VALIST= <valist>
##$VCLIST= <CCCCCCCCCCCCCCC>
##$VD= 0
##$VDLIST= <DDDDDDDDDDDDDDD>
##$VPLIST= <PPPPPPPPPPPPPPP>
##$VTLIST= <TTTTTTTTTTTTTTT>
##$WBST= 1024
##$WBSW= 4
##$XGAIN= (0..3)
0 0 0 0
##$XL= 0
##$YL= 0
##$YMAX_a= 6323465
##$YMIN_a= -11984967
##$ZGOPTNS= <>
##$ZL1= 120
##$ZL2= 120
##$ZL3= 120
##$ZL4= 120
##$ABSF1= 14.96138
##$ABSF2= -5.596802
##$ABSG= 5
##$ABSL= 3
##$ALPHA= 0
##$AQORDER= 0
##$ASSFAC= 0
##$ASSFACI= 0
##$ASSFACX= 0
##$ASSWID= 0
##$AUNMP= <proc_prof1d_extract.lims>
##$AXLEFT= 0
##$AXNAME= <>
##$AXNUC= <1H>
##$AXRIGHT= 0
##$AXTYPE= 0
##$AXUNIT= <>
##$AZFE= 0.1
##$AZFW= 0.1
##$BCFW= 0
##$BC_mod= 0
##$BYTORDP= 0
##$COROFFS= 0
##$CY= 15
##$DATMOD= 1
##$DC= 0
##$DFILT= <>
##$DTYPP= 0
##$F1P= 0
##$F2P= 0
##$FCOR= 0.5
##$FTSIZE= 131072
##$FT_mod= 6
##$GAMMA= 0
##$GB= 0
##$INTBC= 1
##$INTSCL= 1
##$ISEN= 128
##$LB= 0.3
##$LEV0= 0
##$LPBIN= 0
##$MAXI= 10000
##$MC2= 0
##$MEAN= 0
##$ME_mod= 0
##$MI= 0
##$NCOEF= 0
##$NC_proc= -2
##$NLEV= 6
##$NOISF1= 0
##$NOISF2= 0
##$NSP= 0
##$NTH_PI= 0
##$NZP= 0
##$OFFSET= 14.96138
##$PC= 1
##$PHC0= 248.4119
##$PHC1= 0
##$PH_mod= 1
##$PKNL= yes
##$PPARMOD= 0
##$PPDIAG= 0
##$PPIPTYP= 0
##$PPMPNUM= 2147483647
##$PPRESOL= 1
##$PSCAL= 4
##$PSIGN= 0
##$PYNMP= <proc.py>
##$REVERSE= no
##$SF= 400.020009482821
##$SI= 131072
##$SIGF1= 0
##$SIGF2= 0
##$SINO= 400
##$SIOLD= 131072
##$SPECTYP= <>
##$SREGLST= <1H.CDCl3>
##$SSB= 0
##$STSI= 131072
##$STSR= 0
##$SW_p= 8223.68421052631
##$SYMM= 0
##$S_DEV= 0
##$TDeff= 65536
##$TDoff= 0
##$TI= <>
##$TILT= no
##$TM1= 0
##$TM2= 0
##$TOPLEV= 0
##$USERP1= <user>
##$USERP2= <user>
##$USERP3= <user>
##$USERP4= <user>
##$USERP5= <user>
##$WDW= 1
##$XDIM= 131072
##$YMAX_p= 440504904
##$YMIN_p= -11948
##$CURPLOT= <Network HP LaserJet P1505>
##$CURPRIN= <$Network HP LaserJet P1505>
##$DFORMAT= <normdp>
##$LAYOUT= <+/1D_H.xwp>
##$LFORMAT= <normlp>
##$PFORMAT= <normpl>
##$SURQMSG= 1
$$ End of Bruker specific parameters
$$ ---------------------------------
##NTUPLES= NMR SPECTRUM
##VAR_NAME=  FREQUENCY,     SPECTRUM/REAL,   SPECTRUM/IMAG
##SYMBOL=    X,             R,               I
##VAR_TYPE=  INDEPENDENT,   DEPENDENT,       DEPENDENT
##VAR_FORM=  AFFN,          ASDF,            ASDF
##VAR_DIM=   131072,        131072,          131072
##UNITS=     HZ,            ARBITRARY UNITS, ARBITRARY UNITS
##FACTOR=    0.0627417313425164, 1,          1
##FIRST=     8223.62146879497, 255,          -66898
##LAST=      0,             2091,            -66991
##MIN=       0,             -11948,          0
##MAX=       8223.62146879497, 440504904,    0
$$ Real data points
##PAGE= N=1
##DATA TABLE= (X++(R..R)), XYDATA
$$ [...]
67761 86693 86666 87061 88774 91546 94212 96097 97580 99285 101295 103261 104848 105907 106444 106554 106273 105505
67745 105505 104242 102781 101573 100966 101210 102445 104354 105996 106472 105761 104611 103564 102479 101035 99309
67730 99309 97652 96264 95135 94205 93374 92422 91160 89602 87890 86141 84523 83333 82724 82389 81850 81117
67714 81117 80705 80807 80830 80138 79011 78285 78142 77925 77292 76846 77213 78062 78631 78773 78834 78803 78392 77839 77788 78263
67694 78263 78547 78247 77763 77428 76931 76075 75434 75621 76324 76707 76486 76061 75799 75795 76167 77057 78260 79358 80203
67675 80203 80981 81814 82655 83505 84418 85320 86095 86745 87213 87196 86468 85296 84212 83521 83370 84052 85677 87629
67657 87629 88926 89200 88948 88825 89150 90035 91334 92386 92411 91395 90093 88998 87886 86570 85447 84844
67641 84844 84436 83814 83121 82567 81837 80661 79574 79274 79457 79221 78609 78787 80440 82805 84735 86024 87135
67624 87135 88177 88902 89474 90480 92126 93901 95206 95922 96227 96177 95687 94776 93686 92830 92641 93306 94590
67607 94590 96030 97421 98931 100634 102119 102796 102579 101992 101557 101243 100669 99662 98473 97394 96313 94729
67591 94729 92227 88929 85532 82876 81406 80953 80992 81064 80994 80846 80794 80993 81426 81883 82239 82772 83975 85909
67573 85909 87861 88916 88819 88124 87491 87038 86443 85480 84341 83485 83234 83426 83431 82647 81059 79262 77863 77028
67555 77028 76632 76570 76679 76539 75772 74574 73551 72933 72275 71226 70300 70432 71786 73433 74420 74825 75419 76467
67537 76467 77346 77453 77064 76953 77332 77653 77436 76914 76648 76792 77007 76974 76695 76349 76033 75655 74984 73856 72467
67518 72467 71273 70457 69650 68499 67371 67047 67718 68646 68988 68644 68171 68098 68507 69041 69119 68341 66861 65343
67500 65343 64405 64209 64564 65212 65956 66731 67631 68668 69527 69859 69846 70046 70580 70975 71019 71167 71719 72158 71922
67481 71922 71341 71088 71006 70397 69388 69048 69904 71114 71572 71293 71185 71754 72553 72858 72550 72194 72311 72644 72342
67462 72342 71002 69285 68219 68121 68638 69592 71107 72969 74664 76260 78543 81810 85085 87001 87131 86073
67446 86073 84636 83383 82598 82163 81606 80705 79901 79788 80366 81155 81798 82206 82348 82372 82740 83750 85046 86029
67428 86029 86622 87136 87502 87255 86292 85090 84026 83001 81888 80844 79952 79026 78095 77645 77958 78505 78472 77692
67410 77692 76629 75615 74608 73721 73414 73899 74700 75147 75117 74976 74950 74883 74598 74099 73372 72391 71537 71613 72974
67391 72974 74785 75634 74962 73548 72555 72456 73023 73919 74940 75828 76258 76073 75459 74837 74600 74784 74949 74512
67373 74512 73281 71616 70143 69443 69893 71362 73058 74119 74544 75103 76159 77097 77298 77180 77698 79105
67357 79105 80765 81955 82263 81408 79429 77073 75326 74431 73905 73605 74061 75457 76999 77789 77865 77841 77925 77935
67339 77935 78052 78734 79862 80672 80788 80806 81426 82471 83306 83974 85240 87401 89681 91165 91992 93154 95285
67322 95285 98075 100828 103160 105057 106548 107464 107339 105584 102133 97930 94387 92153 90792 89749 89101
67307 89101 89034 89142 88873 88358 88208 88610 89246 90051 91419 93537 96006 98348 100496 102521 104193 105112 105159
67290 105159 104624 103989 103653 103717 103895 103672 102659 100898 98866 97180 96097 95216 93868 91966 90269 89599
67274 89599 90004 90907 91783 92344 92333 91733 91194 91730 93806 96977 100453 103687 106441 108638 110316 111494 112065
67257 112065 112003 111562 110939 109861 107943 105454 103294 102117 101818 101873 101775 101147 99925 98639 98038 98238 98584
67240 98584 98486 97991 97407 96826 96287 96007 96125 96463 96746 96830 96643 96239 96034 96541 97667 98715 99301 99854 100916
67221 100916 102363 103595 104092 103538 101899 99800 98387 98271 98950 99641 100281 101175 102082 102379 101979 101377 100865
67204 100865 100319 99775 99623 100084 100959 102005 103168 104303 105083 105397 105635 106378 107833 109591 110910 111356 111272
67187 111272 111452 112197 112923 112892 112070 111012 110235 110076 110848 112485 114199 115079 115064 114818 114664 114212 113146 111819
67169 111819 110772 110104 109617 109322 109512 110365 111619 112606 112765 112297 112148 113032 114643 116174 117379 118545 119592
67152 119592 120006 119793 119728 120269 120849 120728 120039 119468 119335 119598 120422 122036 124087 125759 126624 126945 127112 127251
67134 127251 127478 128057 129000 129822 130018 129649 129241 129214 129659 130586 131995 133581 134672 134842 134517 134612 135438 136320
67116 136320 136549 136443 137034 138753 140921 142623 143710 144665 145831 147058 147937 148115 147529 146636 146313 147190 149045
67099 149045 151093 152796 154196 155416 156243 156383 155939 155428 155378 156079 157562 159593 161646 163129 163850 164266
67083 164266 165129 166822 169006 170906 171984 172388 172833 173977 175819 177701 179013 179925 181277 183617 186467
67068 186467 188739 189887 190450 191421 193275 195749 198362 200873 203244 205441 207431 209225 210783 211927 212538
67053 212538 212807 213119 213688 214414 215148 215965 217123 218890 221336 224105 226420 227719 228476 230000 233059 236999
67037 236999 240563 243294 245603 247755 249581 251148 252928 255052 257121 259051 261397 264349 267144 269162
67023 269162 271083 274071 278131 282178 285589 288760 292069 295222 298001 300901 304481 308531 312377 315750
67009 315750 318919 322188 325687 329533 333803 338246 342320 345697 348707 352159 356601 361765 366863 371493
66995 371493 376026 380985 386352 391861 397692 404323 411725 419243 426376 433222 439989 446533 452635 458441
66981 458441 464372 470792 477854 485331 492497 498568 503551 508382 514012 520607 527784 535263 543058 551362
66967 551362 560489 570603 581275 591712 601677 611765 622436 633312 643928 654628 665956 677522
66955 677522 688458 698925 710224 723176 737124 750876 764016 776919 790086 803943 818879
66944 818879 834895 851421 867926 884569 901820 919645 937638 955919 975307 996324 1018417
66933 1018417 1040497 1062128 1083920 1106866 1131438 1157296 1183679 1210075 1236582 1263605 1291249
66922 1291249 1319238 1347580 1376946 1407968 1440268 1472819 1505295 1538442 1572772 1607608 1642062
66911 1642062 1676525 1712312 1749991 1788965 1828705 1869405 1911128 1953218 1995155 2037249 2079858
66900 2079858 2122570 2165033 2208059 2252858 2299309 2345957 2391766 2436986 2482147 2527103 2571477
66889 2571477 2615326 2658758 2701351 2742516 2782211 2820876 2858790 2895787 2931467 2965389 2997145
66878 2997145 3026401 3052840 3076077 3095980 3113150 3128710 3143285 3156351 3166670 3173143 3175212 3172964
66866 3172964 3167195 3159003 3148857 3136299 3120798 3102565 3082161 3059689 3034921 3007892 2978796 2947489
66854 2947489 2913748 2877876 2840421 2801415 2760642 2718586 2676267 2633928 2590793 2546484 2501874
66843 2501874 2457929 2414363 2370179 2325096 2279727 2234652 2190129 2146563 2104392 2063350 2022448
66832 2022448 1980925 1938896 1897008 1855861 1815792 1776785 1738435 1700383 1662912 1626718 1591986
66821 1591986 1558097 1524470 1491315 1459290 1428675 1399183 1370360 1341936 1313955 1286730 1260528
66810 1260528 1235127 1209927 1184659 1159713 1135553 1112107 1089008 1066190 1043905 1022322 1001492
66799 1001492 981538 962460 943818 925077 906339 888346 871633 855930 840515 824972 809422
66788 809422 794186 779390 764907 750664 736916 724032 711896 699726 686740 672951 659152
66777 659152 646228 634649 624401 615026 605794 596196 586331 576631 567299 558322 549851 542135 535048
66764 535048 528139 521180 514258 507309 500089 492722 485729 479253 472789 466031 459501 453840 448835 443702
66750 443702 438111 432369 426745 421182 415683 410510 405842 401536 397307 392933 388294 383465 378758 374430
66736 374430 370379 366369 362435 358747 355115 351076 346562 342112 338281 335124 332373 329710 326707 322864
66722 322864 318105 313085 308642 305025 301839 298608 295163 291597 288174 285248 282925 280764 278093 274755
66708 274755 271298 268318 265851 263589 261415 259420 257513 255426 253100 250709 248243 245405 242130 238870
66694 238870 236070 233631 231260 229130 227695 226892 226009 224395 221917 218733 215146 211852 209678 208621 207606
66679 207606 205732 203425 201781 201005 200237 198832 197068 195378 193585 191295 188661 186260 184444 183171 182317
66664 182317 181821 181558 181332 180967 180251 178904 176842 174444 172304 170708 169505 168528 167934 167997 168616 169170 168974
66647 168974 167947 166756 166131 166022 165630 164363 162548 160982 159957 159081 157980 156822 155960 155317 154413 152955
66631 152955 151194 149645 148575 147816 147046 146169 145345 144699 144087 143308 142463 141916 141835 141936 141814 141411 140959 140566
66613 140566 140052 139286 138476 137982 137902 137948 137750 137210 136557 136066 135755 135380 134702 133695 132477 131213 130185 129773
66595 129773 130035 130335 129797 128260 126468 125077 123775 121801 119120 116632 115192 114846 115135 115775 116790 118166
66579 118166 119622 120693 120983 120511 119833 119637 120036 120416 120120 119167 118163 117627 117548 117525 117171 116390 115378 114423
66561 114423 113765 113586 113939 114525 114736 114279 113693 113869 114981 116246 116824 116512 115459 113722 111527 109558 108482
66544 108482 108334 108706 109295 109872 109993 109367 108354 107582 107049 106198 104871 103615 102879 102463 102052 101762 101774 101820
66526 101820 101522 101031 100832 100952 100750 99605 97586 95377 93603 92330 91182 89937 88928 88708 89321 90156
66510 90156 90644 90898 91434 92369 93164 93188 92381 91268 90368 89653 88677 87274 85971 85521 86101 87219 88423 89675
66492 89675 90885 91511 91106 90116 89621 90212 91432 92405 92712 92468 91884 91074 90198 89510 89205 89315 89705 90076
66474 90076 90067 89637 89288 89646 90688 91618 91684 90978 90269 90146 90530 90964 91174 91295 91637 92214 92482 91800 90299
66455 90299 89041 88928 89628 90009 89571 88930 88843 89364 90150 91019 91825 92344 92779 93886 95932 97801 97914 96037
66437 96037 93547 91861 91181 90906 90699 90731 91198 92016 92938 93761 94349 94526 94053 92940 91754 91263 91578 91980
66419 91980 91850 91295 90532 89241 87278 85516 84995 85431 85626 85285 85243 85697 85593 84364 83122 83198 84359 85480
66401 85480 86268 87184 88124 88422 88073 87885 88283 88780 88792 88209 87115 85700 84618 84641 85611 86363 86054 85114 84563
66382 84563 84864 85753 86735 87354 87334 86940 86943 87814 89042 89635 89206 88324 87881 88362 89646 91179 92285 92553 92093
66363 92093 91405 90947 90786 90642 90214 89489 88711 88031 87245 85979 84120 82009 80261 79447 79767 80830 81793
66346 81793 81982 81447 80818 80656 81040 81708 82422 83196 84254 85666 86992 87548 87288 87079 87666 88539 88459 87017
66328 87017 85058 83486 82349 81418 80955 81346 82324 83212 83767 84272 84869 85254 85122 84598 84097 83909 83990 84084 84075
66309 84075 84233 84899 85891 86483 86163 85195 84221 83635 83559 84081 85007 85630 85341 84433 83751 83557 83297 82620 81942
66290 81942 81658 81316 80178 78372 76933 76701 77578 78865 79938 80485 80453 80069 79761 79796 80018 80116 80122 80454 81364
66271 81364 82514 83245 83226 82742 82384 82562 83306 84339 85293 85974 86496 87088 87738 88175 88213 87997 87817 87844 88080
66252 88080 88328 88151 87146 85554 84342 84325 85295 86309 86700 86461 85804 84874 83996 83699 84229 85289 86424
66235 86424 87348 87821 87614 86901 86350 86419 86788 86848 86580 86536 86968 87433 87370 86810 86325 86422 87153 88277 89666 91376
66215 91376 93194 94346 94044 92463 90775 89973 89951 90030 90078 90565 91669 92889 93667 93986 94194 94554 95092 95682
66197 95682 96161 96543 97065 97768 98125 97472 95919 94391 93612 93433 93340 93243 93378 93704 93843 93540 92952 92502 92633
66178 92633 93574 95119 96681 97718 98047 97766 97093 96465 96441 97160 97990 98048 97097 95803 95088 95368 96290 97060
66160 97060 97123 96639 96259 96431 97084 97941 98755 99115 98556 97222 96071 95919 96518 96996 96972 96711 96416 96030 95704
66141 95704 95817 96393 97030 97574 98347 99522 100722 101551 102116 102689 103128 102961 101971 100527 99406 99279 100101 100997
66123 100997 101095 100573 100496 101472 102900 103782 103916 103907 104291 105059 105909 106553 106785 106516 105862 105150 104802 105113 105955 106760
66103 106760 107088 107180 107609 108425 109137 109634 110466 111885 113249 113914 114245 115032 116239 117106 117347 117479 117846 118065
66085 118065 117675 116811 115925 115302 115205 116096 118143 120643 122355 122564 121664 120663 120243 120313 120320 119867 119051 118340 118195
66066 118195 118720 119546 120067 119971 119552 119353 119507 119645 119508 119289 119256 119358 119476 119796 120511 121339 121764 121743 121821 122499
66046 122499 123762 125257 126639 127671 128268 128572 128872 129357 130026 130815 131678 132539 133286 133794 133910 133554 132989
66029 132989 132823 133412 134321 134674 134085 133013 132252 132338 133383 135116 136913 138108 138541 138750 139462 140963 142980
66012 142980 145024 146759 148067 148929 149336 149420 149653 150712 152971 156174 159713 163097 166147 168990 172092
65997 172092 176102 181319 187390 193728 200033 206125 211506 215613 218541 221032 223644 226239 228375 229848
65983 229848 230702 230953 230501 229175 226826 223531 219659 215546 211169 206432 201652 197382 193751 190374 186965
65968 186965 183596 180300 176913 173526 170664 168677 167285 165981 164640 163433 162377 161294 160114 159035
65954 159035 158470 158847 160226 161986 163255 163838 164438 165704 167425 168990 170367 172125 174605 177503 180335
65939 180335 182980 185673 188611 191633 194255 196049 197051 197690 198269 198737 199077 199668 200999 203161 205838
65924 205838 208666 211459 214214 217112 220404 224115 228021 232096 236746 242280 248325 254150 259555 265032
65910 265032 270987 277139 282864 287878 292297 296112 298930 300402 300835 301088 301682 302176 301727 300275 298804
65895 298804 298279 298583 298779 298169 296724 294530 291251 286457 280393 274136 268735 264179 259424 253555 246709
65880 246709 239633 232714 225937 219585 214145 209396 204365 198616 192957 188384 184858 181745 178957 176847
65866 176847 175306 173888 172741 172551 173367 174284 174576 174483 174526 174565 174077 172953 171555 170142 168676 167128 165693
65849 165693 164710 164557 165509 167452 169818 171978 173716 175185 176470 177391 177729 177588 177450 177884 179102 180727
65833 180727 182011 182385 181893 181207 181253 182668 185421 188992 193010 197664 203336 209877 216566 222874 229031
65818 229031 235682 243062 250718 257975 264492 270271 275227 278949 280960 281125 279608 276498 271788 265886
65804 265886 259830 254597 250204 245869 241103 236296 232068 228358 224523 220239 215916 212152 209064 206422
65790 206422 204233 202797 202134 201743 201262 201155 202390 205424 209818 214903 220465 226704 233818 241842 250675
65775 250675 260097 270010 280665 292305 304351 315388 324342 331350 336988 340953 342071 339513 333471
65762 333471 324666 313755 301356 288203 275094 262869 252406 244242 238192 233796 231264 231523 235152
65749 235152 241632 249862 259113 269307 280763 293946 309157 326106 343880 361547 378607 394707
65737 394707 409152 421006 429527 434292 435106 432056 425543 416000 403612 388533 371292 352774 333811
65724 333811 314968 296680 279407 263563 249404 236974 226141 216695 208458 201253 194818 188873
65712 188873 183322 178239 173687 169693 166414 164013 162200 160198 157497 154533 152287 151209 150813 150382 149782
65697 149782 149346 149128 148675 147719 146863 147141 148852 151148 153047 154522 156205 158216 159868 160691 161205 162436
65681 162436 164950 168642 173158 178157 183249 188097 192670 197341 202794 209832 219027 230313 243088 256960
65667 256960 272287 289727 309309 330183 351285 372007 392154 411484 429515 445763 460007
65656 460007 472162 481935 488869 492949 494973 495955 496193 495371 493689 492377 492730 494951 498372 502529 507397
65641 507397 512508 516381 517217 514047 507065 496924 483910 467855 448801 427579 405555 383789 362581
65628 362581 341792 321289 301036 281161 262222 245142 230490 218000 207063 197472 189338 182593
65616 182593 177128 173222 171058 169752 167659 164065 159971 156751 154536 152562 150721 149837 150312 151271 151446
65601 151446 150482 148950 147397 145911 144533 143559 143255 143551 144226 145176 146321 147481 148603 149996 152006 154505
65585 154505 157055 159557 162317 165367 168241 170812 173997 179084 186484 195633 206039 217825 231122
65572 231122 245526 260596 276482 293613 311937 330891 349960 368764 386599 402361 415140
65561 415140 424628 430828 433694 433167 429260 421852 410720 396148 379265 361358 342956 324052 305085
65548 305085 287075 270626 255439 241239 228664 218624 211014 204722 198892 193595 189168 185474 182146
65535 182146 179258 177368 177025 178358 180956 183975 186572 188444 189895 191228 192218 192310 191195 189008 186096
65520 186096 182752 179115 175188 171003 166834 163098 159986 157393 155341 154165 153993 154262 154136 153370 152430
65505 152430 151767 151339 150906 150508 150448 151002 152286 154226 156409 158064 158536 157942 157229 157357 158402 159624 160521
65488 160521 161598 163832 167546 172173 177109 182325 187912 193479 198429 202607 206172 208909 210255 210164 209509
65473 209509 209289 209568 209470 208146 205488 201918 197782 193229 188512 184051 179987 175986 171752 167573 163993
65458 163993 161067 158395 155881 153896 152550 151365 149991 148717 147822 146947 145715 144631 144607 145726 147153
65443 147153 148249 149110 149992 150950 152193 154145 156793 159486 161661 163339 164769 166144 167939 170892 175063
65428 175063 179390 182791 185363 187886 190405 192052 192175 190924 188607 185238 181107 177231 174609 173163
65414 173163 171866 169953 167656 165642 164093 162692 161442 160997 161906 163753 165463 166461 167120 167975 168902 169453
65398 169453 169737 170584 172848 176737 181793 187243 192433 197160 201631 205975 209847 212648 214054 214172 213232
65383 213232 211358 208642 205249 201449 197678 194502 192318 191108 190627 190722 191230 191731 191770 191447 191436 192331 194168
65366 194168 196653 199555 202732 206041 209444 213056 216979 221329 226541 233356 242207 252821 264696 277751
65352 277751 292136 307402 322282 335399 346002 354021 359645 363007 364108 362947 359748 354981 349053
65339 349053 342031 333938 325234 316617 308311 299883 290966 281788 272731 263763 254772 246215 238808 232560
65325 232560 226707 220812 215448 211367 208348 205330 201671 197809 194674 192692 191494 190312 188488 185778
65311 185778 182439 179063 176241 174298 173249 172869 172727 172328 171383 169998 168566 167480 166990 167259 168458 170722
65295 170722 174026 178107 182494 186705 190566 194381 198595 203148 207264 210118 211691 212683 213504 213700 212692
65280 212692 210798 209016 207822 206722 205152 203308 201677 200080 197779 194499 190894 187878 185849 184680
65266 184680 184122 183970 183987 183940 183711 183346 183092 183366 184398 185761 186495 185967 184514 183049 182172 181870 181901 182072
65248 182072 182090 181498 179972 177577 174675 171724 169173 167293 165917 164511 162720 160833 159573 159391 160063
65233 160063 160922 161450 161708 162203 163301 164797 166158 167162 168007 168746 168974 168353 167194 166064 165042 163808
65217 163808 162429 161496 161350 161699 162190 162865 163733 164401 164653 165001 166030 167407 168223 168326 168563 169527 170668
65200 170668 171003 170277 169027 167798 166750 165787 164702 163236 161354 159479 158199 157727 157824 158222 158934 160217
65184 160217 162367 165443 168961 171908 173481 173956 174584 176384 179126 181736 183577 185021 186676 188387 189351
65169 189351 189100 187957 186521 185127 184086 183966 185102 186999 188795 190364 192511 195954 200561 205674 210755
65154 210755 215505 219780 223771 228001 232831 238173 243899 250303 257948 267223 278287 291224 306082
65141 306082 322958 342141 363751 387057 410603 433378 455417 476901 497292 516037 533652
65130 533652 551131 568335 583737 595777 603820 607827 608009 605095 600248 594244 587026 578232 567645
65117 567645 554931 539451 520830 499505 476501 452904 429585 407003 385091 363719 343434
65106 343434 325261 309509 295254 281439 268136 256280 246398 238076 230555 223485 217066 211637 207171
65093 207171 203138 198984 194774 191129 188560 187132 186757 187328 188487 189721 190905 192284 193771 194791 195141
65078 195141 195398 196054 196769 196963 196664 196184 195457 194407 193621 193784 194601 195070 194811 194420 194459 194847 195344 195903 196299
65059 196299 195993 194791 193256 192109 191543 191318 191247 191313 191542 192022 192841 193794 194339 194105 193379 192897 193122 193810
65041 193810 194253 193988 193269 192783 192843 192989 192489 191072 188988 186548 183923 181240 178553 175808 173138 171018
65025 171018 169724 168746 167254 165207 163510 162954 163408 164194 164856 165345 165809 166433 167264 168054 168505 168783 169415
65008 169415 170578 171854 172930 174166 176175 179076 182467 185932 189246 192268 194962 197473 199945 202264
64994 202264 204144 205392 205969 205911 205371 204678 204169 203938 203880 203980 204541 206141 209215 213521 218062 221781 224399
64977 224399 226313 227794 228644 228694 228105 226897 224604 220918 216417 212165 208625 205399 202062 198832 196221
64962 196221 194311 192672 190919 189081 187344 185651 183816 182030 180851 180458 180175 179209 177708 176510 175820
64947 175820 174774 172670 170090 168271 167676 167728 167826 168029 168707 169973 171561 172951 173544 173093 172148 171765 172540
64930 172540 174093 175666 177030 178501 180140 181334 181378 180285 178783 177579 176858 176464 176204 175855 175273 174743
64914 174743 174887 175808 176654 176671 176458 177441 180008 182962 185061 186435 188132 190907 194998 200422 206775 213175
64898 213175 219128 225196 232140 239708 247069 254221 261983 270523 278821 285857 291586 296438 300594 304249
64884 304249 307967 312051 315830 318136 318351 316580 313037 307823 301280 294083 286832 279829 273358 267872
64870 267872 263641 260380 257491 254792 252810 252213 253002 254398 255456 255561 254381 251821 248237 244310 240335
64855 240335 235918 230764 225453 220807 216699 212215 207065 202124 198341 195682 193458 191193 188867 186731
64841 186731 185264 184898 185369 185689 185122 183950 182956 182485 182413 182612 182929 182994 182687 182634 183637 185645 187842 189722
64823 189722 191472 193261 194816 195996 197275 199259 202072 205553 209776 214964 221040 227647 234611 242111
64809 242111 250375 259421 269221 279898 291509 303570 314933 324245 330561 333552 333363 330481 325671
64796 325671 319635 312587 304395 295277 286047 277489 269713 262422 255651 249900 245649 242983 241608 240951
64782 240951 240403 239783 239450 239697 240176 240287 240018 239968 240646 242223 244897 248877 253883 259230 264670 270695 277766
64765 277766 285687 294109 303229 313458 324567 335556 345360 353472 359993 365323 369735 373156 375463
64752 375463 376994 378464 380253 382133 383856 385570 387238 388034 386876 383434 378155 371412 363151 353392
64738 353392 342630 331536 320615 310234 300731 292352 285250 279552 275249 272035 269520 267611 266429
64725 266429 265801 265103 263753 261686 259351 257483 256886 258053 260776 264362 268404 273144 278866 285187 291304
64710 291304 296784 301678 305798 308395 308902 307733 305849 303530 300056 294790 288164 281207 274373 267370
64696 267370 260021 252707 245880 239751 234618 230962 228799 227367 225930 224520 223539 223016 222824 223314 224981
64681 224981 227629 230560 233553 237047 241381 246580 252963 261209 271482 283092 295345 308130 321235
64668 321235 333664 344234 352553 358881 363246 365184 364232 360282 353622 345040 335752 326820 318569 310795
64654 310795 303383 296428 289953 283960 278788 275064 273207 273129 274311 275961 277228 277733 278048 279389 282705
64639 282705 288126 295312 304124 314875 327928 343076 359343 375585 391334 406816 421962 435696
64627 435696 446548 453817 457804 458977 457336 452677 445112 435085 423037 409212 393821 377372 360783
64614 360783 345035 330632 317556 305861 296043 288539 283056 278734 274863 271127 267282 263095 258775
64601 258775 255161 253220 253404 255384 258257 261096 263595 266227 269620 273809 278292 282691 287009 291331
64587 291331 295619 299885 304243 308734 313383 318441 324221 330628 337159 343463 349535 355232 359994 363295
64573 363295 365117 365792 365604 364693 363062 360489 356698 351829 346410 340616 333882 325671 316390 307110 298502
64558 298502 290463 282730 275374 268620 262574 257355 253180 250030 247404 244651 241547 238403 235672 233586
64544 233586 232203 231575 231739 232583 233893 235547 237562 239911 242431 244975 247517 249996 252112 253456 253747
64529 253747 252861 250809 247915 244884 242348 240380 238683 237255 236529 236741 237445 237782 237156 235694 234313 234249
64513 234249 236061 238922 241229 242218 242790 244578 248373 253569 258868 263314 266988 271037 276912 285278 295639
64498 295639 307073 319079 331544 344145 356077 366267 373665 377583 378039 375680 371182 364925 357391
64485 357391 349478 341968 334949 328301 322520 318422 316038 314431 312788 311129 309723 308323 306400 303756
64471 303756 300509 296695 292297 287554 282860 278463 274578 271677 270203 269945 270135 270433 271479 274115 278214
64456 278214 282614 286141 288459 289902 290907 291724 292398 292785 292729 292417 292363 292869 293711 294643 295928 297927 300315
64439 300315 302321 303867 306006 309957 316054 323807 332656 342389 353097 365105 378888 394882 413428
64426 413428 434927 459838 488527 521484 559775 604947 658409 721339 795287 882056 982372
64415 982372 1094889 1216844 1345166 1476529 1607078 1733296 1853161 1965686 2069201 2160635
64405 2160635 2236451 2293672 2330107 2344553 2337330 2310250 2265681 2205664 2131596 2044142 1943440
64394 1943440 1830250 1707295 1579097 1450238 1324145 1203409 1090347 986602 892700 808568
64384 808568 734273 669945 615287 569489 531347 499311 471914 448479 429049 413390 400608
64373 400608 389995 381459 374613 368186 361175 353953 347323 340989 334087 326851 320384 314818 309062 302726
64359 302726 296952 292684 289251 285570 281891 279251 277791 276771 276043 276376 278214 281098 284624 289211 295413
64344 295413 302900 310608 317662 323764 328824 332574 334574 334451 332124 327928 322547 316794 311380 306775
64330 306775 303113 300261 298066 296573 295950 296247 297344 299033 300950 302506 303202 303132 302971 303311 304054 304499
64314 304499 303919 302077 299358 296525 294198 292441 290887 289200 287254 284920 281980 278373 274259 269702
64300 269702 264606 259126 253858 249299 245385 241842 238731 236229 234094 231956 230036 229069 229402 230659 232374
64285 232374 234405 236527 238170 239054 239825 241688 245480 251212 258251 265742 273143 280650 288898 298052 307482
64270 307482 316593 325576 334850 343953 351557 356569 358897 359207 358362 357089 355749 354287 352629 351085 350146
64255 350146 349957 350301 350974 351730 351839 350235 346315 340350 333016 324776 315828 306360 296752 287612 279539
64240 279539 272571 266086 259721 254262 250921 249643 248864 247284 245233 243863 243624 244142 245067 246251 247392
64225 247392 248268 249222 250668 252115 252458 251444 250152 249730 250196 250837 251277 251584 251671 251231 250243 249019 247621
64208 247621 245653 242846 239657 237066 235829 236050 237360 239293 241472 243648 245696 247550 249075 250134
64194 250134 250906 252077 254479 258349 263082 267904 272900 279301 288599 301257 316329 332394 348773
64181 348773 365561 382446 397943 410170 418183 422115 422202 418319 410640 400140 388023 374956 361223
64168 361223 347305 333794 320911 308588 297003 286631 277760 270300 264082 258997 254789 251143 248119
64155 248119 246148 245342 245105 244686 243968 243440 243588 244603 246627 249913 254566 260255 266244 271693 276067 279452
64139 279452 282502 285812 289168 291561 292084 290778 288482 285993 283600 281344 279338 277664 276212 274907
64125 274907 273942 273490 273313 273013 272736 273250 275145 278249 282015 286344 291680 298423 306488 315500 325195 335557
64109 335557 346587 358000 369151 379347 388254 395954 402555 407870 411606 413792 414914 415683 416797
64096 416797 418855 422272 427099 432917 438964 444447 448804 451669 452713 451723 448959 445189 441028 436326
64082 436326 430510 423456 415638 407422 398735 389640 380707 372421 364629 356973 349643 343214 337962 333789
64068 333789 330620 328324 326316 323867 320949 318329 316657 315781 315064 314037 312653 311209 310190 309952 310483
64053 310483 311700 313848 317177 321217 324992 328150 331400 335553 340656 346461 353232 361447 370969 381177
64039 381177 391879 403533 416426 430066 443514 456019 467156 476619 484168 489726 493356 495076
64027 495076 494743 492234 487935 482984 478712 475666 473449 471657 470604 470774 471864 472911 473174 472335 469933
64012 469933 465372 458705 450825 442523 433804 424483 415052 406402 398953 392515 386826 381751 377042 372453
63998 372453 368162 364650 362044 359978 358260 357312 357714 359547 362399 365804 369452 373200 377188 381813 387342
63983 387342 393564 400036 406544 413098 419585 425839 432040 438741 446327 454707 463653 473162 483259 493657
63969 493657 503989 514389 525538 538078 552097 567269 583384 600645 619553 640617 664113
63958 664113 689955 717717 746881 777335 809817 845884 887362 935722 992010 1057276 1132955
63947 1132955 1220811 1322722 1440674 1576812 1733166 1911096 2110997 2332510 2574907 2837166
63937 2837166 3117685 3414079 3723271 4041570 4364313 4685225 4996376 5289271 5556425
63928 5556425 5792086 5991604 6150527 6264675 6331084 6348551 6317132 6237408 6110599 5939458
63918 5939458 5728831 5485212 5215777 4927770 4628333 4324269 4021507 3724661 3437146
63909 3437146 3161747 2901143 2657979 2434431 2231553 2048994 1885491 1739745 1610831
63900 1610831 1497795 1399146 1312889 1237016 1169865 1110277 1057626 1011565 971493 936304 904811
63889 904811 876220 849922 825101 801106 778176 757226 738736 722250 707087 693069 680351
63878 680351 669060 659518 652475 648604 647910 649963 654543 661675 671240 682971 696855 713186 732261
63865 732261 754213 778983 806063 834376 862819 891006 919225 947660 975875 1002996 1028056
63854 1028056 1050274 1069338 1085476 1098850 1108821 1114146 1114031 1108744 1099214 1086344 1070764 1052820
63842 1052820 1032464 1009374 983428 955042 924979 893939 862335 830236 797505 764189 730818
63831 730818 698127 666534 636146 607266 580429 555819 533012 511547 491397 472679 455278
63820 455278 439091 424345 411274 399617 388861 378895 370008 362244 355150 348316 341879 336250 331507
63807 331507 327308 323395 319942 317270 315339 313742 312199 310784 309579 308371 306871 304989 302632 299539
63793 299539 295764 292120 289528 287880 286090 283397 280128 277041 274432 272105 269778 267165 264140 261108
63779 261108 258848 257613 256771 255644 254280 253016 251790 250477 249503 249426 250073 250722 250951 250755 250035 248748
63763 248748 247442 246891 247157 247700 248354 249351 250287 250148 248840 247826 248508 250578 252642 253957 254745 255187 255065
63746 255065 254459 253989 254136 254854 256008 257699 259886 262067 263702 264849 266086 267878 270141 272396 274241
63731 274241 275700 277134 278867 280920 283144 285452 287856 290386 293175 296527 300735 305860 311811 318440
63717 318440 325296 331463 336125 339414 342329 345632 349104 352008 353934 354853 354666 353213 350691 347604 344224
63702 344224 340514 336701 333472 331222 329461 327484 325547 324796 325843 327909 329754 331095 332650 334995
63688 334995 337975 341289 345071 349527 354306 358622 361824 363584 363738 362400 360232 358166 356745 355894 355326
63673 355326 354837 354186 353169 352071 351679 352429 353762 354805 355617 357215 360163 363572 365896 366568 366474 366753
63657 366753 367470 367656 366462 363918 360505 356295 350918 344352 337441 331438 327125 324439 322738 321256 319515
63642 319515 317631 316173 315506 315351 315281 315538 316924 319770 323450 327099 330469 333769 336971 339784 342274
63627 342274 345147 349287 355103 362259 369890 377188 384079 391336 399883 409908 420822 431956 443155
63614 443155 454754 467313 481428 497589 516045 536830 559882 585048 612102 640907 671471
63603 671471 703577 736444 769019 800533 830332 857177 879155 894658 903297 905857 903662 898117
63591 898117 890479 881627 872080 862274 852519 842514 831220 817614 801455 783076 762687 740322
63579 740322 716354 691627 667041 643408 621617 602400 585736 570941 557646 546319 537532 531088
63567 531088 526346 523217 522221 523492 526341 530054 534634 540270 546439 552225 557512 563249 570218 578060
63553 578060 585969 594033 603387 615158 629810 647559 668875 694261 723865 757642 795707 838083
63541 838083 883954 931183 976534 1016401 1047695 1068623 1079007 1080092 1074010 1063205 1049927 1035935
63529 1035935 1022479 1010376 999901 990631 981609 971788 960257 946095 928293 906021 878999 847723
63517 847723 813454 777913 742633 708456 675729 644814 616081 589541 565002 542650 522972
63506 522972 505936 490804 477048 464865 454442 445229 436515 428290 420899 414216 407920 402317 398059
63493 398059 395096 392654 390340 388473 387212 386117 384897 383883 383330 382836 382030 381408 381871 383619 385998
63478 385998 388367 390727 393535 397200 401773 406934 412293 417712 423125 428046 431626 433439 433866 433413 431990
63463 431990 429243 425216 420258 414569 408434 402699 398256 395047 392215 389388 387219 386392 386669 387295 387920
63448 387920 388658 389679 391269 394059 398577 404518 411005 417666 425048 433811 443929 454932 466675 479562
63434 479562 494294 511761 533046 559077 589933 624455 660415 694998 725424 749688 767177
63423 767177 778653 785641 789829 792903 796572 802455 811857 825599 843958 866805 894006 925656 961602
63410 961602 1000566 1039976 1076902 1109102 1135137 1153944 1164836 1167968 1164445 1155914 1144167 1130971
63398 1130971 1117704 1104845 1091966 1078317 1063217 1045866 1025169 1000239 971082 938641 904180
63387 904180 868723 832988 797656 763604 731832 703035 677150 653508 631638 611931 595318
63376 595318 582308 572473 564916 559041 554823 552555 552524 554833 559305 565490 572900 581359 591117 602636
63362 602636 616276 632065 649616 668322 687935 709108 733154 761003 792540 827107 864375
63351 864375 904221 945820 987392 1027038 1063291 1094624 1119054 1134987 1142467 1143112 1138853 1131037
63339 1131037 1120640 1108655 1095949 1082938 1069607 1055642 1040390 1022958 1002617 979140 952711
63328 952711 923670 892474 859815 826651 794106 763345 735467 711429 692030 677813 668771 664106
63316 664106 662394 661951 660996 657641 650212 637810 620605 599649 576590 553332 531446 511601 493701
63303 493701 477706 464070 453149 444421 436654 428909 421257 414491 409293 405685 403117 400891 398469
63290 398469 395515 391955 388121 384600 381664 378937 375853 372371 368961 365938 363206 360726 358778 357511
63276 357511 356521 355229 353508 351698 350157 349060 348540 348679 349331 350176 351014 351888 352865 353838 354605 355100 355501
63259 355501 356143 357281 358915 360841 362869 364997 367386 370253 373743 377837 382381 387275 392600 398449
63245 398449 404711 411153 417648 424115 430348 436269 442431 449933 459585 471277 484322 498275 513301
63232 513301 529957 548774 569927 593064 617488 642653 668477 695103 722383 749734 776532
63221 776532 802589 828210 853754 879195 904252 928929 953730 979224 1005566 1032550 1059765
63210 1059765 1086461 1111545 1134191 1154216 1171346 1184351 1191558 1192173 1186370 1174108 1154857 1128851
63198 1128851 1097805 1063795 1028057 991468 955539 922025 891807 864889 841356 821619 805770
63187 805770 793397 784212 778480 776746 779352 786187 796652 810016 826059 845103 867101 891073
63175 891073 915895 941300 967498 994147 1020461 1046155 1071467 1096271 1120051 1142866 1165411
63164 1165411 1187733 1208504 1225997 1239275 1248122 1252343 1251604 1245576 1233821 1215794 1191304 1160826
63152 1160826 1125310 1086074 1044931 1003703 963158 922909 882848 844273 809045 777923 750239
63141 750239 724969 701575 679971 660306 642888 627914 615148 604093 594453 586209 579383 573998
63129 573998 570134 567633 565864 564161 562571 561812 562414 564186 566567 569286 572581 576926 582529 588989 595514
63114 595514 601663 607720 614084 620420 625798 629675 632392 634696 637126 639875 642801 645365 646904 647202
63100 647202 646600 645422 643583 641022 638211 635870 634247 632976 631635 630195 628930 628110 627870 628196 628904
63085 628904 629614 629879 629444 628492 627510 626753 625974 624990 624466 625657 629092 633849 638490 642492 646402 650898
63069 650898 656244 662570 670007 678329 686947 695611 704853 715516 728053 742449 758541 776212 795587
63056 795587 817219 841721 868984 898182 929011 962542 1000284 1042645 1088931 1138687 1192215
63045 1192215 1249666 1310309 1373013 1436956 1501580 1566317 1630709 1694444 1757050 1817905 1876858
63034 1876858 1934504 1991582 2048459 2105377 2162591 2219703 2275260 2327583 2375740 2419047 2455841
63023 2455841 2483524 2499915 2504021 2495459 2473770 2438669 2390643 2331078 2262061 2186212 2106447 2025567
63011 2025567 1945920 1869258 1796755 1729342 1668253 1615064 1570830 1535363 1507808 1487892 1476175
63000 1476175 1473188 1478803 1492395 1513007 1539305 1569992 1604488 1642729 1684185 1727773 1772891 1819779
62988 1819779 1868372 1917484 1965802 2013178 2060166 2106585 2151319 2193332 2231963 2266164 2294180
62977 2294180 2314281 2325280 2326149 2315696 2293085 2258427 2212538 2156369 2091050 2018317 1940457 1859694
62965 1859694 1777724 1695874 1615433 1537678 1463641 1394035 1329380 1269974 1215592 1165471 1118906
62954 1118906 1075836 1036521 1000659 967200 935239 904724 876011 848996 823067 797818 773461
62943 773461 750504 729282 709775 691695 674738 658886 644407 631458 619831 609301 600032 592294
62931 592294 585833 579841 573642 567194 560974 555560 551307 548077 545167 541741 537496 532856 528570 525246
62917 525246 523149 522157 521824 521637 521203 520115 517891 514429 510428 506871 503988 501171 497980 494732 491893
62902 491893 489407 487056 485077 483835 483069 482009 480287 478297 476618 475400 474388 473242 471726 469905
62888 469905 468268 467428 467500 467930 468081 467885 467778 468087 468675 469168 469438 469760 470480 471540 472467 472918 473110 473576
62870 473576 474527 475659 476532 476888 476622 475693 474222 472466 470599 468660 466780 465204 463999 463035 462357 462259
62854 462259 462748 463338 463760 464534 466246 468426 469830 469876 469230 468805 468805 469004 469321 469666 469637 468985 468067 467326 466523
62835 466523 465097 463151 461455 460403 459540 458333 456929 455885 455505 455733 456435 457510 458858 460488 462488
62820 462488 464768 466967 468847 470602 472635 475139 478079 481401 484965 488371 491240 493806 496968 501519
62806 501519 507316 513386 518942 524254 530404 538074 546739 555195 562865 570366 578737 588402 598996 609999
62792 609999 621285 633117 645919 660062 675728 692900 711623 732402 756303 784506 817644
62781 817644 855513 897474 943212 993239 1048719 1110806 1180004 1255991 1337981 1425336 1517789
62770 1517789 1614939 1715482 1817170 1917627 2014911 2107028 2191150 2263858 2322293 2364854 2390842
62759 2390842 2399843 2391663 2366647 2325843 2270894 2203766 2126444 2040879 1949287 1854257 1758167 1662525
62747 1662525 1568276 1476698 1389504 1307974 1232491 1163003 1099351 1040910 986692 936429 891077
62736 891077 851579 817429 787114 759748 735509 714590 696488 680493 666248 653593 642353
62725 642353 632532 624286 617520 611909 607519 604890 604151 604426 604629 604714 605770 608953 614609 622294 631317
62710 631317 641293 652494 665738 681719 700400 721214 743933 769189 798097 831522 869765 912815
62698 912815 960631 1013122 1070056 1131298 1197263 1268936 1347098 1431488 1520880 1613978 1709930
62687 1709930 1807728 1905333 1999665 2087448 2165804 2232162 2284127 2319832 2338353 2339454 2322978
62676 2322978 2288808 2237578 2171247 2092712 2004943 1910640 1812525 1713478 1616029 1521815 1431680
62665 1431680 1346146 1265602 1190168 1119794 1054697 995489 942616 895712 853750 815834 781681
62654 781681 751245 724160 699801 677790 658078 640463 624314 608994 594385 580753 568255
62643 568255 556801 546334 536954 528758 521782 516086 511676 508349 505813 503938 502607 501404 499796 497747
62629 497747 495780 494252 492833 490880 488115 484748 481219 477996 475379 473320 471597 470307 469861 470287 470991
62614 470991 471584 472603 474891 478454 482483 486410 490390 494679 499112 503493 508120 513580 520197 527920
62600 527920 536729 546949 559065 573272 589312 606979 626783 649871 677159 708758 744333 783623
62588 783623 826243 871335 918022 966086 1015552 1065514 1113824 1158146 1196943 1229373 1254680
62577 1254680 1272072 1280894 1280680 1271183 1252686 1226209 1193221 1155146 1113213 1068683 1023008 977639
62565 977639 933588 891225 850663 812273 776557 743446 712316 683107 656948 634957 616619
62554 616619 600157 584496 570088 557717 547366 538645 531460 525587 520212 514698 509523 505713 503462
62541 503462 501953 500436 498918 497761 497198 497366 498297 499658 500891 501849 502955 504566 506419 507963 509030
62526 509030 509978 511294 513388 516729 521978 529772 540328 553261 567870 583810 601556 622185 646591
62513 646591 674948 706908 742232 781132 824011 871000 921804 975952 1033013 1092441 1153227
62502 1153227 1213831 1272506 1327652 1377799 1421353 1456569 1482037 1497342 1503283 1501436 1493557 1481365
62490 1481365 1466640 1451147 1436370 1423570 1414178 1409819 1411644 1419788 1433834 1453773 1480177 1513289
62478 1513289 1552001 1593679 1634816 1671987 1702583 1724967 1738196 1741776 1735612 1719739 1693710 1656530
62466 1656530 1607685 1548339 1481196 1409156 1334312 1258024 1181479 1106045 1033371 965192 902740
62455 902740 846322 795735 751010 712396 679704 652185 629100 609956 594129 580835 569664
62444 569664 560674 553784 548525 544579 541963 540456 539468 538879 539406 541569 544778 548046 551188 554624 558255
62429 558255 561240 562799 562612 560525 556564 551364 545978 540979 536003 530317 523592 516114 508462 501094
62415 501094 494130 487529 481496 476441 472367 468646 464708 460676 456966 453596 450367 447411 444909 442434
62401 442434 439302 435606 432274 430019 428871 428822 430200 432992 436349 439285 441633 443911 446452 449023 451264
62386 451264 453215 455327 458011 461230 464661 468252 472406 477412 482997 488798 494964 501764 508858 515587
62372 515587 521979 528731 536177 544044 552401 561997 573175 585117 596804 608335 620778 635115 651915
62359 651915 671716 695083 722332 753634 789383 830150 876392 928349 985801 1047532 1111329
62348 1111329 1174999 1237073 1296039 1349402 1394442 1429954 1456492 1474865 1485115 1487133 1481462 1468984
62336 1468984 1450282 1425769 1396053 1361773 1323389 1281626 1237936 1194065 1151179 1109705 1069916
62325 1069916 1032257 997052 964192 933303 904107 876549 850647 826215 802698 779357 755849
62314 755849 732658 710826 691061 673085 655955 639067 622790 608048 595336 584403 574894 566932
62302 566932 560760 556050 552056 548426 545367 542929 540615 537998 535340 533289 532226 532276 533595 536129 539238
62287 539238 542054 544239 546003 547519 548830 550303 552468 555157 557386 558482 558918 559637 560954 562618 564652
62272 564652 567427 570958 574710 578300 582008 586453 592087 599161 607885 618349 630426 643942 658977
62259 658977 675972 695709 719190 747423 781171 820876 866674 918320 975220 1036694 1102110
62248 1102110 1170367 1239294 1305915 1367476 1421994 1467955 1504110 1529954 1545984 1552976 1551125 1540278
62236 1540278 1520919 1494400 1462096 1424647 1382223 1335425 1285771 1235350 1186028 1138877 1094218
62225 1094218 1052138 1012845 976644 943756 914253 887981 864385 842592 821916 802289 783982
62214 783982 766973 750752 734804 719082 703955 689801 676778 664914 654246 644691 635895 627471
62202 627471 619543 612814 607819 604291 601670 600085 600236 602173 604874 607419 610069 613644 618239 623314
62188 623314 628889 635849 644828 655301 666084 676457 686598 697114 708320 719896 731194 741892
62176 741892 752159 761962 770469 776664 780565 783424 786668 791069 796989 804858 815115 828175 844856
62163 844856 866504 894116 927418 965186 1006462 1051056 1098738 1148157 1196667 1241152 1279077
62152 1279077 1309037 1330567 1343790 1349414 1348821 1343490 1333867 1319032 1297863 1270507 1238442 1203297
62140 1203297 1166098 1127657 1089147 1051885 1016753 984167 954535 928414 906154 887585 872126
62129 872126 859143 848171 838997 831633 826136 822362 819962 818656 818387 819125 820714 823127 826690 831722
62115 831722 838049 845216 853240 862682 873819 886007 898031 908681 916795 921244 921546 918460 913667
62102 913667 908860 905307 903794 904265 905536 906011 904936 902726 900158 897770 896034 895392 895780 896626 897698
62087 897698 899552 902735 906941 911441 916118 921543 928187 936076 945190 955697 967608 980606 994431
62074 994431 1009280 1025632 1043812 1063790 1085176 1107189 1128714 1148707 1166828 1183693 1200396
62063 1200396 1217698 1235731 1254516 1274498 1296303 1320046 1345213 1371189 1397402 1422750 1445335
62052 1445335 1463286 1475806 1483172 1485838 1483833 1476922 1464913 1447725 1425430 1398359 1366953 1331429
62040 1331429 1291853 1248678 1202961 1155829 1107898 1059519 1011476 965068 921389 880839 843455
62029 843455 809426 778918 751633 727017 704975 685921 669929 656264 644025 632950 623186 614570
62017 614570 606614 599027 591680 584186 576140 567922 560603 554781 549994 545653 542025 539803 539042 539143 539843
62002 539843 541696 545501 551533 559376 568228 577339 586349 595234 603850 611629 617917 622441 625251 626328
61988 626328 625629 623465 620415 616708 611901 605354 596878 586860 575912 564525 552939 541197 529333
61975 529333 517588 506534 496947 489396 483760 479158 474590 469761 465110 461038 457417 454019 451038 448843
61961 448843 447425 446506 446036 446100 446401 446414 446107 446096 446893 448409 450399 452997 456438 460510 464701 468798 473048
61944 473048 477815 483406 490283 499087 510226 523487 538189 553730 569968 587093 605181 623910
61932 623910 642699 661135 679215 697165 715014 732345 748431 762713 775137 785954 795132 802134
61920 802134 806449 808162 807704 805078 799756 791578 781449 770920 761219 752994 746745 743068 742370 744727
61906 744727 750136 758664 770118 783784 798763 814477 830574 846319 860351 871245 878284 881600
61894 881600 881648 878678 872705 863847 852526 839336 824844 809632 794444 780036 766774 754481 742771
61881 742771 731472 720638 710293 700287 690306 679902 668684 656721 644669 633179 622308 611849
61869 611849 602152 594082 588028 583498 580012 577858 577577 579055 581666 585047 589238 594339 600609 608754
61855 608754 619436 632478 647130 663108 680822 700599 722410 746457 773236 802635 833623
61844 833623 865267 897472 930180 962385 992556 1019682 1043294 1062792 1077496 1087166 1091805 1091112
61832 1091112 1084882 1074026 1060514 1046144 1031920 1018771 1008127 1001240 998334 998933 1002767 1009863 1019857
61819 1019857 1031734 1044334 1056669 1067522 1075109 1077718 1074766 1066874 1054726 1038096 1016399 989969
61807 989969 960313 929025 896975 864725 833192 803387 775741 750148 726512 704838 684910
61796 684910 666416 649421 634309 621140 609406 598568 588601 579868 572635 566790 561854 557196 552416
61783 552416 547627 543319 539948 537631 536118 534931 533710 532629 532244 532735 533503 533870 533884 533968 534034 533617 532799
61766 532799 532216 532002 531536 530574 529926 530437 531888 533588 535664 538909 543491 548521 553034 556771 559920 562643
61750 562643 565136 567642 570000 571391 570972 568711 565392 561822 558190 554155 549398 544056 538703 533922
61736 533922 529883 526356 523110 520199 517853 516230 515358 515227 515817 517098 518999 521274 523376 524766 525548
61721 525548 526617 528877 532394 536560 540861 545112 549061 552409 555392 558705 562520 565979 568135 568926
61707 568926 568763 567553 564885 560985 556665 552327 547700 542689 537778 533388 529517 526211 523688 521647
61693 521647 519202 516066 513094 510978 509022 506041 502063 498158 494842 491641 488242 485005 482103 479042
61679 479042 475541 472235 469969 468736 467709 466018 463241 459514 455586 452490 450733 449901 449267 448550 447817
61664 447817 446933 445601 443858 442142 440759 439658 438834 438658 439500 441152 442958 444599 446502 449252 452776
61649 452776 456357 459332 461454 462666 463046 463135 463819 465567 468099 471025 474304 477759 480701 482661 484118
61634 484118 485751 487283 487861 487379 486532 485569 483974 481582 479124 477280 475883 474500 473121 471770 470022
61619 470022 467491 464445 461520 459132 457522 456945 457306 457917 458023 457358 455881 453405 449843 445406 440109
61604 440109 433525 425613 417482 410668 405763 402144 398799 394935 390167 384824 379976 376478 373982 371407
61590 371407 368278 365024 362047 359232 356522 354305 352883 351968 350997 349640 347894 345942 344085 342542 341230
61575 341230 339933 338643 337457 336216 334684 333030 331693 330750 329955 329450 329841 331247 332848 333731 333837 333774
61559 333774 334021 334644 335418 335881 335567 334643 334079 334762 336554 338558 340173 341462 342625 343526 343835 343371 342303
61542 342303 341238 341042 342240 344556 347242 349781 352020 353829 355173 356565 358898 362579 367127 371814
61528 371814 376283 380239 382973 383860 383212 382051 380944 379510 377272 374481 371762 369213 366337 362820 359019
61513 359019 355637 353203 351914 351665 352083 352729 353423 354332 355539 356659 357066 356517 355417 354406 353785 353380
61497 353380 352902 352349 352033 352203 352705 353077 353006 352636 352380 352482 352847 353286 353824 354707 356091 357783 359321 360316
61479 360316 360718 360836 361170 362174 363900 365794 367033 367303 367172 367481 368430 369467 370080 370350 370616 370909 370944
61462 370944 370570 369967 369420 369033 368678 368139 367353 366558 366167 366421 367169 368106 369130 370422 372141 374116 375890
61445 375890 377089 377769 378347 379168 380252 381562 383384 386141 389784 393681 397277 400673 404349 408433 412490
61430 412490 416011 418926 421548 424134 426564 428455 429577 430104 430451 430882 431433 432137 433136 434449 435814 436969
61414 436969 438043 439486 441585 444121 446583 448588 449985 450555 449864 447644 444338 440946 438154 435792 433299
61399 433299 430506 427628 424679 421377 417687 414098 411190 409199 408107 407856 408277 408993 409585 409780 409486 408867
61383 408867 408429 408726 409783 410965 411547 411283 410461 409706 409820 411417 414421 418085 421655 424854 427655 429953
61367 429953 431747 433363 435165 437192 439259 441249 443074 444556 445643 446669 448223 450802 454597 459391
61353 459391 464609 469819 475345 482088 490541 500299 510653 521219 531712 541649 550756 559243 567180
61340 567180 573934 578774 581763 583550 584654 585592 587299 590427 594198 596831 597289 596073 594221 592272 590335
61325 590335 588375 586009 582612 578161 573604 570036 567787 566605 566303 566771 567700 568805 570221 572325 575234
61310 575234 578765 582815 587560 593370 600750 610208 621873 635179 649126 662853 675789 687268 696266
61297 696266 701812 703683 702596 699571 695140 689280 681967 673487 664114 653940 643305 633092 624160
61284 624160 616607 609939 603799 598088 592547 586866 581359 577074 574970 575248 577545 581371 586237 591677
61270 591677 597395 603219 608936 614442 620042 626174 632773 639355 645800 652580 660090 668338 677558 688505
61256 688505 701546 715801 729666 741958 752160 759895 764888 767445 768437 768587 767996 766387 763581 759675
61242 759675 754924 749573 743798 737843 732123 726938 722071 717015 711785 707089 703427 700345 697014 693333
61228 693333 690085 688074 687485 687970 689028 690349 692058 694549 697801 701057 703553 705410 707393 709948 712991
61213 712991 716546 720863 725714 730199 733632 736211 738436 740241 741128 740978 740222 739332 738577 738348 739387 742475
61197 742475 748047 756189 766907 780276 796363 815084 836091 858685 881719 903594 922654 937985
61185 937985 949914 959485 967239 972751 975515 976016 975458 974561 973046 970332 966225 960672 953358 944080 933370
61170 933370 922284 911576 901286 891002 880168 868277 855283 841871 828815 815921 802153
61159 802153 787035 771405 756468 742662 729971 718829 709858 702927 697396 693351 691798 693365 697441
61146 697441 702887 708862 714504 718383 719139 716523 711266 704046 695108 684865 674208 664020 654763 646773
61132 646773 640602 636734 635056 634872 635450 636532 638448 641926 647698 656037 666561 678583 691764 706400
61118 706400 723014 741749 762270 784216 807523 832242 858167 884800 911613 938177 964143
61107 964143 989262 1013448 1036679 1058833 1079718 1099171 1116926 1132375 1144602 1152655 1155694 1153135
61095 1153135 1145075 1132571 1117052 1099186 1078648 1055191 1029539 1002872 975734 948038 920008
61084 920008 892498 866211 841180 817302 794956 774611 756046 738497 721634 705984 692319
61073 692319 680957 671778 664551 658947 654518 650980 648382 646730 645600 644467 643323 642577 642423 642736 643630
61058 643630 645603 648951 653406 658588 664487 671335 679367 688907 700268 713165 726677 740292 754797
61045 754797 771518 790774 811580 832911 854755 877774 902358 928340 955403 983384 1012040
61034 1012040 1040747 1068773 1096042 1123426 1151930 1181616 1211726 1241787 1272065 1302856 1334073
61023 1334073 1365949 1399476 1435464 1473517 1512492 1551705 1591247 1631571 1673484 1718395 1768038
61012 1768038 1824104 1888405 1962736 2047756 2142553 2246319 2360409 2488273 2634205 2803486
61002 2803486 3003673 3244740 3538349 3898223 4341133 4886968 5559960 6393422 7433396
60993 7433396 8732861 10335703 12257239 14463881 16850850 19230989 21363039 23028895
60985 23028895 24121203 24680643 24861175 24860013 24860050 24992454 25299483 25701213 26004154 25974187
60975 25974187 25438238 24347773 22771616 20845172 18722931 16552648 14460041 12534698
60967 12534698 10823773 9339827 8075537 7013859 6131948 5404255 4806392 4316899 3916497
60958 3916497 3587714 3315834 3089202 2898310 2735273 2594189 2470999 2362618 2266633 2181853
60948 2181853 2108318 2046156 1994425 1950911 1912778 1877537 1843797 1811076 1778798 1745794 1711124
60937 1711124 1674937 1638040 1601006 1564176 1528140 1493389 1459710 1426542 1393821 1361913 1330943
60926 1330943 1300822 1271699 1243670 1216198 1188603 1161082 1134530 1109368 1085257 1061927 1039568
60915 1039568 1018327 998074 978760 960428 942809 925602 909164 894268 881036 868774 857018
60904 857018 846085 836406 827918 820335 813407 806642 799282 790991 782245 773820 766096 758943 751974 744843
60890 744843 737574 730550 723879 717088 709963 703393 698518 695065 691428 686556 680932 675438 670118 664491
60876 664491 658427 652115 645607 638792 631509 623524 614865 606368 599266 593908 589395 584804 580258 576426
60862 576426 573519 571189 568971 566442 563375 560191 557847 556907 557017 557519 558073 558423 558243 557685 557491 557980
60846 557980 558414 558045 557297 557164 557763 558256 558012 557027 555223 552100 547308 541131 534271 527454 521242 515842
60830 515842 510977 506192 501358 496767 492889 490211 489063 489309 490373 491782 493447 495095 495892 495237 493753
60815 493753 492758 492729 492865 492361 491498 491145 491504 491756 490901 488712 485905 483458 481763 480393 478659 476342 473806
60798 473806 471587 469991 468961 468066 466653 464252 460909 457060 453052 448932 444657 440322 436124 432231
60784 432231 428760 425858 423687 422243 421175 419879 417970 415647 413492 411832 410412 408696 406423 403845
60770 403845 401520 399873 398915 398399 398279 398865 400425 402909 406206 410382 415312 420328 424753 428630 432396
60755 432396 435974 438896 441332 444228 448089 452225 455582 457789 459054 459613 459839 460468 461971 463819 464846
60740 464846 464295 462206 458919 454692 449762 444412 438837 433108 427247 421281 415321 409677 404672 400268
60726 400268 396118 392171 388847 386388 384343 382109 379761 377970 377133 376883 376429 375206 373330 371557 370621
60711 370621 370427 370117 369134 368006 367825 369076 371228 373318 374737 375556 376312 377403 378638 379502 379888 380230
60695 380230 380883 381741 382631 383630 384760 385837 386968 388751 391578 395017 398278 400994 403242 405230 407383
60680 407383 410295 413981 417468 419824 421439 423693 427447 432369 437606 442495 446626 449825 452283 454313
60666 454313 455913 456840 457054 456712 455738 453789 450716 446772 442396 438060 434214 431059 428456 426342 425007
60651 425007 424612 424649 424440 424035 424089 424914 426181 427558 429003 430316 430902 430229 428232 425201 421608 418022 414726
60634 414726 411389 407555 403499 400085 397701 395826 393899 392110 391058 391015 391821 393195 394799 396227 397272
60619 397272 398150 399260 400751 402394 403852 405015 406115 407391 408554 408863 407994 406578 405450 404599 403444
60604 403444 402042 401249 401514 402256 402800 403283 404133 405130 405632 405533 405442 405968 407218 408895 410513 411575 411988 412352
60586 412352 413482 415550 417913 419903 421475 422928 424301 425422 426455 427924 429968 431899 432899 433024
60572 433024 433173 434056 435656 437810 440855 445353 451463 458954 467638 477460 488350 500296 513406 527539
60558 527539 542026 556061 569129 580661 589561 594717 595953 593998 589621 583362 576045 568771 562187
60545 562187 556313 551295 547745 546079 546063 547330 549879 553772 558880 565377 574011 585410 599450 615731
60531 615731 634199 654645 675913 696338 714935 731517 745659 756251 762255 763451 760327 753766
60519 753766 745036 735540 726086 716641 707069 697784 689312 681551 674074 667027 661089 656456 652534 648965
60505 648965 646374 645602 646546 648489 651400 656206 663703 673953 687015 703707 725088 751584 783003
60492 783003 819085 859477 903457 950303 999811 1051807 1105108 1157525 1207069 1252618 1293231
60481 1293231 1327318 1352968 1368891 1374633 1370029 1354833 1329015 1293251 1249060 1198495 1143692 1086610
60469 1086610 1029041 972663 918913 868765 822720 781022 743812 711123 682737 658068 636267
60458 636267 616633 599008 583591 570350 558808 548512 539388 531434 524346 517794 511843 506759 502499
60445 502499 498719 495179 491780 488314 484607 480924 477887 475844 474538 473426 472171 470774 469435 468324
60431 468324 467433 466716 466370 466672 467423 467898 467710 467327 467315 467368 466667 465022 463090 461509 460459 460069 460603 462003
60413 462003 463722 465257 466594 468009 469701 471648 473565 474976 475566 475424 474781 473797 472960 473277 475353 478422
60397 478422 481011 482542 483631 484943 486586 488691 491546 494847 497705 499907 502447 506229 510862 515248
60383 515248 518804 521537 523497 524925 526619 529378 533126 537083 540680 543894 546856 549566 551976 554064
60369 554064 555887 557696 559779 561996 563785 564835 565445 565998 566500 566946 567656 568773 569848 570503 571204 572796
60353 572796 575452 578708 582402 586948 592671 599406 606850 614834 623128 631435 639748 648420 657563 666476
60339 666476 673812 678311 679514 677875 674192 668923 662191 654424 646552 639218 632122 624526 616313 608111
60325 608111 600518 593639 587424 581977 577385 573502 570103 567060 564263 561588 559107 557159 555981 555333
60311 555333 554798 554546 555571 558865 564404 571265 578799 587371 597806 610525 625632 643461 664410
60298 664410 688190 713690 739521 764222 786024 803039 813982 818361 815975 806807 791542 771729
60286 771729 749174 725609 702916 682861 666066 651745 638923 627544 618017 610122 602951 595722
60274 595722 588233 580693 573429 566606 560009 553324 546714 540744 535603 530962 526825 523852 522350 521530
60260 521530 520371 518762 517206 515834 514411 512950 511610 510177 508342 506349 504768 503777 503261 503427 504634
60245 504634 506685 508854 510594 511749 512252 512182 511994 512068 512111 511607 510806 510634 511606 513427 515635 518021 520383
60228 520383 522506 524578 527154 530556 534685 539425 544693 550123 555262 560115 564938 569500 573279 576568
60214 576568 580595 586125 592585 599057 605647 613284 622403 632386 642265 651590 660601 669796 679371 688964
60200 688964 697909 705696 712200 717567 722064 725958 729363 732199 734345 735638 735641 733878 730659 727242 724542
60185 724542 721945 718048 712409 705828 699005 691834 684175 676479 669234 662444 656031 650150 644743 639402
60171 639402 634165 629907 627308 625869 624550 623115 622172 622035 622203 622023 621357 620464 619604 618870 618146 617111
60155 617111 615495 613487 611761 610993 611399 612759 614724 616932 618910 620190 620784 621440 623045 625649 628400
60140 628400 630654 632862 635975 640279 645297 650670 656538 662980 669681 676397 683344 690820 698632 706085
60126 706085 712418 717214 720674 723467 726046 728163 729378 730036 731208 733555 736691 739810 742502 744831
60112 744831 747031 749348 751676 753223 753096 751507 749760 748587 747127 744151 739715 734780 729658 723879
60098 723879 717495 711487 706600 702535 698624 694695 690949 687602 685066 683955 684341 685330 686009 686574 687951
60083 687951 690402 693186 695623 697805 699985 701896 703126 703754 704021 703545 701485 697471 691910 685363 678041
60068 678041 670031 661524 652624 643380 634249 626089 619375 613703 608371 603154 598159 593359 588765 584784
60054 584784 581758 579293 576690 574074 572492 572725 574476 576947 579778 583171 587403 592512 598280 604292
60040 604292 610143 615783 621580 627941 634851 641734 647703 652062 654798 656456 657326 656895 654419 649923 644245
60025 644245 638172 631977 625712 619370 612677 605290 597478 590081 583474 577027 569988 562529 555418 548919
60011 548919 542591 536155 530022 524789 520527 516833 513476 510762 509156 508578 508264 507452 506119 504901 504335
59996 504335 504464 505106 506154 507464 508797 510155 511989 514824 518703 523197 527917 532839 538172 543965 549832
59981 549832 554971 558552 560224 560282 559305 557601 555013 551277 546536 541426 536591 532201 528100 524363 521419
59966 521419 519507 518320 517388 516625 516279 516518 517304 518524 520050 521744 523567 525461 527056 527877 528067 528435
59950 528435 529386 530283 530418 530213 530686 531960 533166 533737 534010 534455 535101 535887 536775 537252 536428 534079 531128
59933 531128 528773 527570 527530 528544 530287 532239 534175 536362 539071 542281 546061 550657 555979 561624 567737
59918 567737 575155 584140 593582 602213 610095 618093 626182 633240 638486 642247 645054 646700 646679 645114 642768
59903 642768 640174 637144 633295 628876 624811 621808 619606 617370 614703 611928 609452 607360 605790 605275
59889 605275 606384 609240 613572 618926 624658 630114 635116 640075 645360 650836 656209 661507 666931 672564
59875 672564 678506 685014 692078 699082 705176 709821 712712 713500 712055 708848 704655 699967 694925 689724
59861 689724 684747 680371 676783 673730 670299 665329 658482 650719 643398 637148 631999 628195 626165 625741
59847 625741 626160 627014 628795 632308 637895 645397 654495 664808 675768 686613 696499 704666 710635 714355
59833 714355 716164 716738 717166 718760 722317 727347 732302 735730 737178 736874 734754 730165 722636 712772 702059
59818 702059 691861 682808 675164 669253 665177 662442 660369 658663 657145 655151 651933 647669 643319 639311
59804 639311 635078 630204 625289 621115 617540 613878 610021 606466 603396 600434 597332 594317 591598 588934
59790 588934 585923 582531 579205 576556 575009 574626 575065 575631 575495 574240 572405 571224 571396 572286 572749 572590
59774 572590 572630 573451 574832 576574 579014 582318 585920 589185 592157 595147 598022 600437 602440 604321 606092
59759 606092 607602 608981 610574 612598 615143 618261 621809 625470 629193 633258 637735 642331 647020 652178
59745 652178 657686 662555 666090 668865 671807 674773 676863 677841 678374 679005 679677 680272 680854 681331 681445 681235
59729 681235 681057 681116 681293 681352 680965 679794 678027 676629 676473 677290 677988 677952 677567 677568 678349 679818 681458 682599
59711 682599 683046 683347 684133 685473 687285 689943 693734 697968 701461 703907 706137 709024 712781 717292 722382
59696 722382 727601 732357 736479 740268 743919 747322 750432 753323 755785 757334 757663 756817 755007 752647 750394
59681 750394 748634 747034 745043 742610 739851 736321 731443 725528 719496 713546 706947 699306 691218 683482
59667 683482 676374 670021 664795 660889 657922 655296 652703 650266 648490 647981 648757 650040 651332 653432 657520
59652 657520 663328 669255 674356 679104 683946 688329 691674 694184 695869 695712 692798 687709 681860 675911
59638 675911 669635 662953 656193 649527 643027 637110 632195 627981 623835 619893 617005 615416 614185 612243
59624 612243 609545 606771 604202 601343 597578 592881 587866 583268 579373 575802 571820 567033 561921 557630
59610 557630 555048 554128 554238 555013 556489 558531 560742 563090 566008 569447 572454 574304 575492 576825 577923
59595 577923 577634 575858 573930 573071 573316 574177 575429 576821 577826 578222 578415 578682 578602 577703 576248 574867 573705
59578 573705 572379 570541 568138 565358 562554 559978 557383 554247 550608 547225 544609 542388 540027 537756
59564 537756 536139 535106 534088 533019 532493 532797 533319 533208 532317 531233 530592 530595 531123 532027 533187 534477 535923
59547 535923 537842 540515 543694 546748 549480 552444 556214 560734 565815 571961 580169 591152 605291 623081
59533 623081 644687 668830 692684 713231 728593 738310 743037 744120 742891 740061 736085 732048 729537
59520 729537 729367 730859 732616 733610 733419 731886 728933 724479 718383 710586 701275 690611 678445 664789
59506 664789 650484 636821 624520 613603 604178 596576 590562 585228 580019 575300 571593 568799 566540
59493 566540 564801 563872 563939 564899 566295 567391 567722 567614 567669 567861 567759 567635 568498 570840 574131 577756 581658
59476 581658 585831 589971 594049 598472 603305 608050 612519 617077 621622 625245 627507 629181 631047 632780
59462 632780 633808 634542 635785 637448 638907 640360 642910 647391 653762 661497 669961 678543 686958 695324
59448 695324 703637 711459 718460 724795 730472 734769 736838 736471 733784 728666 721162 712026 702182 692012
59434 692012 681845 672692 665578 660286 655581 650730 646164 642693 640694 640112 640743 642433 645409 650423
59420 650423 658163 668481 680450 693170 706330 720158 735107 751487 769256 788333 809100 832097
59408 832097 856848 881237 902246 917056 923554 920791 909694 893062 874371 856609 842130 832787
59396 832787 829633 832717 841130 852457 862196 865247 859132 845327 826940 805975 783509 761255 741319
59383 741319 724718 711283 700785 693152 687897 684399 682668 682989 684986 687891 691502 696051 701349 706929
59369 706929 712774 719038 725253 730752 735691 740743 746009 751180 756542 762671 769213 775141 780364 785971
59355 785971 792685 800110 807824 816261 826014 836933 848363 859862 871504 883920 898041 914178
59343 914178 931321 947889 963151 977321 990408 1001813 1011041 1017978 1022301 1023447 1021330 1016428 1008986
59330 1008986 998849 986229 972000 957080 942086 927529 913559 899515 884714 869876 856819
59319 856819 846385 837567 829105 821068 814304 809143 805342 802676 800738 798522 795014 790229 785138 780554
59305 780554 776437 772321 768117 764282 761209 758589 755789 752965 751395 752349 755998 761922 770218 781225
59291 781225 794299 807657 819479 828417 833094 832172 825437 814230 800413 785303 769833 755149
59279 755149 742541 732951 726735 723738 723572 725993 730951 738087 746589 755968 766637 779036 792425
59266 792425 805360 817208 828347 838869 848012 854971 859425 860983 858991 853319 844809 834602 823428
59253 823428 811700 799781 788032 776979 767414 759768 753469 747605 742126 737666 734340 731754 730216
59240 730216 730770 733760 738338 743779 750185 757474 764708 771115 776892 782378 787277 791405 795293 799121
59226 799121 801684 801490 798538 794196 789522 784514 778822 772534 766240 760774 756821 754384 752703 750891
59212 750891 748527 745575 742213 739000 736670 735289 733940 731655 728373 724714 721175 717928 715019 712321
59198 712321 709592 706945 704992 704143 704054 704054 703846 703508 703172 703113 703760 705203 706931 708472 710076 712383 715610
59181 715610 719435 723498 727658 731828 735924 739932 743853 747668 751476 755531 760038 765066 770742 777259
59167 777259 784608 792571 801162 810818 821879 833935 845787 856056 863933 869498 873195 874953 874068
59154 874068 870189 863934 856065 846501 834862 821690 808216 795024 781859 768781 756599 745850
59142 745850 736135 726745 717299 707595 697572 687709 678800 671081 664137 657797 652414 648050 644178 640463
59128 640463 637183 634620 632766 631828 632158 633448 634883 636512 639506 644545 650914 657828 665765 675687 687624
59113 687624 700863 714949 729672 744520 758899 772624 785678 797893 809388 820826 832591
59102 832591 844060 854191 862437 868658 872657 874404 874314 872800 869966 866134 862097 858296 854333 849924
59088 849924 845833 843155 842038 841699 841287 840115 837483 833041 827122 820186 812222 803130 793287 783203
59074 783203 772976 762601 752434 742887 734046 726041 719258 713637 708282 702443 696466 691160 686685
59061 686685 682691 679048 675697 672185 668100 663658 659172 654316 648703 642905 638077 634693 632326 630518
59047 630518 629159 628123 627178 626282 625548 624999 624671 624668 624810 624594 623942 623546 623970 624797 625191 624986 624772 625349 627545
59028 627545 631985 638405 645705 653322 662050 672856 685567 699524 714832 731791 749521 766325
59016 766325 781315 794619 806139 815177 821344 824897 826034 824750 821578 817735 814235 811334 808956
59003 808956 807150 806067 805976 807325 810386 814876 820347 826754 834106 841688 848192 852643 854809 854904 853322
58988 853322 850535 846805 842087 836414 830029 822872 814536 805254 796346 788939 782814 777331 772996 771071
58974 771071 771879 774495 778059 782492 788009 794829 803398 814058 826393 839591 853445 868299 883970
58961 883970 899460 913799 926560 937495 946272 952673 956550 957572 955474 950411 942615 931942 918425
58948 918425 902963 886699 869864 852129 834090 817468 803565 792129 781944 772060 762420 753871
58936 753871 747653 744364 743320 743276 743631 744375 745044 744543 742210 738502 734387 730407 726371 721694 716022 709750
58920 709750 703846 698954 694975 691710 689400 688155 687373 686402 685419 684998 685160 685557 686260 687615 689589 692050
58904 692050 695502 700768 708069 717023 727322 738775 751046 764145 778848 795690 813794 831614
58892 831614 848687 865726 883178 900787 918613 937487 958100 980314 1003453 1026633 1048755
58881 1048755 1068815 1086284 1100790 1111640 1118325 1121166 1120723 1116742 1108553 1096350 1081247 1064203
58869 1064203 1045692 1026314 1006850 987803 969626 953126 938768 925833 913302 901380 891085
58858 891085 882419 874086 865026 855181 844758 833890 823227 813714 805454 797677 790018 782923 776577
58845 776577 770354 763628 756366 748706 740673 732485 724424 716357 708057 699914 692512 685585 678348 670911
58831 670911 664398 659573 656228 653894 652173 650339 647753 644909 643137 643064 644174 645853 647863 649817 651368
58816 651368 653105 656094 660261 664321 667607 670858 674770 678806 681944 683736 684276 683948 683592 684089 685344
58801 685344 686228 685737 683678 680373 676537 673273 671148 669243 666134 661715 656967 652196 646983 641872 638403
58786 638403 637059 636724 636691 637765 640742 645157 650225 655825 661843 667668 673022 678243 683231 687210 689975
58771 689975 692088 693228 691747 686759 679467 671627 663847 656248 649519 644144 639507 634864 630480 626971
58757 626971 624349 622549 622040 622983 624546 625902 627171 628587 629590 629687 629515 630082 631603 633882 637210 641942
58741 641942 647697 653814 660189 667013 674208 681696 689680 698060 706208 713904 721869 730858 740716 750799
58727 750799 760551 769288 776236 781344 785253 788011 788806 787508 785421 783798 782638 781759 781987 784198 787998
58712 787998 792345 796798 801230 805027 807577 809038 809763 809463 807656 804306 799269 791789 781393 768783
58698 768783 754999 740215 724039 706543 688398 670529 654112 640196 628722 618589 609171 600985
58686 600985 594397 588668 583002 577543 572542 567445 561722 555793 550283 545157 540402 536727 534640 533551
58672 533551 532655 532013 532073 532985 535171 539566 546354 554445 563205 573716 587139 602612 617944 631647
58658 631647 643094 651432 655781 656230 653646 648788 642350 635183 627581 618987 609298 599734 591479 584250
58644 584250 577277 570941 566279 563440 561741 560714 560096 559420 558619 558424 559298 560750 562691 566434 572970
58629 572970 580974 587970 592898 596200 597953 597517 594838 590743 585989 581115 577051 574820 574677 576327 579719
58614 579719 584911 591619 599667 609311 620305 631261 640813 648838 655664 660855 663884 665293 666013 666075
58600 666075 665095 663543 662366 661745 661117 659990 657947 654551 650187 646319 643991 642788 642163 642786 645516
58585 645516 650021 655741 663342 673750 686420 699878 713399 726850 739612 751008 761250 770743
58573 770743 779152 786364 793514 801690 810415 818849 827723 838604 852055 868134 887912 912647 941936
58560 941936 974304 1009094 1046055 1083498 1118615 1149459 1175274 1195370 1209291 1217714 1221694 1221339
58548 1221339 1216604 1208869 1200171 1191296 1182020 1172583 1163291 1153130 1140415 1124447 1105210 1082238 1055456
58535 1055456 1026483 997301 968242 939046 911055 886220 864473 844333 825785 810388 798706
58524 798706 789728 782748 777768 774089 770606 767574 766164 766188 766112 765334 764555 763854 762302 759712 757052 754906
58508 754906 753023 751338 749849 747599 743526 738345 733997 731344 729907 729487 730221 731304 731524 730958 730473
58493 730473 729943 728833 728060 729165 731969 735209 739141 745123 752924 761031 769683 781031 796013 813489
58479 813489 832763 854496 878621 903609 928343 952574 975065 993459 1006544 1014706 1017811 1014818
58467 1014818 1005949 993106 977641 959807 940944 923882 910355 899853 891696 886445 884703 886332
58455 886332 891427 900370 912500 926321 941197 957028 972267 984282 991850 995320 994380 988049 977061
58442 977061 963778 949348 933302 916271 900558 887420 876170 866569 859721 855966 854221 854077 856267
58429 856267 860526 865347 870551 877748 887631 899169 911959 926835 943324 959001 972129 982712
58417 982712 990352 993750 993061 990172 985778 978691 968771 957832 946775 934581 921160 908384 897163
58404 897163 886212 874964 865039 857601 851895 847570 845715 846173 846629 845975 846054 848486 852266 856049 860319
58389 860319 865519 870337 873625 876012 878161 879447 879669 879968 880805 881152 880734 880791 881604 881783 881109 881509 884052
58372 884052 887644 891807 897907 906344 915415 924359 934640 946860 959419 971714 985491 1001361 1017223
58359 1017223 1031997 1047709 1065717 1083845 1099405 1112166 1122334 1128714 1131258 1132546 1134385 1135587
58347 1135587 1135214 1135062 1136611 1138436 1139230 1140653 1144695 1150799 1157942 1166944 1178366 1190773 1203401 1217859
58333 1217859 1235017 1253025 1270593 1289146 1309311 1328427 1344179 1357683 1370256 1380242 1385914 1388674
58321 1388674 1390532 1391188 1390288 1389612 1390315 1390963 1390939 1392699 1397910 1404611 1411034 1418820 1429473 1441113 1451977
58306 1451977 1463686 1477715 1492139 1505387 1519690 1537014 1555011 1570798 1585495 1601121 1616372
58295 1616372 1629534 1642417 1657237 1672605 1686652 1701175 1718690 1738289 1758268 1779726 1803723
58284 1803723 1828119 1851219 1875218 1902209 1930383 1958190 1988351 2023310 2060525 2096951 2134378
58273 2134378 2175678 2219528 2263647 2309328 2357838 2406378 2452703 2499724 2550402 2602447 2653493
58262 2653493 2706933 2766622 2830180 2893640 2958321 3026695 3095856 3161816 3226097 3291441 3355437
58251 3355437 3415386 3475059 3539410 3607038 3675181 3747413 3828460 3916000 4005795 4100398 4204341
58240 4204341 4315321 4429038 4548344 4678523 4817958 4962613 5115322 5281120 5458006
58231 5458006 5642108 5837309 6049665 6277187 6515523 6768669 7043252 7337716 7648546
58222 7648546 7981530 8344792 8736712 9153577 9603069 10096701 10635311 11216519 11849916
58213 11849916 12549613 13318850 14158660 15084988 16120228 17275804 18562209 20008548 21652641
58204 21652641 23521718 25646515 28086710 30920377 34222351 38085396 42657686 48135932
58196 48135932 54742629 62754788 72551616 84608124 99483158 117890205 140755897
58189 140755897 169060157 203443338 243757531 288636851 335091252 378446054 413174975
58182 413174975 434603557 440504904 431511500 410298753 380438009 345643333 309360786
58175 309360786 274375183 242451972 214261984 189641669 168001926 148697531 131260140
58168 131260140 115449804 101165196 88345657 76949787 66956351 58320481 50930586
58161 50930586 44632549 39282560 34754784 30919920 27653370 24861166 22474443 20425006
58153 20425006 18647813 17099680 15752586 14572093 13520702 12576854 11731371 10968524
58145 10968524 10267709 9620091 9026794 8482986 7978565 7511700 7086754 6700646 6344511
58136 6344511 6016650 5720991 5454669 5209193 4981797 4773874 4580234 4391603 4206383
58127 4206383 4029275 3860052 3694276 3533370 3383263 3244153 3111428 2985400 2870394
58118 2870394 2765315 2664711 2568255 2480105 2399814 2322820 2249001 2181971 2120626 2060079 2000324
58107 2000324 1945514 1895167 1844407 1792637 1743763 1697939 1651092 1602764 1556774 1513857 1471012
58096 1471012 1428382 1389599 1354958 1321225 1288570 1260880 1238671 1218306 1198746 1182658 1170212
58085 1170212 1158093 1145378 1134392 1124990 1113831 1100032 1085940 1071648 1054261 1033341 1011744
58074 1011744 990406 967452 943079 920129 899118 877650 855380 834707 816041 797261 778442
58063 778442 762272 749229 737005 725231 716031 709285 702053 693424 685467 678739 671244 662420 653821
58050 653821 645373 635366 624669 616436 611016 605524 599070 593897 590609 586802 581413 576183 571753 566474
58036 566474 560158 555020 551788 548596 544574 540802 536937 530780 522096 513138 504633 494972 484055 474014
58022 474014 465289 455897 445535 436558 429928 423995 418275 414566 413187 411877 409574 407653 406348 403773
58008 403773 399684 396477 395113 393704 391520 390632 392024 393674 394234 395246 397974 401253 404182 407842 412596
57993 412596 416562 418365 418679 417774 414558 409469 405237 403206 401729 399548 397679 396542 394412 390451 386276
57978 386276 382805 378516 372692 367397 364180 361559 357877 354125 351856 350648 349657 349452 350324 350885 350220
57963 350220 349472 349598 349619 348723 347999 348339 348628 347675 346069 344577 342700 340238 338343 337545 336700 335246 334385
57946 334385 334686 334720 333625 332818 333637 335421 337493 340799 345916 351678 357535 365133 375627 387564 399353
57931 399353 411752 425781 440111 452725 463557 473288 481113 485855 487992 488573 487292 483551 478198
57918 478198 472393 465861 458001 449635 442035 435195 428545 422313 416784 411322 405530 400341 396760 394555
57904 394555 393126 392307 391303 388474 383424 377867 373226 368889 363943 358935 354569 350340 345936 342442
57890 342442 340730 340144 340051 341078 343511 346257 348782 352231 357044 361427 363951 365813 368550 371262 372176
57875 372176 371429 370194 368481 365927 363425 361884 360579 358742 357493 358149 359850 361021 362024 364156 367035
57860 367035 369258 370864 372974 375669 378251 380967 384536 388606 392433 396373 400931 405175 407984 410056
57846 410056 412719 415489 416765 416229 414560 411449 406077 399116 392174 385516 378260 370544 363534 357494
57832 357494 351717 346297 342169 339357 336830 334245 332339 331476 331098 330781 330830 331751 333894 337317 341312 344583
57816 344583 346631 348248 349942 350947 350728 350171 349996 349315 347328 345156 344075 342937 339451 333286 325969
57801 325969 318420 310714 303740 298865 295941 293530 291034 289031 287719 286735 286302 286977 288472 290207 292672
57786 292672 296627 301392 305654 309560 314199 319360 323803 327597 332161 337918 343839 349436 355353 361747
57772 361747 367837 373365 378822 383914 387377 388674 388335 386414 382241 376099 369502 363184 356216 347781
57758 347781 338593 329921 322307 315834 310657 306650 303281 300288 297878 296089 294691 293783 293715 294350 295118
57743 295118 295758 296236 296142 295158 294019 294001 295457 297649 299862 301710 302602 302016 300338 298519 297054 296102 296206
57726 296206 297734 299889 301418 302134 302629 302813 302050 300477 298825 297059 294552 291500 288744 286237 283168
57711 283168 279639 276708 274489 271723 267702 263320 259690 256762 253813 250415 246533 242379 238456 235123
57697 235123 232091 228981 226159 224243 223048 221980 221112 220806 220609 219780 218698 218454 219211 220250 221365 222824
57681 222824 224159 224664 225120 227364 231888 237389 243066 249907 259309 271841 287922 308604 335170 368879
57667 368879 411297 463849 526757 598975 678348 760000 834759 891625 923198 928164 908938 869037
57655 869037 813324 748476 681200 616302 556820 504704 460383 422730 390501 363385 341239
57644 341239 323192 308162 295570 285121 276565 269941 265257 261637 257709 253084 248566 244742 241384
57631 241384 238434 236359 235161 234163 233169 232725 232854 232648 231591 230166 228786 227206 225407 223867 222450
57616 222450 220317 217492 215307 214547 214303 213343 211607 209632 207644 205928 205085 205055 204791 203709 202654 202739
57600 202739 203991 205744 207533 208896 209204 208352 206986 205506 203618 201219 198736 196127 192610 188006 183270
57585 183270 179112 175189 171386 168684 167787 167827 167413 166188 164547 162700 160869 159604 158975 158164 156625 154899
57569 154899 153574 152307 150665 148966 147371 145117 141737 138218 135825 134404 132968 131340 130064 129184
57555 129184 128253 127292 126709 126496 126366 126446 127107 128348 129984 132119 134851 137817 140557 142905 144601 145146
57539 145146 144617 143979 143996 144439 144931 145749 147026 148007 148124 148120 149080 150842 152380 153265 153708 153609 152689 151328 150204
57520 150204 149222 147840 146403 146148 147660 150097 152190 153534 154719 156529 159196 162343 165612 169187 173304
57505 173304 177369 180277 181753 182695 183917 185302 186475 187437 188076 187906 186899 185792 184921 183556 181130
57490 181130 178366 176407 175447 175011 174916 175130 175220 174789 174026 173174 172040 170698 169952 170264 170880 170943 170857 171511 172631
57471 172631 172976 171832 169421 166150 162387 158705 155469 152302 148712 144995 141848 139429 137537 136411
57457 136411 136482 137502 138595 139079 138795 137965 137225 137359 138457 139739 140596 141230 141794 141793 141073 140548 140990 141826
57439 141826 142128 142120 142538 143129 143072 142534 142523 143365 144472 145492 146610 147687 148098 147531 146327 145048 144281 144509
57421 144509 145540 146421 146546 146351 146280 145825 144577 143460 143622 144676 145454 146100 147815 150602 152885 153655 153703
57404 153703 154287 155690 157492 159335 160885 161696 161543 160579 159144 157818 157434 158366 159956 161283 162273 163381
57388 163381 164493 165063 165144 165358 165988 167013 168915 172444 177402 182547 186812 190026 192459 194392 196040
57373 196040 197247 197341 195989 193928 192093 190312 187791 184683 182107 180632 179705 178682 177525 176381 175198
57358 175198 173917 172488 170759 168877 167466 166828 166391 165716 165479 166441 168020 169123 169978 171724 174400 176834
57342 176834 178522 180085 181740 182764 182899 182975 183591 184241 184288 183866 183395 182954 182514 182130 181680 181072 180730 181139
57324 181139 181970 182507 182787 183297 183665 182994 181499 180481 180421 180393 179724 178991 178924 179460 180360 181707 183270 184422
57306 184422 185181 186367 188307 190364 192098 193805 195466 196378 196574 197459 200161 204030 207604 210338 212632
57291 212632 214813 216866 218706 220136 220956 221570 222949 225600 229082 232798 236668 240756 244961 249407 254406
57276 254406 259742 264761 269457 274620 280553 286503 291780 296531 300967 304746 307624 309879 311514 311932
57262 311932 311000 309591 308432 307262 305766 304471 303878 303478 302529 301292 300747 301488 303523 306620 310155 313126
57246 313126 315055 316560 318506 320966 323503 326023 328815 332109 336092 340967 346612 352591 358742 365262
57232 365262 371962 378136 383559 388863 394457 399763 404187 408211 412805 418228 424028 429955 436304 443541
57218 443541 451924 461239 470804 480096 489405 499326 509617 519343 528297 537375 547304 557854 568626
57205 568626 579711 591187 602820 614693 627267 640406 653251 665468 677674 690200 702547
57194 702547 714676 727704 742450 758265 774138 790094 806573 823276 839663 855972 872774
57183 872774 890013 907253 924322 940988 956617 970997 985003 999736 1015422 1031723 1048425
57172 1048425 1065290 1081954 1098774 1117028 1137508 1159516 1181938 1204484 1227105 1249035 1269461
57161 1269461 1288626 1307299 1325638 1343409 1360823 1378349 1396131 1414212 1432772 1451565 1469821
57150 1469821 1487397 1505211 1523803 1542352 1559996 1577343 1595675 1615445 1636558 1659324 1683974
57139 1683974 1709827 1735967 1762243 1788620 1814274 1838406 1861464 1884484 1907751 1931074 1954861
57128 1954861 1979887 2006472 2034805 2065542 2099148 2135200 2173231 2213710 2257510 2305145 2357236
57117 2357236 2414753 2477917 2545971 2619221 2700270 2792160 2896315 3013513 3145624 3294926
57107 3294926 3462901 3651515 3865131 4109983 4393006 4722949 5111910 5574710 6128490
57098 6128490 6795180 7603718 8588636 9788089 11244755 13005718 15116944 17616183 20529627
57089 20529627 23869326 27627260 31770808 36244138 40969381 45844215 50748764 55568388
57081 55568388 60204389 64537651 68364918 71382429 73264128 73791076 72939165 70873839
57073 70873839 67874574 64243405 60236791 56035855 51752867 47457797 43203839 39041154
57065 39041154 35021615 31198857 27623468 24335020 21357049 18697961 16354183 14311971
57057 14311971 12549026 11037439 9746573 8644797 7701626 6890867 6192412 5591134 5074578
57048 5074578 4631629 4252106 3926434 3645572 3401389 3187028 2997059 2827660 2676548
57039 2676548 2542205 2423001 2317097 2222727 2137997 2060649 1988615 1920776 1856842 1796757 1740734
57028 1740734 1689518 1643926 1604262 1570903 1545445 1530697 1529521 1544065 1575744 1624583 1687309
57017 1687309 1755686 1817046 1857478 1866250 1839057 1778399 1691502 1587731 1476672 1366539 1262861
57006 1262861 1168335 1084041 1010551 947842 894903 850055 811604 778058 748179 721217 696844
56995 696844 674655 654091 635038 617984 603273 590632 579726 570725 564002 559796 558551 561082
56983 561082 567810 577978 589820 601041 608979 611040 605770 593504 575839 554833 532684 511291
56971 511291 491457 472918 455499 439786 426413 415430 406872 401237 398795 399078 401858 408111 419202
56958 419202 435387 455675 478598 502188 523517 539251 546942 545524 534985 516335 491740 463933
56946 463933 435237 407305 381439 358598 339172 323319 311492 304244 301586 302893 307489 315256
56934 315256 326876 343635 366644 395988 430599 468573 506758 540087 562679 570720 564160 545459
56922 545459 517515 483285 446211 409521 375111 343722 315788 291367 269750 250216 233058
56911 233058 219072 208244 199723 192910 187669 183588 180044 177090 175461 175430 176294 177222 178075 179215 181005
56896 181005 183685 187405 192126 197695 204096 211523 220349 231208 244828 261427 280407 300815 321756
56883 321756 342011 359665 372672 379674 380024 373541 360949 344288 326136 308395 292165 278411
56871 278411 268001 261178 257723 257741 261838 270565 284199 303108 327925 359389 398290 445271 499911
56858 499911 559602 619349 672735 713462 737113 742537 731650 707644 673643 633107 590486 550165
56846 550165 514757 485131 461837 445667 436971 435552 441630 456317 480958 516543 563893 623834
56834 623834 696752 781849 876155 973250 1062993 1133903 1177227 1189491 1171967 1128753 1065595
56823 1065595 989387 907364 826010 750353 683738 627798 582673 547554 521393 503514 494061
56812 494061 494096 505106 528202 563631 610823 668496 734195 803303 868553 921286 954244 963791
56800 963791 949898 914869 862841 799886 732880 667253 606077 551184 504093 465374 434190
56789 434190 409404 390759 378500 372604 373070 380336 394606 415250 441484 472804 507612 541894
56777 541894 570360 588923 595542 589499 571317 543312 508928 471119 431893 393210 357236 325440
56765 325440 298083 274691 254518 236709 220816 207158 196087 187009 178885 171589 165905 162110
56753 162110 159375 156791 154234 151980 150023 148071 145845 143206 140299 137601 135535 134058 132876 131833
56739 131833 130837 129724 128586 127851 127632 127389 126738 125997 125443 124682 123550 122883 123357 124185 124169 123572 123719 125021
56721 125021 126796 128784 131430 134625 137604 140258 143234 146473 148942 150130 150668 151115 151347 151515 152402
56706 152402 154293 156545 158838 161770 165596 169325 171853 173243 174284 175447 176803 178330 179764 180733
56692 180733 181412 182428 183830 184923 185417 185887 186717 187489 187850 188076 188227 187724 186456 185381 185261 185639 185906
56675 185906 186533 188183 190270 191587 192065 192754 194183 195707 196593 196959 197440 198491 200195 202336 204476 206159
56659 206159 207209 207871 208724 210426 213205 216581 219880 223043 226525 230315 233639 235813 236955 237585 237957
56644 237957 238047 237822 237279 236438 235485 234651 233932 233246 232714 232281 231153 228343 223883 218795 213752 208482 202637
56627 202637 196456 190295 184161 178124 172555 167642 163193 159174 155886 153359 151185 149144 147368 145717
56613 145717 143770 141655 140142 139661 139973 141021 143125 145895 147961 148410 147755 146945 146208 145487 145192 145730
56597 145730 146836 147958 148785 148934 147929 146120 144892 145214 146604 148192 150018 152394 154761 156267 157081
56582 157081 158059 159426 160749 162000 163655 165844 168190 170507 172852 174875 175821 175409 174304 173604 174062
56567 174062 175714 178012 180431 183093 186578 191094 196343 202405 210123 220222 232578 246719 262337
56554 262337 278617 293642 305335 312850 316579 317166 315164 311394 306883 302397 298293 294682 291426 288250
56540 288250 285069 281928 278497 274230 269301 264718 261048 257717 254064 250368 247131 244008 240345 236306
56526 236306 232548 229119 225642 222431 220474 220155 220726 221200 221256 221095 220851 220314 219090 217039 214591 212452
56510 212452 210865 209377 207409 204768 201543 198017 194868 192915 192299 192311 192244 192010 191828 191995 193128 195831
56494 195831 199590 202722 203986 203761 203235 203029 203114 203470 204179 205271 206935 209392 212161 214065 214486 214102
56478 214102 213896 214038 214224 214446 214766 214860 214412 213604 212779 212084 211805 212475 214162 216210 218048 219653 220968
56461 220968 221718 222138 222908 223885 223953 222717 221257 220506 219962 218945 218047 218251 219491 221108 222901 224735 226005
56444 226005 226608 227570 229562 231638 232674 233218 234494 236277 237261 237084 236554 236167 235731 235167 234531 233520 232051
56427 232051 230943 230912 231330 231112 230371 229991 230008 229746 229187 228886 228790 228390 227819 227629 227759 227808 227942 228400 228489 227416
56407 227416 225718 224634 224465 224817 225866 227918 230212 231887 233734 237220 241945 245961 248541 250722 253018
56392 253018 254626 255366 256544 259039 262026 264339 265846 266776 266857 265884 264170 261894 258846 255313 252305
56377 252305 250423 249274 248405 248057 248667 250321 252937 256331 259971 263330 266553 270051 273525 276224 278131
56362 278131 279945 281892 283454 284263 284416 283955 282950 282011 281747 281814 281442 280776 280666 281349 282398 283784 285750
56345 285750 287724 288685 288678 288759 289369 289919 290078 290321 291092 292413 294308 296661 298789 300258 301888 304754 308507
56328 308507 311984 315178 319026 323449 327320 330438 333824 337851 341652 344646 347151 349219 350304 350374 349897
56313 349897 348626 345966 342730 340790 340547 340459 339597 339018 339910 341887 343935 345782 347629 349646 352328 356278
56297 356278 361123 365610 369183 372478 376136 380224 384851 390052 395021 398861 402169 406374 411461 415997
56283 415997 419543 423260 427885 432901 438070 443941 450354 456260 461553 467335 473922 480421 486750 494058
56269 494058 502512 510767 518452 527169 538084 550477 563626 578127 594204 610701 627130 645057
56257 645057 666152 690535 718187 750231 787277 828203 872219 920906 976694 1040491 1112073
56246 1112073 1191500 1278651 1372454 1471865 1576664 1686195 1798461 1911572 2024887 2137485
56236 2137485 2246567 2348442 2440059 2518692 2581488 2626547 2653480 2662112 2652019 2624239 2581813
56225 2581813 2527329 2461298 2384200 2298727 2208560 2116077 2022553 1929414 1837809 1747925 1660012
56214 1660012 1575352 1495244 1419914 1349236 1283418 1222202 1164669 1110662 1061071 1015913 973663
56203 973663 933394 896033 862548 832490 805315 781350 760303 740633 721674 704685 690538
56192 690538 678145 666521 656454 648553 641562 634346 627875 623366 620049 616567 613099 610329 607770
56179 607770 604947 602847 602448 603106 603988 605608 608370 611166 613116 615121 618002 620909 623309 626613 631744
56164 631744 637009 640740 644281 649865 657076 664070 670891 678878 687939 697113 706906 718532 731604 744999
56150 744999 759287 776048 795557 817348 842251 871629 905327 942554 984298 1033046 1090845
56139 1090845 1159312 1240457 1335561 1444021 1564805 1697613 1840625 1988372 2133818 2271570
56129 2271570 2397798 2509417 2606027 2691170 2768909 2840098 2903684 2959387 3006262 3040637 3059092
56118 3059092 3062691 3055459 3039767 3015861 2984288 2945079 2895123 2829559 2745696 2643486 2523567
56107 2523567 2388098 2242919 2095873 1953005 1818190 1694927 1585551 1489583 1405693 1334485
56097 1334485 1276848 1230784 1192829 1161561 1136934 1117437 1101109 1088283 1080106 1075178 1070806 1066689
56085 1066689 1064296 1063576 1063470 1064697 1068720 1074723 1080729 1086837 1094246 1102198 1109113 1115708 1123709 1132646
56071 1132646 1141269 1150849 1163448 1178106 1192453 1206850 1223137 1240493 1256618 1271898 1288314 1305238
56059 1305238 1320519 1334775 1350253 1366320 1380408 1392624 1405089 1417637 1428694 1439586 1453238
56048 1453238 1469208 1484654 1499593 1516499 1535347 1554010 1573117 1595522 1621220 1647624 1674582
56037 1674582 1704270 1736508 1769087 1802385 1838634 1876984 1914323 1950615 1988364 2027351 2065217
56026 2065217 2102795 2143321 2186635 2229576 2271661 2315009 2359356 2403030 2448183 2498875 2554434
56015 2554434 2610853 2668155 2730028 2796781 2865445 2936369 3012799 3094193 3176963 3261469 3351276
56004 3351276 3446006 3542272 3641042 3746375 3857590 3970915 4088201 4215362 4352665 4495503
55994 4495503 4644255 4804044 4975235 5154088 5342390 5546084 5764723 5993224 6233808
55985 6233808 6494598 6776471 7073735 7388154 7729314 8100445 8497519 8923465 9389133
55976 9389133 9898995 10450736 11050501 11712927 12444521 13243806 14120221 15095620 16185338
55967 16185338 17397310 18753011 20289495 22038558 24027215 26303818 28941775 32016722
55959 32016722 35611227 39852681 44924461 51043145 58467273 67543613 78718541 92519016
55951 92519016 109597073 130809141 157133909 189336420 227521628 270707733 316415332
55944 316415332 360464328 397500880 422473838 432342480 426860289 408054505 379124239
55937 379124239 343615664 304994504 266281599 229690034 196508133 167289447 142118320
55930 142118320 120778866 102872737 87942231 75547632 65274119 56734909 49604250
55923 49604250 43629951 38603990 34343053 30702889 27582543 24898718 22571194 20537639
55915 20537639 18759884 17204283 15830980 14608451 13521117 12554213 11685232 10896580
55907 10896580 10182387 9536143 8944297 8397850 7897707 7442579 7022901 6631860 6271244
55898 6271244 5941183 5634773 5347807 5083482 4842357 4617360 4403699 4204454 4021513
55889 4021513 3849848 3685556 3531169 3388273 3252844 3122530 3000984 2890576 2787918
55880 2787918 2690748 2602250 2524503 2454343 2389460 2331780 2280890 2230706 2176822 2121135 2065483
55869 2065483 2006840 1942905 1876703 1811568 1746782 1681827 1619741 1562432 1507422 1452755 1400619
55858 1400619 1353034 1308600 1266584 1229548 1198806 1171742 1146488 1124762 1107158 1090267 1071597
55847 1071597 1052988 1036101 1018722 998642 977205 956057 934299 911678 890646 872325 854227
55836 854227 834711 815923 799591 783766 766662 749990 735528 721978 708122 695632 685740 676428
55824 676428 665781 654992 645248 634860 622382 609508 598117 587364 576382 566803 559814 553607
55812 553607 546590 540331 536515 533744 530188 526826 525240 524688 524164 524979 528527 533688 539085 545701 554563
55797 554563 563880 571075 575815 578702 578908 575498 569309 561349 551114 538381 524749 511532 498259
55784 498259 485090 474373 467664 463318 459084 454933 451274 446747 440128 432387 424682 416370 407191 399217
55770 399217 394259 391346 389046 388307 390528 394643 398531 401604 403731 403418 399516 393226 386157 377946 367931
55755 367931 357466 348222 339698 330669 321643 313728 306504 299142 292196 286151 279790 272185 264785 259322
55741 259322 255055 250377 245721 242547 240679 238978 237514 236880 236438 235418 234696 235424 236890 237713 238012 238424
55725 238424 238091 235748 231828 227599 223177 218263 213655 210117 206836 202973 199545 197814 196977 195567 194073
55710 194073 193991 195322 197159 199810 204068 209122 213352 216579 219573 222015 222930 222429 221125 218496 213772
55695 213772 207884 202637 198534 195054 192339 190815 189796 188275 186518 185342 184630 184171 184942 187666 191089
55680 191089 193695 196248 200512 206217 211528 215887 220065 223772 225565 225161 223857 222561 221065 219234
55666 219234 217320 215201 212757 210801 210219 210495 210521 210507 211612 214030 216880 219706 222644 225443 227669 229557
55650 229557 231459 232859 233058 232245 230744 228084 224089 219863 216139 211702 205258 197943 191998 187626 183253
55635 183253 178284 173483 169030 164349 159742 156208 153730 151482 149588 148873 149062 149023 148688 148926 149577 149447
55619 149447 148251 146791 145143 142483 138901 135669 133394 131407 129249 127314 125809 124387 123079 122350
55605 122350 122067 121546 120662 119793 118811 117336 115894 115467 115946 116298 116202 116206 116338 115944 114989 114238 114005 113844 113573
55586 113573 113468 113451 113129 112638 112521 112853 113365 114100 115067 115747 116020 116963 119406 122288 123921 124352 124936 125999
55568 125999 126758 127313 128800 131484 134285 136422 138027 139079 139148 138377 137393 136177 134245 131924 130124 128864
55552 128864 127394 125722 124674 124442 124391 124220 124004 123288 121601 119731 118967 119171 119164 118907 119502 120965 121865 121525
55534 121525 120952 121130 121925 123060 124630 126154 126521 125434 123739 121910 119427 116005 112235 108635 105243
55519 105243 102413 100762 99961 98783 96769 94761 93517 92926 92844 93510 94760 95860 96409 96447 95636 93415
55503 93415 90031 86298 82382 78065 74122 71971 71829 72650 73934 76064 78698 80545 81162 81482 82127 82657
55487 82657 82893 83439 84390 85024 85356 86486 88739 90863 91867 92315 93040 93849 94357 94923 95896 96863 97387 97586
55469 97586 97451 96552 94978 93542 92497 91078 88874 86664 85309 84803 84868 85432 86008 85701 84453 83333
55453 83333 83068 83227 83291 83454 83922 84511 85415 87226 89692 91578 92315 92612 92953 92784 91859 91069 91091 91381 91324
55434 91324 91287 91588 91500 90298 88522 87319 87185 88009 89495 90937 91439 91055 90852 91244 91270 90152 88514 87313
55416 87313 86593 86147 86397 87668 89443 91207 93250 95756 97918 98877 98834 98408 97638 96451 95380 94919 94704
55399 94704 94110 93054 91593 89484 86871 84671 83489 82804 81934 81102 80764 80658 80387 80299 80918 82005 83010
55382 83010 83908 84850 85495 85461 85026 84718 84636 84640 84736 84786 84456 83885 83767 84286 84723 84601 84370 84423 84356 83855 83447 83620
55360 83620 84026 84304 84759 85388 85256 83898 82548 82789 84482 86170 87025 87353 87538 87614 87690 87904 88065 87986 88056
55341 88056 88893 90632 92937 95319 97084 97505 96582 95144 93810 92470 91122 90368 90432 90526 89940 89093 88762
55324 88762 88969 89385 90127 91317 92431 92962 93189 93477 93434 92625 91587 91245 91696 92311 92588 92227 90962 89173
55306 89173 88112 88606 89928 90796 91099 91747 93118 94541 95231 95063 94536 94387 95068 96320 97549 98707 100128
55289 100128 101420 101542 100447 99515 99667 100038 99399 97944 96691 95955 95467 95277 95467 95596 95423 95583 96525
55272 96525 97450 97277 96113 94759 93430 92050 91180 91428 92376 93228 94059 95272 96277 95996 94457 92790
55256 92790 91824 91712 92565 94315 96147 97158 97498 97941 98583 98920 98985 99328 99955 100233 99831 98995 98025 97188
55238 97188 96820 96813 96379 95138 93972 93897 94529 94643 93864 92714 91391 89648 87732 86312 85595 85380 85763 86876
55220 86876 88228 89279 90352 91991 93744 94744 95174 95947 97113 97796 97686 97389 97279 97152 97067 97432 98108
55203 98108 98410 98166 97939 98122 98565 99130 99827 100462 100788 100934 100998 100575 99459 98374 98053 98047 97538 96903 97133
55184 97133 97988 98149 97179 96009 95404 95261 95490 96319 97467 98187 98377 98615 98963 98813 98083 97454 97211 96919
55166 96919 96456 96317 96662 97126 97720 98843 100157 100642 100146 99760 100217 100921 101081 100812 100577 100390 100168 100198 100697
55147 100697 101427 102052 102425 102420 102088 101925 102252 102362 101274 99366 98190 98461 99249 99477 99179 98876 98710 98785 99527
55128 99527 101077 102900 104369 105235 105287 104277 102497 100811 99822 99505 99713 100365 101051 101202 100868 100607 100559 100386
55110 100386 100115 100194 100623 100954 101238 102032 103374 104697 105868 107243 108611 109286 109495 110360 112087 113412 113404
55093 113404 112705 112350 112421 112510 112516 112320 111594 110619 110341 110963 111357 110625 109354 108578 108406 108551 109378 111351 113927
55074 113927 115917 116674 116361 115446 114550 114320 114844 115491 115663 115246 114165 112328 110374 109504 110003 110759 110902
55057 110902 110941 111513 111993 111481 110397 109862 109965 109890 109436 109187 109265 109055 108359 107850 108064 108644 108966 108999 109203 109776
55037 109776 110314 110227 109389 108263 107317 106515 105703 105234 105668 106853 107980 108655 109252 110077 110834 111244 111476 111646
55019 111646 111524 111118 110958 111362 111974 112413 112832 113398 113753 113486 112734 111915 111311 111244 112127 113925 116012 117906
55001 117906 119700 121450 122780 123505 124104 125076 126213 126930 126933 126228 124914 123282 121725 120408 119446 119385 120720
54984 120720 122763 123916 123446 122222 121463 121627 122803 125031 127593 129054 128846 128018 127703 127729 127528 127426 127939
54967 127939 128535 128301 127362 126636 126527 126779 127222 127749 127935 127556 127228 127673 128647 129309 129338 128981 128445 127977 128136
54948 128136 129087 130017 130088 129646 129648 130241 130829 131214 131699 132303 132793 133327 134133 134694 134221 132843 131416 130255 128981
54929 128981 127665 127134 127900 129594 131705 134243 137457 141419 146128 151563 157515 163732 170260 177328 184944
54914 184944 192840 200582 207352 211948 213540 212284 208768 203261 196111 188478 181779 176438 171767 166968
54900 166968 161689 155904 150039 145109 141946 140257 139078 138076 137660 137849 137871 137095 135772 134646 134328 135131
54884 135131 136977 139390 141965 144946 148922 153984 159575 165152 170545 175753 180883 186325 192461 199098
54870 199098 205403 210343 212989 212792 210037 205845 201196 196141 190408 184372 178725 173405 167722 161517
54856 161517 155465 150242 146077 143140 141566 140893 140108 138542 136309 133821 131418 129517 128492 128094 127535
54841 127535 126412 125211 124614 124630 124693 124411 123941 123676 123670 123474 122655 121433 120499 120093 119700 118875 117930 117348 116996
54822 116996 116445 115748 115327 115319 115628 116302 117261 117911 117763 117301 117497 118563 119840 120877 121866 122991 124061 124939
54804 124939 125750 126497 127027 127480 128249 129314 130071 129967 129011 127578 126130 125167 125045 125697 126742 127850 128846
54787 128846 129651 130461 131737 133628 135585 136967 137783 138415 138920 139151 139304 139723 140363 141039 141998 143598 145635
54770 145635 147720 150103 153411 157721 162707 168496 175387 182750 189296 194682 199899 205711 211569 216456
54756 216456 219956 221886 221589 218434 212799 205964 199062 192428 185882 179367 173211 167824 163184 158909
54742 158909 154967 151937 150201 149201 148000 146365 144805 143815 143671 144643 146627 148679 149693 149583 149166
54727 149166 149023 149257 150298 152977 157532 163262 169453 176034 183153 190654 198145 204994 210134 212543 212198
54712 212198 210086 207182 203852 200190 196211 191661 186340 180800 176022 172245 168766 165108 161670 158962
54698 158962 156887 155065 153262 151205 148580 145545 142713 140388 138329 136493 135376 135305 135929 136710 137426
54683 137426 137959 138103 137865 137514 137161 136703 136240 135986 135807 135515 135583 136662 138218 138709 137490 135638 134428
54666 134428 133880 133392 132924 132725 132561 132052 131392 131044 131053 131161 131207 130980 130140 128791 127708 127456 127740 128080 128606
54647 128606 129584 130714 131553 132215 132923 133270 132718 131547 130525 129814 129007 128213 128269 129686 131936 134011 135263
54630 135263 135591 135181 134413 133810 133855 134661 135815 136573 136433 135565 134578 133906 133656 133905 134666 135517 135791 135342 134706
54611 134706 134323 134034 133588 133214 133414 134444 136161 138058 139347 139502 138910 138541 138805 139180 139108 138625 137927 137057
54593 137057 136415 136813 138384 139974 140349 139651 139078 139376 140201 140726 140340 138967 137139 135671 134953 134761 134900
54576 134900 135588 136865 138114 138675 138557 138121 137458 136620 136071 136240 136871 137389 137723 138195 138791 139110 139006 138743
54558 138743 138601 138721 139285 140362 141609 142476 142719 142533 142299 142452 143334 144773 145973 146189 145535 144906 145214
54541 145214 146815 149346 151871 153406 153702 153439 153509 154324 155866 157942 160057 161403 161422 160209 158232 155936
54525 155936 153756 151995 150435 148606 146766 145936 146523 147547 147869 147609 147614 148038 148350 148414 148611 148993 149153 148971
54507 148971 148742 148566 148238 147785 147501 147431 147339 147195 147154 147093 146770 146461 146789 147811 148783 148955 148200 146866 145538
54488 145538 144954 145481 146476 146782 146167 145803 146937 149476 152265 154500 156375 158399 160516 162094 162698 162674
54472 162674 162815 163453 164070 163984 163240 162572 162490 162732 162753 162570 162829 163975 165604 166972 168021 169366 171012 171744
54454 171744 170498 168016 166258 166190 167074 167954 168746 169462 169470 168398 167053 166535 166863 167212 167066 166381 165058 163189
54436 163189 161521 160776 160642 160253 159546 159262 159670 160174 160269 160017 159444 158389 157345 157632 160046 163712 166848
54419 166848 168469 168958 169135 169233 168937 168115 167247 166972 167350 167845 168005 167832 167409 166646 165680 165078 165198 165645 165868
54400 165868 166054 166887 168494 170165 171094 171084 170592 170397 171141 172782 174555 175746 176362 176845 177405 177979 178537
54383 178537 178986 178995 178355 177346 176348 175359 174316 173514 173166 172895 172315 171848 172241 173440 174644 175367 175750 175919
54365 175919 175856 175858 176331 177048 177381 177358 177770 179055 180815 182631 184608 186831 189010 191098 193542 196362 198531
54348 198531 198974 197967 196906 196713 196917 196368 194554 192050 189807 188201 186922 185631 184388 183341 182363
54333 182363 181298 180268 179350 178294 177006 175996 175826 176270 176637 176707 176713 176531 175697 174341 173367 173442 174310 175285
54315 175285 175915 175985 175357 174085 172382 170324 167983 165859 164685 164643 165206 165855 166534 167249 167752 167902 167884 167782
54297 167782 167304 166281 165190 164800 165340 166201 166456 165727 164609 164156 164780 165814 166328 166102 165509 164790 164015
54280 164015 163544 163828 164766 165810 166726 167716 168794 169678 170371 171282 172606 174064 175285 176009 175962 175184 174498
54263 174498 174886 176225 177322 177466 177285 177760 179062 180706 182276 183448 183797 183138 181870 180622 179757 179389
54247 179389 179576 180171 180833 181372 181882 182342 182415 181784 180400 178353 175907 173705 172372 171698 170743 169084 167455
54230 167455 166787 167023 167320 167089 166431 165846 165912 167003 168888 170689 171608 171725 171901 172885 174558 176029 176441
54213 176441 175812 174957 174502 174208 173599 172941 173021 174027 175301 176175 176471 176124 174999 173368 171960 171236 171049
54196 171049 171145 171491 171874 171774 170982 169950 169196 168739 168367 168055 167867 167792 167856 168071 168213 168102 168122 168823 169911
54177 169911 170367 169802 169003 168809 169211 169937 171058 172326 172723 171545 169580 168313 168247 168723 169121 169436 169690
54160 169690 169610 169103 168564 168453 168735 168853 168198 166719 165187 164630 165298 166380 166872 166475 165487 164220 162889
54143 162889 161809 161282 161346 161849 162689 163822 165196 166770 168464 170050 171320 172344 173280 174001 174297 174388 174692
54126 174692 175116 175190 174991 175203 176078 177030 177544 177814 178164 178587 179245 180656 182735 184322 184413 183490 183005 183794
54108 183794 185508 187251 188271 188309 187720 187121 186764 186578 186821 187906 189406 190200 190096 190329 191713 193226 193405
54091 193405 192387 191436 191045 190708 190193 189796 189468 188814 188052 187947 188792 190290 192441 195565 199398 203149 206740
54074 206740 211227 217598 225734 234704 243445 250946 256382 259446 260267 258965 255679 250951 245473 239434
54060 239434 232751 225969 220203 215957 212640 209552 206771 204708 203319 202280 201655 201833 202845 204059 204718
54045 204718 204711 204788 205894 208256 211210 214040 216692 219540 222813 226600 231116 236419 242071 247601 253206
54030 253206 259465 266412 273356 279643 285152 290095 294773 299520 304402 308907 312401 314959 317312 319932
54016 319932 322636 325180 327723 330427 332972 334787 335639 335775 335555 335067 334021 331996 328754 324269 318530
54001 318530 311552 303699 295679 288032 280855 274163 268204 263193 259080 255745 253027 250351 246917 242720
53987 242720 238845 236207 234452 232672 230656 228704 226653 224083 221303 219213 218169 217726 217476 217370 217245
53972 217245 216823 216291 216162 216420 216443 215911 215220 214875 214976 215364 215794 215928 215737 215831 216787 218186 219021 219056 219021 219409
53952 219409 219909 220273 220917 222273 224158 226200 228423 231037 234012 237140 240228 243167 246146 249814 254724
53937 254724 260596 266619 272514 278647 285173 291828 298730 306473 315062 323496 331009 338225 346624 357319
53923 357319 370601 386095 402663 418410 431321 440041 444177 444254 441457 436948 431275 424839 418798
53910 418798 414737 413226 413419 414398 416131 418702 421349 423030 423515 423362 423083 422852 422615 421981 420238 416990
53894 416990 412676 408146 403965 400260 396849 393221 388791 383483 377717 371601 364726 357132 349831 343724
53880 343724 338437 332887 326661 320142 313598 307021 300801 295746 292069 288815 284614 278924 272497 266727
53866 266727 262493 259491 256766 253923 251484 249973 249003 247642 245452 242829 240476 238793 237642 236463
53852 236463 234816 232969 231727 231489 231804 232032 232019 231809 231120 229676 227846 226413 225758 225643 225746 226055 226698
53835 226698 227686 228821 229722 230033 229715 229002 227976 226445 224403 222327 220832 220202 220362 220975 221489 221544 221595
53818 221595 222654 225098 228125 230674 232406 233459 233877 233919 234408 235953 238083 239850 241150 242719 244965
53803 244965 247594 250417 253752 257831 262405 267188 272191 277423 282668 287826 293081 298471 303543 307736
53789 307736 310997 313832 316800 320029 323194 325992 328561 331244 333854 335526 335571 334203 332139 329730 326883
53774 326883 323505 319461 314332 307941 301151 295374 291065 287236 282815 277894 273288 269306 265595 262029
53760 262029 259133 257372 256345 254940 252348 248815 245342 242670 240633 238494 235777 232646 229661 227374
53746 227374 226081 225700 225821 226034 226265 226671 227260 227788 228065 228224 228617 229468 230603 231506 231735 231398 231152 231640
53728 231640 232978 234804 236561 237663 237696 236874 236177 236641 238458 240935 243254 244989 246009 246324 246212 246185
53712 246185 246611 247463 248586 250047 252039 254460 256798 258599 260033 261847 264590 267998 271346 274339 277345
53697 277345 280772 284661 289054 294248 300218 306151 311100 315005 318542 322052 325157 327441 328928 329758
53683 329758 329912 329502 328899 328194 326916 324676 321854 319268 317320 315881 314897 314634 315230 316359 317506 318327
53667 318327 318628 318257 317242 315903 314588 313348 312082 310926 310285 310377 310873 311056 310359 308818 307113 306085
53651 306085 306048 306584 307108 307462 307747 307758 307098 305915 304988 304829 305101 305245 305295 305666 306522 307824 309716 312267
53633 312267 314966 317170 318971 321037 323523 325786 327297 328228 328942 329490 329996 331062 333295 336655 340565
53618 340565 344452 347933 350820 353260 355765 358803 362463 366573 370993 375637 380442 385406 390441 395250
53604 395250 399660 404176 409715 416617 424299 432019 439460 446304 451889 455827 458640 461217 463796 465779
53590 465779 466436 465495 463332 460886 459054 457785 456056 453146 449641 446724 444785 443272 441702 440140 438699
53575 438699 437153 435218 432836 430050 426923 423696 420789 418531 416965 415937 415212 414565 413873 413082 412051
53560 412051 410629 408958 407487 406521 406004 405881 406358 407527 409014 410312 411279 412092 412925 413927 415257 416832
53544 416832 418277 419384 420406 421627 422964 424293 425836 427880 430365 433115 436231 439930 444245 449187
53530 449187 454816 460825 466540 471836 477651 484979 493691 502954 512495 522742 534013 546244 559341
53517 559341 573092 586918 600510 614606 630348 647858 666169 684546 703160 722442 742667
53506 742667 764312 788029 813851 840973 868558 896244 923733 950575 976707 1002603 1028531
53495 1028531 1054061 1078643 1102215 1124992 1147046 1168438 1189421 1210222 1230899 1251573 1272523
53484 1272523 1293867 1315442 1337051 1358489 1379294 1398908 1417293 1435046 1452805 1470881 1489383
53473 1489383 1508148 1526421 1543197 1558065 1571247 1582650 1591516 1597308 1600319 1601029 1599359 1594982 1587961
53460 1587961 1578639 1567298 1554306 1540265 1525660 1510625 1495278 1479849 1464157 1447423 1429075
53449 1429075 1409377 1388916 1367849 1346105 1323912 1301640 1279413 1257317 1235579 1214093 1192249
53438 1192249 1169995 1148736 1130361 1115448 1103127 1092574 1083758 1076663 1070721 1065501 1061363 1058938
53426 1058938 1058368 1059398 1061876 1065691 1070465 1075769 1081624 1088472 1096725 1106594 1118234 1131702 1146759
53413 1146759 1163034 1180477 1199381 1219837 1241504 1264124 1288058 1313936 1341895 1371512 1402522
53402 1402522 1435187 1469803 1506227 1544181 1583790 1625440 1669256 1715089 1762977 1813249 1866106
53391 1866106 1921243 1977972 2035612 2093902 2153174 2213922 2275918 2337953 2398798 2458249 2516757
53380 2516757 2574165 2629453 2681824 2731435 2778771 2823788 2866029 2905225 2941358 2974317 3003774
53369 3003774 3029299 3050410 3066679 3077910 3084002 3084506 3078553 3065339 3044440 3015647 2979009 2935380
53357 2935380 2886561 2834423 2780013 2723782 2666370 2608649 2551139 2493921 2437254 2381883 2328584
53346 2328584 2277595 2228581 2180962 2134230 2088141 2042685 1997774 1952949 1907628 1861776 1816216
53335 1816216 1772126 1730242 1690701 1653563 1619266 1588374 1560914 1536154 1513103 1491229 1470737
53324 1470737 1452252 1436130 1421858 1408115 1393642 1378133 1362079 1345885 1329582 1313472 1298359
53313 1298359 1284692 1272036 1260008 1249322 1241103 1235327 1230807 1226726 1223353 1221134 1219939 1219629 1220644
53300 1220644 1223467 1227977 1233833 1241198 1250603 1262375 1276534 1292980 1311337 1330892 1351218 1372817
53288 1372817 1396753 1423592 1452864 1483423 1514077 1543946 1572556 1599724 1625340 1649297 1671619
53277 1671619 1692476 1711994 1730127 1746677 1761172 1772780 1780698 1784766 1785456 1783203 1778112 1770369 1760385
53264 1760385 1748265 1733550 1715879 1695569 1673163 1648744 1622158 1593746 1564298 1534276 1503470
53253 1503470 1471592 1438981 1406561 1375093 1344512 1314111 1283459 1253043 1223729 1195779 1168746
53242 1168746 1142250 1116280 1090659 1064866 1038716 1012709 987334 962484 937972 914121 891298
53231 891298 869237 847475 826303 806737 789567 774839 762094 750698 740068 729998 720681 711964
53219 711964 702839 692212 680099 667484 654970 642130 628293 613437 598051 582571 567261 552352
53207 552352 538033 524404 511600 499813 489052 479055 469561 460597 452386 445051 438372 431766 424561
53194 424561 416512 408044 399828 392149 384869 377960 371706 366262 361278 356253 351134 346348 342240 338670
53180 338670 335261 331920 328951 326594 324584 322312 319487 316485 313978 312244 310942 309530 307784 305842
53166 305842 303835 301696 299424 297355 295859 294855 294019 293480 293796 294896 295592 294752 292715 290889 290065 289771
53150 289771 289296 288593 287933 287322 286654 286008 285420 284657 283530 282209 280997 280060 279482 279298 279333 279398 279764 280953
53132 280953 282815 284325 284692 284290 284116 284709 285977 287750 289945 292322 294495 296179 297283 297946 298599 299661
53116 299661 301036 302215 303050 303877 304688 304840 304088 303378 303880 305569 307331 308208 307921 306454 303913 300804
53100 300804 297828 295259 292834 290261 287553 284987 283015 281979 281665 281376 280811 280468 280754 281098 280603 279260
53084 279260 277802 276538 275122 273476 272155 271652 271901 272614 273624 274711 275549 276015 276261 276432 276562 276706
53068 276706 276882 276909 276667 276374 276230 275929 275017 273671 272620 272242 272193 271941 271239 270088 268661 267302 266263
53051 266263 265431 264693 264451 265292 267143 269210 270827 271967 272918 273848 274728 275359 275480 275122 274684 274319 273553
53034 273553 272057 270491 269855 270125 270304 269777 268810 267685 266302 264902 264299 264865 265922 266655 267167 268128 269736
53017 269736 271551 273077 274114 274650 274706 274258 273257 271900 270832 270705 271449 272359 273045 273913 275542 277899
53001 277899 280264 281679 281504 279982 278290 277636 278193 279258 280309 281301 282031 282085 281620 281389 281628 281693 281270
52984 281270 281193 282351 284369 286140 287309 288470 290139 292291 294856 297964 301558 305252 308754 312084 315244
52969 315244 317956 319848 320792 320961 320663 320118 319389 318541 317767 317202 316700 316035 315328 314946 314929 314861 314427 313690 312705
52950 312705 311267 309312 307235 305493 304162 303131 302430 302063 301728 301088 300193 299410 298999 298941 299046 299049 298700 297867
52932 297867 296501 294596 292465 290939 290729 291462 291925 291545 291073 291400 292246 292641 292293 291730 291254 290514 289231
52915 289231 287754 286672 286247 286419 287028 287809 288418 288700 288825 288987 289035 288591 287493 286065 284906 284450 284683
52898 284683 285246 285688 285665 285072 284183 283589 283775 284642 285529 285812 285507 285244 285611 286439 286859 286273 285178 284635 284910
52879 284910 285181 284839 284475 285013 286348 287602 288442 289301 290427 291537 292518 293673 295122 296620 298182 300192
52863 300192 302656 305032 307101 309326 312003 314680 316874 318704 320318 321265 321027 319727 317712 314878 311093
52848 311093 306912 303142 299809 296181 291813 287062 282636 279047 276446 274515 272561 270098 267455 265501
52834 265501 264742 264865 265104 264825 263815 262319 260902 260161 260430 261613 263176 264364 264675 264141 263036 261488
52818 261488 259686 258234 257712 257909 258110 258142 258496 259294 259920 259973 259844 260018 260539 261563 263571 266391 268790
52801 268790 269822 269963 270103 270027 268944 267045 265312 263964 262173 259440 256285 253447 251234 249852 249563
52786 249563 250131 250686 250538 249794 249048 248890 249732 251584 253815 255600 256743 257661 258549 259129 259375 259858 260980
52769 260980 262328 263206 263498 263602 263665 263271 261871 259412 256571 254410 253550 253598 253572 253008 252377 252319 252764 253132
52751 253132 253236 253499 254278 255317 256148 256770 257573 258679 259769 260716 261932 263789 266060 268371 270900 274030
52735 274030 277426 280184 281951 283225 284416 285313 285807 286403 287502 288723 289476 289828 290270 290924 291473 291597
52719 291597 291122 290033 288674 287588 286835 285909 284656 283721 283612 283917 284001 283902 283822 283347 282073 280511 279397
52702 279397 278470 277024 275465 275128 276496 278643 280618 282321 283768 284446 283986 282843 281863 281563 282028 283074
52686 283074 284264 285180 285753 286023 285731 284737 283669 283374 283699 283634 282758 281668 280831 279957 278839 277926 277505 277125
52668 277125 276419 275870 276125 277076 278218 279438 280849 282201 283083 283454 283541 283481 283497 284092 285568 287623 289820
52651 289820 292156 294751 297346 299597 301598 303479 304757 304752 303577 302172 301266 300797 300349 299674 298715 297519
52635 297519 296353 295601 295417 295600 295902 296243 296631 297113 297928 299462 301857 304752 307523 309703 311108 311648
52619 311648 311247 310001 308295 306545 304878 303230 301731 300658 299889 298763 296775 294255 292013 290473 289525
52604 289525 289105 289405 290445 291819 293042 293902 294453 294907 295573 296593 297662 298339 298658 299084 299793 300462 300922
52587 300922 301544 302604 303614 303800 303177 302756 303582 305797 308685 311409 313538 314998 315914 316675 317885 319729
52571 319729 321394 321602 319978 317535 315544 314310 313370 312387 311322 310077 308618 307283 306365 305542 304262
52556 304262 302556 300900 299473 298237 297531 297747 298426 298596 298036 297411 297065 296625 296019 295803 296034 295834 294751
52539 294751 293758 294026 295294 296307 296477 296329 296526 297191 298135 299170 300152 301060 301976 302798 303217 303167 303041 303124
52521 303124 303206 303054 302972 303521 304916 306952 309234 311258 312687 313856 315579 318140 320927 323424 325974 329055
52505 329055 332329 335057 337034 338406 338964 338332 336671 334482 331930 329018 326179 323905 321899 319412 316447
52490 316447 313895 312379 311621 311098 310671 310347 309969 309401 308640 307599 306179 304655 303591 303272 303557 304283 305352
52473 305352 306417 307031 307256 307631 308412 309405 310632 312496 314955 317242 318927 320753 323728 327746 331815
52458 331815 335410 338823 342116 344474 344963 343513 340871 337868 335025 332508 330056 327057 323121 318681
52444 318681 314721 311855 309853 308093 306229 304289 302463 301023 300262 300157 300183 299722 298727 297761 297409 297793
52428 297793 298567 299178 299199 298694 298258 298438 299152 299893 300404 300808 301183 301506 302020 303123 304729 306204 307140 307813
52410 307813 308694 309970 311794 314515 318267 322721 327673 333541 340915 349908 360339 372065 384555 396376
52396 396376 405750 411627 413810 412307 407331 399887 391594 383579 376006 368896 362834 358420 355355 352641
52382 352641 349641 346571 343969 342025 340624 339792 339814 340915 343015 345832 349077 352504 356026 359910 364675
52367 364675 370530 376985 383236 388800 393564 397400 400158 401958 403031 403258 402294 400219 397603 394903 392231
52352 392231 389829 388208 387542 387344 387065 386700 386632 387241 388802 391364 394467 397358 399705 401751 403675 405382
52336 405382 407096 409520 413049 417353 422110 427539 433818 440692 448188 457042 467716 479561 491762
52323 491762 504574 518774 534299 550380 566734 583618 600817 617506 633256 648478 663802
52312 663802 679630 696209 713521 731112 748676 766762 786240 807159 828757 850503 872464
52301 872464 894732 917228 940084 963438 986854 1009609 1031506 1052583 1072087 1088664 1101701
52290 1101701 1111621 1118774 1123027 1124656 1124572 1123209 1120132 1115234 1109413 1103394 1096732 1088766 1079967 1071554
52276 1071554 1064203 1057804 1052055 1046746 1041898 1038219 1036948 1038540 1041862 1045351 1048676 1052663 1057965 1064595
52262 1064595 1072512 1081811 1092337 1103756 1116062 1129450 1143787 1158774 1174574 1191635 1209838 1228454
52250 1228454 1247060 1265892 1285032 1303711 1320724 1335295 1347350 1357181 1364976 1370475 1373111 1372788
52238 1372788 1370520 1367906 1365765 1363579 1360296 1355310 1348575 1340332 1331076 1321496 1312021 1302529 1292687 1282405
52224 1282405 1271766 1260846 1249948 1239766 1230865 1223097 1215910 1209151 1203123 1197983 1193576 1189888 1187127
52211 1187127 1185189 1183644 1182542 1182705 1184783 1188386 1192672 1197408 1202890 1209054 1215378 1221654 1228187 1235134
52197 1235134 1242188 1249035 1255679 1262207 1268763 1275891 1284308 1293977 1303874 1313020 1321363 1329324 1336913 1343636
52183 1343636 1348931 1352295 1353292 1351803 1348055 1342127 1333859 1323560 1312340 1301222 1290300 1279290 1268554
52170 1268554 1258893 1250554 1243098 1236180 1229834 1224119 1219136 1215393 1213509 1213429 1214445 1216036 1218267 1221305
52156 1221305 1225054 1229259 1233466 1236758 1238086 1237182 1234854 1232261 1230130 1228696 1227987 1227921 1228381 1229280 1230536
52141 1230536 1232050 1233900 1236290 1238970 1240945 1241253 1239930 1237821 1235584 1233414 1231632 1230910 1231814 1234529 1239095
52126 1239095 1245515 1253687 1263678 1275907 1290610 1307306 1325412 1345192 1367287 1391385 1416285 1441390
52114 1441390 1467192 1493964 1520843 1546705 1571297 1594983 1617890 1639809 1660520 1679841 1697715
52103 1697715 1714611 1731433 1748784 1766599 1784645 1802823 1820730 1837473 1852276 1864826 1874780
52092 1874780 1881495 1884599 1884259 1880502 1872782 1860767 1845093 1826933 1807242 1786822 1766595 1747190
52080 1747190 1728592 1710729 1694072 1679168 1665907 1653838 1642994 1633862 1626687 1621217 1617119 1614350
52068 1614350 1613347 1614971 1619894 1627699 1637032 1646924 1657531 1669267 1681879 1694984 1708917 1724210
52056 1724210 1740594 1757365 1774458 1792259 1810468 1828027 1844201 1858941 1871959 1882303 1889235
52045 1889235 1892890 1893650 1891271 1885185 1875451 1862976 1848805 1833531 1817396 1800703 1783797 1766688
52033 1766688 1748977 1730486 1711834 1694068 1677664 1662122 1646568 1630438 1613618 1596356 1579150
52022 1579150 1562307 1545481 1528146 1510666 1494330 1479928 1466792 1453656 1439971 1425967 1411981
52011 1411981 1398401 1385907 1375019 1365506 1356709 1348187 1339450 1329358 1316632 1301057 1283602 1265185
51999 1265185 1245798 1224946 1202617 1179637 1157262 1136419 1117138 1098778 1080928 1063909 1048190
51988 1048190 1033596 1019405 1004901 989497 972637 954092 934288 913970 893707 873824 854380
51977 854380 834759 813814 791180 768170 746704 727534 710234 694700 681702 671851 664886 660321
51965 660321 658153 658636 661807 667458 675170 684060 692889 700674 707012 711717 714429 714699 712237 707038 699562
51950 699562 690826 682002 673802 666404 659903 654537 650556 648251 648129 650780 656455 664963 675912 688791
51936 688791 702947 717813 733103 748563 763645 777692 790171 800373 807239 810053 809134 805296
51924 805296 798801 789411 777291 763065 747081 729477 711135 693736 678478 665361 654066 644984
51912 644984 638945 636397 637320 641600 648913 658341 668393 677487 684452 688815 690735 690560 688456 684649
51898 684649 679793 674609 669114 662617 654476 644485 632484 618182 601648 583662 565387 547927 532161
51885 532161 518544 506896 496771 488214 481800 477883 476148 476072 477413 480195 484664 491371 500804 512613
51871 512613 525559 538338 550087 560007 567145 571009 572047 571134 568849 565460 561246 556428 551103 545645
51857 545645 541012 538234 537614 538545 540071 541548 542924 544515 546357 547859 548261 547353 545297 541910 536726
51842 536726 529906 522406 514945 507398 499532 491791 484826 478673 472993 467857 463786 461226 460395 461399
51828 461399 463965 467232 470282 472849 475083 476747 477220 476363 474866 473443 472012 470009 467370 464858 463310
51813 463310 462792 462716 462714 463007 463731 464300 463955 462821 461860 461684 461872 461628 460745 459669 458916 458621 458510 458187 457650
51794 457650 457496 458300 459801 461100 461657 461600 460990 459485 457009 454151 451483 449042 446921 445792 446134 447298
51778 447298 448044 447903 447426 447201 447245 447403 447824 448886 450985 454501 459671 466397 474343 483178 492643 502447
51762 502447 512226 521481 529491 535569 539615 542093 543176 542232 538544 532342 524638 516247 507457 498530
51748 498530 489974 482176 475180 468930 463405 458465 453941 449983 447050 445400 444893 445410 447235 450791 456105
51733 456105 462669 469745 476723 483277 489264 494488 498583 501213 502444 502796 502941 503449 504783 507279 510802
51718 510802 514409 516675 516720 514881 512133 508902 504886 500184 496002 493636 492951 492460 490852 487943 484293
51703 484293 480623 477813 476722 477608 480073 483719 488257 492715 495346 495127 492992 490870 489657 488797 487703
51688 487703 486812 486924 487929 488578 487498 484347 479978 475476 471185 466843 462478 458633 455628 453204 451183
51673 451183 449927 449714 450112 450458 450607 450714 450697 450601 451254 453866 459021 466511 475932 486773 498003 508337
51657 508337 516919 523212 526324 525340 520659 514324 508567 504424 502016 501642 503950 509180 516641 524929 532423
51642 532423 537651 539595 537908 532940 525446 516102 505203 492971 480168 468104 457799 449376 442511
51629 442511 437180 433570 431521 430665 431007 432759 435576 438493 440786 442454 443753 444776 445647 446590 447465
51614 447465 447631 446617 444692 442481 440324 438266 436406 434829 433388 431870 430329 428975 427899 427149 426952
51599 426952 427478 428444 429336 430133 431556 434435 439067 445310 453137 462744 474066 486330 498087 507570
51585 507570 513120 513817 510106 503723 496525 489341 482201 475598 470909 469250 470414 473467 478135 485080
51571 485080 494881 507309 521708 537679 555191 574255 594689 616099 637995 660056 682306 705039
51559 705039 728717 754086 782142 813652 848647 886580 926719 967982 1008346 1044872 1074613
51548 1074613 1095504 1106526 1107378 1098161 1079269 1051555 1016673 977012 934878 891705 848297 805657
51536 805657 765086 727427 692744 661020 632786 608794 589293 573812 561340 550509 540002
51525 540002 529371 519391 511293 505509 501331 497670 493941 490261 487141 485171 484731 485689 487377 489126
51511 489126 490973 493636 497513 501786 504787 505358 503597 500261 495811 490392 484406 478552 473265 468439
51497 468439 463826 459485 455766 453019 451277 450167 449137 447948 446791 445839 444928 443963 443352 443541 444157 444128
51481 444128 442771 440443 438056 436264 435143 434246 432876 430666 428020 425678 423756 421632 418894 415921
51467 415921 413194 410467 407135 403254 399661 397069 395389 394119 393045 392345 392096 391992 391653 391048 390386 389674
51451 389674 388768 387999 388375 390792 395119 400375 405683 410831 416089 421960 429050 437735 447858 459018
51437 459018 471057 483797 496289 506903 514430 518833 520826 521188 520649 519875 518975 517148 513263 506865
51423 506865 498511 489170 479512 469795 460332 451908 445500 441462 439205 437875 437160 437104 437527 438225 439600
51408 439600 442301 446089 449717 452194 453646 454708 455695 456680 457795 459009 460027 460837 461997 463979 466645
51393 466645 469721 473271 477270 481260 485080 489489 495373 502659 510797 520088 531652 546201 563750
51380 563750 584626 609933 640704 677221 719499 767711 821624 879984 940955 1002863 1063997
51369 1063997 1121726 1172327 1211967 1237957 1249312 1246452 1230587 1203270 1166222 1121191 1069865
51358 1069865 1014107 956351 899337 845066 794108 746232 701581 660927 624984 594008 568029
51347 568029 546947 530240 516951 506095 496811 488139 479190 469768 460489 452035 444608 438252 433188
51334 433188 429412 426231 422733 418665 414523 410866 407887 405556 403761 402185 400418 398393 396536 395277
51320 395277 394467 393500 392018 390341 389157 388837 389219 390066 391572 394243 398213 402870 407283 410970 414163
51305 414163 417312 420500 423447 426003 428326 430414 431712 431581 430122 428131 426078 423514 419732 414725
51291 414725 409120 403494 398233 393793 390460 387899 385581 383753 383350 384702 387001 389387 391927 395036
51277 395036 398534 402068 406031 411104 416900 421987 425444 427675 429426 430725 431272 431373 431848 433179 435215
51262 435215 437594 440094 442608 445074 447418 449370 450448 450289 448922 446564 443424 439931 436855 434748
51248 434748 433338 431848 429883 427682 425541 423466 421430 419576 418016 416685 415493 414362 413025 411126
51234 411126 408676 406190 404195 402768 401602 400341 398747 396839 395007 393787 393420 393731 394416 395107 395273
51219 395273 394581 393552 393384 394723 396939 398916 400300 401667 403753 406865 410783 414835 418287 421017 423663
51204 423663 426798 430201 433288 435974 438631 441459 444427 447699 451410 455013 457468 458296 457993 457212 455902
51189 455902 453584 450197 446416 443135 440734 438839 436866 434825 433373 432950 433183 433449 433650 433970 434190 433909
51173 433909 433309 433010 433123 433085 432538 431845 431547 431805 432524 433584 434757 435851 437033 438562 440161 441272 442103
51156 442103 443696 446546 449731 451904 452799 453296 454329 456112 458163 459670 460015 459306 458218 457182 455984
51141 455984 454318 452292 450109 447672 444832 441698 438388 434875 431479 429043 428056 427919 427656 427079 426727
51126 426727 426865 427237 427737 428700 430408 432732 435408 438303 441311 444236 446938 449427 451820 454356 457344
51111 457344 460942 465005 469310 473745 478120 481998 484997 487201 489052 490906 492853 494820 496666 498257
51097 498257 499550 500475 500772 500267 499349 498678 498252 497298 495393 493142 491350 490082 489117 488780 489453 490520 490695
51080 490695 489441 487477 485876 485169 485255 485607 485527 484734 483717 483098 482841 482632 482878 484512 487714 491574 495284
51063 495284 499109 503861 509880 516891 524638 533448 544305 558269 575492 594747 614139 632254 648372
51050 648372 662118 673666 684213 695428 708188 722319 737424 753136 768471 781890 792426
51039 792426 800073 804719 805519 801887 794485 784635 773336 761465 750298 740818 732570 723928 713549
51026 713549 701158 687130 672008 656553 641738 628464 617357 608766 602734 599037 597486 598093 600776
51013 600776 605083 610483 616750 623814 631456 639487 647991 656982 665971 674386 682411 690932 700576 711144
50999 711144 722077 733089 744161 755162 765752 775596 784592 792904 800761 808091 814397 819170 822368
50986 822368 824344 825392 825642 825381 825148 825393 826344 828426 832594 839928 850879 865034 881589 899829
50972 899829 919185 939164 959518 980486 1002631 1026490 1052571 1081753 1115329 1154320 1198807
50961 1198807 1248206 1302161 1360858 1424361 1491960 1562485 1635108 1709529 1785216 1860656 1933595
50950 1933595 2002085 2065167 2122487 2173505 2217493 2254276 2284457 2308678 2327111 2340237 2349857
50939 2349857 2358629 2368406 2379309 2390286 2400037 2407396 2411553 2412455 2410678 2406574 2399759 2389633 2376018
50926 2376018 2358836 2337443 2310846 2278480 2240305 2196115 2145335 2087898 2025092 1959113 1891686
50915 1891686 1823298 1753908 1684231 1616043 1551186 1490577 1434323 1382460 1335112 1292106 1253021
50904 1253021 1217704 1186245 1158226 1132431 1107683 1083710 1060952 1039779 1020234 1002352 986312
50893 986312 972287 960330 950299 941762 934179 927455 922172 918924 917499 916997 916726 916697 917234 918414 920048
50878 920048 922039 924593 928081 932671 938156 944206 950823 958483 967774 979013 992142 1006758 1022198
50865 1022198 1037934 1054125 1071579 1090988 1112365 1135338 1159724 1185730 1213997 1245812 1282836
50854 1282836 1326028 1374982 1428800 1487527 1552322 1624458 1704784 1794097 1893222 2002360 2120934
50843 2120934 2248386 2384759 2530140 2683882 2844723 3011296 3182032 3354647 3526015
50834 3526015 3692358 3849262 3991885 4115965 4219033 4300575 4361109 4401469 4422945 4427617
50824 4427617 4418210 4397860 4370268 4339793 4310873 4287148 4271047 4263977 4266418 4277577 4295022 4314835
50812 4314835 4332270 4342564 4341519 4325760 4292743 4240709 4168658 4076296 3964017 3833124 3686172
50801 3686172 3526841 3359189 3187021 3014110 2844654 2682734 2531048 2390531 2261528
50792 2261528 2144920 2041684 1951707 1873721 1806447 1749384 1702411 1664996 1635986 1613881 1597219
50781 1597219 1584940 1576454 1571198 1568130 1565955 1563829 1561482 1558578 1554399 1548339 1540301 1530373 1518505
50768 1518505 1504819 1489839 1473981 1456985 1438279 1417740 1395702 1372375 1347757 1322125 1296178
50757 1296178 1270637 1246065 1223124 1202462 1184120 1167422 1151831 1137751 1126170 1117677 1112143 1109259
50745 1109259 1109004 1111522 1116909 1125378 1137398 1153364 1173180 1196487 1223351 1254457 1290507 1331694
50733 1331694 1377974 1429625 1487121 1550454 1618915 1691676 1768369 1848913 1932984 2019812 2108442
50722 2108442 2197975 2287528 2376082 2462476 2545585 2624386 2697646 2763381 2818746 2860770 2887429
50711 2887429 2898179 2893809 2876123 2847701 2811607 2771087 2729528 2690398 2656726 2630445 2612435
50700 2612435 2603128 2602583 2609842 2622734 2638652 2655214 2669838 2679095 2679135 2666820 2640308 2598866 2542803
50687 2542803 2473649 2393824 2305853 2212159 2115691 2020213 1929353 1845320 1768815 1700094 1639796
50676 1639796 1588676 1546958 1514323 1490372 1474792 1467170 1467055 1474308 1488990 1510693 1538262 1570350
50664 1570350 1605852 1643421 1680968 1716278 1748079 1776110 1800368 1820988 1838779 1855006 1870341
50653 1870341 1884575 1897539 1909635 1921057 1931190 1939466 1946380 1953059 1960121 1967638 1976144 1987035
50641 1987035 2001882 2021629 2046352 2075505 2108551 2145652 2187569 2234488 2285126 2337459 2390139
50630 2390139 2442758 2494946 2545945 2595192 2642741 2688888 2733708 2776949 2817620 2853113 2879002
50619 2879002 2890371 2883815 2858662 2816911 2762458 2700219 2635398 2572904 2516783 2469731 2433014
50608 2433014 2406862 2390793 2383469 2382630 2385789 2391157 2397640 2403852 2407435 2405513 2395653 2376347 2346880
50595 2346880 2307058 2257242 2198560 2133002 2063040 1990958 1918479 1846936 1777523 1711150 1648263
50584 1648263 1589099 1534016 1483360 1437146 1395131 1357074 1322617 1290993 1261334 1233374 1207612
50573 1207612 1184720 1165051 1148725 1135837 1126388 1120183 1116917 1116269 1117894 1121530 1127199 1135167 1145619
50560 1145619 1158434 1173261 1189787 1208038 1228503 1251778 1277901 1306236 1336233 1368067 1402172
50549 1402172 1438321 1475618 1513321 1551131 1588657 1625154 1660099 1693702 1726552 1759002 1791141
50538 1791141 1823222 1855942 1890400 1927887 1969558 2016051 2067331 2122997 2182813 2247094 2316637
50527 2316637 2392140 2473692 2561057 2654565 2755352 2864372 2981383 3105256 3234956 3369590
50517 3369590 3507474 3645767 3781210 3910894 4032215 4142486 4238828 4318241 4377788 4415124
50507 4415124 4429100 4419695 4387356 4332732 4257069 4162625 4052652 3931266 3803242 3673496 3546587
50496 3546587 3426867 3318810 3226513 3152724 3098780 3065516 3053461 3061916 3088398 3129339 3180801
50485 3180801 3238163 3295685 3347044 3386137 3407294 3405616 3378158 3324853 3247807 3149874 3034358
50474 3034358 2905706 2769399 2630545 2492682 2358060 2228719 2106973 1994815 1892925
50465 1892925 1800428 1715884 1638617 1568992 1507424 1453551 1406563 1365953 1331496 1302711 1278806
50454 1278806 1259123 1243278 1230877 1221359 1214122 1208655 1204611 1201871 1200381 1199797 1199647 1200147 1202567 1208246
50440 1208246 1217342 1229013 1242611 1258011 1274648 1290967 1305387 1317526 1328053 1337523 1345802 1352608
50428 1352608 1358213 1363475 1369475 1377249 1387511 1400227 1414504 1429351 1444721 1461509 1480357 1500802
50416 1500802 1521943 1543664 1566743 1591977 1619832 1650970 1686400 1726777 1772036 1821990 1876843
50405 1876843 1936677 2000799 2068068 2137578 2208561 2279827 2349860 2417428 2481599 2541095 2594065
50394 2594065 2638691 2673763 2698425 2711447 2710981 2695259 2663768 2617772 2559541 2491161 2414434 2331885
50382 2331885 2247164 2164013 2085101 2012192 1946936 1890904 1845172 1810512 1787827 1777664 1779249
50371 1779249 1790551 1809270 1833178 1859560 1885182 1907200 1923509 1931881 1929480 1914099 1885798 1846879
50359 1846879 1800250 1748049 1691679 1632563 1572524 1513452 1456639 1402426 1350469 1300422 1252393
50348 1252393 1206894 1164545 1125791 1090756 1059365 1031734 1008354 989646 975380 964934 958177
50337 958177 955734 958133 965007 975309 988011 1002138 1016255 1028353 1036466 1039448 1037317 1031048 1021959
50324 1021959 1011117 999279 987324 976468 967818 961847 958543 957906 960001 964535 970755 977861 985372
50311 985372 993080 1000916 1008936 1017172 1025354 1033048 1040291 1047879 1056696 1066787 1077359 1087689 1097755
50298 1097755 1107903 1118214 1128557 1139230 1151199 1165471 1182325 1201415 1222758 1247408 1276966
50287 1276966 1312513 1354203 1401512 1452815 1504020 1548146 1577560 1587498 1577688 1551132 1512250 1466213
50275 1466213 1418589 1374029 1334960 1302024 1275560 1256044 1243247 1235931 1232706 1232618 1234674 1237498 1240078
50262 1240078 1242465 1245249 1248527 1251802 1254663 1257097 1259232 1261288 1263760 1267254 1272027 1277959 1285099 1294075
50248 1294075 1305845 1321182 1340415 1363571 1390708 1422069 1457861 1497826 1541173 1586891 1633922
50237 1633922 1680946 1726446 1769487 1810389 1850271 1889854 1928891 1966559 2001921 2033821 2060661
50226 2060661 2080534 2091510 2091750 2079750 2054912 2018041 1971164 1916846 1857677 1796272 1735368 1677577
50214 1677577 1624851 1578105 1537195 1501042 1467824 1435421 1402111 1367039 1330057 1291316 1251338
50203 1251338 1211385 1173340 1138856 1108608 1082280 1059048 1038006 1018479 1000300 983826 969535
50192 969535 957493 947127 937392 927295 916558 905849 896143 887819 880562 874126 868712 864425 860773
50179 860773 857104 853262 849433 845508 841025 835817 830425 825784 822497 820361 818565 816479 814277 812550
50165 812550 811356 810070 808308 806567 805687 806102 807911 811145 815378 819537 822911 826221 830934 837532 845186
50150 845186 853219 862104 872630 884693 897359 909721 921278 931792 941319 950262 958990 967405 975255
50137 975255 982936 991722 1003064 1017860 1036574 1059933 1089159 1125385 1169099 1220442 1279880 1348049
50125 1348049 1424741 1508369 1596661 1687651 1779859 1871904 1962439 2050344 2134865 2215820 2294017
50114 2294017 2371013 2447715 2523014 2593928 2656852 2708268 2744678 2762849 2760739 2738045 2695913
50103 2695913 2636396 2562135 2476025 2380956 2280005 2176685 2074384 1975346 1880582 1790852 1707323
50092 1707323 1631071 1562340 1500569 1444946 1394859 1350060 1310450 1275557 1244364 1216103 1191162
50081 1191162 1170592 1154596 1142022 1131559 1122868 1116316 1112187 1110534 1111293 1113975 1117575 1121246 1124848
50068 1124848 1128492 1131879 1134586 1136734 1138838 1141017 1142753 1143397 1142585 1140320 1136974 1133122 1128999 1124232
50054 1124232 1118419 1111853 1105264 1098922 1092424 1085366 1077794 1069964 1062179 1055053 1049478 1045890 1043814 1042506
50040 1042506 1041988 1043096 1046532 1052135 1059220 1067337 1076466 1086707 1098168 1111209 1126294 1143319 1161313
50027 1161313 1179166 1196585 1214013 1231655 1248927 1264851 1278713 1290315 1299952 1308284 1315980 1323322
50015 1323322 1330354 1337484 1345571 1355201 1366079 1377459 1389193 1402393 1419197 1441732 1470830 1505482
50003 1505482 1543651 1583692 1624862 1666660 1708300 1749092 1788950 1828282 1867651 1907647 1948490
49992 1948490 1989268 2027780 2061364 2087504 2103403 2105703 2091575 2060117 2012419 1950610 1877467
49981 1877467 1796525 1711485 1625218 1539870 1457854 1381855 1313461 1252440 1197868 1149485 1107448
49970 1107448 1071198 1039365 1010836 985471 963587 945050 929024 914481 900857 888256 877088
49959 877088 867519 859344 852344 846619 842446 839930 838930 839295 841057 844354 849271 855737 863494 872080
49945 872080 880800 888753 895042 899158 901275 902075 902257 902139 901692 900727 898852 895428 889834 881887 871849
49930 871849 859982 846298 830879 814220 797021 779759 762774 746685 732351 720271 710275 701893
49918 701893 694842 689122 684980 682867 682982 684646 686593 688249 690297 693473 697227 700328 702677 705704
49904 705704 710889 718536 728109 739022 750827 763216 776293 790429 805438 820237 833671 845383
49892 845383 855530 863974 870185 873736 874468 872264 867029 858938 848533 836571 823751 810384 796319
49879 796319 781546 766827 753254 741022 729229 717260 705805 695999 687983 680964 674446 668732
49867 668732 664238 660912 658424 656621 655759 656439 659114 663362 667980 672247 676918 683471 692520 703496
49853 703496 715738 729189 743831 758986 773506 786478 797617 807177 815559 822847 828763 833119
49841 833119 836011 837293 836156 831749 824142 814229 802848 790496 777769 765360 753526 742154 731591
49828 731591 722830 716565 712438 709577 707551 706549 706874 708608 711620 715682 720625 726470 733370 741427
49814 741427 750705 761283 773017 785288 797268 808371 818230 826494 833180 839061 844962 850528 854311
49801 854311 855370 854220 851896 848703 844378 838976 832891 826178 818490 809686 800020 789655 778405 766177
49787 766177 753458 741172 730081 720488 712502 706447 702682 700917 700003 698786 697166 696019 696108 697438
49773 697438 699556 702045 704614 707233 710408 714995 721436 729330 737830 746156 753715 760224 765960 771443
49759 771443 776633 780798 783467 785086 786345 787274 787357 786174 783442 778737 771768 762827 752561 741454
49745 741454 729950 718861 709149 701318 695356 691064 688027 685484 682871 680487 679080 678776 678926 679123
49731 679123 679751 681360 683973 687304 691266 695859 700755 705353 709312 713008 717524 724050 733044 743974
49717 743974 756086 769259 783779 799436 815369 830765 845016 857036 865244 868841 868639 866005
49705 866005 861258 853678 843016 830387 817662 806412 797450 790928 786575 783999 782823 782462 781904 780075
49691 780075 776456 771108 764263 756352 748517 742474 739429 739283 741173 744550 749412 755693 762955 770858
49677 770858 779713 790441 804096 821418 842667 867574 895233 923858 950750 972955 988419 996653
49665 996653 998364 994722 987212 977900 969204 963094 960590 961921 966790 974286 982744 989875 993078 989994
49651 989994 979418 962020 939896 915202 889396 863706 839651 818526 800692 785907 774132
49640 774132 765505 759718 756092 754296 754382 756005 758188 760133 761753 763083 763673 762991 761061 758192 754244
49625 754244 748746 741753 734114 726777 720091 713914 708096 702700 697911 693934 690922 688831 687367 686193
49611 686193 685234 684750 685065 686175 687660 689016 690112 691236 692730 694641 696802 699058 701223 702876 703535
49596 703535 703209 702631 702668 703412 704119 704219 704213 705241 707745 710918 713603 715414 716763 718076 719428 720801 722198
49579 722198 723457 724312 724797 725283 726031 726984 728115 729651 731775 734386 737401 741076 745824 751926 759584
49564 759584 768934 779693 791099 802679 814820 827997 841465 853315 862030 867474 870199 870426 868223
49551 868223 864226 859382 853962 847553 840277 833467 828632 826007 824590 823495 822740 822704 823343 824275 825269 826225
49535 826225 826837 826791 826358 826465 827984 831137 835682 841474 848688 857613 868487 881533 897034 915316
49521 915316 936691 961315 988848 1018109 1047045 1073239 1094640 1109990 1118857 1121679 1120004 1116417
49509 1116417 1113548 1112818 1114234 1117390 1122195 1128363 1134640 1139089 1140002 1136224 1126916 1111868 1092137 1069746
49495 1069746 1046454 1023201 1000823 980578 963375 948861 935865 923597 912050 901457 891947
49484 891947 883782 877370 872847 869881 868055 867272 867668 869204 871457 873772 875665 877151 878626 880359 882210
49469 882210 884007 886019 888782 892403 896289 899701 902485 905209 908652 913217 918647 924179 928985 932627
49455 932627 935212 937082 938314 938543 937357 934863 931717 928441 924824 920172 914128 907056 899680 892545
49441 892545 885912 879962 874932 871072 868439 866701 865363 864457 864881 867675 872984 880117 888640 898869
49427 898869 911142 925245 940932 958583 978773 1001447 1026054 1052367 1080636 1110893 1142269
49416 1142269 1172689 1198840 1216902 1224391 1221794 1212164 1199062 1185120 1172227 1162003 1155399 1152247
49404 1152247 1151800 1153683 1157991 1164682 1173290 1183258 1194172 1205634 1217078 1227969 1238237 1248469 1259502
49391 1259502 1271563 1283792 1294834 1303998 1311632 1318268 1323685 1326963 1327180 1323729 1316256 1304879 1290576
49378 1290576 1274919 1259185 1243882 1229143 1215259 1202583 1191203 1181084 1172514 1166146 1162590 1162084
49366 1162084 1164448 1169086 1175052 1181425 1187693 1193603 1198713 1202462 1204727 1205852 1205837 1203928 1199458 1192854
49352 1192854 1185304 1177540 1169453 1160891 1152309 1144385 1137385 1131195 1125772 1121321 1118091 1116086 1114917 1113956
49338 1113956 1112772 1111291 1109367 1106408 1101943 1096434 1090953 1085912 1080740 1075050 1069488 1064978 1061679 1059293
49324 1059293 1057986 1058237 1059913 1062231 1064721 1067716 1071709 1076691 1082296 1088269 1094636 1101630 1109534 1118382
49310 1118382 1127708 1136897 1145918 1155565 1166839 1180232 1195734 1213379 1233438 1255843 1279440 1302078
49298 1302078 1321649 1336953 1347433 1352445 1351468 1345053 1334846 1322297 1307840 1291721 1275033 1259220
49286 1259220 1244862 1231550 1218797 1206529 1194851 1183940 1174078 1165257 1156930 1148789 1141674 1136914
49274 1136914 1134737 1134023 1133736 1133798 1134378 1135168 1135822 1136464 1137237 1137794 1137708 1137053 1136187 1135309 1134632 1134610 1135563 1137329 1139668
49255 1139668 1142816 1147397 1154131 1163903 1177661 1195662 1216973 1240034 1263340 1285182 1303182 1315006
49243 1315006 1319551 1317000 1307766 1292063 1270596 1245127 1218070 1191708 1167731 1146978 1129350 1114322
49231 1114322 1101789 1092347 1086689 1084918 1086473 1090450 1095934 1102319 1109554 1117941 1127613 1138324 1149759
49218 1149759 1161839 1174549 1187651 1200671 1213126 1224684 1235212 1244719 1253187 1260413 1266149 1270509
49206 1270509 1274190 1278240 1283593 1290759 1299822 1310666 1323298 1337850 1354217 1371782 1389727 1407636
49194 1407636 1425612 1443757 1461751 1479056 1495328 1510413 1524087 1536046 1546251 1555106 1563179 1570751
49182 1570751 1577692 1583823 1589410 1595311 1602671 1612498 1625458 1641962 1662301 1686829 1716114 1751035
49170 1751035 1792657 1841930 1899229 1963689 2032543 2101029 2163317 2214071 2249851 2269813 2275721
49159 2275721 2271347 2261278 2249517 2238567 2229342 2221664 2214833 2208114 2201074 2193687 2186262 2179355 2173660
49146 2173660 2169755 2167846 2167841 2169742 2173781 2180128 2188649 2199091 2211290 2224994 2239682 2254918 2270832
49133 2270832 2287871 2306078 2324978 2344271 2364184 2384865 2405727 2425797 2444638 2462712 2480933
49122 2480933 2500062 2520378 2541587 2563114 2584777 2607167 2631160 2657180 2685216 2715444 2748511
49111 2748511 2785376 2827443 2876976 2936943 3010356 3100086 3209027 3339176 3489403 3654165
49101 3654165 3825181 3995269 4161526 4325522 4489604 4650717 4796192 4906709 4966224 4971051
49091 4971051 4930024 4856290 4759118 4642108 4506506 4354711 4191484 4023512 3858113 3701710
49081 3701710 3558941 3432841 3325131 3235789 3162745 3102918 3053841 3014068 2982109 2955717 2932617
49070 2932617 2911622 2892549 2875168 2858710 2842502 2826665 2811837 2798335 2785989 2774668 2764447
49059 2764447 2755079 2745772 2735919 2725775 2715994 2706731 2697644 2688654 2680128 2672303 2665020 2658116 2651665 2645699
49045 2645699 2640144 2635281 2631920 2630833 2632241 2635927 2641578 2648840 2657321 2666742 2676808 2686725 2695187 2701229
49031 2701229 2705060 2707852 2710790 2714362 2718383 2722488 2726577 2730744 2734713 2737591 2738560 2737704 2735698 2732792
49017 2732792 2728755 2723892 2719365 2716073 2713813 2711995 2710635 2710074 2710187 2710698 2712086 2715384 2720940 2727836 2734720
49002 2734720 2740947 2746908 2753527 2761388 2770095 2778528 2785886 2792317 2798326 2803835 2808235 2811180 2812889 2813757
48988 2813757 2814081 2814124 2814074 2813922 2813660 2813500 2813562 2813452 2812598 2810971 2809073 2807158 2804843 2801578 2797161 2791673 2785216
48971 2785216 2777866 2769730 2760932 2751611 2741869 2731652 2720922 2710160 2700413 2692433 2685936 2680179 2675217
48958 2675217 2672095 2671785 2674333 2679178 2685855 2694251 2704445 2716493 2730255 2745405 2761763 2779408 2798248
48945 2798248 2817677 2837063 2856361 2875766 2894978 2913486 2931495 2949875 2969155 2989346 3010889
48934 3010889 3034907 3062072 3091964 3124084 3158888 3197150 3238724 3282673 3328397 3376054 3426023
48923 3426023 3478552 3533787 3591603 3651406 3712624 3775436 3840568 3908269 3977854 4048331 4119172
48912 4119172 4190302 4261585 4332484 4402184 4470027 4535893 4600081 4662723 4723468 4781858 4837830
48901 4837830 4891538 4942752 4990772 5034981 5075343 5112405 5147042 5180126 5212102 5242653 5270902
48890 5270902 5296013 5317633 5335831 5350775 5362457 5370650 5375083 5375682 5372584 5365993 5356212 5343814 5329380
48877 5329380 5312865 5293513 5270739 5244814 5216300 5185041 5150278 5111691 5069711 5024634 4976006
48866 4976006 4923222 4866454 4806697 4745210 4683171 4621527 4560720 4500659 4441345 4383445 4327839
48855 4327839 4274625 4223030 4172464 4123276 4076171 4031212 3987893 3946146 3906789 3870797 3838420
48844 3838420 3809295 3783196 3760288 3740667 3724028 3709992 3698502 3689728 3683730 3680429 3679820 3681976
48832 3681976 3686872 3694393 3704610 3717885 3734540 3754396 3776606 3799979 3823560 3847058 3870760 3895024
48820 3895024 3919922 3945380 3971533 3998761 4027353 4057146 4087425 4117136 4145393 4172005 4197497
48809 4197497 4222520 4247371 4272217 4297524 4323796 4350950 4378427 4406078 4434471 4464034 4494284
48798 4494284 4524329 4553935 4583682 4614116 4645059 4675699 4705096 4732707 4758742 4783846 4808097
48787 4808097 4830459 4849772 4866223 4881207 4895539 4908418 4918355 4924495 4926542 4924037 4916488 4904039
$$ [...]
##END NTUPLES=NMR SPECTRUM
##END=
