
##TITLE=UV1286_M2_1207-1380_20_7534579_fRNGb9eGlU
##JCAMPDX= 6.0         $$ Bruker NMR JCAMP-DX V2.0
##DATA TYPE= NMR SPECTRUM
##DATA CLASS= NTUPLES
##ORIGIN= BRUKER
##OWNER= Administrator
$$ 1.72 TOPSPIN		Version 2.1
$$ 2013-02-22 00:14:37.731 -0500  Administrator@X
$$ Compression mode = diff/dup
##.OBSERVE FREQUENCY= 400.02188249412
##.OBSERVE NUCLEUS= ^1H
##.ACQUISITION MODE= SIMULTANEOUS (DQD)
##.ACQUISITION SCHEME= undefined
##.AVERAGES= 8
##.DIGITISER RES= 22
##SPECTROMETER/DATA SYSTEM= spect
##.PULSE SEQUENCE= zg30
##.SOLVENT NAME= COFFEE_meoh
##.SHIFT REFERENCE= INTERNAL, COFFEE_meoh, 1, 14.98509
##AUDIT TRAIL= $$ (NUMBER, WHEN, WHO, WHERE, PROCESS, VERSION, WHAT)
$$ ##TITLE= Audit trail, TOPSPIN		Version 2.1
$$ ##JCAMPDX= 5.01
$$ ##ORIGIN= Bruker BioSpin GmbH
$$ ##OWNER= Administrator
$$ $$ E:\/data/COFFEE/nmr/UV1286_M2_1207-1380_20_7534579_fRNGb9eGlU/10/pdata/1/auditp.txt
$$ ##AUDIT TRAIL=  $$ (NUMBER, WHEN, WHO, WHERE, PROCESS, VERSION, WHAT)
(   1,<2013-02-22 00:14:29.075 -0500>,<Administrator>,<X>,<go>,<TOPSPIN 2.1>,
      <created by zg
	started at 2013-02-22 00:13:22.606 -0500,
	POWCHK enabled, PULCHK disabled,
       configuration hash MD5:
       86 BA 57 50 F2 9D 5C 9B 26 00 A9 28 5F 66 2E 89
       data hash MD5: 64K
       0E 4A 43 1E 27 F3 95 22 8E D3 BA 88 14 9A E9 C3>)
(   2,<2013-02-22 00:14:32.278 -0500>,<Administrator>,<X>,<proc1d>,<TOPSPIN 2.1>,
      <Start of raw data processing
       efp LB = 0 FT_mod = 6 PKNL = 1 PHC0 = 0 PHC1 = 0 SI = 32K 
       data hash MD5: 32K
       37 E9 D3 03 C3 C8 4F 49 9F 47 CE 03 42 A2 67 7B>)
(   3,<2013-02-22 00:14:32.778 -0500>,<Administrator>,<X>,<proc1d>,<TOPSPIN 2.1>,
      <pk PHC0 = 67.71973 PHC1 = 0 
       data hash MD5: 32K
       DF 0A 66 84 C5 B4 32 BB 93 A6 91 58 F2 A3 64 74>)
(   4,<2013-02-22 00:14:33.012 -0500>,<Administrator>,<X>,<proc1d>,<TOPSPIN 2.1>,
      <abs ABSG = 1 
       data hash MD5: 32K
       2E 2E BF 85 8B AD 67 15 C5 4E 83 65 30 D4 67 C3>)
(   5,<2013-02-22 00:14:33.184 -0500>,<Administrator>,<X>,<proc1d>,<TOPSPIN 2.1>,
      <abs ABSG = 2 
       data hash MD5: 32K
       51 84 BF 9F CD 67 D8 0A 70 10 67 06 1E 16 0A 9E>)
(   6,<2013-02-22 00:14:33.356 -0500>,<Administrator>,<X>,<proc1d>,<TOPSPIN 2.1>,
      <abs ABSG = 3 
       data hash MD5: 32K
       C1 6D 49 42 92 90 24 3D 28 A2 D1 23 7F D6 FA 72>)
(   7,<2013-02-22 00:14:33.528 -0500>,<Administrator>,<X>,<proc1d>,<TOPSPIN 2.1>,
      <abs ABSG = 4 
       data hash MD5: 32K
       9D B8 43 CA BC 33 C6 CD E0 FA 2B FD E5 43 E3 C6>)
(   8,<2013-02-22 00:14:33.653 -0500>,<Administrator>,<X>,<proc1d>,<TOPSPIN 2.1>,
      <abs ABSG = 5 
       data hash MD5: 32K
       72 AA D1 9D CE BC B3 09 A8 31 75 08 F3 8B A1 D3>)
$$ ##END=
$$ 
$$ $$ hash MD5
$$ $$ 9F 86 D0 22 89 95 0A 8F B3 52 FA 14 1C 6C 06 48
##$RELAX= 
##$RELAX= 
##$RELAX= 
##$RELAX= 
##$RELAX= 
##$RELAX= 
##$RELAX= 
$$ Bruker specific parameters
$$ --------------------------
##$DU= <E:\>
##$EXPNO= 10
$$ [...]
150 150 150 150 150 150 150 150
##$TP07= 0
##$TPNAME0= <>
##$TPNAME1= <>
##$TPNAME2= <>
##$TPNAME3= <>
##$TPNAME4= <>
##$TPNAME5= <>
##$TPNAME6= <>
##$TPNAME7= <>
##$TPOAL= (0..7)
0.5 0.5 0.5 0.5 0.5 0.5 0.5 0.5
##$TPOFFS= (0..7)
0 0 0 0 0 0 0 0
##$TUNHIN= 0
##$TUNHOUT= 0
##$TUNXOUT= 0
##$USERA1= <user>
##$USERA2= <user>
##$USERA3= <user>
##$USERA4= <user>
##$USERA5= <user>
##$V9= 5
##$VALIST= <valist>
##$VCLIST= <CCCCCCCCCCCCCCC>
##$VD= 0
##$VDLIST= <DDDDDDDDDDDDDDD>
##$VPLIST= <PPPPPPPPPPPPPPP>
##$VTLIST= <TTTTTTTTTTTTTTT>
##$WBST= 1024
##$WBSW= 4
##$XGAIN= (0..3)
0 0 0 0
##$XL= 0
##$YL= 0
##$YMAX_a= 564569
##$YMIN_a= -560830
##$ZGOPTNS= <>
##$ZL1= 120
##$ZL2= 120
##$ZL3= 120
##$ZL4= 120
##$ABSF1= 14.98509
##$ABSF2= -5.573092
##$ABSG= 5
##$ABSL= 3
##$ALPHA= 0
##$AQORDER= 0
##$ASSFAC= 0
##$ASSFACI= 0
##$ASSFACX= 0
##$ASSWID= 0
##$AUNMP= <proc_prof1d_extract_pilot.lims>
##$AXLEFT= 0
##$AXNAME= <>
##$AXNUC= <1H>
##$AXRIGHT= 0
##$AXTYPE= 0
##$AXUNIT= <>
##$AZFE= 0.1
##$AZFW= 0.1
##$BCFW= 0
##$BC_mod= 0
##$BYTORDP= 0
##$COROFFS= 0
##$CY= 15
##$DATMOD= 1
##$DC= 0
##$DFILT= <>
##$DTYPP= 0
##$F1P= 0
##$F2P= 0
##$FCOR= 0.5
##$FTSIZE= 32768
##$FT_mod= 6
##$GAMMA= 0
##$GB= 0
##$INTBC= 1
##$INTSCL= 1
##$ISEN= 128
##$LB= 0
##$LEV0= 0
##$LPBIN= 0
##$MAXI= 10000
##$MC2= 0
##$MEAN= 0
##$ME_mod= 0
##$MI= 0
##$NCOEF= 0
##$NC_proc= -8
##$NLEV= 6
##$NOISF1= 0
##$NOISF2= 0
##$NSP= 0
##$NTH_PI= 0
##$NZP= 0
##$OFFSET= 14.98509
##$PC= 1
##$PHC0= 67.71973
##$PHC1= 0
##$PH_mod= 1
##$PKNL= yes
##$PPARMOD= 0
##$PPDIAG= 0
##$PPIPTYP= 0
##$PPMPNUM= 2147483647
##$PPRESOL= 1
##$PSCAL= 4
##$PSIGN= 0
##$PYNMP= <proc.py>
##$REVERSE= no
##$SF= 400.02
##$SI= 32768
##$SIGF1= 0
##$SIGF2= 0
##$SINO= 400
##$SIOLD= 32768
##$SPECTYP= <>
##$SREGLST= <1H.CDCl3>
##$SSB= 0
##$STSI= 32768
##$STSR= 0
##$SW_p= 8223.68421052631
##$SYMM= 0
##$S_DEV= 0
##$TDeff= 65536
##$TDoff= 0
##$TI= <>
##$TILT= no
##$TM1= 0
##$TM2= 0
##$TOPLEV= 0
##$USERP1= <user>
##$USERP2= <user>
##$USERP3= <user>
##$USERP4= <user>
##$USERP5= <user>
##$WDW= 1
##$XDIM= 32768
##$YMAX_p= 466325976
##$YMIN_p= -735390
##$CURPLOT= <Network HP LaserJet P1505>
##$CURPRIN= <$Network HP LaserJet P1505>
##$DFORMAT= <normdp>
##$LAYOUT= <+/1D_H.xwp>
##$LFORMAT= <normlp>
##$PFORMAT= <normpl>
##$SURQMSG= 1
$$ End of Bruker specific parameters
$$ ---------------------------------
##NTUPLES= NMR SPECTRUM
##VAR_NAME=  FREQUENCY,     SPECTRUM/REAL,   SPECTRUM/IMAG
##SYMBOL=    X,             R,               I
##VAR_TYPE=  INDEPENDENT,   DEPENDENT,       DEPENDENT
##VAR_FORM=  AFFN,          ASDF,            ASDF
##VAR_DIM=   32768,         32768,           32768
##UNITS=     HZ,            ARBITRARY UNITS, ARBITRARY UNITS
##FACTOR=    0.250966925370066, 1,           1
##FIRST=     8223.43324360094, -104097,      150130
##LAST=      0,             -90091,          -192095
##MIN=       0,             -735390,         0
##MAX=       8223.43324360094, 466325976,    0
$$ Real data points
##PAGE= N=1
##DATA TABLE= (X++(R..R)), XYDATA
$$ [...]
19546C6870b43426b0065A57529o803c05262A8175R7695i3539G8888J18152J1116
19535B08156b75191b3159F4125i0915b9799j16113f5729B84236a0403k23859A0404
19523d3692G0407K48448a08401B02609h0605q5613D3138P6063a54304k28309C6357
19511B4810R0677a6309F3902b92371B49650h9933j01005D5295b05773b2902A09554
19499d7814F2451c8832A88885c71504A43075A0306J28798b62068Q8644D5723M8837
19488I4560a25933A61159B1444a7790k59731f5670D5627a37619c5012B20275b27699
19476c83062d6821k20471J16826A71102K36396B7731L2559J43358a67705k7157
19466a94862i0177k7030a4949A32189c25429J43878B7782m97b61233A07479k3330
$$ y = [36870, -243426, -20065, 157529, 150726, -305262, 18175, 115870, -93539, 78888, 197040, 208156, -275191, -23159, 64125, -90915, -29799, -145912, -65729, 284236, -10403, -234262, 10404, -43692, 70407, 318855, -108401, 202609, -80605, -166218, 43138, 119201, -154304, -382613, 36357, 24810, 115487, -16309, 63902, -292371, 249650, -89933, -190938, 45295, -205773, -22902, 109554, -47814, 62451, -38832, 188885, -371504, 143075, 10306, 139104, -262068, -173424, 45723, 94560, -125933, 161159, 21444, -17790, -277521, -65670, 45627, -137619, -35012, 220275, -227699, -383062, -46821, -267292, -150466, 171102, 407498, 27731, 60290, 203648, -167705, -194862, -90177, -117207, -14949, 132189, -325429, -181551, 27782, 27285, -261233, 107479, 84149]
19455H4149K2067i7170A07208d66942I0839a5802k24239I9469a80079k2856m7885
19444b50820D3983P7309B8457c07724A57409a87367H3321a75058A50395m5474
19434A04921i6338A01737a69945A2478c83868J65462l9133k02848A59993a09563
19423a89486A41190b56657A02956a24585N9368B5421i7565J0793C67166b36573
19412b7115G950O6767R2262b37786L1037H2848i830l04735B57503r4001j7329
19401A46173n2424a97979A08670a74310q5638A71569a94155A4325L1621c52409
19390b05184H8693L313b50316o5056F5251L5141a13497q6364c6869q6597l9461
19379a62927o1114k56539C40670j24279b96508c3688n8238H9873a93652k47154
$$ y = [84149, 106216, -97170, 107208, -466942, 90839, -15802, -240041, 99469, -180079, -202935, -250820, 43983, 121292, 28457, -307724, 157409, -187367, 83321, -175058, 150395, 104921, -96338, 101737, -169945, 12478, -383868, -218406, -257539, -460387, 159993, -109563, -189486, 141190, -256657, 102956, -124585, -65217, 25421, -97565, -86772, 367166, -236573, -27115, 7950, 74717, 166979, -237786, -206749, 82848, -9830, -314565, 257503, 163502, 146173, 93749, -197979, 108670, -174310, -259948, 171569, -194155, 14325, 45946, -352409, -205184, 88693, 92006, -250316, -315372, 65251, 100392, -113497, -199861, -36869, -123466, -162927, -224041, -480580, 340670, 216391, -296508, -33688, -91926, 89873, -193652, -440806]
19369d40806C5153P5859L5299h1263a9322l0816a0676A37264f6176C39814G1224
19357a1898n3463D8176J79882F8692c10552A08764b75306i7106J1907j37896B00506
19345a4414k52687g4888k6366o4957N050g5463n0524n6126n9597l5264a32996
19333e3396o5919j24877d4949k38033A21770k3205D7102j2907a53150B10240b65081
19321B58812d011k63732i9574L8399J3980B2218h4890j04246A78428i7699m5891
19310a43590b7866k7100A40183h5500m23299i9147A92121p1014f672k62794P4895
19299a94571A25621K7715a41197G3630J91127e1948A38002g9474A38722J0827
19289A49549j8142a65457j995k04943A59395a79413o3684R3564B37347a26340
$$ y = [-440806, 35153, 111012, 146311, -81263, -19322, -50138, -10676, 137264, -66176, 339814, 71224, -11898, -65361, 48176, 228058, 68692, -310552, 108764, -275306, -97106, -85199, -223095, 200506, -14414, -267101, -74888, -101254, -166211, -161161, -75463, -125987, -182113, -241710, -276974, -132996, -53396, -119315, -244192, -44949, -282982, 121770, 98565, 47102, 34195, -153150, 210240, -265081, 258812, -4011, -267743, -99574, -61175, -47195, 22218, -84890, -189136, 178428, -97699, -143590, -27866, -54966, 140183, -85500, -508799, -99147, 192121, 121107, -6672, -269466, -194571, 125621, 153336, -141197, 73630, 264757, -51948, 138002, -79474, 138722, 149549, 131407, -165457, -167452, -372395, 159395, -179413, -243097, -149533, 237347, -126340]
19278b18158d2190C4988a50054I2855g1493p5251b6983j08049r7647R6829j38006
19267b73856B3061b65906C4253a87792p346O4181j51842a13626H0003C7039a16290
19255d22048d4565A3625a35195o5064j0399C4705f1833F005a91000Q5986j48626
19244b53640A84Q8937a26523j25849D8411J27252a4083k49817K8112c7091D4604
19232a53220J17r0426J21228k9451B25873B6118J50607B2665c89582J03350B73986
19220e1111G5599P6644a55221C2978F292L167J87074G6349R0524g3931D3216N8102
19208A01318A3532a25176b3163H0458l0769i5837K2923A62412F6060c19072a12725
19196f887o3471m496p4995g4744k08803D9813J12560J711d34355A53014c10471
$$ y = [-218158, -42190, 34988, -150054, 92855, -71493, -146744, -26983, -135032, -232679, -135850, -273856, 23061, -265906, 34253, -187792, -195138, -130957, -282799, -113626, 80003, 37039, -116290, -422048, -44565, 13625, -135195, -200259, -210658, 34705, -61833, 6005, -191000, -105014, -253640, 184, 89121, -126523, -252372, 48411, 175663, -14083, -263900, -235788, -37091, 44604, -153220, -153103, -243529, -122301, -151752, 225873, 26118, 176725, 22665, -389582, -286232, 273986, -51111, 75599, 152243, -155221, 32978, 6292, 9459, 196533, 76349, 166873, -73931, 43216, 101318, 13532, -125176, -23163, 80458, 49689, -95837, -72914, 162412, 66060, -319072, -112725, -6887, -70358, -74854, -149849, -74744, -283547, 49813, 162373, 164084, -434355, 153014, -310471]
19184e4812q3139A43754C8398d4557p8109N310j13614e878A22747d6540m4449
19173i0989b8493k13158a19741A28052d740k36862B6242b92400Q1087a01488E2049
19161a56762C850a046B798a00451n7714A26371g8363G6303h4688J8368j3905j2744
19149i2969o6746b6821m6283A30895d8358k18108J15567O0516j41833l8471f3436
19137c77j69998C6846j7550Q80a12303E7802Q9840J09886i4262j27329O1211k95562
19125d55942g8641B10960a195j82403j21241j32259C0728J38628j1701a85841
19114C5019a337j58463D7960c12199a11095j27739B9462O5560a80995e2454i406
19102B8742J5541f2768A81489D3598f3111n5106J5046J6056k05224A08057b11731
$$ y = [-54812, -137951, 143754, 38398, -44557, -122666, -117356, -230970, -5878, 122747, -46540, -90989, -28493, -241651, -119741, 128052, -4740, -241602, 26242, -292400, -211313, -101488, 52049, -156762, 3850, -1046, 2798, -100451, -158165, 126371, -78363, 76303, -84688, -66320, -80225, -92969, -159715, -26821, -73104, 130895, -48358, -266466, -150899, -90383, -232216, -270687, -63436, -377, -170375, 36846, 19296, 20176, -112303, 57802, 147642, 257528, -94262, -221591, -160380, -455942, -78641, 210960, -1195, -183598, -304839, -437098, 30728, 169356, 157655, -185841, 35019, -1337, -159800, 47960, -312199, -111095, -238834, 29462, 95022, -180995, -52454, -9406, 28742, 44283, -62768, 181489, 43598, -63111, -118217, -103171, -87115, -292339, 108057, -211731]
19090B2649M5392j1442b71911a33109J1821A61338C832a97960i870C94873b83751
19078c8067j38385A2973i7721d8197A15230c1287E1284g9387m4635j20258J11992
19067a32288b3682m335k15145J09409j01168J12786r8051B3483Q4439e8050k35582
19056b93632c0297A6520a1834F3509k9551J4504L79a24795m3651j929f8483B2082
19043c1054k31790l45638L02510E6279J45977K02320C2343a84934j17598a23398
19032A91626b8031j133n3645I4771l8400i465C26020H9756D2452a78847g7080
19020A01589O5980e4233B30516b63590A24637e5406m0027A35660L0458K07811
19010C73929D6884K55o619A7012b03597A0973a41774a1947C5014a26724B2126
$$ y = [22649, 68041, 56599, -271911, -133109, -121288, 161338, 3832, -197960, -9870, 394873, -283751, -38067, -176452, 12973, -97721, -48197, 115230, -31287, 51284, -79387, -124022, -244280, -132288, -23682, -28017, -243162, -133753, -234921, -122135, -220186, 23483, 107922, -58050, -293632, -30297, 16520, -11834, 63509, 33958, 48462, 48841, -124795, -168446, -170375, -68483, 22082, -31054, -262844, -608482, -305972, 56279, 202256, 404576, 32343, -184934, -302532, -123398, 191626, -28031, -29164, -82809, 94771, 56371, -9465, 326020, 89756, 42452, -178847, -77080, 101589, 167569, -54233, 230516, -263590, 124637, -55406, -95433, 135660, 166118, 373929, 46884, 47139, 40520, 17012, -203597, 10973, -141774, -11947, 35014, -126724, 22126]
18998A55049a38631d8752D4135d15451a43241n4206l2216b6257j6715D1378M9339
18987I0717b06439g2150C68525F1451a64028c3927o4536j90707c5660B9661a20930
18975e1678B09393c36346A78361D5695b21422a5565K047A87131i5169r7007H4241
18963a03438M3394D1274J7016J80596A4970N6452b76154D4558F434Q6210a97826
18951G0835Q8566E4628a00410b0840Q361A38040A784a57108j18034h0605j48828
18940b29433f2307k90069a53539B49167b46762k0289a26443j15606g5031d78j60961
18929a61439A34832a88881d4377k7249K2814B51170b8911j20791m309F4522K3554
18918H8076J728c71386H986a42569A21228K1205a45866J6006K5951j84372B1355
$$ y = [155049, -138631, -48752, 44135, -415451, -143241, -197447, -229663, -26257, -42972, 41378, 90717, -206439, -72150, 368525, 61451, -164028, -33927, -98463, -289170, -35660, 29661, -120930, -51678, 209393, -336346, 178361, 45695, -221422, -15565, -13518, 187131, -95169, -192176, 84241, -103438, -60044, 41274, 58290, 238886, 14970, 71422, -276154, 44558, 6434, 92644, -197826, 70835, 159401, 54628, -100410, -20840, -12479, 138040, 1784, -157108, -275142, -80605, -229433, -62307, -352376, -153539, 249167, -246762, -267051, -126443, -242049, -75031, -478, -161439, 134832, -188881, -44377, -71626, -48812, 251170, -28911, -149702, -154011, 64522, 88076, 89804, -371386, 8986, -142569, 121228, 142433, -145866, -129860, -103909, -288281, 21355]
18906a42284m7915I2332J20650a57466I915a17122E8028i6041C21192m5075A04562
18894A96524D112a52688k9186f6379k01223f2651j08999H076J7538c0971A31841
18882H3493d7898j91648B12557a33637j19128A7838a40157j11638F2380M038N3188
18871A19606J59902a41307M6955d668j85999J2832L1684b1481A38906g231j55646
18860a62877e6115k16017a26449N8120b5512C7377K17953b93107A69104K45417
18850D14521H2707J52768C6053Q3412n8221L95975b12370h4827a7727j54537j66626
18839c38890a3331k08839d6036A22237C3536a07327p2928j59125A01832b29326
18828b10941Q5087A04087g8320k34962R7213j04078C3115a96484D8995h3670l2962
$$ y = [-142284, -190199, 92332, 212982, -157466, 9915, -117122, 58028, -96041, 321192, 276117, 104562, 196524, 4112, -152688, -181874, -66379, -267602, -62651, -171650, 8076, 25614, -30971, 131841, 83493, -47898, -239546, 212557, -133637, -252765, 17838, -140157, -251795, 62380, 66418, 119606, 279508, -141307, -94352, -4668, -190667, -177835, -146151, -21481, 138906, -7231, -162877, -56115, -272132, -126449, -68329, -25512, 37377, 255330, -293107, 169104, 414521, 82707, 235475, 36053, 119465, 61244, 457219, -212370, -84827, -17727, -172264, -338890, -13331, -222170, -46036, 122237, 33536, -107327, -180255, -339380, 101832, -229326, -210941, -125854, 104087, -78320, -313282, -216069, -320147, 33115, -196484, 48995, -83670, -116632]
18817a16632k07991A05936K5276h4594j87536c0292B50211j6667J83040p8237
18807C38347C8054J56458a27168a038j23691G1757Q7029d613j42445F0139b756
18795b09563C83671I6893a22341j35377a00795a0692j82661N2929E7183i1025
18784C26233b3623O536C2187N6032b13475h946j35441a6697c111j27089a5806
18772a30355k6559m329A00970a43429N069j79017C10739F8569k3139c09241g9716
18760a96727o6811J16676d2384o8121r2686e6971j59381n706b093k23773F6717
18748D3837d7369m5211A88108a44776N4793j14836d327k80864b7084C20579d5701
18736a49128A57773b08744O5065j66976H4180J6885h7247n5055B93292b7594j55701
$$ y = [-116632, -324623, 105936, 131212, -84594, -272130, -30292, 250211, 233544, 416584, 338347, 38054, 194512, -127168, -1038, -124729, 71757, 158786, -4613, -147058, 60139, -2756, -209563, 383671, 96893, -122341, -257718, -100795, -10692, -193353, -140424, 57183, -91025, 326233, -23623, -17087, 32187, 88219, -213475, -8946, -144387, -16697, -3111, -130200, -15806, -130355, -156914, -161243, 100970, -143429, -138360, -317377, 310739, 68569, 45430, -309241, -79716, -196727, -263538, -146862, -42384, -110505, -203191, -56971, -216352, -222058, -2093, -225866, 66717, 43837, -47369, -92580, 188108, -144776, -89983, -204819, -4327, -285191, -27084, 320579, -45701, -149128, 157773, -208744, -143679, -310655, 84180, 101065, -87247, -142302, 293292, -27594, -183295]
18725a83295K7736i942M248k7346F0002h4702E1832c2354k06309c7380D73814
18713a59258I1692Q9736D2023a90638R2449L3869j32045K8073p1363N4020C3383
18701a14865C699d0103F8919a74217A55447P1323c06539B69555h4786k73499A66909
18689b51173B13389i8232C80270A4428Q1214D3215a27647G449c9721J4446E1977
18677g4591l4925A00009L7586B4046a11388A2491a2606m00937F6457j3246i5384
18665C502a32612q2342k6k7248I1203a77318c2539o1128j91241a38693B0706c93
18652a69930B84656J6236C6075d92525F4945a12450B78798c39189C528h1382o0724
18641a42106E4706P9275j1459b11401A46871J264b35573C04049a5211A54756Q6139
$$ y = [-183295, -155559, -9942, -5694, -33040, 60002, -84702, 51832, -32354, -238663, -37380, 473814, -159258, 91692, 181428, 42023, -190638, -98189, -64320, -196365, -168292, -239655, -185635, 33383, -114865, 3699, -40103, 68919, -174217, 155447, 226770, -306539, 269555, -84786, -358285, 166909, -251173, 213389, -98232, 380270, 14428, 95642, 43215, -127647, 7449, -39721, -25275, 51977, -74591, -109516, 100009, 137595, 24046, -111388, 12491, -12606, -413543, 66457, 53211, -95384, 3502, -132612, -214954, -214980, -242228, 91203, -177318, -32539, -93667, -284908, -138693, 20706, -393, -169930, 284656, 300892, 36075, -492525, 64945, -112450, 278798, -339189, 3528, -81382, -142106, 54706, 133981, 122522, -211401, 146871, 148135, -235573, 304049, -15211, 154756, 240895]
18630B40895A17410B2389e0117p1785H8004e7933A63905P7954a48885o0771k5906
18619b35562J2750a0827r2067H9757m3209G122b0950n8987J6372A10636d19155
18607B36655c24880r0718g6746l6954B30599a81839G8520J8348h0625F9988i5867
18595b27839c7697C12002a1902j28773k4671f8709A43816J05030A2730b23372
18584b24021K2609f8434K7467m08104m1379f3514l09080N8684B77219a77057j4976
18573a92033E8483a58383a6366n7071l81544B0941b10065n3685K3244c862l78771
18562c82633b4501o4196I4712a21188N3961C9564j5226M2208b7583B8431J45842
18551A74273c03141H340c01872f1864a7894A57595C0990a33970j95296J18003
$$ y = [240895, 117410, 22389, -50117, -121902, 88004, -57933, 163905, 241859, -148885, -209656, -235562, -222812, -10827, -102894, 89757, 46548, 7122, -20950, -79937, -63565, 110636, -419155, 236655, -324880, -415598, -76746, -113700, 230599, -181839, 78520, 96868, -80625, 69988, -95867, -227839, -37697, 312002, -11902, -140675, -165346, -68709, 143816, 248846, 12730, -223372, -224021, -201412, -68434, -40967, -449071, -490450, -63514, -372594, -313910, 277219, -177057, -192033, 58483, -158383, -16366, -73437, -454981, 20941, -210065, -263750, -240506, -3862, -382633, -24501, -88697, 94712, -121188, -67227, 39564, 24338, 66546, -27583, 28431, 174273, -303141, 8340, -301872, -61864, -17894, 157595, 30990, -133970, -329266, -211263]
18541b11263j18774A67603b4843B12872c15315e13m274B6867a44867R447E9016
18529i6327e786k0600A63907a9451B24451G3688K9076b50570a00894F0923p742
18518E3181c18825h5360F9663N2341a3052j57176B00401i5845E0960a40312e9104
18506f2687j28675O2934A58955c18430Q2185A43331e3603A9087N8909a77242J8482
18495a58760q79A42218d89657A24285B64a22168a0147r6343j31609h0266o7887
18484a48153H4396d162j85120j76130A9125a07029g407l71885i9115k5310j15858
18473b40283A0985C35g9322j46182a04912a67A42811o3853B3593a55731H502a12160
18460A89162a34630C7008c32135I7641C1052a23206e1677j00916A3381b0429B4728
$$ y = [-211263, -330037, 167603, -24843, 212872, -315315, -513, -4787, 26867, -144867, -135420, 59016, -96327, -5786, -26386, 163907, -19451, 224451, 73688, 102764, -250570, -100894, 60923, 53181, -318825, -85360, 69663, 122004, -13052, -170228, 200401, -95845, 50960, -140312, -59104, -62687, -191362, -128428, 158955, -318430, -236245, 143331, -53603, 19087, 77996, -177242, -158760, -159639, 142218, -489657, 124285, 264, -122168, -10147, -106490, -238099, -80266, -148153, 84396, -4162, -189282, -365412, 19125, -107029, -7407, -379292, -99115, -124425, -240283, 10985, 335, -79322, -225504, -104912, -167, 142811, 78958, 23593, -155731, 8502, -112160, 189162, -134630, 37008, -332135, 97641, 31052, -123206, -51677, -152593, 13381, -20429, 24728]
18448a07422l4810j70684a28518A55288a85835D8290h7957A72814O3270c8800
18437F2450f9951D8397e8592C4948b36795o690C24065c1569H0717J15523n0553
18426A45687c12084a39858p5271c6072A36177c6177k11871M0195I376b0498k85045
18415c05543d616D442c5014A26274n6524i8954A97588d0459B1906a35799A12661
18403A32146g5262B02126b6670j54186l5016G526c08931D11120a5677m4638E3224
18391a49736M0480J9605p7733j41872J02231g9249m0297j63434i6121G152P9050
18380H6202N4575a1658L472j24587A88508j1848a82377B78913a56104e607o268
18369a1875j52345K9499A19143L08859a46451l3760P0846D2049L7693J93253O281
$$ y = [-107422, -142232, -312916, -128518, 155288, -185835, 48290, -87957, 172814, 236084, -38800, 62450, -69951, 48397, -58592, 34948, -236795, -243485, 324065, -31569, 80717, 196240, 145687, -312084, -139858, -215129, -36072, 136177, -36177, -248048, -207853, 9376, -20498, -305543, -4616, 4442, -35014, 126274, 69750, -98954, 197588, -40459, 21906, -135799, 112661, 132146, -75262, 202126, -26670, -180856, -215872, 7526, -308931, 411120, -15677, -60315, 53224, -149736, -109256, -89651, -167384, -309256, -207025, -79249, -119546, -282980, -96121, 7152, 86202, 140777, -11658, -8186, -132773, 188508, 176660, -182377, 278913, -156104, -5607, -11875, -164220, -134721, 119143, 428002, -146451, -180211, -109365, 42049, 79742, 272995, 279276]
18358B79276b07054C5036b64948a03246r3928D34805c018H2950b54309B7853a05324
18346A35420h574k35744g7436F2725b52728B32131q9418n0815a83392A25124b2245
18334D8789g5913j10808f8465k45483a39803A97142D9605a10725A84400b46213
18323D595a67348a0318B12929H4461M1235K1481g7234k22958a8211j67389P3396
18312a12204B43574a66458A64123R2418D6252i0842m4629I7416a62598A02322
18301a20758A48848h7675A79673b061j67697N2878K9794c4942B92669a99780j7817
18290b17597j06878a33437M0856b1348k47249a21561A64156a40171N4180j0830
18280i6821j88742A38936a09341b8378p7486N1070j0967m4115A87516l7933d10704
$$ y = [279276, -207054, 35036, -264948, -103246, -197174, 434805, -3018, 82950, -254309, 27853, -105324, 135420, -8574, -244318, -77436, 62725, -252728, 232131, 142713, 91898, -183392, 125124, -22245, 48789, -75913, -186721, -68465, -313948, -139803, 197142, 49605, -110725, 184400, -246213, 4595, -167348, -10318, 212929, 84461, 125696, 147177, -77234, -300192, -18211, -185600, -112204, 243574, -166458, 164123, 256541, 46252, -90842, -135471, 97416, -162598, 102322, -120758, 148848, -87675, 179673, -2061, -169758, -116880, -87086, -34942, 292669, -199780, -217597, -324475, -133437, -92581, -21348, -268597, -121561, 164156, -140171, -85991, -96821, -285563, 138936, -109341, -28378, -105864, -54794, -65761, -109876, 187516, 149583, -410704]
18268a06520n459C1843h3426k77167a20914l91899A55371i3666G6119b56810b2161
18256b42989a15804O666K0875C94431e53525E6239A045O1890N5968a60129A13297
18244E1044J33132a36823o9718B27005e6819B28387K0650A20087a71154E3636
18233E9774b35601A81346g467G5231b15997a6805j25135q2405B3116b53039H9986
18221f165A45207A4172a26498d4522e030j30392C8042J39789g0554k46963J13283
18210b04234k02523a22356H8570a88127F3799b61112q6308G9874a12100A51804
18199e121r9376I2223J8069a01548r9744A93306o6436F0426o315L1857a22155
18187A37444c9396m2645F6436d421k31090A06282a94719C29153b47342N066g8144
$$ y = [-106520, -111979, 31843, -83426, -360593, -120914, -512813, 155371, -93666, 76119, -256810, -22161, -242989, -115804, -109138, -88263, 394431, -553525, 56239, 1045, 62935, 118903, -160129, 113297, 51044, 184176, -136823, -206541, 227005, -56819, 228387, 249037, 120087, -171154, 53636, 59774, -235601, 181346, -7467, 75231, -215997, -16805, -141940, -224345, 23116, -253039, 89986, -6165, 145207, 14172, -126498, -44522, -5030, -135422, 38042, 177831, -70554, -317517, -204234, -406757, -122356, 88570, -188127, 63799, -261112, -347420, 79874, -112100, 151804, -5121, -104497, 92223, 110292, -101548, -201292, 193306, 126870, 60426, 54111, 85968, -122155, 137444, -39396, -82041, 66436, -4421, -235511, 106282, -194719, 329153, -247342, -242276, -78144]
18175A16290C1486h072q6187E7174b3710E5098k0584i0841j02905D15806g0197
18163B0526c2362J2155k4134m6955I4711O4262c93028B3140J07443f6792B26921
18151a75788P9934D6874a50155f8931j30423n4050A09301b11538B9431N6130a09534
18139e9593j91616J14718F6511k3586a54605C20553d9387J3988k81520D3207g1899
18127F7144j3594h9196p3971j37439b7671A44470c24383B8936c4399B20995e71061
18115B00757p6281M3696b03246k9474A53062B6858d1359I2400k418i6140I8660
18103F9083a67574E6218a50986A0299d0850k6619k13161N8107A36610a4416L917
18092a0499b378j92172d9470G8684b56222i0655B82789l826a71633P7622k21552
$$ y = [116290, 31486, -8072, -94259, 57174, -23710, 55098, 34514, -90841, -193746, 415806, -70197, 20526, -32362, -20207, -44341, -91296, 94711, 158973, -393028, 23140, 130583, -66792, 226921, -175788, -95854, 46874, -150155, -68931, -199354, -253404, 109301, -211538, 29431, 85561, -109534, -59593, -251209, -136491, 66511, 42925, -154605, 320553, -49387, -35399, -316919, 43207, -71899, 67144, 53550, -89196, -163167, -300606, -27671, 144470, -324383, 28936, -34399, 220995, -571061, 200757, 124476, 168172, -203246, -232720, 153062, 26858, -41359, 92400, 89982, -96140, 98660, 69083, -167574, 56218, -150986, 10299, -40850, -67469, -280630, -222523, 136610, -14416, -10499, -2378, -194550, -49470, 78684, -256222, -90655, 282789, 278963, -171633, -94011, -315563]
18081c15563i3225a99p8417C2304a17473k14695b6664B4932a02240A08841c04201
18069a72062A1248R7628a27759o8921P4059A49196i4738E7313a88326P8802B09266
18057a83913f6612J4415n6424G41a21969b0357H7625c1121A1905b95408a43956
18045B0801J04842a55481N3454O943c3410q8936b0741A66755M7776q3884J08965
18034B39612b18676f5493b372l6932E7307M158b93384j7918A07699g0342A57670
18022B2384i0520n7717B4966Q0354K5631a70977B75542a39889G2293c34864Q2071
18011b52793c6536j15386q817A47274A4154c26925A89465g7445A65322A5745J04212
18000A19957c80230a72895f9180c2627m0771n9665G011N4593b63887M9308G3758
$$ y = [-315563, -93225, -199, -78616, 32304, -117473, -332168, -26664, 24932, -102240, 108841, -304201, -172062, 11248, 108876, -127759, -196680, -122621, 149196, -94738, 57313, -188326, -109524, 209266, -183913, -66612, -52197, -108621, 741, -121969, -20357, 87625, -31121, 11905, -295408, -143956, 20801, 125643, -155481, -102027, -95084, -33410, -122346, -20741, 166755, 214531, 130647, 239612, -218676, -65493, -2372, -39304, 57307, 61465, -293384, -311302, 107699, -70342, 157670, 22384, -90520, -148237, 24966, 105320, 130951, -170977, 275542, -139889, 72293, -334864, -252793, -36536, -151922, -160739, 147274, 14154, -326925, 189465, -77445, 165322, 15745, 119957, -380230, -172895, -69180, -32627, -73398, -133063, 7011, 61604, -263887, -214579, 73758]
17988b08330D6990a19305C3839J70710c1313F636K49497a45928I815a80185C0582
17976D7319J2040b15988A41017b54962C3403N0931l1487L18824a6253j68086C33733
17964a28626A7952a23297D45477b74358J34497B40948m6213m1631a54186A07782
17953i2588A45865a48382j7595F1909a59455C00646E1090a92075A43088a61812
17942c571l18059f1040o2729N8067A68308J2804e878m5158o6328B4832a96113
17930B05408I5657K57070j1233a12580B26162a9289D02380B9976M3283A9028b71921
17918b78295J21579k29582b1246j74238L9833B00214K2897a80253e1426j73882
17908b25308B9708J11925K65795A89757b81254D9860Q6558P6834F8789J23274
$$ y = [-208330, 46990, -119305, 33839, 204549, -31313, 6636, 256133, -145928, 9815, -180185, 30582, 47319, 59359, -215988, 141017, -254962, 33403, 84334, 52847, 371671, -16253, -184339, 333733, -128626, 17952, -123297, 445477, -274358, -139861, 240948, 194735, 153104, -154186, 107782, -92588, 145865, -148382, -165977, 61909, -159455, 300646, 51090, -192075, 143088, -161812, -3571, -321630, -61040, -123769, -65702, 168308, 181112, -5878, -51036, -117364, 24832, -196113, 205408, 95657, 352727, 341494, -112580, 226162, -19289, 402380, 29976, 73259, 19028, -271921, -278295, -156716, -386298, -21246, -195484, -155651, 200214, 223111, -180253, -51426, -225308, 29708, 141633, 407428, 189757, -281254, 49860, 136418, 213252, 68789, 192063]
17898A92063J1371I230L8625J368a78127A66184E5291f9427A01156m7305J67398
17887B21249a90030A8816a01849A82097k2863m388a22722b4834A49019b3669k9954
17876e3623B74804a62071O7054J3412j59029A89442a15104j72545J32367a0683
17865c36600A49888c04860a32287c2165l405A2611a06627j90560B80265k9508
17855B50757A22791K3864a01652m8154q2819k7707P0701B29429c1943j53938A3431
17843B6194a90997K5002e3732A02503b66883g9303j54953j14673c0005k57112
17833b87117H1547a4756j16824c6671A28036c9880H0992J12947H5149D869f8009
17821A93137q8637j8169b47047A7034g8831b6406n1030H1923P4009K47649a49001
$$ y = [192063, 203434, 9230, 47855, 49223, -178127, 166184, 55291, -69427, 101156, 53851, 221249, -190030, 18816, -101849, 182097, 159234, 154846, -122722, -24834, 149019, -23669, -53623, 274804, -162071, -95017, -81605, -240634, 189442, -115104, -287649, -155282, -10683, -336600, 149888, -304860, -132287, -32165, -35570, 12611, -106627, -297187, 280265, 250757, 122791, 146655, -101652, -149806, -232625, -260332, -189631, 229429, -31943, -185881, 13431, 26194, -190997, -165995, -53732, 102503, -266883, -79303, -234256, -348929, -30005, -287117, 81547, -14756, -131580, -36671, 128036, -39880, 80992, 193939, 85149, 4869, -68009, 193137, 104500, 86331, -247047, 17034, -78831, -26406, -77436, 81923, 155932, 403581, -149001]
17809a85655n1772A5590K73435b82011A56814F1227J38021b02924b7419j36864
17799a64283j57719J31478k21273h2706m9805c1298B16700F2030K632k9425d4617
17787C50346L8049c59211B3052j1472J17353b0294K189n85433B8688c82969D25904
17775B85124J48286h8288C1961N00758G84b36509a06995B72408j23284c09128
17764B92346o6441B1603Q5525J35458B5582a40260b8204j69876R0171J9791A00412
17752b66514j13346I6674O6665C4087A6782J96835c12007c1963A4137N5013b3317
17740a37434C42078b0632B37248F7231P4155b32065L9969A98350a27653D2758
17729A79092b40236B14196b9848j9097e919C0318K98984B6664d9537j46593j27632
$$ y = [-185655, -237427, 15590, 289025, -282011, 156814, 61227, 199248, -202924, -27419, -164283, -322002, -190524, -411797, -82706, -132511, -31298, 216700, 62030, 64662, 35237, -44617, 350346, 388395, -359211, 23052, 11580, 128933, -20294, -18105, -603538, 28688, -382969, 425904, 285124, 433410, -88288, 31961, 532719, 784, -236509, -106995, 272408, 149124, -309128, 292346, 225905, 21603, 107128, 242586, 25582, -140260, -28204, -198080, -107909, -88118, 100412, -266514, -379860, 96674, 163339, 34087, 16782, 213617, -312007, -31963, 14137, 69150, -23317, -137434, 342078, -20632, 237248, 67231, 141386, -232065, -192096, 198350, -127653, 42758, 179092, -240236, 214196, -29848, -48945, -5919, 30318, 329302, 26664, -49537, -196130, -323762]
17718c23762c6594A10658f6590E2254a24639B49443C5980K31545b28349j0048
17708b38397A64329m5811J98287A8672J66456b09321R6774B12101h9021l42901
17698d31922f291A26719a532A12544A8275J47336b6270j10720K7957G1470a83354
17686F1566f6273A16385a99728E6245i5525B49626d9519C16736a08870Q833A53872
17674b4635A15065A7487K2265K7327b65650e8856B69824a11217C58071A10605
17663A92418o6457K1985o1132P7627D8833N267b19827A9943J03306b01014A39836
17651i6604A13711O0257b18151A27220i4510K3159E7309a2367C08246a75430A86169
17639A25195N887a27179n233c389A93890E9793b1217A14116a91710Q3648j76384
$$ y = [-323762, -36594, 110658, -66590, 52254, -124639, 249443, 35980, 267525, -228349, -238397, 164329, 118518, 316805, 18672, 185128, -209321, -112547, 212101, -89021, -431922, -6291, 126719, -1532, 112544, 18275, 165611, -26270, -136990, -109033, 71470, -183354, 61566, -66273, 116385, -199728, 56245, -95525, 249626, -49519, 316736, -108870, -100037, 153872, -24635, 115065, 17487, 39752, 67079, -265650, -58856, 269824, -111217, 358071, 110605, 192418, 125961, 147946, 86814, 164441, 48833, 54100, -219827, 19943, 123249, -201014, 139836, -96604, 113711, 173968, -218151, 127220, -94510, -71351, 57309, -12367, 308246, -175430, 186169, 125195, 131082, -127179, -132412, -3389, 193890, 59793, -21217, 114116, -191710, -108062, -284446]
17628b84446J33562C8159I391c9604k50284J28876H3395a53000O4506k40377J46117
17617a82754E6233M3027J00985Q9257a38341A36056M0230C1689K30550M8703J01403
17606D12345b81024C52212a11453A50954d3787C3415K66495j4062a73724j19150
17596b92874A69181L26872B21372F5030a45814B52410C9087K39879f5328C22379
17585C6116a09875j08320R6848A77116b7534C2594b09084L3856C2646L83380f0852
17573b38902d0943r1479j02723e2544J3957B31624M7500A26168C7111a12407d2690
17561A21793R5681f0497a0946H6992b26145d4706A97373m8927f0754H9288O3657
17550A52945K08745b4250h097C40518e7214A94801b78921a4250j43263A28916
$$ y = [-284446, -150884, 38159, 9391, -39604, -289888, -161012, 83395, -153000, -88494, -328871, -182754, 56233, 99260, 200245, 289502, -138341, 136056, 176286, 31689, 262239, 310942, 412345, -281024, 352212, -111453, 150954, -43787, 33415, 299910, 285848, -173724, -292874, 169181, 496053, 221372, 65030, -145814, 252410, 39087, 278966, -65328, 322379, 36116, -109875, -218195, -121347, 177116, -27534, 32594, -209084, -175228, 32646, 416026, -60852, -238902, -40943, -132422, -235145, -52544, -38587, 231624, 279124, 126168, 37111, -112407, -42690, 121793, 217474, -60497, -10946, 86992, -226145, -44706, 197373, 148446, -60754, 89288, 152945, 361690, -24250, -8097, 340518, -57214, 194801, -278921, -14250, -157513, 128916]
17539B25089N5267a1633A17727K51765j60938D2864K22831J26284a43864c4373
17528a3993A75486e285A82470J049g5239q3276A64532D7196J75606K2683a25763
17516d05346A00996K42452G0423K13996o3596J4774m8729r2788J26665g2773G7468
17504A64881e9988A49843J55446j00180a8696L216j0904o1939A45052D0156K50046
17493B90202K03834k08055K01167j20430m7132g6356A09089O1927F0899a27915
17482A56570K78331j05526j10716J30479m5041a43285f5505C79749F3011L94668
17472D57679g4122B69086c8061B87945j22737F0342b97933A85343C108K63868
17462B66976i9970D9084b7272D7594K49640C8665b25961B13298a33943A7326J82243
$$ y = [225089, 280356, -11633, 117727, 369492, 208554, 42864, 265695, 391979, -143864, -34373, -13993, 175486, -5285, 182470, 183519, -75239, -158515, 164532, 47196, 222802, 245485, -125763, -405346, 100996, 343448, 70423, 284419, 220823, 235597, 186868, 94080, 220745, -72773, 77468, 164881, -59988, 149843, 305289, 205109, -18696, -15480, -26384, -88323, 145052, 40156, 290202, 494036, 285981, 487148, 366718, 319586, -76356, 109089, 171016, 60899, -127915, 156570, 434901, 329375, 218659, 349138, 304097, -143285, -65505, 379749, 63011, 457679, -74122, 269086, -38061, 287945, 165208, 60342, -297933, 185343, 3108, 266976, -99970, 49084, -27272, 47594, 297234, 38665, -225961, 213298, -133943, 17326, 199569]
17451A99569J78754J11726A14493N7010m1157N13430A26407K17097H8915M53023
17441E41938I1310M15613B19451A1652J69663K10390J84768k18880j55680j8870
17431A83043J27598n3225A05362K80652M3628a429C89700A23036J44800C4359
17420F6180L22778e0257C06329j44942D8400M83848k62466L37628B78707M0700
17410C19407J21820I4018O7747K0130k7812K60166k6283A51351K50301C1706f5250
17398b5254B02034G4862L44828m0086E1347K66316m961f1728C95255j63306q1345
17387A50604n0452L57318b7203A74034m216J44134J03197f8191l2065E4064A5045
17375f0285k0184F2981C0439J13216A0339K03647O7277H4358J78884a6294D7876
$$ y = [199569, 378323, 490049, 114493, 171503, 130346, 643776, 126407, 343504, 88915, 541938, 91310, 506923, 219451, 11652, 181315, 391705, 576473, 357593, 201913, 183043, 310641, 257416, 105362, 386014, 429642, -1429, 389700, 123036, 267836, 34359, 66180, 388958, -50257, 306329, 161387, 48400, 532248, 269782, 607410, 278707, 319407, 441227, 94018, 161765, 181895, 154083, 414249, 387966, 151351, 401652, 31706, -65250, -25254, 202034, 74862, 419690, 379604, 51347, 317663, 312702, -61728, 395255, 231949, 150604, 100152, 457470, -27203, 174034, 169818, 313952, 417149, -68191, -100256, 54064, 15045, -60285, -80469, 62981, 30439, 143655, 10339, 213986, 281263, 84358, 263242, -16294, 47876]
17363I0054b32530A36649k4382R4067h508k75075B11008G0306j431R5992J60652
17352C25519p7860P3055A54700g5122A33278K74315d03281C48610D337J35324
17342A39661J63726a14848b0871A03338J78606j3820c8665C15917j57280o6189
17332I2448a48399H8004R5540F1450a87105B09218E9174a08876A15542K20929
17322C36471A52192l037p1115h2648C29333P5489j40206i2009E9445h5620A31325
17310F6889M68307c17371B30573l2363i8485B44282D7247M07735k18495G8904
17299A46834b51556I0991P5371a33467B91464j10837N0150O0736r0585J24468
17289C25396g2660A52704K42333E286M52551j48338A46640K8927L0374a1245C35923
$$ y = [90054, -232530, 136649, 112267, 206334, -8508, -283583, 211008, 70306, 68875, 164867, 325519, 247659, 320714, 154700, -75122, 133278, 407593, -403281, 348610, 4337, 139661, 303387, -114848, -20871, 103338, 281944, 268124, -38665, 315917, 158637, 92448, -148399, 88004, 183544, 61450, -187105, 209218, 59174, -108876, 115542, 336471, 152192, 149155, 78040, -82648, 329333, 404822, 264616, -92009, 59445, -85620, 131325, 66889, 535196, -317371, 230573, 198210, -98485, 244282, 47247, 454982, 236487, 78904, 146834, -251556, 90991, 166362, -133467, 291464, 180627, 230777, 291513, 200928, 325396, -72660, 152704, 395037, 5286, 457837, 309499, 146640, 175567, 205941, -11245, 335923]
17277A35064A9393J66357q7620K43157P690a9457C08362j33546K65898E6325J14064
17266A70389E0491N60911A02652c8928D64109A97288k0203J8774a4606C32401
17255a23844C688a15086F3286L95624c8685C59488b88212C26225C5121L5163J99248
17244B69532L2975K6354I1664L00379A52196J8768m2299C0756J73681F8508K57141
17233C25649q9658E886L77685C5120J78422J37922I043L35019n0445q7254N2432
17222B58795g0697F3542J83326K26948B35805J19021I2958K94872A82982a61402
17211C32328n0872J51308j11098J0643H6807M1021J44395J49877B03784K00917
17201D04701j41726L51481A71750J13538N5838q0888a47554D98086k06346j06449
$$ y = [135064, 19393, 185750, 98130, 341287, 348977, -19457, 308362, 174816, 440714, 56325, 170389, 50491, 611402, 102652, -38928, 464109, 197288, 177085, 195859, -14606, 332401, -123844, 3688, -115086, 63286, 458910, -38685, 359488, -288212, 326225, 35121, 70284, 269532, 302507, 328861, 91664, 392043, 152196, 170964, 128665, 30756, 204437, 68508, 325649, 235991, 5886, 383571, 35120, 213542, 351464, 9043, 344062, 293617, 206363, 258795, -70697, 63542, 246868, 473816, 235805, 354826, 92958, 387830, 182982, -161402, 332328, 281456, 432764, 321666, 332309, 86807, 127828, 272223, 422100, 203784, 404701, 262975, 614456, 171750, 285288, 341126, 260238, -147554, 498086, 291740, 185291]
17191A85291k69J44757P26F5452K7646J219J88929O02050B61579L07827k57026
17180C12380j15522J02376J63570n2113A79252L36060k8170j28206j56200J15242
17170C17978k3165J03583r4722i871B85326q8262O4530p8289J0712L0222J08605
17159C32844J95258k57005F4394d7199b854B85246c5837A70974L78936k46777
17149C03133p7478A2069L23709K34882A55447M06783k11878L4819J32184k00939
17139C16416J30787J2171o7580j71816O0295j25936K40014j38628K42074A73934
17128H8085L58241F6467J29827K95483K43612j23067k76791L39320B97081L6121
17118C33202K69072D9642M43192j07809j72722J92256j0556M9082j47196P7421
$$ y = [185291, 185022, 329779, 330505, 65452, 93098, 94317, 283246, 885296, 261579, 569406, 312380, 196858, 299234, 462804, 410691, 179252, 515312, 487142, 358936, 202736, 317978, 294813, 398396, 303674, -9871, 285326, 197064, 261594, 183305, 194017, 224239, 332844, 528102, 271097, 64394, -47199, -2854, 285246, -35837, 170974, 549910, 303133, 225655, 12069, 335778, 570660, 155447, 562230, 350352, 385171, 517355, 316416, 447203, 459374, 391794, 219978, 280273, 154337, 394351, 255723, 497797, 173934, 88085, 446326, 66467, 196294, 491777, 735389, 612322, 335531, 674851, 297081, 333202, 602274, 49642, 492834, 385025, 212303, 404559, 394003, 443085, 295889, 373310]
17108C73310K93357k65528a10807C25412r9851P9332O358L11255j45058q5571
17098C91877L4643j65552L40920N6774j33128j08895j92192L40692E3285L34152
17088C87437K90676k78963J38044n3733J87051B88603O562L28262q9721B66308
17077D49806L3340l1749j18864L14331J42392A63702J62430J3061j608p3013K54584
17066E19156j51835K33581j05817J13229j84837K23556j53634J12945L2076j68223
17056D70197K36480o5726n772j50606L4650J6384k07149K41976q5122K16803n7820
17045F44295N4809o612B30055J06503K21616j501J09416j74677p5306L28576J4392
17034G59074j29316k17505l7545L52844k56283J41524N166J25506M2963j57044
$$ y = [373310, 666667, 401139, -110807, 325412, 225561, 304893, 311251, 622506, 477448, 391877, 426520, 260968, 601888, 658662, 525534, 416639, 224447, 565139, 53285, 387437, 678113, 399150, 537194, 483461, 670512, 288603, 295165, 623427, 533706, 266308, 449806, 483146, 451397, 332533, 646864, 789256, 163702, 326132, 339193, 337585, 264572, 519156, 367321, 600902, 495085, 608314, 423477, 647033, 493399, 606344, 638420, 470197, 706677, 640951, 635179, 484573, 519223, 535607, 328458, 570434, 485312, 702115, 644295, 699104, 692492, 230055, 336558, 558174, 556673, 666089, 491412, 416106, 744682, 759074, 629758, 412253, 374708, 727552, 471269, 612793, 617959, 743465, 786428, 629384]
17024F29384j51380P355P9238L4615K31487j17873J63920q2972k80475L68031
17014H81330D02367J17176J25880j11538K29338k5005l24785M39939j26483j25912
17004F00977j58117J94277K76480j27251P4203j15775j20276J14785K813R390
16994G51506l6924j56944j7900P1769L48963j12500R3465m37353j718K77320K00666
16983I80350J43089l78245J55754l64750J49084K09274J9245q6542o7182P2280
16973H32357M58391m57411o3057L23789j81229J13706j93380M6411j1496P3208
16963I41289r5524L922J69709q9533K80490k0560j92312J56645k18756j31154
16953H04216M27904E56950N15679J93248Q347j27318R4091m3337j72060J23100
$$ y = [629384, 478004, 485359, 564597, 599212, 830699, 712826, 876746, 793774, 513299, 881330, 402367, 519543, 645423, 533885, 763223, 738218, 413433, 853372, 726889, 600977, 442860, 637137, 913617, 786366, 860569, 744794, 624518, 739303, 742116, 751506, 714582, 557638, 539738, 611507, 960470, 847970, 941435, 504082, 502364, 779684, 980350, 1123439, 745194, 900948, 536198, 685282, 894556, 913801, 827259, 760077, 832357, 1290748, 833337, 770280, 1094069, 912840, 1026546, 833166, 879577, 868081, 941289, 845765, 849687, 1019396, 929863, 1210353, 1189793, 997481, 1154126, 935370, 804216, 1232120, 556950, 1072629, 1265877, 1274224, 1146906, 1240997, 1197660, 1025600, 1148700]
16943A148700n0541K37447j94242O6924j81095J22236K36291k2454j71840M28077
16933A619503l85888j1572J62170r2483l0657P5914k20274M32907J38543j95842
16923A492321m9916J28303k98661L51333j63403J93185k04509M3804K29831k30904
16913A491384n7526K39370k67790M98300l79489k2749p9044L81892L2733l00262
16903A536819J20558J06051J10570K4764j8709j76660M42947l3348K10415m37434
16893A885973L17325o3546r571j52629J32589j10557K41170P9520k58432J69327
16883B231169P7327j23423L49966J7111k36237J13003l53443N22290J675k07880
16873B391558K23728j35734R5649o2138R0172q1572L9264R7301J62301L8934M0402
$$ y = [1148700, 1098159, 1335606, 1141364, 1208288, 1027193, 1149429, 1385720, 1363266, 1191426, 1619503, 1233615, 1222043, 1384213, 1291730, 1261073, 1336987, 1116713, 1549620, 1688163, 1492321, 1442405, 1570708, 1272047, 1623380, 1459977, 1653162, 1448653, 1492457, 1722288, 1491384, 1433858, 1673228, 1405438, 1903738, 1524249, 1501500, 1422456, 1804348, 1837081, 1536819, 1657377, 1763428, 1873998, 1898762, 1880053, 1703393, 2146340, 2112992, 2323407, 1885973, 2203298, 2139752, 2130181, 1977552, 2110141, 1999584, 2240754, 2320274, 2061842, 2231169, 2308496, 2185073, 2535039, 2552150, 2315913, 2428916, 2075473, 2597763, 2599438, 2391558, 2615286, 2479552, 2575201, 2513063, 2603235, 2521663, 2560927, 2658228, 2820529, 2859463, 2899865]
16862B899865k35982P9935K02811o1726r812J71758m2787K57275K21973K900l74098
16851C112112L81003j65687J16490K22424M7274P1306j01633O9684j73778L83339
16841C962534P2243M8278J25298L8727J14692q4595K0472K66640k47263R9162
16831D416188L65425j76282J52553k13628N3771N15103q5555M22787K963k30818
16821E222507J25311K44589L02300l41616N45522r8304K02172J28601o3774P6286
16811F343594K53882j35036L50765K17743K07291K39180K43436j9202J80596k214
16801G880035K46894K97556K66784R4070L68809R5863J13437L11448J84945J44749
16791A0004590O34122J22895J69006M69089K31205J67407L61253L43866L22989
$$ y = [2899865, 2663883, 2743818, 2946629, 2884903, 2875091, 3046849, 3004062, 3261337, 3483310, 3486210, 3112112, 3493115, 3327428, 3443918, 3666342, 3713616, 3784922, 3683289, 3752973, 3579195, 3962534, 4034777, 4083055, 4208353, 4247080, 4361772, 4277177, 4297649, 4564289, 4317026, 4416188, 4781613, 4605331, 4757884, 4544256, 4598027, 5113130, 5027575, 5450362, 5453325, 5222507, 5347818, 5592407, 5894707, 5553091, 6098613, 6000309, 6202481, 6331082, 6267308, 6343594, 6597476, 6462440, 6813205, 7030948, 7238239, 7477419, 7720855, 7701653, 7882249, 7880035, 8126929, 8424485, 8691269, 8785339, 9154148, 9250011, 9363448, 9674896, 9859841, 10004590, 10638712, 10761607, 10930613, 11399702, 11630907, 11798314, 12159567, 12503433, 12826422]
16782A2826422N14370K95393K04042O83638L86585M07771M14479N87127N31218
16773A6851045P12666K48062Q55604N02724O17948N09464J117523J22088J076084
16764B2613208J341323O81685O52642J060109J047237J222196J171728J390967
16756C1181095J172630Q92627K053900J272260K078212J393161J806747K380750
16748D4231382J772292K496243K449950K426302K796899L156814K818652L476523
16740F5625057L817002L568122M103698M650061M444473M912649N482840N015247
16732A01619149N941084O364225O530254O618562O720380O986692P134192O997064
16724A54911602O937133O519839N951570N482717M454833L981697K695026J667715
$$ y = [12826422, 13340792, 13636185, 13840227, 14523865, 14910450, 15318221, 15732700, 16319827, 16851045, 17563711, 17811773, 18667377, 19170101, 19788049, 20297513, 21415036, 21537124, 22613208, 23954531, 24636216, 25288858, 26348967, 27396204, 28618400, 29790128, 31181095, 32353725, 33246352, 35300252, 36572512, 38650724, 40043885, 41850632, 44231382, 46003674, 48499917, 50949867, 53376169, 56173068, 59329882, 62148534, 65625057, 69442059, 73010181, 77113879, 81763940, 86208413, 91121062, 96603902, 101619149, 107560233, 113924458, 120454712, 127073274, 133793654, 140780346, 147914538, 154911602, 161848735, 168368574, 174320144, 179802861, 184257694, 188239391, 190934417, 192602132]
16716A92602132M66706n32971k234246k693215m422645m694606n823879o309826
16708A66357450o819821o834566p078413p211768p364294o954638o792656o279118
16700A11022176o073199o095637n536733n518504m560407m646310m293617m130332
16692G0167437m168693l403661l071680l216546l090127k457518k589651k198667
16684D5970894k118639k141167k203776j834274j758661j479131j162456j918161
16676C1354629j220250j248544j243998j167415n50038j348669j006519q52810
16668B2716386p21175m75108j410829n00444m52769p13699o62097n32338p63332
16659A6484595o06571m93768l02982q17168m06282j50012l83314q96929k86222
$$ y = [192602132, 193068838, 192535867, 190301621, 187608406, 183185761, 178491155, 172667276, 166357450, 159537629, 152703063, 145624650, 138412882, 131048588, 124093950, 117301294, 111022176, 104948977, 98853340, 93316607, 87798103, 83237696, 78591386, 74297769, 70167437, 65998744, 62595083, 59523403, 56306857, 53216730, 50759212, 48169561, 45970894, 43852255, 41711088, 39507312, 37673038, 35914377, 34435246, 33272790, 31354629, 30134379, 28885835, 27641837, 26474422, 25924384, 24575715, 23569196, 22716386, 21995211, 21520103, 20109274, 19608830, 19156061, 18442362, 17780265, 17247927, 16484595, 15878024, 15384256, 15081274, 14264106, 13857824, 13707812, 13324498, 12427569, 12141347]
16650A2141347J1440q1758p19102l89536j14538m37431k32982l00128j31938n28951
16640I216423J401l18032q8400m38938j22619q07k66081j48116m58995L13918
16630G689754o54423Q7225n59399J46360k37034j22564J31233k68406o1537k0448
16620F130761k36737l31962p8875J82901k73842j60396q3707j27728j74306N9708
16610D905817k29055k329Q4076l03545M2083j41972l56388J4745M1260k88115
16600C766577N2152k40051J27328J76999j6946m66600j6524J6396j1820J8547
16590C406058J83605k45603j68561l65734j07222L35255k79581K51893k50128
16581B759982J04904r5043j27415L91108o31227N8717Q9958j68124K97368l69146
$$ y = [12141347, 12152787, 12071029, 11351927, 10962391, 10847853, 10410422, 10177440, 9877312, 9745374, 9216423, 9217824, 8899792, 8811392, 8372454, 8249835, 8249028, 7982947, 7834831, 7375836, 7689754, 7035331, 7122556, 6563157, 6709517, 6472483, 6349919, 6481152, 6212746, 6151209, 6130761, 5894024, 5562062, 5483187, 5666088, 5392246, 5231850, 5148143, 5020415, 4846109, 4905817, 4676762, 4674433, 4758509, 4454964, 4497047, 4355075, 3998687, 4013432, 4054692, 3766577, 3818729, 3578678, 3706006, 3883005, 3866059, 3399459, 3382935, 3399331, 3387511, 3406058, 3589663, 3344060, 3175499, 2809765, 2702543, 3037798, 2758217, 3010110, 2759982, 2864886, 2769843, 2642428, 3033536, 2402309, 2461026, 2550984, 2382860, 2680228, 2311082]
16571B311082k4539Q3841j30678K47298j58671l13837K52963k19884P7804J08573
16561B233952k12153P9664q7288R00j84267J50115k8276M9713O0795l21194k34351
16550A507610M21164K57385l87257K0476J33766j57448o7105k18026M11498j53531
16540A768532j00152k5000J04217j99416J00235n62488Q28398l44619j91049K3466
16530A402124N7931m2249m2125J02488n3378p5448M0438J30052j38279J06249
16520A487803n07810j5481P9150N9885M91037l81614m41998J97287K04023R0000
16510A262282n6862J0212K0392j14235M3752M0542J3496M279l58523K12504j62743
16499I15096K27208m0362K79618j86484r0096k51652j18371M99275F02382L24238
$$ y = [2311082, 2286543, 2370384, 2239706, 2487004, 2328333, 2014496, 2267459, 2047575, 2125379, 2233952, 2021799, 2101463, 2014175, 2015075, 1830808, 1980923, 1952647, 2002360, 2063155, 1741961, 1507610, 1928774, 2186159, 1798902, 1819378, 1953144, 1795696, 1728591, 1510565, 1922063, 1768532, 1668380, 1643380, 1747597, 1548181, 1648416, 1085928, 1914326, 1569707, 1378658, 1402124, 1460055, 1417806, 1375681, 1478169, 1424791, 1349343, 1389781, 1519833, 1381554, 1487803, 979993, 964512, 1043662, 1103547, 1594584, 1212970, 770972, 968259, 1172282, 1262282, 1205420, 1215632, 1236024, 1121789, 1165541, 1206083, 1219579, 1223858, 865335, 1077839, 915096, 1142304, 1101942, 1381560, 1195076, 1104980, 853328, 734957, 1234232, 602382, 926620]
16489I26620J38444l08196J96306k01962L2975K70681k13806l5577M06341l78403
16479H33423k8430J71289k01514r8857k4975P6419K67367j06283j27103j4185
16469G47151J55161k29526K28024k71260O2333j77667j6348K88504q4195r646
16459F92531K39332k49712O6845m2306M75922D77682N0205K09096C52750M21181
16449G73931k73006K70769k24141N4597r0656j76081L7055N01484m23082J40202
16439E91072J79023O002j10577q1651J43648k5500n5415J37392j25018j94299
16429D64677J59960Q2548C28524N02729B43009P154K84576O1563j74498P9587
16419E01391j49070j4393K95486F4062Q5013M87990j10478j94094K30152B21361
$$ y = [926620, 1065064, 756868, 953174, 751212, 784187, 1054868, 841062, 805485, 1211826, 833423, 804993, 976282, 774768, 675911, 650936, 727355, 994722, 888439, 761336, 747151, 902312, 672786, 900810, 629550, 691883, 514216, 497868, 786372, 702177, 692531, 931863, 682151, 748996, 706690, 1182612, 477682, 527887, 736983, 352750, 773931, 500925, 771694, 547553, 602150, 511494, 335413, 372468, 873952, 450870, 591072, 770095, 776097, 665520, 583869, 727517, 702017, 646602, 783994, 658976, 464677, 624637, 707185, 328524, 831253, 243009, 250163, 534739, 596302, 421804, 501391, 352321, 337928, 633414, 64062, 149075, 637065, 526587, 332493, 562645, 221361]
16408D50154M7728j31575j0684o369A65130M8889J81782K44404r9189k48253q646
16397B84117N508M2501J17905J34725k19336j35735K54903J0730j01970J56203
16387E49551J62284B19654J86207j62036j11373J11890n8705Q498J86810j90279
16377A90666O5784A0153L43188j19670O4387o7687R482q0750N34773k71897r3141
16366C28838K7638j04834J0654J8521A34948L93999j57157k7674J19833q1133
16356C82816q6338R9504j86369M0037K18426A97795L51218j49710A48985O4266
16346B13251K96906E9742K31975J41473H8071J1742M0098J62714j3073J11625
16336D01177i286D04167d2113B64481A04574k9535N4165L0461P3504l2366m3080
$$ y = [450154, 497882, 366307, 355623, 349254, 165130, 214019, 395801, 640205, 541016, 292763, 284117, 289625, 332126, 450031, 584756, 365420, 229685, 484588, 495318, 393348, 549551, 711835, 219654, 405861, 243825, 132452, 244342, 185637, 194135, 380945, 190666, 256450, 10153, 353341, 233671, 298058, 230371, 239853, 159103, 693876, 421979, 328838, 356476, 251642, 262296, 280817, 134948, 528947, 371790, 344116, 463949, 382816, 296478, 395982, 209613, 249650, 468076, 197795, 549013, 399303, 148985, 213251, 510157, 59742, 291717, 433190, 88071, 99813, 139911, 302625, 289552, 401177, -9286, 404167, -42113, 264481, 104574, 75039, 129204, 159665, 233169, 200803, 157723]
16325A57723K31124A56846d5730D49484j69740L4669A56745F7811K78325a08915
16314c3610C14118j05480a3697A67867J91721A34413D1199K72710l4754A35696
16303D46049k01657M64946l43538A35270J27190n9811o4194M7337n4670K7696
16293A58818K01742g9831K0652k1627B11737j01430j2098j7239K39602C9552P2700
16282A12252P7885o4066k8009J43461L8785A07194c76960A99942J8029a06570
16271A26366d201F9796K6541P9044F5436J81357A01593R9130K922M0855a05946
16259B3206J9495Q1969J07029K1690E7292j2306N7775K91669a28325E0270a5936
16247A52872K18615j01959b07240G1675J38137h7818D16398j91878h419n2903
$$ y = [157723, 388847, 156846, -45730, 449484, 279744, 314413, 156745, 67811, 346136, -108915, -33610, 314118, 208638, -13697, 167867, 359588, 134413, 41199, 313909, 279155, 135696, 446049, 244392, 709338, 365800, 135270, 262460, 202649, 138455, 185792, 131122, 158818, 360560, -79831, -59179, -80806, 211737, 110307, 98209, 80970, 320572, 39552, 112252, 190137, 126071, 98062, 241523, 280308, 107194, -376960, 199942, 217971, -106570, 126366, -4201, 69796, 96337, 175381, 65436, 246793, 101593, 200723, 203645, 244500, -105946, 23206, 42701, 124670, 231699, 253389, 57292, 44986, 102761, 394430, -128325, 50270, -15936, 152872, 371487, 269528, -207240, 71675, 209812, -87818, 416398, 224520, -8419, -61322]
16237f1322B95173L4982I5495K09425h16B73506J03947k0092q0274a25981C3347
16225A66450K99394c6908A43670d7402K15C49227J59342B6318K46329b14107C73415
16213A40622a13355A69186n1055m7468a96239d6326A43567o0124B4545J23426
16203A47971k7967K888a62758B81372p7635a72954D5193b37355B82667b59399
16192H0111n006K50552a7579C23083p2639a38347B08167a64770D3143L2231l3960
16181D1414J10485l7424j9840g7331m2242B76224H5073b90175B41474b51358I1025
16169a14096I1346J41764l2794B953h2463j97391B23275l422J01764b2204F1093
16157A64625b3845A28443A3426J77993A6350a55226e5093l1877r67A03951M6335
$$ y = [-61322, 295173, 330155, 95495, 304920, -816, 273506, 377453, 357361, 277087, -125981, 33347, 166450, 465844, -36908, 143670, -47402, -47187, 349227, 508569, 26318, 272647, -214107, 373415, 140622, -113355, 169186, 118131, 70663, -196239, -46326, 143567, 83443, 24545, 147971, 120004, 122892, -162758, 281372, 203737, -172954, 45193, -237355, 282667, -259399, 80111, 75105, 325657, -17579, 323083, 250444, -138347, 208167, -164770, 43143, 75374, 41414, 151899, 114475, 94635, -77331, -119573, 276224, 85073, -290175, 241474, -251358, 91025, -114096, 91346, 233110, 200316, 2953, -82463, -279854, 223275, 219853, 321617, -22204, 61093, 164625, -23845, 128443, 13426, 191419, 16350, -155226, -55093, -86970, -87937, 103951, 150286]
16146A50286b99022R6240C69518c48513a33689C3460g1544B5389M3213J75240
16136B43842n3772l6565J18695E5961a70150j2530A24825f2739l6173n8597A50593
16124d4894B91353d0631k16416k6716J14895j26122D2759J19959a86735M5008
16114a41727A00802M4715c83146C19540j56960M7933b49010A9762c88583f5441
16103B85871i897D1578d5619i882H2066A4724J16600b8296j37289J6451A17517
16091f158E6663a77462g2362j5103F4525a5128B29889a76048c8476F0711L58783
16080D19494f1781j03812j29365A99420O0094q6769a93197A659R1655c69981D4447
16068A02165B2509J34210J83066h9191j29933c4893l1331H186b35370I166b75299
$$ y = [150286, -299022, -202782, 369518, -348513, -133689, 33460, -71544, 25389, 68602, 243842, 190070, 153505, 272200, 55961, -170150, -182680, 124825, -62739, -98912, -157509, 150593, -44894, 291353, -40631, -257047, -283763, -168868, -294990, 42759, 162718, -186735, -141727, 100802, 145517, -383146, 319540, 162580, 210513, -249010, 19762, -388583, -65441, 285871, -9897, 41578, -45619, -9882, 82066, 14724, 131324, -28296, -165585, -149134, 117517, -6158, 56663, -177462, -72362, -87465, 64525, -15128, 229889, -176048, -38476, 60711, 419494, -61781, -165593, -294958, 199420, 259514, 172745, -193197, 1659, 93314, -369981, 44447, 102165, 22509, 156719, 339785, -89191, -219124, -34893, -66224, 8186, -235370, 9166, -275299]
16056E9508a16881A33764b65605A8064J26612G0115c65922C37475l990A2962J00281
16045A13243k1179f3982C3116b14200E9152c1803l8922A60413B4079f90p9382
16034h0072j47591B75252a20381H1194O3663A7402P8039k848D1140c2577A69735
16022b20981r8060i646A94970E4151J32662a87787l8190O9908D690c18973A92009
16010c67303A07262c27475c0389G2736a67189I804K34279n8281e3600o3503j4648
15999a31751C46703c38757a47939C23750A2810K56616B3365J02447C0881J74907
15989B05788B4272J98805d0365C6916Q8376b9885C13348K26094k13908k7369f6984
15977b51878C9616d4505j31763Q7558A043J08931J24051c73266a8919B8921O6713
$$ y = [59508, -116881, 133764, -265605, 18064, 144676, 70115, -365922, 337475, 333485, 12962, 113243, 92064, -63982, 33116, -214200, 59152, -31803, -70725, 160413, 24079, -690, -80072, -227663, 275252, -120381, 81194, 144857, 17402, 95441, 92593, 41140, -32577, 169735, -220981, -319041, -9646, 194970, 54151, 186813, -187787, -225977, -156069, 4690, -318973, 192009, -367303, 107262, -327475, -30389, 72736, -167189, 9804, 244083, 185802, -53600, -117103, -131751, 346703, -338757, -147939, 323750, 12810, 269426, 23365, 125812, 30881, 205788, 24272, 223077, -40365, 36916, 125292, -29885, 313348, 539442, 325534, 298165, -66984, -251878, 39616, -44505, -176268, -88710, 1043, 109974, 234025, -373266, -18919, 28921, 95634]
15966I5634i5978F2900K97860b53352A92394a16534e6990A66108j9905a89866
15955A10042B032O8030h1332A05218f5456B36113b93998C4106f5452b8364j12700
15944a41064d1299A91942c58869B55333f7493k23623G15c17084E193k453c11471
15932e75263a58814o0370J03375B565O3846c46707A40437b02834A51513D8026
15921d3365m31873a45730l82792B8047c1333o5464Q023A51a96924i3355A34637
15909d669F7067a2053B24569f7908E223b14247P1006L3295C0052i1760B04529
15897I0545J37392b49404R8286B21521j7634b88391D0122a8876C42772j08859
15887B33913p956r3161f7153A61781J01533A580c6462A10384b17352A9856P247
$$ y = [95634, -95978, 62900, 360760, -253352, 192394, -116534, -56990, 166108, 146203, -189866, 110042, 2032, 70062, -81332, 105218, -65456, 236113, -293998, 34106, -65452, -28364, -141064, -41299, 191942, -358869, 255333, -67493, -291116, 715, -317084, 5193, 2740, -311471, -575263, -158814, -219184, -115809, 2565, 66411, -346707, 140437, -202834, 151513, 48026, -43365, -475238, -145730, -528522, 28047, -31333, -96797, -88774, 151, -196924, -93355, 134637, -4669, 67067, -12053, 224569, -67908, 5223, -214247, -143241, -109946, 30052, -91760, 204529, 90545, 227937, -249404, -151118, 221521, 203887, -288391, 40122, -18876, 342772, 233913, 225957, 132796, -67153, 161781, 263314, 1580, -36462, 110384, -217352, 19856, 27103]
15876B7103P8484a25855h051p8636C9226J27346a27564N7924G2647A5639c45469
15864b74376g3309n4570q2112n8612B19685O686H1691a06770k16730C4821a85521
15852a13936B12891h3061A44452Q0454h0783c4767m36916C9134J7329b23175J02081
15841a21094A32147a23301l0047C6859e7088A59156E4081Q4959a50238l4784A08528
15829A54747c59374i2621A9308c76761O9615C9819a48120A30631k9368b51435
15818d8665j07261A69713C7100M8940e524j39047J0008N4219k97568f0441G9404
15806a18270I8584a07916l34541a24591j34887B461P2796O1010h9324G9387h1512
15794a29412D2069a33007j7490A91248a22914q7182l6793A36826n9464N1737d8549
$$ y = [27103, 105587, -125855, -8051, -86687, 39226, 166572, -127564, -69640, 72647, 15639, -345469, -274376, -73309, -127879, -209991, -268603, 219685, 226371, 81691, -106770, -323500, 34821, -185521, -113936, 212891, -83061, 144452, 224906, -80783, -34767, -471683, 39134, 56463, -223175, -121094, 132147, -123301, -153348, 36859, -57088, 159156, 54081, 139040, -150238, -185022, 108528, 154747, -359374, -92621, 19308, -376761, -307146, 39819, -148120, 130631, 101263, -251435, -48665, -155926, 169713, 37100, 86040, -5524, -144571, -134563, -80344, -377912, -60441, 79404, -118270, 98584, -107916, -442457, -124591, -259478, 2461, 75257, 136267, -89324, 79387, -81512, -129412, 42069, -133007, -150497, 191248, -122914, -210096, -246889, 136826, 77362, 129099, -48549]
15782g9808B19182j02272g0906j70664B34588B0735J77839c78195c1637D6059
15771h4846m1136k48185c6858J7131j29720E1436L9188L265O0639q57E3687D542
15758A63164i1459H9274n331J39470j00638N6228l6993a9698n0330F3209P6894
15747A40103J1312b04109N6715c0246j04846B17787A5887b53746P8377A22257
15736f366l38671D2215c3556J6527B9496Q4626b3452q8853b2008I6826h5757J3442
15724g2315k66325a15109G9891i4269j41272a2675A07239J9638b9529j96668g4458
15712A75277a05363a4969I5148g6338p5825J6882L0058C85766a13624n8491F1540
15700a52084E590e1792O40I901a57559b2454j31791c610o4659j60204a233A46336
$$ y = [-79808, 219182, 116910, -70906, -241570, 234588, 20735, 198574, -378195, -31637, 46059, -84846, -125982, -374167, -36858, -19727, -149447, 51436, 90624, 93889, 154528, 153671, 53687, 4542, 163164, -91459, 89274, 83943, 223413, 122775, 179003, 142010, -19698, -70028, 63209, 140103, 151415, -204109, -147394, -30246, -135092, 217787, 15887, -253746, -175369, 122257, -6366, -345037, 42215, -33556, -17029, 29496, 114122, -23452, -112305, -22008, 96826, -85757, -72315, -338640, -115109, 79891, -94269, -235541, -12675, 107239, 126877, -29529, -226197, -74458, 175277, -105363, -14969, 95148, -76338, -152163, -135281, -105223, 385766, -113624, -172115, 61540, -152084, 5590, -51792, -51152, 9901, -157559, -22454, -154245, -3610, -68269, -228473, -1233, 146336]
15687B3229J86658a04674A39442b59495D3423M2530a5387l42108F7278G629J56918
15676A64547b19157A90926b43379I3114J55471D838M9697d05450J45020B02105
15665b7155B71765a52929c0965E6696b80690i5952B26685L626b42279h5518A30639
15653D1729f6609F976d29513A09894b01904A25078h5488j40181b5947A17996c53685
15641a07111K0075J9519B1620h8603F7919a51941q6751i1623e959j63155e5154
15629a21714C8891b6493G4138a94651h9802Q493j0810j6461j07823I9668a3865
15617A37463h4302B50555h6294d2325B1113g0967m9041N8012q1616L9228j07867
15606b12251D5015a28615j39130d3433A24476g5259j14583A62609a82810H6568
$$ y = [23229, 209887, -104674, 139442, -259495, 43423, 85953, -15387, -357495, 67278, 7629, 164547, -219157, 190926, -243379, 93114, 248585, 4838, 54535, -405450, -260430, 202105, -27155, 271765, -152929, -30965, 56696, -280690, -95952, 226685, 230311, -242279, -85518, 130639, 41729, -66609, 6976, -429513, 109894, -201904, 125078, -85488, -225669, -25947, 117996, -353685, -107111, -87036, -67517, 21620, -88603, 67919, -151941, -238692, -91623, -5959, -169114, -55154, -121714, 38891, -26493, 74138, -194651, -89802, -81309, -92119, -108580, -216403, 99668, -13865, 137463, -84302, 250555, -86294, -42325, 21113, -70967, -120008, -61996, -143612, -104384, -212251, 45015, -128615, -267745, -43433, 124476, -75259, -189842, 162609, -182810, 86568]
15595G7703O842d28659C5494e3961k9011D1303b3355j69711B8225M6652e7767
15583b24798B14577c79444A04705f2150J3271j99894C731i65l20226a23114I7198
15571B03039b34826A87923a91976B16103f989A38298d3142F024i1384M5255A29600
15559B87599a36925C21125b63408B9631l782b42503a4015A40914b06245A78354
15548I7592f0048B41538a53041j43825J07595b3497A42201a30859A36758g5694
15537h7399L0864o9500B54644F5566Q3283e4467n411o6864B98499a4726m477m2972
15525f2175k68415B1003d6133r8095A63474f6090j83949A48543b9038o0063C72241
15513d2361A24490b1762A34393C8169A600b01372C67403f916l65037A02796j4765
$$ y = [77703, 84545, -428659, 35494, -53961, -82972, 41303, -23355, -193066, 28225, 74877, -57767, -224798, 214577, -379444, 104705, -62150, -48879, -248773, 3731, -965, -321191, -123114, 97198, 203039, -234826, 187923, -191976, 216103, -6989, 138298, -43142, 6024, -91384, -46129, 129600, 287599, -136925, 321125, -263408, 29631, 25849, -242503, -14015, 140914, -206245, 178354, 97592, -60048, 241538, -153041, -296866, -189271, -23497, 142201, -130859, 136758, -75694, -87399, -56535, -126035, 254644, 65566, 148849, -54467, -59878, -126742, 298499, -14726, -19203, -62175, -330590, 21003, -46133, -144228, 163474, -66090, -250039, 148543, -29038, -89101, 372241, -42361, 124490, -21762, 134393, 38169, 1600, -201372, 367403, -6916, -371953, 102796, 88031]
15502H8031L321d1457j6573D1097a19087d4264B38386d9100k18551c2275E4633
15490A96693a13670N5731n0268d6518o036A1637b61455A98052A3945h1628A82095
15478B7605b3587j0744R187o6555J3135K3390k59688J26905A46260e438k04656
15467b10094J01124G7572d87876A64371o2813J20427c13392a10034A18190i3405
15456c176j45882A13081m5764K84853j68921q6798L98953A26335d8000j89203
15446b37203B56881a32284j48227a30973H8366J04886H0427J12987E0111L01443
15436C51554D050a12648I4734m505b03856k3061c4583E4243A1291i6211A74521
15424B82133a39850j1543m7275B28795I2356d072k40602B9763J75357b19525N6536
$$ y = [88031, 91352, -41457, -58030, 41097, -119087, -44264, 238386, -49100, -267651, -32275, 54633, 196693, -113670, -57939, -108207, -46518, -52554, 11637, -261455, 198052, 13945, -81628, 182095, 27605, -23587, -34331, -25144, -91699, -78564, -55174, -314862, -187957, 146260, -5438, -210094, -108970, 77572, -487876, 164371, 101558, 221985, -313392, -110034, 118190, -93405, -3176, -149058, 113081, 67317, 352170, 183249, 96451, 495404, 126335, -48000, -237203, 256881, -132284, -280511, -130973, 88366, 193252, 80427, 193414, 50111, 351554, 4050, -112648, 94734, 90229, -203856, -226917, -34583, 54243, 11291, -96211, 174521, 282133, -139850, -151393, -198668, 228795, 92356, -4072, -244674, 29763, 205120, -219525, -162989]
15413a62989g6197L3320E8951j4546g7942L1570k78283a21769d6831l06328P7604
15402b75555A12665O8155c55878A7223B331b5037A47532E4134a39403r3073e2923
15390A17516a39220n2877h8892A96927I1357i7848D23639a01195A93639b02758
15379B51832k1282J341J7736a61846A06700b54827B01040c49454J51774A46131
15368B50228D4608b56570c1965c265A97214d7815q8209A48120a9036j25220A79264
15356F0682o569J01600e1255D9959J10488n8898K53360a03945n2918E09772a78224
15344b51740C3166N8467l4781R6551F6504O3119b37005P4947J6005j66662F4011
15332b4656A30520i5336A12547J05479c59160A37220b29510j35876J45596A39298
$$ y = [-162989, -76197, -42877, 58951, 44405, -77942, -46372, -324655, -121769, -46831, -353159, -275555, 112665, 180820, -355878, 17223, 2331, -25037, 147532, 54134, -139403, -232476, -52923, 117516, -139220, -192097, -88892, 196927, 91357, -97848, 423639, -101195, 193639, -202758, 251832, 230550, 231891, 249627, -161846, 106700, -254827, 201040, -349454, -197680, 146131, 250228, 44608, -256570, -31965, -3265, 197214, -47815, -136024, 148120, -19036, -144256, 179264, 60682, 54113, 155713, -51255, 49959, 160447, 101549, 354909, -103945, -156863, 509772, -178224, -251740, 33166, 91633, 56852, 153403, 66504, 129623, -237005, -162058, -146053, -312715, 64011, -24656, 130520, -95336, 112547, 218026, -359160, 137220, -229510, -365386, -219790, 139298]
15321A05382a47046q6926d0902p0109K0794A87210D1227C877J08579M567K2560
15310A39583l8246K01184j46643c2813j3302h891B51181j12000i9163F1625K39768
15299C01393h2087A38784b90051d7498A65394J5272c9648f444B13723F7094f7806
15287B2396c19381e108B39718q550E5271d7326m1593A3814b0602F0865d43610
15275E6891J71054a83262A50733d439o9753E7609K7323a19043H481i0761A62372
15263f8045r5963A02658i1218D6451b8353j60023B90384k9739A29010r415f5809
15251C5685i2631E3149K42393N39324J110397j94226n87553O46469D53368A16829
15240b72174G6909K42561A33443R0008Q861D5208j3277J58768b0675G4148K89589
$$ y = [105382, -147046, -233972, -40902, -111011, -90217, 187210, 41227, 3877, 112456, 117023, 139583, 101337, 302521, 155878, -32813, -46115, -8891, 251181, 139181, -99163, 61625, 301393, -82087, 138784, -290051, -47498, 165394, 180666, -39648, -6444, 213723, 67094, -67806, 22396, -319381, -5108, 239718, 231168, 55271, -47326, -88919, 13814, -20602, 60865, -443610, 56891, 227945, -183262, 150733, -4439, -74192, 57609, 84932, -119043, 8481, -90761, 162372, -68045, -164008, 102658, -91218, 46451, -28353, -188376, 290384, 260645, 129010, 119595, -65809, 35685, -92631, 53149, 295542, 834866, 1945263, 1751037, 1163484, 1809953, 453368, 116829, -272174, 76909, 319470, 133443, 223451, 232312, 45208, 31931, 190699, -20675, 74148, 363737]
15229C63737g9508A14430Q9679E6111a57486B46199J66746A01342N8866F4395
15218g2462A39253e7994B79188H347J45837P5976b1861A64464k9167O1308p0848
15207A25757a09655C6641J42778C9520a28289R310A82464q3414l9690K44748G7634
15195A89317J94655b558F1748b1791D65044c87570e2027B21078i186B27294h0406
15183B98099a51386A79913d6092A23924O8660H5736A4906M8184Q0600Q2727n4452
15172A71965f9483D3861c27601c4413A47548J0682A424J36506N397Q0864l7965
15161A86226d4978C0272K0403a47516C3653b63749a18913M9492B57212g9069B39020
15149C99612G2890g8279E7585I144N6472a0433n552o7200b7579I5768J35940D1271
$$ y = [363737, -79508, 114430, 204109, 56111, -157486, 246199, 412945, 101342, 160208, 64395, -72462, 139253, -57994, 279188, 8347, 154184, 230160, -21861, 164464, 135297, 196605, 125757, -109655, 36641, 179419, 39520, -128289, -118979, 182464, 99050, 59360, 304108, 77634, 189317, 383972, -2558, 61748, -21791, 465044, -387570, -52027, 221078, -9186, 227294, -80406, 298099, -151386, 179913, -46092, 123924, 192584, 85736, 14906, 63090, 143690, 226417, 171965, -69483, 43861, -327601, -34413, 147548, 158230, 1424, 137930, 143327, 224191, 186226, -44978, 30272, 50675, -147516, 33653, -263749, -118913, -69421, 257212, -79069, 239020, 399612, 72890, -78279, 57585, 9144, 65616, -10433, -15985, -83185, -27579, 95768, 231708, 41271]
15136A06484K21905n8795d40691B8596K7192J567J32174J21253a39149D57286
15125A28912c0974j67577i7435B97172J15092A11476m7991K14268E841a1243A8288
15113E7850K58376d27835a82867B26810c9138C86191e3851D7853i5192O566A20190
15101A79959b76937A93514M9866k2809E9924R8614a23024C08987A26213e3425
15090A14939K97263f1143d848G2397J16636n3843R3598K19900j17513k8182A37050
15078D47485C1784K04593j1698J79311A85177M4967r1953a64120C32590E4235
15067B91679r5543a85778C80763I3716J95057C1958N8494i177B657J75726L9174
15056B17557B3717L8698M4664D2488J51329K27372a63162O3900B09576C6458L22600
$$ y = [106484, 328389, 269594, -440691, 28596, 55788, 57355, 189529, 310782, -139149, 457286, 128912, -30974, -198551, -97435, 297172, 412264, 111476, 63485, 277753, 5841, -11243, 18288, 57850, 316226, -427835, -182867, 226810, -39138, 386191, -53851, 47853, -95192, -88626, 120190, 179959, -276937, 193514, 243380, 220571, 59924, 158538, -123024, 308987, 126213, -53425, 114939, 412202, -61143, -4848, 72397, 189033, 135190, 228788, 448688, 331175, 302993, 137050, 447485, 31784, 236377, 224679, 403990, 185177, 230144, 138191, -164120, 332590, 54235, 291679, 196136, -185778, 380763, 93716, 288773, 31958, 90452, -9177, 2657, 178383, 217557, 23717, 62415, 107079, 42488, 193817, 421189, -163162, -99262, 209576, 36458, 359058]
15045C59058R619j18150j0691E1786J81000B9221b2434A17076K55406f3456C24269
15033a23275E9210J46683l0587P8219M2034D8260K21017j16068K19713F712d634
15021B48989J83494C8358O3307K08294R5627G5567R5516J52814A12640K18832
15011C31472A42318K39143j62032Q15N843P1218G0642K84703m6148b6921f048
14999f0726A95065E5821Q3223L67237B08254J03185j9524p6866K69680k20175
14989B64554i1014b9997B9200K25456D1295K81604R7809M0247A42052C4780K10549
14978B45329K27056A24119R9382a79656C70769k7049K042J07224A61878A8917
14967A98790L0869o0601J1131k4127a848B04000J3349L6064n3311H5055M6914
$$ y = [359058, 368677, 250527, 239836, 51786, 232786, 29221, -22434, 117076, 372482, -63456, 324269, -123275, 59210, 205893, 175306, 253525, 295559, 48260, 269277, 153209, 372922, 6712, -4634, 248989, 432483, 38358, 101665, 309959, 405586, 75567, 171083, 323897, 112640, 331472, 142318, 381461, 219429, 220244, 226087, 297305, 70642, 355345, 309197, -26921, -6048, -60726, 195065, 55821, 139044, 506281, 208254, 311439, 291915, 215049, 484729, 264554, -91014, -29997, 29200, 254656, 41295, 322899, 420708, 460955, 142052, 34780, 245329, 472385, 124119, 223501, -179656, 370769, 343720, 345762, 452986, 161878, 18917, 198790, 229659, 169058, 180189, 156062, -1848, 204000, 217349, 253413, 200102, 85055, 131969]
14956A31969R2642J58411j31269q9161J15057L46879j84502q6360o4289j09386
14946A79991J85812M0917M5186j31949j59154d373F0597M17389k996j77354M05865
14935G03501C38871D3080h0961B32928K16707n5069o9149m6405L0203d5925B81580
14923A00841K84630A54860J84260N0300j35792J37575K0062B04572J71501J01183
14913D77256j37799j19654K40396J51263j15977A10038K43245k5411A09557K47149
14903C56706j49249L31015B07662n3429J58001j27896r031A1578K88662l7655
14893B62585J39043M26525C12807K33625K7097j98078A54869O869L73759B60856
14882E52419j26554K5084A69515O0084J467K62948j63040j38321L26855A88119
$$ y = [131969, 224611, 383022, 251753, 162592, 277649, 624528, 440026, 353666, 289377, 179991, 365803, 406720, 451906, 319957, 160803, -4373, 60597, 477986, 474990, 297636, 703501, 338871, 43080, -80961, 232928, 449635, 394566, 325417, 279012, 309215, -45925, 281580, 100841, 385471, 154860, 339120, 389420, 253628, 391203, 411265, 204572, 376073, 477256, 339457, 219803, 460199, 611462, 495485, 110038, 353283, 327872, 109557, 356706, 207457, 538472, 207662, 154233, 312234, 184338, 175307, 11578, 300240, 262585, 401628, 828153, 312807, 546432, 573529, 375451, 154869, 161738, 535497, 260856, 552419, 425865, 450949, 169515, 229599, 231066, 494014, 330974, 192653, 519508, 188119]
14871A83608J17699C2888K36603L17178k4059j21A4124L15346a78378B46656N9184
14860C05840L39279j02637j83595A45733B7085J62561L67243B65071L27169k45838
14850C46402J42232k15168J06862N6041M3287m9634o0669K59269j90339J03162
14840E41445K0744j09430J19487j3593J30152C40879M0921O1392j63755Q1967
14830C61404J22271J42276j90519Q0505A81158K20501j7909L59715j19171j43109
14820D81185J01505B81452l3397P0009p6903M27241P2059r4059K7308j10770J79409
14809G42349l36047m8880J49063k41009M97832C02172L15508M8937m4215M2095
14799F64497O9583k18473M8537j48642O2849n1532L81559l51909R9539l7400A81488
$$ y = [183608, 301307, 32888, 269491, 586669, 562610, 562489, 14124, 329470, -178378, 246656, 305840, 645119, 542482, 358887, 145733, 27085, 189646, 556889, 265071, 592240, 346402, 488634, 273466, 380328, 436369, 479656, 430022, 369353, 628622, 438283, 541445, 562189, 452759, 572246, 558653, 688805, 340879, 381800, 443192, 279437, 361404, 483675, 625951, 435432, 515937, 181158, 401659, 383750, 743465, 624294, 481185, 582690, 281452, 248055, 318064, 241161, 668402, 740461, 646402, 673710, 562940, 742349, 406302, 357422, 506485, 265476, 763308, 302172, 617680, 666617, 622402, 664497, 734080, 515607, 564144, 415502, 478351, 426819, 808378, 456469, 556008, 518608, 181488]
14787H78796C70584M81711K6040C84929L34995k4654k81639P4382J1144M10281
14777I09438C12916L95253k95766O2637R5583o7547O6832J4762j5084J12886l30551
14766C51921M73065l00633M8144J19442K43408l54718k06492L24228p7506J97403
14756H18262k75258J38720k6169J54808j64484P138j30348L25297R5605D39235
14745E71165J06440J18076r1561J75445k97344J30043K29790l41239p0036J30870
14735F61649j4655J3967L15512r3619k07774o749K144J66142J12685O9887r9375
14724I19814j05976K9633K6108O3729n2853M2325l18917L18725J20558E04673
14713A090154q8652J03634j39082k50312K41744Q8075j16369m3016q6327k01543
$$ y = [878796, 370584, 852295, 878335, 384929, 719924, 695270, 413631, 488013, 499157, 909438, 312916, 708169, 412403, 475040, 570623, 503076, 569908, 584670, 569586, 682472, 351921, 824986, 524353, 572497, 691939, 935347, 580629, 374137, 698365, 620859, 818262, 543004, 681724, 655555, 810363, 645879, 653017, 522669, 847966, 943571, 439235, 571165, 677605, 795681, 704120, 879565, 582221, 712264, 942054, 600815, 530779, 661649, 646994, 660961, 976473, 882854, 675080, 668331, 670475, 836617, 949302, 1019189, 919814, 813838, 843471, 869579, 933308, 880455, 922780, 603863, 922588, 1043146, 504673, 1090154, 1001502, 1105136, 966054, 715742, 957486, 1045561, 929192, 886176, 799849, 598306]
14703E98306K32439r1229L35636j40884L07474l27569j75461J30539L6079j44357
14693G60973J89556N3996j45687K16139j39240q3767L37612m46220J81653K77749
14683A202764l2403n05k28223j33303C92560M79943J5851k11235N25620l78979
14673H23760P0437K42858j39124J33090k53399J66160K9081k5089r6077K0337
14663I72034R9780l04960K66956p6051L81811j23819K41818j44394l45600L94721
14653A362296k72544K3282K5365l27677J46926N14862m03306L72874p8291Q5734
14643A449521l61861K85148k197l3946K0126J09756m73850K04941J59943o4416
14633A293165L49089j01729m25521K22055Q7819K8262m01318L50575J97799P9523
$$ y = [598306, 830745, 739516, 1075152, 934268, 1241742, 914173, 738712, 869251, 905330, 760973, 950529, 1004525, 858838, 1074977, 935737, 851970, 1189582, 743362, 925015, 1202764, 1170361, 1169856, 941633, 808330, 392560, 872503, 888354, 677119, 1202739, 823760, 894197, 1137055, 997931, 1131021, 877622, 1043782, 1072863, 1047774, 951697, 972034, 1071814, 766854, 1033810, 957759, 1339570, 1215751, 1457569, 1313175, 967575, 1362296, 1089752, 1113034, 1138399, 810722, 957648, 1472510, 1069204, 1442078, 1363787, 1449521, 1087660, 1372808, 1370611, 1336665, 1356791, 1466547, 992697, 1197638, 1357581, 1293165, 1642254, 1540525, 1115004, 1337059, 1424878, 1453140, 1051822, 1402397, 1600196, 1679719]
14623A679719p615n72439L66554k6582K66308L3539k35948J19163l47533j03301
14613A171865M99796k31222K88891m63778L49205j82386L76156l19343j23954
14604A365230L24179l99540O31247q101j03666m2293j83938j14303K53127O8377
14594A790319K78069j53234j80857J44603j67791L50406k3030k66968P6778k99073
14584A549222N32562k66070L86405p3355J465j43332q7976M03857J42078j64573
14574B280283k94245L13906j96449j93476O47110j93678o2697K14090j2219J41819
14564B644444k65677K7907P9461K97970j14811J62916J74644P4214J61675J92705
14554C435448Q9828N53335L63449L67602R07712J392353M435330Q321696J9362051
$$ y = [1679719, 1672104, 1099665, 1466219, 1439637, 1705945, 1739484, 1503536, 1622699, 1275166, 1171865, 1671661, 1440439, 1729330, 1265552, 1614757, 1432371, 1808527, 1489184, 1365230, 1689409, 1289869, 1921116, 1913015, 1809349, 1767056, 1583118, 1468815, 1721942, 1790319, 2068388, 1915154, 1734297, 1878900, 1711109, 2061515, 2038485, 1771517, 1848295, 1549222, 2081784, 1815714, 2202119, 2128764, 2130229, 1986897, 1898921, 2302778, 2444856, 2280283, 1986038, 2299944, 2103495, 1910019, 2557129, 2363451, 2300754, 2514844, 2502625, 2644444, 2378767, 2406674, 2486135, 2784105, 2669294, 2832210, 3006854, 3081068, 3242743, 3435448, 3525276, 4078611, 4442060, 4809662, 5717374, 7109727, 11545057, 19866753, 39228804]
14545C9228804J3246818B3828301j1684155E405413k445824q06372j78823L10695
14537B285089p6228j64641P3063j02750j07016K42849K96283k1670j01325k95087
14527B028567N62974k50136J48154q4902j59288J96912L63032o6711j34875K43298
14517B847025l29291O18510m01901L6305Q6411J83155J35950j48964m4960N5172
14507C037412j2107M3784n421j46116M86008N7235m59906O9916J18614L45957
14497C535376R576j18915N0990J91504o6989J94391p962l22001K16032j40377
14487C541625M20993l53209K14416J3130J67674j7115J59569k10806K12660N6809
14477D205746m1513N19315r13194N66168j78647K17237j66446N23694l41673o7307
$$ y = [39228804, 52475622, 23828301, 12144146, 5405413, 2959589, 2153217, 1974394, 2285089, 2208861, 2044220, 2117283, 2014533, 1907517, 2150366, 2446649, 2424979, 2323654, 2028567, 2591541, 2341405, 2489559, 2404657, 2245369, 2442281, 2805313, 2738602, 2603727, 2847025, 2517734, 3136244, 2734343, 2770648, 2857059, 3040214, 3176164, 3027200, 2982240, 3037412, 3025305, 3069089, 3063668, 2917552, 3403560, 3460795, 3000889, 3070805, 3189419, 3535376, 3544952, 3426037, 3477027, 3668531, 3601542, 3795933, 3787971, 3465970, 3682002, 3541625, 3962618, 3609409, 3823825, 3836955, 4004629, 3987514, 4147083, 3936277, 4148937, 4205746, 4164233, 4683548, 3770354, 4336522, 4157875, 4375112, 4208666, 4732360, 4390687, 4323380]
14467D323380O15935J79831k99416K0977Q8293l7462J64716J55350j11138P0496
14457E170962M2765p0860K3669K17102l2572J75525L10304j35819j65852N56080
14447F091304k44448L46536k12452J26794j24048K29015L20747k6189J74522j21449
14437F560332j09736M09884J3324o46L04027l6900J50958J20143k6274j1316K49734
14426G623530K61976j16484l1000O93964k13068j19717L11376R2908R8504P8456
14416H680445P1973j03379N85468q8563O1864K94653O6017J13636J92739L44480
14406A0219333K35767k18300M72538k1762L49031J11500Q6246O35940o30010M25477
14396A1665760N09300L99957n61927L88842L86267q7210N73314J93943L18748
$$ y = [4323380, 4939315, 5119146, 4819730, 4840707, 4929000, 4891538, 5056254, 5211604, 5100466, 5170962, 5213727, 5142867, 5166536, 5383638, 5351066, 5526591, 5836895, 5701076, 5535224, 6091304, 5846856, 6193392, 5980940, 6107734, 5983686, 6212701, 6533448, 6507259, 6681781, 6560332, 6450596, 6860480, 6873804, 6873158, 7177185, 7140285, 7291243, 7411386, 7385112, 7373796, 7623530, 7885506, 7769022, 7738022, 8431986, 8218918, 8099201, 8410577, 8503485, 8601989, 8680445, 8752418, 8649039, 9234507, 9145944, 9207808, 9502461, 9568478, 9682114, 9874853, 10219333, 10455100, 10236800, 10709338, 10687576, 11036607, 11148107, 11234353, 11870293, 11240283, 11665760, 12175060, 12575017, 12013090, 12401932, 12788199, 12700989, 13274303, 13468246, 13786994]
14387A3786994j03478N52113K20178R271K86997M63164L5367L90562M51679L31708
14377A6424555J03361L46772J86453K75227M80067J30410P91357J76882J81802
14368A9096886R29806j26210M94606N97254O56293J15306M82553M97421O22126
14359B3366041K52200P73141N47701N20081O78203P30981P16680N4714J015014
14350B8654756M97167Q05245O75109J025009O03725R21978Q34060P05602J278871
14341C6001522R23010N36682J320331J073952R76888J320937J186157J128527
14333D4468006J696514J312325J083447J996750J070098J907809J399147K251195
14325E7185291J814876J865222J877921K281047K154559K689497K478596K730699
$$ y = [13786994, 13683516, 14235629, 14455807, 14465078, 14752075, 15215239, 15250606, 15641168, 16092847, 16424555, 16527916, 16874688, 17061141, 17336368, 17816435, 17946845, 18738202, 18915084, 19096886, 20026692, 19900482, 20395088, 20992342, 21648635, 21763941, 22246494, 22743915, 23366041, 23618241, 24391382, 24939083, 25459164, 26137367, 26868348, 27585028, 27639742, 28654756, 29151923, 29957168, 30632277, 31657286, 32261011, 33182989, 34017049, 34722651, 36001522, 36924532, 37461214, 38781545, 39855497, 40832385, 42153322, 43339479, 44468006, 46164520, 47476845, 48560292, 50557042, 51627140, 53534949, 54934096, 57185291, 59000167, 60865389, 62743310, 65024357, 67178916, 69868413, 72347009, 75077708]
14317G5077708K570966K875397L208920L574902K985547L490509M143233M012750
14309A01939932M215820M623363M855025M932538N160103N819084N706662O367046
14301A43619573O794806P037782P443294P817753Q446157Q568643R588283J0152252
14293B09468543J0031078J1142928J1432369J2036328J2417483J3377632J3340458
14286B93246819J4009489J4750820J4813902J5068217J4510634J4976076J4540692
14279C95916649J3738080J2906539J2562085J0651805R134633P017962M390533
14272D66318286P690j457806m06400l139354l169490m304527o127088q913235
14264D38808076j1105278j3038713j3581734j4505616j5194115j5180646j5290931
$$ y = [75077708, 77648674, 80524071, 83732991, 87307893, 90293440, 93783949, 97927182, 101939932, 106155752, 110779115, 115634140, 120566678, 125726781, 131545865, 137252527, 143619573, 150414379, 157452161, 164895455, 172713208, 181159365, 189728008, 199316291, 209468543, 219499621, 230642549, 242074918, 254111246, 266528729, 279906361, 293246819, 307256308, 322007128, 336821030, 351889247, 366399881, 381375957, 395916649, 409654729, 422561268, 435123353, 445775158, 454909791, 461927753, 466318286, 466325976, 464868170, 464461770, 461322416, 458152926, 453848399, 447721311, 438808076, 427702798, 414664085, 401082351, 386576735, 371382620, 356201974, 340911043]
14257C40911043j5008513j5024863j4697477j3028152j3247725j3092168j2147186
14250B44664959j1693108j1342672j0890920r927850r344018r316511p973280
14243A74176600q088516p587702p411795o783019o291701n589622n712949n347018
14235A21364278n099862n133488m391168m246215l494253m165665l397471l477488
14227H7958668l543477l052862k738202k863773k840504k160579k631630k377693
14219F5749948k122265k025600k236094j899893j720197j262239j497547j917794
14211E1068319j568759j481881j601480j079317n82684j334430j294285j577339
14203D0548144j243313j003597n09168r97897j182648o24339j378514q69741l73080
$$ y = [340911043, 325902530, 310877667, 296180190, 283152038, 269904313, 256812145, 244664959, 232971851, 221629179, 210738259, 200810409, 191466391, 182149880, 174176600, 166088084, 158500382, 151088587, 144305568, 138013867, 132424245, 126711296, 121364278, 116264416, 111130928, 106739760, 102493545, 98999292, 94833627, 91436156, 87958668, 84415191, 81362329, 78624127, 75760354, 72919850, 70759271, 68127641, 65749948, 63627683, 61602083, 59365989, 57466096, 55745899, 54483660, 52986113, 51068319, 49499560, 48017679, 46416199, 45336882, 44754198, 43419768, 42125483, 40548144, 39304831, 38301234, 37792066, 36794169, 35611521, 34987182, 33608668, 32738927, 32365847]
14194C2365847o98719q42387q69820o49222r57435o98394p02982m93774n10675
14185B5942439n70554n66310m97045o98489m72409n67339o48015k97094n45014
14176B1080170l39872m91217k86829l78484l97252m48174j07348n64034m92545
14167A7574415j9191n84316j50687m69483r5382k87472j08902j23328n11141n6783
14157A5167730l05500n10642R5570m36200l56743j32944m10396q4856j17911j97358
14147A2710750m18556J91229q0383m49935m65900P6299k56279j89932J84300k69515
14137A1032078m3488l67590K47862m94802o0213n31270j527l35653K69463J570
14127I716430m50492k10582p7667r9637J90391q03299M44691l68444J41583m35775
$$ y = [32365847, 31667128, 30824741, 29954921, 29305699, 28348264, 27649870, 26946888, 26453114, 25942439, 25371885, 24805575, 24308530, 23610041, 23137632, 22570293, 21922278, 21625184, 21080170, 20740298, 20249081, 19962252, 19583768, 19186516, 18738342, 18630994, 18066960, 17574415, 17555224, 16970908, 16820221, 16350738, 16255356, 15967884, 15858982, 15735654, 15224513, 15167730, 14862230, 14351588, 14447158, 14010958, 13654215, 13521271, 13110875, 13026019, 12908108, 12710750, 12292194, 12483423, 12403040, 11953105, 11487205, 11563504, 11307225, 11117293, 11301593, 11032078, 10988590, 10621000, 10868862, 10374060, 10313847, 9782577, 9781050, 9445397, 9714860, 9716430, 9265938, 9055356, 8977689, 8878052, 9068443, 8265144, 8709835, 8341391, 8482974, 8047199]
14117H047199k48311N17807m50118J13767k80588J13780k8321k41689o8195j32308
14107G343023l45692Q0375j71683Q5524j06595j92749K7055o5978p1859n8592
14097F522829j15094L9533l53807k29364K21166n1294k30493J17693l05459j3120
14087E602590P4609j01453m9304m10098P90893o11469n7977Q3522k4296j10017
14077E187000J0324j94315l12359j48160p316R7305j08669M40801O9139l86133
14067D647617j68116k79856O97867m73404j02237m1183K20961p0387K12420m61375
14057D182307K25893l31709l669j12376j9663k72073K24829j09336J23916k03640
14047C704479n3614q7031M48934l30354N4028j5766J51698j60829k84330J49594
$$ y = [8047199, 7798888, 8316695, 7866577, 7980344, 7699756, 7813536, 7785215, 7543526, 7475331, 7343023, 6997331, 7077706, 6906023, 6991547, 6884952, 6692203, 6719258, 6653280, 6581421, 6522829, 6407735, 6447268, 6093461, 5864097, 6085263, 6033969, 5803476, 5921169, 5615710, 5602590, 5677199, 5575746, 5526442, 5116344, 5907237, 5295768, 5237791, 5321313, 5297017, 5187000, 5197324, 5003009, 4690650, 4542490, 4535174, 4632479, 4523810, 4964611, 5033750, 4647617, 4479501, 4199645, 4897512, 4424108, 4321871, 4280688, 4501649, 4431262, 4643682, 4182307, 4408200, 4076491, 4072822, 3960446, 3940783, 3668710, 3893539, 3784203, 3908119, 3704479, 3650865, 3563834, 4012768, 3682414, 3736442, 3720676, 3872374, 3711545, 3427215, 3576809]
14037C576809J4O8806q5359k10087L08498l44667L37328m24308M7393M0583L1413
14026C346423m8432K74643n45585j66428j48552K55384j49878q7380K21438k05614
14016B746019j7702L44771m61891J60420p3498J24613k89640J88725j82639J0448
14006B549626L2707n1759k75545J91129j16186J27569p1167N9184j49564L53211
13996B649205l89882m8522J62361j11654J10242K90563J55898P77550K350245
13987E946006O933753J7563006K2066311k2405370j5004752o392423k651452r72219
13979E082860r86474l77255k95728r5386k07703l57383K86819Q2944j13867k50972
13969B767855j24689J25113n4214l18678M47202o36028J60209L43480m64919N07867
$$ y = [3576809, 3576823, 3645629, 3560270, 3350183, 3658681, 3314014, 3651342, 3227034, 3274427, 3315010, 3346423, 3297991, 3572634, 3027049, 2860621, 2712069, 2967453, 2817575, 2730195, 2951633, 2746019, 2728317, 3073088, 2611197, 2771617, 2698119, 2822732, 2533092, 2721817, 2539178, 2549626, 2582333, 2530574, 2255029, 2446158, 2329972, 2457541, 2386374, 2445558, 2295994, 2649205, 2259323, 2210801, 2373162, 2261508, 2371750, 2662313, 2818211, 3595761, 5946006, 12879759, 30442765, 52509076, 30103706, 15098954, 8706531, 6055079, 5082860, 4096386, 3719131, 3423403, 3328017, 3120314, 2762931, 3049750, 3132694, 3018827, 2767855, 2643166, 2768279, 2714065, 2395387, 2842589, 2206561, 2366770, 2710250, 2245331, 2753198]
13959B753198l47437l79957K50517j15142J342k04706K0529L02656J36574k86767
13949B130807j34012K08400k22858J92101o9396j27577J53890o7443P892j86348
13939A885456l0137K04593l26004o0906N06143l2706n25091N12334k28608k87173
13929A617901J74069L1922l35169J07619k0796L08957k23623N989P6637j68356
13919A575150K37285Q362k07632J98112l49847R5274j61761L96021l71691j84509
13909A234764L58460K85565m86827J95275N1876j50640j41787j5118K1973K86281
13899A639822L1913J2732m38785M20521m86432M40367m17384J33831J66406j61338
13889A341653J22622j23811K06108O7981l83625R9844K96983l58558L66137l36962
$$ y = [2753198, 2405761, 2025804, 2276321, 2161179, 2162521, 1957815, 1978344, 2281000, 2417574, 2130807, 1996795, 2205195, 1982337, 2174438, 2105042, 1977465, 2131355, 2063912, 2071804, 1885456, 1855319, 2059912, 1733908, 1673002, 2179145, 2146439, 1621348, 2133682, 1905074, 1617901, 1791970, 1823892, 1488723, 1596342, 1575546, 1884503, 1660880, 1666869, 1743506, 1575150, 1812435, 1820797, 1613165, 1811277, 1461430, 1556704, 1394943, 1790964, 1419273, 1234764, 1593224, 1878789, 1391962, 1587237, 1639113, 1488473, 1346686, 1331568, 1353541, 1639822, 1671735, 1684467, 1245682, 1666203, 1179771, 1620138, 1202754, 1336585, 1502991, 1341653, 1464275, 1340464, 1546572, 1614553, 1230928, 1330772, 1627755, 1269197, 1635334, 1298372]
13879A298372j76652L9764R8590L13952n8905o81656K74085M90374l91395k21715
13869I84814K52841N0337R6860j13763L48764k0433m93160K84627k01358o4287
13859A125242m8227J10524j6522L1689M0605j77104L7999j15978M84613p0927
13849A401914m92131J95310N1062L6328l03145j8054L41270l82575P6935q0314
13839H26600K49630J00386j34199M2740J2377j46785J98905Q623J01150k61016
13829I98411m2987K52369j42059k257K530M39263m20030q1795k86321N42294o25515
13818F33903Q5343J17141K52183J38819k85331j50383L79898k14119J87790L526
13808A148770L0213m40452K16950l09918J77588J8736K13119R6041m87178j3716
$$ y = [1298372, 1121720, 1161484, 1260074, 1574026, 1515121, 833465, 1107550, 1597924, 1206529, 984814, 1237655, 1287992, 1384852, 1271089, 1619853, 1599420, 1106260, 1390887, 1189529, 1125242, 1077015, 1187539, 1171017, 1202706, 1243311, 1066207, 1104206, 988228, 1472841, 1401914, 909783, 1105093, 1156155, 1192483, 889338, 871284, 1212554, 829979, 906914, 826600, 1076230, 1176616, 1042417, 1085157, 1097534, 950749, 1149654, 1158277, 1259427, 998411, 955424, 1207793, 1065734, 1063477, 1066007, 1505270, 1085240, 1003445, 717124, 1259418, 633903, 719246, 836387, 1088570, 1227389, 942058, 791675, 1171573, 957454, 1145244, 1148770, 1178983, 738531, 955481, 645563, 823151, 841887, 1055006, 1151047, 663869, 650153]
13798F50153J43033J19113k52527L5855J57822J65836j80757L23595N9515l36144
13788H85494L66965m44231l83179L11009j34204L12121J91038j81114J46174m05559
13778F64514M28043D84456O34947m15680K05489l4265L4496r4171J28539k3594
13768I20217L2610L6876m26726J85099J02812O230k60944N30341r2723k99384
13758G34408l0890J60529Q3357j59789L05650j28644l70913K44456C85706N83866
13748I69572m07641p092K5716M7006L14488n9200k85826K32681p8213k58096K25995
13737G19390Q2463m6874J55814l76450n3913M32004m4145j59858K73008l21382
13727F60057k6751K1418j07807P4j44216M26173k54017N4784J5869k60144L50598
$$ y = [650153, 793186, 912299, 659772, 695627, 853449, 1019285, 838528, 1162123, 1221638, 885494, 1252459, 808228, 425049, 736058, 601854, 913975, 1105013, 923899, 1070073, 664514, 1092557, 484456, 1119403, 703723, 909212, 874947, 909443, 815272, 943811, 920217, 952827, 989703, 562977, 748076, 850888, 857118, 596174, 1126515, 1033792, 734408, 703518, 864047, 947404, 787615, 1093265, 964621, 593708, 838164, 385706, 969572, 561931, 554839, 580555, 627561, 942049, 882849, 597023, 829704, 751491, 493395, 719390, 801853, 754979, 910793, 534343, 480430, 912434, 868289, 708431, 981439, 660057, 633306, 654724, 546917, 546991, 402775, 828948, 574931, 629715, 645584, 385440, 736038]
13716G36038j8403n9097R9304m5765k75599K3511K39505j64030M6352j50984J61940
13705E92772k4793l558p3718l1728N2997K35683J20109k64068K31708l15133P7851
13694E98122k23222N16017k31502K8508j90939K36410j36214J78157k82701q0702
13684D11934K12748O2022j08318P7155j94230P258Q4816J42802k1173m7335j03820
13673E23859j01289r4509J46802m5135J7380J01896j15737O5623R7523K584m4626
13662E54371k20885K33347K21405l22297J88445k39433J57207j62476L02443k46014
13652D66113K17579j80489j11874j58534K02669K74364p5489k55035K76735k13199
13642D42840J32148j3581n4998A48260L93631k11608J68720N8698B35507K01661
$$ y = [736038, 717635, 658538, 757842, 712077, 436478, 459989, 699494, 535464, 581816, 430832, 592772, 567979, 564421, 490703, 458975, 511972, 747655, 867764, 603696, 835404, 520271, 598122, 374900, 890917, 659415, 687923, 496984, 733394, 597180, 775337, 492636, 411934, 624682, 686704, 578386, 655541, 461311, 468569, 553385, 696187, 675014, 627679, 523859, 422570, 328061, 474863, 429728, 447108, 549004, 433267, 498890, 596413, 598997, 554371, 333486, 566833, 788238, 465941, 654386, 414953, 572160, 409684, 712127, 466113, 683692, 503203, 391329, 232795, 435464, 709828, 634339, 379304, 656039, 442840, 574988, 561407, 506409, 148260, 541891, 330283, 499003, 557701, 235507, 437168]
13632D37168j87835L27476J20527B29856N28051l10897K76006C08683K07949L400
13622E20032j2800N9376N6430j08784A69390K45018P1542A28879L33030J45627
13612F07536k94567k2900L75495B08966M54177l17267N5202E3389O59962l5602
13602F77749j06771B83223J6598J20415o7051k8289q671J22347K54729l04853
13592C88448J33447j69707J58337J38931B90856J22145j11834M42663Q3997C01538
13581E94411M0098k73838l4011L37325B89676K88493m8789r999K52788B76855
13570E05034Q5749B82548H8189J83131J28038J51352B32878N5994C4351M07525
13560D41876r1228o9430N0405K15271Q9606j06656j65019I9810K07624J84223
$$ y = [437168, 249333, 576809, 697336, 229856, 757907, 447010, 723016, 308683, 516632, 520032, 507232, 566608, 623038, 514254, 169390, 414408, 485950, 128879, 461909, 607536, 312969, 290069, 665564, 208966, 663143, 345876, 401078, 53389, 713351, 677749, 570978, 283223, 299821, 420236, 353185, 324896, 316225, 438572, 693301, 388448, 521895, 352188, 510525, 649456, 290856, 413001, 301167, 743830, 827827, 301538, 594411, 634509, 360671, 326660, 663985, 289676, 578169, 529380, 519381, 772169, 276855, 505034, 590783, 282548, 88189, 271320, 399358, 550710, 232878, 288872, 34351, 441876, 350648, 281218, 331623, 546894, 636500, 529844, 364825, 99810, 307434, 491657]
13550D91657F5228K75634j10395M4394k8636J66655R573o4812K6959o6766j56153
13539A61681K71017A02235N52896A93198L30998B56779m2252J38793j11638J55915
13529C97597p3430j28930K72443G4662C3296J85084K89936j21513K16339A22246
13518C73593j22725p5954K03356J26469n9824j38075R042q3183J79541A46466
13507A68434C3282K54807P1172K9817O5750j68927K6048J77363A75834J13602
13497B89436J30944M974G0212N0446K45451j46621d291D85599p803A32230O2452
13486A94682N8914j12196K76121C6132J20718J36449N1097L15614A33177M45267
13476E78444k40742p657I0634K37062A16453j1701J39072L19055J2048A59476
$$ y = [491657, 65228, 340862, 230467, 274861, 246225, 412880, 422453, 357641, 384600, 317834, 161681, 432698, 102235, 655131, 193198, 524196, 256779, 214527, 353320, 241682, 397597, 324167, 195237, 467680, 74662, 33296, 218380, 508316, 386803, 603142, 122246, 373593, 250868, 174914, 378270, 504739, 444915, 306840, 315882, 232699, 412240, 146466, 168434, 33282, 288089, 359261, 389078, 454828, 285901, 311949, 489312, 175834, 289436, 420380, 425354, 70212, 120658, 366109, 219488, -4291, 485599, 477796, 132230, 194682, 253596, 141400, 417521, 36132, 156850, 293299, 344396, 660010, 133177, 578444, 337702, 330045, 90634, 327696, 116453, 104752, 243824, 562879, 574927, 159476]
13465B98485O865o0889j0010p4169L80097o2013k32205J89536E1041Q2354M48274
13454E81669G0852J88681M1140F4975M55486r9520Q729q8181n7010P2716n6521
13443C00674a067C09733A28508L37400j29345j30478J41831p789A2249L29701
13433C41950A13560L69557B23670m5935L5063G1346K03416J41041A07841J94990
13423C02831K77804B81763H8441R8148J73591j29435K10777A87719M1315J72629
13413D01663j59282j20985L10168j36640J45380q9536B0921R9297Q0803K6559
13403B27580J293k3898e3240C94983j61394c7046B73688G8062M72373A797L56488
13392C58285m8345J07199F0753L3809K3146e287A40164M69965j4089B01493G5030
$$ y = [298485, 305350, 244461, 234451, 160282, 540379, 478366, 246161, 435697, 51041, 133395, 581669, 70852, 259533, 300673, 64975, 520461, 420941, 429670, 341489, 284479, 357195, 300674, -1067, 309733, 128508, 465908, 336563, 206085, 347916, 340127, 12249, 341950, 113560, 483117, 223670, 177735, 212798, 71346, 274762, 415803, 107841, 302831, 580635, 281763, 88441, 186589, 360180, 230745, 441522, 187719, 229034, 401663, 242381, 121396, 431564, 294924, 440304, 350768, 20921, 120218, 201021, 227580, 228873, 204975, -53240, 394983, 233589, -37046, 273688, 78062, 550435, 1797, 358285, 309940, 417139, 60753, 94562, 117708, -5287, 140164, 610129, 596040, 201493, 75030]
13380A6875J80933O3560m8868Q8899q4673j322j01632R889Q6170L80485k03988
13369C86328A53226M78796D830M89976G4382K96617L19122f9620D72036B29352
13358D31956A44232L6194o616J77909O405K6947p0735A5081K74640J44650k07931
13347B26440o9285M1588L17834A76904f1471B94985J93434k41623K49357A78026
13336B52764J38565j57865J13645a4210C97916A13971J76649M2000Q9971k7001
13326C95590m8328j66832M2503O9250j28416e8871D39496o5287j51885A1079O05801
13315F16880k54874E1591K58801Q6844j00784j39157o5438K12845K18538A18556
13304b05292E9760q805K22747q484M08525D7832M7787e4626F998K12011Q7886
$$ y = [16875, 197808, 261368, 212500, 301399, 216726, 215404, 113772, 123661, 209831, 590316, 386328, 153226, 632022, 4830, 494806, 74382, 370999, 690121, -69620, 472036, 229352, 431956, 144232, 180426, 173810, 351719, 358124, 385071, 314336, 15081, 289721, 434371, 226440, 157155, 198743, 516577, 176904, -61471, 294985, 488419, 246796, 496153, 178026, 252764, 391329, 233464, 347109, -14210, 397916, 113971, 290620, 332620, 422591, 395590, 347262, 180430, 222933, 292183, 163767, -58871, 439496, 374209, 222324, 11079, 616880, 362006, 51591, 310392, 397236, 296452, 157295, 91857, 304702, 523240, 118556, -205292, 59760, 50955, 273702, 265218, 673743, 47832, 95619, -54626, 6998, 219009, 306895]
13293C06895K45422B07950L8221J00517A21783n3383a37050D06632k987A10581
13282A65352N43089D7159J29491M71783A9319J63661k7855d3335B4276d61381
13271e169B22603I5085L00316H3219b6531k9787A35420a63355A58994E5899K30263
13260B86162A29352K05788A51759P7982c9244E664K69100M2332H6983L6402a58800
13248C73385r9554e2131j12069C08755R209e4560A64082P1935e4441C24248n1848
13237B72400a29428A3096M16091F4662J45579L11792e0220n0238B31476q9501
13227A41975j9614m3852a61469I6293J08741h2191B44916J78418E7088j4838J60040
13216B02290F6308Q0378k6057J15618C8740J41180J00000B8534K50808H4883p61
$$ y = [306895, 552317, 207950, 246171, 346688, 121783, 68400, -137050, 406632, 403645, 110581, 165352, 708441, 47159, 176650, 648433, 19319, 182980, 155125, -43335, 24276, -461381, -5169, 222603, 95085, 395401, 83219, -26531, -56318, 135420, -163355, 158994, 55899, 286162, 129352, 335140, 151759, 229741, -39244, 5664, 274764, 317096, 86983, 123385, -158800, 373385, 273831, -52131, -164200, 308755, 317964, -54560, 164082, 236017, -54441, 324248, 272400, -129428, 13096, 429187, 64662, 210241, 522033, -50220, -100458, 231476, 141975, 122361, 78509, -161469, 96293, 205034, -82191, 244916, 423334, 57088, 42250, 202290, 66308, 146686, 120629, 236247, 38740, 179920, 279920, 28534, 279342, 84883, 84122]
13205H4122K66803F2972B2245f5077r6482C2035K72603G7990M6443m8474k8142
13194D7817i0855B12826a20181R121A82240a56552A80736D4180b38208E2927K7749
13183H0676J57146C7897L09467E0167Q4962d7486J708B55579O0275A27609O5084
13172A92693I2355C9419J69154J31132B5766Q3752L24447C2872J83788e8444A83573
13160B29030N6358M2649C8480J22645G4755Q6537b28400I8395b6325g21l31198
13149c31919A82878J07902A26339B8022M7617K92983a08363A25066J60320j23283
13139A62103d8879B39261j05619b86804A69781M05136c4403E3942a53102K1921
13129a31181A54415o3505Q6575c68905B00500p3961o2307J81353L9825e0845A69113
$$ y = [84122, 350925, 62972, 22245, -65077, -161559, 32035, 304638, 77990, 124433, 75959, 47817, -90855, 212826, -120181, -111060, 182240, -156552, 180736, 44180, -238208, 52927, 80676, 237822, 37897, 347364, 50167, 135129, -47486, -45778, 255579, 315854, 127609, 192693, 92355, 39419, 208573, 339705, 25766, 109518, 433965, 32872, 216660, -58444, 183573, 229030, 285388, 328037, 38480, 161125, 74755, 161292, -228400, 98395, -26325, -721, -331919, 182878, 290780, 126339, 28022, 75639, 368622, -108363, 125066, 285386, 162103, -48879, 239261, 133642, -286804, 169781, 574917, -34403, 53942, -153102, -131181, 154415, 90910, 177485, -368905, 200500, 126539, 64232, 245585, 285410, -50845, 169113]
13117a37037C9218A7438L75203I4399c429n4465A08349C9243J69376J4489b7764
13105F9656N4480D5031L02766b3063C4206e3257A82364a25210c6295m0535A03983
13093A66457N374C078J11686f0530B16858d3382C44214j40418J7683E9499b6016
13081E2598M76658A83725B732L39549m6880j39486k8762J31124J62005b37881
13070B06036G699L44807b1920B4947J72487F9326L9455a11251A28013f142B35581
13058B98249F6867J26179a77928G6001A7450N7090J21428f5482C75690d0489m2835
13047h3324A33445J34892b0851D2816P3135P7975J29874J9354H6857K05624c3153
13035D76677j95170g9584B13915K21051r223A46978M7090r706P3358a48011A27650
$$ y = [-137037, 39218, 17438, 392641, 94399, -3429, -57894, 108349, 39243, 208619, 223108, -27764, 69656, 124136, 45031, 347797, -23063, 34206, -53257, 182364, -125210, -36295, -76830, 103983, 166457, 171831, 3078, 114764, -60530, 216858, -43382, 344214, 203796, 221479, 59499, -26016, 52598, 529256, 183725, 2732, 342281, 295401, 155915, 127153, 258277, 420282, -237881, 206036, 7699, 352506, -21920, 24947, 197434, 69326, 108781, -111251, 128013, -6142, 235581, 298249, 66867, 193046, -177928, 76001, 17450, 74540, 195968, -65482, 375690, -40489, -83324, 133445, 268337, -20851, 42816, 115951, 193926, 323800, 343154, 86857, 292481, -33153, 476677, 281507, -79584, 213915, 434966, 425743, 146978, 194068, 184362, 257720, -148011, 127650]
13023D0272j488J06802K3967h38A7305J18938P7235o5478J31299A12003O075a93284
13010B00323H1955C543h565B54396A10151K55286A68414J1307D5171J62482b14089
12998A85084K14563d7996n6282G1001M79294A27834c5270j24826A19543a79562
12987a94416B93434J0261a5658B11104b43669A56853i7163a521C05100a37355
12976A83616e9711J0397j19903A38193F8835P7285p2142J19844P5648g8089A05914
12964B05873m0561a5499I6153O3208k2551d4811D1581b3444o9559D7898a71649
12952a49636r9767G5068a7267B04527b1616k7567G1220c4484j3432k5626L3787
12941c9755D514a44308J3194E9117J34712B6355a14601p5350R1981B50165a15437
$$ y = [40272, 38784, 145586, 169553, -838, 17305, 136243, 213478, 148000, 279299, 112003, 118078, -193284, 200323, 81955, 3543, -8565, 254396, 110151, 365437, 168414, 179721, 45171, 207653, -214089, 185084, 399647, -47996, -104278, 71001, 550295, 127834, -35270, -160096, 119543, -179562, -194416, 293434, 303695, -15658, 211104, -243669, 156853, -97163, -1521, 305100, -137355, 183616, -59711, -49314, -169217, 138193, 68835, 146120, 73978, 193822, 269470, -78089, 105914, 205873, 165312, -15499, 96153, 159361, 136810, -44811, 41581, -23444, -93003, 47898, -171649, -149636, -249403, 75068, -17267, 204527, -21616, -49183, 71220, -34484, -47916, -73542, -39755, 4514, -144308, -131114, 59117, 193829, 26355, -114601, -189951, -97970, 250165, -115437]
12929E747R7592e260B55491H1878a35694D9009N7070M2183O6391F796J9450a1505
12916A49741P4415p0304F6446c976E1073L0190A1955J92302m8521D7617N3532
12905A01149m9661K05806b5694A64593J28779A27236a01427j5818n880i125j37671
12894a46796J3669G8913R7259b25663F5143J63602K72530A32240B1724i4329j60117
12883b54446N8519A30019b09448j4466B08721H4917a41303A15246a18873B32883
12872a63778A9970j619J71756H0647J87595d8439D2159c0293B25833a18615B4490
12860a05776d9043A9619g0728A3217K81124K82226G8062i7672L8027B20959H9948
12848a121A0719J27077q835J1095a21050B08212k0771L8865p552a27l7561B58506
$$ y = [5747, 103339, -5260, 255491, 81878, -135694, 49009, 106079, 148262, 214653, 6796, 26246, -11505, 149741, 224156, 153852, 66446, -3976, 51073, 81263, 11955, 204257, 155736, 47617, 101149, 51488, 257294, -25694, 164593, 293372, 127236, -101427, -117245, -123125, -9125, -146796, -133127, 78913, 176172, -225663, 65143, 228745, 501275, 132240, 21724, -94329, -254446, -195927, 130019, -209448, -223914, 208721, 84917, -141303, 115246, -118873, 232883, -163778, 19970, 18351, 190107, 80647, 268242, -48439, 42159, -30293, 225833, -118615, 24490, -105776, -49043, 19619, -70728, 13217, 294341, 576567, 78062, -97672, -59645, 220959, 89948, -1121, 10719, 137796, 128961, 140056, -121050, 208212, 187441, 226306, 218754, -127, -37688, 258506]
12835A27078i3503j16889E9361c1628C03668b38074M7442e9028D0102K70657K7543
12824C38302r5604a92432N5607E9758J29445o191d25087I8515L02579B2687d0950
12812D6553i8775H5309J9983J11839b27165g9071A22081a32723l981H0571k7568
12801E3003a89343A31779E482J22034J42996a45968a9456A03617b803A14468K70661
12790C85129b17633C64808j15381R5245K1547A51844a13593F6786c268j98316
12780b01584B62246D9585b11910D21643a47903B91271a83033g6142A48389a63632
12769c29040H5407h7617J268B1642J14142P94O4424a14741o6433A60503o9954
12758I0549C4943b33441A94673F8104J21929a15751C12116H315L7490K66227A31637
$$ y = [127078, -93503, -210392, 59361, -31628, 303668, -238074, -190632, -59028, 40102, 310759, 338302, 242698, -192432, -136825, 59758, 189203, 183012, -425087, 98515, 401094, 22687, -40950, 46553, -98775, 85309, 105292, 217131, -227165, -79071, 122081, -132723, -136704, 80571, 53003, -189343, 131779, 5482, 127516, 270512, -145968, -19456, 103617, -2803, 114468, 385129, -217633, 364808, 249427, 344672, 366219, 151844, -113593, 66786, -3268, -201584, 262246, 49585, -211910, 421643, -147903, 291271, -183033, -76142, 148389, -163632, -329040, 85407, -87617, -86349, 21642, 135784, 136578, 201002, -114741, -181174, 160503, 90549, 34943, -233441, 194673, 68104, 190033, -115751, 312116, 8315, 45805, 312032, 131637]
12746i5373j36624A01058g115j08845A28266a71656c1248G2718e7822A28876m7014
12735H1862K39756f7273A44860J24691J00954p628B6330R8564o0445B3914J01843
12724A25757C7140a35932H3638J55439j16396K3644d2959j15038A89602b39988
12713F0707K00720A15752a97823B84520A32492Q9892o2364d4206C06501O5670
12703C72171a05214C67773j53702c5473p1891A34932P2311m3299b98224A61774
12692b0539n170C36980C6427a53148H631O1734M2533J5685J31749N3775A39812
12680A69214m766L52921b5276j7898B08197H1016K64352i9518C67682F4289J14394
12669A78683D8890K43568a05148A14506L19386B7640K80446d3726n1157a9445
$$ y = [-95373, -231997, 101058, -7115, -115960, 128266, -171656, -31248, 72718, -57822, 128876, 81862, 321618, -67273, 144860, 269551, 370505, 362877, 26330, 124894, 64449, 23914, 125757, 37140, -135932, 83638, 239077, 122681, 146325, -42959, -157997, 189602, -239988, 60707, 261427, 115752, -197823, 284520, 132492, 222384, 160020, -44206, 306501, 372171, -105214, 367773, 214071, -35473, -107364, 134932, 207243, 163944, -298224, 161774, -20539, -25709, 336980, 36427, -153148, 8631, 70365, 112898, 128583, 260332, 314107, 139812, 169214, 164448, 517369, -25276, -43174, 208197, 81016, 345368, -99518, 367682, 64289, 178683, 48890, 292458, -105148, 114506, 433892, 27640, 308086, -43726, -94883, -19445]
12658h2377A64478p4765a13192B92419b10208c301o7462a3676A78536B6159J5202
12647D1361a77750B62542I0235L1362e2422A51883B6242a99135C2643P1732Q9648
12636A94023i5503G7257A0453Q5178B3682N3411E567J23257K22516A6582J67588
12625A84170a23367A38012J9127M2756G8392M0671K88668A60850L8569a11726
12614D2106N5911k7435p387L4627h4499K4291A88487b95877b3729C94573a23816
12602A42124L2767K4590a49971L6351A17287P8255H8444J25149K0532n512N1772
12591B80385D5178d59778B08647b00010F9303a43130A10619C067a87408A05236
12580B43278j09513a39593B30921I9984L8408a08656d8098B6316J75752b3580
$$ y = [-82377, 164478, 89713, -113192, 292419, -210208, -3301, -70763, -13676, 178536, 26159, 41361, -177750, 262542, 90235, 121597, -52422, 151883, 26242, -199135, 32643, 104375, 194023, -95503, 77257, 10453, 95631, 23682, 77093, 5567, 128824, 351340, 16582, 184170, -123367, 138012, 157139, 199895, 78392, 119063, 407731, 160850, 199419, -111726, 42106, 98017, 70582, 63195, 97822, -84499, -60208, 188487, -295877, -23729, 394573, -123816, 142124, 174891, 199481, -149971, -113620, 117287, 195542, 88444, 213593, 234125, 228613, 280385, 45178, -459778, 208647, -200010, 69303, -143130, 110619, 3067, -187408, 105236, 243278, 133765, -139593, 230921, 99984, 138392, -108656, -48098, 26316, 202068, -23580]
12569A34650M7504h1307A7799K5151a22189A67270E026c78386G6829J08199j1465
12558A73563J17722c1404B05559o5943d3969A39083b17475B32945p8179F1034
12547A66383a17519C37223i9040k3648I1869J12930G7128P0889C6903g9824A61673
12535A29279J60621b8100d07C28542c8318B92720r646l4063B516Q9329J92599
12524B84444f2026A69317b5608o1163B2060a5667l00137f1524a7626j57524k0059
12513a95209a7490k81190e3586j21634Q5628D9507j306Q7873a86767B03193c2524
12501A79159h3694a7032D46541b8723H8582c72054C2421f7418c84D3994g4868
12489A16885J2452i059p6993k70857B55688C7948c13811a56218D3600J9934O5949
$$ y = [134650, 182154, -81307, 17799, 42950, -122189, 167270, 5026, -378386, 76829, 185028, 173563, 291285, -31404, 205559, 139616, -43969, 139083, -217475, 232945, 154766, 61034, 166383, -117519, 337223, -99040, -122688, 91869, 204799, 77128, 148017, 36903, -79824, 161673, 129279, 289900, -28100, -407, 328542, -38318, 292720, 283074, 249011, 2516, 91845, 284444, -62026, 169317, -25608, -86771, 22060, -15667, -315804, -61524, -17626, -175150, -195209, -17490, -298680, -53586, -175220, -89592, 49507, 48201, 136074, -186767, 203193, -32524, 179159, -83694, -17032, 446541, -28723, 88582, -372054, 32421, -67418, -384, 43994, -74868, 116885, 129337, -9059, -86052, -356909, 255688, 37948, -313811, -156218, 43600, 63534, 129483]
12478A29483c66006a21602m4025B55905a75729F3562e583B6667L55013A40694
12467A1433M941c3603H0760b00331A47109E091O4717a92651A4381Q1675k626e3221
12454A48661l183E2921L3371l2275J50315k5363c2314C17014j56570m3523J58980
12443B75901c00308A3901O7325f9898r508i816k65638J08956B09895C4165a81177
12431B71845q0539N0260c14569B03782a54420J6771B83464A05812M6910b39784
12420a73854F0629j6710J49976n2250J4441p3879L36468A93870q2850b437E5386
12408A25920L0061e7991A16099K24438r9548b26881c4032k52945c6955j31407
12398a68362A9217L4965c81471a64524F6371d08520O8820C83050c4814j25227
$$ y = [129483, -366006, -121602, -165627, 255905, -175729, 63562, -5583, 26667, 381680, 140694, 11433, 16374, -33603, 80760, -200331, 147109, 5091, 69808, -192651, 14381, 96056, 93430, -53221, 148661, 145478, 52921, 86292, 54017, 204332, 178969, -32314, 317014, 160444, 116921, 275901, -300308, 13901, 81226, -69898, -79406, -9816, -275454, -166498, 209895, 34165, -181177, 271845, 191306, 241566, -314569, 203782, -154420, -137649, 283464, 105812, 152722, -239784, -173854, 60629, 43919, 193895, 141645, 156086, 82207, 418675, 193870, 111020, -2437, 55386, 125920, 155981, -57991, 116099, 340537, 240989, -226881, -34032, -286977, -36955, -168362, 19217, 54182, -381471, -164524, 66371, -408520, -339700, 383050, -34814, -160041]
12388a60041B47003c13192g6784B6027J82630N5611D0866R866a31770A41824a48986
12376B13759i1098A66115G9286Q9634a36904C7555J43255b34405J07054A76048
12365A13987J09908J4620p1421q0868b32496A62692G4380L313i3128I9622J49581
12354B49203C0860c14725B99231N2934c16249B01232a24859A35903A3755L4339
12344D8094c0941f803m670A9834J23101a12818j37023C45795i2673A92711b13436
12332a81834A96685B9366K15765b28352N3525I0846J666Q3773a03808D735a43098
12320i8682A20820a53026a8440F169J05450l4843M1911a07179A48271d135q5811
12309h9946l5684j5210E9496Q7726C5149b76128A39723O7689j2227o7221F927
$$ y = [-160041, 247003, -313192, -76784, 26027, 208657, 264268, 40866, 50732, -131770, 141824, -148986, 213759, -91098, 166115, 79286, 168920, -136904, 37555, 180810, -234405, -127351, 176048, 113987, 223895, 238515, 167094, 86226, -232496, 162692, 74380, 77693, -93128, 99622, 249203, 30860, -314725, 299231, 352165, -316249, 201232, -124859, 135903, 13755, 48094, -30941, -6803, -11473, 19834, 142935, -112818, -249841, 345795, -92673, 192711, -213436, -181834, 196685, 29366, 245131, -228352, -174827, 90846, 92512, 176285, -103808, 4735, -143098, -98682, 120820, -153026, -18440, 6169, 111619, 76776, 118687, -107179, 148271, -4135, -89946, -125630, -140840, 59496, 147222, 35149, -276128, 139723, 207412, 195185, 127964, 6927]
12297a04002F4249a32444A40437a21436A57031p6319J95108j24618m0660N5680
12287A66222p7214L481k1020R9652H876a47807G3343J28999c358C21628c70315
12275A30591L40175j87937j42L8858l0242d3804B11781r4702K91080a25046A57937
12263G3802M1319J54922J5065A0742J02092m4507B8090P6004c2380I624e120F3519
12250C80190j47147j13255b26029D69721I3217J15469e7805F8658a23133A33905
12239B10861b32386F1968j0207J03630h9886B33869B0934J29595K70951A63362
12228a49051C66956K24346j91662J77430O975e1187D0819R5481P2534Q7198A23308
12216B61572A11057g0522B15927o8033N3565J67087D0451A7600a4212B97251K12538
$$ y = [-104002, 64249, -132444, 140437, -121436, 157031, 80712, 275820, 151202, 110542, 166222, 89008, 92489, 71469, 171121, 8876, -147807, 73343, 202342, -3358, 321628, -370315, 130591, 470766, 282829, 282687, 321545, 291303, -43804, 211781, 117079, 408159, -125046, 157937, 73802, 115121, 270043, 285108, 10742, 112834, 68327, 28090, 104094, -32380, 9624, -5120, 63519, 380190, 233043, 119788, -226029, 469721, 93217, 208686, -57805, 68658, -123133, 133905, 210861, -232386, 61968, 51761, 155391, -89886, 233869, 20934, 150529, 421480, 163362, -149051, 366956, 591302, 399640, 577070, 584045, -51187, 40819, 136300, 208834, 296032, 123308, 261572, 111057, -70522, 215927, 147894, 201459, 368546, 40451, 17600, -14212, 297251, 509789]
12205E09789B2891i972A69524l2969L433E9534K42811l7782J34793A89713K5105
12194B14818K40265J41205h4407A96212G8234a86689i3113k5662B85620d2712
12183B63887A22131a54700B18416g212m2310A86757b80095C9257J6049e7699B28434
12171D09679j77077g8868D34121a2691I4841a9009F6392J27686H7506K54738f9268
12159C22022n5549c22405J16973h3612r1295A12420a7754A57566M6393b69596
12148A31605E7278K6945o554O297b59171c5747J7361q0626B4472i5860A83725
12136E480J41291f0294G9117J50690j10687n0682M2317a63675g3307F3364a8759
12124a77714L7621B25345q8773o1032N6952L1344h2722E2988b06426A46918b63152
$$ y = [509789, 22891, -9972, 169524, 136555, 139988, 59534, 302345, 264563, 399356, 189713, 214818, 455083, 596288, -84407, 196212, 78234, -186689, -93113, -118775, 285620, -42712, 263887, 122131, -154700, 218416, -7212, -49522, 186757, -280095, 39257, 55306, -57699, 228434, 409679, 232602, -78868, 434121, -12691, 94841, -19009, 66392, 194078, 87506, 342244, -69268, 322022, 266473, -322405, -205432, -83612, -174907, 112420, -17754, 157566, 203959, -269596, 131605, 57278, 84223, 77669, 83966, -259171, -35747, -18386, -99012, 24472, -95860, 183725, 5480, 146771, -60294, 79117, 229807, 119120, 68438, 110755, -163675, -73307, 63364, -18759, -177714, -140093, 225345, 136572, 75540, 132492, 163836, -82722, 52988, -206426, 146918, -263152]
12112F9936a96941B5639J37563B6665L5526d3345k70481B71537b9084j24455L2249
12101a21290g4n8195A26099E7711E60a76925d5731k44907a1371D71255a6658k04917
12089b21575b4381j39021q5077A05843b73133D19665a45699k8453E8043N7971
12079A16014J96629A10441e0737A21048m5892N7220L14042N01676J299735A032915
12068D97921j24252J21741a3563r459j51036B39889l7145e375j96540E1071g7369
12056c1112B14143b56376C45728j54197J34217G9538k7129K9140J5626b5991A80499
12044c66588F1226J62046F6306K27533a40176A27160N8981R5335H5688h0592K2352
12033e8240p5987j15618A67975Q5343A22302L2754a25156B15644D9408J02917
$$ y = [69936, -196941, 25639, 163202, 26665, 62191, -43345, -313826, 271537, -29084, -153539, -121290, -74, -58269, 126099, 57711, 560, -176925, -45731, -290638, -11371, 471255, -16658, -221575, -24381, -163402, -248479, 105843, -273133, 419665, -145699, -174152, 58043, 116014, 312643, 110441, -50737, 121048, 75156, 132376, 446418, 948094, 2247829, 1032915, 497921, 373669, 495410, -13563, -23022, -174058, 239889, 202744, -5375, -201915, 51071, -77369, -31112, 214143, -256376, 345728, 191531, 325748, 79538, 52409, 81549, 97175, -25991, 180499, -366588, 61226, 223272, 66306, 293839, -140176, 127160, 186141, 281476, 85688, -80592, -58240, -134227, -249845, 167975, 253318, 122302, 155056, -125156, 215644, 49408, 152325]
12023A52325M12472h1427D9030j3805L4406J80090I0645D0328P1634b09375H7676
12011e270k35548i1085B48326A3280a79825A92937j2010p5035B8716b22809A09141
11999F8785b3914A33478O5225b21608L3905c0934E709J16445b40950a07153C13865
11987c62381f2607k15897g9941A80157h2048H6961a02099a9674j60412b5174j89181
11976b14355h3559q7438A43955a41123K7000k03870f6637A32578d751k70280R0077
11965a84954F831a44552B46619k1199G5376i222A69084j9136H263c86962i7360
11953b980I805J14148c9004l4717F1261a15123r819j02220c7828A63758a31648
11941B30106l4963K1021e2648A63378c09254i6153k6906N8092E98g2202D30343
$$ y = [152325, 564797, -81427, 49030, 35225, 69631, 249721, 90645, 40328, 111962, -209375, 87676, -5270, -240818, -91085, 248326, 13280, -179825, 192937, 180927, 105892, 28716, -222809, 109141, 68785, -23914, 133478, 198703, -221608, -187703, -30934, 5709, 122154, -240950, -107153, 313865, -362381, -62607, -278504, -79941, 180157, -82048, 86961, -102099, -19674, -180086, -25174, -214355, -83559, -170997, 143955, -141123, -114123, -317993, -66637, 132578, -4751, -275031, -184954, 6831, -144552, 246619, 225420, 75376, -9222, 169084, 149948, 8263, -386962, -97360, -2980, 9805, 123953, -39004, -73721, 61261, -115123, -124942, -227162, -37828, 163758, -131648, 230106, 195143, 216164, -52648, 163378, -309254, -96153, -123059, -64967, 598, -72202, 430343]
11929c3902A25908B0950R184R268R3379j4674D2941O3477O2810J59153G9778a34895
11916h6697A14848J77655b60977a00044k10351J24606F15J57740B8848b43115
11905b04916E3552a35883k22142a3849O905B80046H5634c1714n2325B38818H3560
11893a72891j78830J72553p8684H9708b76373P3868A5641a53745G4582g35390
11882I7472k4193J21253j8137J6384l9862h9050j01002G3875M8225k7026b71548
11870a63190R419n9573i1963H17N0709J26928a01641O778r6306b5168k01866d749
11857b21050A29183j4755n0376b15494H7806Q6054b13367i2626C06756c3618H1141
11845a26459B8365b05486B6471g9647j06382j34031A27838e3118B22677l8623
$$ y = [-33902, 125908, 20950, 30134, 39402, 132781, 118107, 42941, 106418, 169228, 328381, 79778, -134895, -86697, 114848, 292503, -260977, -100044, -310395, -185789, 615, 158355, 28848, -243115, -204916, 53552, -135883, -358025, -13849, -6944, 280046, 85634, -31714, -84039, 238818, 83560, -172891, -351721, -179168, -257852, 89708, -276373, -202505, 15641, -153745, 74582, -735390, 97472, 73279, 194532, 176395, 192779, 152917, -89050, -190052, 73875, 122100, 95074, -271548, -163190, -153771, -213344, -91963, 817, 51526, 178454, -101641, -94863, -191169, -25168, -227034, -4749, -221050, 129183, 114428, 64052, -215494, 87806, 173860, -213367, -92626, 306756, -33618, 81141, -126459, 28365, -205486, 26471, -79647, -186029, -320060, 127838, -53118, 222677, 184054]
11835A84054C6280p770J37880a62450e2528j57975L23N5140A07091a49274e5911
11823F8979a59397E3860c57540A7514a52706A45626c8857o5655d2991j76372L6226
11812a83137O1995b6663k05237C06364p8527a29508N1997F1932d0239A46618i4541
11800B61640p1129e7920B7376c3986j45259D7876J44970g2549D56751d2703B94499
11788c36911J48722Q5970B94149D6241b13053f5332j67643A41618a47809B24827
11777A55464E2576b18669C1097L1179L9154J85928b05891E5848b12303A41757
11766A36574a58745F6747J48123b68863K6324E8083K39843c19934J27556k1652
11756b14030f304E24375I2264i3237c0644A91732a14617G0099g4215B1175J61267
$$ y = [184054, 36280, 28510, 166390, -162450, -52528, -210503, -210180, -155040, 107091, -149274, -55911, 68979, -159397, 53860, -357540, 17514, -152706, 145626, -38857, -104512, -42991, -219363, -183137, -121142, -26663, -231900, 306364, 227837, -129508, -77511, 61932, -40239, 146618, -94541, 261640, 190511, -57920, 27376, -33986, -179245, 47876, 192846, -72549, 456751, -42703, 294499, -336911, -188189, -102219, 294149, 46241, -213053, -65332, -232975, 141618, -147809, 224827, 155464, 52576, -218669, 31097, 62276, 101430, 287358, -205891, 55848, -212303, 141757, 136574, -158745, 66747, 214870, -268863, -242539, 58083, 297926, -319934, -192378, -214030, -6304, 524375, 92264, -93237, -30644, 191732, -114617, 70099, -74215, 21175, 182442]
11745A82442b07765N2080m1150H9014k8202c07820B18689a28522L724B7595K6521
11734E4116K9112P0930i5799n3344g3549k2525j28348B0888K99320H5387b5501
11722A82207a39027F6881a32772k617A83609H0965J1281J30277a11157C80854
11711B53734c57141A01726N6857N1669d1758C6658O6888J57865r9855l6081J64007
11700B89482c4673n8883c621E5929P3195B9559g33D9786c41400B24314a29662
11688H349a25991I4134f8630b8199B0915c4474B90365q0673b4817G3670Q9454
11677A63124c847E21337j98462b971I0275N731i1717r817D9236i5840B46066G3244
11664A05240c00370a13486e6053j78721j27168C02937c04784L9280C45666N5839
$$ y = [182442, -207765, -155685, -196835, 89014, 60812, -307820, 218689, -128522, -124798, 27595, 54116, 83228, 154158, -95799, -149143, -73549, -96074, -224422, 20888, 320208, 85387, -25501, 182207, -139027, 66881, -132772, -135389, 183609, 80965, 92246, 222523, -111157, 380854, 253734, -357141, 101726, 158583, 210252, -41758, 36658, 103546, 261411, 161556, 125475, 289482, -34673, -93556, -3621, 55929, 129124, 29559, -733, 49786, -341400, 224314, -129662, 8349, -125991, 94134, -68630, -28199, 20915, -34474, 290365, 209692, -24817, 73670, 163124, -3847, 521337, 322875, -2971, 90275, 96006, -91717, -101534, 49236, -95840, 246066, 73244, 105240, -300370, -113486, -56053, -234774, -361942, 302937, -304784, -265504, 345666, 401505]
11654D01505F0837a46666B07561l5105Q2369C562M8875k5754i340G049g7504c3130
11641D1225M3828O2644K52098g9929j54355B2455b63758b1986A94003f7794B3719
11629A93958K37116C7687J1639e6070C46449A35227a25943B6178L06518j23639
11619B09057a7102B15734n9532b5133j23813A21681n4188P8320o843N8484C3745
11607C13481j12694n9203J11350d8879C87604j23994I9819b32778A2238R5933
11597A08171J6293J6790b01544h637A78855E7954J74548a29842A39718k5722Q2875
11586A96871k1371p7462a57873J8286A69304c9765n9733C96982b08150A31114
11575G4751f0608B11583Q1864P875A33139b24262C4311a27449B31915a7612A40317
$$ y = [401505, 60837, -146666, 207561, 172456, 254825, 3562, 52437, 26683, -9340, 7049, -77504, -33130, 41225, 85053, 147697, 399795, -79929, -234284, 22455, -263758, -21986, 194003, -67794, 23719, 193958, 431074, 37687, 49326, -56070, 346449, 135227, -125943, 26178, 332696, 209057, -17102, 215734, 156202, -25133, -148946, 121681, 67493, 145813, 138970, 197454, 33745, 313481, 200787, 141584, 252934, -48879, 387604, 263610, 99819, -232778, 12238, 108171, 124464, 141254, -201544, -8637, 178855, 57954, 232502, -129842, 139718, 113996, 196871, 175500, 98038, -157873, -139587, 169304, -39765, -99498, 396982, -208150, 131114, 74751, -60608, 211583, 293447, 301322, 133139, -224262, 34311, -127449, 231915, -17612, 140317]
11563A21137J79920d4919A66600n6045J89829h6783E8683M3160J94661A33030
11552C0596K6706i9109I2678c5294G5264J54655j00752a62133H5406f3835j07563
11541a71398A30273J2797J25632J78296A83749c6469B6798N6047l4956K1873i3122
11529A60772C863J26965a27960A22696b37222i9695B56001M0602J43141i5147
11518b489A53981J50615j41366k8352R4888b93783A34978o6092J48774A5211K3404
11507C8615K59625a6184I5150h8971m2113N1493c8159j71946C55716A62812N3407
11496B16219r5741P5248a65170E4039J25904j3216F6323d1814F928L8241K39787
11485B84956c2704I7313j4281p433L72491A99681a15570A41167K10645J56503
$$ y = [121137, 301057, -44919, 166600, 110555, 300384, -86783, 58683, 101843, 296504, 133030, 30596, 57302, -99109, 92678, -35294, 75264, 229919, 129167, -162133, 85406, -63835, -171398, 130273, 143070, 268702, 446998, 183749, -36469, 26798, 82845, 47889, 69762, -93122, 160772, 3863, 130828, -127960, 122696, -237222, -99695, 256001, 296603, 439744, -95147, -2489, 153981, 304596, 163230, 134878, 229766, -293783, 134978, 68886, 217660, 15211, 38615, 298240, -16184, 95150, -88971, -131084, -79591, -38159, -210105, 355716, 162812, 216219, 120478, 195726, -165170, 54039, 179943, 166727, 66323, -41814, 6928, 45169, 284956, -32704, 97313, 83032, 75599, 448090, 199681, -115570, 141167, 351812, 508315]
11475E08315r0612A75537G2939J23022q6245L26692B0943L07981j52795O3420
11465B39549c4470A03073D3491L88726A30361K10691B3000O0562a38652B5312
11454h578l55780D8285Q2438h2549I8131K80997b17013B2911L8013J30190J77547
11443C68661c0582C3955K92430O7553b37522B33268A00227a65016C73040i1588
11432B82733h5099j21142N5222H5785c2435k96576A31163C5812N6731J39005a1861
11420A70354a75937a3144A22446j4897a17359E13617A4344K7656R3085b17697
11409a09173A44600E0324A7138K02579q7458J36478a18774p7709A1816J69680
11399A81496H2469d2733B87187b57039A61977a22132o521L2374L4477J2980B56824
$$ y = [508315, 417703, 175537, 72939, 195961, 109716, 436408, 20943, 328924, 176129, 239549, -34470, 103073, 43491, 432217, 130361, 341052, 23000, 83562, -138652, 25312, -8578, -364358, 48285, 130723, -82549, 98131, 379128, -217013, 22911, 60924, 191114, 368661, -30582, 33955, 326385, 393938, -237522, 233268, 100227, -165016, 373040, -91588, 282733, -85099, -206241, -151019, 85785, -32435, -329011, 131163, 35812, 92543, 231548, -11861, 170354, -175937, -13144, 122446, 107549, -117359, 513617, 14344, 42000, 135085, -217697, -109173, 144600, 50324, 17138, 219717, 132259, 268737, -118774, -196483, 11816, 181496, 82469, -42733, 287187, -257039, 161977, -122132, -128653, -96279, -61802, -48822, 256824]
11387E7499J52451G9994J03673a7935k86163A3234N6826K05668a50433A7458a17363
11375D87858h1377B44969J2087O4995a64020a8930D16179a498A23558C3928J7331
11364E1259L9514K7087L52391A61497a90377D0141a13064O515E6712j6949b71780
11352h461j45872f1103H0448a93334A02613g3743K4137F4829L4577B8070K5586
11341E3656a34747M9897A153J28478d3345j92839a514k9321q901A17777H338M4772
11329E3110O5684B7936c8536j25122A04412a39854D6858K02206E6511K95946C7695
11317b27351a456f62j89456A1807h2145f446n864j0584J1128k40473Q5756Q1820
11305h4663J4647m945C2290J94067J8548d8663k48674J27341B38374D6188c1458
$$ y = [57499, 209950, 79994, 183667, -17935, -304098, 13234, 70060, 275728, -150433, 17458, -117363, 487858, -81377, 244969, 257056, 322051, -164020, -18930, 416179, -1498, 123558, 33928, 51259, 90773, 117860, 470251, 161497, -190377, 40141, -113064, -106549, 56712, 39763, -271780, -8461, -154333, -61103, 80448, -193334, 102613, -73743, -49606, 64829, 99406, 28070, 53656, -134747, -84850, 1153, 129631, -43345, -236184, -1514, -30835, -39736, 117777, 8338, 53110, 118794, 27936, -38536, -163658, 104412, -139854, 46858, 249064, 56511, 352457, 37695, -227351, -1456, -662, -190118, 11807, -82145, -6446, -12310, -22894, -11766, -252239, -166483, -84663, -70016, -74961, 32290, 226357, 244905, -48663, -297337, -169996, 238374, 46188, -31458]
11293D9199c8443B93257c31734G091O0487a76315b8601B1052i0310c1600j30534
11282a62134A49001f8234j79144P0593A64869N606a9196k7703A15590b04757b0548
11270a24649c0944j33479A58264M0496c12158B93616H9790J20537H4457C6008
11259a93425g9589A08577A3024f0809K3105m0435j75954E0446b80270d5684C329
11247a11614j00501M1514m1457a01348A12810i6969I3168a38197A1258b6141p9713
11236a05854a8838n37813a62576M3878j51611a31642D68416b49388A53760N2927
11226B06687f8122a9660k88823P1837F074h9934j10671B39220b99919A30811J1043
11215A41854m5128b15341A23782H308a42134G0580K00078a44137A49081a75483
$$ y = [49199, -38443, 293257, -331734, 7091, 67578, -176315, -28601, 21052, -90310, -31600, -162134, 149001, -68234, -247378, -176785, 164869, 170475, -19196, -46899, 115590, -204757, -20548, -124649, -30944, -164423, 158264, 198760, -312158, 293616, 89790, 210327, 84457, 36008, -193425, -79589, 108577, 13024, -60809, -37704, -78139, -254093, 50446, -280270, -45684, 3329, -111614, -212115, -170601, -212058, -101348, 112810, -96969, 93168, -138197, 11258, -26141, -105854, -18838, -556651, -162576, -118698, -270309, -131642, 468416, -249388, 153760, 206687, -68122, -19660, -308483, -236646, 6074, -89934, -200605, 239220, -299919, 130811, 141854, 96726, -215341, 123782, 8308, -142134, 70580, 270658, -144137, 149081, -175483]
11204b24011j83003d6704K0876r3840H0651M1909e7334A1393a00433J1603o5992
11193a54822E9055N8537b5245l6505A6782c24370C74118H1283J17484a32592b518
11181a34907M253k36488a21629C8357b35826D07889a56421k1869A77821d5758
11170d2683j55893A01801N4214r505a91929r2903e7529j46577C81269A38313n4043
11159H4270g6659H6312a89391B07986p3243n0811c04735F9870e3702O948k2045
11148f8799F8722A3671Q2919R0536a36095D5329a64628A04474i0817H4667p221
11137G7446d2816a2372C13439a12682A9290K31289a18513A55831m1083g0968B90822
11125E1293b15452B32084D4459J05869c2902B13291n7296k1742a46519F4094N7219
$$ y = [-224011, -407014, -46704, -25828, -119668, 80651, 122560, -57334, 11393, -100433, -88830, -154822, 59055, 117592, -25245, -61750, 16782, -324370, 374118, 81283, 198767, -132592, -2518, -134907, -130654, -367142, -121629, 38357, -235826, 407889, -156421, -178290, 177821, -45758, -42683, -198576, 101801, 156015, 146510, -191929, -284832, -57529, -204106, 381269, 138313, 84270, -76659, 86312, -189391, 207986, 134743, 83932, -304735, 69870, -53702, -46754, -68799, 68722, 13671, 96590, 187126, -136095, 45329, -164628, 104474, -90817, 84667, 77446, -42816, -12372, 313439, -112682, 19290, 250579, -118513, 155831, 114748, -70968, 290822, 51293, -215452, 232084, 44459, 150328, -32902, 213291, 155995, 134253, -146519, 64094, 121313]
11114A21313i4715A37004a41320g139A37020R4275r8337P0034F4070K28109j08439
11103A83740b70697C99550c8888A70056K79808c39386A10854J63722F75J80987
11093A81662L2011A7723i0781M0082A77005a37398B93542j09542R9529K70288
11083E53817A78123a40887B08463K6648A16846N1353j6925k7526A3300M4878L52101
11072D10279j45825r1892j5392N40431k30996c7232B58054L80607k88660j40133
11062B09868K23039J27309K4710J90169k29253L96211m03105K88236p4267n7036
11052F95881J25464R3033N4284j15448j714j00671K12366j11221J33174l33683
11042F51465L25435l41775J12671k29148K65228K46702k75188j64574K34886m701
$$ y = [121313, -94715, 137004, -141320, -7139, 137020, 231295, 132958, 202992, 64070, 292179, 183740, -270697, 399550, -38888, 170056, 449864, -339386, 110854, 274576, 675, 181662, 213673, 17723, -90781, -50699, 177005, -137398, 293542, 184000, 283529, 553817, 178123, -140887, 208463, 235111, 116846, 168199, 151274, 123748, 13300, 58178, 410279, 264454, 172562, 157170, 697601, 466605, -37232, 258054, 638661, 350001, 209868, 432907, 560216, 584926, 775095, 545842, 942053, 538948, 827184, 752917, 695881, 821345, 914378, 968662, 853214, 851500, 750829, 963195, 851974, 985148, 651465, 976900, 635125, 747796, 518648, 783876, 1030578, 755390, 590816, 825702, 821001]
11032H21001j6104p1878J87685j46975k74339k8420J73223K96401j40217k88586
11022E11791J61643j28108r8796j35568N01530B84978J26714L03266j80553N2476
11012E86881K02937J38215n407k36243J28758l68024K82706K27850m68835P4202
11002E63040o6212J3910L64744p5226n5881l5325j4872l42444Q0445L16379k21639
10991E26919J68910J52770J8525K54907k86812K91418m6522l10499K7329M11233
10981A208178n6438Q4151m4479M24740M84657j72765L15182J38903L97700J60864
10971B940693o4483K75509j07654j36552j38383m1315m07188n72205n9676n1691
10961A637055K21492l1393j03957P1149J8110j0031K33065k59262m59091j04908
$$ y = [821001, 804897, 733019, 920704, 773729, 499390, 470970, 644193, 940594, 800377, 511791, 673434, 545326, 446530, 310962, 812492, 284978, 411692, 714958, 534405, 586881, 789818, 928033, 922626, 686383, 815141, 447117, 729823, 957673, 488838, 563040, 496828, 510738, 875482, 800256, 744375, 709050, 694178, 351734, 432179, 748558, 526919, 695829, 848599, 867124, 1122031, 835219, 1126637, 1080115, 769616, 796945, 1208178, 1151740, 1235891, 1191412, 1616152, 2100809, 1928044, 2243226, 2382129, 2779829, 2940693, 2876210, 3151719, 3044065, 2907513, 2769130, 2727815, 2320627, 1748422, 1688746, 1637055, 1858547, 1827154, 1723197, 1794346, 1812456, 1802425, 2035490, 1776228, 1317137, 1212229]
10951A212229K7825k66648m3678k04929J07377l73178L184n6356r3440L2264Q481
10940C53131R6872k06457D6017k1411Q1421J47142o4553i6432D98642m4794A56085
10928A1221a91335C19861r7243I0253a34986L4296D26871A8009c0312F9987N5375
10917A25362b23662e1099b5360A48729D051a86688G6411d7661G1730B8153O0419
10906H8572h889l5304k22889B3610a03610D2615J30424b85907C514b9158j47460
10895a76618h0162F8045a0513j3403b530n4561F7657d1987C11542j07433a06517
10883f0825j29752j69428R1570A73707b11264A34532E0683a36782A51656L59225
10873E10881A77170L6359j5595n8353f7322E819d0991m689k60325F5301J93512
$$ y = [1212229, 1240054, 973406, 929728, 724799, 832176, 458998, 462182, 405826, 312386, 344650, 353131, 450003, 243546, 46017, 24606, 106027, 253169, 188616, -96432, 498642, 453848, 156085, 11221, -191335, 319861, 222618, 90253, -134986, -100690, 426871, 18009, -30312, 69987, 125362, -223662, -51099, -25360, 148729, 4051, -186688, 76411, -47661, 71730, 28153, 88572, -8889, -44193, -267082, 23610, -103610, 42615, 173039, -285907, 3514, -29158, -176618, -80162, 68045, -10513, -23916, -2530, -57091, 67657, -41987, 311542, 204109, -106517, -60825, -190577, -360005, -268435, 173707, -211264, 134532, 50683, -136782, 151656, 510881, 177170, 213529, 197934, 139581, -67322, 5819, -40991, -45680, -306005, 65301, 258813]
10862B58813G8498K97632f2610B8613L49182D7697L4444b29123j43267G1021J96939
10851B67960D0875b65807N0710B45358a37263k44892G0892J88222c84098a42872
10840G4022K6308a08298H0346E252J12509k8210J71928F9401K88357a64864l6006
10829b00870I5701a03888A67298b29498Q1969M9807H785K58812a35465o1726O4476
10818a32715F3550L17497A9930d66173K13236E2521a21063G6852h2615j61101
10808b43716h3193b0765n2749a134j36341F0988q125c2016j6608j85990A48323
10796G3725d7013E1240J04403a60807M7371e6040F119a56447P7596L1461d369
10784A1035J32293e8076G4952f7394D59217b7550D3210g7981C1869c35297a22950
$$ y = [258813, 78498, 376130, -62610, 28613, 377795, 47697, 82141, -229123, -372390, 71021, 267960, 40875, -265807, -215097, 245358, -137263, -382155, 70892, 259114, -384098, -142872, 74022, 100330, -108298, 80346, 5252, 117761, 89551, 261479, 69401, 357758, -164864, -200870, 95701, -103888, 167298, -229498, -147529, -97722, 8785, 267597, -135465, -197191, -132715, 63550, 381047, 19930, -466173, -252937, 52521, -121063, 76852, -82615, -243716, -83193, -20765, -73514, -1134, -137475, 60988, 52863, -32016, -48624, -234614, 148323, 73725, -47013, 51240, 155643, -160807, -113436, -56040, 6119, -156447, -78851, -47390, -4369, 11035, 143328, -58076, 74952, -67394, 459217, -27550, 43210, -77981, 31869, -335297, -122950]
10772b26792G7416P1049h9561H5592j060d23320e9999H1281b79198j5679g9126
10760a36134H0901B4946a02164I5362i3312F6703b2360I2064b44892a10343E6341
10748a71867m7614a1336k30270C53635b68970C8894a34851C05698A16911b07573
10737a79435I8234J01463a77002E5746d2170B0341J54268c18429a13408B62450
10726a87676L4358k5936H6804a25604q563F9691f0761j22610l0501A5228K28260
10715B43488f5103A39312c95171F9765N2142n5594M7322b17544P3109d9265r9555
10704a48820A54190c98976A70340g2242C50868M9777b43689b4663D9477i7766
10693e9336J1871j39729E310f2797B45772a92113B4627J34276d86597a17421k65046
$$ y = [-226792, 77416, 148465, -89561, 85592, 84532, -423320, -59999, 81281, -279198, -294877, -79126, -136134, 80901, 24946, -102164, 95362, -93312, 66703, -22360, 92064, -244892, -110343, 56341, -171867, -219481, -11336, -241606, 353635, -268970, 38894, -134851, 305698, 116911, -207573, -179435, 98234, 199697, -177002, 55746, -42170, 20341, 174609, -318429, -113408, 262450, -187676, -153318, -179254, 86804, -125604, -134167, 69691, -60761, -183371, -213872, 15228, 243488, -65103, 139312, -395171, 69765, 121907, 66313, 113635, -217544, -144435, -49265, -148820, 154190, -398976, 170340, -72242, 350868, 400645, -243689, -24663, 49477, -97766, -59336, -47465, -187194, 5310, -62797, 245772, -192113, 24627, 158903, -486597, -117421, -382467]
10682c82467h0866A67324g9304k77459c6785H6363a42465O6191j22918P0175K1777
10671a07240d0521j87703c5649H1410a4885B67082I6657b27021A04394K40753
10661C45147b0686A58642d26273a32254j39822k7564e3917A768b66783K1327g2666
10649b09579R6089A19973c79586h3590B9824K6224A9125b03753A73493a3025l16526
10638c29551a08426K5047F8043p495b03422m5552C9274M13212a9012j07729b422
10626G0100f7965m3867A11344a29300q9167l39990a74590l88210b72606l9841
10616c12447C3864b83487A79662c11872a29487r7892r9774C71115a32590C81736
10605i9475j27007d7839G9153J32510o2885a64115g0578j71491C70662b38285
$$ y = [-382467, -80866, 167324, -79304, -356763, -36785, 86363, -142465, -76274, -199192, -129017, -107240, -40521, -228224, -35649, 81410, -14885, 267082, 96657, -227021, 104394, 345147, -20686, 158642, -426273, -132254, -272076, -299640, -53917, 1768, -266783, -245456, -72666, -209579, -113490, 119973, -379586, -83590, 29824, 56048, 19125, -203753, 173493, -13025, -329551, -108426, -83379, 68043, 60548, -203422, -248974, 39274, 452486, -19012, -126741, -2422, 70100, -67965, -111832, 111344, -129300, -218467, -558457, -174590, -562800, -272606, -312447, 33864, -283487, 179662, -311872, -129487, -227379, -327153, 371115, -132590, 381736, -99475, -226482, -47839, 79153, 211663, 148778, -164115, -70578, -242069, 370662, -238285]
10594b5412A69399E1937n483g0262B3646g9458A08752l5123e1356k2041j59802
10583b33199e8714D54918A39988P2446m1282g3786A61279j7174B5697b28134p0857
10572b98991H5631J63464i3675c2034k9671k1140k0860o9524r1537a6806m2053
10561e8859H7946A6385b7823r8199A3172L4883R8894b1745B91271p2405C4126
10549E8266J54756d81917C9744b47300n0344B17705P8863a12844C7982a95213
10538c61605F8130B0076a33499N6764A77120b18141D5408a33231O906f1725A91362
10526a52189A5014O4212a08066H0198l3597a53451B81402C812K48000l293c15487
10514a00130K2364C83506A43670a3286A08962e5746j51263R4103E12778a30005
$$ y = [-25412, 169399, 51937, 46454, -70262, 23646, -79458, 108752, 73629, -51356, -73397, -233199, -58714, 454918, 139988, 212434, 171152, -73786, 161279, 144105, 25697, -228134, -298991, 85631, 249095, -93675, -32034, -61705, -82845, -103705, -173229, -264766, -16806, -58859, 87946, 16385, -27823, -126022, 13172, 48055, 146949, -21745, 291271, 218866, 34126, 58266, 213022, -481917, 39744, -247300, -297644, 217705, 296568, -112844, 37982, -195213, -361605, 68130, 20076, -133499, -76735, 177120, -218141, 45408, -133231, -126325, -61725, 191362, -152189, 15014, 79226, -108066, 80198, 46601, -153451, 281402, 3812, 251812, 248519, -315487, -100130, -77766, 383506, 143670, -13286, 108962, -55746, -207009, -112906, 512778, -130005]
10503c74036a21476E0757a78668M7846A5732d8584k64971J04492A52166a39946
10492B47483r6489R587d2458n8493A85844B9070J71636B1681a39560A19855J58569
10481B78424J80235N0958J4087B24932K18356g8570A60141a25653A41701b18556
10470c47682B42718J06546b19632C34102b74290M8843h0597A04981f2379k47534
10460c09913i5635j7157C7867a44706p9391c2828A22981J02281j12042f3038j44226
10449b07264A2882K2448a21363A87254D8810a17245E6080R5579G1a09424E5365
10437A62739e9299r9487d2450A83350a74881j30353L1337R15g0971a412A45244
10425a99139G184L7254j6770d6008j37164o1144A0820L1317P3802O3387C1931
$$ y = [-374036, -121476, 50757, -178668, -130822, 15732, -48584, -313555, -209063, 152166, -139946, 247483, 150994, 160581, -42458, -100951, 185844, 29070, 200706, 21681, -139560, 119855, 278424, 458659, 509617, 523704, 224932, 443288, -78570, 160141, -125653, 141701, -218556, -347682, 242718, 349264, -219632, 334102, -274290, -225447, -80597, 104981, -62379, -309913, -95635, -112792, 37867, -144706, -224097, -32828, 122981, 225262, 113220, -63038, -207264, 12882, 35330, -121363, 187254, 48810, -117245, 56080, 151659, 71, -109424, 55365, 162739, -59299, -158786, -42450, 183350, -174881, -305234, -273897, -272982, -70971, -1412, 145244, -199139, 7184, 44438, 27668, -46008, -183172, -244316, 10820, 42137, 115939, 179326, 31931]
10413g1374n7376D02349A28829K66197c66617b8113p1833I499J9038Q7905m1473
10402G4969K7085b36687E4225K9867C4947a50033H0923L552b67571A27620d2059
10390B02863R0466r32E221J73457P4836P0711E5839J96461R9158b1547j24697
10379a46244B06513O1292m011n3306J84223j38937o6509K76165B22913K8972L9039
10368B90924M6065K1439K2320L39742k10785j44981G0241K08990k088Q3290j28359
10357B32074I5115b0718B21330J37793M5680k4124K0127N7902N5288B05242M0738
10346B45980J08469K6526j8707j6617j07086M06771A21979J35143j14848n3270
10336H9004l1536K13641O8414K775K6770d11201a97561K2783h661A25300a19081
$$ y = [-71374, -128750, 402349, 128829, 395026, -366617, -28113, -99946, 9499, 28537, 116442, 74969, 102054, -236687, 54225, 84092, 34947, -150033, 80923, 84475, -267571, 127620, -42059, 202863, 293329, 292397, 5221, 178678, 253514, 324225, 55839, 252300, 351458, -21547, -146244, 206513, 267805, 263794, 210488, 394711, 255774, 189265, 465430, 222913, 251885, 290924, 336989, 358428, 380748, 720490, 509705, 364724, 70241, 279231, 277143, 360433, 232074, 95115, -20718, 221330, 359123, 404803, 380679, 400806, 458708, 513996, 205242, 245980, 354449, 380975, 362268, 345651, 238565, 645336, 121979, 257122, 142274, 89004, 57468, 271109, 339523, 342298, 369068, -411201, -197561, -174778, -8661, 125300, -119081]
10324D3356I626J47423K64987E5847K09403l8346o3077l9247c1415B00708N7120
10313B57828j08793G1566K69058a02671d7102B19574E91a19301G6252a12077c9424
10301B78800n3206e518j20227B20572d01896C14447A32492a75243B36784q1382
10291A55402i9539A73380F5036a26520A42918l2311P0711b51741B79233a02621
10280a82119F5763a39074C0670d3254G6550b4254n5570b8684j8432D0669b04957
10268g4595j59227I7742a02580c4974A53464K40234G9438K58680A46736K80044
10258D26780j20521n2436J70730K49569A69999J15201f40883B34833a2206l7102
10248d9308n7905q0992d7330A50875J87168b56127a18297j23787Q9315N4527F9027
$$ y = [43356, 9626, 157049, 422036, 55847, 265250, 226904, 163827, 124580, -31415, 200708, 257828, 149035, 71566, 340624, -102671, -47102, 219574, 591, -119301, 76252, -112077, -39424, 278800, 225594, -5518, -125745, 220572, -401896, 314447, 132492, -175243, 236784, 155402, -99539, 173380, 65036, -126520, 142918, 110607, 181318, -251741, 279233, -102621, -182119, 65763, -139074, 30670, -43254, 76550, -24254, -79824, -28684, -47116, 40669, -204957, -74595, -233822, 97742, -102580, -34974, 153464, 393698, 79438, 338118, 146736, 426780, 306259, 253823, 424553, 674122, 169999, 285200, -640883, 234833, -12206, -49308, -107213, -188205, -47330, 150875, 338043, -256127, -118297, -242084, -152769, -98242, 69027]
10236A17294b73463B28741d5895C77143h668l0388A3770h0039h917k19208n3063
10225b81188H3238b8197l00569a28400p5782g6204J7875k14625H2102B7693h6011
10213I8691k2442b14951A51403a72637C1861a77417h0539l187G9374a71837e7567
10201b03731O9180I4442f1223j54975A16301m2564P9298a23813M9755k03800C21630
10189b33730e3968K2852k03848k9297h8350B93366j13104P5642c9471G8870C1018
10177C87993h5547j12357A451K23041O2096a43475j46853D7847b57921e5420o664
10166f2084B8274J23627f8810A6853b62847d027j83845Q3489B4603a39026B28250
10154B15517F2185a50204e4453j5440k6646B72765h733j04183A38651e0381e926
$$ y = [117294, -273463, 228741, -45895, 377143, -8668, -39056, 13770, -80039, -8917, -228125, -281188, 83238, -28197, -328766, -128400, -204182, -76204, -58329, -272954, 82102, 27693, -86011, 98691, 76249, -214951, 151403, -172637, 31861, -177417, -80539, -83726, 79374, -171837, -57567, -203731, -134551, 94442, -61223, -216198, 116301, 73737, 153035, -123813, -74058, -277858, 321630, -233730, -53968, -31116, -234964, -264261, -88350, 293366, 180262, 255904, -39471, 78870, 31018, 387993, -85547, -197904, 1451, 224492, 286588, -143475, -290328, 47847, -257921, -55420, -62084, 28274, 151901, -68810, 16853, -262847, -4027, -187872, -104383, 24603, -139026, 228250, 215517, 62185, -150204, -54453, -69893, -96539, 272765, -8733, -112916, 138651, -50381, -5926]
10142B2674e7559Q979I4697m7166b27699e2376j58030b8465B40824k5368l6202
10131A79254d1736j37915N7868A57754f1891l56532G0960C0460K1304J9509a02730
10119g2969j07142E72048f6977A56894J58856a75436A42342n1950Q1340d0548
10108b6240m4634d79r8m48327J49687B72269a38198C5722c40683h8102E4011a5041
10095a61419H4263c42660h8626j59284j5322a1221E0973K5627b20630N2144k316
10084a70802g8571j75414b4324j81302g281A89060c31476J62751k6290h4967A5802
10072E3003c5693A02076a36563l00045A06429d03190h0707j24434M71g2970j34299
10061b07269C9845i7938A26116a79432A39618N8091a23458A39722d45687J43358
$$ y = [22674, -57559, -48580, 94697, 47531, -227699, -52376, -210406, -28465, 240824, 215456, 179254, -41736, -179651, -121783, 157754, -61891, -418423, 70960, 30460, 51764, 71273, -102730, -72969, -180111, 572048, -66977, 156894, 315750, -175436, 142342, 90392, 171732, -40548, -26240, -70874, -479, -577, -448904, -299217, 272269, -138198, 35722, -340683, -88102, 54011, -15041, -161419, 84263, -342660, -88626, -247910, -263232, -11221, 50973, 76600, -220630, -168486, -170802, -78571, -253985, -24324, -205626, -7281, 189060, -331476, -168725, -195015, -84967, 15802, 53003, -35693, 102076, -136563, -436608, 106429, -403190, -80707, -205141, -204670, -72970, -207269, 39845, -97938, 126116, -179432, 139618, 197709, -123458, 139722, -445687, -302329]
10051c02329A2377c86669a7176j38073q7513g5168K9331r8868E4204i5464j00256
10040a95720B09072e1506G8504b08720J4047e7507k14964A34254a11541b4980
10029a54485c3541k44773h5733j12519i4572l5261C04865b76934K3736D2416b98782
10017a18615j85601L4460l6312B1238b52368l5186e8692A6705a13671B13841o8967
10006A44874a41203C68578a25466c6490I9094R0257f472n7716j83849c3469k98412
9995c31881c4654L336A13417b56345M8079c2631A33947f9019A88342a67653I3337
9983c71157a73059g654j00482N0297k42042A13362A647b5313o6161L8056j3252
9972f6670j62796B31250b38595h6875d2524j51078p1001K5986k7266B18616c03905
$$ y = [-302329, 12377, -386669, -17176, -155249, -242762, -75168, -45837, -144705, 54204, -95464, -195720, 209072, -51506, 78504, -208720, -194673, -57507, -272471, 134254, -111541, -24980, -154485, -33541, -278314, -85733, -198252, -94572, -129833, 304865, -276934, -253198, 42416, -298782, -118615, -304216, -269756, -306068, 21238, -252368, -287554, -58692, 16705, -113671, 213841, 144874, -141203, 368578, -125466, -36490, 99094, 189351, -6472, -64188, -248037, -33469, -331881, -34654, -31318, 113417, -256345, -208266, -32631, 133947, -69019, 188342, -167653, 93337, -371157, -173059, -7654, -108136, -57839, -299881, 113362, 1647, -25313, -91474, -53418, -66670, -229466, 231250, -238595, -86875, -42524, -193602, -264603, -238617, -265883, 218616, -303905]
9960B58184b53960j43197H0992d4236L372k27653c2617A79861a3617k79240J25478
9949a67379B2452a43282b3611E3015P399J7778J82834j6765b0802j6653j16920
9938a54375j17368J34131F7227a65826l1875O1915d6178B4348c18424J29260f6412
9926A27938D0648a23977r4894C2016b66588a11383C34267a52992A26540e1942
9915a27174A21480b35955A79195h6093B32022a18158k6739d5342p9450C1127b15088
9903a9001n0392n2504e4770k51083a50624C55911a06609C19024d4454n0250q2485
9892a77189B76738b09676B26245h2151F3175M4934B1922A724a90699G0967K21905
9881B92872b02306A2358f1171b1726A42309b33041f9277k785j13634j07092A40051
$$ y = [258184, -253960, -397157, 80992, -44236, -40864, -268517, -32617, 179861, -13617, -292857, -167379, 22452, -143282, -23611, 53015, 60414, 78192, 261026, 244261, -20802, -37455, -154375, -271743, -137612, 67227, -165826, -197701, -135786, -46178, 24348, -318424, -189164, -66412, 127938, 40648, -123977, -218871, 32016, -266588, -111383, 334267, -152992, 126540, -51942, -127174, 121480, -235955, 179195, -86093, 232022, -118158, -144897, -45342, -124792, 31127, -215088, -19001, -69393, -121897, -54770, -305853, -150624, 355911, -106609, 319024, -44454, -94704, -177189, 276738, -209676, 226245, -82151, 63175, 108109, 21922, 1724, -190699, 70967, 292872, -202306, 12358, -61171, -21726, 142309, -233041, -69277, -72062, -185696, -292788, 140051]
9869F147J8539K26124b59455a23807A02576b9827B02292b38268P7503f8586I1385
9857d4077j23946j84768d793I2391l3747a59025B34408b26721b3132B11581a42011
9845a93505B1649R2881B0963J31986a4817k72579N838d214j78785D2858J2405
9834E5263b26415R8095C64857F2850a40630A92737N3694a42758f5682k07620J21298
9823a52004A79227a06400l37683a66819f0190m9140N1282A04059a99325B6196
9812H4545b09263K2616A22971b40740j9276I4412m250a41721f0449j65123o530
9801b32102e8622D89920k24357c05327p4064b1307A08735b07776b2489k48237
9791b70726C6062M9980a56350I5454b4689q9901B45172C5915b47474F3661a47967
$$ y = [6147, 24686, 250810, -259455, -123807, 102576, -29827, 202292, -238268, -160765, -68586, 91385, -44077, -168023, -352791, -4793, 92391, 58644, -159025, 234408, -226721, -23132, 211581, -142011, -193505, 21649, 114530, 20963, 152949, -14817, -287396, -281558, -4214, -182999, 42858, 55263, -226415, -128320, 364857, 62850, -140630, 192737, 246431, -142758, -65682, -273302, -152004, 179227, -106400, -444083, -166819, -60190, -109330, -58048, 104059, -199325, 26196, 84545, -209263, -186647, 122971, -240740, -260016, 94412, 90162, -141721, -60449, -225572, -232102, -58622, 489920, 265563, -305327, -379391, -21307, 108735, -207776, -22489, -270726, 36062, 86042, -156350, 95454, -24689, -114590, 245172, 35915, -247474, 63661, -147967]
9779E9590b1066D10801o9805n5975c83858i2977r890j12526A62945d1603l7636
9768g9239j19820a5682j17915k16825l9886H1211c13337h4236K5152B40754a43158
9756b31352B95101F6083a05246b8488j81619J00073M2672H3463a7841j09598b5183
9744C01207C8288a60743C0641a86903i254B03827b40079j46802A60983a41612
9733d6052k88985J40861m6675j65604R1984a07936M7666F0324J49523o3251p702
9722A38894F4854b77828A7458b05165i516o5317L2024a3287A1836J13061j5240
9711A09657a59511j13727I2398K9943d06489A77517o5979b07001b5997A34881
9700C6272g025j85008d8661G5414g9688l1365B92364a01920j8415H2974a63873
$$ y = [59590, -21066, 410801, 340996, 285021, -383858, -92977, -102867, -215393, 162945, -41603, -79239, -199059, -15682, -133597, -350422, -390308, 81211, -313337, -84236, -59084, 240754, -143158, -231352, 295101, 66083, -105246, -28488, -210107, -110034, -67362, 83463, -17841, -127439, -25183, 301207, 38288, -160743, 30641, -186903, -9254, 203827, -240079, -386881, 160983, -141612, -46052, -335037, -194176, -240851, -406455, -314471, -107936, -60270, 60324, 209847, 146596, 138894, 64854, -277828, 17458, -205165, -9516, -74833, -42809, -13287, 11836, 124897, 109657, -159511, -273238, 92398, 122341, -406489, 177517, 111538, -207001, -25997, 134881, 36272, -7025, -192033, -48661, 75414, -79688, -111053, 292364, -101920, -120335, 82974, -163873]
9688c73553a60333A61271G9923b12632a5630j70580h3758E3118c9798j28717E1549
9676a29717b4790q0399A84430i8798j14205B2853b3178D7408b79096A29633a98804
9664C84298c88540i5632k12411L9769B13466J3130B8717c847A28070Q3261a53704
9652h4075H7836O1966a12038r0740B7734R7577d25379f3503j80644O2872g3767
9640A67054h7279F8963e8142A28268d760j27028b5802B32854a75107l2389q2561
9629b90057E4354b17455g6323K1540j29259N203P4326p697k03468N9901B6609
9617d5033A62076c8296j120m00165a74295G2766a54702n0439A0013a35865A35194
9605B24118g2697r599n9629F5546P3913a94654f3982o730A67848a1766l936k92106
$$ y = [-373553, -160333, 161271, 79923, -212632, -15630, -186210, -83758, 53118, -39798, -168515, 51549, -129717, -24790, -105189, 184430, -98798, -213003, 22853, -23178, 47408, -279096, 129633, -198804, 384298, -388540, -95632, -308043, -268274, 213466, 226596, 28717, -3847, 128070, 211331, -153704, -84075, 87836, 149802, -112038, -202778, 27734, 125311, -425379, -63503, -244147, -181275, -73767, 167054, -87279, 68963, -58142, 128268, -4760, -131788, -25802, 232854, -175107, -207496, -290057, 54354, -217455, -76323, -54783, -184042, -178839, -104513, -112210, -315678, -255777, 26609, -45033, 162076, -38296, -39416, -439581, -174295, 72766, -154702, -205141, 10013, -135865, 135194, 224118, -72697, -82296, -141925, 65546, 139459, -194654, -63982, -70712, 167848, -11766, -15702, -307808]
9593c07808J25723Q9797j15478H6182J66483i8438k00852Q930j25666A38630l7143
9582A01487n473i0825B93006b92201B03893a88497L4539A491a70665A7999c32664
9570A27939D1686L9069b97070a26077a7292j11926A60348f6011c859m4426m2854
9559i1139b4541B8055R7588k2298b01022c4715A34700F2029Q0132b01943c5229
9547b82859f7569n5296D830K1118h1425A48757g8771r894l1351K9241D6416i5846
9534g8046k86354b0194A20801A1058g7982q8755d2632B17298c08516B01869a35643
9522a68391j24568F9845a47178a5079k57335C27287e6271E9933c69538J55085
9512b14453A31451N2827d65722J52047G4956b38968a11046B4456b564m3942J1293
$$ y = [-307808, -182085, -92288, -207766, 86182, 252665, -98438, -299290, -290360, -416026, 138630, 101487, 96014, -90825, 293006, -292201, 203893, -188497, -153958, 1491, -170665, 17999, -332664, 127939, 41686, 80755, -297070, -126077, -17292, -129218, 160348, -66011, -3859, -48285, -91139, -24541, 28055, 125643, 103345, -201022, -34715, 134700, 62029, 142161, -201943, -35229, -282859, -67569, -122865, 4830, 25948, -81425, 148757, -78771, -88665, -120016, -90775, 46416, -95846, -78046, -364400, -20194, 120801, 11058, -77982, -166737, -42632, 217298, -308516, 201869, -135643, -168391, -292959, 69845, -147178, -15079, -272414, 327287, -56271, 59933, -369538, -214453, 131451, 184278, -465722, -313675, 74956, -238968, -111046, 24456, -2564, -46506, -35213]
9501c5213D14069D040Q2576a26197F840M2207L18333A72423b32538h0885k48069
9490c28954a47811o8595B12440c84181E6538a82371A4394e2602l15440e4799G5712
9478a72618P0953j44188J16228M2279A43799j8687a91961A39343c34843D8730
9467A4305a91216E6899c53314A44419O7852H9479f2067J2904i696B32515c89443
9455a82144R831d2833j76526p6505a40103j25164B90066a88612H1340Q764h102
9443a46433q8038A14033b34605A00445c4062q4631d0072j05895O5328l8639o1030
9432a80308O87A66976p4656J43677a22758q3623b6915l67033a67053A01388g5410
9420a90065I1386b31044B7904i646B6560a63752I368N4330d14620a98062j61145
$$ y = [-35213, 414069, 4040, 86616, -126197, 6840, 49047, 367380, 172423, -232538, -80885, -328954, -147811, -216406, 212440, -384181, 56538, -182371, 14394, -52602, -368042, -54799, 75712, -172618, -101665, -245853, -129625, -87346, 143799, 125112, -191961, 139343, -334843, 48730, 14305, -191216, 56899, -353314, 144419, 212271, 89479, -62067, -49163, -9696, 232515, -389443, -182144, -172313, -42833, -219359, -295864, -140103, -265267, 290066, -188612, 81340, 90104, -8102, -146433, -234471, 114033, -234605, 100445, -34062, -118693, -40072, -145967, -80639, -119278, -180308, -179621, 166976, 92320, 235997, -122758, -206381, -26915, -393948, -167053, 101388, -75410, -190065, 91386, -231044, 27904, -9646, 26560, -163752, 9368, 63698, -414620, -198062, -359207]
9409c59207H7059a00397J3330k2754r5884A92370a07302b7021l2503j23552h6643
9397i7739A28213b19519K0397A03227K8337K76412a61889A4216J31540b97255
9386I6279e3647b6488n4403k05191Q3587A11156b1149j03432o7176g5719L27k50912
9374c26304A6350g8225j32463o902f6046a8808P055E2335a38201A13650a60939
9362i6263A87882f1402j3253A61805i2185d5496k16386d0491j26100A58881a37815
9350a38308A29651b25676C2169J93243B5919e6991k25238a04536D5217e5669A55170
9338b11505a02340m4337A90530o8233a49078A45621n4638a70851A61233b21798
9327B9920c32947h5657A4129a32417A21195b0380j56742g1088E6941O1879b9799
$$ y = [-359207, 87059, -100397, -87067, -109821, -205705, 192370, -107302, -27021, -59524, -183076, -86643, -97739, 128213, -219519, -199122, 103227, 131564, 407976, -161889, 14216, 145756, -297255, 96279, -53647, -26488, -80891, -286082, -202495, 111156, -21149, -124581, -191757, -75719, -75392, -326304, 16350, -78225, -210688, -217590, -66046, -18808, -11753, 52335, -138201, 113650, -160939, -96263, 187882, -61402, -74655, 161805, -92185, -45496, -261882, -40491, -166591, 158881, -137815, -138308, 129651, -225676, 32169, 225412, 25919, -56991, -282229, -104536, 45217, -55669, 155170, -211505, -102340, -146677, 190530, 122297, -149078, 145621, 90983, -170851, 161233, -221798, 29920, -332947, -85657, 14129, -132417, 121195, -20380, -177122, -71088, 56941, 118820, -29799]
9315B63781A6616P3053J1121b36530L3600P6741J2513j45435a8955j47872j02503
9304b69330H7706c14715J29346B59665D3855J54i4517n9097H0795b79260c3232
9292C1754a2943A04231O7257b58482d2489E199b70553a05676A0015f9363j91383
9281b60746D2681K20313J004a50543o9319M2228K5282J8010k61540A598a47462
9269A1636a55206G8145a83479k4479D7231L29047c49131e0419C5693k068a58557
9257c16594e3956k05715J29664J5088j12487g8130j72992B33083a49625j4315
9247a63940l2756P0348A74099a6327j6804g209B19449N8684F2030d13878K06185
9236b07693c8445j40807A28075b31534h298j284l04265A0313J4754a08695k84968
$$ y = [263781, 16616, 89669, 100790, -236530, -202930, -126189, -113676, -259111, -18955, -166827, -269330, 87706, -314715, -185369, 259665, 43855, 44009, -94517, -153614, 80795, -279260, -33232, 31754, -12943, 104231, 171488, -258482, -42489, 5199, -270553, -105676, 10015, -69363, -260746, 42681, 262994, 263998, -150543, -219862, -177634, -152352, -134342, -395882, 1598, -147462, 11636, -155206, 78145, -183479, -207958, 47231, 376278, -349131, -50419, 35693, 33625, -158557, -316594, -53956, -259671, -130007, -114919, -227406, -78130, -251122, 233083, -149625, -163940, -196696, -126348, 174099, -16327, -33131, -7209, 219449, 278133, 62030, -413878, -207693, -38445, -179252, 128075, -231534, -8298, -9582, -313847, 10313, 25067, -108695, -393663]
9225c93663A13733c7474k07427L8380g4989o9680K5801B69346a00715A15148J6898
9214A32046K318e7676k1272L2048j86496a13126E1322a10205e2063A79028a25242
9202b77419D560J2226i6280l1519l6489P8688k1550a0185j66277A02986c57384
9190b49234a17745D7362J14762G3904J49951C6398K15719H8434a82664C16749
9179G6572K52006a73873B23144h4k07889A13777b38286M4928d4129A4109b39209
9167a2156o6671p3976A36366c52936J11906p8325A19851N838a8305A57234P8544
9156B35778b56073A97054a44896A12654j147b67730q2250e2837A22450F0494Q4072
9145A44566K5963a36282j69437a05238C6211J9466a09946j43151g0223l0154F3006
$$ y = [-393663, 113733, -37474, -244901, -206521, -74989, -144669, -118868, 269346, -100715, 115148, 132046, 134364, -57676, -78948, -46900, -233396, -113126, 51322, -110205, -52063, 179028, -125242, -277419, 4560, 16786, -96280, -127799, -164288, -85600, -107150, -10185, -176462, 102986, -357384, -249234, -117745, 47362, 162124, 73904, 223855, 36398, 252117, 88434, -182664, 316749, 76572, 328578, -173873, 223144, -84, -207973, 113777, -238286, -193358, -44129, 14109, -239209, -12156, -78827, -152803, 136366, -352936, -241030, -319355, 119851, 125689, -18305, 157234, 235778, -256073, 197054, -144896, 112654, 111507, -267730, -349980, -52837, 122450, 60494, 144566, 170529, -136282, -305719, -105238, 36211, 55677, -109946, -253097, -70223, -100377, 63006]
9133e769j41718j34585a05434m87630f8857A35670b97236a36803B8276a94632
9122e171k46346A42304c4210G1707i3033M0230j9542m20981D0434N3323K3391
9111A17148b7011A2013N4177a71802l5564D9238a72237A58080E1815a90379A20052
9099b34571C43943b97868I8642K13662H5690C8252O2677i5866A65057a02199d2495
9087D1652b09902Q3955A63992h8740c5657j28921l95049J86134J43810F9843a2776
9075a75032P4376B3114P2550a43285j32245R5483A02265H182a85051B03944a85034
9063a91784A25979h074A18388c62124A11177h3817B73701a26887j5056A09716
9052e9372K3956k6093j5076j69147E7115c172m4536A13042c7781D5564a6489m3244
$$ y = [-5769, -147487, -282072, -105434, -593064, -68857, 135670, -297236, -136803, 28276, -194632, -5171, -251517, 142304, -34210, 71707, -93033, -52803, -72345, -493326, 40434, 93757, 117148, -27011, 12013, 66190, -171802, -207366, 49238, -172237, 158080, 51815, -190379, 120052, -234571, 343943, -297868, 98642, 312304, 85690, 38252, 100929, -95866, 165057, -102199, -42495, 41652, -209902, -125947, 163992, -88740, -35657, -164578, -559627, -373493, -229683, 69843, -12776, -175032, -100656, 23114, 95664, -143285, -275530, -180047, 102265, 8182, -185051, 203944, -185034, -191784, 125979, -8074, 118388, -362124, 111177, -83817, 273701, -126887, -141943, 109716, -59372, -35416, -61509, -76585, -245732, 57115, -3172, -47708, 113042, -37781, 45564, -16489, -59733]
9040e9733B51298I5623B2001a9843q3892C7968P286f5105l02746a1419l33058
9029c44477D1256k0203b79291C4306f3088k44520a13571A6966d7601k24243j56064
9018d27908b07333d8526D37707b40672j29971a08041B02401h5499A59020C4144
9007b27457Q5189n8571A37074a12888p9956d6903j39725c9870A95251D562a10688
8995C01652a32556C5738a7432j68049c5652o6283H7965a78120A20120g8470A27720
8983d3941p8248j10605C63816c18717h2706m8603K4482k67880J41299c6427A58480
8971b26286M928P6394A56628c93431A55605a85797P6907j55185p3747b4704g083
8959a59316j20870J07514N5640k01636J12838A94539b3912A8443a00321j9544
$$ y = [-59733, 251298, 95623, 22001, -19843, -103735, 37968, 45254, -65105, -367851, -11419, -344477, 41256, 21053, -279291, 34306, -63088, -307608, -113571, 16966, -47601, -271844, -427908, -207333, -48526, 437707, -240672, -370643, -108041, 202401, -85499, 159020, 34144, -227457, -142268, -200839, 137074, -112888, -192844, -46903, -186628, -39870, 195251, 4562, -110688, 301652, -132556, 35738, -17432, -185481, -35652, -101935, 87965, -178120, 120120, -78470, 127720, -43941, -122189, -232794, 363816, -318717, -82706, -131309, -106827, -374707, -233408, -36427, 158480, -226286, -221358, -144964, 156628, -393431, 155605, -185797, -108890, -264075, -337822, -24704, -7083, -159316, -280186, -172672, -117032, -318668, -205830, 194539, -23912, 18443, -100321, -119865]
8949a19865G7556J90348H6280c36538b688q1949i387k83310A22970b53768E2237
8937E2876N8711a00621A30893O9314E9157b04523K9972A42097a28450L6708D12265
8925C07208p2604L57462J141111L197418R250102D241939A162212C69671M3020
8916D12691B481P0906a0374G169a61487P8883A10990a79380B60516m944E2425
8904E9273e0519j26894C77470A43768J5977i3435L4873k36000I7210b96819J21089
8893a75730k4624j44763A5513J73425i620k53805G8060a52705D65b60481R9824
$$ y = [-119865, 77556, 267904, 86280, -336538, -2688, -84637, -9387, -292697, 122970, -253768, 52237, 52876, 111587, -100621, 130893, 200207, 59157, -204523, -174551, 142097, -128450, -91742, 412265, 307208, 234604, 592066, 1733177, 4930595, 14180697, 4241939, 1162212, 369671, 412691, 2481, 73387, -10374, 7169, -161487, -82604, 110990, -179380, 260516, 255572, 52425, 59273, -50519, -177413, 377470, 143768, 159745, -93435, -58562, -294562, 97210, -296819, -175730, -200354, -345117, 15513, 188938, -9620, -263425, 78060, -152705, 465, -260481, -160657]
$$ [...]
##END NTUPLES=NMR SPECTRUM
##END=
