
##TITLE=UV1286_M2_1207-1380_20_7534579_fRNGb9eGlU
##JCAMPDX= 6.0         $$ Bruker NMR JCAMP-DX V2.0
##DATA TYPE= NMR SPECTRUM
##DATA CLASS= NTUPLES
##ORIGIN= BRUKER
##OWNER= Administrator
$$ 1.72 TOPSPIN		Version 2.1
$$ 2013-02-22 00:27:41.298 -0500  Administrator@X
$$ Compression mode = diff/dup
##.OBSERVE FREQUENCY= 400.02188249412
##.OBSERVE NUCLEUS= ^1H
##.ACQUISITION MODE= SIMULTANEOUS (DQD)
##.ACQUISITION SCHEME= undefined
##.AVERAGES= 64
##.DIGITISER RES= 22
##SPECTROMETER/DATA SYSTEM= spect
##.PULSE SEQUENCE= noesygpps1d.comp
##.SOLVENT NAME= COFFEE_meoh
##.SHIFT REFERENCE= INTERNAL, COFFEE_meoh, 1, 14.96118
##AUDIT TRAIL= $$ (NUMBER, WHEN, WHO, WHERE, PROCESS, VERSION, WHAT)
$$ ##TITLE= Audit trail, TOPSPIN		Version 2.1
$$ ##JCAMPDX= 5.01
$$ ##ORIGIN= Bruker BioSpin GmbH
$$ ##OWNER= Administrator
$$ $$ E:\/data/COFFEE/nmr/UV1286_M2_1207-1380_20_7534579_fRNGb9eGlU/12/pdata/1/auditp.txt
$$ ##AUDIT TRAIL=  $$ (NUMBER, WHEN, WHO, WHERE, PROCESS, VERSION, WHAT)
(   1,<2013-02-22 00:27:35.173 -0500>,<Administrator>,<X>,<go>,<TOPSPIN 2.1>,
      <created by zg
	started at 2013-02-22 00:16:04.943 -0500,
	POWCHK enabled, PULCHK disabled,
       configuration hash MD5:
       86 BA 57 50 F2 9D 5C 9B 26 00 A9 28 5F 66 2E 89
       data hash MD5: 64K
       7F 9F A2 93 53 75 49 ED E1 EE 17 72 13 82 B8 E8>)
(   2,<2013-02-22 00:27:38.298 -0500>,<Administrator>,<X>,<proc1d>,<TOPSPIN 2.1>,
      <Start of raw data processing
       efp LB = 0.3 FT_mod = 6 PKNL = 1 PHC0 = 0 PHC1 = 0 SI = 128K 
       data hash MD5: 128K
       8F 60 E5 B5 87 AE 11 A1 A4 11 7C 5B 46 A4 92 99>)
(   3,<2013-02-22 00:27:39.392 -0500>,<Administrator>,<X>,<proc1d>,<TOPSPIN 2.1>,
      <pk PHC0 = 249.3567 PHC1 = 0 
       data hash MD5: 128K
       DD F7 F6 73 F0 C9 FF 0A 28 A2 46 A6 EF F6 61 7F>)
(   4,<2013-02-22 00:27:40.048 -0500>,<Administrator>,<X>,<proc1d>,<TOPSPIN 2.1>,
      <abs ABSG = 1 
       data hash MD5: 128K
       D7 83 00 A7 59 D7 92 CC D3 3B C2 14 43 58 A4 49>)
(   5,<2013-02-22 00:27:40.267 -0500>,<Administrator>,<X>,<proc1d>,<TOPSPIN 2.1>,
      <abs ABSG = 2 
       data hash MD5: 128K
       EA F5 12 A5 C8 4B DE 14 B7 52 02 1F DE F3 C5 66>)
(   6,<2013-02-22 00:27:40.407 -0500>,<Administrator>,<X>,<proc1d>,<TOPSPIN 2.1>,
      <abs ABSG = 3 
       data hash MD5: 128K
       1F 3E B6 12 76 B5 7B CE 90 CF 4D 74 69 27 06 9F>)
(   7,<2013-02-22 00:27:40.611 -0500>,<Administrator>,<X>,<proc1d>,<TOPSPIN 2.1>,
      <abs ABSG = 4 
       data hash MD5: 128K
       A0 C1 97 55 98 4C 7E 9B B8 BD 3C 07 B6 E4 86 91>)
(   8,<2013-02-22 00:27:40.782 -0500>,<Administrator>,<X>,<proc1d>,<TOPSPIN 2.1>,
      <abs ABSG = 5 
       data hash MD5: 128K
       A3 7A 21 29 16 22 4B CF 93 BD 54 16 DA C7 25 49>)
$$ ##END=
$$ 
$$ $$ hash MD5
$$ $$ 8C 03 62 0C D4 C7 5C 6B 10 4D E6 FF C0 F8 97 2A
##$RELAX= 
##$RELAX= 
##$RELAX= 
##$RELAX= 
##$RELAX= 
##$RELAX= 
##$RELAX= 
##$RELAX= 
$$ Bruker specific parameters
$$ --------------------------
##$DU= <E:\>
##$EXPNO= 12
$$ [...]
150 150 150 150 150 150 150 150
##$TP07= 0
##$TPNAME0= <>
##$TPNAME1= <>
##$TPNAME2= <>
##$TPNAME3= <>
##$TPNAME4= <>
##$TPNAME5= <>
##$TPNAME6= <>
##$TPNAME7= <>
##$TPOAL= (0..7)
0.5 0.5 0.5 0.5 0.5 0.5 0.5 0.5
##$TPOFFS= (0..7)
0 0 0 0 0 0 0 0
##$TUNHIN= 0
##$TUNHOUT= 0
##$TUNXOUT= 0
##$USERA1= <user>
##$USERA2= <user>
##$USERA3= <user>
##$USERA4= <user>
##$USERA5= <user>
##$V9= 5
##$VALIST= <valist>
##$VCLIST= <CCCCCCCCCCCCCCC>
##$VD= 0
##$VDLIST= <DDDDDDDDDDDDDDD>
##$VPLIST= <PPPPPPPPPPPPPPP>
##$VTLIST= <TTTTTTTTTTTTTTT>
##$WBST= 1024
##$WBSW= 4
##$XGAIN= (0..3)
0 0 0 0
##$XL= 0
##$YL= 0
##$YMAX_a= 6407965
##$YMIN_a= -11360394
##$ZGOPTNS= <>
##$ZL1= 120
##$ZL2= 120
##$ZL3= 120
##$ZL4= 120
##$ABSF1= 14.96118
##$ABSF2= -5.597002
##$ABSG= 5
##$ABSL= 3
##$ALPHA= 0
##$AQORDER= 0
##$ASSFAC= 0
##$ASSFACI= 0
##$ASSFACX= 0
##$ASSWID= 0
##$AUNMP= <proc_prof1d_extract.lims>
##$AXLEFT= 0
##$AXNAME= <>
##$AXNUC= <1H>
##$AXRIGHT= 0
##$AXTYPE= 0
##$AXUNIT= <>
##$AZFE= 0.1
##$AZFW= 0.1
##$BCFW= 0
##$BC_mod= 0
##$BYTORDP= 0
##$COROFFS= 0
##$CY= 15
##$DATMOD= 1
##$DC= 0
##$DFILT= <>
##$DTYPP= 0
##$F1P= 0
##$F2P= 0
##$FCOR= 0.5
##$FTSIZE= 131072
##$FT_mod= 6
##$GAMMA= 0
##$GB= 0
##$INTBC= 1
##$INTSCL= 1
##$ISEN= 128
##$LB= 0.3
##$LEV0= 0
##$LPBIN= 0
##$MAXI= 10000
##$MC2= 0
##$MEAN= 0
##$ME_mod= 0
##$MI= 0
##$NCOEF= 0
##$NC_proc= -2
##$NLEV= 6
##$NOISF1= 0
##$NOISF2= 0
##$NSP= 0
##$NTH_PI= 0
##$NZP= 0
##$OFFSET= 14.96118
##$PC= 1
##$PHC0= 249.3567
##$PHC1= 0
##$PH_mod= 1
##$PKNL= yes
##$PPARMOD= 0
##$PPDIAG= 0
##$PPIPTYP= 0
##$PPMPNUM= 2147483647
##$PPRESOL= 1
##$PSCAL= 4
##$PSIGN= 0
##$PYNMP= <proc.py>
##$REVERSE= no
##$SF= 400.020009565169
##$SI= 131072
##$SIGF1= 0
##$SIGF2= 0
##$SINO= 400
##$SIOLD= 131072
##$SPECTYP= <>
##$SREGLST= <1H.CDCl3>
##$SSB= 0
##$STSI= 131072
##$STSR= 0
##$SW_p= 8223.68421052631
##$SYMM= 0
##$S_DEV= 0
##$TDeff= 65536
##$TDoff= 0
##$TI= <>
##$TILT= no
##$TM1= 0
##$TM2= 0
##$TOPLEV= 0
##$USERP1= <user>
##$USERP2= <user>
##$USERP3= <user>
##$USERP4= <user>
##$USERP5= <user>
##$WDW= 1
##$XDIM= 131072
##$YMAX_p= 452137992
##$YMIN_p= -11417
##$CURPLOT= <Network HP LaserJet P1505>
##$CURPRIN= <$Network HP LaserJet P1505>
##$DFORMAT= <normdp>
##$LAYOUT= <+/1D_H.xwp>
##$LFORMAT= <normlp>
##$PFORMAT= <normpl>
##$SURQMSG= 1
$$ End of Bruker specific parameters
$$ ---------------------------------
##NTUPLES= NMR SPECTRUM
##VAR_NAME=  FREQUENCY,     SPECTRUM/REAL,   SPECTRUM/IMAG
##SYMBOL=    X,             R,               I
##VAR_TYPE=  INDEPENDENT,   DEPENDENT,       DEPENDENT
##VAR_FORM=  AFFN,          ASDF,            ASDF
##VAR_DIM=   131072,        131072,          131072
##UNITS=     HZ,            ARBITRARY UNITS, ARBITRARY UNITS
##FACTOR=    0.0627417313425164, 1,          1
##FIRST=     8223.62146879497, 1224,         -66402
##LAST=      0,             3205,            -66649
##MIN=       0,             -11417,          0
##MAX=       8223.62146879497, 452137992,    0
$$ Real data points
##PAGE= N=1
##DATA TABLE= (X++(R..R)), XYDATA
$$ [...]
63876F27072J92K582M690O890R496J2475J5300J7359J8702K0042K1816K3621K4928
63863H05165K5931K7045K7891K7474K5543K3061K1058J9463J7464J4679J1524
63852A046298Q475N385J732k586o989j0814j4033j7109k0261k3142k5386k7044
63840I14526k8377k9487l0465l1512l2530l2894l2126l0611k9167k8008k6734
63829E82615k5245k4006k3222k2362k0856j8863j6993j5547j4341j3111j1772
63818C76297j0338q932p835p277p120o854o083m950m023l653l541l083k115j065
63804B99428l86j68l50r27j668k057j980k096k966m026m158l251k423k493k928
63789B67551k800k147j808k128k572k579k196j780j470j257j232j413j521j284
$$ plain form
63876 627072 627264 629846 634536 641426 650922 663397 678697 696056 714758 734800 756616 780237 805165
63863 805165 831096 858141 886032 913506 939049 962110 983168 1002631 1020095 1034774 1046298
63852 1046298 1054773 1060158 1061890 1059304 1052315 1041501 1027468 1010359 990098 966956 941570 914526
63840 914526 886149 856662 826197 794685 762155 729261 697135 666524 637357 609349 582615
63829 582615 557370 533364 510142 487780 466924 448061 431068 415521 401180 388069 376297
63818 376297 365959 357027 349192 341915 334795 327941 321858 316908 312885 309232 305691 302608 300493 299428
63804 299428 299042 298874 298524 297597 295929 293872 291892 289796 286830 282804 278646 275395 272972 270479 267551
63789 267551 264751 262604 260796 258668 256096 253517 251321 249541 248071 246814 245582 244169 242648 241364
63775B41364q82p35q04n47K01P06J94j002j708j323l97K45L94J95l39j102j535
63758B32925j146k19M91O79O70P48P81N90K93J26J50K96N32Q84J339J752J915
63741B42806J789J634J725J921J852J580J642K264K927L003K471J700R89O67J181
63726B70151K547M010M844N190N528N745N429M851M687M880M653L779K948K677
63712C31919K588K109J211J23j065k168k787k849k811l063l426l605l532l084
63698C09560j981m11P57R87Q31J167K030K805L268L635L786L276K253J617J908
63683C35488K533K506J653O16o6m82q93j199j078m86K26O86Q41Q62Q75Q49P56
63666C43687P19R51J548K298K735K427J342j60j662k931l834m258m245m104m130
$$ plain form
63775 241364 240482 239747 238943 238396 238597 239303 239497 238495 236787 235464 235067 235312 235706 235901 235562 234460 232925
63758 232925 231779 231560 232051 232730 233400 234148 234929 235519 235812 235938 236088 236384 236916 237800 239139 240891 242806
63741 242806 244595 246229 247954 249875 251727 253307 254949 257213 260140 263143 265614 267314 268303 268970 270151
63726 270151 272698 276708 281552 286742 292270 298015 303444 308295 312982 317862 322515 326294 329242 331919
63712 331919 334507 336616 337827 337950 336885 334717 331930 329081 326270 323207 319781 316176 312644 309560
63698 309560 307579 307168 307925 308912 309743 310910 312940 315745 319013 322648 326434 329710 331963 333580 335488
63683 335488 338021 340527 342180 342796 342730 342248 341355 340156 339078 338592 338818 339504 340345 341207 342082 342931 343687
63666 343687 344406 345357 346905 349203 351938 354365 355707 355547 353885 350954 347120 342862 338617 334513 330383
63651C30383m208l928l166k439k433l138l637l040j572l69j06k51l4M05M97N16
63635C03480J388L150M607M875M481M424M873N434O059O896P648P878P777Q007
63621C80977Q830R979J1096J1958J2459J2867J3767J5299J6871J8133J9701K2217
63609E54154K5131K7356K8767L0076L1449L2264L2203L1521L0135K7331K2665
63598H73052J6511R600K742l078p132r605j1143j1780j1200r920r247r859j1412
63585H07529j3650j6760k0346k3234k4787k5493k5799k5358k3940k2025j9820
63574E66317j6761j2796r206p148o065m614k556o82P24K166L852N301O131O550
63560E31213O973P593Q297Q725Q645Q498R238J1231J3766J6034J8115K0576K3560
$$ plain form
63651 330383 326175 322247 319081 316642 314209 311071 307434 304394 302822 302453 302347 302096 302062 302467 302964 303480
63635 303480 304868 308018 312625 317500 321981 326405 331278 336712 342771 349667 357315 365193 372970 380977
63621 380977 389807 399786 410882 422840 435299 448166 461933 477232 494103 512236 531937 554154
63609 554154 579285 606641 635408 665484 696933 729197 761400 792921 823056 850387 873052
63598 873052 889563 899163 901905 898827 891695 882090 870947 859167 847967 838047 828800 818941 807529
63585 807529 793879 777119 756773 733539 708752 683259 657460 632102 608162 586137 566317
63574 566317 549556 536760 527554 520406 514341 509727 507171 506489 507213 509379 513231 518532 524663 531213
63560 531213 538186 545779 554076 562801 571446 579944 589182 600413 614179 630213 648328 668904 692464
63547F92464K6903L0633L4719L8744M2384M5560M7358M5484L8108K6176J2914
63536A081447J098q313j5071j8649j8909j6909j4286j2125j0735j0127j0372j1622
63524I35427j4082j7757k2207k6669l0520l3452l5306l5975l5503l4047l1860
63513F18049k9263k6553k3747k0784j8041j6173j5164j4056j2167j0057q685q053
63501D15306p482o875o686o776o309n009l615k805k364j773j041n29m23o86j121
63486C61812j226m38J074K276K362J787J703K602L828M466M317L924L854M085
63472C96426M144L711K971K237J422J48j669l543m852n361n297n077m965m843
63458C75452m292l097j683q34q44j075n91Q17K399L317L579L891M653N514O113
$$ plain form
63547 692464 719367 750000 784719 823463 865847 911407 958765 1004249 1042357 1068533 1081447
63536 1081447 1082545 1074232 1059161 1040512 1021603 1004694 990408 978283 967548 957421 947049 935427
63524 935427 921345 903588 881381 854712 824192 790740 755434 719459 683956 649909 618049
63513 618049 588786 562233 538486 517702 499661 483488 468324 454268 442101 432044 423359 415306
63501 415306 407824 400949 394263 387487 381178 376169 372554 369749 367385 365612 364571 364042 363619 362933 361812
63486 361812 360586 360148 361222 363498 365860 367647 369350 371952 375780 380246 384563 388487 392341 396426
63472 396426 400570 404281 407252 409489 410911 411059 409390 405847 400995 395634 390337 385260 380295 375452
63458 375452 371160 368063 366380 365546 364702 363627 363036 363853 366252 369569 373148 377039 381692 387206 393319
63443C93319O876Q478J0645J2234J2675J2725J3419J4808J6343J8119K1002K5438
63431E66081L0592L4755L6318L4463K9410K2377J5182R492O176N105N560O950
63419H02461R220J2531J6744K1453K6349L1164L5259L7842L8611L7674L4786K9278
63407A133372K1133J1586K336n406j0983j4127j5306j5618j5742j5455j4692j4512
63395A046586j6184j9702k3902k7884l1459l4433l6288l6690l5827l4090l1843
63384G18284k9373k6790k4064k1386j9132j7176j4756j1544q248n582l228o61
63372E36344J682L141M243O056Q373J0004J0825J2079J4329J6546J7929J9288
63360F60839K1720K4815K7333K9026L0754L3056L5475L7305L8317L8594L8009
$$ plain form
63443 393319 400195 408673 419318 431552 444227 456952 470371 485179 501522 519641 540643 566081
63431 566081 596673 631428 667746 702209 731619 753996 769178 778670 784846 789951 795511 802461
63419 802461 811681 824212 840956 862409 888758 919922 955181 993023 1031634 1069308 1104094 1133372
63407 1133372 1154505 1166091 1168427 1163021 1152038 1137911 1122605 1106987 1091245 1075790 1061098 1046586
63395 1046586 1030402 1010700 986798 958914 927455 893022 856734 820044 784217 750127 718284
63384 718284 688911 662121 638057 616671 597539 580363 565607 554063 545815 540233 537005 536344
63372 536344 538026 541167 545410 551466 559839 569843 580668 592747 607076 623622 641551 660839
63360 660839 682559 707374 734707 763733 794487 827543 863018 900323 938640 977234 1015243
63349A015243L6104L2360K6620J9269J1004K625m843j0254j3180j4444j5203j5655
63337A069646j5327j4565j4732j6672j9821k3157k6324k9361l1956l3588l3946
63326H10197l2926l0649k7738k4956k2288j8980j4767j0304o082j972J434K134
63314F23103j384p962j4661j9467k2170k2987k1861j9331j6769j5015j3547j1590
63302D36359r360p656o644n784m725l752l308l474l916m142l809l049k402k292
63288C72046k561k695k492k298k499k999l332l156k486j546o51j73l38r45j493
63273C42382j714j732j630j198l67M46Q29R63J276J676J708J403J378J933K598
63258C49951K781K473K065J893K165K988M102M840M766M201L899M306N289O377
$$ plain form
63349 1015243 1051347 1083707 1110327 1129596 1140600 1143225 1138382 1128128 1114948 1100504 1085301 1069646
63337 1069646 1054319 1039754 1025022 1008350 988529 965372 939048 909687 877731 844143 810197
63326 810197 777271 746622 718884 693928 671640 652660 637893 627589 621507 619535 620969 623103
63314 623103 621719 613757 599096 579629 557459 534472 512611 493280 476511 461496 447949 436359
63302 436359 426999 419343 412699 406915 402190 398438 395130 391656 387740 383598 379789 376740 374338 372046
63288 372046 369485 366790 364298 362000 359501 356502 353170 350014 347528 345982 345331 345158 344820 343875 342382
63273 342382 340668 338936 337306 336108 335741 336187 337016 337979 339255 340931 342639 344042 345420 347353 349951
63258 349951 352732 355205 357270 359163 361328 364316 368418 373258 378024 382225 386124 390430 395719 402096
63244D02096P085P179O961P143Q194R781J1104J1779J2250J3317J5290J7605J9347
63231E49131K0178K0703K1695K3156K4410K5023K5238K5420K5497K5191K4549
63220H10191K3881K3405K3157K3141K3335K3584K3695K3572K3190K2438K1151
63209A064740J9204J6530J3053Q624L107l375j0251j6661k1994k6203k9504l1906
63197I85364l3104l2748l0796k7786k4759k2460k0434j7425j3035q381m620j400
63185G48416K398O779J0595J3225J5270J7437J9669K1676K3456K4926K5751K5993
63173I55591K6241K6672K6622K5493K3578K1611J9989J8790J7962J6962J4836
63162A194347J1171O568J749l374r239j5760k2439k8918l4836l9465m2134m2843
$$ plain form
63244 402096 409181 416360 423321 430464 438658 448439 459543 471322 483572 496889 512179 529784 549131
63231 549131 569309 590012 611707 634863 659273 684296 709534 734954 760451 785642 810191
63220 810191 834072 857477 880634 903775 927110 950694 974389 997961 1021151 1043589 1064740
63209 1064740 1083944 1100474 1113527 1122151 1125258 1121883 1111632 1094971 1072977 1046774 1017270 985364
63197 985364 952260 919512 888716 860930 836171 813711 793277 775852 762817 754436 749816 748416
63185 748416 750814 757593 768188 781413 796683 814120 833789 855465 878921 903847 929598 955591
63173 955591 981832 1008504 1035126 1060619 1084197 1105808 1125797 1144587 1162549 1179511 1194347
63162 1194347 1205518 1212086 1213835 1210461 1201222 1185462 1163023 1134105 1099269 1059804 1017670 974827
63150I74827m2096m0399l8301l6355l4511l1970k8354k4648k2206k0990j9633
63139F35364j7189j4109j1472r900r305r135q632p317n406l555k202j388j086
63126E34668j219j329p41P35K525L860M504M901N646O767P544P211N991M991M895
63111E90949N074M435K874J393R34J471K224K382J695O11j89n73j033j822k443
63096F07982k325j655j041o95m45k74k83k96j74k53q06j259p35N63J361R04j27
63079F00442n93j45Q21J912K889L479L596L726M583O335Q311R589R814R510R600
63064F73869J0567J2073J3432J4402J5473J7366K0308K3729K6755K9164L1723
63053H88861L5203L9201M2447M4440M6052M8272N1034N3777N6434N9058O1030
$$ plain form
63150 974827 932731 892332 854031 817676 783165 751195 722841 698193 675987 654997 635364
63139 635364 618175 604066 592594 582694 573389 564254 555622 548305 542899 539344 537142 535754 534668
63126 534668 533449 532120 531379 532114 534639 538499 543003 547904 553550 560317 567861 575072 581063 586054 590949
63111 590949 596023 600458 603332 604725 605659 607130 609354 611736 613431 614042 613853 613280 612247 610425 607982
63096 607982 605657 604002 602961 602266 601821 601547 601264 600968 600794 600541 599735 598476 597741 598304 599665 600569 600442
63079 600442 599849 599704 600525 602437 605326 608805 612401 616127 620710 627045 635356 644945 654759 664269 673869
63064 673869 684436 696509 709941 724343 739816 757182 777490 801219 827974 857138 888861
63053 888861 924064 963265 1005712 1050152 1096204 1144476 1195510 1249287 1305721 1364779 1425809
63042A425809O1614O1062O0283N9622N8773N7755N6962N6260N5075N3535N2515
63031B059265N2230N1671M9902M6988M3135L7722K9887J9649P782n001j8196l1199
63019B343835m3401n4399o3684p0511p4518p6116p5866p3819o9941o4789n9044
63008A617747n2635m5087l6612k8132k0127j2176l851M503J2250J9203K5494L1007
62996A511584L5425L8786M1529M3925M5667M6353M6215M6078M6438M6771M6143
62985A994914M4434M2514M0981L9092L5412K9317K1383J2334K190r244k1464l3374
62973B198489m4157n3717o2239o9650p5620p9787q1850q1688p9587p6179p2020
62962A421995o7352o2420n7701n3497m9572m5571m1743l8643l6193l3642l0715
$$ plain form
63042 1425809 1487423 1548485 1608768 1668390 1727163 1784918 1841880 1898140 1953215 2006750 2059265
63031 2059265 2111495 2163166 2213068 2260056 2303191 2340913 2370800 2390449 2398231 2393230 2375034 2343835
63019 2343835 2300434 2246035 2182351 2111840 2037322 1961206 1885340 1811521 1741580 1676791 1617747
63008 1617747 1565112 1520025 1483413 1455281 1435154 1422978 1419127 1423630 1435880 1455083 1480577 1511584
62996 1511584 1547009 1585795 1627324 1671249 1716916 1763269 1809484 1855562 1902000 1948771 1994914
62985 1994914 2039348 2081862 2122843 2161935 2197347 2226664 2248047 2260381 2262571 2253327 2231863 2198489
62973 2198489 2154332 2100615 2038376 1968726 1893106 1813319 1731469 1649781 1570194 1494015 1421995
62962 1421995 1354643 1292223 1234522 1181025 1131453 1085882 1044139 1005496 969303 935661 904946
62951I04946k8170k6782k6188k5253k3412k1220j9652j9161j9310j9165j8107
62940F58526j6462j5057j4096j2922j1117r305q301p928p353o315n330m751m407
62927E35182m077l692l065k138j478j788k830l501l261k714k539k533k161j461
62913D97944r56j015j648k531l019k644j870j774k671l656l945l869l932l699
62899D60715k556j066m08o98r72p27m23l36l7N91Q20J58p60j055q09o70p13m80
62881D50574L4K56m0l31j05N06J021J172R25L22m05q10p12n28p72j332j589j233
62863D46953o08j57M4J0m60j393k163j955p68M85R98Q29N18L25J88J31K47M16
62845D43640M22L57M86O50L18n65j207r08o8K61k61q95r16m85j69n1J64M42L87
$$ plain form
62951 904946 876776 849994 823806 798553 775141 753921 734269 715108 695798 676633 658526
62940 658526 642064 627007 612911 599989 588872 579567 571266 563338 555985 549670 544340 539589 535182
62927 535182 531105 527413 524348 522210 520732 518944 516114 512613 509352 506638 504099 501566 499405 497944
62913 497944 496988 495973 494325 491794 488775 486131 484261 482487 479816 476160 472215 468346 464414 460715
62899 460715 458159 457093 456685 455987 455015 454288 453865 453529 453492 454083 454903 455061 454301 453246 452437 451767 451054 450574
62881 450574 450608 450864 450824 450493 450388 450894 451915 453087 454012 454334 453929 453119 452407 451879 451107 449775 448186 446953
62863 446953 446345 446188 446232 446242 445782 444389 442226 440271 439503 439988 440986 441815 442333 442658 442846 442977 443224 443640
62845 443640 444062 444419 444905 445555 445873 445308 444101 443193 443125 443386 443125 442230 441314 440829 440660 440609 440773 441215 441602
62826D41602q7n28m70J32J037J938K495K574K552K989L776M101L535K746K600
62811D70992L023L300L354L865N098O322O733O504O458O999P775Q272Q417Q553
62797E55665R029R878J0786J1447J1930J2609J3672J4892J6075J7598K0125K3763
62785G27469K7772L1377L4681L8507M3359M8860N4365N9789O5507P1583P7538
62774A280807Q2899Q7558R1479R4336R5734R5437R3150Q8306Q0518P0094N7753
62763B218071M3857K8353J1532n657k2224l7791n2301o5273p5774q3214q7965
62752A871614r0904r2502r2556r0813q7522q3204p8176p2676o7250o2435n8030
62741I95546n3225m7703m2161l7436l3525k9869k6295k3100k0448j8169j6152
$$ plain form
62826 441602 441515 440987 440517 440649 441686 443624 446119 448693 451245 454234 458010 462111 465646 468392 470992
62811 470992 474015 477315 480669 484534 489632 495954 502687 509191 515649 522648 530423 538695 547112 555665
62797 555665 564694 574572 585358 596805 608735 621344 635016 649908 665983 683581 703706 727469
62785 727469 755241 786618 821299 859806 903165 952025 1006390 1066179 1131686 1203269 1280807
62774 1280807 1363706 1451264 1542743 1637079 1732813 1828250 1921400 2009706 2090224 2160318 2218071
62763 2218071 2261928 2290281 2301813 2296156 2273932 2236141 2183840 2118567 2042793 1959579 1871614
62752 1871614 1780710 1688208 1595652 1504839 1417317 1334113 1255937 1183261 1116011 1053576 995546
62741 995546 942321 894618 852457 815021 781496 751627 725332 702232 681784 663615 647463
62730F47463j4443j2944j1370r572p655n768m035k661j783j228n95L76J678L182
62716E80645M642N774O634P813R778J2125J3953J5053J6283J8594K2031K5865
62704G39190K9473L2863L6497M0774M5666N0821N5952O1029O6021P0773P5312
62693A304371P9947Q4748Q9090R2162R3654R3550R1395Q6404P8248O7231N3749
62682B214549L8127K1017L385j4093l1137m7288o1676p3570q2747q9235r3155
62671A784177r4899r5010r3655r0633q6032q0510p4742o9048o3617n8589n3776
62660I23666m8843m3927l9537l5640l1574k7179k3296k0614j8699j6868j5353
62649F02136j4763j4784j4344j3043j1506j0308r301q181p071o126n135l917k821
$$ plain form
62730 647463 633020 620076 608706 599134 591479 585711 581676 579015 577232 576004 575409 575785 577463 580645
62716 580645 585287 591061 597695 605508 615286 627411 641364 656417 672700 691294 713325 739190
62704 739190 768663 801526 838023 878797 924463 975284 1031236 1092265 1158286 1229059 1304371
62693 1304371 1384318 1469066 1558156 1650318 1743972 1837522 1928917 2015321 2093569 2160800 2214549
62682 2214549 2252676 2273693 2277078 2262985 2231848 2184560 2122884 2049314 1966567 1877332 1784177
62671 1784177 1689278 1594268 1500613 1409980 1323948 1243438 1168696 1099648 1036031 977442 923666
62660 923666 874823 830896 791359 755719 724145 696966 673670 653056 634357 617489 602136
62649 602136 587373 572589 558245 545202 533696 523388 514087 505906 498835 492709 487574 483657 480836
62636D80836k309k193j683l71J074J428K09j759l158l481l244l058k906k456j762
62621D55167j245j133j164r16k67M82R12R73J079J673K717L799M611N111N338
62606D77137N429N769O649P770Q562R067J0002J1788J4134J6730J9745K3199K6484
62593F42465K9120L1534L4439L7780M0942M3734M6366M8519M9088M7143M2738
62582A093868L6720L0026K3207J6197Q499j22r068j7293k4206k9934l4728l8495
62570A054671m1004m2216m2306m1540m0217l8529l6514l4205l1786k9381k6896
62559F50077k4304k1911j9925j7918j5266j2150r595q280p745p084o067n193m856
62546D89783m819m527l650k330j094n09p51j348j492o78Q74K382L058K651J618
$$ plain form
62636 480836 478527 476334 474651 474280 475354 476782 476991 475232 472074 468593 465349 462291 459385 456929 455167
62621 455167 453922 452789 451625 450709 450442 450924 451836 452809 453888 455561 458278 462077 466688 471799 477137
62606 477137 482566 488335 494984 502754 511316 520383 530385 542173 556307 573037 592782 615981 642465
62593 642465 671585 703119 737558 775338 816280 860014 906380 954899 1003987 1051130 1093868
62582 1093868 1130588 1160614 1183821 1200018 1208517 1208395 1199327 1182034 1157828 1127894 1093166 1054671
62570 1054671 1013667 971451 929145 887605 847388 808859 772345 738140 706354 676973 650077
62559 650077 625773 603862 583937 566019 550753 538603 529008 520728 512983 505899 499832 494639 489783
62546 489783 484964 480437 476787 474457 473363 472854 472103 470755 469263 468585 469459 471841 474899 477550 479168
62531D79168Q19R40K003L369M326M762N230O364Q247J0427J2443J4208J5937J7938
62517E86181K0409K3324K6406K9396L2392L5757L9701M3971M7989N1171N3213
62506I89910N4245N4727N4881N4198N1769M7204M1000L3921K6236J7809Q701m72
62494A434129q787j5432j9940k2151k2087j9960j6305j1867p111j932L866R965
62482A302388J5776K1157K6474L1811L6474L9290L9066L4874K6684J6027N511
62471A595532l042r977j7094k5772l5907m6327n5683o2962o7598o9499o9136o7474
62459A065061o5434o3141n9853n5020m9224m3625l8653l3826k8795k3810j9139
62448E84541j4832j1263r063q087p194n632l927k828k077r81L93J472K264L175
$$ plain form
62531 479168 479987 480927 482930 486299 490625 495387 500617 506981 515228 525655 538098 552306 568243 586181
62517 586181 606590 629914 656320 685716 718108 753865 793566 837537 885526 936697 989910
62506 989910 1044155 1098882 1153763 1207961 1259730 1306934 1347934 1381855 1408091 1425900 1434601 1434129
62494 1434129 1425342 1409910 1389970 1367819 1345732 1325772 1309467 1297600 1290489 1288557 1292423 1302388
62482 1302388 1318164 1339321 1365795 1397606 1434080 1473370 1512436 1547310 1573994 1590021 1595532
62471 1595532 1592490 1582513 1565419 1539647 1503740 1457413 1401730 1338768 1271170 1201671 1132535 1065061
62459 1065061 999627 936486 876633 821613 772389 728764 690111 656285 627490 603680 584541
62448 584541 569709 558446 549383 541296 534102 528470 524543 521715 519638 518657 519050 520522 522786 525961
62434E25961L986L950K947J749J021O62J96p09k182m062n760o718p056p375p928
62419D98682q342q166p279n867m411l651l988m903n433n249m766m354m015l812
62405D24446l936m094l574k210q01j71k02j34M55J322K026K340K395K539K971
62390D23372L405L343K731K124K035K428K993L623M317M923N284N604O261P257
62376D79700Q083Q256P872P479P501P932Q515R063R511R917J0605J2050J4306
62363F00790J6721J8664K0514K3306K7334L1725L5672L9468M3811M8583N2982
62352I59570N6488N9114O0824O1242N9849N6062M9400M0188K9882K0028J1024
62341A463671K414n762j2777j8345k3134k7891l2668l7114m0878m3529m4633m4315
$$ plain form
62434 525961 529947 533897 536844 538593 539614 540276 540472 539763 537581 533519 527759 521041 513985 506610 498682
62419 498682 490340 482174 474895 469028 464617 460966 456978 452075 446642 441393 436627 432273 428258 424446
62405 424446 420510 416416 412842 410632 409831 409660 409458 409324 409779 411101 413127 415467 417862 420401 423372
62390 423372 426777 430120 432851 434975 437010 439438 442431 446054 450371 455294 460578 466182 472443 479700
62376 479700 487783 496039 503911 511390 518891 526823 535338 544401 553912 563829 574434 586484 600790
62363 600790 617511 636175 656689 679995 707329 739054 774726 814194 858005 906588 959570
62352 959570 1016058 1075172 1135996 1197238 1257087 1313149 1362549 1402737 1432619 1452647 1463671
62341 1463671 1466085 1460323 1447546 1429201 1406067 1378176 1345508 1308394 1267516 1223987 1179354 1135039
62329A135039m3267m1861l9726l6541l2845k9581k7179k5467k4263k3520k3053
62318G87736k2537k1854k1175k0661k0196j9482j8395j7145j6051j5081j3822
62307E81337j2096j0380r209q381p199n563m136l313k635j668q81r25j392j088
62293E12471L39J765J968J111L50L03N24N76Q47J867L224L882L523K938K894L170
62277E41752L104K690K572L078L807M235M326M410M728N318O172P323Q772J0475
62263F12762J2497J5062J8268K1801K5169K8397L2155L6910M2217M7295N2018
62252I44551N6748O1315O4865O6695O6539O3903N8100M9281L8733K7755J6928
62241A515413O774j923r089j5824k3018l0200l6537m2125m7249n1085n2486n1729
$$ plain form
62329 1135039 1091772 1049911 1010185 973644 940799 911218 884039 858572 834309 810789 787736
62318 787736 765199 743345 722170 701509 681313 661831 643436 626291 610240 595159 581337
62307 581337 569241 558861 549652 541271 534072 528509 524373 521060 518425 516757 515876 514951 513559 512471
62293 512471 512810 514575 516543 517654 518004 518307 518831 519407 520254 522121 525345 529227 532750 535688 538582 541752
62277 541752 544856 547546 550118 553196 557003 561238 565564 569974 574702 580020 586192 593515 602287 612762
62263 612762 625259 640321 658589 680390 705559 733956 766111 803021 845238 892533 944551
62252 944551 1001299 1062614 1127479 1194174 1260713 1324616 1382716 1431997 1470730 1498485 1515413
62241 1515413 1522187 1520264 1511175 1495351 1472333 1442133 1405596 1363471 1316222 1265137 1212651 1160922
62229A160922n0173m8321m5502m1437l6911l2680k8790k5243k2316j9972j7755
62218G91822j5643j4213j3679j3485j3166j2878j2850j2893j2744j2382j1802
62207F46087j1022j0354j0086r858q973p366n587l882k099n10K50K99N73J524
62193E78996K591L307L965M811N547O095O995Q427R660J0165J0496J1344J2387
62180F74786J2872J2760J2500J2016J0784Q765O644N195M797N398O684Q394J0623
62167G92218J3551J6913K0318K4131K9198L5359M1022M4757M6618M7373M7061
62156A158519M4967M0556L3861K5396J6229P708N47n573j1189j6389k1190k5792
62144A247650k9950l2925l4696l6321l8292l9312l7910l4545l0919k7642k4003
$$ plain form
62229 1160922 1110749 1062428 1016926 975489 938578 905898 877108 851865 829549 809577 791822
62218 791822 776179 761966 748287 734802 721636 708758 695908 683015 670271 657889 646087
62207 646087 635065 624711 614625 604767 595794 588428 582841 578959 576860 576350 576600 576899 577472 578996
62193 578996 581587 584894 588859 593670 599217 605312 612307 620734 630394 640559 651055 662399 674786
62180 674786 687658 700418 712918 724934 735718 744483 751127 756322 761119 766517 773201 781595 792218
62167 792218 805769 822682 843000 867131 896329 931688 972710 1017467 1064085 1111458 1158519
62156 1158519 1203486 1244042 1277903 1303299 1319528 1327236 1327783 1322210 1311021 1294632 1273442 1247650
62144 1247650 1217700 1184775 1150079 1113758 1075466 1036154 998244 963699 932780 905138 881135
62133H81135j9847j6125j3365j0920q277o104n236n263m930l654k045r33k90P22
62119G84868K686N160P183Q444R490J0753J1940J2617J2702J1878R315M844m4
62106H91836l363m597m663m191k992j297k52o77k084l484m542n361n657m913l144
62091H40619r57J127K997M640N951O945P812Q617R134R257R385J0072J1309J2513
62077I39421J3408J4472J6181J8197J9798K0876K1864K2743K2898K2117K1019
62066A152994K0229J9826J9847K0646K2244K3913K4993K5609K6069K6009K4724
62055A407103K2047J8234J3388P632J630l719q125j1968j5688j9518k3603k7968
62043A359445l2364l6536m0438m3903m6437m7753m8166m8060m7212m5190m2112
$$ plain form
62133 881135 861288 845163 831798 820878 812601 806497 801261 795998 791068 787414 785369 784436 784146 784868
62119 784868 787554 792714 799897 808341 817831 828584 840524 853141 865843 877721 887036 891880 891836
62106 891836 888473 883876 879213 875022 872030 870733 870481 869804 867720 864236 859694 854333 848676 843763 840619
62091 840619 839662 840789 843786 848426 854377 861322 869134 877751 886885 896142 905527 915599 926908 939421
62077 939421 952829 967301 983482 1001679 1021477 1042353 1064217 1086960 1109858 1131975 1152994
62066 1152994 1173223 1193049 1212896 1233542 1255786 1279699 1304692 1330301 1356370 1382379 1407103
62055 1407103 1429150 1447384 1460772 1468404 1470034 1466315 1458190 1446222 1430534 1411016 1387413 1359445
62043 1359445 1327081 1290545 1250107 1206204 1159767 1112014 1063848 1015788 968576 923386 881274
62032H81274l8535l4837l1229k8092k5642k3462k0946j8084j5395j3194j1476
62021F20382j0270r572r105q641q373q468q503p995p220o723o293n204l459j919
62007E18637j107o48k3Q36J934L444N227O663P392P788Q366R036R188Q363O632
61992E91728M554K854J846J083k18k292m579o413p638q521r320j0049j0575j0723
61978E31737j0387r610q617p843p727q176q324p339n569m284m091m218l752k893
61964D38907k362k161j753j121p69p67o33j86J89J73k9QO05J836L404M715N443
61947D45499N890O492P209P847Q551R565J0767J1977J3329J4862J6138J6913J7596
61934E92635J8420J8693J7839J6642J6260J6386J5714J4043J2524J1701J0692
$$ plain form
62032 881274 842739 807902 776673 748581 722939 699477 678531 660447 645052 631858 620382
62021 620382 610112 600540 591435 582794 574421 565953 557450 549455 542235 535512 529219 524015 520556 518637
62007 518637 517530 516882 516859 517695 519629 523073 528300 534963 542355 550143 558509 567545 576733 585096 591728
61992 591728 596282 599136 600982 602065 601847 599555 594976 588563 580925 572404 563084 553035 542460 531737
61978 531737 521350 511740 503123 495280 487553 479377 471053 463714 458145 453861 449770 445552 441800 438907
61964 438907 436545 434384 432631 431510 430741 429974 429341 429155 429344 429517 429488 429496 430101 431937 435341 440056 445499
61947 445499 451389 457881 465090 472937 481488 491053 501820 513797 527126 541988 558126 575039 592635
61934 592635 611055 629748 647587 664229 680489 696875 712589 726632 739156 750857 761549
61923G61549Q734O282L995J722r05l660o135q294j0014j0656r702p427m580j788
61909G19121N78K512M598P508J1003J3930J5489J5892J5562J4423J2312R430N999
61896H48357K044k049n451p814r735j1776j3614j4682j5100j5349j5437j4998
61884G24396j3973j2620j1125r662q613q259q391q635q968r566j0316j0783j0596
61871E92889r639q074o377n075m214l273j843j34J346K412L227M072N278P168
61857E77763R671J2189J4090J5363J6575J8270K0505K2858K4883K6586K8345L0300
61845H17398L1980L2765L2525L1436K9445K6325K2224J7544J2442O893J202m043
61833A058136q511j2058j4258j4669j3589j1789r514o457k809N73L338O101R254
$$ plain form
61923 761549 770283 776565 780560 782282 781377 777717 771582 763288 753274 742618 732916 725489 720909 719121
61909 719121 719699 722211 726809 734317 745320 759250 774739 790631 806193 820616 832928 842358 848357
61896 848357 850401 848352 842901 835087 825352 813576 799962 785280 770180 754831 739394 724396
61884 724396 710423 697803 686678 677016 668403 660144 651753 643118 634150 624584 614268 603485 592889
61871 592889 583250 575176 568799 563724 559510 556237 554394 554260 555606 558018 561245 565317 570595 577763
61857 577763 587434 599623 613713 629076 645651 663921 684426 707284 732167 758753 787098 817398
61845 817398 849378 882143 914668 946104 975549 1001874 1024098 1041642 1054084 1060977 1062179 1058136
61833 1058136 1049625 1037567 1023309 1008640 995051 983262 973748 967291 964482 965055 968393 974494 983748
61820I83748J1944J2880J1728R180N963K189k446q111j4351k0108k4516k7631
61808I40469k9998l1676l2247l1692l0522k8960k6759k4053k1568j9734j8262
61797F44998j6876j5689j4639j3291j1569r917q420o635m687l561l685m074l688
61784E28267k862k511k577k293j553r61p15l64K30M94j39j496k776l152k375j040
61768E04177p2K09L29Q05J469J857J862J629J282J073J439K449L531M080M095
61753E30214L906L661L352K955K295J119m12j735k568l135l530l543l262l196
61739E26121l446l492l185l099l430l459k743k005j941j934j006N36J495J488
61725D99900J249J387J770K061K136K005J871K144K885L525L589L379L350L349
$$ plain form
61820 983748 995692 1008572 1020300 1029480 1035443 1037632 1035186 1027075 1012724 992616 968100 940469
61808 940469 910471 878795 846548 814856 784334 755374 728615 704562 682994 663260 644998
61797 644998 628122 612433 597794 584503 572934 563017 554597 547962 543275 539714 536029 531955 528267
61784 528267 525405 522894 520317 518024 516471 515510 514795 514431 514661 515155 515016 513520 510744 507592 505217 504177
61768 504177 504105 504314 504643 505448 506917 508774 510636 512265 513547 514620 516059 518508 522039 526119 530214
61753 530214 534120 537781 541133 544088 546383 547502 547090 545355 542787 539652 536122 532579 529317 526121
61739 526121 522675 519183 515998 512899 509469 506010 503267 501262 499321 497387 496381 496917 498412 499900
61725 499900 501149 502536 504306 506367 508503 510508 512379 514523 517408 520933 524522 527901 531251 534600
61711E34600L062K707K461J691k81k841m516m668l984l416l328l616l930l809
61697E10132l209k713k734k875k656k435k749l202k986k228j762j785j783j695
61683D75320k015k718l151l107l044l094k845k300k037k183k241k106k336k933
61669D39210l012k172j344j524k346k698k222j539j244j280j130l31J032K216
61655D21616K514K122J862J959J775R98L86Q01K038L140L555L448L140K783K446
61640D54583K147J867J712J825J988J641N96n69j173j236j305j637k023k273k471
61625D53672k711k932l117l350l556l381k613j629j082j058q80m4Q77Q09l79j687
61609D26939k293k467k825l376l917m729o058p232p245o124m964m517m526m455
$$ plain form
61711 534600 537662 540369 542830 544521 544240 541399 536883 532215 528231 524815 521487 517871 513941 510132
61697 510132 506923 504210 501476 498601 495945 493510 490761 487559 484573 482345 480583 478798 477015 475320
61683 475320 473305 470587 467436 464329 461285 458191 455346 453046 451009 448826 446585 444479 442143 439210
61669 439210 436198 434026 432682 431158 428812 426114 423892 422353 421109 419829 418699 418368 419400 421616
61655 421616 424130 426252 428114 430073 431848 432846 433232 434033 436071 439211 442766 446214 449354 452137 454583
61640 454583 456730 458597 460309 462134 464122 465763 466359 465790 464617 463381 462076 460439 458416 456143 453672
61625 453672 450961 448029 444912 441562 438006 434625 432012 430383 429301 428243 427363 427319 428196 429005 428626 426939
61609 426939 424646 422179 419354 415978 412061 407332 401274 394042 386797 380673 375709 371192 366666 362211
61595C62211m145l628k929k349k297k640k747k362j917j754j691j615j875k557
61581C27705k963k429j364q41j316k198k616k257j388m79J70N47P46O84J73o46
61565C11528j228j249j021r60q84k98P11J339J073M16K73Q19J413J549J401J309
61549C16191J206R46Q19J166J666J603R10L71N97J306J858K060K106K172K389
61534C37366K943L775M498M812M794M457L470J670m19j984k631k465j815j212
61520C57259j238j937k676k896k722k500k205j765j441j319r36j9Q10Q58M77N09
61504C38259R08Q55J34o34j087j549k167k438j949j007j83L25O74R71J106Q83
61488C33101L62J21P25J722J868P99j78J52J144J334P30O19J395K098K201K293
$$ plain form
61595 362211 358066 354438 351509 349160 346863 344223 341476 339114 337197 335443 333752 332137 330262 327705
61581 327705 324742 322313 320949 320108 318792 316594 313978 311721 310333 309854 310024 310571 311317 312001 312174 311528
61565 311528 310300 309051 308030 307070 306186 305888 306599 307938 309011 309427 309700 310519 311932 313481 314882 316191
61549 316191 317397 318343 319162 320328 321994 323597 324507 324878 325475 326781 328639 330699 332805 334977 337366
61534 337366 340309 344084 348582 353394 358188 362645 366115 367785 367366 365382 362751 360286 358471 357259
61520 357259 356021 354084 351408 348512 345790 343290 341085 339320 337879 336560 335624 335605 336415 337273 337750 338259
61504 338259 339167 340022 340156 339522 338435 336886 334719 332281 330332 329325 329142 329467 330141 331112 332218 333101
61488 333101 333463 333584 334309 336031 337899 338698 338520 338672 339816 341150 341880 342499 343894 345992 348193 350486
61472C50486K592K274R61l30n92k50l36r91j574j666j231l56N25O37k35j291j695
61455C46928j534j189m32J039K604L187K646J869J554J533J396J117R55J075J450
61440C64198J894K132K074J975K129K508K862L134L422L619L430K838K293K233
61426D00741K512K511J868R55M44N11P62R21J188J731K245K436K515K758K842
61411D26940K216J028jo15j253k184k989l231l072k919k823k574k189j956j960
61396D02418j875j326n27k83j036k080k233j359n10l53l27J14M00j25q51p41k0
61379C89286K88J41M84J457K087J921J688J964K358K491K693L121L125K246J095
61364D16445O31J009J675K107K127J902J917K533L476M257N015O144P275P629
$$ plain form
61472 350486 353078 355352 356313 355983 355391 355141 354805 353814 352240 350574 349343 348987 349512 350149 349914 348623 346928
61455 346928 345394 344205 343773 344812 347416 350603 353249 355118 356672 358205 359601 360718 361673 362748 364198
61440 364198 366092 368224 370298 372273 374402 376910 379772 382906 386328 389947 393377 396215 398508 400741
61426 400741 403253 405764 407632 408587 409031 409542 410304 411225 412413 414144 416389 418825 421340 424098 426940
61411 426940 429156 430184 430183 429568 428315 426131 423142 419911 416839 413920 411097 408523 406334 404378 402418
61396 402418 400543 399217 398690 398407 397371 395291 393058 391699 391189 390836 390509 390623 391023 390898 390047 389306 389286
61379 389286 389574 389715 390199 391656 393743 395664 397352 399316 401674 404165 406858 409979 413104 415350 416445
61364 416445 417076 418085 419760 421867 423994 425896 427813 430346 433822 438079 443094 449238 456513 464142
61350D64142P461P921R220J0174J0024R408Q923Q059O404M752L885L326K400J711
61336E57810K184L307L660K844J657O37l59j191j339r45r93k117l795m960n001
61321E51399m061k762j734j093l80Q16K339L706M634N107N245N343N728O355O883
61306E87525P321Q042R075R954J0559J1262J1848J1177Q609N033J711j180m019
61293F76917o448p760q160q548r190r581r486r190q804q231p766p785p844o962
61279E61162m974k812j236q0J047K095K981L976N183O045O028N488N365O030O800
61264F03098O839O250O004O745Q055R160J0059J1351J2971J3833J3037J0829Q031
61251G26262N104K279P0j097j559k052k738l144l037k844l095l815m558m836m467
$$ plain form
61350 464142 471603 479524 488744 498918 508942 518350 527273 535332 541736 546488 550373 553699 556099 557810
61336 557810 559994 563301 566961 569805 571462 572099 571740 570549 569210 568265 567272 565155 561360 556400 551399
61321 551399 547338 544576 542842 541749 541369 542185 544524 548230 552864 557971 563216 568559 574287 580642 587525
61306 587525 594846 602888 611963 621917 632476 643738 655586 666763 675372 680405 682116 680936 676917
61293 676917 670469 662709 654549 646001 636811 627230 617744 608554 599750 591519 583753 575968 568124 561162
61279 561162 556188 553376 552140 552060 553107 555202 558183 562159 567342 573387 579415 584903 590268 596298 603098
61264 603098 609937 616187 622191 628936 636991 646151 656210 667561 680532 694365 707402 718231 726262
61251 726262 731366 733645 733715 732618 731059 729007 726269 723125 720088 717244 714149 710334 705776 700940 696473
61236F96473l705l046k864l229l958m629m660l788k491j549j051l23J055K628
61222F64863L656L891L571L091K848L004L234L143L052L723N192O480O726N967
61208G22441M565K668O24p92j154q16j88P66J991L089M095N755Q339J0938J2656
61193G74977J3904J5712J8190K0386K1279K0324J7518J3586R702O513L826J574
61181I37491L07J95L34j95j289k504m034o051p857q668q750q868r140r369r816
61166H61786j0705j1463j1558j1591j2438j3756j4429j4150j3484j2735j1840
61155G23637j1049j0520r587p561m988k914j199J097L807N540N518M212K123p94
61141F97322m187p026q746r701j0210r984q859p308n839m503l167j722L5K145
$$ plain form
61236 696473 692768 689722 686858 683629 679671 675042 670382 666594 664103 662554 661503 661180 662235 664863
61222 664863 668519 672410 675981 679072 681920 684924 688158 691301 694353 698076 703268 709748 716474 722441
61208 722441 727006 729674 730298 729506 728352 727536 727348 728114 730105 733194 737289 743044 751383 762321 774977
61193 774977 788881 804593 822783 843169 864448 884772 902290 915876 925578 932091 935917 937491
61181 937491 937798 937993 938327 938132 936843 934339 930305 924254 916397 907729 898979 890111 880971 871602 861786
61166 861786 851081 839618 828060 816469 804031 790275 775846 761696 748212 735477 723637
61155 723637 712588 702068 692481 684920 679932 677018 675819 676916 680723 686263 691781 695993 698116 697322
61141 697322 693135 686109 677363 667662 657452 647468 638609 631301 625462 620959 617792 616070 616105 618250
61127F18250M140N604O894Q584J0429J1797J2913J4631J6979J8974K0045K0666
61115G69906K1436K2415K3533K4783K5832K6178K5877K5419K4900K4013K2822
61104A037114K1657K0291J8148J5295J2296R072M950o0n067r539j3647j7279j9845
61091A073386k1381k2814k4640k6259k7000k6958k6411k5267k3629k2126k1172
61080H05729k0473j9625j8577j7240j5356j3113j1265j0180r369q295p107o191
61068F48938n455m481l082j453JR06J266J537K146L098M308N859P483Q355Q148
61053F77574P820Q461R802J0813J1475J2675J4646J6685J8374J9891K1199K2045
61041H51460K2790K4079K5715K6961K7876K9131L0563L1244L1072L0966L1386
$$ plain form
61127 618250 622390 627994 634888 643472 653901 665698 678611 693242 710221 729195 749240 769906
61115 769906 791342 813757 837290 862073 887905 914083 939960 965379 990279 1014292 1037114
61104 1037114 1058771 1079062 1097210 1112505 1124801 1133873 1138823 1138763 1133696 1124157 1110510 1093231 1073386
61091 1073386 1052005 1029191 1004551 978292 951292 924334 897923 872656 849027 826901 805729
61080 805729 785256 765631 747054 729814 714458 701345 690080 679900 670531 662236 655129 648938
61068 648938 643483 639002 635920 634467 634468 635374 636640 638177 640323 643421 647729 653588 661071 669426 677574
61053 677574 685394 693855 703657 714470 725945 738620 753266 769951 788325 808216 829415 851460
61041 851460 874250 898329 924044 951005 978881 1008012 1038575 1069819 1100891 1131857 1163243
61030A163243L1919L2500L3692L5490L7157L8524M0216M2385M4368M5740M6532
61019A591766M6537M5898M6295M9812N6541O4977P4672Q6449R9900J13190J25997
61008B402034J40588J59478J84393K18123K64495L25126L98373M82479N77399
60999E152488O83331Q01534R38532J106050J314759J570510J871196K187164K429237
60990A8054801K452631K136740J495776P10946L2564l66577m56701l04466n186
60981B3750528L23445N19370M16462m6671p55619j477348k004075k256208k273626
60972A6196258k140959j930435j690313j451900j232188j035937q62948p13583
60964E137995n87554m82000l93767l21688k64977k21173j87109j60415j39101
$$ plain form
61030 1163243 1195162 1227662 1261354 1296844 1334001 1372525 1412741 1455126 1499494 1545234 1591766
61019 1591766 1638303 1684201 1730496 1780308 1836849 1901826 1976498 2062947 2162847 2276037 2402034
61008 2402034 2542622 2702100 2886493 3104616 3369111 3694237 4092610 4575089 5152488
60999 5152488 5835819 6637353 7575885 8681935 9996694 11567204 13438400 15625564 18054801
60990 18054801 20507432 22644172 24139948 24850894 24883458 24516881 24060180 23755714 23750528
60981 23750528 24073973 24593343 25009805 24963134 24207515 22730167 20726092 18469884 16196258
60972 16196258 14055299 12124864 10434551 8982651 7750463 6714526 5851578 5137995
60964 5137995 4550441 4068441 3674674 3352986 3088009 2866836 2679727 2519312 2380211
60955B380211j21062j05111r1355p9708o9194n9179n0072m2107l4720k7898k2936
60944A676869k0931k1399k2989k4687k5705k5385k4006k2864k2650k2543k1648
60933A422062k0560k0514k1596k2764k3332k3530k3719k3876k3836k3613k3379
60922A171343k3356k3616k3824k3487k2651k2002k1909k1784k0832j9215j7899
60911I30768j7435j7348j6836j5708j4354j3103j1974j0980j0301r906r391q469
60899G74963p444o765o334n776n264n408o205o867o864o534o373o404o546o879
60885F85300p127o675n632n118n785o766o923o405o083o059n867n726o291p316
60871E97527p784p414p020p142p256o697n608m555l774l161k608j997j175k16
$$ plain form
60955 2380211 2259149 2154038 2062683 1982975 1913781 1854602 1804530 1762423 1727703 1699805 1676869
60944 1676869 1655938 1634539 1611550 1586863 1561158 1535773 1511767 1488903 1466253 1443710 1422062
60933 1422062 1401502 1380988 1359392 1336628 1313296 1289766 1266047 1242171 1218335 1194722 1171343
60922 1171343 1147987 1124371 1100547 1077060 1054409 1032407 1010498 988714 967882 948667 930768
60911 930768 913333 895985 879149 863441 849087 835984 824010 813030 802729 792823 783432 774963
60899 774963 767519 760754 754420 748644 743380 737972 731767 724900 718036 711502 705129 698725 692179 685300
60885 685300 678173 671498 665866 660748 654963 648197 641274 634869 628786 622727 616860 611134 604843 597527
60871 597527 589743 582329 575309 568167 560911 554214 548606 544051 540277 537116 534508 532511 531336 531120
60857E31120N07O86M28J86K71L47l65k055l606l584j987k77N18Q07J092P92p18
60840E24162k744m099m726n374o068o129n518n048n114n229m877m099l062j844
60826D60231o69J98Q13J359J703J717J740K143K583K401J544M86n05j320j572
60811D72852j044l31k19o26r48j150j579j985j839j405j427j802j737j270j399
60796D54091k447l483l726l557l602l691l352k713k381k735l689m710m977m039
60782D04989k458j395j394k020k616k846k529j619n01K25L47M4n63j268j414n02
60766C84480Q68J515J216R35J403K286K950L280L472L597L725L947M101L945L627
60751D25347L453L188K335J101L62N04R63J095Q63M53j62r88j907k928m116n240
$$ plain form
60857 531120 531627 532313 532741 532927 533198 533545 533180 531125 527519 523935 521948 521671 522189 522996 524088 524880 524162
60840 524162 521418 517319 512593 507219 501151 495022 489504 484456 479342 474113 469236 465137 462075 460231
60826 460231 459562 459760 460573 461932 463635 465352 467092 469235 471818 474219 475763 476249 475744 474424 472852
60811 472852 471808 471477 471258 470632 469684 468534 466955 464970 463131 461726 460299 458497 456760 455490 454091
60796 454091 451644 448161 444435 440878 437276 433585 430233 427520 425139 422404 418715 414005 409028 404989
60782 404989 402531 401136 399742 397722 395106 392260 389731 388112 387611 387836 388183 388227 387664 386396 384982 384480
60766 384480 385348 386863 388079 389014 390417 392703 395653 398933 402405 406002 409727 413674 417775 421720 425347
60751 425347 428800 431988 434323 435424 435786 436290 437253 438348 439211 439664 439502 438514 436607 433679 429563 424323
60735D24323n924o195o359o382o033n478n090m696l807k604j893j963k263k273
60721C63363k087j936j861j866j839j397m63J51l61j477j915j428r82j040r28
60706C43934j89N88Q28Q63J213J746K082K131J831J015j2m72j9R39J974K966L559
60689C64977L210K133J349J383J743J954K218K623K689K316K341L420N036O193
60675D03585O546O255N452M387L513K881K016Q31j0j26j36p22j617k176k403k696
60659D25580l143l606m134m579m327l049j388k65J86M20N84N08L62O10J287J805
60643D06851J598O69n17j498k142k601k942l050k986l170l784m248l814k594j358
60628C74414n52o2K00K18K43M83N42K3n54l39M59Q84P88Q40J041O57k26n84k12
$$ plain form
60735 424323 418399 412204 405845 399463 393430 387952 382862 378166 374359 371755 369862 367899 365636 363363
60721 363363 361276 359340 357479 355613 353774 352377 351914 352065 351704 350227 348312 346884 345902 344862 343934
60706 343934 343745 344333 345161 346024 347237 348983 351065 353196 355027 356042 356030 355558 355539 356478 358452 361418 364977
60689 364977 368187 370320 371669 373052 374795 376749 378967 381590 384279 386595 388936 392356 397392 403585
60675 403585 410131 416386 421838 426225 429738 432619 434635 435466 435456 435330 435194 434472 432855 430679 428276 425580
60659 425580 422437 418831 414697 410118 405791 402742 401354 401089 401275 401695 402279 402787 403149 403759 405046 406851
60643 406851 408449 409118 408601 407103 404961 402360 399418 396368 393382 390212 386428 382180 378366 375772 374414
60628 374414 373862 373800 374000 374218 374461 374944 375486 375509 374955 374616 375075 375959 376747 377587 378628 379285 379059 378475 378263
60609C78263o9l66LJ354K188J433K63K91J083J051k4q66o92P3Q36J408J618J327
60591C89174Q23N91Q17J504K552L399L162J812N39K97O43O78L73J32k01q37j205
60574D04253o16N99J670K589L776M939N451N627O510Q413J0528J2046J2891J3356
60560D92032J3626J3664J3080J1370Q656N848L483R67k338n740p845q277p868
60547E30658p243o126m132j573P64K325L260M316O016P892R026R522J0675J3232
60533E78612J6262J8393J9390J9733J9371J7777J4825J0755N789N35l776o403
60521G11263p984r430j0463j0240q923p624o996o867o890o680n677l911k419j926
60507F15233j511J31K555M108M487N191P295J0215J3125J6238K0025K4162K8056
$$ plain form
60609 378263 378194 377828 377831 379185 381373 382806 383069 383360 384443 385494 385470 384604 383912 383985 384821 386229 387847 389174
60591 389174 389997 390588 391405 392909 395461 398860 402022 403834 404373 404670 405313 405991 406364 406496 406295 405458 404253
60574 404253 403637 404236 405906 408495 412271 417210 422661 428288 434798 443211 453739 465785 478676 492032
60560 492032 505658 519322 532402 543772 552428 558276 561759 562726 560388 554648 546803 538526 530658
60547 530658 523415 517289 513157 511584 512348 514673 517933 522249 528265 536157 545183 554705 565380 578612
60533 578612 594874 613267 632657 652390 671761 689538 704363 715118 720907 721442 717666 711263
60521 711263 703279 693849 683386 673146 664223 656599 649603 642736 635846 629166 623489 619578 617159 615233
60507 615233 613722 613853 616408 620516 625003 630194 637489 647704 660829 677067 697092 721254 749310
60494G49310L1810L5962M0580M5079M8681N0816N1284N0135M7333M2749L6594
60483A230333K9493K1746J3025L274o607j5762k4483l3472m2273m9470n4193n6521
60471A015090n6592n4427n0619m6239m1920l7766l3972l0674k7341k3423j9558
60460E92559j7004j5797j4616j2698j0729r451q510p297n997n112m598m179l962
60447D72609m128m339m005k966j627o26m47j067j806j935j513j259j544j945j932
60432D41470j440o63K61J105J486J179L56o11j347j585j366j063r06o12Q1P97
60416D37142Q76L20k06k03K52R00J510J761J457R01O16O65O68M70K97L15M46O93
60398D48880J168J806K301K397K067J550J380K002L112L806L673L244L034K807
$$ plain form
60494 749310 781120 817082 857662 902741 951422 1002238 1053522 1103657 1150990 1193739 1230333
60483 1230333 1259826 1281572 1294597 1297871 1291264 1275502 1251019 1217547 1175274 1125804 1071611 1015090
60471 1015090 958498 904071 853452 807213 765293 727527 693555 662881 635540 612117 592559
60460 592559 575555 559758 545142 532444 521715 512264 503754 496457 490460 485348 480750 476571 472609
60447 472609 468481 464142 460137 457171 455544 454918 454471 453404 451598 449663 448150 446891 445347 443402 441470
60432 441470 440030 439367 439628 440733 442219 443398 443754 443143 441796 440211 438845 437782 436876 436264 436345 437142
60416 437142 438018 438338 438132 437929 438181 439081 440591 442352 443809 444710 445326 445991 446659 447129 447426 447741 448187 448880
60398 448880 450048 451854 454155 456552 458619 460169 461549 463551 466663 470469 474142 477386 480420 483227
60384D83227K341K172K778L619L920L857M009M157L694K850K383K307K033J539
60370E24886J313J345J268J301J875K479K168J126N00O69R59J041J280J631J562
60355E45403J313J834L147M157M480N047O382P718Q463R178J0261J0897J0303
60342F28583R003P831O498M216J060k195n080p456r010r550r468r300r160q943
60328E87029q585p820o396m918m576n418n873m737k846j841j983k274k144j838
60314E25780j378k97J429L103M097M458M626N054O137Q063J0645J3514J6461J9420
60300F21112K2285K4778K6346K6075K3249J8188J2126N943n29p593j4547j9926
60288G37507k2720k2940k1356j8995j6703j4709j2698j0431q183o472n604n596
$$ plain form
60384 483227 485568 487740 490518 494137 498057 501914 505923 510080 513774 516624 519007 521314 523347 524886
60370 524886 526199 527544 528812 530113 531988 534467 536635 537761 538261 538930 539889 540930 542210 543841 545403
60355 545403 546716 548550 551697 555854 560334 565381 571763 579481 587944 597122 607383 618280 628583
60342 628583 637586 645417 651915 656131 657191 654996 649916 642460 633450 623900 614432 605132 595972 587029
60328 587029 578444 570624 564228 559310 554734 549316 543443 538706 535860 534019 532036 529762 527618 525780
60314 525780 524402 524105 525534 528637 532734 537192 541818 546872 553009 561072 571717 585231 601692 621112
60300 621112 643397 668175 694521 720596 743845 762033 774159 780102 779573 771980 757433 737507
60288 737507 714787 691847 670491 651496 634793 620084 607386 596955 588772 582300 576696 571100
60276E71100o195o890p220p196p083o775n928m746l965l878l974l796l483l164
60262D96807k516j449n87n14r66j314j496j793k032j704p69J92O18M44m7n31p34
60245D81609m76K69J306K173K340J700P84K30J01Q9J42M09P10O98N44Q36J712
60228D95176K691L418L975M385M417M093L760L553L316L160L392L852M061M160
60214E47409M880O280P429P730P762Q266R069R528R504R210Q649P766O828O142
60200F56452N614N030M496M271M290M100L189J478l23j145q09m80j222k491l021
60185F79429k821l095m258n427o033o520p062p002o153n422n387n425m906m172
60171F05746l564k697j522j014j685k434j996p32N9r2p65j580k203k075j187n28
$$ plain form
60276 571100 564905 558015 550795 543599 536516 529741 523813 519067 515102 511224 507250 503454 499971 496807
60262 496807 494291 492842 492255 491741 490775 489461 487965 486172 484140 482436 481667 481859 482477 482921 482874 482343 481609
60245 481609 481133 481402 482708 484881 487221 488921 489705 489935 490036 490125 490267 490676 491386 492084 492628 493464 495176
60228 495176 497867 501285 505260 509645 514062 518155 521915 525468 528784 531944 535336 539188 543249 547409
60214 547409 552289 558569 565998 573728 581490 589756 598825 608353 617857 627067 635716 643482 650310 656452
60200 656452 662066 667096 671592 675863 680153 684253 687442 688920 688597 687452 686643 686163 684941 682450 679429
60185 679429 676608 673513 669255 663828 657795 651275 644213 637211 631058 625636 620249 614824 609918 605746
60171 605746 602182 599485 597963 596949 595264 592830 590834 590102 590161 590069 589304 587724 585521 583446 582259 581731
60155E81731p45j041l99P83J376J299J371J880K388K637K633K280J829K143L462
60140F03627M536M143K918K411K887L544M370O023P976Q633P594O301N913N903
60126F76779N306M182L091K106J087L25K24O92J362K035K638L002K967K546J889
60111G10231J252Q49N13j69j097j533j264j297k544m281m948m339l808m310n287
60096F77968n767n567n038m332l417k334j100J85J093J242R90J190K070K873K809
60081F62865J871O38k78m99j33J17m35j664k863l738m708o095p594q717r255r242
60065F10270q812q255p820p439o870o036m998l766k575j990k159k320j759j000
60051E44471j101j899k045r08N97J543K347L896O034P727Q361Q209P771P245O629
$$ plain form
60155 581731 580986 579945 579546 580329 581705 583004 584375 586255 588643 591280 593913 596193 598022 600165 603627
60140 603627 608163 612306 615224 617635 620522 624066 628436 634459 642435 651068 658662 664963 670876 676779
60126 676779 682085 686267 689358 691464 692551 692876 693100 693792 695154 697189 699827 702829 705796 708342 710231
60111 710231 711483 712332 712845 712676 711579 710046 708782 707485 704941 700660 695712 691373 687565 683255 677968
60096 677968 672201 666634 661596 657264 653847 651513 650413 650598 651691 652933 653923 655113 657183 660056 662865
60081 662865 664736 665374 665096 664597 664464 664581 664146 662482 659619 655881 651173 645078 637484 628767 619512 610270
60065 610270 601458 593203 585383 577944 571074 565038 560040 556274 553699 551709 549550 547230 545471 544471
60051 544471 543370 541471 539426 538518 539115 540658 543005 546901 552935 560662 569023 577232 585003 592248 598877
60036E98877N899N028M105L353K835K109N36j945m456n857n871n404n574o490
60022E87145p336p555p430p436p534p447p148o742o207n667n531n843n927n189
60008D94153l999l253l191l227k801j954j162q88j140j265n66O30J142N94J66
59993D73239R65K334K871K563K661L621M502M578M410M840N779O469O327N180
59979E30339L194Q95j128k680l845m447m238l570l222l438l729l739l663l558
59965D93171k996j739l04O04Q49P96P93J038J645K520L204L123K052M09r09j192
59949E03064o11m5j4o0M67J377J866J557P81q7r60j720k098j970j488q85l82j25
59931D98667N3N41J328J843J819J892K780M221N382N972O294O465O417O402O746
$$ plain form
60036 598877 604776 609804 613909 617262 620097 622206 622742 620797 616341 610484 604613 599209 593635 587145
60022 587145 579809 572254 564824 557388 549854 542407 535259 528517 522310 516643 511112 505269 499342 494153
60008 494153 490154 486901 483710 480483 477682 475728 474566 473678 472538 471273 470707 471337 472479 473073 473239
59993 473239 474204 476538 479409 481972 484633 488254 492756 497334 501744 506584 512363 518832 525159 530339
59979 530339 533533 534428 533300 530620 526775 522328 518090 514520 511298 507860 504131 500392 496729 493171
59965 493171 490175 488436 488132 488736 489585 490381 491174 492212 493857 496377 499581 502704 504756 505165 504256 503064
59949 503064 502453 502408 502394 502334 502801 504178 506044 507601 508382 508295 507335 505615 503517 501547 500059 499174 498792 498667
59931 498667 498720 499261 500589 502432 504251 506143 508923 513144 518526 524498 530792 537257 543674 550076 556822
59916E56822P247P596Q085Q993R462Q166N224K348Q30K85l14j273k339l409m416
59901F03307n031m971m410l746l206k807k383j673o90R4L73O82J765L387M522
59886E85213M788M855N235N596N599N664O266P048P229O646N857N354N053M589
59872F64992L817K971K302J639N67r59k507l865n257o533o904o099n177n259n891
59857F27837n789m809l957l561k871j633o94n49m26N68K319M253O166P932R155
59842F33941R716R963R790Q341N319J889m60j450j640j082O37L212N308N627L812
59827F92923M52l291o165p560p886p967p995p457o077m440l387l074k935k463
59813F22678j732j049m91j08k71j331k959m332n049n362n439n095m396l869l697
$$ plain form
59916 556822 564069 571665 579750 588743 598205 606371 611595 613943 614773 615058 614744 613471 611132 607723 603307
59901 603307 598276 593305 588895 585149 581943 579136 576753 575080 574390 574484 574857 575539 577304 580691 585213
59886 585213 590001 594856 600091 605687 611286 616950 623216 630264 637493 644139 649996 655350 660403 664992
59872 664992 668809 671780 674082 675721 676288 675329 672822 668957 663700 657167 650263 644164 638987 633728 627837
59857 627837 622048 617239 613282 609721 606850 605217 604523 603974 603548 604116 606435 610688 616854 624786 633941
59842 633941 643657 653620 663410 671751 677070 678959 678499 677049 675409 674327 674964 678176 683484 689111 692923
59827 692923 693375 690084 683919 676359 668473 660506 652511 645054 638977 634537 631150 628076 625141 622678
59813 622678 620946 619897 619406 619298 619027 617696 614737 610405 605356 599994 594555 589460 585064 581195 577498
59798E77498l430k867k554k858l277l302l202l231k889j881j044j192j705j447
59784E42619n99k34n67r14j043j161q80K58J479J518O47L04P61R57P75J496L392
59767E48808M743M280L024K600K997L182K843K383K000J792K097K786K973K311
59753E88819J864K684M184M932M578L988L775L756L673L567L414L015K417J983
59739F36649J964K237K366J940J004J53r5L7o5m32n25j91M0k38p92j100p74K64
59721F42442J467J773Q69M7P50K432L172K353J324J165J339J091P64R20J332J623
59705F64863J991K539K886L007L535M506M853L963K788K561L180L710L725L428
59691G11535L082K986L292L321K029l57k190k585k542l107l714l483l015l395
$$ plain form
59798 577498 574068 571201 568647 565789 562512 559210 556008 552777 549888 548007 546963 545771 544066 542619
59784 542619 542020 541786 541219 540305 539262 538101 537221 537479 538958 540476 541123 541427 542188 543145 543920 545416 548808
59767 548808 553551 557831 560855 563455 566452 569634 572477 574860 576860 578652 580749 583535 586508 588819
59753 588819 590683 593367 597551 602483 607061 611049 614824 618580 622253 625820 629234 632249 634666 636649
59739 636649 638613 640850 643216 645156 646160 646313 646218 646255 646190 645758 645233 645042 645082 644844 644052 642952 642178 642442
59721 642442 643909 645682 646551 646598 647348 649780 652952 655305 656629 657794 659133 660224 660988 661908 663240 664863
59705 664863 666854 669393 672279 675286 678821 683327 688180 692143 694931 697492 700672 704382 708107 711535
59691 711535 714617 717603 720895 724216 726245 725888 723698 721113 718571 715464 711750 708267 705252 701857
59677G01857m277m472l921l676m235n129n939o604o900o581n896n266m664l997
59663F30300l632l775l813l063j778o15L82J398K048J971J796K442L708M564M629
59648F36562M375M049L365K248J008l44k182m469o388p021o235m949m409m975
59634F10635n597n068l755l189l835m331l439j709n48n41j415k816m225m861m508
59619E60798l868l489l114k609k531l078l513l445l536m023l770k045l0Q66J115
59604E23728J941K999K976J842P58J67l69p30l58L78N03Q0Q4P43J343J538J563
59587E39186J319O51K86J001J961J485m62k131k449k145k122k268k296k509l078
59572E26429l541l491l012k251j382r55j311j675j010K61N80n01j696j897j442
$$ plain form
59677 701857 697580 693108 689187 685511 681276 676147 670208 663604 656704 650123 644227 638961 634297 630300
59663 630300 626668 622893 619080 616017 614239 613624 614006 615404 617452 619423 621219 623661 627369 631933 636562
59648 636562 640937 644986 648351 650599 651607 651263 649081 644612 638224 631203 624968 620019 615610 610635
59634 610635 605038 599970 596215 593026 589191 584860 581421 579712 579164 578623 577208 574392 570167 565306 560798
59619 560798 556930 553441 550327 547718 545187 542109 538596 535151 531615 527592 523822 521777 521747 522613 523728
59604 523728 525669 528668 531644 533486 534244 534411 534042 533312 532954 533332 533835 533915 533999 534742 536085 537623 539186
59587 539186 540505 541156 541442 542443 544404 545889 545427 543296 540847 538702 536580 534312 532016 529507 526429
59572 526429 522888 519397 516385 514134 512752 511797 510486 508811 507801 508062 508642 508141 506445 504548 503106
59557E03106j081p98k85L86J062J756K259K291K234K820L877M334L857L413L791
59542E33022M496M739M767N539P537J0415J3528J6521J9527K2613K4596K3005
59530F90305J6354O512k341p340q717q005o010l103k01J751K725L187L160K340
59516F90617Q26r32k681m412o047p461q734j0020j1253j2131j2333j1710j0450
59503E93279r088q136p628p139o238m846l320k257j954j975j520l95P93J441J536
59488E42553J241O22M2P1O58J115J323J968L119L774L593L809N276O758O707N721
59472E88350N539O285O556N849M986M268L057J380K68Q4l6o72j223q98L81K258
59456F26432M221N538N931O268P549R369J0465J0592J0506J0257Q994O688M502
$$ plain form
59557 503106 502025 501227 500942 501328 502390 504146 506405 508696 510930 513750 517627 521961 525818 529231 533022
59542 533022 537518 542257 547024 552563 560100 570515 584043 600564 620091 642704 667300 690305
59530 690305 706659 713171 710830 703490 694773 686768 680758 677655 677454 679205 681930 685117 688277 690617
59516 690617 691443 690511 687830 683418 677371 669910 661176 651156 639903 627772 615439 603729 593279
59503 593279 584191 576055 568427 561288 555050 550204 546884 544627 542673 540698 539178 538783 539576 541017 542553
59488 542553 543794 544416 544458 544529 545187 546302 547625 549593 552712 556486 560079 563888 569164 575922 582629 588350
59472 588350 593889 600174 606730 612579 617565 621833 624890 626270 626538 626622 626586 625914 624691 623793 624174 626432
59456 626432 630653 636191 642122 648390 655939 665308 675773 686365 696871 707128 716122 722810 727312
59443G27312L161K159Q18j068l746p278j0551j1949j1313j0014q852p335n348
59430F55996l964l886m399m567m285l577j985N78L328N578P443R189J0791J2402
59416F78642J4362J6406J7877J8871K0150K1935K3960K6496K9377K9903K4080
59405I22059J1229m248j6713k3621k5338k2842j7343j0718m216K570R739J4662
59393H35220J3372M665q176j9860k6701k8227k6339k3213j9803j6140j2577r838
59381F62383p886n849l453j444j63J189L105M688M907M153L629L792M289M824
59367F78164N275N427N294N355N882O436O461O002N469N177N420O397P710Q573
59353G63042Q845R226J0188J1410J2471J3353J4006J4263J4411J4868J5195J4499
$$ plain form
59443 727312 730473 732632 733450 732382 728636 721358 710807 698858 687545 677531 668679 661344 655996
59430 655996 652032 648146 643747 639180 634895 631318 629333 629911 633239 638817 646260 655449 666240 678642
59416 678642 693004 709410 727287 746158 766308 788243 812203 838699 868076 897979 922059
59405 922059 933288 929040 912327 888706 863368 840526 823183 812465 808249 810819 820558 835220
59393 835220 848592 853257 845081 825221 798520 770293 743954 720741 700938 684798 672221 662383
59381 662383 654497 648648 645195 643751 643588 644777 647882 652570 657477 661630 665259 669051 673340 678164
59367 678164 683439 688866 694160 699515 705397 711833 718294 724296 729765 734942 740362 746759 754469 763042
59353 763042 771887 781113 791301 802711 815182 828535 842541 856804 871215 886083 901278 915777
59341I15777J3063J2260J2393J1969R778O462L258L73k567n511q327j1208j3883
59328I43837j5413j5503j5161j5190j5103j4276j3149j2307j1370r864q334p547
59316G90620p294o871o091n097l905k918k931l850m370l776l013l038l335l058
59302G31073k507k115j135J114L658N130O024P970J1230J4237J5288J3366P928
59289H11261m31r238j5606j8601j9230j8450j6508j3942j1632r606p055l804q10
59276F66348J207K678M425O672R042J1110J2661J3706J4280J4144J2966J1024
59264G80263R199P945O729M921K581L6k655n180o783p314p743q775r731r673q948
59249G44872q529q411p847o734n639m689l518k129q57L18J606K742L364L805M639
$$ plain form
59341 915777 928840 941100 953493 965462 975240 981702 984960 985333 982766 977255 968928 957720 943837
59328 943837 928424 912921 897760 882570 867467 853191 840042 827735 816365 806501 798167 790620
59316 790620 783326 776455 770364 765267 761362 758444 755513 751663 747293 743517 740504 737466 734131 731073
59302 731073 728566 726451 725316 726430 730088 735218 741242 749212 760442 774679 789967 803333 811261
59289 811261 810830 801592 785986 767385 748155 729705 713197 699255 687623 678017 670962 667158 666348
59276 666348 667555 670233 674658 681330 690372 701482 714143 727849 742129 756273 769239 780263
59264 780263 789462 797407 804136 809057 811638 811674 809019 803839 797056 789742 781999 773224 763493 753820 744872
59249 744872 736343 727932 720085 713351 707712 703023 699505 697376 696519 696837 698443 701185 704549 708354 712993
59234G12993N707O346O430O311N959M978L431J851N54n62j627k688l779m720n211
59219G35973n395n781o189n632l879k266k054k725l001k800k964l462l333k326
59205F84166j362j183j469j582j472j550k012k492k350j459o61q68j675j638k22
59190F62171J478K330K426K197J481M00N4J140K710L466L565L932M457M258L352
59175F99417K722K919L655M535N322N718N798O298P657R209J0061J0327J0599
59162G84237J0756J0225Q985P405N547L457J565q3k296n537q844j0967j1932j2462
59148G80056j2628j2188j1582j1362j1244j0860j0729j1239j1441j0278q429p427
59136F50649p433p408p021o757o452n388l761k643k387k347k032j419l55J168
$$ plain form
59234 712993 718700 725046 731476 737787 743746 748724 752155 754006 754560 753998 752371 749683 745904 741184 735973
59219 735973 730578 724797 718608 712976 709097 706831 704777 702052 699051 696251 693287 689825 686492 684166
59205 684166 682804 681621 680152 678570 677098 675548 673536 671044 668694 667235 666574 665706 664031 662393 662171
59190 662171 663649 665979 668405 670602 672083 672483 672537 673677 676387 679853 683418 687350 691807 696065 699417
59175 699417 702139 705058 708713 713248 718570 724288 730086 736384 744041 753250 763311 773638 784237
59162 784237 794993 805218 814203 821608 827155 830612 832177 832094 829798 824261 815417 804450 792518 780056
59148 780056 767428 755240 743658 732296 721052 710192 699463 688224 676783 666505 658076 650649
59136 650649 643216 635808 628787 622030 615578 610190 606429 603786 601399 599052 597020 595601 595246 596414
59122E96414K402K808L253M913P271Q716Q977R404J0763J2278J3028J3111J3045
59109G06383J3096J3273J3251J2362J0451Q477P383O789N778M440L466K766J763
59096H09678O13j79r15k111l229l467l300l672m145l588k333j772k036j972j468
59081G76104j774l369n219o575p769q932r454r182q720q268p437o494o338p012
59067F79561p543p429p038o423n226l898l512m063m406m123m004m394m536m014
59053F08952l412l103k646j837j147q11n69n48j159j934j825q74k47l82m69p2
59037E87917J81r0k67J82R53J687K445L262M078N171O589P473P233P044Q529J1130
59021F53517J2708J2751J2937J4228J5454J5384J4239J2404R471N565K047j52
$$ plain form
59122 596414 598816 601624 604877 609790 617061 625777 634754 644158 654921 667199 680227 693338 706383
59109 706383 719479 732752 746003 758365 768816 777293 784676 791465 797243 801683 805149 807915 809678
59096 809678 810291 810112 809197 807086 803857 800390 797090 793418 789273 785685 783352 781580 779544 777572 776104
59081 776104 774330 770961 765742 759167 751398 742466 733012 723830 715110 706842 699405 692911 686573 679561
59067 679561 672018 664589 657551 651128 645902 642004 638492 634429 630023 625900 621896 617502 612966 608952
59053 608952 605540 602437 599791 597954 596807 595996 595427 594879 593720 591786 589961 589087 588840 588458 587989 587917
59037 587917 588098 588008 587741 587923 588876 590563 593008 596270 600348 605519 612108 619581 626814 633858 642387 653517
59021 653517 666225 678976 691913 706141 721595 736979 751218 763622 773093 778658 780705 780553
59009G80553j602k953l768l547k769k007j019N29K330L959N299O136O207N864
58995G93212N624N075L446J265l5k34n44j549k608l468m696o162o859o663o536
58980G69268o603n809m003k420j539l80J413K844L652N051P396R180R525R695
58966G97270J0820J1976J2002J1531J1638J1926J1523J0715J0064R002O713L490
58954I18670P4l374o696r283j1156j3288j5846j7494j7441j6734j6402j5825j4244
58941G60961j2409j1180r895p717n446m255l685k624j420j266k059k553k282j938
58927F92232k057k510l047l497l643l558l602l678l222k327j892k156k276j870
58913F52897j634j712r97Q86K526K803K700L580M999N820O395P904J0286J2428
$$ plain form
59009 780553 778951 775998 772230 768683 765914 763907 762888 763417 765747 769706 775005 781141 787348 793212
58995 793212 798836 803911 807357 808622 808587 808353 807809 806260 803652 800184 795488 789326 782467 775804 769268
58980 769268 762665 756856 752853 750433 748894 748514 749927 752771 756423 761474 768870 778050 787575 797270
58966 797270 808090 820066 832068 843599 855237 867163 878686 889401 899465 908467 915180 918670
58954 918670 918744 915370 908674 899391 888235 874947 859101 841607 824166 807432 791030 775205 760961
58941 760961 748552 737372 727477 719760 714314 710059 706374 703750 702330 701064 699005 696452 694170 692232
58927 692232 690175 687665 684618 681121 677478 673920 670318 666640 663418 661091 659199 657043 654767 652897
58913 652897 651263 649551 648554 649440 651966 654769 657469 661049 666048 671868 678263 686167 696453 708881
58899G08881J3918J5141J6095J6378J6048J5535J5069J4823J5016J5287J4933
58888H77124J4439J5482J8453K1267K1842K0645J9451J8623J7132J4400J0653
58877A069511O106J144l174o176q622j1649j5095j7897j9558k0233j9948j8757
58865I35652j7174j5574j3722j1590r932r264r074q790q749r380j0303j0932j1208
58852G89960j1048j0112q733p985q033p697o381n209n245o015o677p347q120q202
58838F83156p324o682p209q027p890o964n952m781l442k824l219l341k213q05
58824F12483l28k06O05J642K019K291L332M424M368L603L395L643L385K689K314
58809F49659K064J229J26l60l28n15r30j133j270j650j992k153k724l794m255
$$ plain form
58899 708881 722799 737940 754035 770413 786461 801996 817065 831888 846904 862191 877124
58888 877124 891563 907045 925498 946765 968607 989252 1008703 1027326 1044458 1058858 1069511
58877 1069511 1075617 1076761 1073587 1067411 1058789 1047140 1032045 1014148 994590 974357 954409 935652
58865 935652 918478 902904 889182 877592 867660 858396 849322 840532 831783 822403 812100 801168 789960
58852 789960 778912 768800 760067 752082 744049 736352 729971 724762 719517 713502 706825 699478 691358 683156
58838 683156 675832 669150 661941 653914 646024 639060 633108 628327 624885 622061 618842 615501 613288 612483
58824 612483 612155 611949 612554 614196 616215 618506 621838 626262 630630 634233 637628 641271 644656 647345 649659
58809 649659 651723 652952 653078 652718 652390 651875 650945 649812 648542 646892 644900 642747 640023 636229 631974
58794F31974l572k982l577m521m610m212m019l381j705j25K81N96K252M305M887
58779F11591M298M247M880N035M748M983N274M084J412j096k575l578m542n372
58765F33389o267p360p860p108n899n286m828l648k261j525q23P40K253K374J842
58750E87733K280L268L054J638O44N86O79J050K629N031O850P927R192J0420J0383
58735F53364R147Q127P933Q021Q147Q322P835O326N216N839O884O107L867K332
58721G47467J795P25r16j502q00k12J57J646L914M778L690K619K749L007K562
58706G71679K076J523n04m173p357q589r008j0306j2532j4918j7106j8601j8604
58693F53580j7342j6089j5197j3695j1356r422q599p965o679n247m364l893l649
$$ plain form
58794 631974 628402 625420 621843 617322 612712 608500 604481 601100 599395 599270 599551 600147 602399 606704 611591
58779 611591 615889 620136 625016 630051 634799 639782 645056 649140 650552 649456 646881 643303 638761 633389
58765 633389 627122 619762 611902 604794 598895 593609 588781 585133 582872 581347 580524 581264 583517 585891 587733
58750 587733 590013 593281 596335 597973 598617 599203 599882 600932 603561 608592 615442 623369 632561 642981 653364
58735 653364 662511 670638 678571 686592 694739 703061 710896 717222 722438 728277 735161 741268 745135 747467
58721 747467 749262 749987 749071 747569 746769 746557 746714 748360 752274 757052 760742 763361 766110 769117 771679
58706 771679 773755 775278 774774 770601 763244 754655 745647 735341 722809 707891 690785 672184 653580
58693 653580 636238 620149 604952 591257 579901 570479 561880 553915 547236 541989 537625 533732 530083
58680E30083l884m424m497l895l194k582j646m18O05J446K432L153L106L080M322
58665E23687O585Q634J0337J2384J4257J4501J2930J0642P964M452O87k043l810
58652F21207n709p557q133p609p434p834p715p025o800o815n755l857k774k584
58638E33606j653J90J062L47j52Q05K120K555K450K344J956J361J288J574J197
58623E51050K61jN18O52L30P87K150L169L768N242P563Q986Q926Q614Q325O768
58607F17108L947J894J484J264K90l97k65n24j659k287j789j647k837m128m309
58592F06145l871l279j855L65J892K228K913M877O861P798Q630J0436J2592J4084
58578F69816J4830J4750J3393J1411J0397J0377R626P763O706P585R179J0431
$$ plain form
58680 530083 526199 521775 517278 513383 510189 507607 505961 505543 506148 507594 510026 513179 516285 519365 523687
58665 523687 530272 538906 549243 561627 575884 590385 603315 613957 621921 626373 627060 625017 621207
58652 621207 615498 607941 599808 592199 584765 576931 569216 562191 555391 548576 542821 538964 536190 533606
58638 533606 531953 532143 533205 533552 533400 534205 536325 538880 541330 543674 545630 546991 548279 549853 551050
58623 551050 551311 551310 551828 552480 552810 553597 555747 558916 562684 567926 575489 584475 593401 602015 610340 617108
58607 617108 621055 622949 624433 625697 625987 625590 625325 624801 623142 620855 619066 617419 614582 610454 606145
58592 606145 602274 598995 597140 597505 599397 601625 604538 609415 616276 624074 632704 643140 655732 669816
58578 669816 684646 699396 712789 724200 734597 744974 754600 762363 769069 776654 785833 796264
58566G96264J2111J4737J7295J9329K2008K5822K9351L1545L2996L3810L2622
58555A067890K8947K4173J9051J2737N508k08l071m587o216p267p192p314q473
58542A113978r477r750j1040j4596j8888k2125k4813k7848l0204l0574k9442k7686
58530H57535k4957k1118j7442j4701j1968q790o485n755n094l268j296m49k80
58517G35932j38m94j287j267l97n53k324l685l403l066l906m406l247j914k010
58502G03835k400j498j80Qm65n11n55j137j252k39O80O28Q00K026K936K637K858
58485G08171N156Q133R801J0669J2237J4388J6505J9062K1981K3453K2612K1232
58473H93400K0606J9013J4624Q620L000k464q435j3351j5309j5008j4271j3279
$$ plain form
58566 796264 808375 823112 840407 859736 881744 907566 936917 968462 1001458 1035268 1067890
58555 1067890 1096837 1121010 1140061 1152798 1158306 1158098 1155027 1150440 1144224 1136957 1129765 1122451 1113978
58542 1113978 1104501 1094751 1083711 1069115 1050227 1028102 1003289 975441 945237 914663 885221 857535
58530 857535 832578 811460 794018 779317 767349 758559 752074 746319 741225 737957 736661 736212 735932
58517 735932 735794 735300 734013 732746 732349 731796 729472 725787 722384 719318 715412 711006 707759 705845 703835
58502 703835 701435 699937 699757 699765 699300 698789 698234 697097 695845 695606 696286 696914 697714 699740 702676 705313 708171
58485 708171 713327 721460 731261 741930 754167 768555 785060 804122 826103 849556 872168 893400
58473 893400 914006 933019 947643 956263 959263 956799 948364 935013 919704 904696 890425 877146
58461H77146j1491r484p696n073j113K602M859O816R655J2381J3875J4734J5120
58448I22331J3314Q672L424o67m774r878j4009j5335j5199j5351j4810j2268r070
58435H36380o851m755j882J87K82M34K646N343O283O508Q113J0374J1502J2030
58421H86594J3197J4009J2991J0871Q661N340L01m339o833q657j1316j3122j2328
58408H95369j0695j0536j0933j0257r626j0250j0210p629m394k976k270l59J462
58395H06696J437J308L279N690N892M867M793M680K768P41R98K150J666O80J664
58380H49309L724M573M855O052O595M622K158J948K639J679M52J639M047M995
58366H99287N385P429R882J0561J0983J3351J5622J5047J3808J5432J8104J7524
$$ plain form
58461 877146 865655 856171 848475 843402 842289 844891 849750 856566 866221 878602 892477 907211 922331
58448 922331 935645 944317 947741 947074 942300 932422 918413 903078 887879 872528 857718 845450 836380
58435 836380 829529 824774 822892 823079 823361 823795 826441 831784 838067 844575 852688 863062 874564 886594
58421 886594 899791 913800 926791 937662 946323 951663 951964 947625 940792 932135 920819 907697 895369
58408 895369 884674 874138 863205 852948 843322 833072 822862 815233 810839 807863 805593 805234 806696
58395 806696 808133 809441 812720 818410 824302 829169 833962 838642 841410 842151 843149 845299 846965 847645 849309
58380 849309 853033 857606 862461 868513 875108 879730 881888 883836 886475 888154 888606 890245 894292 899287
58366 899287 904672 912101 921983 932544 943527 956878 972500 987547 1001355 1016787 1034891 1052415
58354A052415J4105J1358R364N962K347J288J553J71j571l85K589L659L127L984
58340A109966N830O236O280Q663J2036J3315J3738J6383J9677J9825J7792J7302
58328A267043J7894J6507J4041J3368J2860Q965L462J025J302M66j176n76J087
58315A356268M24q85J316N427O434M967N828Q942J0038R270J0674J3898J4835
58302A447436J3773J4777J7592J8274J7049J7505J8976J7909J5661J6515J9206
58291A634673J9071J7179J8401K1766K2159K0286K1308K4692K5290K3531K4532
58280A872888K7898K8620K7325K9213L3655L5313L4831L7534M2384M3424M1531
58269B254616M3178M8092M9990M9085N1613N7187N9224N7991O0393O6483O9152
$$ plain form
58354 1052415 1066520 1077878 1087242 1093204 1095551 1096839 1098392 1098563 1096992 1096607 1099196 1102855 1105982 1109966
58340 1109966 1115796 1122032 1128312 1136975 1149011 1162326 1176064 1192447 1212124 1231949 1249741 1267043
58328 1267043 1284937 1301444 1315485 1328853 1341713 1350678 1354140 1355165 1356467 1356933 1355757 1355181 1356268
58315 1356268 1356692 1355807 1357123 1362550 1368984 1373951 1379779 1388721 1398759 1408029 1418703 1432601 1447436
58302 1447436 1461209 1475986 1493578 1511852 1528901 1546406 1565382 1583291 1598952 1615467 1634673
58291 1634673 1653744 1670923 1689324 1711090 1733249 1753535 1774843 1799535 1824825 1848356 1872888
58280 1872888 1900786 1929406 1956731 1985944 2019599 2054912 2089743 2127277 2169661 2213085 2254616
58269 2254616 2297794 2345886 2395876 2444961 2496574 2553761 2612985 2670976 2731369 2797852 2867004
58258B867004O7649O8243P1009O9503O4280O2929O5773O5492O1864O2639O8664
58247C595049P2693P4057P9657Q9217R4890R6700J02837J13484J20477J23994
58237D563055J32717J46260J55184J59693J69963J86349J98444K05630K18620
58228F135915K38434K54554K66378K85110L11664L34907L54562L82792M20175
58219H984491M54541M86556N30689N87524O42430O95426P63422Q48901R37354
58210A4931334J030430J148736J296513J458649J638760J863062K140780K461967
58202B7970231K842156L325766L938548M685598N603050O753113Q153034R767470
58194G3038966J1585735J3645535J5977131J8612867K1674569K5358782K9791383
$$ plain form
58258 2867004 2934653 3002896 3073905 3143408 3207688 3270617 3336390 3401882 3463746 3526385 3595049
58247 3595049 3667742 3741799 3821456 3910673 4005563 4102263 4205100 4318584 4439061 4563055
58237 4563055 4695772 4842032 4997216 5156909 5326872 5513221 5711665 5917295 6135915
58228 6135915 6374349 6628903 6895281 7180391 7492055 7826962 8181524 8564316 8984491
58219 8984491 9439032 9925588 10456277 11043801 11686231 12381657 13145079 13993980 14931334
58210 14931334 15961764 17110500 18407013 19865662 21504422 23367484 25508264 27970231
58202 27970231 30812387 34138153 38076701 42762299 48365349 55118462 63271496 73038966
58194 73038966 84624701 98270236 114247367 132860234 154534803 179893585 209684968
58187B09684968L4908318M0281632M4658341M5608391M0292041K7486877R217424
58180D52137992r890519k5237167l4541413l8113659l7655677l5084523l1952552
58173B39662482k9148066k6782378k4492394k1990429j9323477j6695949j4244203
58166H6985586j2031630j0112078q500282p145582n994793n037890m263676l625362
58158C0274293l082751k633150k273248j971988j705989j483711j311200j167840
58150A4644416j036514r25719q42255p71254p01158o41001n96161n52736n01832
58141H075786m55053m20969l89102l51245l16664k92472k69884k43318k23192
58132E113887k16443k12885k03315j93730j89614j83333j69113j54682j46540
$$ plain form
58187 209684968 244593286 284874918 329533259 375141650 415433691 442920568 452137992
58180 452137992 442247473 417010306 382468893 344355234 306699557 271615034 239662482
58173 239662482 210514416 183732038 159239644 137249215 117925738 101229789 86985586
58166 86985586 74953956 64841878 56341596 49196014 43201221 38163331 33899655 30274293
58158 30274293 27191542 24558392 22285144 20313156 18607167 17123456 15812256 14644416
58150 14644416 13607902 12682183 11839928 11068674 10367516 9726515 9130354 8577618 8075786
58141 8075786 7620733 7199764 6810662 6459417 6142753 5850281 5580397 5337079 5113887
58132 5113887 4897444 4684559 4481244 4287514 4097900 3914567 3745454 3590772 3444232
58123C444232j38569j25915j15575j12610j09774j01072r2514q9664q7231q0397
58113B390911p4212p2668p0306o3402n7974n8221n8235n3336m8658m8558m8323
58102A737018m4263m1398m3309m4564m0934l7210l7431l7138l2676k8589k8497
58091A321009k7943k3496j9852k0749k1766j9110j6796j8127j8855j5752j3463
58080A105100j5829j8637j7925j7310k0151k2482k0793j9020k0721k1912j8789
58069H91531j5261j5631j6808j4872j2626j3531j4609j2432r948j0522j1252q925
58057G35114o654p905r695q427o898q846j1823j1997j0924j1276j1008q057n745
58044F15859p154r002p290m320l951m682l639k797m879p364o849n243n723o662
$$ plain form
58123 3444232 3305663 3179748 3064173 2951563 2841789 2740717 2648203 2558539 2471308 2390911
58113 2390911 2316699 2244031 2173725 2110323 2052349 1994128 1935893 1882557 1833899 1785341 1737018
58102 1737018 1692755 1651357 1608048 1563484 1522550 1485340 1447909 1410771 1378095 1349506 1321009
58091 1321009 1293066 1269570 1249718 1228969 1207203 1188093 1171297 1153170 1134315 1118563 1105100
58080 1105100 1089271 1070634 1052709 1035399 1015248 992766 971973 952953 932232 910320 891531
58069 891531 876270 860639 843831 828959 816333 802802 788193 775761 765813 755291 744039 735114
58057 735114 728460 720555 710860 702433 695535 686689 674866 662869 651945 640669 629661 621604 615859
58044 615859 608705 599703 592413 588093 584142 579460 575821 573024 568145 560781 553932 548689 542966 536304
58030E36304n532m735p325j0738j0883r027q732r309q148o334o280o731n448l952
58016D33130m503n387m170k492k786l480k313j057k049l342k333p80j276k098
58002C95064p47Q32j64j880j313r4j251l251k891j346j640k616j231J465K217
57987C81154J418J646K298J071j012j321o68j593l198k856j440j809l418l439
57973C66833k055j830k809k864j935j635j620n14O49j6j447j342l29n23j343q41
57957C46379K29j86j323j004M3n45k338k970k390k342k567j462L68R94P03J172
57941C32761K150K417K835M924P603Q858R284J0531J1789J1506J0948J2107J3522
57928D41235J2331R194O984N764L334j73k589l892n905q332r115q343p995q241
$$ plain form
58030 536304 530772 526037 518712 507974 497091 488064 479332 470023 461875 455541 449261 442530 437082 433130
58016 433130 428627 423240 419070 416578 413792 410312 407999 406942 404893 401551 399218 398438 397162 395064
58002 395064 394317 395149 394985 393105 391792 391698 390447 387196 384305 382959 381319 378703 377472 378937 381154
57987 381154 382572 384218 386516 387587 386575 385254 384586 382993 379795 376939 375499 373690 370272 366833
57973 366833 364778 362948 360139 357275 355340 353705 352085 351571 352220 352204 350757 349415 349086 348563 347220 346379
57957 346379 346608 346422 345099 344095 344138 343593 341255 338285 335895 333553 330986 329524 329892 330886 331589 332761
57941 332761 334911 337328 340163 345087 352690 361548 370832 381363 393152 404658 415606 427713 441235
57928 441235 453566 462760 469744 475508 478842 478669 476080 472188 466283 457951 448836 440493 432498 424257
57914D24257p652o617o791p624o993n022l751l463k708j495j119j321r46p01j983
57899C66071l749l935l207l690m855m460k810k185k550j821n7O53K55Q03K376
57884C36839K808J721J169J867K239J569Q66L14r91k567k921k479l091m513m514
57869C28316k625p29K47J165K164K283J876K427L754M188L609L479L957L841L297
57854C61249L705M730M653L555L211L708L229J385k15r69j962l428m370m827n814
57839C67840o880o590n436n365o393o621n614m867m760m133k973k476k340j019
57825C02373J125J992J295Q65J232J088L14L23J038P70m17o35K10J23j041r63
57809C09692Q87J905M56j906l631n386p649q961q304o723n241l468j439m22p32
$$ plain form
57914 424257 416605 409988 403197 395573 388580 383558 379807 376344 373636 372141 371022 369701 368755 368054 366071
57899 366071 362322 358387 355180 351490 346635 342175 339365 337180 334630 332809 332752 333405 333660 334463 336839
57884 336839 339647 341368 342537 344404 346643 348212 349078 349392 348401 345834 342913 340434 337343 332830 328316
57869 328316 325691 324962 325209 326374 328538 330821 332697 335124 338878 343066 346675 350154 354111 357952 361249
57854 361249 364954 369684 374337 377892 381103 384811 388040 389425 389210 388241 386279 382851 378481 373654 367840
57839 367840 360960 354370 348934 343569 337176 330555 324941 320074 315314 311181 308208 305732 303392 302373
57825 302373 303498 305490 306785 307650 308882 309970 310284 310607 311645 312415 311998 311363 311573 311696 310655 309692
57809 309692 310579 312484 312940 311034 307403 302017 294368 285407 277103 270380 265139 261671 260232 259810 259078
57794B59078r80m26Q0L10J252K793L433L126L698N437O182M951L689L987M784
57779C01394M936N428P181Q834Q624O788M642K849J779J767J954O80k042m261
57765C50553n062n673o820p369o751o340p034p665p179o387o179n987n390n239
57751B61478n738n383l321r80J60P16J869L308M110M241L921K994J945J983L050
57736B74353L434K398J392J523J724Q14m10o59k31j03l62p51j460k183j894o54
57720B76931j52j301k805l309l437m268n389n844n721n427m685l512l004l789
57706B24288m760m622l640k818k406k224k353k548k040p88R2n4n37o83p91j039
57690A93077r18m41m60j019r88p5M84K00L79J788L028K754K018K883N768R555
$$ plain form
57794 259078 258098 257672 257752 258062 259314 262107 265540 268666 272364 277801 283983 288934 292623 296610 301394
57779 301394 306330 311758 318939 327773 336397 343185 347827 350676 352455 354222 356176 356856 354814 350553
57765 350553 345491 339818 332998 325629 318878 312538 305504 297839 290660 284273 278094 272107 266717 261478
57751 261478 255740 250357 247036 246056 246216 246932 248801 252109 256219 260460 264381 267375 269320 271303 274353
57736 274353 277787 280185 281577 283100 284824 285638 285228 284569 284338 284235 283873 283122 281662 279479 277585 276931
57720 276931 276779 275478 272673 269364 265927 261659 256270 250426 244705 239278 234593 231081 228077 224288
57706 224288 219528 214906 211266 208448 206042 203818 201465 198917 196877 196089 196181 196127 195590 194907 194116 193077
57690 193077 192159 191718 191258 190239 189251 189176 189660 189860 190239 192027 195055 197809 199827 202710 208478 218033
57674B18033J3284J6542J9155K1722K5590L1352L8109M4960N2271O0682O9361
57663F11061P5422P4316O1483L6035L416k7327m9825o3022o8406o7434o2180n5457
57651D68082m8618m1160l3393k7247k3345j9799j5419j1699r963q861o706m220
57639B17652k842k164j175m71j028k041k071j249n96k67n0l95j312j588o46J78
57623A99935k99j173j254j164j868k646k500k196k821l608l227k187j807j938
57609A71247j663j251j422j599r07j7k2m10j72Pj132k883l341k261j128p49o57
57592A51640n86p71j062j227j713k798l608l369k803k780k589j258L14N44k84
57577A27650o11k20k00p81j156j269j872k943l629l665l429k937k151j790k323
$$ plain form
57674 218033 231317 247859 267014 288736 314326 345678 383787 428747 481018 541700 611061
57663 611061 686483 760799 822282 858317 861733 834406 784581 721559 653153 585719 523539 468082
57651 468082 419464 378304 344911 317664 294319 274520 259101 247402 237439 228578 221872 217652
57639 217652 214810 212646 211471 211000 209972 207931 205860 204611 204015 203748 203698 203303 201991 200403 199757 199935
57623 199935 199636 198463 197209 196045 194177 191531 189031 186835 184014 180406 177179 174992 173185 171247
57609 171247 169584 168333 166911 165312 164405 164388 164366 163956 163784 163791 162659 159776 156435 154174 153046 152297 151640
57592 151640 151054 150283 149221 147994 146281 143483 139875 136506 133703 130923 128334 127076 127390 127934 127650
57577 127650 127039 126819 126619 125838 124682 123413 121541 118598 114969 111304 107875 104938 102787 100997 98674
57562I8674k718j809l56Ko92r60l84R3R4K64P49Q90N58M38R00J721K783L911M302
57543A08460L357J697K62r98k358k967j936j32Q14Q37J137J883K017J193K61k48
57527A13279o14r21r01p13o98n22K42J118J491J843K858L807L433K077J276J479
57511A28534J740J538J372J584J910K157K207J583K02q82p43q6j78q89j245j308
57495A37496j853k668k826k361k041j928j681j813k886l978l797k793k353k406
57481A02112j878r85q19j002j35J470J944Q28m19j069j855k827k894k121k096
57466H8254l281m154l811l302l374l064j652k48o5o80j097j228j199n41P83J806
57450F3147J907J652J523J051P8m61m9L68m5n87k95M31O76O16R68J542J573J067
$$ plain form
57562 98674 95956 94147 93791 93793 93101 92141 91757 91850 91944 92208 92957 93847 94405 94843 95743 97464 100247 104158 108460
57543 108460 111817 113514 113776 112778 110420 107453 105517 105385 106199 107036 108173 110056 112073 113266 113527 113279
57527 113279 112665 111744 110843 110130 109432 108910 109152 110270 111761 113604 116462 120269 123702 125779 127055 128534
57511 128534 130274 131812 133184 134768 136678 138835 141042 142625 142827 141945 141202 141116 140938 140049 138804 137496
57495 137496 135643 132975 130149 127788 125747 123819 122138 120325 117439 113461 109664 106871 104518 102112
57481 102112 100234 99249 98430 97428 97293 98763 100707 101535 101116 100047 98192 95365 92471 90350 88254
57466 88254 84973 80819 77008 73706 70332 67268 65616 65368 65303 64623 63526 62298 61099 60558 61341 63147
57450 63147 65054 66706 68229 69280 69358 68897 68848 69216 69171 68584 68289 68720 69396 70012 70980 72522 74095 75162
57432G5162O66N14K50o4R5Q44J568J620R41O2l72j82K05L03R1k28o84j261j490
57413G8040r80j17M28O23Q18R15P22O93J342K114J946P67o13j848l078l825l310
57396G4637j937j069j079r68j47P12R73R28R39P99M55M42J091K103L167M191M742
57379H9979M215K839J605J002O29J84j35m01j097k236l175l519l466l186k673
57364H0565k190j958j545m93N56N45k96o96k39K70L68M74O84M27l68q85o22J20
57346G4717J046K092K780K561J905J763J901J183l98j468j365q82o25j98M22K60
57330H5694j045k366k577j889j143p31p89j350j867j561o23m4o1mJ74k61j136
57313F8421j123J55J296J127K02m26n83m38R4N86M9j466k409j766m20L74P05J234
$$ plain form
57432 75162 75828 76342 76592 76528 76623 77467 79035 80655 81596 81658 81286 81104 81309 81612 81703 81475 80791 79530 78040
57413 78040 77060 76943 77371 77994 78812 79727 80449 81142 82484 84598 86544 87311 86698 84850 81772 77947 74637
57396 74637 72700 71631 70552 69584 69437 70149 71122 72050 72989 73788 74243 74685 75776 77879 81046 85237 89979
57379 89979 94194 97033 98638 99640 100269 100453 100318 99917 98820 96584 93409 89890 86424 83238 80565
57364 80565 78375 76417 74872 74379 74935 75480 75184 74488 74249 74519 74887 75361 76045 76472 76104 75219 74597 74717
57346 74717 75763 77855 80635 83196 85101 86864 88765 89948 89550 88082 86717 85835 85210 85012 85434 85694
57330 85694 84649 82283 79706 77817 76674 75943 75154 73804 71937 70376 69753 69709 69648 69644 69818 69557 68421
57313 68421 67298 67453 68749 69876 70078 69652 69069 68631 68725 69311 69360 67894 65485 63719 63299 63673 64378 65612
57295F5612J732J531P21m3l98l34N0L50R3n38q68p95q09r48p93n59q62j347j020
57276F0775j55j92j425k446k438k236k448k363j606j083j287j215r8J266K005
57261D5054K477L038L115K668K928M339N309M565L338L527M897N766N500M659
57247A01180L602K553K237K951L650L342K677K871L824M595M975N185M916M023
57233A52581L509M288N569N887N216M710M839N138N374N729O071O203O351O636
57219B28101O591O169O344P600Q734Q447P340O889P203P306P075P253P898Q332
57205C31282Q455Q724R000Q740Q160Q027Q434Q895R396J0269J1265J1893J2457
57192D54997J3587J4956J5586J5343J5005J5008J5089J5156J5456J5908J6121
$$ plain form
57295 65612 67344 68875 69596 69553 69155 68821 68871 69221 69314 68776 67908 67113 66304 65356 64563 64004 63142 61795 60775
57276 60775 60620 60428 59003 56557 54119 51883 49435 47072 45466 44383 43096 41881 41783 43049 45054
57261 45054 47531 50569 53684 56352 59280 63619 68928 73493 76831 80358 85255 91021 96521 101180
57247 101180 104782 107335 109572 112523 116173 119515 122192 125063 128887 133482 138457 143642 148558 152581
57233 152581 156090 160378 165947 171834 177050 181760 186599 191737 197111 202840 208911 215114 221465 228101
57219 228101 234692 240861 247205 254805 263539 271986 279326 286215 293418 300724 307799 315052 322950 331282
57205 331282 339737 348461 357461 366201 374361 382388 390822 399717 409113 419382 430647 442540 454997
57192 454997 468584 483540 499126 514469 529474 544482 559571 574727 590183 606091 622212
57181F22212J6087J6104J6141J5933J5491J4922J4112J3278J3297J4662J6473
57170G88712J7412J7413J7542J8435J9716K0712K1049K0739K0215J9983J9732
57159A001660J8419J5880J3611J3061J3733J3963J3195J2394J2502J3419J4492
57148A156329J5234J5624J6067J6886J7598J7183J5424J3309J1779J0778R962
57137A316173R399R034Q290O991N846N421N438N663O483P963R418J0633J2439
57124A419191J5140J7549J8593J8846J9411K0342K1296K2729K5111K7754K9765
57113A655727L1588L4508L9257M5966N4719O5161P6209Q7155R8581J11614J27146
57102B427631J46379J71200K03352K44159K95491L59917M39469N35381O48941
$$ plain form
57181 622212 638299 654403 670544 686477 701968 716890 731002 744280 757577 772239 788712
57170 788712 806124 823537 841079 859514 879230 899942 920991 941730 961945 981928 1001660
57159 1001660 1020079 1035959 1049570 1062631 1076364 1090327 1103522 1115916 1128418 1141837 1156329
57148 1156329 1171563 1187187 1203254 1220140 1237738 1254921 1270345 1283654 1295433 1306211 1316173
57137 1316173 1325572 1334606 1342896 1349887 1355733 1361154 1366592 1372255 1378738 1386701 1396119 1406752 1419191
57124 1419191 1434331 1451880 1470473 1489319 1508730 1529072 1550368 1573097 1598208 1625962 1655727
57113 1655727 1687315 1721823 1761080 1807046 1861765 1926926 2003135 2090290 2188871 2300485 2427631
57102 2427631 2574010 2745210 2948562 3192721 3488212 3848129 4287598 4822979 5471920
57093E471920P80580R27544J084037J244025J402218J552853J690326J811046
57085A5964549J911586J985096K022439K014962J950774J812627J594237J324115
57077C0580385J058099Q31252O19693L63254K7492l64686p59487j115479j417497
57068B9823026j663843j854185j987495k062162k076462k032427j939038j809416
57060A4397998j656013j489886j321604j159579j008439q70841p49229o44264
57052E498143n53826m75704m09680l55338l09948k70526k36310k07339j82374
57043B497098j60071j40674j24533j10443r7240q5669p6921p0460o4920n9865
57033A506302n5235n0264m4447l8404l2561k6273j9216j2180n257L089J4034K7188
$$ plain form
57093 5471920 6252500 7180044 8264081 9508106 10910324 12463177 14153503 15964549
57085 15964549 17876135 19861231 21883670 23898632 25849406 27662033 29256270 30580385
57077 30580385 31638484 32469736 33089429 33452683 33480175 33115489 32356002 31240523 29823026
57068 29823026 28159183 26304998 24317503 22255341 20178879 18146452 16207414 14397998
57060 14397998 12741985 11252099 9930495 8770916 7762477 6891636 6142407 5498143
57052 5498143 4944317 4468613 4058933 3703595 3393647 3123121 2886811 2679472 2497098
57043 2497098 2337027 2196353 2071820 1961377 1864137 1778468 1701547 1631087 1566167 1506302
57033 1506302 1451067 1400803 1356356 1317952 1285391 1259118 1239902 1227722 1222465 1225554 1239588 1266776
57021A266776M1945N7039O6993O2482L8442J026l6358o3537p8465q3778q2546
57010A190019p7532p1215o4847n8438n2079m6257m1027l6112l1713k8218k5314
56999F57267k2440j9839j8131j7068j5832j4280j2957j2039j1069r560p292m311
56987D92449j166J402L404N645Q384J0701J1601J0763P839K360m856j1447j5699
56974E21380j8002j9329j9469j7898j5258j2676j0392q190o309m851l119o53J913
56961C87147M037O452J0008J4236J8136K1439K3838K3796J9663J1585J391q850
56949E32878j7314k2477k4084k3488k2125k0139j7238j3867j0512o849k736R04
56937C52953L395N551Q461J1901J5271J9071K4006K9260L2962L3570K9758K0241
$$ plain form
57021 1266776 1308721 1365760 1432753 1495235 1533677 1534703 1498345 1434808 1356343 1272565 1190019
57010 1190019 1112487 1041272 976425 917987 865908 819651 778624 742512 710799 682581 657267
56999 657267 634827 614988 596857 579789 563957 549677 536720 524681 513612 504052 496760 492449
56987 492449 491283 492685 496089 501734 510118 520819 532420 543183 551022 553382 548526 537079 521380
56974 521380 503378 484049 464580 446682 431424 418748 408356 400166 393857 389006 385887 385234 387147
56961 387147 391184 397636 407644 421880 440016 461455 485293 509089 528752 540337 541728 532878
56949 532878 515564 493087 469003 445515 423390 403251 386013 372146 361634 354785 352049 352953
56937 352953 356348 361899 370360 382261 397532 416603 440609 469869 502831 536401 566159 586400
56925E86400N646j0230k2850l0471l4092l4849l3175k9926k6360k2949j9505j6285
56913C11354j3666j1264q646o484n554n149m012k430j710j894j741q79k06k8N46
56898B48237J981L481M237M469M817N533O568P789Q992J0234J2061J4818J7956
56885C51173K0544K2041K1950J9342J3706N939k249r442j4581j6869j6625j5418
56873C79511j4279j2515r244n091j118K918P692J2570J6480J9877K4124K9453
56861D50378L5231M1693M9361N6782O0502N7349M5856K6438K312k0437l6223m3965
56849G25277m6335m5443m1309l4313k6315j8592j0702k288N793J3045K0314K8306
56837E67438L6601M5053N4784O6618P9470R0792R7272R4532P8195M7564Q147l0786
$$ plain form
56925 586400 592046 581816 558966 528495 494403 459554 426379 396453 370093 347144 327639 311354
56913 311354 297688 286424 277778 271294 265740 260591 256579 254149 252439 250545 248804 247925 247719 247691 248237
56898 248237 250218 253699 257936 262405 267222 272755 279323 287112 296104 306338 318399 333217 351173
56885 351173 371717 393758 415708 435050 448756 454695 452446 443004 428423 411554 394929 379511
56873 379511 365232 352717 343473 338382 337264 340182 347874 360444 376924 396801 420925 450378
56861 450378 485609 527302 576663 633445 693947 751296 797152 823590 825902 805465 769242 725277
56849 725277 678942 633499 592190 557877 531562 512970 502268 499980 505773 518818 539132 567438
56837 567438 604039 649092 703876 770494 849964 940756 1038028 1132560 1210755 1258319 1266466 1235680
56825A235680o1390q0277q7949q6978q0579p1550o1512n0966l9992k8941j8549
56814E66997r350j004P392J6158K4718L2839M1445N1364O1512O8771O9266N9563
56802I89671L8311Q516k2462m7113o2444o9902p1656o8671o1996n3522m4728l5986
56790D98018k7585k0203j3941q061k136L458Q492J3321J8156K2869K7547L1984
56778E51919L4369L1743K2523Q057q417k3453l4378m0147m1838m1441l9758l6369
56766C82810l1582k7004k3685k0984j7889j4526j1683r624q047o631n251m046
56754B01858l417l430l343k510j520j454k124k322j769j464j910k377k271j922
56740A70025j503n50Q28J554J122M82N56R05P25K34J53M81O70N60L35L3l01l36
$$ plain form
56825 1235680 1174290 1094013 1006064 919086 838507 766957 705445 654479 614487 585546 566997
56814 566997 557647 556643 564035 580193 604911 637750 679195 730559 792071 860842 930108 989671
56802 989671 1027982 1036498 1014036 966923 904479 834577 762921 694250 632254 578732 534004 498018
56790 498018 470433 450230 436289 428228 426092 429550 438042 451363 469519 492388 519935 551919
56778 551919 586288 618031 640554 648611 640194 616741 582363 542216 500378 458937 419179 382810
56766 382810 351228 324224 300539 279555 261666 247140 235457 225833 217786 211155 205904 201858
56754 201858 198441 195011 191668 189158 187638 186184 184060 181738 179969 178505 176595 174218 171947 170025
56740 170025 168522 167972 168800 170354 171476 171958 172514 173419 174144 174378 174531 175012 175682 176242 176577 176610 176309 175973
56722A75973J45Q40J302J422J318J170J278J770K196J961J277R66J219J371J085
56707A95293Q60J051J195Q31L19K61N96P29L35k87n08L9R50J291O37l75r80j325
56689B00912j875k304j912q68o3K09L74N72M96J94O9J00PNM21P78M18k25j90K96
56669A97414J00q50j296n46O81J555K026K121J686J092R95J206R00J81N1O71J028
56652B09015P39P19J497K188J904J028L70j6n16j204j896k279j870o01O33R25
56636B10636O87R18J379J011ql74J39M09K04O61J989K615J590Q1n67p16j249j909
56618B17496k025j824j884k113k174k142k081j760j340j425j996k236j758r61
56604A91777JJ320K417K225R80J92M27O65K52k12m57j109j993j782k37J044J056
$$ plain form
56722 175973 176118 176958 178260 179682 181000 182170 183448 185218 187414 189375 190652 191618 192837 194208 195293
56707 195293 196153 197204 198399 199230 199549 199810 200406 201135 201470 201183 200675 200714 201664 202955 203592 203217 202237 200912
56689 200912 199037 196733 194821 193953 193890 194099 194473 195045 195541 195735 195804 195904 195911 195916 196337 197115 197533 197308 197118 197414
56669 197414 197514 196664 195368 194822 195503 197058 199084 201205 202891 203983 204978 206184 207084 207265 207316 207987 209015
56652 209015 209754 210473 211970 214158 216062 217090 217460 217444 216928 215724 213828 211549 209679 209078 209711 210636
56636 210636 211323 212241 213620 214631 214623 214249 214388 214797 215001 215662 217651 220266 221856 221937 221370 220654 219405 217496
56618 217496 215471 213647 211763 209650 207476 205334 203253 201493 200153 198728 196732 194496 192738 191777
56604 191777 191778 193098 195515 197740 198720 198912 199339 200004 200256 200044 199587 198478 196485 194703 194466 195510 196566
56587A96566P78J063J066K7j134j384j149j015n10N59J145P74O94J766K799K588
56571B04633J987K232K744K469K044K655L861M483M675N293O102O411O683P836
56557B64108R631J1289J2690J3515J2305Q245L016r10l010m178m534l718k560
56544C15889k353k837k762k028j625j836k104k273k481k322j577j155j854k841
56530B85841k904k474k709l297l115k478k707l704l923k721j065J04P12P41M9
56515B56350r91j796k401k986l024k105j012p16q69o69m57r35j444q16M53P42
56499B37324k08j104j273j323j577j520r84n24l89k10J37L69M07L35K1m47l91
56482B28643M50J151R09L30L56O76N98N47J195J810J203j67p38r5Q48J534K043
$$ plain form
56587 196566 197344 198407 199473 199500 198366 196982 195833 194818 194308 194867 196012 196786 197480 199246 202045 204633
56571 204633 206620 208852 211596 214065 216109 218764 222625 227108 231783 237076 243178 249589 256272 264108
56557 264108 273739 285028 297718 311233 323538 331783 334799 333889 330879 326701 322167 318449 315889
56544 315889 313536 310699 307937 305909 304284 302448 300344 298071 295590 293268 291691 290536 288682 285841
56530 285841 282937 280463 277754 274457 271342 268864 266157 262453 258530 255809 254744 254848 255560 256301 256350
56515 256350 255359 253563 251162 248176 245152 243047 242035 241319 240450 239781 239324 238389 236945 236129 236582 237324
56499 237324 237116 236012 234739 233416 231839 230319 229335 228811 228422 228212 228349 228718 229125 229460 229481 229034 228643
56482 228643 229093 230244 231153 231483 231839 232515 233113 233660 234855 236665 237868 237701 236963 236868 237716 239250 241293
56465B41293K061J177l8o05n23l97k17J59J37o10j039k55P41N40l23m06J04O4
56447B41863k31L86J467J527P63P86J694J868Q19q8j4L50M47N82O32k9j055j306
56429B50461p60m86o57l65M43P16K03k85n51j113j523o26J193K066J317K71K7
56412B50331K59O25J373K080J618L0j187j205p70o09n06l65n48p99l27O74J165
56395B51839J080J338J896J643N72J20Q60J683J862K091K781L092K469J645J297
56380B76268J083O47L43L76L33Q6l6j46o50j131p68J07L51j1K05J258K064K007
56362B82386J582J040J47o00k44Q76J396J094J038J473J474R45R69J804K405K308
56346C00093K132J897Q33p39j333o11R7J3j61K7J22K51J307L092M136L922L465
$$ plain form
56465 241293 243354 244531 244493 243888 243365 242968 242751 242910 243047 242437 241398 241143 241884 242424 242101 241695 241799 241863
56447 241863 241632 242018 243485 245012 245775 246561 248255 250123 250942 250854 250840 251190 251637 252219 252851 252822 251767 250461
56429 250461 249701 249215 248558 248193 248636 249352 249555 249270 248719 247606 246083 245457 246650 248716 250033 250304 250331
56412 250331 250590 251215 252588 254668 256286 256316 255129 253924 253154 252545 252039 251674 251126 250327 250000 250674 251839
56395 251839 252919 254257 256153 257796 258368 258488 259348 261031 262893 264984 267765 270857 273326 274971 276268
56380 276268 277351 277998 278341 278717 279050 279136 279100 278954 278304 277173 276405 276512 276863 276852 277057 278315 280379 282386
56362 282386 283968 285008 285155 284555 284311 285187 286583 287677 288715 290188 291662 292607 293576 295380 297785 300093
56346 300093 302225 304122 304955 304216 302883 302272 302369 302382 302221 302248 302370 302621 303928 307020 311156 315078 318543
56329C18543L334K957K294K232K858L230L166L407L778L331K405K280K598J605
56315C58018p21k324k270j725j334m13O78L20j330j927o10P34Q90J193K636M034
56299C55849M493N106O504P217O187M587L633K823J828J720K757L243K314J541
56285D09802K206L209L417L724M932N876N588N331O463Q112Q805Q706Q556Q244
56271D92971P913Q650J0461J1602J1363J1411J2834J4224J4454J4949J7187K0114
56259F48133K2242K4292K7467L1078L4114L7518M2661M9044N5478O2070O9177
56248A103274P5964Q1763Q7379R3463R9209J04095J08866J13240J14846J12354
56238B094453J07469J01820R4038Q2147O6855N0211L2755J4244m467k2312l9189
$$ plain form
56329 318543 321877 324834 327128 329360 332218 335448 338614 342021 345799 349130 351535 353815 356413 358018
56315 358018 357297 354973 352703 350978 349644 349231 349909 350229 348899 346972 346362 347096 347986 349179 351815 355849
56299 355849 360342 365448 371952 379169 385356 389943 393576 396399 398227 399947 402704 405947 408261 409802
56285 409802 412008 415217 418634 422358 427290 433166 438754 444085 450548 458660 467465 476171 484727 492971
56271 492971 500884 509534 519995 531597 542960 554371 567205 581429 595883 610832 628019 648133
56259 648133 670375 694667 722134 753212 787326 824844 867505 916549 972027 1034097 1103274
56248 1103274 1179238 1261001 1348380 1441843 1541052 1645147 1754013 1867253 1982099 2094453
56238 2094453 2201922 2303742 2397780 2479927 2546782 2596993 2629748 2643992 2639525 2617213 2578024
56227B578024n4487o6424p4679q1509q8313r3292r4661r3837r2999r1752q8783
56216A657288q4805q1105p7071p1803o6421o2246n8413n3820m9551m6856m4499
56205I60698m0855l6834l3975l1455k7709k3534k0703j8983j7045j4991j3477
56194F81137j1872r681q171q186q123o505m689m411m619l509j910j654k261k129
56180F03417j488j441j589j149q66j266r36J024K821K836K432L201L887L073K420
56165F16376L815N653N546M581N149O635P022O952Q255J0210J1064J1689J3902
56152G16849J6783J8342J9312K1559K4473K6678K9524L4919M1484M6912N2492
56141A049327O1060P2093Q3121R4405J07660J21332J31588J36961J37830J32737
$$ plain form
56227 2578024 2523537 2457113 2382434 2300925 2212612 2119320 2024659 1930822 1837823 1746071 1657288
56216 1657288 1572483 1491378 1414307 1342504 1276083 1213837 1155424 1101604 1052053 1005197 960698
56205 960698 919843 883009 849034 817579 789870 766336 745633 726650 709605 694614 681137
56194 681137 669265 659584 651413 643227 635104 628599 623910 619499 614880 611371 609461 607807 605546 603417
56180 603417 601929 600488 598899 597750 596884 595618 594682 595706 598527 601363 603795 606996 610883 613956 616376
56165 616376 620191 625844 631390 635971 641120 647755 654777 661729 669984 680194 691258 702947 716849
56152 716849 733632 751974 771286 792845 817318 843996 873520 908439 949923 996835 1049327
56141 1049327 1110387 1182480 1265601 1360006 1467666 1588998 1720586 1857547 1995377 2128114
56131B128114J19865J01553Q3084O7644N5960M9199M7669M7634M3837L4669K1675
56120B800903N927j0917k4209l0222l1549l4160m0412m9375o1927p9757j00179
56109B344123j17393j28558j34215j33893j26494j14240j01196q8358p4636o1432
56099A263708n1337m3486l5247k7400k2524j9592j5528j0825q148o663l562O8
56087A019464R41rQ89L160L232J495J816M472O091O214P447R437R253P510P663
56072A089075R461R601Q422R218J1416J1456J0106J1499J5110J6230J4591J4733
56060A230918J7413J8432J6762J6108J7392J7282J5319J5009J6616J6329J3748
56049A411328J2849J4377J4735J3458J4217J7326J8872J8402J9705K2934K3973
$$ plain form
56131 2128114 2247979 2349532 2432616 2500260 2556220 2605419 2653088 2700722 2744559 2779228 2800903
56120 2800903 2806830 2795913 2771704 2741482 2709933 2675773 2635361 2585986 2524059 2444302 2344123
56109 2344123 2226730 2098172 1963957 1830064 1703570 1589330 1488134 1399776 1325140 1263708
56099 1263708 1212371 1168885 1133638 1106238 1083714 1064122 1048594 1037769 1029621 1022958 1019396 1019464
56087 1019464 1020405 1020396 1021285 1024445 1027677 1029172 1030988 1035460 1041551 1047765 1055212 1064649 1073902 1081412 1089075
56072 1089075 1098536 1108137 1116559 1125777 1137193 1148649 1158755 1170254 1185364 1201594 1216185 1230918
56060 1230918 1248331 1266763 1283525 1299633 1317025 1334307 1349626 1364635 1381251 1397580 1411328
56049 1411328 1424177 1438554 1453289 1466747 1480964 1498290 1517162 1535564 1555269 1578203 1602176
56038A602176K2731K3867K7972L0318K9768L0528L3630L5222L4781L6341M0115
56027A947449M1629M0697M2223M6528M8186M6126M5441M7475M7921M6438M8076
56016B448189N3094N5738N5212N7389O3372O7258O7584O9929P5631P9279Q0015
56005C172690Q3610R0699R4994R5926J00531J09919J16849J19805J25927J36679
55995D247629J44807J49016J56980J69920J79592J84862J95170K12804K28386
55986E869166K39255K54988K78845L01601L20216L44218L76809M08705M37849
55977H831652M75380N24462N74044O21613O80200P54476Q33356R15436J016967
55968A5227586J144814J288145J447517J643821J887442K170312K501874K919952
$$ plain form
56038 1602176 1624907 1648774 1676746 1707064 1736832 1767360 1800990 1836212 1870993 1907334 1947449
56027 1947449 1989078 2029775 2071998 2118526 2166712 2212838 2258279 2305754 2353675 2400113 2448189
56016 2448189 2501283 2557021 2612233 2669622 2732994 2800252 2867836 2937765 3013396 3092675 3172690
56005 3172690 3256300 3346999 3441993 3537919 3638450 3748369 3865218 3985023 4110950 4247629
55995 4247629 4392436 4541452 4698432 4868352 5047944 5232806 5427976 5640780 5869166
55986 5869166 6108421 6363409 6642254 6943855 7264071 7608289 7985098 8393803 8831652
55977 8831652 9307032 9831494 10405538 11027151 11707351 12461827 13295183 14210619 15227586
55968 15227586 16372400 17660545 19108062 20751883 22639325 24809637 27311511 30231463
55960C0231463L453121M110416M922524N947275P210758Q686162J0353021J2231250
55952H7145990J4342581J6709501J9428600K2676120K6592275L1173192L6134844
55945B54203103M0515726M2250796L8619540K7968301J1475970o924134k2727293
55938C85382009l3250428l8301343l9160762l7333126l4014565l0068433k6047017
55931A47206335k2224391j8728552j5651403j3033462j0835405q994471p477824
55924E0260827o253735n259425m435427l758427l212805k762520k376606k052514
55916B0149368j790317j569740j373119j205674j072911r60582q55254p63294
55908A0558477o91934o31213n71107n18058m78830m44946m07837l73518l48397
$$ plain form
55960 30231463 33684584 37795000 42717524 48664799 55875557 64561719 74914740 87145990
55952 87145990 101488571 118198072 137626672 160302792 186895067 218068259 254203103
55945 254203103 294718829 336969625 375589165 403557466 415033436 408109302 385382009
55938 385382009 352131581 313830238 274669476 237336350 203321785 173253352 147206335
55931 147206335 124981944 106253392 90601989 77568527 66733122 57738651 50260827
55924 50260827 44007092 38747667 34312240 30553813 27341008 24578488 22201882 20149368
55916 20149368 18359051 16789311 15416192 14210518 13137607 12177025 11321771 10558477
55908 10558477 9866543 9235330 8664223 8146165 7667335 7222389 6814552 6441034 6092637
55899F092637l25626k98607k73629k56606k41004k20887k02661j92227j83163
55890C898227j68975j54974j46982j39874j28160j16890j11394j06621r6953q6784
55880B640620q1347p6516o7503n8867n6363n7202n7090n8715o4561o9439o8723
55869A924294o6440o7194o7587o3552n8585n6747n4767m8967m2975m0863l9392
55858A317225l4720l0202k9879l0569k7971k4551k4020k3889k0856j7960j9074
55847A033534k1621k1744k1437k3634k5489k3530k0618k0769k1738j9577j6187
55836G97190j5477j6152j4907j2996j3178j3780j1935r297q720q659o537m214
55824F61338m567o007n781n402p484j0465j1554j1729j2859j3301j1225q916q846
$$ plain form
55899 6092637 5767011 5468404 5194775 4938169 4697165 4476278 4273617 4081390 3898227
55890 3898227 3729252 3574278 3427296 3287422 3159262 3042372 2930978 2824357 2727404 2640620
55880 2640620 2559273 2482757 2415254 2356387 2300024 2242822 2185732 2127017 2062456 1993017 1924294
55869 1924294 1857854 1790660 1723073 1659521 1600936 1544189 1489422 1440455 1397480 1356617 1317225
55858 1317225 1282505 1252303 1222424 1191855 1163884 1139333 1115313 1091424 1070568 1052608 1033534
55847 1033534 1011913 990169 968732 945098 919609 896079 875461 854692 832954 813377 797190
55836 797190 781713 765561 750654 737658 724480 710700 698765 689468 680748 672089 665552 661338
55824 661338 656771 650764 644983 639581 632097 621632 610078 598349 585490 572189 560964 552048 543202
55811E43202q983o837m521m695n141k713O87J512Q97K127M662N964O589Q302R582
55796E50634Q022M930K876J052k341n743o898p346r564j2076j2077j0487r790
55783D91192r190o607l296j992k453l093m654p989j0626r935p429n714l745M07
55769D14876M888O967Q030J0482J2086Q818J629m910r196j2809j5615j5937j4612
55756C94697j4056j4030j2654j0595r901r803q139n798n349o294o104n029n322
55743B81623o519o042l934k659k578j782j68L71l81q01o38r59j373p35M4p44k261
55726B50464k474j923k580l892l766k658k800l987m032k937k709l360k895j089
55712B09362L53J183K655M398M829M438N201O832P026N308L326J527j093m085
$$ plain form
55811 543202 534219 527382 522861 518166 513025 510312 510999 512511 513408 515535 520197 526161 532750 541052 550634
55796 550634 558656 563586 566462 567514 565173 559430 552532 545186 535622 523546 511469 500982 491192
55783 491192 482002 475395 472099 470107 467654 464561 459907 451918 441292 431357 423928 418214 414469 414876
55769 414876 419764 426731 434761 445243 457329 466147 467776 462866 453670 440861 425246 409309 394697
55756 394697 380641 366611 353957 343362 333461 323658 315519 309721 304372 298078 291974 286945 281623
55743 281623 275104 269062 265128 262469 259891 258109 257941 258312 257931 257130 256492 255533 254160 253425 253469 252725 250464
55726 250464 247990 246067 243487 239595 235829 233171 230371 226384 222352 219415 216706 213346 210451 209362
55712 209362 209715 210898 213553 217951 222780 227218 232419 239251 246277 251585 254911 256438 255345 251260
55698B51260n766o273p128q016p238n217m137m186l508j887r90r38p3J575K015
55683A99493R62N69J868L412M068M424M849M718M103L829L597K262R1j467k152
55668B34626k779l085k204r18q00j367q00Q04J628J318J253J783J928J650J742
55653B34779J738O67n33k05Q95P11m18n03J10q98l543n344n593o074p148o862
55637B01779m839l491m204n439n722n573n445m571k989k100k219k003j070o63
55623A51451j003p60J66R4j321k156j423o15r80j755k111k442k753k108o60L1
55607A31655m60p82m17m61j121j060j47j28j532k483j834q80p09m32N05P57m97
55590A19974j750j551o93m64n24q3M35M35L77N89M26l19o39o0M43L07N03J689
$$ plain form
55698 251260 245494 239221 232093 224077 216839 211622 207485 203299 199791 197904 196914 195976 195903 197478 199493
55683 199493 200455 201024 202892 206304 210372 214796 219645 224363 228466 232295 235892 238154 238245 236778 234626
55668 234626 231847 228762 226558 225640 224840 223473 222673 223477 225105 226423 227676 229459 231387 233037 234779
55653 234779 236517 237184 236651 236446 237341 238052 237634 237131 237241 236343 232800 227456 221863 215789 208641 201779
55637 201779 196940 193449 189245 183806 178084 172511 167066 162495 159506 157406 155187 153184 152114 151451
55623 151451 150448 149688 149854 149948 148627 146471 145048 144433 143453 141698 139587 137145 134392 132284 131624 131655
55607 131655 131195 130413 129996 129535 128414 127354 127207 127079 125547 123064 121230 120350 119641 119209 119714 120471 119974
55590 119974 118224 116673 115980 115516 114992 114909 115344 115779 116156 116745 117171 116852 116213 116153 116596 116903 117406 119095
55572A19095K860L012K629K430K118J475J214J676K031J680J152Q29K78m99o88
55557A41292l25n91j692k259j652j117j563k014j389k65L32M35M19J71j44J55
55541A29793R40J208R08J226K335K779J890R65J050J368J098Q47J168J312P26
55526A49613J04j74r88k651l881l829l481l692l644k669j891k358l046k510j239
55511A13664o59q88j119j255j593j685r99l6M33N17O56P50P15R29J244P02q43
55494A10533k036j912j249j014q29j27M78L42R2M42Q20N12J26M87J048Q74L10
55477A08897K57N02J59p90j580j806j519p57J23L46k86j002j269j496j859j654
55461I6266o91p7n16j063p04o6j69n23RJ194J751J270N24J70J95L67L81j22j019
$$ plain form
55572 119095 121955 124967 127596 130026 132144 133619 134833 136509 138540 140220 141372 142201 142479 141980 141292
55557 141292 140967 140376 138684 136425 134773 133656 132093 130079 128690 128425 128757 129192 129611 129782 129638 129793
55541 129793 130733 131941 132849 134075 136410 139189 141079 142044 143094 144462 145560 146407 147575 148887 149613
55526 149613 149717 149543 148555 145904 142023 138194 134713 131021 127377 124708 122817 120459 117413 114903 113664
55511 113664 113005 112117 110998 109743 108150 106465 105466 105430 105863 106380 107036 107786 108501 109430 110674 111376 110533
55494 110533 108497 106585 105336 104322 103493 103366 103844 104186 104278 104720 105540 106052 106178 106665 107713 108587 108897
55477 108897 109154 109656 109815 109025 107445 105639 104120 103363 103486 103832 103546 102544 101275 99779 97920 96266
55461 96266 95575 95498 94982 93919 93215 93149 92980 92457 92466 93660 95411 96681 97205 97375 97570 97937 98318 98196 97177
55442I7177j593j413q15j59N97J225J143N16L90J118J743J538J060R18P38J50
55426A04333l55l97m56q11q29k13J47m41j195r82J18J234J833J780J137M50L68
55409A05721M87j84j354j526l87N54L56j35j70l10o97k44J128J464l47k488k770
55392I9098j701j107j195r81m58k18M1P41J057J38j121j246l55M07P57J001P82
55375I5640j95j042q30j47l2k40p1R2k86n40k8M00p5l81O66J892J400j84n68N66
55355I6037J318P10k17m97l32P3Q19J381J024K37J19M61N1j200k115k199k050
55338I3620j811r86J82O84L73Q8J36m9n68q09n69k38J62Q28J301R63L30M01R57
55319I4995R87N37N42R61P38k49q40m51J75L29Q5m08j112j407n62R35J739J458
$$ plain form
55442 97177 95584 94171 93356 93197 93794 95019 96162 96678 97068 98186 99929 101467 102527 103445 104183 104333
55426 104333 103978 103581 103125 102314 101485 101272 101419 100978 99783 98801 98919 100153 101986 103766 104903 105353 105721
55409 105721 106208 106024 104670 103144 102757 103311 103667 103532 103362 103052 102355 102111 103239 104703 104356 101868 99098
55392 99098 97397 96290 95095 94114 93656 93438 93479 94220 95277 95415 94294 93048 92693 93100 93857 94858 95640
55375 95640 95445 94403 93573 93426 93394 93154 93083 93175 92889 92349 92321 92721 92646 92265 92931 94823 96223 96039 95471 96037
55355 96037 97355 98065 97848 97351 97019 97092 97911 99292 100316 100553 100672 101133 101184 99984 97869 95670 93620
55338 93620 91809 90823 91005 91689 92062 92150 92286 92237 91669 90860 90291 90053 90215 91043 92344 93307 93637 94038 94995
55319 94995 95982 96519 97061 98022 98760 98511 97671 97220 97395 97724 97809 97401 96289 94882 94320 95255 96994 98452
55301I8452Q52L34l60r58o99J79M67j34n33n2N99O52L70K51K10J33L44R79J562
55282A02648J617J242Q17N63M45J11q14j940k164j140l7L7l79k35J31k93j207
55265I9402j389p16j30J26N99J049O28l96p85l92l41r19j005l3J080J433J194
55248I9405O67k38j121j061n9O98O14M39P76J016N11l11p18o88n39l16o1O6J96
55229I9276O37J098R48L30P4L12K76l44q62p69l66N0N86J061R20K69n3K08L30
55210A03981j07m98k55K58L48j09p10q92j87J227K261K006R47K24%l44o79l01
55192A07170M38K97p67j259l49R56J431J072M05l80r96q82j60K27j30n50m84k21
55174A05818l1K97O08L22l60m14L21P09J88l03j6L65Q1l13p4L36J65k01N4P56
$$ plain form
55301 98452 99304 99638 99278 98320 97621 97800 98267 98133 97600 97548 98147 98799 99169 99420 99630 99763 100107 101086 102648
55282 102648 104265 105507 106324 106887 107332 107443 106629 104689 102525 101385 101348 101385 101006 100771 100902 100609 99402
55265 99402 98013 97297 97167 97293 97892 98941 99569 99173 98388 97996 97655 96736 95731 95698 96778 98211 99405
55248 99405 100072 99834 98713 97652 97593 98291 98905 99344 100120 101136 101647 101336 100618 99930 99391 99075 99014 99080 99276
55229 99276 99913 101011 101959 102289 102363 102675 102951 102607 101745 100976 100610 100660 101246 102307 103227 103496 103443 103651 103981
55210 103981 103874 103376 103121 103379 103727 103618 102908 102016 101829 103056 105317 107323 108270 108494 108494 108150 107471 107170
55192 107170 107608 107905 107138 105879 105530 106486 107917 108989 109394 109014 108018 107136 106976 107203 107073 106523 106039 105818
55174 105818 105787 106084 106692 107014 106654 106240 106561 107270 107458 107155 107139 107504 107585 107272 107198 107534 107699 107498 107552 108308
55154A08308J147J140J116R46K74n87r47p79o41p63q21m99J47P93J001O16J35
55137A10586K30P73R68N40Q8m3l09j031j610j336l50O68J297J419J049M43l7m41
55119A12904j084j755j782j050k68R3L06O31Q11O58L92R7m19r42q35PR09J395
55101A10068J625J655J200M44J31M78Q35P68N92N29L50J54M69J123J138K76l94
55084A21441r0N58O99N28N80O79M27J8k79o63j240j540j309j014j010r44n70l21
55066A15950m29l05M41J150J091N71K59J27j74m37k63J39K07k05q45j366j318
55049A14593m38O82Q93n8j090j183n22J85O34P39L86j10j19K68K03m62p43j20
55031A13738N59M71O0P4L58M29L85L64P4m22l89K55M02n29j395r89J01N26J86
$$ plain form
55154 108308 109455 110595 111711 112657 112931 112344 111397 110618 109977 109214 108393 107894 108041 108834 109835 110451 110586
55137 110586 110816 111589 112557 113097 113185 113142 112833 111802 110192 108856 108506 109174 110471 111890 112939 113382 113345 112904
55119 112904 111820 110065 108283 107233 106965 107058 107364 107995 108806 109464 109856 109953 109534 108592 107757 107764 108673 110068
55101 110068 111693 113348 114548 114992 115123 115601 116436 117204 117796 118325 118675 118829 119298 120421 121559 121835 121441
55084 121441 121351 121909 122608 123136 123716 124395 124822 124840 124561 123898 122658 121118 119809 118795 117785 116841 116271 115950
55066 115950 115521 115216 115657 116807 117898 118469 118728 118855 118681 118244 117981 118120 118327 118122 117277 115911 114593
55049 114593 114155 114837 115730 115672 114582 113399 112877 113062 113696 114435 114821 114711 114592 114860 115063 114601 113858 113738
55031 113738 114297 114768 114828 114902 115260 115689 116074 116438 116512 116090 115701 115956 116358 115829 114434 113445 113546 114072 114258
55012A14258n7O0K56N90J099J084R1r74r24j9N69N39M88N78M47K21L69P42Q20
54993A20237P26J016J569J709J332R59Q38P36N32K58k15q75j202p83l2L59L23
54976A27487K23K04L10O45Q99L85p43j205l28P96R44O28J054J992K125J114r7
54959A36433p50p83j73R88J872J611N29k78n21q21j416j828j728j259o40j10l6
54942A31090k94o4R39J640J077M1m8O89R33L48j77k50l59m89J19J518K697L017
54924A42427K921K937L034L241L954N211O423P036O969O372N530M875M374L247
54910B08551R70j758l947n609p195q279q141p235o570o017m673k799j648j364
54896A44286q57N2J73r10j888j704r73o45n30r2M02N06N17R16J571K180K873L773
$$ plain form
55012 114258 114201 114261 114517 115107 116206 117290 117381 116407 115483 115464 116033 116572 117060 117638 118085 118306 118675 119417 120237
54993 120237 120963 121979 123548 125257 126589 127548 128386 129122 129654 129912 129697 128822 127620 126837 126805 127164 127487
54976 127487 127710 127914 128224 128869 129768 130153 129410 128205 127877 128673 129617 130245 131299 133291 135416 136530 136433
54959 136433 135683 134900 134727 135715 137587 139198 139727 139449 138928 138107 136691 134863 133135 131876 131236 131126 131090
54942 131090 130796 130732 131671 133311 134388 134429 134381 135070 136003 136351 136174 135924 135565 135076 135195 136713 139410 142427
54924 142427 145348 148285 151319 154560 158514 163725 170148 177184 184153 190525 196055 200930 205304 208551
54910 208551 209521 207763 203816 198207 191012 182733 174592 167357 160787 154770 150097 147298 145650 144286
54896 144286 143429 143481 143654 142744 140856 139152 138179 137534 137004 136912 137314 137820 138337 139253 140824 143004 145877 149650
54878A49650M582N119N663O283O523O198N758N439M754L349J597j08j928l887
54864A98992n304n613n253n091n343n565n423n034m716m671m671m063k573r47
54850A34725k36m05m67l3K24j19m82l27n6k22n64n61l71n53j173j770j843j140
54832A24627J59J221J088j14j090q74L1N19L51P2l5j93n04p59r20j231j662j712
54814A18974r50L32J292J421J118J139J550J629R56J08r3L80R19J125R44L66m22
54797A30788q79p57n37n19k7J466K872K522O24p89n05M82P68L86J90M05O64P99
54779A37953Q24O06J62n5L41J258K424L601M336M160L368K940L374M232N099O131
54763A80754P274P866P639P247P071O294M097J137j270k955m787o955q538q924
$$ plain form
54878 149650 154232 159351 165014 171297 177820 184018 189776 195215 199969 203318 204915 204807 202879 198992
54864 198992 193688 188075 182822 177731 172388 166823 161400 156366 151650 146979 142308 138245 135672 134725
54850 134725 134489 134084 133617 133584 133808 133689 133207 132880 132824 132602 132038 131477 131106 130553 129380 127610 125767 124627
54832 124627 124786 126007 127095 126981 125891 125017 125048 125567 125918 125990 125955 125762 125258 124499 123579 122348 120686 118974
54814 118974 118024 118356 119648 121069 122187 123326 124876 126505 127461 127569 127476 127856 128775 129900 130844 131210 130788
54797 130788 129909 129152 128615 128096 128069 129535 132407 134929 135553 134764 134259 134741 135509 135895 136085 136490 137154 137953
54779 137953 138777 139383 139545 139490 139831 141089 143513 147114 151450 155610 158978 161918 165292 169524 174623 180754
54763 180754 188028 195894 203533 210780 217851 224145 228242 229379 228109 225154 220367 213412 204874 195950
54749A95950q599q212p634o484m981l697k763j927j223r77j079q38L2P59M70m19
54733A48378n74M51J559J694J188R73J186J378J546K036K726L251L869N059O396
54718A81116O821O100N046M172L132J637L0j456l069m778n917o074n700n390n102
54703A70568m500l626k830k388k436k845l054k506j362l22K91P03R23N93k23q54
54687A46132q93o57n46n72p61j291j961k125j525o73j44j9j68n36r22j015q18
54670A31506n78k91Q9J73l73r42n83M83J068Q12N59P40P20K30Q9P11J130M64o63
54651A35344j113q28m50j29K99N58L53N0J11L09L33N28J236J902J792J155P90
54634A42240P77O17K66J28K00P5l09o24p65q25o40m3N42M54l44j224j664j567
$$ plain form
54749 195950 187351 179139 171505 165021 160040 156343 153580 151653 150430 149453 148374 147536 147568 148327 148797 148378
54733 148378 147804 148255 149814 151508 152696 153669 154855 156233 157779 159815 162541 165792 169661 174720 181116
54718 181116 187937 194037 199083 203255 206387 208024 208054 206598 203529 198751 192834 186760 181060 175670 170568
54703 170568 166068 162442 159612 157224 154788 151943 148889 146383 145021 144699 144990 145693 146616 147209 146986 146132
54687 146132 145239 144582 144036 143464 142703 141412 139451 137326 135801 135128 134984 134965 134797 134261 133339 132324 131506
54670 131506 130928 130637 130726 130899 130526 129584 129001 129484 130552 131364 131923 132663 133383 133613 133702 134413 135543 136007 135344
54651 135344 134231 133403 132953 132824 133123 133681 134034 134084 134195 134504 134837 135365 136601 138503 140295 141450 142240
54634 142240 143017 143634 143900 144028 144228 144303 143994 143370 142605 141780 141140 141097 141639 142093 141749 140525 138861 137294
54616A37294j026k73K44L07K63N25Q92Q28L04j53j27L17Q00Q96L75m69r80p77
54598A39240r1O95J384J685J203J52n08j78N65P53K60k54k88J47P78J186R44J34
54580A47807n31m95l9J93K0k59l58j51L11O39L55m20r73j017j037j308j291o04
54562A40842J20J33k08J1Q65J559J566J043L22l79p63o17r9M57R09J109Q13J67
54544A47850j20L67J056J188R55J183K033K747K617J780R82Q35J184J153Q9j455
54528A64444k160j573o24l07m62m21j34j2j95n76j109j568j443p11j35j91l39
54511A52484O4O59P26L64J74K33K20J66K41R6o81j671j960j295k39O29J082J073
54493A52365P14K75k01q72j426j116O6J054J156R71J121J023Q3q32n00O63J224
$$ plain form
54616 137294 136268 135995 136239 136546 136809 137334 138226 139054 139358 139205 139078 139395 140195 141091 141466 140997 140017 139240
54598 139240 139149 139844 141228 142913 144116 144268 143760 143582 144147 144900 145160 144906 144618 144765 145543 146729 147673 147807
54580 147807 147276 146781 146742 146935 146955 146696 146338 146187 146498 147137 147492 147072 146099 145082 144045 142737 141446 140842
54562 140842 140962 141095 140887 140898 141763 143322 144888 145931 146253 145874 145111 144494 144395 144852 145761 146870 147683 147850
54544 147850 147730 148097 149153 150341 151296 152479 154512 157259 159876 161656 162638 163473 164657 165810 165899 164444
54528 164444 162284 160711 160087 159780 159318 158897 158763 158751 158556 157980 156871 155303 153860 153149 153014 152823 152484
54511 152484 152548 153207 153933 154297 154471 154704 154924 155090 155331 155427 154746 153075 151115 149820 149581 150210 151292 152365
54493 152365 153079 153354 153153 152281 150855 149739 149805 150859 152015 152986 154107 155130 155213 154381 153881 154544 155768
54476A55768R15P43J139J470J414J382J404Q90k11j011q03J51J108J471R72qm66
54459A66328P5P41N02j63k2P96Q78j97j122p80L27J045R53K51p68j674j973j687
54441A63510j263p80O1J033J350Q34K51J52J37l41j096j551j437r18l99l12o08
54424A58623o36k7N82M40l4J55Q87J154Q26Q08J336J533J047O72P59M66o17j401
54406A66573r22N6K69q4R7R00J392J239J086J343J567J323Q29M57J97j05l04j13
54388A75800M81J122J440J369J087O68Jq51j505j673j506j287j016o24l10k11
54372A72985r8J74K38j14l14K40J152J640J796K234K732K458J505R43J161J378
54356A90110J125R71J328J649J465J191J239J245Q98P25J128J407O30r52k218
$$ plain form
54476 155768 156683 157426 158565 160035 161449 162831 164235 165125 164914 163903 163100 163251 164359 165830 166802 166794 166328
54459 166328 166403 167144 167646 167483 167461 168257 169135 168938 167816 167036 167363 168408 169361 169612 168844 167170 165197 163510
54441 163510 162247 161467 161528 162561 163911 164745 164996 165148 165285 164944 163848 162297 160860 159942 159543 159231 158623
54424 158623 157987 157960 158542 158982 158948 159103 159990 161144 161970 162778 164114 165647 166694 167366 168125 168591 167974 166573
54406 166573 165651 165707 165976 165892 165989 166889 168281 169520 170606 171949 173516 174839 175668 176125 176322 176217 175913 175800
54388 175800 176281 177403 178843 180212 181299 181967 181968 181117 179612 177939 176433 175146 174130 173506 173196 172985
54372 172985 172887 173061 173299 173185 172871 173111 174263 175903 177699 179933 182665 185123 186628 187571 188732 190110
54356 190110 191235 192206 193534 195183 196648 197839 199078 200323 201221 201946 203074 204481 205111 204159 201941
54341B01941k611k514k398k304k108j784j426j172j075r64o54l74n23j001j196
54326A79837q23l00j41l97q50j263j379j114p91p20o26j54K86N4m75k93M85N45
54308A71881n92j703j615p89l04k99k94k39k70m7O86J337J132K08o82j270j750
54291A65390k019j699q16J53Q36J140J085Q27O78P19O35K42j86l23j92J15O28
54274A67213J148J260R29O70P43P77M56Ml07n12n02O4R44J245O62O0K08P14Q93
54255A76669R19J277J674J426N46l26p78p48k45M07N03k09j023j253j117j084
54239A76638r50l98J57K00Q8L62N76j20j442k131j608n02M23R92J237J107P12
54222A75341K63k34p61r45n04J24K54j34n17o17m86r7M56O15lq32r84m75j07k63
$$ plain form
54341 201941 199330 196816 194418 192114 190006 188222 186796 185624 184549 183585 182931 182557 182034 181033 179837
54326 179837 179014 178714 178573 178176 177326 176063 174684 173570 172779 172059 171433 171279 171565 171619 171144 170851 171336 171881
54308 171881 171289 169586 167971 167182 166878 166579 166285 166046 165776 165729 166415 167752 168884 169092 168410 167140 165390
54291 165390 163371 161672 160856 161009 161845 162985 164070 164897 165575 166294 166929 167171 166985 166662 166470 166585 167213
54274 167213 168361 169621 170550 171220 171963 172740 173196 173200 172893 172381 171879 171943 172887 174132 174794 174854 175062 175776 176669
54255 176669 177588 178865 180539 181965 182511 182185 181407 180659 180414 180821 181324 181115 180092 178839 177722 176638
54239 176638 175688 175290 175447 175647 175735 176097 176673 176553 175111 172980 171372 170870 171293 172285 173522 174629 175341
54222 175341 175604 175370 174609 173664 173160 173284 173538 173404 172887 172270 171784 171687 172143 172758 172755 171923 170939 170464 170357 170094
54202A70094n98p05m21L59J361J647N62j174k093j680o06M68J406J980J846J213
54186A73659O56J67o88j676j920j211l36Q9K54L42J61k44m16l35m76p73n33K53
54168A66973O34K33n4L28M18p03k073j932k11J380J672J201R81J108J035M53m90
54151A70953j398j739j176l4Q54J020Q02P11P62O81M84M29N27N47M92O40R86J024
54133A76565L79n68j037p87k85pO7J27J13j05l87m39k09R0K55K72K63M59J053
54114A75819J993K887L246K818J722M21m52n75k50n2j19j65j29l14p14p33k8Q43
54096A86218J031M39k59l75K38J144J558R63j73o97j22P26Q43L87K81Q99J819
54079A94920K646L306L668L574L316L510M402N726P142Q274Q377O689L349m63
$$ plain form
54202 170094 169496 168791 168370 168729 170090 171737 172299 171125 169032 167352 166746 167214 168620 170600 172446 173659
54186 173659 174315 174482 173794 172118 170198 168987 168651 168740 168994 169336 169497 169253 168837 168502 168026 167253 166720 166973
54168 166973 167607 167840 167786 168114 168532 167829 165756 163824 163613 164993 166665 167866 168847 169955 170990 171443 170953
54151 170953 169555 167816 166640 166606 167460 168480 169282 169993 170755 171436 171920 172349 172876 173423 173915 174555 175541 176565
54133 176565 176944 176376 175339 174552 174267 174260 174327 174454 174567 174462 174075 173636 173427 173517 173772 174044 174307 174766 175819
54114 175819 177812 180699 183945 186763 188485 188906 188454 187879 187629 187577 187458 187293 187164 186850 186136 185403 185375 186218
54096 186218 187249 187688 187429 187054 187292 188436 189994 190957 190784 190087 189965 190691 191534 191921 192202 193101 194920
54079 194920 197566 200872 204540 208114 211430 214940 219342 225068 232210 240484 248861 255550 258899 258436
54065B58436l500n349o267o550o234n331m182l431l413l623l204k092j125p71
54051B03364m80K52Q97Q17N22J025K144K722K365J911J963K078J807J661K393
54036B25441L902N377O208O383O220O018N778N272M474L850L799M025L966L752
54022B94465L981M550M528L482K177J526J436J213O75L08M01N92K89n48j208r47
54006C16920k0L46o52k357l568m205n160o618p555p255o304n597n101m390l712
53991B54772l639l953l839l115k509k510k673k350j693j431j769k040j581o75
53977B20995k53p06j405j515r20j27M19N64L00j09r6N77J269J187N55L81R67J388
53959B23471P58n73j462j233p4J378K450K638J954J075P84J218J805J998J888
$$ plain form
54065 258436 254936 249587 243320 236770 230536 225205 221023 217592 214179 210556 207352 205260 204135 203364
54051 203364 202884 203136 204033 204850 205372 206397 208541 211263 213628 215539 217502 219580 221387 223048 225441
54036 225441 229343 234720 240928 247311 253531 259549 265327 270599 275073 278923 282722 286747 290713 294465
54022 294465 298446 302996 307524 311006 313183 314709 316145 317358 318033 318341 318742 319334 319623 319075 317867 316920
54006 316920 316900 317246 316594 314237 310669 306464 301304 294686 287131 279876 273572 267975 262874 258484 254772
53991 254772 251133 247180 243341 240226 237717 235207 232534 230184 228491 227060 225291 223251 221670 220995
53977 220995 220742 220036 218631 217116 216196 216069 216488 217052 217352 217243 217147 217724 218993 220180 220735 221116 222083 223471
53959 223471 224229 223656 222194 220961 220887 222265 224715 227353 229307 230382 231166 232384 234189 236187 238075
53944B38075K038K735L592M079M244M581N169N501N419N600O573P725Q104P862
53930C11297P992Q737R282R196R228J0287J2311J4496J5920J5549J2466O946Q66
53917D44573l691o086p033p192o530m939k804p55P92J715K114K224K241K133J697
53902D18459Q09m00j589k368k589k509k575k960l420l691l874m276m965n631n941
53887C72480n902n842o053o555p196p843q267q061o969n329l864k961k551k577
53873B92510l067l582l408k625k285k998l985m209l801l487l256k643j990k158
53859B49016l072l678l436k848k309j540m94J98J17l26n95o56n12Q2R22J092N2
53842B32013j439k124j640p09j72k50n43n40k08p5m44p39k11Q12J233P54K96N42
$$ plain form
53944 238075 240113 242848 246440 250519 254763 259344 264513 270014 275433 281033 287606 295331 303435 311297
53930 311297 319289 328026 337308 346504 355732 366019 378330 392826 408746 424295 436761 443707 444573
53917 444573 440882 434796 427763 420571 414041 409102 406298 405543 406335 408050 410164 412388 414629 416762 418459
53902 418459 419268 418868 417279 414911 412322 409813 407238 404278 400858 397167 393293 389017 384052 378421 372480
53887 372480 366578 360736 354683 348128 340932 333089 324822 316761 309792 304463 300599 297638 295087 292510
53873 292510 289443 285861 282453 279828 277543 274545 270560 266351 262550 259063 255807 253164 251174 249016
53859 249016 245944 242266 238830 235982 233673 232133 231639 231837 231954 231628 231033 230377 229865 229947 230869 231961 232013
53842 232013 230574 228450 226810 226101 225929 225679 225136 224596 224388 224313 223869 223130 222919 223731 224964 225718 226014 226556
53824B26556J002R56M76k5m91q61p17L9O69N22K4Q0Q12J574J921J941J878J959
53806B38315K426L263M055M496M756N031N072M666M226M355N028N645N726N205
53792C02265M279L401L089L328L409K760J735J067Q46N61n5p05j080j288j704
53777C21908k614l935n170n783n756n511n227m649l700k862k639l035l720m339
53763B62968m421l621k337j544j613j848j586j102r97j238j483j736j994j791
53749B35657r09m8k9o61j168j388j656j845j490p07r6J94M47N92L41M9M44J335
53731B29062J617Q80J18L47J242J720J396Q49P45J117J463J309P28L27N68J171
53715B44659J478J333J231J603K274K756K752K313J851J907K595L296L298K700
$$ plain form
53824 226556 227558 228514 228990 228965 228474 227613 226896 226935 227604 228126 228150 228230 229042 230616 232537 234478 236356 238315
53806 238315 240741 244004 248059 252555 257311 262342 267414 272080 276306 280661 285689 291334 297060 302265
53792 302265 306544 309945 313034 316362 319771 322531 324266 325333 326179 326740 326685 325980 324900 323612 321908
53777 321908 319294 315359 310189 304406 298650 293139 287912 283263 279563 276701 274062 271027 267307 262968
53763 262968 258547 254926 252589 251045 249432 247584 245998 244896 243899 242661 241178 239442 237448 235657
53749 235657 234748 234700 234671 234010 232842 231454 229798 227953 226463 225756 225660 225854 226301 226893 227234 227283 227727 229062
53731 229062 230679 231559 231677 232024 233266 234986 236382 237231 237976 239093 240556 241865 242593 242920 243488 244659
53715 244659 246137 247470 248701 250304 252578 255334 258086 260399 262250 264157 266752 270048 273346 276046
53701B76046K221K153K079J793J833K646L731M121L602K936K878L354L764L745
53687C16902L391K816J889N57q25j781k219k305k027j308n00k25m97n99q7N58
53671C13740O45J91l27p59j245j657j613j034l13N3j83p79j067n68K74M50j80
53654C05628n60P1R77J027L52l7J56L30J72m5l34j004j683j358J41J635K041J662
53636C09171J486J773J974J689J134Q07J028J744K532K870K611K123J888K089
53622C34919K513K790K691K409K378K716L035L035K958L079L177L037L132M021
53608C75890N315O035N983N863O053O136N834N484N303N029M629M510M530L765
53594D50359J949K51k38q9n54j579k000j490j003j188j566j649j789k344k817
$$ plain form
53701 276046 278267 280420 282499 284292 286125 288771 292502 296623 300225 303161 306039 309393 313157 316902
53687 316902 320293 323109 324998 325555 324730 322949 320730 318425 316398 315090 314590 314365 313868 313269 313182 313740
53671 313740 314385 314576 314249 313490 312245 310588 308975 307941 307628 307681 307498 306719 305652 305084 305358 305808 305628
53654 305628 305068 305139 306116 307143 307495 307458 307614 307944 308116 308071 307737 306733 305050 303692 303833 305468 307509 309171
53636 309171 310657 312430 314404 316093 317227 318034 319062 320806 323338 326208 328819 330942 332830 334919
53622 334919 337432 340222 342913 345322 347700 350416 353451 356486 359444 362523 365700 368737 371869 375890
53608 375890 381205 387240 393223 399086 405139 411275 417109 422593 427896 432925 437554 442064 446594 450359
53594 450359 452308 452559 452321 452232 451678 450099 448099 446609 445606 444418 442852 441203 439414 437070 434253
53579D34253k633k125j964k000j583q10n62j172j854j810j250r11j019j195j134
53564D12231q87o13m80o38r46r24l62K04J12m45o28j26N08P53P44P73P55N52L90
53545D10973N95J175J914K592K954K797K307J971K016K316K970M302O073P288
53531D52243P329O784O607O951P362P723Q318R233J0251J1196J1980J2457J2663
53518E71097J2921J3412J3915J4319J4944J5989J7170J8404K0141K2427K4243
53507G58982K4715K4475K4843K6045K7203K7734K7688K6918K5220K3306K2427
53496A039556K2762K3172K2890K2434K2485K2732K2442K1505K0396J9557J9186
53485A279117J9269J9487J9424J9047J8630J8265J7910J7844J8330J8821J8288
$$ plain form
53579 434253 431620 429495 427531 425531 423948 423138 422576 421404 419550 417740 416490 415579 414560 413365 412231
53564 412231 411344 410731 410251 409613 408667 407743 407381 407585 407697 407252 406624 406498 407006 407759 408503 409276 410031 410583 410973
53545 410973 411568 412743 414657 417249 420203 423000 425307 427278 429294 431610 434580 438882 444955 452243
53531 452243 459572 466356 472963 479914 487276 494999 503317 512550 522801 533997 545977 558434 571097
53518 571097 584018 597430 611345 625664 640608 656597 673767 692171 712312 734739 758982
53507 758982 783697 808172 833015 859060 886263 913997 941685 968603 993823 1017129 1039556
53496 1039556 1062318 1085490 1108380 1130814 1153299 1176031 1198473 1219978 1240374 1259931 1279117
53485 1279117 1298386 1317873 1337297 1356344 1374974 1393239 1411149 1428993 1447323 1466144 1484432
53474A484432J6532J4494J2966J1704J0086P973N551K987N82j344l055n376q583
53461A548949j1895j4376j5869j6670j6896j6642j6321j6297j6552j7051j8030
53450A372350j9548k1105k2149k2629k2713k2354k1555k0713k0178j9758j8979
53439A140669j7679j6001j4071j1975r880p869n949m379l633l704l792l105j640
53426A036992Q4J797L544N210O573P716R036J0746J2597J4185J5411J6638J8343
53413A158872K0516K2483K3552K3828K4101K5027K6672K8844L1332L3753L5630
53402A454610L6879L7961L9401M1389M3833M6447M8743N0415N1797N3461N5366
53391A960302N6840N7533N7806N8052N8219N8252N8375N8567N8233N6801N4335
$$ plain form
53474 1484432 1500964 1515458 1528424 1540128 1550214 1558187 1563738 1566725 1567307 1565963 1562908 1557532 1548949
53461 1548949 1537054 1522678 1506809 1490139 1473243 1456601 1440280 1423983 1407431 1390380 1372350
53450 1372350 1352802 1331697 1309548 1286919 1264206 1241852 1220297 1199584 1179406 1159648 1140669
53439 1140669 1122990 1106989 1092918 1080943 1071063 1063194 1057245 1052866 1049233 1045529 1041737 1038632 1036992
53426 1036992 1037076 1038873 1042417 1047627 1054200 1061916 1070952 1081698 1094295 1108480 1123891 1140529 1158872
53413 1158872 1179388 1201871 1225423 1249251 1273352 1298379 1325051 1353895 1385227 1418980 1454610
53402 1454610 1491489 1529450 1568851 1610240 1654073 1700520 1749263 1799678 1851475 1904936 1960302
53391 1960302 2017142 2074675 2132481 2190533 2248752 2307004 2365379 2423946 2482179 2538980 2593315
53380B593315N1304M8123M5194M2804M0727L8219L4848L0939K6981K2939J8506
53369B993899J3654Q590L440j768p147j3132k0214k8192l6065m2905m8496n2935
53357B768729n6073n7756n8248n8067n7576n6904n5999n4698n2962n1088m9273
53346B160085m7186m4623m2457m2018m3327m4876m5480m5416m5280m4622m2576
53335A672224l9195l5485l2389l0240k8724k6978k4225k0766j7811j5993j4765
53324A385653j3583j2798j2852j3443j4178j5159j6184j6260j4896j3035j1705
53313A231560j0544q860p261o710o537n121k400m8R85J573K780M503O271Q141
53299A208332J0191J1988J3243J4318J5619J7123J8811K0836K2940K4452K5347
$$ plain form
53380 2593315 2644619 2692742 2737936 2780740 2821467 2859686 2894534 2925473 2952454 2975393 2993899
53369 2993899 3007553 3016143 3019583 3017815 3010668 2997536 2977322 2949130 2913065 2870160 2821664 2768729
53357 2768729 2712656 2654900 2596652 2538585 2481009 2424105 2368106 2313408 2260446 2209358 2160085
53346 2160085 2112899 2068276 2025819 1983801 1940474 1895598 1850118 1804702 1759422 1714800 1672224
53335 1672224 1633029 1597544 1565155 1534915 1506191 1479213 1454988 1434222 1416411 1400418 1385653
53324 1385653 1372070 1359272 1346420 1332977 1318799 1303640 1287456 1271196 1256300 1243265 1231560
53313 1231560 1221016 1212156 1204895 1198185 1191648 1186527 1184127 1184079 1185064 1186637 1189417 1193920 1200191 1208332
53299 1208332 1218523 1230511 1243754 1258072 1273691 1290814 1309625 1330461 1353401 1377853 1403200
53288A403200K6545K8559L0448L0790K9315K6973K4735K2898K1395K0087J8714
53277A683659J6925J4588J1862Q987O044K956k74l302n648p310r013j1518j4767
53264A693189j8073k1005k3661k6043k7782k8657k8999k9327k9782l0242l0703
53253A398915l1288l1906l2173l1701l0469k8855k7305k6032k5082k4646k4972
53242A084486k5869k6566k6375k5395k4402k4071k4398k4740k4340k3008k1306
53231H14016j9911j8802j7386j5433j3313j1293r298p639p193q271r845j0588
53219F65044j0381j0116j0422j1240j2397j3819j5225j6188j6522j6186j5043
53208E17505j3153j1160r759q908q087p157o424o031n919o204o996p877q252q125
$$ plain form
53288 1403200 1429745 1458304 1488752 1519542 1548857 1575830 1600565 1623463 1644858 1664945 1683659
53277 1683659 1700584 1715172 1727034 1736021 1742065 1745021 1744747 1741445 1735797 1728487 1719474 1707956 1693189
53264 1693189 1675116 1654111 1630450 1604407 1576625 1547968 1518969 1489642 1459860 1429618 1398915
53253 1398915 1367627 1335721 1303548 1271847 1241378 1212523 1185218 1159186 1134104 1109458 1084486
53242 1084486 1058617 1032051 1005676 980281 955879 931808 907410 882670 858330 835322 814016
53231 814016 794105 775303 757917 742484 729171 717878 708580 700941 693748 685477 675632 665044
53219 665044 654663 644547 634125 622885 610488 596669 581444 565256 548734 532548 517505
53208 517505 504352 493192 483433 474525 466438 459281 452857 446826 440907 434703 427707 419830 411578 403453
53194D03453p991p962p707p213o919o934o725n870m663l762l502l650l672l254
53180C23629k742k795l404l672k980j939j519j637j427p05k90p97j801k413k175
53165B93333j361p32q47j330j140k3Q40L46r13j478j012l67k8K39L35j89j034
53148B84639j318j044j167j891k216j580p21l19l8M50N95rp36r14q46r75q52P7
53130B71135J291J888J895J996K333K502K388K100J446K87q02j086p46n57p17
53115B85353p20l09L02J054K091K986K840J474o4o90o01r13k120l380l549k653
53099B81101j877k063k649k584j855j356j362j091q4Q61P75j32q97j106j068r60
53083B63653o67l46m71j077j513j159j30Q51J178Q75M45K37P1l04o27m34J08K94
$$ plain form
53194 403453 395462 387500 379793 372580 365661 358727 352002 346132 341469 337707 334205 330555 326883 323629
53180 323629 320887 318092 314688 311016 308036 306097 304578 302941 301514 300809 300519 299722 297921 295508 293333
53165 293333 291972 291240 290393 289063 287923 287900 288740 289086 288173 286695 285683 285316 285288 285527 285862 285673 284639
53148 284639 283321 282277 281110 279219 277003 275423 274702 274383 274345 274795 275390 275381 274645 273731 272885 271910 271058 271135
53130 271135 272426 274314 276209 278205 280538 283040 285428 287528 288974 289261 288459 287373 286627 286070 285353
53115 285353 284633 284324 284626 285680 287771 290757 293597 295071 295007 294317 293716 292803 290683 287303 283754 281101
53099 281101 279224 277161 274512 271928 270073 268717 267355 266264 266180 267041 267816 267684 266787 265681 264613 263653
53083 263653 262986 262640 262169 261092 259579 258420 258290 259141 260319 261194 261639 261876 261947 261643 261016 260582 260690 260984
53065B60984m7k46J41O12M99r0o45j060j462j627j277o44j46K93R87J749K031
53048B60052J710J182P68N48O43J027J198O44l35q36m72K23N74M26l0n47p86m64
53030B65525J37K77l51j135j276p49k42k50n82p41n07J1O59J322J760J683J199
53013B66740Q75J086J477J475J153J072J264J099L40l70m73l55o53j171j158m57
52997B71944L24P07P92P89O43K18l76q55r09l85O08J703K591L099L072K455J672
52980B88092J387J589J422M50m43j39J089J970K018J925K094J876P98l67n04L13
52964C03570R65Q48N25P55J418J710J139j6j148j848j985j524o67j1j24q42j348
52947C01417j144o41m93o83o69k55J34K1n94j341j832j916j751j663j753j741
$$ plain form
53065 260984 260937 260691 260832 261444 261943 261853 261208 260148 258686 257059 255782 255138 254992 255285 256272 258021 260052
53048 260052 261762 262944 263712 264260 264903 265930 267128 267772 267437 266601 266129 266352 266926 267352 267322 266775 265989 265525
53030 265525 265662 265939 265588 264453 263177 262428 262186 261936 261354 260613 260106 260117 260776 262098 263858 265541 266740
53013 266740 267615 268701 270178 271653 272806 273878 275142 276241 276581 276211 275738 275383 274730 273559 272401 271944
52997 271944 272268 272975 273767 274556 275199 275417 275041 274186 273277 272892 273500 275203 277794 280893 283965 286420 288092
52980 288092 289479 291068 292490 292940 292497 292358 293447 295417 297435 299360 301454 303330 304128 303761 303257 303570
52964 303570 304535 305383 305908 306663 308081 309791 310930 310914 309766 307918 305933 304409 303742 303731 303607 302765 301417
52947 301417 300273 299632 299139 298456 297787 297532 297666 297687 297093 295752 293920 292004 290253 288590 286837 285096
52931B85096j334o73j62L4O9L4k07p32j344j646j339n12K76M19m1m04j60L95O85
52912B78454O73P35R16R04O33M06L22R9m21r58j165j045p93n26l12k08j81j35
52894B77398j37l76q05j029p05L5O96Q84O31L52M73R41J196Q23J30j81N5K80k5
52875B80636o40r62p28j54M90J081J437J302P10K06M15J347K323K660K346J908
52859B94377J774J882J870J419M61o87j402j257o14m93j618l657n438n900m886
52844B75831l288k357k609l322l348k432j359q00n39r6M44O47M48J50o8j74k7
52827B57101M98J134J381J040L51l14o97p21o39q66j429j770j429o80j43O8L22
52810B53207P44J059J135J197J472J938K456K767K432J172o65k293l221l499l279
$$ plain form
52931 285096 283762 283089 282927 282961 283030 283064 282857 282125 280781 279135 277796 277284 277560 277979 277938 277534 277374 277769 278454
52912 278454 279127 279862 280778 281682 282315 282721 283043 283142 282721 281763 280598 279553 278760 278234 277922 277714 277533 277398
52894 277398 277261 276885 276080 275051 274346 274381 275077 275961 276592 276944 277417 278358 279554 280377 280507 280326 280381 280661 280636
52875 280636 279996 279034 278306 278152 278642 279723 281160 282462 283172 283378 283793 285140 287463 290123 292469 294377
52859 294377 296151 298033 299903 301322 301783 301096 299694 298437 297823 297330 295712 292055 286617 280717 275831
52844 275831 272543 270186 267577 264255 260907 258475 257116 256316 255777 255681 256125 256772 257220 257370 257302 257128 257101
52827 257101 257599 258733 260114 261154 261505 261191 260494 259773 259134 258268 256839 255069 253640 252960 252817 252885 253207
52810 253207 253951 255010 256145 257342 258814 260752 263208 265975 268407 269579 268914 266621 263400 259901 256622
52795B56622k529j307j3P77O65k89j458k002j638r15m58j90K70P43O59k5p00r00
52777B47312o36N2J145K164K340J596P09K40o4n04p62n98n65j238k138k195j194
52760B45664L9P64R80Q89M87o6k80O9N67P74Q34J112J497J557J257J029J073J116
52742B59362R48Q02R28J137J160J181J541K051K116J603J108J126J348J152M81
52727B78044p9n2M04P24N26q3o38q03o75o06p36r34j101j285j382j128n09R9M18
52708B70204N72O66M74j28o55m56M19J190J210N45k13m91j11O15J107J020N06
52691B76474q2n17p12n91k19J82M66O47O60M05J28K87P40O25m63j674j896j160
52673B73300l44J82Q00J584J967J583P75L2n43r34r56n05J53O22O01K1q20j242
$$ plain form
52795 256622 254093 252786 252773 253550 254215 253926 252468 250466 248828 247913 247455 247265 247535 248278 248937 248912 248212 247312
52777 247312 246676 246728 247873 250037 252377 253973 254682 254922 254858 254354 253592 252994 252429 251191 249053 246858 245664
52760 245664 245703 246467 247447 248336 248823 248757 248477 248546 249113 249887 250721 251833 253330 254887 256144 257173 258246 259362
52742 259362 260310 261112 262040 263177 264337 265518 267059 269110 271226 272829 273937 275063 276411 277563 278044
52727 278044 277965 277913 278317 279041 279567 279484 278846 278043 277368 276762 276026 275092 273991 272706 271324 270196 269687 269786 270204
52708 270204 270776 271442 271916 271788 271133 270677 271096 272286 273496 274041 273828 273337 273226 273841 274948 275968 276474
52691 276474 276392 275875 275163 274572 274353 274535 275001 275648 276308 276713 276841 277128 277868 278493 278030 276356 274460 273300
52673 273300 272956 273138 273938 275522 277489 279072 279847 279879 279336 278402 277446 276941 277094 277716 278317 278338 277518 276276
52655B76276p91K17J122J763K381K901K919K408J737R88k5r87j229q51p92j428
52639B86609j932j573q32m70k64L96J147J001j5o56j24R71J680K011K504K993
52623B93446K643J247k09o84l65l03r15j499j394r63j025j646k128j928j089R4
52607B83282J259J846J486O72M35J101J840J734Q32j23o02n62j89K45M09J87j84
52590B93668m12n01n55m98j51M60J068J423J468J397J478J719J709J097K15k00
52574C03385Q1M59L53q4l51l93n64r58j187r20l51k7k85r18j397j375j000p04
52556B93764p22q67p52k83J00k34j269k056j657l80N16N02M07R93J666J442N09
52539B91679j01j29k69r16j645j987j812r87M00J463J283L55J96J178J922J331
$$ plain form
52655 276276 275485 275702 276824 278587 280968 283869 286788 289196 290933 291921 291896 290909 289680 288829 288037 286609
52639 286609 284677 283104 282272 281802 281538 281934 283081 284082 284067 283411 283287 284258 285938 287949 290453 293446
52623 293446 296089 297336 297127 296443 296078 295775 294860 293361 291967 291004 289979 288333 286205 284277 283188 283282
52607 283282 284541 286387 287873 288545 288980 290081 291921 293655 294487 294364 293762 293200 293011 293256 293665 293852 293668
52590 293668 293256 292755 292200 291702 291551 292011 293079 294502 295970 297367 298845 300564 302273 303370 303585 303385
52574 303385 303466 303925 304278 304194 303843 303450 302886 301928 300741 299821 299470 299443 299158 298240 296843 295468 294468 293764
52556 293764 293042 292175 291423 291140 291240 291006 289737 287681 286024 285644 286160 286662 287069 288062 289728 291170 291679
52539 291679 291578 291449 291180 290264 288619 286632 284820 283833 284233 285696 286979 287334 287530 288708 290630 291961
52523B91961J33l18J55Q51J453K019K285J962J437J368J765K076K018J744J522
52508C12431J657K416L535M207M025L484K996K026n0k623m367m805m574m254l788
52493C12316l096k466k151k059j985j761j250n12N2J89J87M12O65N39J68M8K28
52476B99524L92N76J111J813J981J383O91N36P29O80L55L75J253K671L637L446
52460C21153K532K063K540L148K773J294n15j997k956l355l374l556m172m569
52446C11009l897k501j727k151k789k439j193r8K18O0j4Q2j5n69j267j396o62
52429B90651L02N18k47j253j651j245m10L72P93Q45Q35J107J567J827J776J732
52413B97519J916K078J978J992K798M374N667N701M908M929O757R498J1446J1979
$$ plain form
52523 291961 292094 291776 291931 292782 294235 296254 298539 300501 301938 303306 305071 307147 309165 310909 312431
52508 312431 314088 316504 320039 324246 328271 331755 334751 336777 336727 334104 329737 324932 320358 316104 312316
52493 312316 309220 306754 304603 302544 300559 298798 297548 297036 297088 297277 297464 297876 298541 299080 299248 299296 299524
52476 299524 299916 300492 301603 303416 305397 306780 307471 308007 308736 309416 309771 310146 311399 314070 317707 321153
52460 321153 323685 325748 328288 331436 334209 335503 334988 332991 330035 326680 323306 319750 315578 311009
52446 311009 307112 304611 302884 300733 297944 295505 294312 294214 294432 294492 294478 294560 294545 293976 292709 291313 290651
52429 290651 290953 291471 291224 289971 288320 287075 286665 287037 287830 288675 289510 290617 292184 294011 295787 297519
52413 297519 299435 301513 303491 305483 308281 312655 318322 324023 328931 333860 340617 350115 361561 373540
52399C73540J1614J0436P670L203j609n314p768r393r913q940p241o121n757n232
52385C39175m125k936j918p32N24J043N89P7L70J197J719J678J485J721K780M553
52369C47200O189O758O352N883N616M754K842P53m13o87q18j073j235j279j262
52354C79580q58J74J269J541Q98Q4l16l05m5L60P16Q55J028J612K490L175L531
52337C95789L907M509N129N657O279P002P428P315P073P388Q582J0453J2557J4383
52323E03451J5561J6172J6723J7550J8327J8470J7915J7177J6595J5983J5214
52312F89138J4826J5548J7312J9168K0266K0594K0609K0598K0675K0991K1488
52301I01213K1713K1347K0757K0437K0081J8876J6724J4382J2243R801O740L760
$$ plain form
52399 373540 385154 395590 403260 406463 404854 399540 391772 382379 372466 363526 356285 350164 344407 339175
52385 339175 335050 332114 330196 329464 329988 331031 331620 331697 332067 333264 334983 336661 338146 339867 342647 347200
52369 347200 353389 360147 366499 372382 377998 382752 385594 386347 385934 385247 384429 383356 382121 380842 379580
52354 379580 378722 378896 380165 381706 382604 382688 382372 382067 382022 382382 383098 383953 384981 386593 389083 392258 395789
52337 395789 399696 404205 409334 414991 421270 428272 435700 443015 450088 457476 466058 476511 489068 503451
52323 503451 519012 535184 551907 569457 587784 606254 624169 641346 657941 673924 689138
52312 689138 703964 719512 736824 755992 776258 796852 817461 838059 858734 879725 901213
52301 901213 922926 944273 965030 985467 1005548 1024424 1041148 1055530 1067773 1077574 1084314 1088074
52289A088074J619j0j941m123n799o802p676q479q541p721o962p026p305o667
52275A010641m987l075j448NJ204J732J733K190L761N888P618Q896J0346J1980
52261A056484J3018J3088J2950J3574J4945J6252J6974J7389J8022J8926J9564
52250A231186J9250J7806J5806J4086J2792J1166Q416M676Q82k110m000m902n218
52237A319836n567o363p381q080q429q933r807j0586j0809j0703j0709j0695j0158
52224A201616r110q206p864p680o999n802m612l655k550r78O24J486J463J279
52210A149012J685K733M001N184O162O692O527N853N233N042N159N360N706O320
52196A220669O946P052O454N696N627O577Q019R058R213Q599P546O255M860L471
$$ plain form
52289 1088074 1089693 1089683 1087742 1083619 1077820 1071018 1063342 1054863 1046322 1038601 1031639 1024613 1017308 1010641
52275 1010641 1005654 1002579 1001131 1001136 1002340 1004072 1005805 1007995 1011756 1017644 1025262 1034158 1044504 1056484
52261 1056484 1069502 1082590 1095540 1109114 1124059 1140311 1157285 1174674 1192696 1211622 1231186
52250 1231186 1250436 1268242 1284048 1298134 1310926 1322092 1330508 1335184 1336066 1333956 1329956 1325054 1319836
52237 1319836 1314269 1307906 1300525 1292445 1284016 1275083 1265276 1254690 1243881 1233178 1222469 1211774 1201616
52224 1201616 1192506 1184300 1176436 1168756 1161757 1155955 1151343 1147688 1145138 1144160 1144784 1146270 1147733 1149012
52210 1149012 1150697 1153430 1157431 1162615 1168777 1175469 1181996 1187849 1193082 1198124 1203283 1208643 1214349 1220669
52196 1220669 1227615 1234667 1241121 1246817 1252444 1259021 1267040 1276098 1285311 1293910 1301456 1307711 1312571 1316042
52182A316042J981j2k760n907q645j0355j1086j1373j1631j1722j1167r840q314
52169A215211p258o684o112n359m641l886k598o81J226K565L458M116M210L460
52155A197027K371J603R50k40j776k682k534j955j575j220m48O46J553J920J801
52140A195441J534J508J758J783J074j70j185j494j201n23N25J926L616N683Q239
52125A218514J1031J3635J6023J8472K0919K2998K4681K6212K7359K7504K6761
52114A454109K6163K6297K6477K5764K4246K2707K1497K0385J9132J7653J5903
52103A700333J4171J3174J3270J3749J3572J2595J1456J0393Q890O529L522J87
52091A821841l463p341j0959j3896j6310j8580k0591k1711k1470k0029j7941j5761
$$ plain form
52182 1316042 1318023 1318011 1315251 1309344 1300699 1290344 1279258 1267885 1256254 1244532 1233365 1223525 1215211
52169 1215211 1207953 1201269 1195157 1189798 1185157 1181271 1178673 1177992 1179218 1181783 1185241 1189357 1193567 1197027
52155 1197027 1199398 1201001 1201951 1201711 1199935 1197253 1194719 1192764 1191189 1189969 1189521 1190167 1191720 1193640 1195441
52140 1195441 1196975 1198483 1200241 1202024 1203098 1202928 1201743 1200249 1199048 1198525 1199050 1200976 1204592 1210275 1218514
52125 1218514 1229545 1243180 1259203 1277675 1298594 1321592 1346273 1372485 1399844 1427348 1454109
52114 1454109 1480272 1506569 1533046 1558810 1583056 1605763 1627260 1647645 1666777 1684430 1700333
52103 1700333 1714504 1727678 1740948 1754697 1768269 1780864 1792320 1802713 1811603 1818132 1821654 1821841
52091 1821841 1818378 1811037 1800078 1786182 1769872 1751292 1730701 1708990 1687520 1667491 1649550 1633789
52079A633789j3875j2445j1278r920q146o279m754l406j644O28K765M336N847
52066A575618P998J0530J2454J3333J3738J4407J5386J6208J6514J6359J6096
52055A728641J6030J6031J5648J4734J3630J2422J0409O999K803r17l760o358
$$ plain form
52079 1633789 1619914 1607469 1596191 1586271 1578125 1571846 1567092 1563686 1562042 1562670 1565435 1569771 1575618
52066 1575618 1583616 1594146 1606600 1619933 1633671 1648078 1663464 1679672 1696186 1712545 1728641
52055 1728641 1744671 1760702 1776350 1791084 1804714 1817136 1827545 1834544 1837347 1836430 1832670 1826312
$$ [...]
##END NTUPLES=NMR SPECTRUM
##END=
