
##TITLE=UV1287_M2_1207-1380_30_7534711_cWZqGJ1YTB
##JCAMPDX= 6.0         $$ Bruker NMR JCAMP-DX V2.0
##DATA TYPE= NMR SPECTRUM
##DATA CLASS= NTUPLES
##ORIGIN= BRUKER
##OWNER= Administrator
$$ 1.72 TOPSPIN		Version 2.1
$$ 2013-02-21 21:12:51.388 -0500  Administrator@X
$$ Compression mode = diff/dup
##.OBSERVE FREQUENCY= 400.02188249412
##.OBSERVE NUCLEUS= ^1H
##.ACQUISITION MODE= SIMULTANEOUS (DQD)
##.ACQUISITION SCHEME= undefined
##.AVERAGES= 8
##.DIGITISER RES= 22
##SPECTROMETER/DATA SYSTEM= spect
##.PULSE SEQUENCE= zg30
##.SOLVENT NAME= COFFEE_meoh
##.SHIFT REFERENCE= INTERNAL, COFFEE_meoh, 1, 14.98509
##AUDIT TRAIL= $$ (NUMBER, WHEN, WHO, WHERE, PROCESS, VERSION, WHAT)
$$ ##TITLE= Audit trail, TOPSPIN		Version 2.1
$$ ##JCAMPDX= 5.01
$$ ##ORIGIN= Bruker BioSpin GmbH
$$ ##OWNER= Administrator
$$ $$ E:\/data/COFFEE/nmr/UV1287_M2_1207-1380_30_7534711_cWZqGJ1YTB/10/pdata/1/auditp.txt
$$ ##AUDIT TRAIL=  $$ (NUMBER, WHEN, WHO, WHERE, PROCESS, VERSION, WHAT)
(   1,<2013-02-21 21:12:42.966 -0500>,<Administrator>,<X>,<go>,<TOPSPIN 2.1>,
      <created by zg
	started at 2013-02-21 21:11:36.732 -0500,
	POWCHK enabled, PULCHK disabled,
       configuration hash MD5:
       86 BA 57 50 F2 9D 5C 9B 26 00 A9 28 5F 66 2E 89
       data hash MD5: 64K
       65 17 D6 BB 3B 60 65 75 63 DA FA 4D C9 A0 09 FC>)
(   2,<2013-02-21 21:12:46.107 -0500>,<Administrator>,<X>,<proc1d>,<TOPSPIN 2.1>,
      <Start of raw data processing
       efp LB = 0 FT_mod = 6 PKNL = 1 PHC0 = 0 PHC1 = 0 SI = 32K 
       data hash MD5: 32K
       A4 66 94 0A AF 0E 44 51 5C 08 55 ED DB 5C D3 CC>)
(   3,<2013-02-21 21:12:46.607 -0500>,<Administrator>,<X>,<proc1d>,<TOPSPIN 2.1>,
      <pk PHC0 = 69.73572 PHC1 = 0 
       data hash MD5: 32K
       49 B6 1A C3 EA 24 B7 CB 70 E1 43 0A 4A 80 69 6B>)
(   4,<2013-02-21 21:12:46.841 -0500>,<Administrator>,<X>,<proc1d>,<TOPSPIN 2.1>,
      <abs ABSG = 1 
       data hash MD5: 32K
       CE 4F 45 19 79 61 A1 26 1A 17 3E 54 FA C4 F8 0C>)
(   5,<2013-02-21 21:12:46.997 -0500>,<Administrator>,<X>,<proc1d>,<TOPSPIN 2.1>,
      <abs ABSG = 2 
       data hash MD5: 32K
       1A 62 F1 74 3D DE D5 BF 2E 36 8A B1 9E DC D9 0E>)
(   6,<2013-02-21 21:12:47.201 -0500>,<Administrator>,<X>,<proc1d>,<TOPSPIN 2.1>,
      <abs ABSG = 3 
       data hash MD5: 32K
       D5 0A A2 DC 9C B1 0F 67 27 DA 9A 7B 8B 0A 43 D2>)
(   7,<2013-02-21 21:12:47.341 -0500>,<Administrator>,<X>,<proc1d>,<TOPSPIN 2.1>,
      <abs ABSG = 4 
       data hash MD5: 32K
       CC 34 B1 43 C5 D7 76 5A CE AB A6 73 0B E7 53 3F>)
(   8,<2013-02-21 21:12:47.497 -0500>,<Administrator>,<X>,<proc1d>,<TOPSPIN 2.1>,
      <abs ABSG = 5 
       data hash MD5: 32K
       2A CA E1 92 AA 94 55 2C 0B A9 28 A0 B2 E4 2A 4B>)
$$ ##END=
$$ 
$$ $$ hash MD5
$$ $$ E9 85 E8 12 BE C3 64 54 10 48 0C 43 25 9E 1B 34
##$RELAX= 
##$RELAX= 
##$RELAX= 
##$RELAX= 
##$RELAX= 
##$RELAX= 
##$RELAX= 
$$ Bruker specific parameters
$$ --------------------------
##$DU= <E:\>
##$EXPNO= 10
$$ [...]
##$TP= (0..7)
150 150 150 150 150 150 150 150
##$TP07= 0
##$TPNAME0= <>
##$TPNAME1= <>
##$TPNAME2= <>
##$TPNAME3= <>
##$TPNAME4= <>
##$TPNAME5= <>
##$TPNAME6= <>
##$TPNAME7= <>
##$TPOAL= (0..7)
0.5 0.5 0.5 0.5 0.5 0.5 0.5 0.5
##$TPOFFS= (0..7)
0 0 0 0 0 0 0 0
##$TUNHIN= 0
##$TUNHOUT= 0
##$TUNXOUT= 0
##$USERA1= <user>
##$USERA2= <user>
##$USERA3= <user>
##$USERA4= <user>
##$USERA5= <user>
##$V9= 5
##$VALIST= <valist>
##$VCLIST= <CCCCCCCCCCCCCCC>
##$VD= 0
##$VDLIST= <DDDDDDDDDDDDDDD>
##$VPLIST= <PPPPPPPPPPPPPPP>
##$VTLIST= <TTTTTTTTTTTTTTT>
##$WBST= 1024
##$WBSW= 4
##$XGAIN= (0..3)
0 0 0 0
##$XL= 0
##$YL= 0
##$YMAX_a= 489246
##$YMIN_a= -488459
##$ZGOPTNS= <>
##$ZL1= 120
##$ZL2= 120
##$ZL3= 120
##$ZL4= 120
##$ABSF1= 14.98509
##$ABSF2= -5.573092
##$ABSG= 5
##$ABSL= 3
##$ALPHA= 0
##$AQORDER= 0
##$ASSFAC= 0
##$ASSFACI= 0
##$ASSFACX= 0
##$ASSWID= 0
##$AUNMP= <proc_prof1d_extract_pilot.lims>
##$AXLEFT= 0
##$AXNAME= <>
##$AXNUC= <1H>
##$AXRIGHT= 0
##$AXTYPE= 0
##$AXUNIT= <>
##$AZFE= 0.1
##$AZFW= 0.1
##$BCFW= 0
##$BC_mod= 0
##$BYTORDP= 0
##$COROFFS= 0
##$CY= 15
##$DATMOD= 1
##$DC= 0
##$DFILT= <>
##$DTYPP= 0
##$F1P= 0
##$F2P= 0
##$FCOR= 0.5
##$FTSIZE= 32768
##$FT_mod= 6
##$GAMMA= 0
##$GB= 0
##$INTBC= 1
##$INTSCL= 1
##$ISEN= 128
##$LB= 0
##$LEV0= 0
##$LPBIN= 0
##$MAXI= 10000
##$MC2= 0
##$MEAN= 0
##$ME_mod= 0
##$MI= 0
##$NCOEF= 0
##$NC_proc= -8
##$NLEV= 6
##$NOISF1= 0
##$NOISF2= 0
##$NSP= 0
##$NTH_PI= 0
##$NZP= 0
##$OFFSET= 14.98509
##$PC= 1
##$PHC0= 69.73572
##$PHC1= 0
##$PH_mod= 1
##$PKNL= yes
##$PPARMOD= 0
##$PPDIAG= 0
##$PPIPTYP= 0
##$PPMPNUM= 2147483647
##$PPRESOL= 1
##$PSCAL= 4
##$PSIGN= 0
##$PYNMP= <proc.py>
##$REVERSE= no
##$SF= 400.02
##$SI= 32768
##$SIGF1= 0
##$SIGF2= 0
##$SINO= 400
##$SIOLD= 32768
##$SPECTYP= <>
##$SREGLST= <1H.CDCl3>
##$SSB= 0
##$STSI= 32768
##$STSR= 0
##$SW_p= 8223.68421052631
##$SYMM= 0
##$S_DEV= 0
##$TDeff= 65536
##$TDoff= 0
##$TI= <>
##$TILT= no
##$TM1= 0
##$TM2= 0
##$TOPLEV= 0
##$USERP1= <user>
##$USERP2= <user>
##$USERP3= <user>
##$USERP4= <user>
##$USERP5= <user>
##$WDW= 1
##$XDIM= 32768
##$YMAX_p= 433010539
##$YMIN_p= -687554
##$CURPLOT= <Network HP LaserJet P1505>
##$CURPRIN= <$Network HP LaserJet P1505>
##$DFORMAT= <normdp>
##$LAYOUT= <+/1D_H.xwp>
##$LFORMAT= <normlp>
##$PFORMAT= <normpl>
##$SURQMSG= 1
$$ End of Bruker specific parameters
$$ ---------------------------------
##NTUPLES= NMR SPECTRUM
##VAR_NAME=  FREQUENCY,     SPECTRUM/REAL,   SPECTRUM/IMAG
##SYMBOL=    X,             R,               I
##VAR_TYPE=  INDEPENDENT,   DEPENDENT,       DEPENDENT
##VAR_FORM=  AFFN,          ASDF,            ASDF
##VAR_DIM=   32768,         32768,           32768
##UNITS=     HZ,            ARBITRARY UNITS, ARBITRARY UNITS
##FACTOR=    0.250966925370066, 1,           1
##FIRST=     8223.43324360094, -113607,      6620
##LAST=      0,             -37220,          -92789
##MIN=       0,             -687554,         0
##MAX=       8223.43324360094, 433010539,    0
$$ Real data points
##PAGE= N=1
##DATA TABLE= (X++(R..R)), XYDATA
$$ [...]
$$ plain form
19561 -140583 -200866 -20784 -63760 -257850 -293781 196134 -62709 -297384 110542 -144465
19550 98180 126604 12244 69837 9563 110254 -156103 125960 1020 291302 -94905 -468255
19539 -468255 280877 -33358 15279 -159502 371511 314811 -206681 -168685 -82669 -16418 -96744
19528 -96744 -375683 -172454 -138319 -381288 -185246 192345 -100539 -300400 28069 198938
19518 198938 -258875 -151533 14829 391114 179111 -46314 -59387 -31796 175517 -251245
19507 -22667 65635 -46925 -113144 51051 114806 -74123 -35773 -380436 -25671 66147 1126 -25562
19494 48965 -5739 -130730 -208645 -4770 -232990 -6828 -267360 78492 212204 -431239 259595
19482 -258185 -176577 143951 -15782 184973 39305 150146 71036 -23884 132045 -34468 -168329
$$ packed form
19561a40583o0283b0784m2976j94090l5931A96134f2709k34675A10542a44465
19550I8180K8424A2244N7593I563J00691a56103A25960A020K90282i4905l73350
19539d68255B80877c3358A5279a59502C71511n6700b06681L7996h2669a6418q0326
19528i6744k78939a72454L4135k42969a85246A92345a00539j99861B8069J70869
19518A98938b58875J07342A4829L76285A79111d6314j3073K7591A75517b51245
19507b2667F5635d6925o6219E1051O3755g4123c5773l44663b5671F6147A126b5562
19494D8965e739j24991p7915d770k28220f828k60532G8492J33712d31239B59595
19482b58185Q1608A43951a5782A84973C9305J10841G1036b3884A32045c4468j33861
$$ plain form
19471 -168329 -315717 47194 -63843 -28550 -105186 -195466 -3645 203175 -107513 172645 -129697
19459 -303477 90748 -314807 109817 80566 -245135 125900 -183017 77677 -208425 -107911
19449 -107911 -139608 676 -52675 374182 68148 115946 -80593 -83899 75179 11971 -446199 -97895
19436 88584 32165 185944 -4594 -241757 236629 -305149 241144 9590 155220 -289156 71560
19424 101324 -63163 64884 71247 -102249 64528 -36618 267235 -151771 -32196 63940 -93467
19412 -199296 -198748 -482632 57772 -499198 -240350 112304 -211076 26248 116193 -248972 -53841
19400 -209498 -131618 -114951 127906 278670 -160918 -153451 -75887 292553 71332 -39354 -277891
19389 -277891 -397749 58191 -131379 103086 -91722 -189144 31632 97089 -85603 -46762 55363
$$ packed form
19471a68329j47388D7194f3843b8550p6636r0280c645B03175a07513A72645a29697
19459c03477I0748c14807A09817k9251b45135A25900a83017G7677b08425J00514
19449a07911l1697F76e2675C74182F8148M7798h0593l306G5179A1971d46199i7895
19436H8584C2165J53779d594k37163B36629c05149B41144I590J45630b89156G1560
19424A01324f3163F4884O363a02249F4528c6618B67235a51771c2196F3940i3467
19412a99296N48k83884E7772d99198b40350A12304b11076B6248Q9945b48972e3841
19400b09498P7880J6667A27906J50764a60918P467g5887B92553G1332c9354k38537
19389b77891j19858E8191a31379A03086i1722r7422C1632O5457h5603L8841E5363
$$ plain form
19377 -56984 -37642 -84736 392794 31980 29110 88022 58328 267399 -129455 -32274 -404727
19366 -404727 25544 95415 18013 -84615 -516112 -93329 -37139 -271648 -189002 -342933 -139096
19354 -116280 41214 -191955 -265916 -79066 -15559 -224738 47874 -25470 44573 74463 -148689
19342 -172607 -189615 -134539 443413 -441156 -247630 108916 -30790 112909 -94033 22573
19331 -61102 -144343 -33963 8247 153292 -211313 -12464 50827 -167607 -276035 -140571 -344497
19320 -344497 -72038 218223 -206581 -75411 -359696 -68200 -194975 266798 126699 -165316
19309 82011 196376 -139134 10189 -39314 47875 12537 -89935 -204681 281885 188301 -175575
19297 -164227 -191868 123226 120271 186801 -51833 18539 -43073 -310633 153384 -191134 188302
$$ packed form
19377e6984J9342m7094C92794C1980k870N8912k9694K09071a29455c2274l72453
19366d04727B5544O9871A8013h4615m31497i3329c7139k34509Q2646j53931a39096
19354a16280D1214a91955p3961g9066a5559k09179D7874b5470D4573K9890a48689
19342a72607j7008N5076D43413d41156J93526A08916c0790A12909i4033B2573
19331f1102q3241c3963H247J45045b11313a2464E0827a67607j08428J35464k03926
19320c44497g2038B18223b06581g5411k84285f8200j26775B66798A26699a65316
19309H2011J14365a39134A0189c9314D7875A2537h9935j14746B81885r3584a75575
19297a64227k7641A23226k955O6530e1833A8539d3073k67560A53384a91134A88302
$$ plain form
19285 -212144 60391 -120099 -154324 175545 -34500 -102939 154214 68894 -140424 -148033 -211056
19274 -211056 -2946 243943 151598 41440 128167 -327360 -131720 -191244 28416 -183984 -229635
19263 -229635 297491 52129 -260267 54762 -584883 -266140 76587 -21538 -151430 389024
19252 -44400 55369 46987 13443 -186019 -89821 -131285 -263808 -68694 245496 99370 290854
19241 290854 27558 -133091 979 276711 -196495 -173029 -162065 190487 110972 -74414 -8291
19229 -183482 -334978 1464 -301933 123868 315520 214893 181538 224784 -114216 -134985
19219 -134985 -101200 -53728 -179822 11980 -357741 31475 120661 -257539 -73414 -238325 165035
19207 -167783 47386 -59622 -162529 85221 -133611 -59786 -34517 -30878 -175310 124877 -224139
$$ packed form
19285b12144F0391a20099l4225A75545c4500o8439A54214F8894a40424p609o3023
19274b11056b946B43943r2345D1440Q6727c27360a31720n9524B8416a83984m5651
19263b29635B97491E2129b60267E4762e84883b66140G6587b1538j29892C89024
19252d4400E5369q382A3443a86019h9821m1464j32523f8694B45496I9370J91484
19241B90854B7558a33091I79K75732a96495K3466J0964A90487p9515g4414h291
19229a83482j51496A464c01933A23868J91652j00627l3355M3246a14216k0769
19219a34985L3785M7472j26094A1980c57741C1475Q9186b57539g3414j64911A65035
19207a67783D7386e9622j02907H5221a33611e9786K5269L639j44432A24877b24139
$$ plain form
19195 -133744 -259648 -200625 -102714 -88025 -81845 77841 -352495 -2943 -146997 32225 -47475
19183 -293567 124327 36196 130605 42958 -534298 -20324 -212897 -196018 -115375 -187490 -59083
19171 -65376 67483 -70053 -96645 -127196 -138031 -227363 -228017 -88908 -195596 -108212 84556 42796
19159 42796 -32261 138351 212517 -201606 -22604 181325 -150183 -251763 11343 -96970 -28782
19147 132918 60769 -3949 -501793 32597 109791 -177582 -86425 -37732 69768 330014 -141216
19135 148435 85827 -231552 -216543 196034 -337824 -63001 61865 -81546 -391810 69750 94135
19124 94135 -38825 -158122 -56170 -173599 24244 -50180 50744 256545 -17321 63834 123937
19113 123937 -147395 42317 -144262 -20263 83484 -1835 -26466 -191849 -210795 157776 94711
$$ packed form
19195a33744j25904N9023R7911J4689O180G7841c52495b943j44054C2225d7475
19183b93567A24327C6196R4409D2958e34298b0324j92573J6879Q0643p2115e9083
19171f5376F7483g0053k6592l0551j0835q9332o54h8908j06688Q7384H4556m1760
19159D2796c2261A38351P4166b01606b2604A81325a50183j01580A1343i6970b8782
19147A32918F0769c949m97844C2597P7194a77582h6425c7732F9768K60246a41216
19135A48435o2608b31552J5009A96034c37824f3001F1865h1546l10264F9750K4385
19124I4135c8825j19297e6170j17429B4244e0180E0744K05801a7321F3834O0103
19113A23937a47395D2317a44262b0263H3484a835k4631j65383j8946A57776o3065
$$ plain form
19102 94711 -17792 -211099 -13058 -69653 -227337 154520 -2257 13654 -490650 -157051 -230218
19091 -230218 145074 201249 18213 254786 -492031 -224315 204068 -83091 172809 30717
19080 104627 9662 -73985 -16047 229874 -255412 -48351 -288944 266246 -401451 -287005
19070 -287005 -187592 -203453 -19550 -160909 269707 54054 129986 33345 -155603 343348 76732
19058 -80906 113660 119778 -118610 -66620 198120 -201710 341860 -319684 9793 97378 -20927
19046 8679 36800 223681 -194784 -25312 -113869 -82091 -112145 -224065 -104518 47016 275130
19035 275130 -145650 -275701 -39216 210585 37588 -195978 20870 109971 -368751 -149799
19024 70144 51423 34577 68321 45767 48396 -55947 44374 -141301 -60549 -66076 95479 -253769
$$ packed form
19102I4711a7792j93307a3058n6595j57684A54520b257A3654d90650a57051p3167
19091b30218A45074N6175A8213K36573d92031b24315B04068h3091A72809C0717
19080A04627I662g3985a6047B29874b55412d8351k40593B66246d01451J14446
19070b87005R9413j5861a9550j41359B69707E4054P5932C3345a55603C43348G6732
19058h0906A13660O118a18610N1990A98120b01710C41860c19684I793Q7585b0927
19046H679K8121J86881a94784b5312q8557L1778l0054j11920a04518D7016K28114
19035B75130a45650j30051c9216B10585C7588a95978B0870Q9101c68751a49799
19024G0144j8721j6846L3744k2554K629e5947D4374a41301f0549n527I5479b53769
$$ plain form
19011 168934 -232024 -68606 -11938 228118 -366180 56107 197939 -95211 -275931 -35402
19000 234982 -100263 -29917 -4733 -264133 -48605 -22589 83942 131568 -40669 146217 71007
18988 177701 -220555 -243485 82482 137576 50125 -354194 203811 7310 -23681 -138355 -221114
18977 -221114 -135229 -10014 77513 -143582 -91538 -43769 -33581 124793 -73952 -35302 -235528
18966 -235528 -59965 -53056 -55952 89565 -9662 116922 28316 -173010 -107144 96701 -69493 -163553
18954 -163553 -79534 111070 204096 -17743 1208 -94348 -163869 107644 -34934 -90417 149514
18942 -52260 -65712 -100172 -66058 417822 114264 -85556 259128 228574 -22671 -277354 111115
18930 -94387 -376163 137761 -173039 155170 141254 -176760 -117528 3286 152155 -70285 -98105
$$ packed form
19011A68934b32024f8606a1938B28118c66180E6107J41832i5211j80720c5402
19000B34982a00263b9917d733k59400d8605b2589H3942M7626d0669A46217G1007
18988A77701b20555k2930H2482N5094E0125c54194B03811G310b3681j14674q2759
18977b21114Q5885a0014G7513a43582N2044d3769J0188A24793g3952c5302k00226
18966b35528e9965O909k896H9565i662A16922B8316a73010O5866I6701f9493r4060
18954a63553g9534A11070R3026a7743A208i4348o9521A07644c4934n5483A49514
18942e2260j3452l4460L4114D17822A14264h5556B59128l0554b2671k54683A11115
18930i4387k81776A37761a73039A55170j3916a76760N9232C286J48869g0285k7820
$$ plain form
18919 -98105 -39241 99315 -3466 175593 119572 101346 -143759 -334600 4837 177995 -144357
18907 171496 -687554 -17583 139975 -143002 179836 32774 -44524 -221077 -160911 -194980
18897 -194980 -253572 217125 97143 -24000 -394550 -342104 -258080 -118541 -106380 -303593 -454156
18886 -454156 -260844 -117628 -236185 121555 85601 14793 -293072 227427 79501 191837
18876 191837 102182 47068 73003 184299 57497 -407341 -28677 51082 36608 -88292 425661
18864 -179534 43434 -56908 -39626 -385220 -166754 44192 216774 -128130 140595 107289
18854 107289 -42977 -81478 -107109 199578 322266 -133885 144879 163523 -222276 7529 -78158
18842 -151461 -15796 96136 -352619 -137302 111060 12124 -36888 403254 -133255 -212366
$$ packed form
18919i8105c9241I9315c466A75593n6021j8226a43759j90841D837J73158a44357
18907A71496f87554a7583A39975a43002A79836C2774d4524j76553O0166l4069
18897a94980n8592B17125I7143b4000l70550N2446Q4024a18541J2161j97213j50563
18886d54156J93312a17628j18557A21555l5954A4793b93072B27427G9501J12336
18876A91837q9655D7068K5935J11296E7497d07341b8677E1082j4474h8292D25661
18864a79534D3434e6908J7282l45594a66754D4192J72582a28130A40595l3306
18854A07289d2977l8501k5631A99578J22688a33885A44879J8644b22276G529g8158
18842a51461a5796I6136c52619a37302A11060A2124c6888D03254a33255p9111
$$ plain form
18832 -212366 29012 253571 -277601 -220702 122128 -228481 94750 8877 145413 358572
18822 358572 26620 -1143 -37748 240138 206926 232655 129938 -300961 -40477 -84258 -169112
18811 -169112 180125 -73556 144901 46851 179893 503289 -68699 284718 -222244 72664
18800 -290806 -188282 52893 -96765 71817 -54741 -164242 213550 -222380 -181319 442095
18789 -3178 -17265 76966 -304014 -161817 165129 -144299 43177 -110512 -167830 30769 -109324
18777 -74896 -332545 146232 -51154 -306308 112743 -125932 -31501 -254864 90114 52713
18767 52713 73719 -356787 -188627 -12418 -305217 91402 -186135 -321221 -75637 -145120 128955
18755 49929 -86475 -343703 10668 27797 249164 -164471 222951 -132780 51935 -185592
$$ packed form
18832b12366B9012K24559b77601N6899A22128b28481I4750H877J36536K13159
18822C58572B6620a143l6605B40138l3212K5729j02717c00961d0477m3781q4854
18811a69112A80125g3556A44901D6851J33042L23396f8699B84718b22244G2664
18800b90806J02524E2893i6765G1817e4741j09501B13550b22380M1061D42095
18789c178j4087G6966c04014J42197A65129a44299D3177a10512n7318C0769a09324
18777g4896k57649A46232e1154k55154A12743a25932c1501k23363I0114l7401
18767E2713K1006c56787J68160a2418k92799I1402a86135j35086g5637o9483A28955
18755D9929h6475k57228A0668J7129K21367a64471B22951a32780E1935a85592
$$ plain form
18744 48687 -139559 -54306 -313242 -142662 -65495 18346 97967 195277 -113018 -172938 -311064
18733 -311064 11554 -177167 -113500 -68826 -99304 434231 -27655 -293338 -319568 -241463 354176
18721 93902 358310 -145918 -422352 -134056 104976 -368942 174766 -105506 117755 -150950
18710 -91458 -238434 -169307 -135436 -278053 34390 -245479 -120480 298366 24271 -213117
18699 -38584 -25755 -254647 117763 -25704 28524 -239149 -120721 -157070 -58612 13492 -197435
18687 -92290 204301 -132852 82788 95372 176516 -232489 -78193 -151613 65564 -198853 97540
18675 354367 -100320 -227223 145068 -247779 -127153 -23584 128368 24160 63358 -270086
18664 -206157 137140 -281304 -187873 89718 83284 41758 -343218 -7976 -93841 -202062 -106330
$$ packed form
18744D8687a39559e4306k58936a42662f5495A8346P9621R7310a13018n9920j38126
18733c11064A1554a77167O3667M4674l0478D34231b7655k65683k6230P8105C54176
18721I3902K64408a45918k76434a34056A04976c68942A74766a05506A17755a50950
18710i1458j46976O9127L3871j42617C4390b45479a20480B98366B4271b13117
18699c8584J2829k28892A17763b5704B8524b39149J18428l6349e8612A3492a97435
18687i2290B04301a32852H2788J2584Q1144b32489g8193p3420F5564a98853I7540
18675C54367a00320j26903A45068b47779J20626b3584A28368B4160L9198b70086
18664b06157A37140b81304R3431H9718o434m1526c43218g976q5865j08221R5732
$$ plain form
18653 -106330 35132 -90658 -285404 381068 90520 -290318 -32823 -66928 -257524 -61032 -251636
18642 -251636 123314 360328 75645 -118243 76056 2403 -37951 192533 -123981 -11430 -230193
18631 -230193 73910 -162790 -134071 -559787 252268 -15959 -51581 259922 -149222 90382
18620 -308647 159784 60742 126423 -458830 -144908 213026 -81583 38431 -239831 -70556
18609 44180 -352181 -146959 15318 68294 -137409 146148 76538 -82338 -93606 -123756 30611
18597 30030 252181 3585 -14424 -197340 -148399 175716 205299 -281898 164428 -201527 -151776
18586 -151776 83434 -24007 131766 -274279 -344818 161722 372076 32364 -146490 -287854
18576 -287854 -169908 -83344 -362614 -87414 46597 204170 171013 -90698 -213612 12230 11652
$$ packed form
18653a06330C5132i0658j94746C81068I0520b90318c2823l4105j90596f1032j90604
18642b51636A23314K37014G5645a18243G6056B403c7951A92533a23981a1430k18763
18631b30193G3910a62790K8719m25716B52268a5959l5622B59922a49222I0382
18620c08647A59784F0742O5681d58830a44908B13026h1583C8431b39831g0556
18609D4180c52181a46959A5318N2976a37409A46148o9610h2338j1268l0150C0611
18597C0030K22151C585a4424j82916M8941A75716K9583b81898A64428b01527M9751
18586a51776H3434b4007A31766b74279p0539A61722K10354C2364a46490j41364
18576b87854J17946h3344k79270h7414D6597J57573l3157i0698j22914A2230n78
$$ plain form
18565 11652 29025 36277 -22429 -146354 -13248 -103432 -208577 69388 -4985 -270843 56908
18553 -136482 -79728 -132205 -378672 89327 -134924 -358611 140410 -151912 -90122 45694
18542 83069 209137 -49715 55136 -307381 -126548 280896 126523 5379 193073 -293809
18531 367361 101454 -44130 91556 -241664 91852 114649 86719 -89486 -89672 -106461 80477
18519 -43730 -92361 299075 -54559 206744 4079 -171598 112290 276663 -232370 -150223 -147940
18508 -147940 -214826 126643 -394801 -42162 -102682 -245493 70010 -310145 24224 -346199
18497 -49465 46580 -149943 88730 27184 -213959 90594 -4591 115937 -203264 -6540 -188337
18486 -188337 -74286 1283 -108661 -265592 238095 89527 -444908 -63406 -177700 -279170
$$ packed form
18565A1652J7373P252b2429j23925a3248r0184j05145F9388d985k65858E6908
18553a36482N6754n2477k46467H9327a34924k23687A40410a51912O1790D5694
18542H3069J26068d9715E5136c07381a26548B80896A26523E379J87694b93809
18531C67361A01454d4130I1556b41664I1852K2797k7930h9486j86j6789H0477
18519d3730m8631B99075e4559B06744D079a71598A12290J64373b32370Q2147K283
18508a47940o6886A26643c94801d2162o0520j42811G0010c10145B4224c46199
18497d9465D6580a49943H8730B7184b13959I0594d591A15937b03264f540j81797
18486a88337g4286A283a08661j56931B38095H9527d44908f3406j14294j01470
$$ plain form
18476 -279170 -114243 -58126 -171599 -131650 -215982 -265712 -41684 4938 14052 -11833 182023
18464 -276653 209239 83224 -243980 -133235 163551 -247789 42318 160804 56849 -15821
18453 370549 -71466 -221113 -275818 200656 152455 -12707 -344440 -56662 71995 -62621 91042
18441 165190 105530 -104264 -56398 -188349 -29856 -76019 -184897 -9897 -65754 96429 -113331
18429 326604 5529 -232264 -28615 151105 -100749 -458535 114602 43032 -107133 104076
18418 414877 -57030 -147749 -21311 -146122 -149372 5252 -51749 -41354 -30475 159232 63071
18406 -16292 -359459 175952 -52050 79726 154545 -139806 -187305 -58876 253436 -262158 24132
18394 -39030 -66116 168145 -261111 -51665 212571 -101989 -12841 51133 -48533 -262524 -106738
$$ packed form
18476b79170a14243N6117j13473L9949q4332m9730d1684D938R114a1833A82023
18464b76653B09239H3224b43980J10745A63551b47789D2318J18486E6849a5821
18453C70549g1466j49647n4705B00656m8201a2707l31733e6662G1995f2621I1042
18441A65190n9660a04264M7866j31951b9856m6163j08878i897n5857I6429a13331
18429C26604E529b32264b8615A51105a00749l57786A14602D3032a07133A04076
18418D14877e7030r0719b1311j24811l250E252e1749J0395J0879A59232F3071
18406a6292l43167A75952e2050G9726P4819a39806m7499e8876B53436b62158B4132
18394c9030k7086A68145b61111e1665B12571a01989a2841E1133d8533k13991a06738
$$ plain form
18382 -330364 -384556 -191662 -120868 -370697 128122 -21531 -49194 -325182 61907 -211930
18371 102453 232687 -95844 86747 245157 -119286 120439 76205 75752 -44759 96604 -43351
18359 6490 -70679 -59637 -202307 -148061 -144359 -268272 30401 -76299 30508 -99140 -81066 -28734
18346 9208 -271329 -54457 -85850 -30343 24194 -318333 320229 16452 72421 -114135 -213163
18335 -213163 49384 295035 94874 -64580 423242 -85528 -603 -223695 41040 -206880 259997
18323 -343554 238428 124865 -176837 35596 -74740 41023 -80718 -144378 -235897 2354 143056
18312 143056 -34565 -182979 -78777 -326918 241578 80802 -67317 166342 54476 179452
18302 179452 -107337 -10735 291075 44743 6234 187242 -84916 48753 82768 -44110 7775
$$ packed form
18382c30364n4192a91662P0794k49829A28122b1531k7663k75988F1907b11930
18371A02453J30234i5844H6747J58410a19286A20439m4234m53d4759I6604d3351
18359F490g0679J1042j42670N4246L702j23913C0401g6299C0508i9140J8074b8734
18346I208b71329e4457l1393c0343B4194c18333C20229A6452N5969a14135r9028
18335b13163D9384K45651I4874f4580D23242h5528f03k23092D1040b06880B59997
18323c43554B38428j13563a76837C5596g4740D1023h0718o3660r1519B354J40702
18312A43056c4565j48414g8777k48141B41578H0802f7317A66342E4476J24976
18302A79452a07337a0735B91075D4743F234J81008h4916D8753L4015d4110G775
$$ plain form
18290 -2289 -238324 -129929 -245632 -99051 126478 47976 -50131 -70276 -193704 224044 -190590
18278 61452 72794 -164749 -284649 -107303 -340221 -218660 -30046 -140271 18943 -163235
18267 225478 29400 196053 20609 55663 58661 -1974 119142 -125840 -181486 386464 -513476
18255 122654 -83705 47722 188453 -266109 -198456 24738 404397 227189 226915 28749 -97233
18243 137582 -347372 256259 -176087 -3429 -4548 -39050 -85402 -132678 21003 -342198 5048
18231 -80509 211475 -22938 -151935 9178 139438 -169519 -51178 165606 -39407 294968 198244
18220 198244 274734 16814 -29456 -236088 49440 -295080 -174351 354757 -66351 -112761 -72736
18209 -72736 -340705 -98117 140848 -237518 387623 87882 85949 -47167 49672 -361843 301440
$$ packed form
18290b289k36035J08395j15703i9051A26478D7976e0131k0145j23428B24044a90590
18278F1452J1342a64749j19900a07303k32918J21561c0046j10225A8943a63235
18267B25478B9400J66653B0609L5054K998a974A19142a25840n5646C86464e13476
18255A22654h3705D7722J40731b66109O7653B4738L79659j77208k74B8749i7233
18243A37582c47372B56259a76087c429j119l4502m6352m7276B1003c42198E048
18231h0509B11475b2938j28997I178J30260a69519e1178A65606c9407B94968r6724
18220A98244P6490A6814b9456k06632D9440b95080J20729C54757f6351m6410M0025
18209g2736k67969i8117A40848b37518C87623H7882j933d7167D9672c61843C01440
$$ plain form
18197 -186220 157425 47692 3900 -269629 -100281 93052 -67998 -92029 -212908 -189114 -286014
18186 -286014 -142538 23036 -57566 -66524 -76680 -237107 -205510 242795 31139 -40240 -124246
18175 -124246 -141551 -125397 -23487 -270472 41245 -186014 -227951 -143027 -436579 -39954 -64404
18164 -64404 45856 113773 284167 -142279 -386585 -91203 -343 44812 145240 123243 -109772
18152 448927 245031 -165288 -55769 210 -205789 -192416 185842 -338146 148052 -139258
18141 -41724 31116 -1161 -255179 -157085 63736 131736 -248386 177399 248607 -77314 -11084
18129 -149269 -37714 121128 -145447 -130104 -243946 -316016 -226442 219249 132354 14817 -208905
18117 -143149 184334 -22733 69724 54548 -212872 -28268 49298 74059 65190 -118936 45395
$$ packed form
18197a86220A57425D7692C900b69629a00281I3052f7998k4031j20879K3794r6900
18186b86014a42538B3036e7566q958j0156j60427L1597B42795C1139d0240q4006
18175a24246j7305J6154b3487k46985D1245a86014m1937Q4924k93552c9954k4450
18164f4404D5856O7917J70394a42279k44306i1203c43D4812J00428k1997a09772
18152D48927k03896a65288e5769B10b05789J3373A85842c38146A48052a39258
18141d1724C1116a161k54018R8094F3736O8000b48386A77399P1208g7314a1084
18129a49269c7714A21128a45447J5343j13842p2070Q9574B19249q6895A4817b08905
18117a43149A84334b2733F9724j5176b12872b8268D9298K4761q869a18936D5395
$$ plain form
18105 -146922 -35424 -17497 32900 -53359 -63249 117543 304259 750 305770 -78322 212787
18093 -77011 150675 85102 -132761 -105936 -25601 9758 -282232 -136366 -316287 103941 -1485
18081 151785 -22513 -57915 21106 120584 -79919 -97030 -112204 -65713 160271 209885 -1081
18069 -373441 -29789 -109645 -135600 176283 -362231 -93267 211220 -61203 -124328 -330766 139037
18057 6092 168591 -26382 -8329 157604 104933 -69356 43129 -150997 -66959 24697 -62027
18045 -148656 -59828 -80124 -172119 -177067 169865 203607 148984 -70277 -306188 91943 -127466
18033 20665 38546 -58981 -99094 107261 -27929 231237 -282551 -361231 -263647 -463 252394
18021 -47858 -173493 131557 -57506 -241510 289475 -81951 81096 -53356 -41025 -198996 277247
$$ packed form
18105a46922c5424a7497C2900e3359r890A17543J86716G50L05020g8322B12787
18093g7011A50675o5573a32761K6825b5601I758b82232a36366j79921A03941a485
18081A51785b2513l5402B1106R9478g9919j7111j5174M6491A60271M9614a081
18069c73441b9789p9856k5955A76283c62231i3267B11220f1203o3125k06438A39037
18057F092J62499b6382h329A57604n2671f9356D3129a50997f6959B4697f2027
18045a48656e9828k0296r1995m948A69865L3742n4623g0277k35911I1943a27466
18033B0665J7881e8981m0113A07261b7929B31237b82551p8680R7584d63B52394
18021d7858j25635A31557e7506j84004B89475h1951H1096e3356J2331j57971B77247
$$ plain form
18009 -64617 59258 -170417 -166038 -284420 -162792 79004 -89263 311911 -331598 108236 331987
17998 331987 128448 262618 234726 287485 296098 218309 95019 167594 -239643 -203271 -82584
17986 75643 -243897 25245 16713 12729 -17977 -316325 59831 -25858 -26974 -71928 -123569 -7882
17973 -198794 -3994 -54188 -112987 221777 18497 -1939 -28458 124591 -135175 151527 -221860
17961 181556 301108 -80060 -339494 190252 145873 -150880 -273673 -123248 -37504 261368
17950 -4821 -156602 -42743 183839 101483 206766 160974 -159274 -28647 145263 -224666 -14362
17938 26669 106740 -88853 -181392 -295745 -27336 263809 -141347 -51688 245966 -345893 -121589
17926 -460914 41273 -342262 -152330 111194 -60066 123504 -319343 65648 187723 243906
$$ packed form
18009f4617E9258a70417M379j18382J21628G9004h9263C11911c31598A08236K23751
17998C31987A28448J34170k7892N2759Q613p7789I5019P2575b39643L6372h2584
17986G5643b43897B5245q532l984a7977k98348E9831b5858j116m4954n1641g882
17973a98794c994n0194n8799B21777A8497a939k6519A24591a35175A51527b21860
17961A81556J19552h0060k59434A90252m4379a50880j22793a23248c7504B61368
17950d821j51781d2743A83839q2356J05283m5792a59274b8647A45263b24666a4362
17938B6669Q0071h8853r2539j14353b7336B63809a41347e1688B45966c45893a21589
17926d60914D1273c42262a52330A11194f0066A23504c19343F5648J22075N6183
$$ plain form
17916 243906 76057 -228696 -17318 101766 124326 292617 278675 -60077 102463 28842 147840
17905 147840 96295 64603 79448 -67242 19046 -229341 -243522 -328463 -127604 -291857 141861
17893 377646 206509 68727 161607 -146572 -156205 -158232 -365984 123598 10351 140765 -268632
17881 307449 -184666 194459 -265096 129042 -184993 67253 163821 -111282 -349250 103536
17870 79543 242956 -129875 68726 6868 -235016 108845 212386 -261584 -189844 -27457 173082
17858 -49877 -329907 -36918 112056 -61202 531973 -310231 -68047 -143188 115678 121137 -282098
17846 186130 -76186 -113519 71488 325340 -44934 -118388 -402898 49892 98434 -336971 -7956
17834 79666 122525 281621 36483 69898 -48366 18542 -178940 -313893 -104134 22447 -159459
$$ packed form
17916B43906G6057b28696a7318A01766K2560J68291j3942f0077A02463B8842J18998
17905A47840n1545l1692J4845f7242A9046b29341j4181q4941a27604j64253A41861
17893C77646j71137F8727R2880a46572r633k027k07752A23598A0351J30414b68632
17881C07449a84666A94459b65096A29042a84993F7253R6568a11282k37968A03536
17870G9543J63413a29875F8726F868b35016A08845J03541b61584P1740b7457A73082
17858d9877k80030c6918A12056f1202E31973c10231f8047p5141A15678N459b82098
17846A86130g6186l7333G1488K53852d4934p3454k84510D9892M8542c36971g956
17834G9666M2859J59096C6483L3415d8366A8542a78940j34953a04134B2447a59459
$$ plain form
17822 -289540 -236350 112887 30186 38027 137062 25233 -30808 60809 -138249 186262 25167
17810 -99015 32685 -270517 -98439 88599 -65346 -66408 -23011 222469 84908 -28051 242203
17798 57442 -504119 -155532 127914 -27573 399820 -172049 71965 75103 -23896 168787 -61034
17786 168204 -52397 61916 -175107 -79491 72844 219827 -85034 527504 -214149 -251538 -75268
17774 167714 126594 -90090 -177693 74224 9896 180973 -62251 -61687 97732 -524 58105 -30111
17761 -103363 -97067 36335 108191 262947 -134664 122474 216560 23767 6524 117940 -128809
17749 -251063 76374 -2525 102698 -40563 93024 139005 5577 -85896 -50926 218114 -78918
17737 -85587 83938 72384 67082 -33847 -93902 53915 -103072 177423 -200577 -262801 108705
$$ packed form
17822b89540N3190A12887C0186P841R9035B5233c0808F0809a38249A86262B5167
17810i9015C2685b70517i8439H8599f5346j062b3011B22469H4908b8051B42203
17798E7442e04119a55532A27914b7573C99820a72049G1965L138b3896A68787f1034
17786A68204e2397F1916a75107g9491G2844J46983h5034E27504b14149l7389g5268
17774A67714m1120i0090q7603G4224I896J71077f2251N64I7732e24E8105c0111
17761a03363O296C6335P1856J54756a34664A22474R4086B3767F524J11416a28809
17749b51063G6374b525A02698d0563I3024M5981E577h5896L4970B18114g8918
17737h5587H3938j1554n302c3847o0055E3915a03072A77423b00577o2224A08705
$$ plain form
17725 -85126 -74282 -130240 -171315 192377 -14106 181103 75137 -11250 -58767 84068 -92545
17713 367737 -288795 -239616 107474 -117387 -17068 -135790 98886 -218438 20017 -59275
17702 103917 63031 -6514 141565 136667 -12192 147412 -161512 172796 -211542 124424 375019
17691 375019 -124709 -110437 257032 -171291 360401 63011 76023 254943 -72033 87267
17680 -256370 -328772 -71869 2413 114825 -23634 23838 317583 19943 -270823 -200929 -23539
17668 -49222 51349 120326 -253476 256947 68983 -129859 207869 -19663 -109151 325415 16276
17656 -73260 169854 229904 262317 33867 -16136 223705 38590 -177845 72872 -5555 233211
17644 -173497 141192 -170422 49332 -8459 67845 187215 37867 -108785 97723 -47000 440913
$$ packed form
17725h5126J0844n5958m1075A92377a4106A81103G5137a1250m7517H4068i2545
17713C67737b88795M9179A07474a17387a7068j18722I8886b18438B0017e9275
17702A03917m0886f514A41565m898a2192A47412a61512A72796b11542A24424K50595
17691C75019a24709J4272B57032a71291C60401F3011J3012J78920g2033H7267
17680b56370p2402g1869B413J12412b3634B3838K93745A9943b70823O9894b3539
17668d9222E1349O8977b53476B56947F8983a29859B07869a9663q9488C25415A6276
17656g3260A69854O0050L2413C3867a6136B23705C8590a77845G2872e555B33211
17644a73497A41192a70422D9332h459F7845J19370C7867a08785I7723d7000D40913
$$ plain form
17632 -374025 377509 309819 162145 192791 269607 228139 206485 -38971 -104981 154843 168657
17621 168657 115225 -10783 118102 293972 218387 193957 357950 101228 256191 35703
17610 27691 -44166 -25292 166087 -62696 -209027 -86549 -117347 37057 317993 -263436 -137205
17599 -137205 -138345 -55496 118618 -3574 -71518 23424 201159 -13404 -115793 -52140 144142
17587 -6114 286492 328178 87416 323272 -104303 41697 147136 -476926 -7566 105956 209090
17576 209090 -2546 -1233 -119436 97636 -232555 -120329 -16529 -281919 176799 158349 -84247
17564 -10015 135929 266665 -211770 -341041 40150 157296 439583 221347 148520 230122
17554 230122 -23928 70500 21825 -31856 -206764 270693 155329 -70812 142632 -43858 -239553
$$ packed form
17632c74025C77509o7690j47674L0646P6816m1468k1654c8971o6010A54843J3814
17621A68657n3432a0783A18102J75870p5585k4430J63993A01228J54963C5703
17610B7691d4166J8874A66087f2696j46331h6549l0798C7057K80936b63436J26231
17599a37205j140e5496A18618c574o7944B3424J77735a3404j02389e2140A44142
17587f114B86492M1686H7416K35856a04303D1697J05439d76926g566A05956J03134
17576B09090b546a233j18203I7636b32555J12226a6529k65390A76799j8450h4247
17564a0015A35929J30736b11770j29271D0150J17146K82287k18236p2827Q1602
17554B30122b3928G0500B1825c1856j74908B70693j15364g0812A42632d3858j95695
$$ plain form
17543 -239553 -281944 -27602 -35424 92585 -379123 -71754 7628 -166061 -78040 -227871 190193
17531 199436 -68402 301987 -85379 209546 272062 -211035 19052 -78748 280436 271175 -101773
17519 211519 3477 -67854 213020 -264627 286807 307732 159466 -147541 373867 302733
17509 302733 128279 203823 165211 191171 81981 -42484 -42523 100270 25339 356471 -52266
17497 2420 114607 230661 156048 -110792 -62387 116052 16693 238725 192125 -47190 587027
17485 3936 245118 130280 222057 285537 392728 169379 366009 274816 233449 187413 288624
17474 288624 132331 6010 91256 204566 -161660 99099 74301 155238 6446 -6147 7929 -219974
17461 189634 157208 265464 149721 44520 107943 59609 225009 33421 355888 76346 66633
$$ packed form
17543b39553m2391b7602p822I2585c79123g1754G628a66061g8040j49831A90193
17531A99436f8402C01987h5379B09546O2516b11035A9052g8748B80436r261a01773
17519B11519C477f7854B13020b64627B86807K0925j48266a47541C73867p1134
17509C02733A28279P5544l8612K5960H1981d2484l9A00270B5339L31132e2266
17497B420J12187J16054p4613a10792M8405A16052A6693K22032m6600d7190E87027
17485C936K41182j14838R1777O3480J07191A69379J96630r1193m1367m6036J01211
17474B88624A32331F010Q5246J13310a61660I9099k4798Q0937F446f147G929b19974
17461A89634l2426J08256j15743D4520O3423m8334J65400C3421L22467G6346r713
$$ plain form
17450 66633 -199467 103846 227774 52132 148372 347849 252640 355222 56001 202576
17440 202576 98822 389217 210191 -252468 236594 292951 222464 295591 107589 128989
17430 128989 242224 239744 273671 -5723 106342 240583 259665 206464 129038 343320 157947
17418 170620 156012 151946 20329 166448 249402 264211 -16057 379657 148528 383864 174260
17406 98865 134116 2702 206413 -17080 6176 113166 253323 198978 128546 2220 182225
17395 182225 125413 256284 -235771 216963 408181 79743 22746 380952 -105009 2039
17384 -51870 208324 -10912 -59652 30274 85646 -177096 332300 125822 -65632 -135967 -55030
17372 35872 -151902 313844 122207 58718 355371 220110 313453 258336 -182411 -1759 590460
$$ packed form
17450F6633a99467A03846J23928E2132R6240J99477r5209J02582E6001J46575
17440B02576I8822K90395j79026b52468B36594N6357p0487P3127A07589K1400
17430A28989J13235k480L3927e723A06342J34241J9082n3201p7426K14282A57947
17418A70620j4608m066B0329J46119Q2954J4809a6057C79657A48528K35336A74260
17406I8865L5251B702K03711a7080F176J06990J40157n4345p0432B220J80005
17395A82225n6812J30871b35771B16963J91218G9743B2746L58206a05009B039
17384e1870B08324a0912m8740C0274N5372a77096C32300A25822f5632p0335e5030
17372C5872a51902C13844A22207E8718K96653j35261R3343n5117a82411a759E90460
$$ plain form
17360 500884 -109494 129540 261093 92347 200089 109068 194325 4484 -188285 143894
17349 59000 328968 22453 61359 -80818 44022 -104722 287233 69014 1739 225054 249490
17338 249490 88332 111089 -67351 153396 29718 198718 278867 304538 488028 238813 67053
17326 336263 204076 443073 305331 268071 133293 308094 235273 66133 266799 -156469
17315 -175425 -92211 19426 76289 347316 148007 -48375 -240235 205733 174056 158925 220576
17304 220576 430400 72494 -203166 186105 129802 89790 229188 84537 306961 -233314
17293 102794 71229 261541 7658 97393 167120 71297 67260 139445 430744 257898 166545
17282 166545 480129 99895 241004 227070 234389 365616 96818 221141 9257 -310948 23201
$$ packed form
17360E00884a09494A29540J31553I2347J07742r1021Q5257D484a88285A43894
17349E9000K69968B2453L8906h0818D4022a04722B87233F9014A739K23315K4436
17338B49490H8332K2757f7351A53396B9718J69000Q0149K5671J83490B38813F7053
17326C36263j32187K38997j37742l7260A33293J74801p2821F6133K00666a56469
17315a75425Q3214A9426N6863K71027A48007d8375j91860B05733l1677j5131O1651
17304B20576K09824G2494b03166A86105n6303m0012J39398H4537K22424b33314
17293A02794l1565J90312G658Q9735O9727G1297m037P2185K91299j72846r1353
17282A66545L13584I9895J41109j3934P319J31227I6818J24323I257c10948B3201
$$ plain form
17270 175086 362961 188453 241781 1582 21792 194188 324478 17101 440820 -156373
17259 24010 337937 -82932 404649 594587 170301 383979 28554 -78806 30830 207751
17249 207751 70508 63750 133227 51036 -19677 158051 216829 187136 88850 194421 -34024
17237 95608 99584 323034 152358 173594 -53392 113430 61126 1719 -1394 406684 372231
17226 372231 180838 279669 329787 -20377 19506 110675 383971 287132 161474 -33943 213527
17214 551413 363219 135476 -205763 -48473 205362 -19578 480808 256386 22238 156790
17204 156790 216593 107922 266087 192777 202106 387134 170049 262590 331690 181448 17238
17192 -43347 -69905 105729 72947 212751 52641 168030 55338 224171 -125422 168868
$$ packed form
17270A75086J87875j74508N3328A582K0210J72396J30290A7101M23719a56373
17259B4010L13927h2932D04649J89938A70301K13678B8554g8806C0830J76921
17249B07751G0508o758O9477E1036a9677A58051N8778k9693H8850J05571c4024
17237I5608L976K23450A52358K1236e3392A13430n2304A719a394D06684l4453
17226C72231A80838R8831N0118b0377A9506R1169K73296r6839j25658c3943B13527
17214E51413j88194A35476b05763d8473B05362a9578D80808k24422B2238J34552
17204A56790N9803A07922J58165p3310R329J85028A70049R2541O9100j50242A7238
17192d3347k6558A05729l2782J39804E2641J15389E5338J68833a25422A68868
$$ plain form
17181 197549 160803 292608 340827 168725 298671 59077 282699 149040 205041 225331
17171 225331 194173 361648 264320 392519 457021 504531 368387 397761 324883 288263 294673
17160 294673 549348 -77063 449107 245188 227813 243105 238507 94791 326671 59664 353225
17149 353225 143000 210184 288277 677342 344363 235550 385026 181627 438522 498097
17139 498097 252755 373541 -73999 44426 361045 29239 497927 331765 108432 363071
17129 363071 279781 334966 45462 84793 -44133 196164 679491 178702 631989 83339 449135
17118 449135 237903 -94228 18626 50573 192143 214735 569126 278238 116039 -64644
17107 380645 161037 372999 378047 475544 352743 355299 243856 414210 313322 480203
$$ packed form
17181A97549l6746J31805M8219A68725J29946E9077K23622j33659N6001K0290
17171B25331l1158J67475r7328J28199O4502M7510j36144K9374p2878l6620O410
17160B94673K54675g7063D49107k03919j7375J5292m598I4791K31880E9664K93561
17149C53225A43000O7184P8093L89065l32979j08813J49476A81627K56895N9575
17139D98097k45342J20786g3999D4426L16619B9239M68688j66162A08432K54639
17129C63071q3290N5185D5462L9331d4133A96164M83327A78702M53287H3339L65796
17118D49135k11232i4228A8626L1947J41570K2592L54391B78238A16039f4644
17107C80645A61037K11962N048R7497j22801K556j11443J70354j00888J66881
$$ plain form
17097 480203 400849 630355 349329 75574 388733 281442 242474 485575 66965 394400
17087 394400 446949 433702 570852 470613 632047 251583 485664 367684 696376 245962
17076 337481 366049 569558 404143 490592 293008 -92578 305564 264107 411973 450440
17066 450440 468752 344807 670145 261995 327153 481900 374592 428535 -22638 508663
17055 352504 555937 761631 276639 575583 222705 55279 557125 356245 824138 494123
17045 494123 386963 607016 608375 431239 449532 377124 472768 910455 505753 382329
17035 382329 219826 671721 474076 589986 639903 438949 583567 544992 558084 596872
17025 596872 574302 605626 566638 659910 580023 745269 350522 513122 877928 695721
$$ packed form
17097D80203p9354K29506k81026G5574L13159j07291l8968K43101F6965L27435
17087C94400N2549j3247J37150j00239J61434B51583K34081j17980L28692B45962
17076C37481K8568K03509j65415Q6449j97584i2578C05564m1457J47866L8467
17066D50440J8312j23945L25338B61995O5158J54747j07308N3943b2638E08663
17055C52504K03433K05694B76639K98944B22705E5279N01846k00880M67893l30015
17045D94123j07160K20053J359j77136J8293p2408R5644M37687m04702j23424
17035C82329j62503M51895j97645J15910M9917k00954J44618l8575J3092L8788
17025E96872k2570L1324l8988R3272p9887J65246C50522J62600L64806j82207
$$ plain form
17015 695721 402198 888980 344323 448123 583816 636696 593583 462605 706210 988227
17005 988227 533720 484774 732152 704546 599048 685016 716999 585817 564740 498328 607782
16994 607782 640192 900019 778245 910464 207210 644295 837260 1001505 653384 550333
16984 550333 838474 459638 512138 1022411 538143 840866 689307 776361 413870 669625
16974 669625 642462 1011009 669445 989244 520202 855876 992190 694774 1114653 588808
16964 588808 818013 854394 908771 908341 831029 922317 803665 963034 1131578 728833 1101656
16953 1101656 1138136 986662 677214 873964 914791 1100018 1047599 879957 1151490 865465
16943 865465 943429 1237040 1034616 1229173 1175882 963765 733966 1133059 912697 1211482
$$ packed form
17015F95721k93523M86782C44323J03800J35693N2880m3113j30978K43605K82017
17005I88227m54507m8946K47378k7606j05498Q5968L1983j31182k1077o6412J09454
16994F07782L2410K59827j21774J32219B07210M37085J92965J64245l48121j03051
16984E50333K88141l78836N2500N10273m84268L02723j51559Q7054l62491K55755
16974F69625k7163L68547l41564L19799m69042L35674J36314k97416M19879n25845
16964E88808K29205L6381N4377m30p7312R1288j18652J59369J68544m02745L72823
16953A101656L6480j51474l09448J96750M0827J85227n2419j67642K71533k86025
16943H65465P7964K93611k02424J94557n3291k12117k29799L99093k20362K98785
$$ plain form
16933 1211482 960543 977627 984784 944070 1205044 1022589 1176847 1204857 1215990 1381211
16923 1381211 977739 1194067 1184825 1437236 1097112 1319925 1101510 1303681 1422110 1622043
16913 1622043 1244976 1566043 1455717 1243258 1452126 1587085 1349340 1494723 1381153
16904 1381153 1773217 1802467 1774208 1528835 1800505 1765029 1458980 1620530 1684427 1477896
16894 1477896 1682369 1782235 1706879 1839020 1347516 1926449 1623152 1967388 1736402 1823659
16884 1823659 1853113 1681859 2147564 1815344 2035951 2075891 1971688 2345926 1842669 2091284
16874 2091284 2035734 2170443 1914237 2412791 2216309 2509336 2238305 2634769 2353894 2336268
16864 2336268 2565904 2420882 2687434 2448185 2711234 2380068 2738071 2609997 2790000
$$ packed form
16933A211482k50939J7084P157m0714K60974j82455J54258K8010J1133J65221
16923A381211m03472K16328r242K52411l40124K22813k18415K02171J18429J99933
16913A622043l77067L21067j10326k12459K08868J34959k37745J45383j13570
16904A381153L92064K9250k8259k45373K71670l5476l06049J61550O3897k06531
16894A477896K04473R9866p5356J32141m91504N78933l03297L44236k30986Q7257
16884A823659K9454j71254M65705l32220K20607L9940j04203L74238n03257K48615
16874B091284n5550J34709k56206M98554j96482K93027k71031L96464k80875j7626
16864B336268K29636j45022K66552k39249K63049l31166L58003j28074J80003
$$ plain form
16855 2790000 2670389 2906792 2731106 3028207 2758470 3125845 2983752 3172892 3003109
16846 3003109 3377710 3006117 3393502 3189778 3476639 3707098 3418704 3420865 3433330 3640102
16836 3640102 3653796 3501904 3443329 3747072 4003820 4038000 4496368 4305157 4056211 4371190
16826 4371190 4297530 4428746 4595351 4789017 4784816 4816702 4826813 5092245 5310093 5014999
16816 5014999 5597676 5336295 5722479 5649626 5665052 5437491 5923370 5974515 6204112 6084953
16806 6084953 6617066 6479322 7019451 6679071 6948766 7147403 7124536 7564653 7319917 7883080
16796 7883080 8001990 8297500 8296404 8783553 8932331 8731081 9492030 9448525 10107825 9879515
16786 9879515 10462487 10223278 10438383 11293457 11611572 11645492 12159211 12749969 13064444 13263916
$$ packed form
16855B790000j19611K36403j75686K97101k69737L67375j42093J89140j69783
16846C003109L74601l71593L87385k03724K86861K30459k88394K161J2465K06772
16836C640102J3694j51892n8575L03743K56748L4180M58368j91211k48946L14979
16826D371190p3660J31216J66605J93666m201L1886J0111K65432K17848k95094
16816E014999N82677k61381L86184p2853J5426k27561M85879N1145K29597j19159
16806F084953N32113j37744N40129l40380K69695J98637k2867M40117k44736N63163
16796G883080J18910K95510j096M87149J48778k01250P60949m3505O59300k28310
16786I879515N82972k39209K15105Q55074L18115L3920N13719N90758L14475J99472
$$ plain form
16776 13263916 13706166 14057361 14650385 14910128 15020849 16203335 16259371 17148652 17750171
16767 17750171 18464644 18899049 19551862 20311946 21075700 22291014 22511098 23490605 24750167
16758 24750167 25407266 26303519 28113552 29304187 30324606 31665197 33114232 34562709
16750 34562709 36132041 37845346 39863906 42228652 44375486 46305761 48757008 51036287
16742 51036287 54247344 57107161 60624824 63903146 67606550 71718813 75579449 80083407
16734 80083407 84644012 89593321 95058733 100335888 106535867 112520997 119040806 125193723
16726 125193723 131732385 138166815 144375742 150121256 155555579 160230704 164324225 167538151
16718 167538151 170019985 171087074 171174139 170229894 167668882 164680870 160389668 155759054
$$ packed form
16776A3263916M42250L51195N93024K59743J10721J182486N6036Q89281O01519
16767A7750171P14473M34405O52813P60084P63754J215314K20084R79507J259562
16758B4750167O57099Q96253J810033J190635J020419J340591J449035J448477
16750C4562709J569332J713305K018560K364746K146834J930275K451247K279279
16742E1036287L211057K859817L517663L278322L703404M112263L860636M503958
16734H0083407M560605M949309N465412N277155O199979N985130O519809O152917
16726A25193723O538662O434430O208927N745514N434323M675125M093521L213926
16718A67538151K481834J067089Q7065r44245k561012k988012m291202m630614
$$ plain form
16710 155759054 150104288 144423001 137920717 131452150 124955802 118714476 112044913 106190942
16702 106190942 100164516 94716642 89147047 84015396 78822329 74883905 70545426 66416169
16694 66416169 62441220 59044477 55983767 52808841 50307225 47556216 45429323 42895972
16686 42895972 40846002 38509332 37049535 35286939 33207702 31881554 30227581 29065956
16678 29065956 27859042 26428418 25391274 24314865 23478814 22242813 21541301 20702852
16670 20702852 20103356 18884696 18339993 17866654 17161270 16179925 15928276 15469830 14578458
16661 14578458 14208367 14000892 13386382 13097347 12225981 11961078 11862916 11165768 10709711
16652 10709711 10595352 10277218 9944665 9625590 9512016 9061682 8955427 8835898 8454540
$$ packed form
16710A55759054n654766n681287o502284o468567o496348o241326o669563n853971
16702A06190942o026426n447874n569595n131651n193067l938424m338479m129257
16694F6416169l974949l396743l060710l174926k501616k751009k126893k533351
16686D2895972k049970k336670j459797j762596k079237j326148j653973j161625
16678B9065956j206914j430624j037144j076409q36051j236001p01512q38449
16670B0702852n99496j218660n44703m73339p05384r81345k51649m58446q91372
16661A4578458l70091k07475o14510k89035q71366k64903r8162o97148m56057
16652A0709711j14359l18134l32553l19075j13574m50334j06255j19529l81358
$$ plain form
16643 8454540 8373729 7613505 7675369 7764620 7705761 6998363 6988451 7366113 6652588 6252293
16633 6252293 6348635 6317367 6531694 5923308 5761330 5733502 5616180 5310679 4875464 5364740
16623 5364740 5088375 4946795 4835261 4651025 4663806 4778200 4529354 4923111 4377581 4293552
16613 4293552 4264978 4185278 4051429 3966117 3930156 4044213 3617397 3535774 3449414 3476356 3431521
16602 3431521 3492876 3266105 3102227 3217268 3222662 3065618 3030316 2858813 2816978 2723582
16592 2723582 2641761 2943040 2737722 2576676 2205898 2617171 2774015 2652331 2268979 2397306
16582 2397306 2444225 2130573 2305285 2178763 2305858 2351167 1959523 2285735 2031932 2172057
16572 2172057 2295831 1955283 2013688 2102982 2017027 1938788 2034960 1830870 1563273 1745700
$$ packed form
16643H454540q0811p60224O1864Q9251n8859p07398r912L77662p13525m00295
16633F252293R6342l1268K14327o08386j61978k7828j17322l05501m35215M89276
16623E364740k76365j41580j11534j84236J2781J14394k48846L93757n45530q4029
16613D293552k8574p9700j33849q5312l5961J14057m26816q1623q6360K6942m4835
16602C431521O1355k26771j63878J15041N394j57044l5302j71503m1835r3396
16592B723582q1821L01279k05318j61046l70778M11273J56844j21684l83352J28327
16582B397306M6919l13652J74712j26522J27095M5309l91644L26212k53803J40125
16572B172057J23774l40548N8405Q9294q5955p8239R6172k04090k67597J82427
$$ plain form
16562 1745700 1745755 1803039 1706035 1728735 1931538 1673011 1526786 1661414 1613499 1387630 1250059
16551 1250059 1463052 1741549 1458392 1363219 1241242 1141140 1455599 1308825 1681185 1331392
16541 1331392 1611766 1298846 1549435 1427224 1129103 1018823 1083443 1390320 1095464 968072
16531 968072 959206 964853 1305790 1156658 1124065 1173497 1177696 1165398 1028480 699181 645463
16520 645463 1239309 1026111 1017897 1056157 1192746 834236 1124028 869942 1035430 1129087
16510 1129087 887386 1183924 1159588 821585 576801 958791 735087 492067 1100016 688697
16500 688697 637976 630772 726883 791809 752592 811633 704970 871241 889993 710088 803999
16489 803999 827988 939740 487403 762438 848045 1024925 746734 785059 558663 903787
$$ packed form
16562A745700N5N7284r7004K2700K02803k58527j46225J34628m7915k25869j37571
16551A250059K12993K78497k83157r5173j21977j00102L14459j46774L72360l49793
16541A331392K80374l12920K50589j22211k98121j10280O4620L06877k94856j27392
16531I68072q866N647L40937j49132l2593M9432M199j2298j36918l29299n3718
16520F45463N93846k13198q214L8260J36589l58510K89792k54086J65488R3657
16510A129087k41701K96538k4336l38003k44784L81990k23704k43020O07949m11319
16500F88697n0721p204R6111O4926l9217N9041j06663J66271J8752j79905R3911
16489H03999K3989J11752m52337K75035Q5607J76880k78191L8325k26396L45124
$$ plain form
16479 903787 584496 948677 470714 457552 729248 628306 480054 568431 565974 425131
16469 425131 378628 666182 772275 368519 702582 518194 573266 441098 680164 891415
16459 891415 573358 868774 677297 638677 695539 503358 560395 843462 469265 499613
16449 499613 652524 613154 524996 26277 887392 635559 335188 543329 439041 465591
16439 465591 467350 485246 640945 290550 427500 542031 283783 574279 557021 469680
16429 469680 -36746 574613 195631 224228 554078 628820 214229 291604 435883 632116
16419 632116 336202 542208 412996 560754 127372 241449 477872 432518 582824 327695
16409 327695 145959 325690 423922 189586 509474 132886 657286 345604 315132 140972
$$ packed form
16479I03787l19291L64181D70714j3162K71696j00942j48252Q8377k457j40843
16469D25131m6503K87554J06093C68519L34063j84388N5072j32168K39066K11251
16459H91415l18057K95416j91477l8620N6862j92181N7037K83067l74197L0348
16449D99613J52911l9370q8158B6277Q61115k51833l00371K08141j04288K6550
16439D65591J759J7896J55699B90550J36950J14531k58248K90496j7258q7341
16429D69680c6746E74613A95631K8597L29850P4742B14229P7375J44279J96233
16419F32116k95914K06006j29212J47758A27372J14077K36423m5354J50306k55129
16409C27695A45959J79731R8232A89586L19888A32886N24400l11682l0472A40972
$$ plain form
16398 202235 610745 190194 294154 338018 453899 420346 7248 188424 360542 45186
16387 299037 156260 381185 450546 630557 483195 413766 18550 359026 253319 126657
16376 262405 486990 92833 39905 -70413 -139627 572209 123324 343681 331764 181885
16366 181885 295117 -121907 19501 468488 98388 378676 -48847 334177 454851 237979
16356 237979 -4917 440769 -18518 404264 340910 526000 363207 552717 354219 94200
16345 68920 73456 235767 266836 234204 450952 254470 9491 -53037 -261931 195072 -98124
16333 78660 318470 323232 -43106 389844 241618 352910 135984 344234 331157 281263 170999
16322 170999 -240697 258641 205213 145136 342813 496611 -169770 294081 -129959 510553
$$ packed form
16398B02235M08510A90194J03960M3864J15881l3553G248J81176J72118D5186
16387B99037j42777K24925O9361J80011j47362o9429A8550L40476j05707A26657
16376B62405K24585I2833C9905g0413o9214E72209A23324K20357j1917j49879
16366A81885J13232a21907A9501M48987I8388K80288d8847C34177J20674k16872
16356B37979d917D40769a8518D04264o3354J85090j62793J89510j98498I4200
16345F8920M536J62311L1069l2632K16748j96482I491e3037k08894A95072i8124
16333G8660K39810M762d3106C89844j48226J11292A35984K08250j3077m9894j10264
16322A70999b40697B58641n3428o0077J97677J53798a69770B94081a29959E10553
$$ plain form
16311 73780 315370 42840 177972 -76378 38695 164508 98521 66171 53828 -40890 205557
16299 -102233 99258 448795 17636 180551 -3104 175331 123314 129921 376307 149733 -232886
16287 109198 -5712 125583 -16892 359877 164369 54541 -127270 165162 87961 -136401
16276 248683 345421 25330 -127262 -184114 34684 432978 -6349 331624 19984 -35047 65977
16264 95115 -36133 -120384 193458 314656 392983 279377 148283 297303 -141923 3171 37734
16253 37734 -38556 259067 215323 171727 169417 79491 -321282 263411 -59146 171460 -58807
16241 190202 218868 443944 265742 125172 10895 178890 -69041 70245 -4674 93408 23675
16229 176989 400551 207559 272988 161583 293245 -158411 3762 203206 164199 -50166
$$ packed form
16311G3780K41590D2840J35132g6378C8695J25813o5987l2350j2343d0890B05557
16299a02233I9258L49537A7636J62915c104A75331n2017O607K46386A49733b32886
16287A09198e712A25583a6892C59877A64369E4541a27270A65162p7201a36401
16276B48683R6738B5330a27262n6852C4684L98294f349C31624A9984c5047F5977
16264I5115c6133q4251A93458J21198P8327j13606j31094J49020a41923C171L4563
16253C7734c8556B59067m3744m3596k310G9491c21282B63411e9146A71460e8807
16241A90202K8666K25076j78202A25172A0895J67995f9041G0245d674I3408B3675
16229A76989K23562j92992O5429j11405J31662a58411C762J99444l9007e0166
$$ plain form
16218 136073 -92559 82627 -1453 -258855 377893 127106 237421 282138 64662 -160340 243327
16206 155562 73632 -241792 228611 159973 -101708 126378 -194697 146778 206632 -183675
16195 177518 79039 71946 -30608 -5842 219197 307542 -73721 15024 179538 -6168 150980
16183 370840 -56837 59218 14953 -139111 -376408 222139 166281 67497 -62969 -114942 -14271
16171 60971 -176378 148380 306905 84157 190914 -179720 -236475 -172529 -4554 -310536 441321
16159 96600 371058 66259 -104605 31210 -37627 -12186 -80320 -250130 -298622 140798 106401
16148 106401 270985 172087 -11109 318595 214473 -233163 280672 235435 90754 -159245
16137 -158464 127676 -59622 61879 73296 11794 171366 133740 182112 -124985 -67673 -132432
$$ packed form
16218A36073i2559H2627a453k57402C77893A27106J10315M4717F4662a60340B43327
16206A55562G3632b41792B28611o8638a01708A26378a94697A46778N9854a83675
16195A77518G9039p093c0608e842B19197Q8345g3721A5024J64514f168A50980
16183C70840e6837E9218A4953a39111k37297B22139n5858F7497f2969n1973a4271
16171F0971a76378A48380J58525H4157J06757a79720n6755O3946d554l05982D41321
16159I6600K74458F6259a04605C1210c7627a2186o8134j69810m8492A40798l4397
16148A06401J64584r8898a1109C18595j04122b33163B80672m5237I0754a59245
16137a58464A27676e9622F1879J1417A1794J59572l7626M8372a24985N7312o4759
$$ plain form
16126 -132432 -68963 150294 29017 68284 -182868 62398 -205696 -288635 -180946 -69628 159858
16114 47821 -48624 16373 350100 191491 79028 17333 -122985 161857 49426 313464 -66037
16102 94559 23480 -104380 42991 289997 -348064 -80867 -30336 -90881 -94531 26752 97997
16091 97997 151107 90929 211589 9311 83344 50058 -349535 55593 73401 89365 -177048
16079 -120100 149500 -140868 -200704 -46749 -75807 -1229 -231240 -48557 -68298 -79915 -109752
16068 -109752 -71741 -8856 15243 -180493 -122718 134102 -289808 -18723 -270965 -281730 -329491
16057 -329491 159817 -467163 140068 -5261 508901 -47934 -239063 54524 202390 253235
16047 253235 -237151 -190855 -73185 204204 298220 -308154 68771 -86157 199144 -176863
$$ packed form
16126a32432O3469A50294B9017L9267a82868F2398b05696q2939J07689f9628A59858
16114D7821d8624A6373L33727j58609G9028A7333a22985A61857D9426K64038f6037
16102I4559B3480a04380D2991K47006c48064h0867c0336o0545l650B6752P1245
16091I7997N3110o0178J20660I311P4033l3286c49535E5593J7808J5964a77048
16079a20100A49500a40868n9836d6749k9058a229k30011d8557j9741j1617k9837
16068a09752L8011h856A5243a80493N7775A34102b89808a8723k52242j0765m7761
16057c29491A59817d67163A40068e261E08901d7934j91129E4524J47866N0845
16047B53235b37151M6296g3185B04204R4016c08154F8771h6157A99144a76863
$$ plain form
16036 69236 -41194 218675 -85506 146255 103067 -306592 163700 -115790 -164320 -252738 9841
16024 -17687 31376 -50574 331992 -152479 107683 61831 128263 -67449 -320451 -155770 359527
16012 -242611 73867 52955 105203 -217863 -137582 -4824 268633 221088 127814 -67280 15427
16000 16472 61596 29120 -153815 200596 15914 -72129 253365 -82853 -223452 -347027 -121486
15988 -342748 230715 -65918 -142310 -36107 228804 20126 228332 507212 120397 286084
15978 286084 193685 169321 82001 169844 92424 229760 29845 -359623 -80564 50512 -164740
15966 210854 -51414 16524 282158 226449 -323868 99095 239596 -277519 -92291 34250 -84783
15954 -203990 -95631 208441 -111792 -19833 -98687 219037 -78175 206675 -104510 16506
$$ packed form
16036F9236d1194B18675h5506A46255m3188c06592A63700a15790m8530q8418I841
16024a7687C1376e0574C31992a52479A07683m5852O6432f7449k53002a55770C59527
16012b42611G3867k0912N2248b17863Q0281d824B68633m7545r3274f7280A5427
16000A6472M5124B9120a53815B00596A5914g2129B53365h2853j40599j23575a21486
15988c42748B30715f5918p6392c6107B28804B0126K08206K78880A20397J65687
15978B86084r2399k4364H2001Q7843p7420J37336B9845c59623h0564E0512a64740
15966B10854e1414A6524K65634n5709c23868I9095J40501b77519i2291C4250h4783
15954b03990i5631B08441a11792a9833p8854B19037g8175B06675a04510A6506
$$ plain form
15943 -161426 -197584 169820 -161414 28414 -329184 -242140 -262423 98855 -92178 100669 -331992
15931 226098 439466 -239104 31212 131740 -265722 202473 -44167 -187459 16928 -300312
15920 -292060 26958 58449 38332 -282790 59774 -105397 -65752 418942 120853 -190356
15909 54270 -108741 -2126 259153 96630 -168472 49147 22485 69756 -496776 -60656 -20147
15897 59794 -66289 101153 -205073 -138083 -81010 25154 17762 -19480 -325776 -223502 -293181
15886 -293181 118848 -118649 -352541 235104 266527 -228902 -159852 -204976 98289 -56599
15875 -314847 138213 -117212 87710 -65728 241172 -62382 165353 12086 56572 98351 -132867
15863 -145320 59658 -105132 -58283 70360 78418 68221 -24137 -142873 -128184 157102 -220133
$$ packed form
15943a61426l6158A69820a61414B8414c29184Q7044k0283I8855i2178A00669c31992
15931B26098K13368b39104C1212J00528b65722B02473d4167j43292A6928c00312
15920b92060B6958L1491k0117b82790E9774a05397L9645D18942A20853a90356
15909E4270a08741b126B59153I6630a68472D9147B2485M7271d96776f0656b0147
15897E9794f6289A01153b05073O6990N7073B5154p392a9480l06296J02274o9679
15886b93181A18848a18649k33892B35104L1423b28902O9050m5124I8289e6599
15875c14847A38213a17212H7710f5728B41172f2382A65353A2086M4486M1779a32867
15863a45320E9658a05132M6849G0360Q058j0197b4137j18736J4689A57102b20133
$$ plain form
15851 223173 -56080 256168 242213 103147 -118120 -78776 -175800 181519 -141799 -215769
15841 -215769 -100762 -141498 -186321 -36376 37619 -271332 -50131 149563 -157560 139774
15830 -38330 -30847 -3687 -166607 194503 83704 96100 234276 -29936 302339 -241377 42181
15818 277230 -174626 -105390 3053 -72024 353398 -14439 -319102 -20460 -155798 65031 305460
15807 305460 -350030 81132 57849 -172052 31354 59765 158333 -27635 931 -32275 -49590
15796 -49590 -171215 -29156 -231139 -64608 -200921 -328903 -9668 -67056 81457 -193891 3424
15784 -63506 29513 -111359 204613 -129554 17323 -110159 -9967 -57793 -96308 -128055 -103622
15773 -103622 -142912 -48830 99504 -37969 -89283 -25225 2829 8673 119646 -99767 164799
$$ packed form
15851B23173e6080B56168j3955A03147a18120L9344r7024A81519a41799p3970
15841b15769a00762m0736m4823c6376C7619b71332e0131A49563a57560A39774
15830c8330P483c687j62920A94503H3704J2396J38176b9936C02339b41377D2181
15818B77230a74626O9236C053g2024C53398a4439l04663b0460j35338F5031K40429
15807C05460c50030H1132k3283a72052C1354K8411R8568b7635I31c2275j7315
15796d9590j21625b9156k01983f4608j36313j27982i668n7388H1457a93891C424
15784f3506B9513a11359B04613a29554A7323a10159i967m7826l8515l1747K4433
15773a03622l9290d8830I9504c7969n1314b5225B829N844J10973i9767A64799
$$ plain form
15761 -193551 -22154 94703 -49961 -36361 69324 212134 13704 17455 75835 -54176 -65965
15750 -65965 -33685 -157361 203067 45413 -189909 291855 -94781 -35413 117585 -79796 -208167
15739 -208167 -199941 91079 174017 89515 -273882 52580 -114324 -247268 162127 -73986 -176413
15728 -176413 -203006 -186866 -148797 -95357 204664 -250906 -97834 -263981 -10967 178931 -398661
15716 -85288 -224721 -272767 207765 -421638 69573 121611 -114162 62898 -54987 -85561 -365757
15705 -365757 -41297 30261 34238 -38954 -190895 -614380 183718 108951 -125603 4927 44676
15694 44676 -192413 164994 361224 277815 -67532 9034 102901 -162480 12015 125817 -44820
15682 10857 240844 -35929 -183611 14577 154211 -327615 -139006 -588 -154794 -13445 397804
$$ packed form
15761a93551b2154I4703d9961J3600F9324J42810A3704L751N8380e4176j1789
15750f5965L2280j23676B03067D5413a89909B91855i4781c5413A17585g9796j28371
15739b08167Q226I1079Q2938q4502b73882E2580a14324j32944A62127g3986j02427
15728a76413k6593J6140L8069N3440B04664b50906i7834j66147a0967A78931c98661
15716h5288j39433m8046B07765d21638F9573N2038a14162F2898e4987l0574k80196
15705c65757d1297C0261L977c8954j51941m23485A83718p4767a25603D927L9749
15694D4676a92413A64994J96230q3409f7532I034R3867a62480A2015J13802d4820
15682A0857K29987c5929j47682A4577J39634c27615a39006e88j54206a3445C97804
$$ plain form
15670 293339 155705 72846 179942 228845 -30429 -1801 222371 -228937 31518 -105059 57554
15658 85193 116037 -35095 -133988 -50445 -158372 -329990 -219588 -165127 105514 -324111 -65217
15646 -7238 -230381 -71448 -7738 -203166 104853 -146426 36878 133213 -168570 -308451 59023
15634 -302245 72083 107458 65628 -104005 -98526 -32733 -42743 54540 49881 -99186 -285103
15623 -285103 -32873 31899 -457897 60376 206701 70669 -6829 -136746 113933 -120618 -143317
15612 -143317 154546 -432693 290967 108965 180118 -124023 -11545 31969 36563 147539
15602 147539 -33521 -217814 -335891 336430 -157670 187257 -317299 142107 110950 -91990
15591 -76972 252307 -60975 -63640 136416 84134 169089 85924 -166623 87212 -14932 188288
$$ packed form
15670B93339j37634G2846J07096M8903c0429a801B22371b28937C1518a05059E7554
15658H5193L0844c5095r8893e0445j07927j71618J10402N4461A05514c24111f5217
15646g238k23143g1448g738j95428A04853a46426C6878R6335a68570j39881E9023
15634c02245G2083L5375m1830a04005N479c2733j0010E4540m659i9186j85917
15623b85103c2873C1899d57897F0376J46325G0669f829j29917A13933a20618k2699
15612a43317A54546d32693B90967A08965P1153a24023a1545C1969M594J10976
15602A47539c3521j84293j18077C36430a57670A87257c17299A42107l1157i1990
15591g6972B52307f0975k665A36416n2282Q4955q3165a66623H7212a4932A88288
$$ plain form
15579 -58444 56454 -203366 -22010 91127 -75890 69789 -91809 -237892 -63614 -78503 -212214
15568 -212214 -196051 -65934 208921 140182 -49476 -146039 275949 80450 -55848 169319 8291
15556 -252180 -19837 262311 184971 -106895 241641 53786 175631 -109177 155066 57694
15545 167255 124752 27095 28403 -261249 -43728 -29205 224203 63203 267744 157615 152316
15534 152316 -30369 168560 -129883 104963 86647 -69970 -318913 -96441 -62695 82968 88115
15523 88115 -341538 3051 171621 -197439 -301629 -245835 -174911 -306579 133927 247647
15513 247647 -144842 190312 87287 -112611 302095 223334 123614 100269 -105552 80984
15502 -207682 -284000 87829 148713 128921 24852 -174364 -78924 110819 -14504 -167235 20111
$$ packed form
15579e8444E6454b03366b2010I1127g5890F9789i1809j46083f3614j4889j33711
15568b12214J6163f5934B08921o8739d9476r6563B75949H0450e5848A69319H291
15556b52180a9837B62311p7340a06895B41641E3786J21845a09177A55066E7694
15545A67255m2503B7095J308b61249d3728J4523B24203F3203K04541j10129n299
15534A52316c0369A68560a29883A04963j8316f9970k48943i6441L3746H2968N147
15523H8115c41538C051J68570a97439j04190N5794P0924j31668A33927J13720
15513B47647a44842A90312H7287a12611C02095p8761r9720k3345a05552H0984
15502b07682p6318H7829O0884j9792B4852a74364g8924A10819a4504j52731B0111
$$ plain form
15490 203960 289574 -56008 107673 -164358 13518 -59242 130831 81434 72359 -93489 -127902
15479 -127902 33619 -52522 102564 65874 101570 153204 -26397 7490 222065 258170 68920
15467 -247264 55721 -429619 -241104 257904 95183 114445 246872 66806 -259550 207074
15456 25439 -84615 -203368 159887 -109072 6618 96589 65368 -89590 -125617 89760 -162077
15444 -302715 92873 -286567 -245678 -46910 168630 -146010 -384097 58861 -27145 -2992 29730
15432 94846 81955 245550 -95750 445902 35641 -254693 -130251 -421347 -23628 -610684
15422 -610684 146850 -230012 -84113 24157 85458 185037 -268596 -233091 151835 75777 -73656
15410 18719 156713 41116 58763 -75318 22903 -144659 -115741 -194876 -48989 -10613 175049
$$ packed form
15490B03960Q5614e6008A07673a64358A3518e9242A30831m9397r075i3489l4413
15479a27902C3619e2522A02564l6690L5696N1634b6397G490K14575L6105F8920
15467b47264E5721d29619J88515B57904I5183J9262J32427F6806b59550B07074
15456B5439h4615j18753A59887a09072F618Q9971l1221h9590l6027H9760a62077
15444c02715I2873b86567M0889d6910A68630a46010k38087E8861b7145b992B9730
15432I4846j2891J63595i5750D45902C5641b54693J24442k91096b3628n87056
15422f10684A46850b30012h4113B4157O1301R9579b68596L5505A51835G5777g3656
15410A8719J37994D1116J7647g5318B2903a44659K8918p9135d8989a0613A75049
$$ plain form
15398 -123173 166487 166982 -126883 47898 -131162 314223 170265 250773 73334 -204396 -216831
15387 -216831 141286 -48538 53297 -448702 -64299 103698 -64334 -10346 -86507 57164 -28074
15375 -48108 -163705 -228145 -73806 -195109 251039 20091 -6742 -89696 -113548 -208875 -195679
15364 -195679 -14792 -20806 -58595 -228582 56788 -142042 113708 -37395 200092 -30769 207763
15352 -196091 241291 -23990 -209776 68212 -431121 -1158 44691 193020 114849 -114077 77347
15340 -121913 -262833 -255528 146807 -10565 -82340 94327 -32592 -214107 -55362 33216 111043
15329 111043 102828 101547 -134235 -131390 -175589 -209226 138933 157856 -47595 34614 187707
15318 187707 -126851 -62424 -216365 90520 45218 -122635 112141 -104560 134603 -204416
$$ packed form
15398a23173A66487M95a26883D7898a31162C14223j43958Q0508G3334b04396j2435
15387b16831A41286d8538E3297d48702f4299A03698f4334a0346p6161E7164b8074
15375d8108j15597o4440g3806j21303B51039B0091f742q2954k3852r5327J3196
15364a95679a4792o014l7789j69987E6788a42042A13708c7395B00092c0769B07763
15352a96091B41291b3990j85786F8212d31121a158D4691J48329p8171a14077G7347
15340a21913j40920P305A46807a0565p1775I4327c2592j81515e5362C3216P7827
15329A11043q215j281a34235K845m4199l3637A38933J8923d7595C4614J53093
15318A87707a26851f2424j53941I0520D5218a22635A12141a04560A34603b04416
$$ plain form
15307 -131216 -117182 -112716 -45309 -210300 -205257 -132606 71709 -75902 142779 -100912 -37066
15295 79681 -121044 -206071 220291 -117339 -122720 331033 -344796 206016 216444 265105 -8809
15283 60962 69804 53016 364198 189088 29779 15495 -58175 -203167 -50427 -6020 -165388
15272 -165388 247416 167870 260435 219295 125092 75876 -120639 152277 157603 -108927 203673
15260 -196510 215039 101605 482490 92273 -208060 152878 -114825 49640 -84643 -34216
15249 364849 275733 703264 1227970 1416316 1188572 1468245 869186 112125 141917 -31712
15238 -84787 113297 -121757 121668 -74891 50105 51029 -176113 -60760 154787 -55228 135533
15226 455937 264788 381232 -118874 -192497 -8168 -211673 -124270 -2641 389256 -28642 -159524
$$ packed form
15307a31216J4034M466d5309j64991N043P2651G1709g5902A42779a00912c7066
15295G9681a21044q5027B20291a17339n381C31033c44796B06016J0428M8661h809
15283F0962Q842j6788L11182j75110B9779j4284e8175j44992e0427f020j59368
15272a65388B47416p9546R2565m1140r4203m9216a20639A52277N326a08927B03673
15260a96510B15039A01605L80885I2273b08060A52878a14825D9640h4643c4216
15249C64849q9116M27531N24706J88346k27744K79673n99059A12125K9792c1712
15238h4787A13297a21757A21668g4891E0105R24a76113f0760A54787e5228A35533
15226D55937j91149J16444a18874p3623h168k03505Q7403b641C89256b8642j30882
$$ plain form
15215 -159524 81104 -38529 139270 15512 113885 -23222 -125863 -271795 -12774 77154 -54654
15203 -124045 154013 244498 -153153 210680 -105841 119418 -128754 -58426 74951 -63753
15192 200166 229784 -51945 70153 33942 76688 72730 25127 125776 -194760 229995 90835
15180 78301 273835 121147 42087 -92685 315700 -74583 222901 277590 115837 -97231 -103301
15169 -103301 150931 236085 91164 -7264 52011 151605 122462 246977 262097 -102331 -142579
15158 -142579 26690 -83069 445649 -162929 100515 -72758 473807 33019 364620 -48943
15147 89097 159274 248395 -417954 162744 -72886 197865 49803 430808 192994 -290777
15136 199563 -5828 22879 80057 -135744 59455 254380 232625 -181540 -98249 131403 -55709
$$ packed form
15215a59524H1104c8529A39270A5512R8373b3222j02641j45932a2774G7154e4654
15203a24045A54013R0485a53153B10680a05841A19418a28754e8426G4951f3753
15192B00166K9618e1945G0153C3942M2746l958B5127J00649a94760B29995I0835
15180G8301J95534A21147D2087i2685C15700g4583B22901N4689A15837i7231o070
15169a03301A50931Q5154I1164g264E2011R9594k9143J24515J5120a02331m0248
15158a42579B6690h3069D45649a62929A00515g2758D73807C3019L31601d8943
15147H9097P0177Q9121d17954A62744g2886A97865D9803L81005A92994b90777
15136A99563e828B2879N7178a35744E9455J94925k1755a81540Q3291A31403e5709
$$ plain form
15124 119476 -141989 173916 61043 280816 -4062 -81788 93266 125678 287854 -58171 -12892
15112 125999 121372 36532 174846 86848 146807 110046 -7561 106439 -377805 68170 386053
15101 386053 173178 99784 54279 4463 94533 228296 233457 62005 -167554 114093 -179988
15089 251296 -73449 -146836 306353 107696 109838 162891 77848 155297 282958 193907 543596
15078 543596 305129 -5400 -13801 130274 496282 580214 272918 428571 85787 229868 145882
15067 145882 419434 -11195 -64798 174473 100887 -83880 122162 403813 153439 130591
15057 130591 244053 129441 271402 129756 -135621 83964 183474 222696 231347 205720 234602
15046 234602 -4547 -42901 219139 397077 115435 363947 525913 22452 199282 70933
$$ packed form
15124A19476a41989A73916F1043K19773d062p7726I3266L2412J62176e8171a2892
15112A25999m627C6532J38314H6848N9959l6761g561A06439c77805F8170L17883
15101C86053A73178p3394m5505D463R0070J33763N161F2005a67554A14093a79988
15089B51296g3449p3387C06353A07696K142N3053G7848P7449J27661q9051L49689
15078E43596k38467e400q401A30274L66008Q3932B72918J55653H5787J44081q3986
15067A45882K73552a1195n3603A74473p3586h3880A22162K81651A53439k2848
15057A30591J13462j14612J41961A29756a35621H3964R9510L9222Q651k5627K8882
15046B34602d547l8354B19139J77938A15435K48512J61966B2452J76830G0933
$$ plain form
15035 122923 -192971 313639 112881 376984 -222537 330975 304468 194808 109164 225022
15025 225022 24552 -144330 439466 16111 -55448 63710 16230 80932 4413 177737 -41585
15013 65912 -192083 -242600 268360 212885 376929 274550 71985 272308 -105207 298595
15002 -69562 207130 -69563 273301 302639 135590 279269 33524 327939 209396 206484 -14322
14990 317924 305065 239503 322872 34158 -101016 339368 -177048 64030 340574 298502 46353
14978 -105156 390804 325461 -101300 79579 114416 159919 297094 522599 373709 192116
14968 192116 68108 230694 331033 114369 34053 119868 374786 403088 -232955 298018
14957 209931 70568 367120 159962 354466 382321 216607 47419 8842 385379 136797
$$ packed form
15035A22923a92971C13639A12881K64103b22537C30975k6507j09660q5644J15858
15025B25022B4552a44330D39466A6111e5448F3710A6230O4702D413J73324d1585
15013F5912a92083n0517B68360n5475J64044j02379G1985K00323a05207B98595
15002f9562B07130f9563B73301K9338A35590J43679C3524K94415j18543k912a4322
14990C17924j2859o5562Q3369C4158a01016C39368a77048F4030K76544m2072D6353
14978a05156C90804o5343a01300G9579L4837M5503J37175K25505j48890j81593
14968A92116F8108J62586J00339A14369C4053Q5815K54918K8302b32955B98018
14957B09931G0568K96552A59962J94504K7855j65714D7419H842L76537A36797
$$ plain form
14946 549381 85855 76594 300917 -133468 168294 122415 74445 494716 111798 38632 444058
14935 444058 132273 272251 187202 266345 172170 422453 515205 17715 109144 360524 79373
14923 -99349 243331 335914 438090 363828 261371 220928 56036 342527 173305 -164210
14912 160673 -98331 78125 8415 247905 129392 125179 241270 180779 422199 90895 270513
14901 270513 290527 413249 212429 354057 128055 440805 434669 254513 232042 422735
14891 422735 226300 300949 613767 26214 20608 369632 157632 533985 309139 262527
14881 262527 365926 221340 397957 387524 435372 400737 490535 462801 307765 242486 102336
14869 360520 52273 293849 284792 61018 391921 215449 330929 275348 430665 248931
$$ packed form
14946E49381H5855r261K24323a33468A68294m5879m7970M20271A11798C8632M05426
14935D44058A32273J39978q5049P9143r4175K50283R2752A7715R1429K51380G9373
14923i9349B43331R2583J02176p4262j02457m0443E6036K86491j69222a64210
14912A60673i8331G8125H415K39490j18513m213J16091o0491K41420I0895J79618
14901B70513K0014J22722k00820J41628A28055L12750o136j80156k2471J90693
14891D22735j96435P4649L12818B6214n606L49024A57632L76353k24846m6612
14881B62527J03399j44586J76617j0433M7848l4635Q9798k7734j55036o5279A02336
14869C60520E2273K41576r057F1018L30903j76472J15480n5581J55317j81734
$$ plain form
14859 248931 389899 151908 230957 -57419 238308 576888 447559 198833 267805 300044
14849 300044 510548 299348 114242 445462 145732 391058 594042 513210 327839 301960
14839 301960 383414 428674 390045 231538 339690 243893 764981 314409 73219 382332
14829 382332 147590 252399 172046 219388 409807 387629 531591 451636 453910 318404 320982
14818 320982 478518 498617 883448 694042 253869 903819 749129 419999 160170 12699
14807 619432 170495 96619 578366 480443 610519 511592 415860 522139 772811 640626
14797 640626 404860 657358 666079 494800 559429 624263 631435 540606 537884 422563 430487
14786 430487 714272 324648 682493 574154 505130 463271 569089 522618 353127 534707
$$ packed form
14859B48931J40968A51908P9049e7419B38308L38580j29329A98833O8972L2239
14849C00044K10504k11200A14242L31220A45732K45326K02984q0832j85371k5879
14839C01960Q1454M5260l8629j58507J08152r5797N21088C14409G3219L09113
14829C82332A47590J04809q0353M7342J90419k2178J43962p9955K274j35506K578
14818C20982J57536K0099L84831j89406B53869O49950j54690l29130A60170A2699
14807F19432A70495p3876M81747r7923J30076r8927r5732J06279K50672j32185
14797F40626k35766K52498Q721j71279O4629O4834P172r0829k722j15321P924
14786D30487K83785C24648L57845j08339o9024m1859J05818m6471j69491J81580
$$ plain form
14776 534707 476340 477976 591847 367197 653151 476556 595803 253271 743985 292743
14765 358883 553872 499740 774936 711302 555950 460644 573848 436693 484411 764006
14755 764006 150779 822649 399576 537879 589181 396579 613109 1028004 352892 530428
14745 530428 440050 817992 303932 583086 511330 744945 950116 585819 582982 436563
14735 436563 634032 658174 739904 519561 696250 670205 588074 787027 499436 491139 395098
14724 395098 618237 497701 1069108 780349 654546 599193 927993 616760 934011 872953
14714 872953 657330 902633 600942 930162 543945 636995 491936 730286 480950 706460
14704 706460 522639 519575 538834 1062963 521542 665926 760768 713323 628288 817377 851386
$$ packed form
14776E34707n8367J636J13871k24650K85954j76595J19247B53271M90714B92743
14765C58883J94989n4132K75196o3634j55352r5306J13204j37155M7718K79595
14755G64006A50779O71870C99576J38303N1302j92602K16530M14895C52892J77536
14745E30428r0378L77942C03932K79154p1756K33615K05171l64297k837j46419
14735D36563J97469K4142Q1730k20343J76689k6045q2131J98953k87591q297r6041
14724C95098K23139j20536N71407k88759j25803n5353L28800l11233L17251o1058
14714H72953k15623K45303l01691L29220l86217R3050j45059K38350k49336K25510
14704G06460j83821l064J9259N24129E21542J44384R4842m7445q5035J89089L4009
$$ plain form
14693 851386 685291 592542 906174 861412 922547 759920 877819 930294 756535 450077
14683 450077 715590 1063315 809669 889217 723766 1007292 512405 1062844 1213149 853403
14673 853403 904269 1042403 879445 728133 786517 796943 943117 800516 900781 796159
14663 796159 506896 823974 1055276 793314 718132 960499 791195 1096074 832975 864466
14653 864466 1355640 1111278 981229 1115007 1150976 963431 920660 1079908 1168127 1077058
14643 1077058 811509 784023 893878 842428 1013940 1026257 870745 924870 1340664 731237
14633 731237 1330021 1262821 1405813 939866 1304156 1211947 993641 1146914 1216432 1170244
14623 1170244 1511936 1083839 984578 1240318 1439659 1204598 1608261 1546987 1096276 1146222
$$ packed form
14693H51386j66095r2749L13632m4762O1135j62627J17899N2475j73759l06458
14683D50077K65513L47725k53646P9548j65451K83526m94887N50439J50305l59746
14673H53403N0866J38134j62958j51312N8384J0426J46174j42601J00265j04622
14663G96159k89263L17078K31302k61962p5182K42367j69304L04879k63099L1491
14653H64466M91174k44362j30049J33778L5969j87545m2771J59248Q8219r1069
14643A077058k65549k7486J09855n1450J71512J2317j55512N4125M15794o09427
14633G31237N98784o7200J42992m65947L64290r2209k18306J53273O9518m6188
14623A170244L41692m28097r9261K55740J99341k35061M03663o1274m50711M9946
$$ plain form
14613 1146222 1228404 1101581 1612157 1283044 1146019 1069683 1427690 1355474 1550306 1262709
14603 1262709 1212858 1414102 1159700 1486032 1447039 1554314 1033898 1479120 1271306 1296439
14593 1296439 1156935 1607974 1216073 1523394 1506630 1626765 1460416 1542888 1339988 1743119
14583 1743119 1612121 1300907 1486184 1936368 1255051 1443839 1693812 1896449 1838795 1521240
14573 1521240 1583276 1699196 2117718 1934776 1865774 1896604 2072499 1927284 2005963 2057161
14563 2057161 2245037 2313452 2144351 1865825 2196272 2640529 2270472 2682216 2421591 2864227
14553 2864227 3053780 3566721 3520996 4346770 5917353 8731521 16579873 36572635 47300493
14544 47300493 20144740 9503523 4531509 2483626 2005301 1677340 1769641 1770446 1793918
$$ packed form
14613A146222Q2182j26823N10576l29113j37025p6336L58007p2216J94832k87597
14603A262709m9851K01244k54402L26332l8993J07275n20416M45222k07814K5133
14593A296439j39504M51039l91901L07321j6764J20135j66349Q2472k02900M03131
14583A743119j30998l11214J85277M50184o81317J88788K49973K02637n7654l17555
14573A521240O2036J15920M18522j82942o9002L0830J75895j45215P8679N1198
14563B057161J87876O8415j69101k78526L30447M44257l70057M11744k60625M42636
14553B864227J89553N12941m5725Q25774J570583K814168P848352J9992762J0727858
14544D7300493B0144740I503523D531509k047883m78325l27961R2301Q05K3472
$$ plain form
14535 1793918 1919171 1586350 1823269 1847134 1888467 1801280 1822912 1740530 1751947 1907366
14525 1907366 2248771 1820381 1790886 1930948 2168641 2538944 2243645 1976901 2554932 2440598
14515 2440598 2639455 2424032 2138233 2526507 2826962 2396775 2377332 2895729 2700340 2611143
14505 2611143 2346922 2403720 2756638 2679090 2419342 2623194 2790117 2844712 2924667 2604641
14495 2604641 2916858 2858842 2845201 3063560 3156314 2961408 3002086 2848443 3103216 2836088
14485 2836088 3000718 3031152 3542026 2953337 3254701 3319324 3362949 3763731 3337296 3789036
14475 3789036 3317976 3558159 3727578 3559746 3959923 3808312 3693045 3599410 3597026 3787136
14465 3787136 3878581 3795470 4102563 4272283 4367168 4300730 4228365 3993775 4419873 4115402
$$ packed form
14535A793918J25253l32821K36919K3865M1333q7187K1632q2382J1417J55419
14525A907366L41405m28390k9495J40062K37693L70303k95299k66744N78031j14334
14515B440598J98857k15423k85799L88274L00455m30187j9443N18397j95389q9197
14505B611143k64221N6798L52918p7548k59748K03852J66923N4595P9955l20026
14495B604641L12217n8016j3641K18359R2754j94906M0678j53643K54773k67128
14485B836088J64630L0434N10874n88689L01364O4623M3625M00782m26435M51740
14475C789036m71060K40183J69419j67832M00177j51611j15267r3635k384J90110
14465C787136R1445q3111L07093J69720R4885o6438p2365k34590M26098l04471
$$ plain form
14455 4115402 4783530 4539044 4147829 4565749 4543699 4785272 4751645 4644872 4985834 4961904
14445 4961904 4756939 4963258 5010691 5201846 5414211 5253748 5222779 5519779 5333063 5710205
14435 5710205 5609692 5590576 5778613 5797410 5593038 6155598 6089675 6329058 6295838 6623968
14425 6623968 6322975 6581395 6684357 6613597 6848190 6985705 6736664 7264425 7250188 7306449
14415 7306449 7499308 7779804 7580562 7723113 8016133 7983661 8262310 7738425 8241840 8035658
14405 8035658 8540484 8626077 8971187 8758538 8949112 9021134 9440207 9007761 9814403 9813250
14395 9813250 10189697 10198637 10246802 10236503 10727514 10886977 10895148 11159624 11297751 11662681
14385 11662681 11852884 11916611 12291715 12430600 12521512 12837825 13036037 13122764 13441933 13757839
$$ packed form
14455D115402O68128k44486l91215M17920k2050K41573l3627j06773L40962k3930
14445D961904k04965K06319M7433J91155K12365j60463l0969K97000j86716L77142
14435E710205j00513j9116J88037J8797k04372N62560o5923K39383l3220L28130
14425F623968l00993K58420J02962p0760K34593J37515k49041N27761j4237N6261
14415G306449J92859K80496j99242J42551K93020l2472K78649n23885N03415k06182
14405H035658N04826Q5593L45110k12649J90574P2022M19073m32446Q06642j153
14395I813250L76447Q940M8165j0299M91011J59463Q171K64476J38127L64930
14385A1662681J90203O3727L75104J38885R0912L16313J98212Q6727L19169L15906
$$ plain form
14375 13757839 14111005 14468936 14582827 15258730 15286674 15302136 16011267 16070492 16245414 16767057
14365 16767057 16937453 17833723 17926291 18479003 18790123 19137522 19490573 19794117 20245989
14356 20245989 20831667 21397757 21981141 22214860 22685960 23520979 24194543 24519803 24998965
14347 24998965 25573858 26488254 27282583 27862008 28756042 29291759 30091193 31191149 32197574
14338 32197574 32688736 33371752 34337831 35240230 35910087 37573835 38376885 39891821 40842287
14329 40842287 42326924 43606511 45018085 46228049 47834328 49605729 51059002 53127388
14321 53127388 54711490 56613064 59022147 60786448 63330368 65758579 67947980 70735437
14313 70735437 73351856 76225340 79499144 83030414 86120360 90168104 93638713 97954337
$$ packed form
14375A3757839L53166L57931J13891O75903K7944J5462P09131N9225J74922N21643
14365A6767057J70396Q96270R2568N52712L11120L47399L53051L03544M51872
14356B0245989N85678N66090N83384K33719M71100Q35019O73564L25260M79162
14347B4998965N74893R14396P94329N79425Q94034N35717P99434J099956J006425
14338C2197574M91162O83016R66079R02399O69857J663748Q03050J514936R50466
14329D0842287J484637J279587J411574J209964J606279J771401J453273K068386
14321E3127388J584102J901574K409083J764301K543920K428211K189401K787457
14313G0735437K616419K873484L273804L531270L089946M047744L470609M315624
$$ plain form
14305 97954337 102268922 107024500 112030195 117519287 122908306 129061628 135631792 142024038
14297 142024038 149359153 156980094 165274140 174033911 183044095 192839192 203424497 214048004
14289 214048004 225546990 237850197 250393118 263737173 277369480 291762007 306069139
14282 306069139 320872670 335680113 350417110 365002833 378802322 392264558 403926846
14275 403926846 414655111 423829811 430486230 433010539 432733808 430855130 428822368 427742611
14267 427742611 423509420 417065955 407481806 396424358 383668324 369804261 355402892
14260 355402892 340573698 325509763 310386219 295528001 280937077 266794043 253960933
14253 253960933 241719829 229490386 217391643 206283069 195557695 185628420 176437743
$$ packed form
14305I7954337M314585M755578N005695N489092N389019O153322O570164O392246
14297A42024038P335115P620941Q294046Q759771R010184R795097J0585305J0623507
14289B14048004J1498986J2303207J2542921J3344055J3632307J4392527J4307132
14282C06069139J4803531J4807443J4736997J4585723J3799489J3462236J1662288
14275D03926846J0728265R174700O656419K524309k76731j878678k032762j079757
14267D27742611m233191o443465r584149j1057448j2756034j3864063j4401369
14260C55402892j4829194j5063935j5123544j4858218j4590924j4143034j2833110
14253B53960933j2241104j2229443j2098743j1108574j0725374r929275r190677
$$ plain form
14246 176437743 167554986 159055999 151749079 144159266 136941281 130493740 124582085 118517399
14238 118517399 113567182 108857273 103721699 99080150 95012184 90946173 87099131 83882787
14230 83882787 80415109 77091685 74102978 71096549 68476580 65879840 63376437 61050743
14222 61050743 58965843 56702989 54938329 52966038 51318276 49615189 47762439 46428356
14214 46428356 44776256 44130899 42207659 40608543 39558853 37988864 37257916 36645045
14206 36645045 35857483 34440196 33222557 32326241 31520284 30674257 30200296 29263869 28295363
14197 28295363 27449300 26698328 25979242 25349797 24969415 24447259 23767536 22802319 22572973
14188 22572973 22233355 21330502 20813401 20572063 19970651 19589212 19112844 18755637 18549533
$$ packed form
14246A76437743q882757q498987p306920p589813p217985o447541n911655o064686
14238A18517399m950217m709909n135574m641549m067966m066011l847042l216344
14230H3882787l467678l323424k988707l006429k619969k596740k503403k325694
14222F1050743k084900k262854j764660j972291j647762j703087j852750j334083
14214D6428356j652100o45357j923240j599116j049690j569989p30948o12871
14206C6645045p87562j417287j217639q96316q05957q46027m73961r36427r68506
14197B8295363q46063p50972p19086o29445l80382n22156o79723r65217k29346
14188B2572973l39618r02853n17101k41338o01412l81439m76368l57207k06104
$$ plain form
14179 18549533 18189752 17553565 17378472 16502421 16941515 16322429 15530794 15439409 15256088
14170 15256088 15051099 14787782 14577183 14143829 13705367 13489765 13382883 13138886 12859066
14161 12859066 12794189 12230523 12484237 11936944 11918697 11270460 11420033 11007599 11047088 10782449
14151 10782449 10489091 10466196 10355752 10083757 10099829 9781532 9589818 9625452 9415474 9035209
14141 9035209 9410845 9156474 8669696 8779998 8345372 8162394 8452127 8122859 8044186 7897033
14131 7897033 7995784 7800271 7233569 7304252 7558692 7245227 6824314 6988282 6778619 6730980
14121 6730980 6991602 6503086 6869728 6611912 6507301 6253994 6186906 6194712 6354941 6150188
14111 6150188 5895593 5962318 5672244 5977310 5724685 5565197 5404049 5526499 5547966 5455522
$$ packed form
14179A8549533l59781o36187j75093q76051M39094o19086p91635r1385j83321
14170A5256088k04989k63317k10599m33354m38462k15602j06882k43997k79820
14161A2859066o4877n63666K53714n47293j8247o48237J49573m12434L9489k64639
14151A0782449k93358k2895j10444k71995J6072l18297j91714L5634k09978l80265
14141I035209L75636k54371m86778J10302m34626j82978K89733l29268p8673j47153
14131G897033R8751j95513n66702P0683K54440l13465m20913J63968k09663m7639
14121F730980K60622m88516L66642k57816j04611k53307o7088P806J60229k04753
14111F150188k54595O6725k90074L05066k52625j59488j61148J22450K1467r2444
$$ plain form
14101 5455522 5172564 5271137 5250009 5065279 5063809 4898365 5075096 5325916 4756962 4529210
14091 4529210 5148315 4601046 4818054 4533842 4353614 4756739 4668498 4324660 4451707 4404709
14081 4404709 4061631 4125113 4190914 4188974 3854771 4342958 4006042 3615863 3888381 4074979
14071 4074979 3998703 3898452 3875638 3736702 3307848 3993043 3323933 3495753 3114663 3594476
14061 3594476 3640966 3309093 3639441 3152194 3420512 3605437 3608569 3132750 3005076 3310078
14051 3310078 2966784 3284703 3258208 3153904 2970417 3114045 2756967 2865839 2872741 2612189
14041 2612189 2822960 2796918 2716391 2639877 2988964 2698435 2522108 2543507 2951106 2615886
14031 2615886 2889259 2598057 2357048 2637747 2543692 2558340 2342421 2538489 2306230 2318390
$$ packed form
14101E455522k82958R8573k1128j84730j470j65444J76731K50820n68954k27752
14091D529210O19105n47269K17008k84212j80228M03125q8241l43838J27047m6998
14081D404709l43078O3482O5801j940l34203M88187l36916l90179K72518J86598
14071D074979p6276j00251k2814j38936m28854O85195o69110J71820l81090M79813
14061C594476M6490l31873L30348m87247K68318J84925L132m75819j27674L05002
14051C310078l43294L17919k6495j04304j83487J43628l57078J08872O902k60552
14041B612189K10771k6042q0527p6514L49087k90529j76327K1399M07599l35220
14031B615886K73373k91202k41009K80699r4055J4648k15919J96068k32259J2160
$$ plain form
14021 2318390 2171384 2503099 2058241 1999178 2098261 2492728 2134516 2003375 1694383 2210825
14011 2210825 1849786 1560675 2009568 2240491 2043438 1909390 1755317 2095672 2000144 2345051
14001 2345051 1887060 1915374 1739292 1599736 1841504 1742905 1634241 1753669 1473502 1737361
13991 1737361 1813639 1841752 2147514 4108489 10008977 28608049 48947410 26235991
13983 26235991 11295734 6933187 4905666 3913714 3534605 3339344 3082170 2620571 2712207
13974 2712207 2603383 2512529 2126741 2381913 2039841 2464154 1962793 1707334 1674364 2070544
13964 2070544 1873527 1968081 1912350 1944852 1797460 1984851 1763270 1882534 1643096 1941189
13954 1941189 1579903 1636096 1807387 1909039 1577586 1364763 1443198 1771740 1652887 1766630
$$ packed form
14021B318390j47006L31715m44858n9063R9083L94467l58212j31141l08992N16442
14011B210825l61039k89111M48893K30923j97053j34048j54073L40355r5528L44907
14001B345051m57991K8314j76082j39556K41768r8599j08664J19428k80167K63859
13991A737361P6278K8113L05762J960975N900488J8599072K0339361k2711419
13983B6235991A1295734m362547k027521r91952l79109j95261k57174m61599R1636
13974B712207j08824r0854l85788K55172l42072M24313n01361k55459l2970L96180
13964B070544j97017R4554n5731L2502j47392J87391k21581J19264k39438K98093
13954A941189l61286N6193J71291J01652l31453k12823P8435L28542j18853J13743
$$ plain form
13944 1766630 1587597 1520874 1365595 1400718 1473440 1665327 1363034 1246146 1428192 1592598
13934 1592598 1406966 1334939 1538708 1165255 1101311 1412164 1381616 1279468 1651091 1130986
13924 1130986 1617468 1226493 1317105 1287578 1172723 1343652 1471067 1282719 1084649 1107669
13914 1107669 1248939 1276759 1286117 1202423 1236689 1258438 1183372 1257881 1087131 1201184 1045226
13903 1045226 983737 1111739 1120085 1102470 1198453 1119274 1139913 1264166 1060574 908777 1150266
13892 1150266 1162354 1034657 1040735 1091175 882568 1332082 1226911 1019535 1108990 670916
13882 670916 965589 1339346 852953 1350191 1094158 1080434 984617 1013389 837773 1072927
13872 1072927 984573 823445 1124861 761514 1047771 855465 515789 796189 897148 1009556
$$ packed form
13944A766630j79033o6723j55279L5123P2722J91887l02293j16888J82046J64406
13934A592598j85632p2027K03769l73453o3944L10853l0548j02148L71623n20105
13924A130986M86482l90975R0612k9527j14855J70929J27415j88348j98070K3020
13914A107669J41270K7820R358q3694L4266K1749p5066P4509j70750J14053j55958
13903A045226o1489J28002Q346j7615R5983p9179K0639J24253k03592j51797K41489
13892A150266J2088j27697O078N0440k08607M49514j05171k07376Q9455m38074
13882F70916K94673L73757m86393M97238k56033j3724r5817K8772j75616K35154
13872A072927q8354j61128L01416l63347K86257j92306l39676K80400J00959J12408
$$ plain form
13862 1009556 867397 717298 1190179 972998 706190 1143870 854181 1005530 1099310 671479
13852 671479 749698 1005247 958888 833560 649219 1003199 954263 1087828 938081 792775
13842 792775 627177 846016 667358 756213 736613 763077 1007961 1009823 985160 721328 1185594
13831 1185594 516707 496885 803998 663327 683383 934642 801044 985946 585287 544639
13821 544639 596059 1036492 804472 865763 942044 773314 676915 866391 749720 536928
13811 536928 1086000 720387 762135 642349 681054 490634 479693 818978 1065196 819521
13801 819521 778318 686705 893790 920285 650109 731209 661558 645350 633029 747555 846637
13790 846637 542546 601906 402310 742399 595996 583113 610110 854542 762809 614616
$$ packed form
13862A009556j42159j50099M72881k17181k66808M37680k89689J51349R3780m27831
13852F71479P8219K55549m6359j25328j84341L53980m8936J33565j49747j45306
13842G92775j65598K18839j78658Q8855j9600K6464K44884J862k4663k63832M64266
13831A185594E16707j9822L07113j40671K0056K51259j33598J84902m00659m0648
13821E44639N1420M40433k32020O1291P6281j68730r6399J89476j16671k12792
13811E36928N49072l65613M1748j19786L8705j90420j0941L39285K46218k45675
13801H19521m1203r1613K07085K6495k70176Q1100o9651j6208j2321J14526R9082
13790H46637l04091N9360j99596L40089j46403j2883K6997K44432r1733j48193
$$ plain form
13780 614616 798842 590182 910051 699590 694231 472955 801885 452855 776532 622483
13770 622483 576157 533637 632429 437818 502700 397077 799430 658947 701076 713150 376028
13759 376028 557684 793195 644998 399667 809002 586853 287456 549378 229224 790224
13749 790224 681977 913156 593242 674531 580988 473522 321144 518421 646862 412086
13739 412086 600687 490894 591370 555505 567478 678371 391529 558687 356018 475374
13729 475374 384641 516162 491834 371684 782930 694279 550291 361878 558830 378811
13719 378811 596840 301631 298834 505553 688199 524386 639618 543456 422720 441392
13709 441392 739775 -7983 633060 554217 587357 290416 79519 75392 570664 276563 758189
$$ packed form
13780F14616J84226k08660L19869k10461n359k21276L28930l49030L23677j54049
13770F22483m6326m2520R8792j94611O4882j05623M02353j40483M2129J2074l37122
13759C76028J81656K35511j48197k45331M09335k22149B87456K61922B29224N61000
13749G90224j08247K31179l19914Q1289r3543j07466j52378J97277J28441k34776
13739D12086J88601j09793J00476l5865J1973J10893k86842J67158k02669J19356
13729D75374r0733J31521k4328j20150M11246q8651j43988j88413J96952j80019
13719C78811K18029k95209k797K06719J82646j63813J15232r6162j20736J8672
13709D41392K98383g983F33060p8843L3140B90416G9519m127M95272B76563M81626
$$ plain form
13698 758189 528443 436917 702600 245681 708458 525212 380826 371081 573426 231568
13687 367571 255772 446596 399653 652128 135572 543416 610299 167752 618291 222481
13676 504529 284840 202059 314157 486469 384610 611509 468917 604505 588297 446782
13666 446782 503077 402223 298420 -25280 365976 689941 574124 318442 615384 485976
13656 485976 81534 248376 355805 367355 242705 234938 448548 485465 505034 142347 95870
13645 95870 297890 -13737 472324 634727 578604 529801 278044 167205 641605 423113
13635 423113 364105 176918 311588 454390 600385 366983 301381 394660 114407 376059
13625 376059 244075 210582 220557 56993 397334 660892 -8291 478260 541230 229700 135277
$$ packed form
13698G58189k29746r1526K65683B45681M62777j83246j44386r745K02345B31568
13687C67571j11799J90824m6943K52475A35572M07844O6883A67752M50539B22481
13676E04529k19689q2781J12098J72312j01859K26899j42592J35588j6208j41515
13666D46782N6295j00854j03803b5280C65976L23965j15817k55682K96942j29408
13656D85976H1534J66842J07429J1550j24650p767K13610L6917J9569A42347m6477
13645I5870K02020a3737D72324J62403n6123m8803k51757j10839M74400k18492
13635D23113n9008A76918J34670J42802J45995k33402o5602R3279A14407K61652
13625C76059j31984l3493R975E6993L40341K63558h291D78260O2970B29700r4423
$$ plain form
13614 135277 358736 444523 -70706 -58029 287639 309257 153835 186882 158211 156076 540540
13603 540540 262944 682766 2272 371675 179517 312953 300166 482403 365365 368889
13593 368889 147206 288670 722138 65944 512671 278974 509001 186731 -18770 56451
13582 269320 215403 86214 131201 249011 344677 249684 448968 59330 -67167 104506 94084
13571 94084 280150 385158 454284 484868 188106 122620 482480 396827 167053 283882
13561 283882 352763 252164 270579 235020 102060 115594 280239 346174 368893 207649 -143267
13549 152290 188521 585880 457489 318927 248503 468070 30435 -6374 36444 120153 169628
13538 169628 347586 279976 385606 401007 320508 291406 192107 316908 73383 87217 -71862
$$ packed form
13614A35277K23459Q5787g0706J2677B87639K1618A53835L3047k8671k135L84464
13603E40540B62944M19822B272L69403A79517J33436j2787J82237j17038L524
13593C68889A47206J41464M33468F5944M46727k33697K30027A86731a8770E6451
13582B69320n3917H6214M4987J17810R5666r4993J99284E9330f7167A04506j0422
13571I4084J86066J05008O9126L0584A88106o5486L59860q5653A67053J16829
13561B83882O8881j00599J8415l5559A02060J3534J64645O5935K2719j61244a43267
13549A52290L6231L97359j28391j38562p0424K19567C0435f374C6444Q3709M9475
13538A69628J77958o7610J05630J5401q0499k9102r9299J24801G3383J3834g1862
$$ plain form
13526 134402 123090 118512 439968 181033 123068 302529 -44328 329921 31173 425458 302006
13515 302006 411443 323201 443998 193615 222217 202115 146318 90598 275483 141656
13505 141656 438088 153138 -44854 465150 -70519 362617 -98086 303515 269126 501311
13495 501311 152645 216633 461693 220278 433429 127338 -13484 107822 556406 -35926
13484 -21185 138163 607181 116197 358818 -36505 407591 48729 118267 152075 209949 183140
13473 183140 356561 474069 155106 464589 195419 30074 128510 159771 78544 307645
13463 307645 21547 141314 184799 276929 72511 14158 -67256 87167 120429 -68954 65467
13451 3781 182286 59382 276340 339370 295766 202224 -190770 107770 143200 364126 78468
$$ packed form
13526A34402j1312m578L21456A81033n7965J79461d4328C29921C1173L94285j23452
13515C02006J09437q8242J20797A93615K8602k0102n5797n5720J84885j33827
13505A41656K96432A53138d4854D65150g0519C62617i8086C03515l4389K32185
13495E01311A52645O3988K45060B20278K13151A27338a3484A07822M48584c5926
13484b1185A38163M69018A16197K42621c6505D07591D8729O9538L3808N7874k6809
13473A83140J73421J17508A55106L09483A95419C0074R8436L1261G8544K29101
13463C07645B1547J19767M3485R2130G2511A4158f7256H7167L3262f8954F5467
13451C781J78505E9382K16958O3030m3604r3542a90770A07770L5430K20926G8468
$$ plain form
13439 258554 312759 18559 459851 397843 433662 327187 327283 -294141 -19241 287768 476022
13428 476022 472500 281978 117857 216907 36301 251073 264526 111654 233708 67826 142609
13417 142609 230509 -37318 110320 339160 113097 428464 286701 195456 47238 236552
13407 236552 407274 166950 408676 219201 268333 279462 -252143 -132632 -79461 111265
13396 -97423 438423 370843 470250 -61390 102791 320566 15856 -12673 269804 171618 180091
13385 180091 11067 259074 81668 -46948 -35525 403129 31948 -1882 396875 165321 -91250
13373 -155479 363667 42148 173242 220798 313955 277826 254998 -99541 202494 419900 179967
13361 257126 187974 75721 362099 415527 414743 -65279 181417 641277 38902 457140 16494
$$ packed form
13439B58554N4205A8559M41292o2008L5819j06475R6b94141a9241B87768J88254
13428D76022l522j90522A17857R9050C6301K14772J3453A11654J22054F7826P4783
13417A42609Q7900c7318A10320K28840A13097L15367j41763r1245D7238J89314
13407B36552J70722A66950K41726j89475M9132J1129b52143J19511N3171A11265
13396i7423D38423o7580R9407f1390A02791K17775A5856a2673B69804r8186Q473
13385A80091A1067K48007H1668d6948J1423D03129C1948a882C96875A65321i1250
13373a55479C63667D2148J31094M7556R3157l6129k2828i9541B02494K17406A79967
13361B57126o9152G5721K86378N3428p84f5279A81417M59860C8902M18238A6494
$$ plain form
13349 37495 311448 182704 -55785 123853 291679 80248 50282 366600 423298 47142 -44739
13337 218440 -8027 14135 30652 268525 470215 349543 212038 -43206 113634 265594
13327 265594 175629 95365 192460 -63357 176627 220960 93919 387021 183870 266573 136100
13316 136100 141001 140773 175197 -14857 82206 247739 256984 50509 415292 280389 -64334 298187
13303 236905 276456 216657 210868 384862 249221 -269997 -7394 267994 87361 49644 -44992
13291 431532 -134615 134480 -163734 99846 -242913 -102331 276175 114135 -369597 -187687
13281 -187687 87102 -41762 470295 126036 50847 -49456 -175989 228973 58336 106242 173175
13270 173175 337561 247992 127266 -75377 333170 -50605 76392 68917 -104960 93956 -64478
$$ packed form
13349C7495K73953j28744e5785A23853J67826H0248k9966L16318N6698D7142d4739
13337B18440h027A4135J6517K37873K01690j20672j37505d3206A13634J51960
13327B65594q9965q0264R7095f3357A76627M4333I3919K93102A83870Q2703j30473
13316A36100M901k28L4424a4857H2206J65533R245E0509L64783j34903f4334B98187
13303B36905L9551n9799n789J73994j35641b69997g394B67994H7361l7717d4992
13291D31532a34615A34480a63734I9846b42913a02331B76175A14135c69597J81910
13281a87687H7102d1762D70295A26036E0847d9456j26533B28973E8336M7906O6933
13270A73175J64386q9569j20726g5377C33170e0605G6392p475a04960I3956f4478
$$ plain form
13258 134659 -47419 258198 40963 211835 177049 47503 158754 34688 -158188 17125 -183384
13246 78400 339440 -51424 -147893 -225505 -131388 154713 177464 120583 130495 -114394 -79278
13235 -79278 102854 -117010 324022 -6038 280980 261171 163211 -124437 153486 148888 111254
13224 111254 -56785 -152090 458364 155650 -84074 -235788 178815 124422 -128755 296303
13213 161790 -68505 -75804 487422 85017 185229 10371 36445 -123724 443643 36119 215167
13202 215167 71218 -55520 85 -16413 144443 102079 161856 244236 -58563 -151203 -53084 -82292
13190 -82292 -166111 -93492 52275 -24573 -7780 97717 13452 -35412 41999 -38527 184077 4979
13177 169050 40218 376487 -23681 -11858 179823 -64128 10118 -125020 128947 -60108 -46333
$$ packed form
13258A34659d7419B58198D0963J70872l4786D7503J11251C4688a58188A7125a83384
13246G8400K61040e1424r6469p7612R4117A54713K2751n6881R912a14394L5116
13235g9278A02854a17010C24022f038B80980j9809r7960a24437A53486m598l7634
13224A11254e6785r5305D58364A55650h4074j51714A78815n4393a28755B96303
13213A61790f8505p299D87422H5017J00212A0371K6074a23724D43643C6119J79048
13202B15167G1218e5520H5a6413A44443m2364N9777Q2380e8563r2640e3084k9208
13190h2292q3819P2619E2275b4573g780I7717A3452c5412D1999c8527A84077D979
13177A69050D0218L36269b3681J1823A79823f4128A0118a25020A28947f0108J3775
$$ plain form
13166 -46333 144492 -110774 129484 -51594 298352 83619 141223 -34797 10058 10767 -37201
13154 304097 218740 220616 -156088 49748 201505 66646 144800 -20260 113286 -56603 36299
13142 245480 42304 -40320 82078 18660 22887 -41083 -105052 -50742 -148866 193615 -144 255764
13129 -109092 -55315 -127645 -67115 126232 75967 -65703 -186347 54490 92081 -88384 -286983
13118 -286983 72434 145850 270494 -215730 -224857 -71513 -30953 178251 -74085 43446 110855
13107 110855 246926 22083 232036 44704 448273 407108 -31765 -10567 390846 114072
13096 224459 28334 96251 46493 208197 -150019 301901 101630 120791 12480 -175587
13085 42100 42793 69658 328855 -18979 472459 187939 -110931 224620 24261 521087 296560
$$ packed form
13166d6333A44492a10774A29484e1594B98352H3619N7604c4797A0058P09c7201
13154C04097q5357J876a56088D9748J51757F6646P8154b0260A13286e6603C6299
13142B45480D2304d0320H2078A8660M227d1083o3969e0742r8124A93615a44B55764
13129a09092N3777p2330O0530A26232n0265f5703j20644E4490L7591h8384j98599
13118b86983G2434P3416J24644b15730r127g1513c0953A78251g4085D3446O7409
13107A10855J36071B2083K09953D4704M03569m1165c1765a0567C90846A14072
13096B24459B8334O7917D6493J61704a50019C01901A01630J9161A2480a75587
13085D2100O93K6865K59197a8979D72459A87939a10931B24620B4261M96826k24527
$$ plain form
13074 296560 -150581 36487 -61820 31181 93638 66421 447305 221683 338861 13691 -144986
13062 148096 154557 22794 -219439 249783 292638 130734 114486 250899 -35179 -29851 149137
13050 63672 434309 308178 53785 276852 156439 57902 366011 270703 118052 41542
13039 28449 282602 253007 434357 -11525 314281 -126386 26816 251439 20353 -3138 -14212
13028 -14212 322355 -64112 13850 -20863 -211483 239476 41717 100368 184322 313322 -113637
13016 -44061 13735 -108754 322058 176081 -51030 196045 127927 478960 251604 197778
13006 197778 -49138 88979 -241134 -78542 -164300 -28037 -64611 59975 88004 95573 442341
12995 442341 200007 -103017 -1648 569 51280 -71066 -69688 -76496 -279778 152849 -413186
$$ packed form
13074B96560a50581C6487f1820C1181O2457k7217L80884B21683J17178A3691a44986
13062A48096O461B2794b19439B49783M2855A30734j6248J36413c5179N328A49137
13050F3672L70637j26131E3785K23067j20413E7902L08109r5308A18052D1542
13039B8449K54153k9595J81350a1525C14281a26386B6816K24623B0353c138j1074
13028a4212C22355f4112A3850b0863j90620B39476D1717N8651Q3954J29000a13637
13016d4061A3735a08754C22058j45977e1030A96045o8118L51033k27356n3826
13006A97778d9138H8979b41134g8542q5758b8037l6574E9975K8029P569L46768
12995D42341B00007a03017a648E69N0711g1066J378o808k03282A52849d13186
$$ plain form
12983 -118303 -241996 -94791 100023 48965 40773 188387 -97121 147022 -49854 102289 -42308
12971 6324 -206097 75318 28072 192249 84422 214868 126904 -43947 360979 75404 -211721
12959 -84794 23764 -21619 56738 -142295 98323 14358 -204677 20447 -155901 482095 268635
12948 268635 130612 218618 -123031 -81819 40707 -55842 -16059 61664 169601 -68307 -93702
12937 -93702 -99834 -55312 155818 19268 -283658 30382 180458 -53604 153467 -88564 285961
12925 134243 -147352 259184 446403 112237 131957 240360 -215425 -227830 34993 4790
12914 -301598 88430 25471 303663 -102570 -265396 88369 153887 -162402 106882 142233
12904 142233 -475464 33281 -32193 -3207 -48272 93561 115877 83378 -173118 185216 310095
$$ packed form
12983a18303j23693i4791A00023D8965q192J47614i7121A47022d9854A02289d2308
12971F324b06097G5318B8072J64177H4422J30446q7964d3947C60979G5404b11721
12959h4794B3764b1619E6738a42295I8323A4358b04677B0447a55901D82095k13460
12948B68635A30612Q8006a23031M1212D0707e5842a6059F1664J07937f8307k5395
12937i3702o132M4522A55818A9268b83658C0382J50076e3604A53467h8564B85961
12925A34243a47352B59184J87219A12237J9720J08403b15425j2405C4993D790
12914c01598H8430B5471K78192a02570j62826H8369O5518a62402A06882L5351
12904A42233d75464C3281c2193c207m5065I3561K2316l2499a73118A85216J24879
$$ plain form
12893 310095 137353 148898 1111 107070 -57202 -108105 -186961 29759 18206 319713 -170744
12881 151573 311479 61095 146640 -314899 172080 392636 -44945 347251 -167956 -209002
12871 -209002 31752 -39256 327203 244306 291555 17772 -65467 70667 -207733 -71864 -78916
12860 -78916 -317279 -244830 -48142 278444 134534 -27886 -7761 268088 192507 205134 55374
12848 157335 17395 -20764 -174298 213818 -21120 268019 -597529 26018 238075 -4253 59584
12836 -106792 -105576 173701 99190 230444 156973 -103505 -198501 -180787 -254407 184058 -295583
12824 63862 76879 -186959 -55494 -152867 -209299 -319429 -204627 182963 -9677 221347 -246799
12812 35945 65185 265093 -64076 -32084 170695 -96101 206236 134397 -47887 181252 59891
$$ packed form
12893C10095A37353J1545A111J05959e7202n0903p8856B9759j1553L01507a70744
12881A51573J59906F1095Q5545c14899A72080K20556d4945C47251a67956m1046
12871b09002C1752c9256C27203q2897M7249A7772f5467G0667b07733g1864p052
12860g8916k38363P2449d8142B78444A34534b7886g761B68088p5581J2627E5374
12848A57335A7395b0764j53534B13818b1120B68019e97529B6018K12057d253E9584
12836a06792J216A73701p4511J31254p3471a03505r4996J7714p3620A84058b95583
12824F3862J3017a86959e5494r7373n6432j10130J14802A82963i677B21347b46799
12812C5945K9240J99908f4076L1992A70695i6101B06236p1839d7887A81252E9891
$$ plain form
12800 -62376 -161069 -265744 6289 52542 -379304 -230698 -105131 -292829 -67295 -266423 -110941
12788 -111598 -83568 -214085 -235984 -192187 -195470 94535 -50321 -114760 -155956 -253623 13872
12776 90786 190441 69495 -199852 82204 -306377 -224253 240394 104607 -107420 354287
12765 68506 262689 -107293 313611 10938 126898 -109495 -146874 -140998 4788 -137914 268342
12753 34027 -54831 -80855 36039 308091 -338721 -273507 84361 173555 164349 -288225 -293816
12742 -293816 128200 218192 150337 223354 124889 237174 25084 -139036 126243 204072 22231
12730 -192743 -122715 -34047 -314708 34366 -413678 -167106 98866 309721 -2507 -67201 34086
12718 208768 7074 24507 131068 -120294 -130950 -192582 31513 -131645 -60176 141794 13872
$$ packed form
12800f2376r8693j04675F289M6253c79304J48606a05131j87698f7295j99128a10941
12788a11598K8030j30517k1899M3797l283I4535e0321o4439m1196r7667A3872
12776I0786R9655F9495a99852H2204c06377Q2124B40394A04607a07420C54287
12765F8506J94183a07293C13611A0938J15960a09495l7379N876D788a37914B68342
12753C4027e4831k6024C6039K72052c38721O5214H4361Q9194r206b88225n591
12742b93816A28200Q9992o7855P3017r8465J12285B5084a39036A26243P7829B2231
12730a92743P0028c4047k80661C4366d13678a67106I8866K10855b507o4694C4086
12718B08768G074J7433J06561a20294j0656o1632C1513a31645f0176A41794A3872
$$ plain form
12706 236728 149623 -25499 -15277 173410 140385 221794 133425 386939 250777 -107804 213346
12694 73343 -153640 215233 -362236 155862 -168427 21932 286981 -340228 -149747 -350945
12684 -350945 29754 66348 362358 -292204 -109564 268633 152302 220042 -59260 166016
12673 245131 -94659 -36888 -50908 18365 -122732 181980 148037 -15979 -120739 166782 317690
12662 317690 -69654 267518 234738 127948 15165 30647 211140 -179738 -54556 189338
12651 179905 190193 -50672 193328 116156 -28825 278745 433372 32456 -191672 336202
12640 -432108 204735 228828 -356228 -100762 -283251 131000 -23155 -11739 -32283 104129
12629 274476 134878 144276 115074 29710 121612 402566 178859 144317 -206489 -201009 214992
$$ packed form
12706B36728q7105b5499J0222A73410l3025Q1409q8369K53514j36162a07804B13346
12694G3343a53640B15233c62236A55862a68427B1932K65049c40228a49747k01198
12684c50945B9754L6594K96010b92204a09564B68633j16331O7740e9260A66016
12673B45131i4659c6888j4020A8365a22732A81980l3943a5979j04760A66782J50908
12662C17690f9654B67518l2780j06790A5165J5482J80493a79738e4556A89338
12651A79905J0288e0672A93328p7172b8825B78745J54627C2456a91672C36202
12640d32108B04735K4093c56228a00762j82489A31000b3155J1416k0544A04129
12629B74476A34878R398k9202B9710R1902K80954A78859l4542b06489N480B14992
$$ plain form
12617 365822 -220203 238415 133221 138253 212973 130829 -99692 34862 111412 -332001 145633
12605 -20320 75414 -257034 -18736 148143 34125 -36035 159340 63034 257743 23479 40534
12594 40534 160170 86851 219275 166473 -56904 -79070 -139575 45082 173712 -129217 -181422
12583 -181422 -20904 16317 226827 90181 -130662 -148900 -106781 -115569 236384 -71205 -256804
12572 -256804 -468858 96856 167059 40466 -253109 182796 13883 -31033 22219 -61158 -52490
12561 -52490 259312 298245 -65030 128650 339167 80535 142710 199342 77533 258705 -136600
12549 -145854 116616 318078 -27025 55936 193530 -118945 28832 377615 -308682 -233597
12539 -233597 -389173 -208368 55912 -221166 -72028 -178473 170549 60833 237317 292511
$$ packed form
12617C65822b20203B38415j05194N032P4720q2144i9692C4862P6550c32001A45633
12605b0320G5414b57034a8736A48143C4125c6035A59340F3034J94709B3479J7055
12594D0534J19636p3319J32424n2802e6904k2166o0505D5082J28630a29217n2205
12583a81422b0904A6317K10510I0181a30662j8238M2119q788B36384g1205j85599
12572b56804k12054I6856P0203D0466b53109A82796A3883c1033B2219f1158Q668
12561e2490B59312L8933f5030A28650K10517H0535O2175N6632G7533J81172a36600
12549a45854A16616K01462b7025E5936J37594a18945B8832L48783c08682P5085
12539b33597j55576J80805E5912b21166g2028j06445A70549F0833J76484N5194
$$ plain form
12529 292511 -69746 331113 176417 256445 67385 150088 -3771 46948 -143438 120866 -133348
12517 -35196 50973 246453 68944 -338807 -248854 -261397 29600 -68493 142198 -19535 -49430
12506 -49430 7926 249767 241585 173612 -34137 60615 99756 46325 -106523 -33818 -77334 101250
12493 123013 32540 -47696 -91210 -13808 -4066 245356 174382 86535 259901 -58563 42514
12481 -52105 146910 1451 92064 -129363 310215 -212935 -136511 156074 7400 172820 352781
12470 352781 45246 120610 61033 -10562 -39278 80153 -29319 294055 -34492 261258 132547
12459 132547 -48353 -356241 -252492 58271 225017 371282 198998 268981 -176895 -142236
12449 -142236 -130786 -23325 -13800 -120609 -66532 -124662 -13585 4832 -168746 66054 63620 211723
$$ packed form
12529B92511f9746C31113j54696Q0028F7385Q2703c771D6948a43438A20866a33348
12517c5196E0973J95480F8944c38807Q9953j2543B9600f8493A42198a9535k9895
12506d9430G926K41841q182o7973c4137F0615L9141D6325a06523c3818m3516A01250
12493A23013C2540d7696m3514a3808d066B45356p0974H6535J73366e8563D2514
12481e2105A46910A451R0613a29363C10215b12935P6424A56074G400J65420J79961
12470C52781D5246P5364n9577a0562k8716H0153b9319B94055c4492B61258j28711
12459A32547d8353l07888J03749E8271J66746J46265j72284O9983a76895L4659
12449a42236J1450b3325R525j06809N4077n8130a3585D832a68746F6054k434J48103
$$ plain form
12437 211723 -621 -240435 -67630 -78099 262183 -103214 25801 -115881 -24971 -294667 54040
12425 -20050 33980 -424188 -38306 49310 -79453 -236791 -399083 326012 108810 -131572
12414 197596 266347 95769 -7630 -263047 -163328 -160480 -366726 277482 -36409 -209716 74463
12402 -125535 43537 35156 106300 -30058 156805 -238026 167966 231281 119631 -64868 -314069
12391 -314069 162589 -14863 -63029 42781 88565 108328 -55075 242473 7400 -56549 68316
12379 -3847 -17882 145921 183320 -262505 170566 -217038 -31481 260646 -18816 3626 -74628
12367 49136 -113599 8824 86753 -9296 181167 -190884 33913 153568 -50364 177530 169667
12356 169667 45487 -61098 -56840 -14611 75802 103898 -58460 141264 51372 -7727 -143626
$$ packed form
12437B11723f21k39814f7630j0469B62183a03214B5801a15881b4971k69696E4040
12425b0050C3980d24188c8306D9310g9453j57338j62292C26012A08810a31572
12414A97596O8751I5769g630k55417R9719K848k06246B77482c6409j73307G4463
12402a25535D3537q381P1144c0058A56805b38026A67966O3315j11650f4868k49201
12391c14069A62589a4863m8166D2781M5784J9763e5075B42473G400e6549F8316
12379c847j4035A45921L7399b62505A70566b17038c1481B60646a8816C626g4628
12367D9136a13599H824P7929i296A81167a90884C3913J19655e0364A77530p863
12356A69667D5487f1098M258a4611G5802K8096e8460A41264E1372g727j35899
$$ plain form
12345 -143626 152790 -42534 45581 -416717 -63648 29585 -55185 -51547 14485 432804 -14616
12333 -33515 -191860 -50827 -98707 -225342 -80002 -43807 4398 40366 -12924 57303 78321
12322 78321 150656 -80867 91734 -36026 158939 151964 -30971 -51152 -52914 154199 -99497 220039
12309 151175 -7473 -217145 81551 323843 46591 242765 130584 -382381 -38569 -43640 76113
12297 -220743 -73599 88977 140196 66482 -169986 -15399 -284080 9160 193149 125160 180504
12286 180504 -161054 4398 -36119 23499 167216 266391 99874 -232658 -7313 192205 216432
12275 216432 167508 98670 420878 340044 119024 -31788 352243 176854 -4933 34358 -262614
12263 118975 6294 -41714 -30826 -64052 -2316 33670 233990 -215627 192160 -105013 -8128
$$ packed form
12345a43626A52790d2534D5581d16717f3648B9585e5185L638A4485M18319a4616
12333c3515j58345e0827m7880j26635h0002L6195D398L5968a2924E7303K1018
12322G8321P2335h0867I1734c6026A58939o975c0971k0181j762A54199i9497B20039
12309A51175g473k09672H1551K42292D6591J96174j12181c82381c8569n071G6113
12297b20743g3599H8977N1219F6482a69986a5399k68681I160J83989o7989N5344
12286A80504a61054D398c6119B3499J43717R9175I9874b32658g313A92205K4227
12275B16432m8924o8838L22208q0834A19024c1788C52243j75389d933C4358b62614
12263A18975F294d1714J0888l3226b316C3670K00320b15627A92160a05013h128
$$ plain form
12251 -170936 -68771 -159780 189920 -260595 -5814 333291 41190 122979 156488 131344 -64435
12239 -292344 33035 232714 -78607 135062 108373 -191413 -49896 307814 34362 18755 95044
12228 95044 148411 157280 -128192 32703 119042 166791 243307 -223007 216181 -192355 366455
12216 403204 316317 186006 -135738 200884 163696 349698 139318 -109847 116703 35333
12205 71834 -202963 640312 42834 -86273 -128626 71791 -126345 189456 -181972 338019
12194 83173 79531 160999 292441 238171 154911 173635 111372 234090 155439 288984 -146547
12182 -25037 77510 70189 -209129 191049 -92447 -21634 44761 67461 12777 202138 64829
12170 67606 348923 -115607 6305 -82452 -124070 129903 40173 96156 167775 -110104 -137076
$$ packed form
12251a70936f8771r1009A89920b60595e814C33291D1190Q1789L3509k5144f4435
12239b92344C3035J99679g8607A35062k6689a91413d9896C07814C4362j5607P6289
12228I5044N3367Q869a28192C2703Q6339M7749P6516b23007B16181a92355C66455
12216D03204q6887j30311a35738B00884l7188J86002A39318a09847A16703C5333
12205G1834b02963F40312D2834h6273m2353G1791a26345A89456a81972C38019
12194H3173l642Q1468J31442n4270q3260J8724o2263J22718p8651J33545a46547
12182b5037G7510p321b09129A91049i2447b1634D4761K2700A2777J89361F4829
12170F7606K81317a15607F305h2452m1618A29903D0173N5983P1619a10104k6972
$$ plain form
12159 -137076 -65188 14953 -35249 70404 302594 407177 129407 124919 -220591 -87487 5871
12147 131005 88326 -202692 -44582 -48326 68399 -24895 98106 -94282 247359 326253 151037
12135 4885 122564 193320 108097 47138 89047 35269 381207 127102 223115 25259 -73210
12123 15964 -189677 305186 167527 -97324 -18706 36481 114859 -186104 130531 -36852 -320260
12112 -320260 171930 316445 155878 107668 102771 -61711 -121056 -140863 -23681 -27507 -221315
12101 -221315 -69087 -32071 -186704 5852 -172103 282004 -68152 177978 11141 -18574 -44493
12090 -44493 169030 -72141 -26725 10102 211970 155299 31856 76504 30008 -104110 215309
12078 187571 68029 -108295 -182065 195473 -90640 172970 1080094 1831882 994007 129868
$$ packed form
12159a37076f5188A4953c5249G0404K32190J04583A29407m488b20591h7487E871
12147A31005m2679b02692d4582l744F8399b4895I8106i4282B47359P8894A51037
12135D885J17679P0756q5223D7138M1909C5269L45938A27102R6013B5259g3210
12123A5964a89677C05186j37659i7324a8706C6481P8378a86104A30531c6852k83408
12112c20260A71930J44515A55878m8210m897f1711n9345j9807b3681l826j93808
12101b21315f9087c2071j54633E852a72103B82004f8152A77978A1141a8574k5919
12090d4493A69030g2141b6725A0102K01868n6671C1856M4648C0008a04110B15309
12078A87571F8029a08295p3770A95473i0640A72970R07124P51788q37875A29868
$$ plain form
12067 127407 -393827 -488435 -67185 82623 -43895 259013 -195000 -152129 19947 -286115 206509
12055 -99960 -82160 -8140 -8638 -104165 10537 6294 178562 -221246 56467 156107 347217 -281675
12042 41579 43531 -176988 53970 -351498 124454 23115 -305550 -160495 69098 25640 397974
12031 397974 -80673 -146800 202932 -38215 -51765 -54168 -40669 -234133 29132 190040 -430330
12019 100663 150236 4373 105356 -33484 -74803 -350878 -218185 182060 -187115 -128658 -338771
12008 -338771 164501 61010 240368 64640 -205862 -370100 -248429 -183378 -129259 -253975
11998 -253975 28135 -174456 -202581 7610 116856 271298 -44341 -86235 21924 -4449 -265169
11987 -265169 -77847 171915 -216076 -118814 6260 99045 47747 3200 237204 -75510 -51202
$$ packed form
12067A27407c93827r4608f7185H2623d3895B59013a95000M2871A9947b86115B06509
12055i9960J7800h140m98r5527A0537m243J72268b21246E6467R9640J91110b81675
12042D1579J952a76988E3970c51498A24454B3115c05550J45055F9098B5640L72334
12031C97974h0673o6127B02932c8215j3550k403J3499j93464B9132J60908d30330
12019A00663M9573D373J00983c3484m1319k76075J32693A82060a87115N8457k10113
12008c38771A64501F1010J79358F4640b05862j64238J21671O5051N4119j24716
11998b53975B8135a74456k8125G610J09246J54442d4341m1894B1924d449k60720
11987b65169g7847A71915b16076R7262F260R2785D7747C200K34004g5510K4308
$$ plain form
11976 -51202 -141300 -17898 -54516 213974 -151813 393390 -284360 16365 -153183 -157761 134743
11964 101591 -86361 -33695 108341 -52203 92867 -230980 76618 65714 -340411 187384 82242
11952 17782 -190764 104436 -277699 -153199 -80757 2158 -302587 401898 -423757 105847
11941 -112342 -287519 312613 208168 -213457 38402 247312 67189 -134557 -178281 -37958
11930 -61482 -217190 -24190 -180696 -158359 -30714 59246 -29566 102465 -61165 -208641 229671
11918 125664 -47255 223321 344039 193186 139926 227013 -34515 304633 -39940 -168985
11908 -168985 2333 -264813 -141672 197135 9663 120349 28041 -294429 -98690 224868 68874
11896 -216220 -255309 4761 131716 233946 -166995 -180682 -229684 196141 -112953 -198142 -105557
$$ packed form
11976e1202r0098a7898l6618B13974a51813C93390b84360A6365a53183m578A34743
11964A01591h6361c3695A08341e2203I2867b30980G6618j0904c40411A87384H2242
11952A7782a90764A04436b77699J24500P2442B158c02587D01898d23757A05847
11941a12342j75177C12613j04445b13457C8402K08910F7189a34557m3724c7958
11930f1482j55708b4190j56506K2337c0714E9246b9566A02465f1165j47476B29671
11918A25664d7255B23321J20718j50853n3260Q7087c4515C04633c9940j29045
11908a68985B333b64813J23141A97135I663J10686B8041b94429i8690B24868F8874
11896b16220l9089D761J26955J02230a66995j3687m9002A96141a12953q5189R2585
$$ plain form
11885 -105557 -407138 -44116 -97545 -250723 95359 -245245 63206 -51996 -93963 181822 85437
11873 114819 10927 90700 -258644 124399 -35272 -11824 -119246 271257 68837 -75307 -224609
11862 -224609 -97828 -83628 -65025 -122252 -52796 -178750 -48244 51497 166963 -63905 41240
11850 -41674 198138 113374 -10137 -85876 -26499 -2224 5718 261806 -177653 47974 15495
11838 55644 25205 -39374 -30827 -124439 -129201 156653 -478741 25814 -548 -153408 -153742 -105056
11826 -105056 184553 -11433 -50842 44615 -158990 35437 179441 -297217 209673 213771 -132065
11814 -125616 329220 234678 147517 -56214 -69544 -30046 -270586 -120813 -203278 -240029 6591
11802 103659 67762 -82208 -192392 -36555 100230 57516 256540 242624 -130687 -212750 -186764
$$ packed form
11885a05557l01581d4116n3429j53178I5359b45245F3206e1996m1967A81822H5437
11873A14819A0927P9773b58644A24399c5272a1824j07422B71257F8837g5307j49302
11862b24609i7828J4200J8603n7227e2796j25954d8244E1497J15466f3905D1240
11850d1674A98138q4764a0137p5739b6499b224E718K56088a77653D7974A5495
11838E5644B5205c9374Q547r3612m762A56653d78741B5814e48j52860l34M8686
11826a05056A84553a1433l9409D4615a58990C5437J44004b97217B09673M098a32065
11814a25616C29220r4542q7161e6214j3330c0046k40540a20813q2465l6751F591
11802A03659l5897h2208j10184c6555A00230m2714J99024j3916a30687q2063K5986
$$ plain form
11791 -186764 -179707 216557 -99506 84084 117353 -26664 -159304 -211239 66662 -5899 365230
11779 -139059 -56921 44097 112494 -220685 -204398 52704 -34771 253815 -56539 145155 141112
11768 141112 -28883 -110888 -73917 -178314 -242225 93705 309740 74235 -54593 -62934 122892
11756 -6051 -456167 86242 -353478 374021 -71301 -116 181795 -281633 194497 155723 125062
11745 125062 87896 78945 290212 -99799 227272 300629 126805 2508 -343036 99460 -1556
11733 -263485 -186048 53117 41143 -245840 -22559 -52798 -418895 165777 -377639 66765 209309
11722 209309 -54065 -6340 -62296 -5244 250333 18452 38728 -4109 -6495 -61999 142248 -22396
11709 4870 -80237 -122026 194099 -113468 -133447 9195 -22557 185591 19318 46232 -59577
$$ packed form
11791a86764P057B16557i9506H4084L3269b6664j32640n1935F6662e899C65230
11779a39059e6921D4097O8397b20685J6287E2704c4771B53815e6539A45155m043
11768A41112b8883q2005L6971j04397o3911I3705K16035G4235e4593q341A22892
11756f051m50116H6242c53478C74021g1301a16A81795b81633A94497l8774l0661
11745A25062l7166q951K11267i9799B27272P3357A26805B508c43036I9460a556
11733b63485P7437E3117j1974b45840b2559l0239l66097A65777c77639F6765J42544
11722B09309e4065f340n5956e244B50333A8452K0276d109k386n5504A42248b2396
11709D870h0237m1789A94099a13468j9979I195b2557A85591A9318K6914e9577
$$ plain form
11697 96549 -234811 127305 -31590 -210669 163538 10184 188197 -127052 124059 313096
11687 313096 248501 212302 183535 22492 -126397 62734 335587 -121503 7998 -175580 165989
11675 -198537 246952 30481 143434 -106041 264826 36168 -324949 315906 -285963 -81968
11664 227211 276024 -262167 112529 -217111 231731 -7390 -500304 89436 91077 19225 27672
11653 27672 195194 178 -97995 8857 -183699 200982 203036 78266 98279 306208 248648 -121467
11640 -86 -253624 196711 -154446 60120 -65183 -110165 -17698 16820 441035 -92906 115454
11628 -71587 38372 -8636 218446 -11046 -42261 120966 -41113 -464066 -238183 222649 441527
11617 441527 -66431 -222034 7335 113732 -254184 -53416 203306 31167 -148900 79116 298440
$$ packed form
11697I6549b34811A27305c1590j79079A63538A0184J78013a27052A24059J89037
11687C13096o4595l6199k8767B2492a26397F2734K72853a21503G998a75580A65989
11675a98537B46952C0481J12953a06041B64826C6168c24949C15906b85963h1968
11664B27211M8813b62167A12529b17111B31731g390m92914H9436J641A9225Q447
11653B7672J67522A78i7995H857a83699B00982K054G8266K0013K07929n7560a21467
11640h6k53538A96711a54446F0120f5183m4982a7698A6820M24215i2906A15454
11628g1587C8372h636B18446a1046l1215A20966d1113m22953K25883B22649K18878
11617D41527f6431j55603G335J06397b54184e3416B03306C1167a48900G9116K19324
$$ plain form
11606 298440 216817 280426 3051 218851 -329555 -10896 -141433 -181963 147931 -136091 -62366
11594 -89700 -220665 1172 96778 98283 326700 139542 290539 456799 347108 400252 490252
11583 490252 28794 159217 268871 176381 156845 -17729 -149649 -5032 51522 356651 83147
11571 -13634 422435 265963 33948 46218 120881 198445 315498 -107060 -40527 -170662 -167136
11560 -167136 -310018 -84055 121018 191353 209780 148857 -22257 120447 -46943 -52418 115718
11548 101331 -4975 15012 32733 -72102 -310387 238342 -11521 320932 -107489 130002 45058
11536 42339 -157673 63852 -38306 533155 40039 -19558 15340 -10345 -71275 -18889 75492
11524 3792 -32351 333592 -21650 277485 115222 143562 -8011 -32702 468005 268760 205853
$$ packed form
11606B98440q1623O3609C051K15800c29555a0896j30537m0530A47931a36091f2366
11594h9700j30965A172R5606J505K28417A39542J50997J66260j09691N3144R0000
11583D90252B8794J30423J09654r2490j9536a7729j31920e032E1522L05129H3147
11571a3634D22435j56472C3948J2270P4663P7564J17053a07060d0527j30135L526
11560a67136j42882h4055A21018P0335J8427o0923b2257A20447d6943n475A15718
11548A01331d975A5012J7721g2102k38285B38342a1521C20932a07489A30002D5058
11536D2339a57673F3852c8306E33155D0039a9558A5340a0345o0930a8889G5492
11524C792c2351C33592b1650B77485A15222K8340h011k4691D68005j99245o2907
$$ plain form
11513 205853 22153 133045 135248 146232 120240 -57353 14897 -116182 247447 -92995 -107804
11502 -107804 168307 214701 156896 163937 110415 -66456 291917 95825 350458 38821 -97156
11490 232853 -106614 237200 42379 312420 370736 336082 151905 146135 -26772 110696 106613
11479 106613 46244 73574 429939 8177 271786 -188313 39083 -75587 213890 243616 -49888
11467 203731 52126 99475 142227 495011 126948 49767 49293 30465 -17386 86919 157076
11456 157076 255603 84170 -134424 246569 148386 157208 -171331 152791 335482 -952 -146103
11445 -146103 141765 -56392 -9022 -68051 -103207 -25632 -151388 -114839 -213612 66863 419999
11434 419999 -29043 220260 103963 -34292 150804 88194 -306198 -144716 156128 -218560
$$ packed form
11513B05853B2153J10892K203J0984k5992e7353A4897a16182B47447i2995j4809
11502a07804A68307M6394n7805P041n3522f6456B91917I5825K54633C8821i7156
11490B32853a06614B37200D2379K70041N8316l4654A51905n770b6772A10696m083
11479A06613D6244K7330L56365H177K63609a88313C9083g5587B13890K9726d9888
11467B03731E2126M7349M2752L52784A26948D9767m74j8828a7386H6919P0157
11456A57076R8527H4170a34424B46569r8183Q822a71331A52791J82691i52j45151
11445a46103A41765e6392i022n9029l5156b5632j25756L6549r8773F6863L53136
11434D19999b9043B20260A03963c4292A50804o2610c06198a44716A56128b18560
$$ plain form
11423 -48000 -100772 59410 -444624 -238494 333860 -77913 83966 178826 -214603 -55505 -75104
11412 -75104 224298 46531 294718 83830 -83575 54697 -28889 -178939 -62055 295923 38628
11400 -157036 93662 444242 211475 -52065 -168297 151164 246085 -251818 -102485 -33140
11389 7885 61927 189415 -12948 13514 -19246 665 -30198 45358 -103288 226688 -52447 485569
11376 -68806 167437 -133573 -55397 -37879 170658 -152760 -153639 55226 15000 34601 4273
11364 -193655 -119771 -114946 -76360 31965 -21464 -65518 -71999 24200 107918 103333 56618 37505
11352 37505 107717 147106 -55334 4157 144266 -36960 -437391 -160859 72163 132936 98474
11341 98474 215553 -119290 266418 -83749 -8307 -290868 27983 -240826 41160 -61836 94745
$$ packed form
11423d8000n2772E9410d44624K06130C33860g7913H3966R4860b14603e5505j9599
11412g5104B24298D6531K48187H3830h3575E4697b8889j50050f2055B95923C8628
11400a57036I3662L50580B11475e2065j16232A51164R4921b51818a02485c3140
11389G885N4042J27488a2948A3514a9246F65c0198D5358a03288B26688e2447D85569
11376f8806A67437a33573e5397J7518A70658a52760q79E5226A5000J9601D273
11364a93655P3884M825L8586C1965b1464m4054o481B4200Q3718m585m6715j9113
11352C7505P0212L9389e5334D157J40109c6960m00431a60859G2163O0773l4462
11341I8474J17079a19290B66418h3749h307k82561B7983b40826D1160f1836I4745
$$ plain form
11329 -231256 365732 -260499 92151 -37575 -165813 -78202 -115028 2372 143885 16925 -60871
11317 -71261 205268 -317910 117791 101446 50208 -46403 180578 -232230 39275 -97192 329489
11305 101991 -113381 143867 44931 -112620 189132 312349 -68798 -255699 -195840 -78240
11294 203772 42824 100422 5948 -136528 -141208 -13291 -48654 13175 61986 -101884 56453
11282 -57216 80856 97364 216180 13860 -44525 -356164 -373077 -153057 124727 -204890 -4598
11270 -107423 -84503 30661 -165451 -187247 -3232 100210 -243833 -7891 -268025 -75835 -120747
11259 -120747 -97086 -190844 -190070 -157693 222354 -245462 -17002 101913 66489 267417 -56450
11247 -87028 131052 109066 50904 23651 -296443 145165 -275869 -175048 -168137 220292 99481
$$ packed form
11329b31256C65732b60499I2151c7575j28238g8202l6826B372J41513A6925f0871
11317g1261B05268c17910A17791j6345E0208d6403A80578b32230C9275i7192C29489
11305A01991a13381A43867D4931a12620A89132J23217f8798j86901N9859g8240
11294B03772D2824N7598E948a36528m680a3291l5363A3175M8811a01884E6453
11282e7216H0856J6508J18816A3860d4525l11639j6913a53057A24727b04890d598
11270a07423K2920C0661a65451k1796c232A00210b43833g891k60134g5835m4912
11259a20747K3661r3758P74L2377B22354b45462a7002A01913l5424K00928e6450
11247h7028A31052k1986E0904B3651b96443A45165b75869J00821O911B20292I9481
$$ plain form
11235 102996 -3275 -102899 -69522 -4226 120273 -126338 -147871 -14073 4665 -43904 -295864
11224 -295864 -86010 -45614 87361 393501 96453 -122447 38708 -182146 -157113 -86600 -472888
11213 -472888 -145792 -175721 147640 -259499 -148841 -61032 -235858 360694 9227 -7225 51781
11201 147846 -311092 -266657 143792 -28699 352783 93564 -350042 144452 -570303 36606
11190 38181 155769 -104278 -60621 65869 -180497 -165848 7020 -109892 -199937 -66789 -402624
11179 -402624 -23338 -98980 -26591 172108 -36713 197088 -71134 569986 -339984 -205882
11169 -205882 -364 -263044 -141344 -43701 -253490 -325074 -138632 41349 -205102 -193510 187798
11157 34731 -199860 -103208 128540 48446 133350 154882 -128688 -113188 117684 114051 -82937
$$ packed form
11235A02996c275r9624L3377d226A20273a26338k1533a4073D665d3904k51960
11224b95864h6010M0396H7361L06140I6453a22447C8708a82146K5033P0513l86288
11213d72888a45792k9929A47640b59499J10658f1032j74826C60694I227g225E1781
11201A47846c11092M4435A43792b8699C52783I3564c50042A44452e70303C6606
11190C8181J17588a04278M3657F5869a80497J4649G020a09892r0045f6789l35835
11179d02624b3338p5642b6591A72108c6713A97088g1134E69986c39984J34102
11169b05882c64k62680J21700d3701k09789p1584a38632D1349b05102J1592A87798
11157C4731a99860R6652A28540D8446Q4904K1532a28688J5500A17684l633h2937
$$ plain form
11145 -144454 -155042 140969 -73198 -269656 249152 -3361 184304 130140 72992 39911 13611
11133 113654 337397 -174523 108734 65107 -32899 93583 294376 -30708 85969 2045 98139
11122 98139 -50262 -103580 122650 -3014 91309 194655 26551 120136 296738 109954 124332
11111 124332 -170920 72586 4157 -25797 177136 91911 122924 266200 66277 49583 -33595
11099 147467 7366 -328435 -62278 138831 203560 190470 -97030 -181979 39951 103706 363248
11088 363248 239474 82649 18913 127435 -93662 -181939 165732 181477 -72452 350695 211241
11077 211241 359319 -34158 485707 153433 282690 -73252 302281 238784 427268 387807
11067 387807 179645 399587 541083 346244 420642 249431 612466 408045 343496 456043
$$ packed form
11145a44454j0588A40969g3198j96458B49152c361A84304n4164n7148l3081A3611
11133A13654K23743a74523A08734m3627c2899I3583K00793c0708H5969B045R6094
11122I8139e0262n3318A22650c014I1309J03346B6551R3585J76602A09954J4378
11111A24332a70920G2586D157b5797A77136q5225L1013J43276F6277j6694c3595
11099A47467G366c28435f2278A38831O4729j3090i7030q4949C9951O3755K59542
11088C63248j23774H2649A8913J08522i3662q8277A65732J5745g2452C50695j39454
11077B11241J48078c4158D85707A53433J29257g3252C02281o3497J88484l9461
11067C87807A79645K19942J41496j94839P4398j71211L63035k04421o4549J12547
$$ plain form
11057 456043 340360 628368 408922 608266 549795 757731 619933 296836 473160 546834
11047 546834 689118 999725 467854 571082 534191 425418 970360 1194162 571947 682224
11037 682224 693091 517932 638184 462415 844280 638100 842789 857852 791810 379455
11026 558911 622298 853550 531868 558208 626539 560273 316576 651501 555074 447804
11016 447804 714117 219929 411755 814959 955997 561222 473002 130744 1002425 529933
11006 529933 327610 548434 593093 653398 700449 473107 551186 522104 530966 660949 722822
10995 722822 646535 612758 413556 489693 630677 634967 661402 628500 741481 949050 1015123
10984 1015123 905877 1007223 988592 677144 1258266 1296117 1574864 1226587 1795673 1821810
$$ packed form
11057D56043j15683K88008k19446J99344n8471K07936j37798B96836J76324P3674
11047E46834J42284L10607D67854J03228l6891j08773N44942K23802E71947J10277
11037F82224J0867j75159J20252j75769L81865k06180K04689J5063o6042C79455
11026E58911O3387K31252l21682K6340O8331o6266k43697L34925r6427j07270
11016D47804K66313B19929J91826M03204J41038l94775q8220A30744Q71681m72492
11006E29933k02323K20824M4659O0305M7051k27342P8079k9082Q862J29983O1873
10995G22822p6287l3777j99202P6137J40984M290K6435l2902J12981K07569O6073
10984A015123j09246J01346j8631l11448N81122L7851K78747l48277N69086K6137
$$ plain form
10974 1821810 1922099 2363337 2157042 2550532 2384433 2376541 2821334 2437114 2291908 1933816
10964 1933816 1610402 1588972 1335324 1548878 1973887 1657454 1816506 1723498 1695253 1383636
10954 1383636 1326572 1436313 1275588 1146167 944023 860767 472373 399387 611330 524525
10944 524525 362874 347960 -3230 321331 442632 5467 312846 135007 94203 -159645 343724
10932 8297 -187759 5824 47266 49115 -123109 122199 145067 140902 266684 355033 214522
10921 214522 57368 -195039 130002 350177 -156173 155796 -308135 -543406 48362 -100297
10910 160674 282154 42739 -82426 -45885 60450 315469 277498 136707 14486 -84388 254529
10898 248610 -118341 141228 85017 -205175 -268524 -292672 278914 -46977 -12337 -64851 -95504
$$ packed form
10974A821810J00289M41238k06295L93490j66099p892M44793l84220j45206l58092
10964A933816l23414k1430k53648K13554M25009l16433J59052r3008k8245l11617
10954A383636n7064J09741j60725j29421k02144q3256l88394p2986K11943q6805
10944E24525j61651j4914c230C21331J21301E467L07379A35007m0804a59645C43724
10932H297a87759E824M1442J849a23109A22199K2868m165J25782Q8349j40511
10921B14522E7368a95039A30002K20175a56173A55796c08135k35271D8362a00297
10910A60674J21480D2739h2426L6541F0450K55019l7971A36707A4486h4388B54529
10898B48610a18341A41228n6211b05175o3349k4148B78914d6977a2337n2514l0653
$$ plain form
10887 -95504 33588 -99372 -130840 76360 118589 19660 53530 114662 -31846 287065 -301848
10875 -257643 235827 366250 -188633 -359093 -82430 305243 -195477 98784 12126 -149430
10864 262364 261935 -365958 -306392 33858 249705 -219185 -51771 -214798 115481 11740 -242022
10852 -115027 185004 405085 -42386 -137529 -18470 -167966 2403 229703 -216676 71992 130537
10841 130537 -19950 107774 -147609 -168458 -203610 266490 -21843 -108085 -342616 -70711 -13162
10829 -302071 -43686 -58511 184218 -318607 211419 33863 89173 -80462 -213176 202639
10818 -58217 -57327 -71631 -212371 -202063 67071 231786 -180202 95703 109767 -12469 196827
10806 -368885 269090 -159067 -220902 202022 207407 -201281 -195205 -201887 336881 76375 165292
$$ packed form
10887i5504C3588i9372l1468G6360M2229A9660L3870O1132c1846B87065c01848
10875b57643B35827J30423a88633j70460h2430C05243a95477I8784A2126a49430
10864B62364m29c65958N9566C3858K15847b19185e1771j63027A15481A1740b42022
10852a15027A85004K20081d2386r5143a8470j49496B403K27300b16676G1992N8545
10841A30537a9950A07774a47609k0849l5152B66490b1843q6242k34531g0711a3162
10829c02071d3686j4825A84218c18607B11419C3863N5310h0462j32714B02639
10818e8217Q90j4304j40740J0308F7071J64715a80202I5703J4064a2469A96827
10806c68885B69090a59067o1835B02022N385b01281O076o682C36881G6375Q8917
$$ plain form
10795 165292 93083 -30401 -601 249792 -10366 -214656 -119076 -51161 207486 -189711 -64471
10783 214048 166503 -118528 -268542 116602 25329 68547 -38082 -221202 53489 -23180 -127984
10772 -127984 136077 2389 108732 -51603 -65503 -75855 -474 -6294 32837 365523 -154665
10760 -205147 -340311 -301134 -149104 -138037 14789 -62186 -213939 -5218 -105803 -160691 -34790
10748 94718 -485078 -97560 335253 56329 320594 -15211 -24102 -1924 266009 -291490 111364
10736 -285073 -92526 210263 114834 230 259551 51010 46835 178529 -140474 -10969 -152826
10725 -152826 -236127 4288 61208 -78504 -182592 5573 -206087 84835 -165437 -30249 -59722
10714 -59722 -24078 51168 -200455 61829 -93622 252377 -115489 56242 475 -30108 -21773 -203013
$$ packed form
10795A65292p2209c0401f01B49792a0366k04290R5580e1161B07486a89711f4471
10783B14048m7545a18528j50014A16602B5329M3218c8082j83120E3489b3180j04804
10772a27984A36077B389J06343e1603j3900j0352d74n820C2837L32686a54665
10760b05147j35164L9177a49104J1067A4789f2186j51753e218j00585n4888c4790
10748I4718d85078i7560C35253E6329K64265a5211q891a924B66009b91490A11364
10736b85073i2526B10263r5429B30K59321E1010m175J31694a40474a0969j41857
10725a52826q3301D288N6920g8504j04088E573b06087H4835a65437c0249k9473
10714e9722b4078E1168b00455F1829i3622B52377a15489E6242D75c0108Q335j81240
$$ plain form
10702 -203013 111442 -54799 127016 -219536 170662 -125955 223053 50598 106176 78166
10692 78166 -57074 133528 -302489 198107 -304992 -78440 -159173 202301 -181304 83925
10681 53263 -103182 86295 114596 12291 -3982 63264 207073 71885 -85944 94758 -131157
10669 -29241 116380 13261 14858 -10217 100573 57556 200090 -66072 4797 14255 126096
10658 126096 58459 -216410 72315 -4747 -43305 -48782 -141421 -90073 -170726 -483003 -131611
10646 156911 -140315 234116 24799 -51728 -96117 92459 -124969 163115 -185289 123826
10635 303791 -325207 37618 26563 125383 -160694 -162823 -150849 -240409 219584 -223078 -96735
10623 172826 -92249 -30799 -149794 32576 -293259 73546 29018 -298260 -58374 267403 -31536
$$ packed form
10702b03013A11442e4799A27016b19536A70662a25955B23053E0598N5578k8010
10692G8166e7074A33528c02489A98107c04992g8440q0733B02301a81304H3925
10681E3263a03182H6295K8301A2291c982F3264J43809G1885h5944I4758a31157
10669b9241A16380A3261J597a0217A00573m3017J42534f6072D797R458J11841
10658A26096E8459b16410G2315d747l8558n477r2639N1348q0653l12277a31611
10646A56911a40315B34116B4799e1728m4389I2459a24969A63115a85289A23826
10635C03791c25207C7618j1055R8820a60694k129J1974q9560B19584b23078i6735
10623A72826i2249c0799j18995C2576b93259G3546B9018b98260e8374B67403c1536
$$ plain form
10611 356874 -173372 -18070 -141992 101763 -102672 238880 -262874 161354 44012 -191043
10600 2345 -195456 158880 -120804 -70654 -252678 -3402 56278 263522 72978 -257814 54319
10588 119983 -32262 49204 -105591 -80853 -8897 184956 -288225 -204602 -159305 -133601 -247649
10577 -247649 -486035 -474807 -27731 60233 -327758 -115069 131512 -66564 -218929 -205049
10567 -205049 -85617 63831 -39922 -265249 -125640 27087 -196008 146550 130 -165613 -74813
10555 56912 -21215 7022 59146 31589 53370 -109671 -158000 32015 135700 -143267 -461524
10544 -461524 157018 -99607 263104 114206 161812 -240761 -20474 125135 -30326 102430
10533 -64501 -132200 -36944 261854 105121 -23127 -135822 118025 -263224 181173 -165293
$$ packed form
10611C56874a73372a8070j23922A01763a02672B38880b62874A61354D4012a91043
10600B345a95456A58880a20804N0150j82024c402E6278K07244G2978b57814E4319
10588A19983c2262D9204a05591K4738h897A84956b88225Q3623M5297K5704j14048
10577b47649k38386J1228b7731F0233c27758a15069A31512f6564j52365J3880
10567b05049h5617F3831c9922k25327a25640B7087a96008A46550A30a65613g4813
10555E6912b1215G022N2124k7557K1781a09671m8329C2015J03685a43267l18257
10544d61524A57018i9607B63104A14206M7606b40761b0474A25135c0326A02430
10533f4501o7699c6944B61854A05121b3127j12695A18025b63224A81173a65293
$$ plain form
10522 -182703 -108107 251874 -99727 -381014 -123682 181095 141777 -318547 10536 3690 -134572
10510 -400436 -164386 -73951 62072 66034 -128663 -98960 -273317 33489 16504 123342 -222068
10498 119377 6377 238816 2557 2983 -63004 -50733 208344 2048 -125673 80470 139491 26629
10485 152856 313743 -114285 -120956 67678 361485 157669 156751 549641 306356 359909 132846
10473 100412 206238 176485 298806 1332 -87162 -130142 51807 177554 172530 177958 169359 63386
10460 -225688 39411 101753 -17507 194733 -69076 -71268 -127438 -14182 234784 36705 -129886
10448 -110289 19087 73162 49206 -115274 -70411 -262162 -120204 40816 -5752 161413 -212994
10436 217873 -313885 74906 155377 113367 -221225 126705 297901 -82587 -98390 115295
$$ packed form
10522a82703P4596B51874i9727k81287a23682A81095l9318c18547A0536C690a34572
10510d00436a64386g3951F2072L962a28663K9703j74357C3489A6504J06838b22068
10498A19377F377K32439B557M26f3004J2271B08344B048a25673H0470N9021B6629
10485A52856J60887a14285o671F7678K93807A57669r18L92890k43285N3553A32846
10473A00412J05826k9753J22321A332h7162m2980E1807J25747n024N428q599F3386
10460b25688C9411O2342a7507A94733f9076k192n6170a4182B34784C6705a29886
10448a10289A9087N4075k3956a15274M4863j91751a20204D0816e752A61413b12994
10436B17873c13885G4906Q0471m2010b21225A26705J71196h2587j5803A15295
$$ plain form
10425 -73930 -178325 -163739 -199809 -44007 412745 -102456 -15628 -267337 -115434 15585 117864
10414 117864 149749 -87407 54210 83333 -91349 89769 -17371 -5768 -136846 -141428 -34042 111969
10401 394805 72309 -4623 -356151 -178334 -219042 -222107 -27967 263296 -76262 254777 -71824
10389 -184091 38200 245215 82883 151065 211533 292308 -196591 266258 223982 67454 37706
10378 37706 162841 571441 309241 49483 359385 474466 119848 121730 -6583 390647 312653
10367 312653 223481 291 541359 73592 722415 160198 342616 223346 45900 439171 430622
10356 430622 210873 279378 154175 80727 274223 385074 297280 356137 300672 787559
10346 787559 467100 201494 236103 272054 440036 300163 342657 183176 250220 427207
$$ packed form
10425g3930j04395J4586l6070d4007D12745a02456a5628k51709a15434A5585J02279
10414A17864L1885h7407E4210K9123i1349H9769a7371e768j31078m582c4042A11969
10401C94805G2309d623l51528J77817m0708l065b7967B63296g6262B54777g1824
10389a84091C8200K07015H2883O8182O0468Q0775a96591B66258m2276F7454k9748
10378C7706J25135M08600k62200D9483L09902J15081A19848J882f583C90647p7994
10367C12653q9172B91N41068G3592O48823A60198J82418j19270D5900L93271q549
10356D30622B10873O8505j25203p3448J93496J10851q7794N8857n5465M86887
10346G87559l20459B01494L4609L5951J67982j39873M2494j59481O7044J76987
$$ plain form
10336 427207 324168 265782 357050 -259198 133619 195616 156519 160370 243953 -93799 156538
10324 196445 -102913 210977 176431 30854 220449 284982 120322 438064 -78538 247595
10313 215909 115693 109100 205204 127709 260465 -118835 34818 -146258 -104815 50806 267946
10302 267946 -184649 96688 194256 11788 38486 -151637 -236344 -38754 55711 -203199 224276
10290 -212389 -235046 20842 -39027 -287312 -64168 25536 -83638 -92226 -88312 -71682 -130175 -130825
10278 -130825 346779 71443 165496 -109491 272573 -192589 -199115 85156 -350759 127626
10267 -294060 -167747 102915 273858 124134 143119 252730 -309962 441142 240558 569978
10257 569978 352280 352010 231563 167152 46627 42339 -19376 177068 -456509 168193 235264
$$ packed form
10336D27207j03039n8386R1268b59198A33619O1997l9097L851Q3583i3799A56538
10324A96445a02913B10977l4546C0854J89595O4533A20322L17742g8538B47595
10313B15909j00216o593R6104p7495J32756a18835C4818a46258M1443E0806K17140
10302B67946a84649I6688R7568A1788K6698a51637q4707c8754E5711b03199B24276
10290b12389k2657B0842c9027k48285f4168B5536h3638q588L914J6630n8493o50
10278a30825C46779G1443R4053a09491B72573a92589o526H5156c50759A27626
10267b94060J26313A02915J70943A24134J8985J09611c09962D41142k00584L29420
10257E69978k17698k70j20447o4411D6627m288a9376A77068d56509A68193O7071
$$ plain form
10246 235264 -96326 140343 380665 -79100 -208307 23175 -12396 -190185 -165387 -92407 -418025
10235 -418025 -291128 -233780 -253915 -212665 -174550 150673 108798 -210555 -7591 87983 209401
10224 209401 47760 -75193 12539 36436 -133296 -136715 82621 140111 91782 -162907 -67421
10212 23559 199851 186411 -128749 -211391 -161359 -5661 -206468 52519 208497 -16941 -6309
10200 -254209 -25870 56973 23127 -144117 -175339 101425 -81069 -3487 -3252 331620 -217481
10188 -273122 -11846 31418 -291682 -387133 -224065 101401 -75656 -3733 155473 287104 -16169
10176 -274709 6161 126024 -255681 10437 147430 -24094 -80452 45864 -112895 120934 -154096
10164 -346615 95407 -273490 -206676 -250273 -179377 275082 -74164 -3788 -31933 3729 -142691
$$ packed form
10246B35264i6326A40343K40322g9100j29207B3175a2396j77789K4798P2980l25618
10235d18025J26897N7348k0135M1250L8115A50673m1875b10555g591H7983J21418
10224B09401D7760g5193A2539K3897a33296l419H2621N7490m8329a62907f7421
10212B3559J76292j3440a28749q2642N0032e661k00807E2519J55978a6941f309
10200b54209b5870E6973B3127a44117l1222A01425h1069c487K35C31620b17481
10188b73122a1846C1418b91682r5451J63068A01401g5656c733A55473J31631a6169
10176b74709F161J19863b55681A0437J36993b4094n6358D5864a12895A20934a54096
10164c46615I5407b73490O6814m3597P0896B75082g4164c788k8145C729a42691
$$ plain form
10152 14227 -315940 -67475 258611 121644 -7233 -26866 -142331 52120 -195355 -104725 -54192
10141 -54192 187592 -341746 -10351 11608 -364443 -53300 172129 -160387 -297506 -83112
10130 -205857 47319 -69668 148935 -196532 -114278 4942 -51481 -208043 -142920 8592 -209568
10118 149041 -21700 32964 -32186 -136221 -382252 57636 -167334 -283089 10449 7999 108386
10107 108386 -258860 -48130 -399420 179571 164639 390840 -205029 -119003 -107367 -2372 36069
10095 49322 133386 78361 219816 -212039 -44575 -150319 241248 -195968 -128179 -3361 40519
10083 168374 -28422 -429999 254976 -296328 62991 -175770 202698 344400 -121280 12619
10072 488392 -384081 -87116 -126124 51795 -49608 -15848 231208 462936 -89814 -104881 -228744
$$ packed form
10152A4227c15940f7475B58611A21644g233j9633j15465E2120a95355R0630N0533
10141e4192A87592c41746a0351A1608c64443e3300A72129a60387j37119h3112
10130b05857D7319f9668A48935a96532Q2254D942e1481j56562O5123H592b09568
10118A49041b1700C2964c2186j04035k46031E7636a67334j15755A0449k450J00387
10107A08386b58860d8130l51290A79571j4932K26201b05029Q6026J1636b372C6069
10095D9322Q4064n5025J41455b12039d4575j05744B41248a95968O7789c361D0519
10083A68374b8422m01577B54976b96328F2991a75770B02698J41702a21280A2619
10072D88392c84081h7116l9008E1795d9608a5848B31208K31728h9814j5067j23863
$$ plain form
10061 -228744 26716 130844 -163028 -212024 -24525 -187624 -51327 225290 -214866 -19232
10050 -112447 -180978 61453 -198682 -95274 -148155 71452 -112357 70278 131373 -284326 -66666
10038 -138055 -231280 -146611 -93706 -217208 -149096 147820 62995 145603 -126897 74931 64171
10027 64171 172920 -255595 12918 353767 -236187 -63236 218832 -101561 -269292 -160048
10017 -160048 -69318 284608 -191395 -210947 -142805 233460 -30105 -212549 -468734 -80905
10006 -194443 86935 -274255 52027 33767 54483 -289629 -181978 58041 -277419 -243832 136
9994 -290735 271147 43017 -339441 2833 -251169 -56713 -242750 -11643 25922 35116 -20972
9982 156865 6966 32247 -265992 -61914 -136251 43494 -364319 -216698 5439 452597 142994
$$ packed form
10061b28744B6716J04128a63028m8996b4525j63099e1327B25290b14866a9232
10050a12447o8531F1453a98682i5274n2881G1452a12357G0278O1095b84326f6666
10038a38055r3225Q4669N2905j23502O8112A47820F2995Q2608a26897G4931j0760
10027F4171J08749b55595A2918L40849b36187f3236B18832a01561j67731J09244
10017a60048f9318B84608a91395j9552O8142B33460c0105j82444k56185h0905
10006a94443H6935b74255E2027j8260K0716b89629J07651E8041b77419L3587A36
9994b90735B71147D3017c39441B833b51169e6713j86037a1643B5922R194b0972
9982A56865F966K5281b65992f1914p4337D3494c64319J47621E439M47158A42994
$$ plain form
9970 -271381 -143847 -286427 -12677 -107720 -67895 25751 -3780 -124883 -170679 -252154 117189
9958 -10067 -4149 159283 -48661 147506 98070 97992 -62800 -321967 -102007 -226364 -117448
9947 -117448 -131725 -65332 97306 130837 -130093 21715 11300 -275071 260309 -98080 164841
9935 -249678 -22263 112814 105200 39796 -154839 -90422 148079 280627 558 -71842 -289760
9924 -289760 -156860 74163 -173803 -209668 3017 -4857 11059 -75047 149190 22602 -164399
9912 -281266 -30478 46683 -46508 14521 77273 -57979 -305053 -106470 -105529 -182697 113288
9900 -76427 -92020 -388762 13682 90505 157014 -335407 33696 -18077 278233 61510 58427
9889 58427 -75962 -181189 18451 35299 -133192 -111894 -264783 -52949 -175566 48723 -278766
$$ packed form
9970b71381J27534j42580a2677r5043L9825B5751c780j21103m5796q1475A17189
9958a0067d149A59283d8661A47506m9436p8f2800k59167a02007j24357J08916
9947a17448j4277f5332I7306L3531a30093B1715j0415b75071B60309i8080A64841
9935b49678b2263A12814p614C9796a54839O4417A48079J32548E58g1842k17918
9924b89760J32900G4163a73803l5865C017d857A1059g5047A49190B2602a64399
9912b81266c0478D6683d6508A4521O2752e7979k47074a06470R41p7168A13288
9900g6427j5593k96742A3682P6823O6509c35407C3696a8077B78233F1510l083
9889E8427g5962j05227A8451J6848a33192K1298j52889e2949j22617D8723b78766
$$ plain form
9877 -31288 -193095 -121135 -244917 -177840 126291 -271614 -172523 97382 -281384 -287532 26919
9865 -553560 -187491 160674 90320 152233 -30117 -262427 -262074 -130458 -90590 -207570 -277113
9854 -277113 -42383 57620 -312140 158420 -64766 -246637 -6114 -59151 407014 22108 -201346
9842 -26969 86922 -240798 -110843 -129469 -203581 134828 -109701 -174168 -16400 -96974 -125450
9831 -125450 -77333 -344938 -239066 -201273 323894 -350287 -129643 -119397 -342846 -124312
9820 -120819 333793 -210510 -183408 -24862 60052 152425 -109278 -32813 -186232 70939 201576
9809 201576 89477 244795 225766 133099 12916 -100232 51053 151256 -92758 57212 92396
9798 92396 -167218 -159820 35386 -37401 202188 -287138 -74413 -29302 -139070 134883 -316575
$$ packed form
9877c1288j61807P1960j23782O7077A26291b71614R9091I7382b81384o148B6919
9865e53560a87491A60674p0354O1913c0117k32310L53a30458L9868j16980o9543
9854b77113d2383E7620c12140A58420f4766j81871f114n3037D07014B2108b01346
9842b6969H6922b40798a10843j8626p4112A34828a09701o4467a6400q0574k8476
9831a25450M8117k67605J05872L7793C23894c50287a29643J0246k23449a24312
9820a20819C33793b10510K7102b4862F0052R2373a09278c2813j53419G0939J30637
9809B01576H9477J55318j9029r2667A2916a00232E1053J00203i2758E7212L5184
9798I2396a67218P398C5386c7401B02188b87138g4413b9302j09768A34883c16575
$$ plain form
9786 26136 6504 72757 -95761 -229869 24466 -86674 -242049 -133940 -245071 -72877 206307
9774 91051 -287800 127565 -27947 -251894 -154809 141171 -298837 -3141 258150 51961 -269900
9762 -94867 -234359 15359 -259259 -268326 312571 -126117 157638 -249032 221220 -29760 22479
9750 139523 356442 -92537 -202460 -332567 -111472 -104115 -186248 -265905 -17058 -301109 75696
9738 -928 -217475 -211788 -75669 -52781 -192526 -15445 60038 -215845 -55891 -188509 23122 -323623
9725 -458945 -203682 -193998 -163934 218441 -47574 23816 -53914 -157306 -42061 -72430 -10041
9713 -196216 -134164 -40354 -250614 -215126 -225909 -224217 -68883 -261807 172917 -209163 -74228
9701 2964 -75441 -241057 -180420 -140423 -40899 -77471 56425 -19559 -175550 -8132 203089 -288614
$$ packed form
9786B6136F504O6253i5761j34108B4466h6674j55375J08109j11131g2877B06307
9774I1051b87800A27565b7947k23947R7085A41171b98837c141B58150E1961b69900
9762i4867j39492A5359b59259r067C12571a26117A57638b49032B21220b9760B2479
9750A39523K16919i2537j09923j30107a11472P357q2133p9657a7058k84051G5696
9738i28k16547N687g5669K2888j39745a5445F0038b15845e5891j32618B3122c23623
9725d58945b03682R684L0064B18441d7574B3816e3914j03392d2061l0369a0041
9713a96216O2052d0354k10260L5488j0783J692f8883j92924A72917b09163g4228
9701B964g5441j65616O0637L9997d0899l6572E6425a9559j55991h132B03089b88614
$$ plain form
9688 2513 150613 168428 -161661 109858 -57299 -131856 78208 145410 155651 -68910 130953
9676 -202855 -281907 209929 5698 37530 -328997 -234889 -89822 -176649 83405 -262534 -266195
9665 -266195 -63181 -262472 -101292 30544 -121942 -191709 -150141 -303595 87885 -267242 92888
9653 -278332 -202717 -53797 12247 -71671 25878 -191351 6683 32041 -255060 -76644 60065
9641 -67811 128810 36443 -79626 -52385 116163 -313207 -17789 102469 -37176 181039 -45487
9629 -209518 225425 37883 -139371 307220 -91345 11865 6598 185897 -102326 -60583 230298
9617 -42662 -61469 -65579 137162 -133905 79610 -175592 -163423 -218254 189315 -104056 -311137
9606 -311137 40637 107240 12377 -173834 387252 -132177 -200232 270155 -262403 39737 -249091
$$ packed form
9688B513J48100J7815a61661A09858e7299p4557G8208O7202J0241f8910A30953
9676b02855p9052B09929E698L1832c28997R4108h9822q6827H3405b62534l661
9665b66195f3181j99291a01292C0544a21942o9767M1568j53454H7885b67242I2888
9653b78332P5615e3797A2247g1671B5878a91351F683K5358b55060g6644F0065
9641f7811A28810C6443g9626K7241A16163c13207a7789A02469c7176A81039d5487
9629b09518B25425C7883a39371C07220i1345A1865n267J79299a02326M1743B30298
9617d2662j8807m110A37162a33905G9610a75592J2169n4831A89315a04056k07081
9606c11137D0637O6603A2377a73834C87252a32177o8055B70155b62403C9737b49091
$$ plain form
9594 197074 -83791 139752 -92713 -9090 -207064 -168873 52040 -210743 -58451 -177751 -4650
9582 70661 -129038 -14177 -10576 97954 -183913 -79324 209465 -5733 -227941 -121033 -29589
9570 248698 -223730 -127048 151680 -205069 -83478 -133368 -89610 237069 -156615 -234205 -45988
9558 -189649 -101570 277757 3392 -235669 -65316 -22030 -94468 284677 -114897 -446933 -145139
9546 -231163 -46977 -62916 -295083 -427840 -53314 224419 153273 -455433 -241212 -69601 213493
9534 57100 -80293 45290 39955 -111457 -250259 -350755 -232187 11607 -126385 72563 -77652
9522 70563 -121536 -59818 198001 -52967 20524 417104 -141050 -297542 53063 -124873 -90114
9511 -90114 -109782 -270027 -424543 61197 -165567 -200411 179099 -185465 -169641 -35765 -72486
$$ packed form
9594A97074h3791A39752i2713i090j97974L8191E2040b10743e8451j19300d650
9582G0661a29038a4177L601I7954a83913g9324B09465e733k22208J06908b9589
9570B48698b23730R6682A51680b05069h3478m9890M3758B37069a56615p7590d5988
9558a89649Q8079B77757C392b35669f5316b2030p2438B84677a14897l32036a45139
9546b31163d6977j5939k32167j32757e3314B24419p1146d55433K14221f9601B13493
9534E7100h0293D5290n335a11457j38802j00496J18568A1607a26385G2563g7652
9522G0563a21536e9818A98001e2967B0524L96580a41050j56492E3063a24873L4759
9511i0114j9668j60245j54516F1197a65567l4844A79099a85465J5824c5765l6721
$$ plain form
9500 -72486 -55871 -69302 4640 -308981 -109417 -369476 84191 -114899 -163516 -227853 12473
9488 158727 176123 -152210 -272586 116951 -196148 -315957 20298 -214644 70213 -178304
9477 115928 -47567 -256098 -12177 77258 25422 73680 -101505 -14395 -58648 229942 65406
9465 -75372 19153 -3521 -3647 153064 25847 -179519 -141527 106917 -159168 -31482 -50450 -107037
9453 -107037 9667 -336362 105694 118774 -120739 -17884 -20081 -41407 48432 -101305 107418
9441 14473 -135805 59060 -173313 -163834 -209104 -73462 -96345 -233183 -257470 199632 -26337
9429 -166062 112949 -236106 -1850 207579 -329439 -122516 -322667 -440470 125329 -16653
9418 50530 -185552 -12475 -261285 18706 -77823 24502 -103629 -146432 -217683 -224974 -168219
$$ packed form
9500g2486J6615j3431D640c08981a09417k60059H4191a14899m8617o4337A2473
9488A58727J7396a52210j20376A16951a96148j19809B0298b14644G0213a78304
9477A15928d7567k08531a2177G7258B5422M8258a01505a4395m4253B29942F5406
9465g5372A9153c521j26A53064B5847a79519L7992A06917a59168c1482j8968n6587
9453a07037I667c36362A05694J3080a20739a7884k197k1326D8432a01305A07418
9441A4473a35805E9060a73313R479m5270g3462k2883j36838k4287A99632b6337
9429a66062A12949b36106a850B07579c29439a22516k00151j17803A25329a6653
9418E0530a85552a2475k48810A8706g7823B4502a03629m2803p1251p291N6755
$$ plain form
9407 -168219 -147069 1748 72981 -19959 -239503 -67634 -205985 76809 -42165 104185 241902
9396 241902 190369 138198 127310 -72434 31350 53544 277956 -51197 -268079 -186912 244988
9384 41718 -259413 -105738 198329 -396325 13049 -307100 129085 47237 -149983 -202663
9374 -202663 -34834 -115249 140768 116200 -196155 349849 83851 -2529 20348 182649 -321329
9362 82336 -253763 -319660 125405 284888 145088 -277338 133697 163929 67231 -162394
9351 19757 -286777 389494 -115499 279986 -8835 -205771 64934 44931 127056 -239520 -161114
9340 -161114 -64373 83514 87112 152921 -214924 -197987 69374 357689 20078 -101997 75560
9328 57263 2382 -81287 -109132 167693 -277346 354415 -297721 -215311 -253079 -298849 -342304
$$ packed form
9407a68219K1150A748P1233a9959k19544f7634j38351G6809d2165A04185J37717
9396B41902n1533n2171j0888g2434C1350K2194K24412e1197k16882Q1167B44988
9384D1718b59413a05738A98329c96325A3049c07100A29085D7237a49983n2680
9374b02663c4834q0415A40768k4568a96155C49849H3851b529B0348J62301c21329
9362H2336b53763o5897A25405J59483j39800b77338A33697L0232F7231a62394
9351A9757b86777C89494a15499B79986h835j96936F4934k0003Q2125b39520P8406
9340a61114f4373H3514L598O5809b14924J6937F9374K88315B0078a01997G5560
9328E7263B382h1287k7845A67693b77346C54415b97721Q2410l7768m5770m3455
$$ plain form
9317 -342304 10293 92400 109707 -212832 116216 -384409 -344955 -127036 -130614 -127987 192560
9305 -138224 -5316 -154796 -89152 74193 -366740 -234879 -110492 144929 -136557 -253473
9295 -253473 -40995 -135960 -1151 199603 -112894 -323203 389560 168115 -66675 306583 -473483
9283 205157 -14300 71784 -56639 -195037 -152663 -363717 -52921 -338870 63853 -13108 20212
9271 100159 -169226 -310136 110774 -263894 128718 95822 -220902 -153935 -281521 -203027
9261 -203027 -279208 61375 -64087 -99975 -3494 75605 -168739 -38340 -115029 42754 -321872
9249 18992 -101134 36259 41165 119330 23611 -132841 -50119 -108888 -100496 208739 107645
9238 107645 236159 -378280 14418 -263429 65489 -44507 206712 -161012 -64499 -110010 -80797
$$ packed form
9317c42304A0293Q2107J7307b12832A16216c84409L9454a27036l578K627A92560
9305a38224e316j49480O5644G4193c66740J31861a10492A44929a36557j16916
9295b53473d0995r4965a151A99603a12894k10309C89560A68115f6675C06583d73483
9283B05157a4300G1784e6639j38398M2374k11054e2921k85949F3853a3108B0212
9271A00159a69226j40910A10774b63894A28718l2896b20902O6967j27586P8494
9261b03027p6181F1375f4087l5888c494G5605a68739c8340p6689D2754c21872
9249A8992a01134C6259M906P8165B3611a32841e0119n8769Q392B08739j01094
9238A07645J28514c78280A4418b63429F5489d4507B06712a61012f4499m5511K9213
$$ plain form
9227 -80797 -240916 -51513 152228 117684 -167263 156253 -146103 186679 -146692 152597
9216 178639 -1406 -7007 42729 -129369 -156001 47904 51223 -136927 69126 -277525 -3613 -255207
9204 -255207 -26634 -32133 188943 -90192 -328342 28288 110142 -125137 219977 31001 -84039
9192 -46530 16717 120074 -105846 116776 -352673 39659 -42102 373697 -266871 -29458 -286650
9181 -286650 -74737 -240834 45822 -332895 144632 140663 155465 -343313 229013 191413 74216
9169 305748 -83948 -106427 49820 -91713 28688 -45007 247264 -236014 -238025 -168621 -160609 -163885
9157 -163885 245611 -298720 140497 289709 -232751 86892 -70658 37731 -173413 99686
9146 54321 73002 178243 -47203 -147606 -71591 272717 101402 -37213 6590 135678 -61469
$$ packed form
9227h0797j60119e1513A52228l4544a67263A56253a46103A86679a46692A52597
9216A78639a406n601D2729a29369k6632D7904L319a36927F9126b77525c613k51594
9204b55207b6634n499A88943i0192k38150B8288Q1854a25137B19977C1001h4039
9192d6530A6717J03357a05846A16776c52673C9659d2102C73697b66871b9458k57192
9181b86650g4737j66097D5822c32895A44632l969J4802c43313B29013l7600G4216
9169C05748h3948k2479D9820i1713B8688d5007B47264b36014k011O9404Q012l276
9157a63885B45611b98720A40497J49212b32751H6892g0658C7731a73413I9686
9146E4321J8681J05241d7203j00403g1591B72717A01402c7213F590J29088f1469
$$ plain form
9134 90524 -286864 -38584 -150839 315605 -178724 171004 -93656 -188375 -227790 7338 52595
9123 52595 157759 -71114 210020 52680 96431 -105046 73865 -69910 196859 104894 28301
9111 18735 72233 -135313 -30551 125538 18628 -103883 61342 -30517 39872 -184212 -29512
9099 231288 397189 -213365 -205250 -90751 -143260 -138392 22262 -148541 850 33310 -182607 -208687
9087 -208687 -142919 -64955 -86988 -16653 104148 -140504 -344782 76447 -132999 -221045 -53121
9075 172033 -89550 -168141 -107641 21582 -154788 -147068 -101884 153271 -49319 61757 157779
9064 157779 56487 -45847 -262987 190649 -195617 -52650 185153 -137523 -10715 268094
9053 -102092 324599 -272215 61012 644 -375622 81189 -73931 -124389 -155490 -137096 -376486
$$ packed form
9134I0524b86864c8584j12255C15605a78724A71004i3656r4719l9415G338M5257
9123E2595J05164g1114B10020E2680M3751a05046G3865f9910A96859r1965B8301
9111A8735N3498a35313c0551A25538A8628a03883F1342c0517C9872a84212b9512
9099B31288J65901b13365Q115i0751n2509M868B2262a48541H50L2460a82607k6080
9087b08687O5768f4955k2033a6653A04148a40504k04278G6447a32999q8046e3121
9075A72033h9550p8591O0500B1582a54788P720M5184A53271d9319F1757R6022
9064A57779E6487d5847k17140A90649a95617e2650A85153a37523a0715B68094
9053a02092C24599b72215F1012F44c75622H1189g3931n0458l1101J8394k39390
$$ plain form
9042 -376486 -10586 -115879 -114733 -349064 133527 132951 -188153 -89655 126364 100701 364922
9031 364922 -274814 -69675 -51618 74717 -125421 -67705 -392053 797 13541 -46131 -51439 -59828
9019 -59828 78584 -207330 -116067 -451286 -170198 110667 -100445 -351386 309675 -317257
9008 -16100 407918 246368 -125178 -61417 136003 41590 37569 -265067 -188878 34505 -92723
8996 306735 233470 21410 -188529 34757 82219 -57741 -88196 276374 -227670 -122709 -156884
8985 -156884 6497 -215022 19373 -196646 199883 195973 -97754 -112109 8245 -5872 61042 133154
8973 133154 103199 -181133 -156608 206083 -460652 -20941 -352961 -4002 -135847 60044 -192670
8961 -216415 41926 -121246 -104701 -74620 -63950 -49935 -68171 80795 -128788 64418 164206
$$ packed form
9042c76486a0586j05293J146k34331A33527n76a88153h9655A26364k5663K64221
9031C64922b74814f9675J8057G4717a25421N7716l24348G97J2744d6131n308q389
9019e9828G8584b07330R1263l35219a70198A10667a00445k50941C09675c17257
9008a6100D07918j61550a25178f1417A36003D1590m021b65067P6189C4505i2723
8996C06735p3265B1410a88529C4757M7462e7741l0455B76374b27670J04961l4175
8985a56884F497b15022A9373a96646A99883l910i7754j4355H245e872F1042P2112
8973A33154k9955a81133K4525B06083d60652b0941l32020d002j31845F0044a92670
8961b16415D1926a21246J6545L0081J0670J4015j8236H0795a28788F4418R9788
$$ plain form
8950 164206 56955 -119003 -225461 11918 -545627 -154308 -154632 -134278 -177126 65744 -172541
8938 -70650 -15425 43183 -34894 125354 252198 132712 -110565 23128 73589 -26886 -259537
8927 -259537 177868 260543 314595 -109141 776964 4125334 13138576 4536036 577928 235950
8916 81778 234378 -208159 -33217 -199404 -186557 55338 -5458 -168893 445670 143582 295602
8905 295602 -175385 -47233 -220291 -135873 -65740 -76050 96595 -72372 -173804 -260598 4306
8893 -68176 89179 -338886 -114697 58489 7090 -21323 102868 -259130 -90660 -242701 -49522
8881 228144 83012 160503 -187470 -162567 154999 -35177 211948 -161138 -123227 -117056 144753
8869 22240 2758 73515 113014 -59406 110656 91727 -16177 215692 204969 176765 46892 -22357
$$ packed form
8950A64206E6955a19003j06458A1918e45627a54308l24K0354m2848F5744a72541
8938g0650a5425D3183c4894A25354J26844j19486a10565B3128N0461b6886k32651
8927b59537A77868Q2675N4052a09141G76964L348370R013242D536036E77928B35950
8916H1778J52600b08159c3217j66187J2847E5338e458j63435D45670A43582J52020
8905B95602a75385d7233j73058Q4418f5740j0310I6595g2372j01432q6794D306
8893f8176H9179c38886a14697E8489G090b1323A02868b59130i0660j52041d9522
8881B28144H3012P7491a87470K4903A54999c5177B11948a61138L7911O171A44753
8869B2240B758P0757L9499e9406A10656j8929a6177B15692j0723k8204D6892b2357
$$ plain form
8856 -25766 61587 -106018 -39554 -9863 95800 -52187 -91914 92005 -335157 -66770 136937
8844 38191 -2271 -58972 -27109 -41817 -211573 -220573 -186684 -333490 -73693 -133298 -218395 -48906
8831 52490 -322655 160852 237563 -120658 -13860 56018 16642 135665 -11828 42124 -36664
8819 -201354 380106 -381923 -373482 115941 -17407 342846 121365 111566 82461 5150 -121051
$$ packed form
8856b5766F1587a06018c9554i863I5800e2187l9727I2005c35157f6770A36937
8844C8191b271n6701b7109j4708j69756r000L3889j46806g3693n9605q5097d8906
8831E2490c22655A60852P6711a20658a3860E6018A6642J19023a1828D2124c6664
8819b01354C80106c81923Q441A15941a7407C42846A21365r799k9105E150a21051
$$ [...]
##END NTUPLES=NMR SPECTRUM
##END=
