
##TITLE=UV1287_M2_1207-1380_30_7534711_cWZqGJ1YTB
##JCAMPDX= 6.0         $$ Bruker NMR JCAMP-DX V2.0
##DATA TYPE= NMR SPECTRUM
##DATA CLASS= NTUPLES
##ORIGIN= BRUKER
##OWNER= Administrator
$$ 1.72 TOPSPIN		Version 2.1
$$ 2013-02-21 21:25:54.425 -0500  Administrator@X
$$ Compression mode = diff/dup
##.OBSERVE FREQUENCY= 400.02188249412
##.OBSERVE NUCLEUS= ^1H
##.ACQUISITION MODE= SIMULTANEOUS (DQD)
##.ACQUISITION SCHEME= undefined
##.AVERAGES= 64
##.DIGITISER RES= 22
##SPECTROMETER/DATA SYSTEM= spect
##.PULSE SEQUENCE= noesygpps1d.comp
##.SOLVENT NAME= COFFEE_meoh
##.SHIFT REFERENCE= INTERNAL, COFFEE_meoh, 1, 14.9612
##AUDIT TRAIL= $$ (NUMBER, WHEN, WHO, WHERE, PROCESS, VERSION, WHAT)
$$ ##TITLE= Audit trail, TOPSPIN		Version 2.1
$$ ##JCAMPDX= 5.01
$$ ##ORIGIN= Bruker BioSpin GmbH
$$ ##OWNER= Administrator
$$ $$ E:\/data/COFFEE/nmr/UV1287_M2_1207-1380_30_7534711_cWZqGJ1YTB/12/pdata/1/auditp.txt
$$ ##AUDIT TRAIL=  $$ (NUMBER, WHEN, WHO, WHERE, PROCESS, VERSION, WHAT)
(   1,<2013-02-21 21:25:48.101 -0500>,<Administrator>,<X>,<go>,<TOPSPIN 2.1>,
      <created by zg
	started at 2013-02-21 21:14:17.919 -0500,
	POWCHK enabled, PULCHK disabled,
       configuration hash MD5:
       86 BA 57 50 F2 9D 5C 9B 26 00 A9 28 5F 66 2E 89
       data hash MD5: 64K
       41 A0 F1 16 F0 35 47 2C 9D 2B 55 80 5B E1 7D 61>)
(   2,<2013-02-21 21:25:51.534 -0500>,<Administrator>,<X>,<proc1d>,<TOPSPIN 2.1>,
      <Start of raw data processing
       efp LB = 0.3 FT_mod = 6 PKNL = 1 PHC0 = 0 PHC1 = 0 SI = 128K 
       data hash MD5: 128K
       15 E5 5E 86 20 E7 19 AD B8 48 5E 91 3C EE FE CB>)
(   3,<2013-02-21 21:25:52.628 -0500>,<Administrator>,<X>,<proc1d>,<TOPSPIN 2.1>,
      <pk PHC0 = 251.3617 PHC1 = 0 
       data hash MD5: 128K
       F1 0D 9D E3 3D 54 A8 0F 8C 47 B6 A7 24 DD 69 9F>)
(   4,<2013-02-21 21:25:53.378 -0500>,<Administrator>,<X>,<proc1d>,<TOPSPIN 2.1>,
      <abs ABSG = 1 
       data hash MD5: 128K
       2D EB 3F 62 90 17 27 2A 8F 41 AF 55 22 9F 9F 79>)
(   5,<2013-02-21 21:25:53.565 -0500>,<Administrator>,<X>,<proc1d>,<TOPSPIN 2.1>,
      <abs ABSG = 2 
       data hash MD5: 128K
       32 17 13 27 A0 8E 42 DF FD 26 E2 4D 79 05 AF 72>)
(   6,<2013-02-21 21:25:53.706 -0500>,<Administrator>,<X>,<proc1d>,<TOPSPIN 2.1>,
      <abs ABSG = 3 
       data hash MD5: 128K
       7C 5F B0 CA 26 A5 87 F8 F7 92 FC 78 F4 B6 E3 70>)
(   7,<2013-02-21 21:25:53.909 -0500>,<Administrator>,<X>,<proc1d>,<TOPSPIN 2.1>,
      <abs ABSG = 4 
       data hash MD5: 128K
       CC 0C 8F 66 54 C2 45 97 A0 E3 6E 60 D8 98 CC 49>)
(   8,<2013-02-21 21:25:54.065 -0500>,<Administrator>,<X>,<proc1d>,<TOPSPIN 2.1>,
      <abs ABSG = 5 
       data hash MD5: 128K
       BB B3 9E FB 1F 25 EF 76 D0 E8 C8 74 ED D7 A1 9F>)
$$ ##END=
$$ 
$$ $$ hash MD5
$$ $$ 4C C5 DF BC 6B 74 C4 53 84 0E DA 37 34 7D 13 39
##$RELAX= 
##$RELAX= 
##$RELAX= 
##$RELAX= 
##$RELAX= 
##$RELAX= 
##$RELAX= 
##$RELAX= 
$$ Bruker specific parameters
$$ --------------------------
##$DU= <E:\>
##$EXPNO= 12
$$ [...]
150 150 150 150 150 150 150 150
##$TP07= 0
##$TPNAME0= <>
##$TPNAME1= <>
##$TPNAME2= <>
##$TPNAME3= <>
##$TPNAME4= <>
##$TPNAME5= <>
##$TPNAME6= <>
##$TPNAME7= <>
##$TPOAL= (0..7)
0.5 0.5 0.5 0.5 0.5 0.5 0.5 0.5
##$TPOFFS= (0..7)
0 0 0 0 0 0 0 0
##$TUNHIN= 0
##$TUNHOUT= 0
##$TUNXOUT= 0
##$USERA1= <user>
##$USERA2= <user>
##$USERA3= <user>
##$USERA4= <user>
##$USERA5= <user>
##$V9= 5
##$VALIST= <valist>
##$VCLIST= <CCCCCCCCCCCCCCC>
##$VD= 0
##$VDLIST= <DDDDDDDDDDDDDDD>
##$VPLIST= <PPPPPPPPPPPPPPP>
##$VTLIST= <TTTTTTTTTTTTTTT>
##$WBST= 1024
##$WBSW= 4
##$XGAIN= (0..3)
0 0 0 0
##$XL= 0
##$YL= 0
##$YMAX_a= 5887993
##$YMIN_a= -10344910
##$ZGOPTNS= <>
##$ZL1= 120
##$ZL2= 120
##$ZL3= 120
##$ZL4= 120
##$ABSF1= 14.9612
##$ABSF2= -5.596982
##$ABSG= 5
##$ABSL= 3
##$ALPHA= 0
##$AQORDER= 0
##$ASSFAC= 0
##$ASSFACI= 0
##$ASSFACX= 0
##$ASSWID= 0
##$AUNMP= <proc_prof1d_extract.lims>
##$AXLEFT= 0
##$AXNAME= <>
##$AXNUC= <1H>
##$AXRIGHT= 0
##$AXTYPE= 0
##$AXUNIT= <>
##$AZFE= 0.1
##$AZFW= 0.1
##$BCFW= 0
##$BC_mod= 0
##$BYTORDP= 0
##$COROFFS= 0
##$CY= 15
##$DATMOD= 1
##$DC= 0
##$DFILT= <>
##$DTYPP= 0
##$F1P= 0
##$F2P= 0
##$FCOR= 0.5
##$FTSIZE= 131072
##$FT_mod= 6
##$GAMMA= 0
##$GB= 0
##$INTBC= 1
##$INTSCL= 1
##$ISEN= 128
##$LB= 0.3
##$LEV0= 0
##$LPBIN= 0
##$MAXI= 10000
##$MC2= 0
##$MEAN= 0
##$ME_mod= 0
##$MI= 0
##$NCOEF= 0
##$NC_proc= -2
##$NLEV= 6
##$NOISF1= 0
##$NOISF2= 0
##$NSP= 0
##$NTH_PI= 0
##$NZP= 0
##$OFFSET= 14.9612
##$PC= 1
##$PHC0= 251.3617
##$PHC1= 0
##$PH_mod= 1
##$PKNL= yes
##$PPARMOD= 0
##$PPDIAG= 0
##$PPIPTYP= 0
##$PPMPNUM= 2147483647
##$PPRESOL= 1
##$PSCAL= 4
##$PSIGN= 0
##$PYNMP= <proc.py>
##$REVERSE= no
##$SF= 400.020009556836
##$SI= 131072
##$SIGF1= 0
##$SIGF2= 0
##$SINO= 400
##$SIOLD= 131072
##$SPECTYP= <>
##$SREGLST= <1H.CDCl3>
##$SSB= 0
##$STSI= 131072
##$STSR= 0
##$SW_p= 8223.68421052631
##$SYMM= 0
##$S_DEV= 0
##$TDeff= 65536
##$TDoff= 0
##$TI= <>
##$TILT= no
##$TM1= 0
##$TM2= 0
##$TOPLEV= 0
##$USERP1= <user>
##$USERP2= <user>
##$USERP3= <user>
##$USERP4= <user>
##$USERP5= <user>
##$WDW= 1
##$XDIM= 131072
##$YMAX_p= 460465619
##$YMIN_p= -49668
##$CURPLOT= <Network HP LaserJet P1505>
##$CURPRIN= <$Network HP LaserJet P1505>
##$DFORMAT= <normdp>
##$LAYOUT= <+/1D_H.xwp>
##$LFORMAT= <normlp>
##$PFORMAT= <normpl>
##$SURQMSG= 1
$$ End of Bruker specific parameters
$$ ---------------------------------
##NTUPLES= NMR SPECTRUM
##VAR_NAME=  FREQUENCY,     SPECTRUM/REAL,   SPECTRUM/IMAG
##SYMBOL=    X,             R,               I
##VAR_TYPE=  INDEPENDENT,   DEPENDENT,       DEPENDENT
##VAR_FORM=  AFFN,          ASDF,            ASDF
##VAR_DIM=   131072,        131072,          131072
##UNITS=     HZ,            ARBITRARY UNITS, ARBITRARY UNITS
##FACTOR=    0.0627417313425164, 1,          1
##FIRST=     8223.62146879497, -173,         -66607
##LAST=      0,             3169,            -67408
##MIN=       0,             -49668,          0
##MAX=       8223.62146879497, 460465619,    0
$$ Real data points
##PAGE= N=1
##DATA TABLE= (X++(R..R)), XYDATA
$$ [...]
$$ plain form
61700 494653 489633 484430 479795 476321 473463 470201 466347 462581 459461 456997 454992 453179 451130 448583
61686 448583 445825 443309 440999 438505 435668 432537 428958 424808 420518 416706 413392 410205 407324 405411
61672 405411 404509 403743 402400 400700 399224 398181 397489 396988 396199 394499 392036 389964 389207 389377 389472 389336 389701
61655 389701 390954 392558 393863 394945 396398 398598 401359 404189 406731 409061 411589 414585 417827 420834
61641 420834 423408 425791 428310 431030 433799 436428 438699 440260 440720 439897 437945 435198 432001 428713 425736
61626 425736 423320 421340 419438 417400 415195 412698 409728 406531 403818 402019 400782 399600 398647 398447 398867
61611 398867 399113 398774 398257 397863 396959 394454 389851 383542 376361 369247 363110 358476 355077 352023 348552
61596 348552 344590 340599 337047 334040 331360 328733 326040 323320 320686 318241 316009 313887 311756 309699
$$ packed form
61700D94653n020n203m635l474k858l262l854l766l120k464k005j813k049k547
61686D48583k758k516k310k494k837l131l579m150m290l812l314l187k881j913
61672D05411r02p66j343j700j476j043o92n01p89j700k463k072p57J70R5j36L65
61655C89701J253J604J305J082J453K200K761K830K542K330K528K996L242L007
61641D20834K574K383K519K720K769K629K271J561M60q23j952k747l197l288k977
61626D25736k416j980j902k038k205k497k970l197k713j799j237j182r53k00M20
61611C98867K46l39n17l94r04k505m603o309p181p114o137m634l399l054l471
61596C48552l962l991l552l007k680k627k693k720k634k445k232k122k131k057
$$ plain form
61582 309699 308026 306978 306443 306058 305497 304641 303605 302661 301991 301433 300657 299700 299011 298825 298836 298788 298975 299644
61564 299644 300242 299900 298574 297049 295859 294886 294114 294016 294828 295995 296847 297509 298700 300798 303427 305830
61548 305830 307423 308110 308257 308363 308732 309486 310669 312054 313037 313346 313782 315593 318908 322513 325504 328442
61532 328442 332323 336974 341285 344624 347158 348877 349214 347872 345383 342482 339338 335753 331877 328372
61518 328372 325869 324379 323331 322179 321014 320392 320497 320702 320265 319324 318795 319307 320584 321932 322937 323482
61502 323482 323399 322523 321024 319425 318158 317277 316625 316182 316188 316936 318487 320485 322203 322921 322498 321634 321344 322068
61484 322068 323361 324537 325369 326059 326777 327561 328503 329657 330802 331698 332572 333962 335991 338204 340217 342091
61468 342091 343839 345003 345119 344356 343321 342423 341751 341365 341248 340993 339951 337830 335027 332378 330698 330364
$$ packed form
61582C09699j673j048n35l85n61q56j036r44o70n58p76r57o89j86J1m8J87O69
61564B99644N98l42j326j525j190r73p72r8Q12J167Q52O62J191K098K629K403
61548C05830J593O87J47J06L69P54J183J385R83L09M36J811L315L605K991K938
61532C28442L881M651M311L339K534J719L37j342k489k901l144l585l876l505
61518C28372k503j490j048j152j165o22J05K05m37r41n29N12J277J348J005N45
61502C23482q3q76j499j599j267q81o52m43OP48J551J998J718P18m23q64k90P24
61484C22068J293J176Q32O90P18P84R42J154J145Q96Q74J390K029K213K013J874
61468C42091J748J164J16p63j035q98o72l86j17k55j042k121k803k649j680l34
$$ plain form
61452 330364 331037 331830 332112 332183 332871 334406 336078 337142 337764 338753 340491 342494 344037 344989 345954 347745 350810
61435 350810 355005 359740 364394 368730 372953 377313 381702 385703 388964 391332 392722 393174 393105 393185 393771 394710
61419 394710 395841 397374 399475 401854 404150 406501 409182 411831 413631 414296 414327 414130 413428 411783 409314
61404 409314 406561 403890 401260 398397 395035 391197 387310 383840 380787 377883 375259 373434 372466 371683 370576
61389 370576 369509 369110 369320 369533 369423 369179 369048 369105 369413 370064 371064 372415 374153 376118 377876 379179 380269
61372 380269 381428 382512 383352 384349 386097 388462 390637 392177 393479 395085 396962 398749 400409 402380 405182
61357 405182 408998 413531 418229 422800 427545 433112 439926 448022 457236 467244 477412 486947 495287 502200
61343 502200 507579 511557 514843 518453 522809 527399 531536 535175 538634 541862 544427 546178 547379 548101
$$ packed form
61452C30364O73P93K82P1O88J535J672J064O22R89J738K003J543R52R65J791L065
61435C50810M195M735M654M336M223M360M389M001L261K368J390M52o9Q0N86R39
61419C94710J131J533K101K379K296K351K681K649J800O65L1j97p02j645k469
61404D09314k753k671k630k863l362l838l887l470l053k904k624j825r68p83j107
61389C70576j067l99K10K13j10k44j31N7L08O51J000J351J738J965J758J303J090
61372C80269J159J084Q40R97J748K365K175J540J302J606J877J787J660J971K802
61357D05182L816M533M698M571M745N567O814Q096R214J0008J0168R535Q340O913
61343E02200N379L978L286L610M356M590M137L639L459L228K565J751J201P22
$$ plain form
61329 548101 547916 546471 544048 541210 538042 534169 529566 524993 521418 519233 518222 518079 518579 519349 519982
61314 519982 520622 522132 525298 529892 534813 539285 543797 549696 557892 568091 579311 590912 602857
61301 602857 615032 626685 636669 643980 647902 648047 644730 639143 632675 625967 618900 611378 603609 595629
61287 595629 587121 578049 569090 561102 554309 548210 542220 536244 530794 526603 524061 523024 523297 525074
61273 525074 528561 533350 538706 544429 550810 557694 564276 570068 575301 580088 583979 587029 590662 596681
61259 596681 605682 617050 630021 643939 657725 670090 680340 688447 694334 697837 699341 699709 699379
61246 699379 698126 695846 692883 689370 684928 679440 673569 667992 662542 656701 650676 645387 641366 638173
61232 638173 635038 631709 628476 625669 623442 622022 621807 622999 625284 628078 631078 634314 637721 641036
$$ packed form
61329E48101j85j445k423k838l168l873m603m573l575k185j011j43N00P70O33
61314E19982O40J510L166M594M921M472M512N899Q196J0199J1220J1601J1945
61301F02857J2175J1653R984P311L922J45l317n587o468o708p067p522p769p980
61287E95629q508r072q959p988o793o099n990n976n450m191k542j037K73J777
61273E25074L487M789N356N723O381O884O582N792N233M787L891L050L633O019
61259E96681R001J1368J2971J3918J3786J2365J0250Q107N887L503J504L68l30
61246F99379j253k280k963l513m442n488n871n577n450n841o025n289m021l193
61232F38173l135l329l233k807k227j420k15J192K285K794L000L236L407L315
$$ plain form
61218 641036 644285 648035 652765 658084 662979 666887 670224 673761 677665 681287 683820 684999 685114 684480 683159
61203 683159 681377 679998 680168 682411 686403 691716 698515 707469 719315 734583 753192 774056 795484
61190 795484 816295 836189 854781 870864 883180 891560 896763 899598 900838 901613 902893 904503 905360
61177 905360 904788 903015 900254 896006 889630 881158 871218 860445 849192 837581 825601 813252 800670
61164 800670 787948 774950 761503 747697 733676 719279 704389 689609 676071 664416 654417 645813
61152 645813 639079 635063 634069 635542 638586 642644 647637 653305 658340 660563 658514 652759 645095 636547
61138 636547 626803 615732 604602 595206 588250 583205 579493 577179 576512 577376 579496 582896 587873 594573
61124 594573 602864 612657 624131 637450 652421 668797 686853 707201 729834 753781 778004 802358
$$ packed form
61218F41036L249L750M730N319M895L908L337L537L904L622K533J179J15o34j321
61203F83159j782j379J70K243L992N313O799Q954J1846J5268J8609K0864K1428
61190G95484K0811J9894J8592J6083J2316Q380N203K835J240P75J280J610Q57
61177I05360n72j773k761m248o376q472r940j0773j1253j1611j1980j2349j2582
61164H00670j2722j2998j3447j3806j4021j4397j4890j4780j3538j1655r999q604
61152F45813o734m016r94J473L044M058M993N668N035K223k049n755p664q548
61138F36547r744j1071j1130r396o956n045l712k314o67Q64K120L400M977O700
61124E94573Q291R793J1474J3319J4971J6376J8056K0348K2633K3947K4223K4354
$$ plain form
61112 802358 827351 853283 879991 907066 933850 959493 983623 1006743 1029309 1050574 1069016
61101 1069016 1083862 1095387 1103557 1107265 1105387 1098099 1086603 1071842 1053975 1033011 1009498 984370
61089 984370 958261 931199 903203 874993 847642 821443 795797 770593 747056 726478 708596
61078 708596 692100 676456 662179 649418 637463 625966 615680 607497 601426 596983 593931 592167
61066 592167 591322 590956 590877 591069 591690 593218 596072 599899 603762 607223 610766 614991 620029 625960 633166 641929
61050 641929 652204 664048 677661 692779 708694 725211 742971 762500 783619 806136 830298
61039 830298 856015 882382 908671 935216 962668 990944 1019559 1048474 1077870 1107539 1137221
61028 1137221 1167237 1198144 1230045 1262844 1296848 1332501 1369750 1408066 1446703 1484576 1520642
$$ packed form
61112H02358K4993K5932K6708K7075K6784K5643K4130K3120K2566K1265J8442
61101A069016J4846J1525Q170L708j878p288j1496j4761j7867k0964k3513k5128
61089I84370k6109k7062k7996k8210k7351k6199k5646k5204k3537k0578j7882
61078G08596j6496j5644j4277j2761j1955j1497j0286q183o071m443l052j764
61066E92167q45l66p9J92O21J528K854L827L863L461L543M225N038N931P206Q763
61050F41929J0275J1844J3613J5118J5915J6517J7760J9529K1119K2517K4162
61039H30298K5717K6367K6289K6545K7452K8276K8615K8915K9396K9669K9682
61028A137221L0016L0907L1901L2799L4004L5653L7249L8316L8637L7873L6066
$$ plain form
61017 1520642 1555287 1591013 1631094 1677882 1732821 1797263 1872109 1956934 2050483 2152178 2263029
61006 2263029 2386087 2527326 2695946 2903094 3160715 3482384 3884595 4386713 5011666
60997 5011666 5789557 6761084 7976870 9494142 11369100 13629684 16217197 18925693
60989 18925693 21407439 23286244 24328246 24552958 24208317 23646021 23196177 23094062 23433416
60980 23433416 24118117 24850658 25220822 24881777 23705325 21811712 19473626 16984367 14573337
60971 14573337 12383772 10483462 8884295 7564042 6486341 5612905 4907823 4339284
60963 4339284 3881047 3511988 3214076 2971603 2771871 2604959 2462595 2338382 2229007
60954 2229007 2133624 2051283 1979686 1916674 1861823 1815851 1778974 1750191 1727519 1708317 1689773
$$ packed form
61017A520642L4645L5726M0081M6788N4939O4442P4846Q4825R3549J01695J10851
61006B263029J23058J41239J68620K07148K57621L21669M02211N02118O24953
60997E011666P77891R71527J215786J517272J874958K260584K587513K708496
60989A8925693K481746J878805J042002K24712l44641n62296m49844j02115L39354
60980B3433416O84701P32541L70164l39045j176452j893613k338086k489259k411030
60971A4573337k189565j900310j599167j320253j077701q73436p05082n68539
60963D339284m58237l69059k97912k42473j99732j66912j42364j24213j09375
60954B229007r5383q2341p1597o3012n4851m5972l6877k8783k2672j9202j8544
$$ plain form
60943 1689773 1669741 1647174 1621783 1593701 1563610 1532602 1501369 1469806 1437719 1405562 1373946
60932 1373946 1342668 1310925 1278527 1246357 1215471 1186139 1157977 1130564 1103615 1076854 1050224
60921 1050224 1024088 998893 974699 951355 929007 907985 888205 869220 850970 833978 818524
60910 818524 804105 790092 776645 764552 754355 745954 738866 732548 726654 721281 716779 713064 709412
60897 709412 705257 700850 696614 692238 687077 681238 675461 669939 664016 657263 650194 643652 637970 632997
60883 632997 628508 624320 620357 616701 613214 609117 603512 596505 589190 582275 575347 567863 560200 553174
60869 553174 546995 541307 535912 530845 526004 521345 517315 514494 512831 511723 510806 510214 510072 510229 510550
60854 510550 511031 511540 511776 511607 511151 510479 509581 508699 508380 508973 510277 511747 512863 513159 512186 509670 505694
$$ packed form
60943A689773k0032k2567k5391k8082l0091l1008l1233l1563l2087l2157l1616
60932A373946l1278l1743l2398l2170l0886k9332k8162k7413k6949k6761k6630
60921A050224k6136k5195k4194k3344k2348k1022j9780j8985j8250j6992j5454
60910H18524j4419j4013j3447j2093j0197q401p088o318n894n373m502l715l652
60897G09412m155m407m236m376n161n839n777n522n923o753p069o542n682m973
60883F32997m489m188l963l656l487m097n605p007p315o915o928p484p663p026
60869E53174o179n688n395n067m841m659m030k821j663j108r17n92j42J57L21
60854E10550M81N09K36j69m56o72q98q82l19N93J304J470J116K96r73k516l976
$$ plain form
60837 505694 500589 494729 488458 482054 475691 469484 463647 458513 454345 451221 449109 447979 447813 448627 450451
60822 450451 453115 456022 458380 459776 460419 460755 461068 461447 461740 461387 459721 456850 453936 452080 451121 450124
60806 450124 448875 448095 448089 448076 447283 445921 444434 442468 439486 435969 432995 430749 428419 425547 422523 419537
60790 419537 416111 412110 408342 405504 403144 400364 397050 393712 390530 387286 384099 381514 379926 379287
60776 379287 379281 379338 378705 377009 374661 372367 370486 369235 369122 370483 372823 375314 377836 380862 384367 387617
60760 387617 390163 392380 394835 397711 401044 404935 409206 413247 416552 419119 421141 422580 423287 423400 423490
60745 423490 424348 426404 429101 431068 431306 430016 427839 424649 419815 413497 406774 400395 394272 388368 383213
60730 383213 379137 375735 372603 369921 367770 365468 362283 358427 354804 352072 350404 349806 350027 350352 350011
$$ packed form
60837E05694n105n860o271o404o363o207n837n134m168l124k112j130j66Q14J824
60822D50451K664K907K358J396O43L36L13L79K93l53j666k871k914j856r59r97
60806D50124j249p80oj3p93j362j487j966k982l517k974k246k330k872l024k986
60790D19537l426m001l768k838k360k780l314l338l182l244l187k585j588o39
60776C79287oN7o33j696k348k294j881j251j13J361K340K491K522L026L505L250
60760C87617K546K217K455K876L333L891M271M041L305K567K022J439P07J13R0
60745D23490Q58K056K697J967K38j290k177l190m834o318o723o379o123n904n155
60730C83213m076l402l132k682k151k302l185l856l623k732j668n98K21L25l41
$$ plain form
60715 350011 348779 346895 344650 342409 340729 339927 339646 339239 338498 337731 337264 337225 337666 338549 339677 340891 342252
60698 342252 343844 345583 347427 349534 351963 354451 356727 358786 360616 362014 363053 364412 366686 369549
60684 369549 372115 374068 375978 378594 382205 386687 391687 396683 401214 405238 409086 413030 416968 420505
60670 420505 423177 424762 425543 426134 426791 427061 426294 424312 421296 417257 412154 406452 401061 396592 392948
60655 392948 389792 387157 385447 384902 385170 385473 385334 385109 385545 386761 388032 388773 389267 390042 390906 391109 390204
60638 390204 388244 385342 381670 377794 374358 371392 368463 365562 363275 362018 361651 361960 362887 364038 364617
60623 364617 364280 363641 363506 364004 364860 366028 367468 368646 368983 368724 368643 368862 368647 367581 366292 365580 365380
60606 365380 365178 365076 365708 367162 368720 369813 370608 371376 371848 371732 371400 371446 371827 372119 372533 373915 376581
$$ packed form
60715C50011j232j884k245k241j680q02k81m07p41p67m67l9M41Q83J128J214J361
60698C42252J592J739J844K107K429K488K276K059J830J398J039J359K274K863
60684C69549K566J953J910K616L611M482N000M996M531M024L848L944L938L537
60670D20505K672J585P81N91O57K70p67j982l016m039n103n702n391m469l644
60655C92948l156k635j710n45K68L03j39k25M36J216J271P41M94P75Q64K03r05
60638C90204j960k902l672l876l436k966k929k901k287j257l67L09R27J151N79
60623C64617l37o39j35M98Q56J168J440J178L37k59q1K19k15j066j289p12k00
60606C65380k02j02O32J454J558J093P95P68M72j16l32M6L81K92M14J382K666
$$ plain form
60589 376581 379800 382703 385158 387408 389402 390962 392268 393628 394942 395874 396437 396988 397655 398172 398308 398267
60573 398267 398602 399836 401975 404299 405976 407210 409546 414589 422576 432603 444028 456988 471555
60560 471555 486987 502099 515912 527695 536796 542776 545540 545109 541561 535430 527911 520232 512878
60547 512878 505784 499227 494161 491434 490960 491931 493771 496591 500697 506032 512453 520417 530942 544698
60533 544698 561381 580122 600234 621286 642530 662612 679901 693012 701137 704229 702940 698215
60521 698215 690815 681266 670209 658591 647369 637103 627890 619563 611869 604512 597341 590693 585444
60508 585444 582360 581260 581068 580977 581416 583600 588252 595135 603707 613800 625679 640022 658089 681361
60494 681361 710565 745249 784521 827853 874866 924676 975868 1026872 1076007 1121427 1161553
$$ packed form
60589C76581L219K903K455K250J994J560J306J360J314R32N63N51O67N17J36m1
60573C98267L35J234K139K324J677J234K336N043P987J0027J1425J2960J4567
60560D71555J5432J5112J3813J1783R101N980K764m31l548o131p519p679p354
60547E12878p094o557n066k727m74R71J840K820M106N335O421P964J0525J3756
60533E44698J6683J8741K0112K1052K1244K0082J7289J3111Q125L092j289m725
60521F98215p400r549j1057j1618j1222j0266r213q327p694p357p171o648n249
60508E85444l084j100j92r1M39K184M652O883Q572J0093J1879J4343J8067K3272
60494F81361K9204L4684L9272M3332M7013M9810N1192N1004M9135M5420M0126
$$ plain form
60483 1161553 1195437 1222327 1241062 1250387 1249816 1239707 1220483 1192200 1154997 1109691 1057926 1002079
60471 1002079 944907 888861 835599 786255 741925 703264 669727 639939 613104 589530 569524
60460 569524 552394 537088 523378 511738 502170 493832 485983 478736 472555 467303 462268 457111 452362
60447 452362 448733 446113 443553 440307 436670 433722 432405 432911 434627 436399 436986 435768 433204 430472 428519
60432 428519 427449 426765 426034 425266 424806 424947 425592 426168 425967 424688 422727 420878 419711 419235 419160 419367 419970
60415 419970 420975 422126 423252 424507 426045 427637 428887 429733 430479 431424 432768 434672 437017 439195 440659
60400 440659 441636 442751 443960 444527 444181 443642 443705 444462 445774 447823 450614 453484 455777 457679 459849 462530
60384 462530 465551 468834 472303 475600 478527 481495 484910 488371 491177 493407 495741 498308 500487 501908
$$ packed form
60483A161553L3884K6890J8735R325n71j0109j9224k8283l7203m5306n1765n5847
60471A002079n7172n6046n3262m9344m4330l8661l3537k9788k6835k3574k0006
60460E69524j7130j5306j3710j1640r568q338p849p247o181n252n035n157m749
60447D52362l629k620k560l246l637k948j317N06J716J772N87j218k564k732j953
60432D28519j070o84p31p68m60J41O45N76k01j279j961j849j167m76p5K07O03
60415D19970J005J151J126J255J538J592J250Q46P46R45J344J904K345K178J464
60400D40659R77J115J209N67l46n39O3P57J312K049K791K870K293J902K170K681
60384D62530L021L283L469L297K927K968L415L461K806K230K334K567K179J421
$$ plain form
60370 501908 502928 504008 505251 506696 508443 510297 511743 512539 512949 513377 514103 515357 517200 519299 521306
60355 521306 523396 525974 528932 531868 535072 539539 545836 553677 562785 573352 585154 596898 607150
60342 607150 615599 622827 629055 633586 635369 633699 628502 620367 610421 599946 589965 581000 573028 565647
60328 565647 558517 551696 545426 539717 534440 529691 525676 522280 519209 516527 514533 513022 511231 508758
60314 508758 506079 503949 502768 502755 504256 507433 511983 517570 524351 532824 543407 556403 572173 591047
60300 591047 613120 638121 665126 692246 716968 737112 751359 758843 758739 750641 735165 713988
60288 713988 689450 664137 640378 619700 602726 589490 579500 571548 564160 556637 549351 542800 536791
60275 536791 530849 524941 519300 513835 508243 502504 496860 491491 486615 482725 480251 479026 478454 478130 477901
$$ packed form
60370E01908J020J080J243J445J747J854J446P96M10M28P26J254J843K099K007
60355E21306K090K578K958K936L204M467O297P841R108J0567J1802J1744J0252
60342F07150Q449P228O228M531J783j670n197q135r946j0475r981q965p972p381
60328E65647p130o821o270n709n277m749m015l396l071k682j994j511j791k473
60314E08758k679k130j181j3J501L177M550N587O781Q473J0583J2996J5770J8874
60300E91047K2073K5001K7005K7120K4722K0144J4247P484j04q098j5476k1177
60288G13988k4538k5313k3759k0678j6974j3236r990p952p388p523p286o551o009
60275E36791n942n908n641n465n592n739n644n369m876l890k474j225n72l24k29
$$ plain form
60260 477901 477413 476158 474151 472201 471138 470907 470656 469734 468345 467119 466261 465480 464690 464353 464866 465993
60244 465993 467201 468263 469164 469776 470178 470973 472586 474335 474986 474251 473045 472201 471752 471674 472461 474505 477517
60227 477517 481004 484768 488551 491861 494625 497537 501203 505361 509357 512935 516132 518963 521813 525700
60213 525700 531424 538718 546761 555217 564229 573716 583349 593022 602756 612247 621003 628862 636007 642622
60199 642622 648803 654527 659378 662757 664802 666527 668419 669428 668275 665428 662741 661157 659729 657064
60185 657064 652878 647797 642369 636779 631123 625464 619747 613828 607550 600820 593840 587218 581599 577224
60171 577224 573995 571718 569979 568099 565803 563788 563051 563635 564519 564750 564195 563176 561950 560706 559651
60156 559651 558906 558571 558901 560088 561815 563371 564324 564870 565571 566971 569398 572781 576681 580710 584787 588745
$$ packed form
60260D77901m88j255k007j950j063k31k51r22j389j226q58p81p90l37N13J127
60244D65993J208J062R01O12M02P95J613J749O51p35j206q44m49p8P87K044L012
60227D77517L487L764L783L310K764K912L666M158L996L578L197K831K850L887
60213E25700N724P294Q043Q456R012R487R633R673R734R491Q756P859P145O615
60199F42622O181N724M851L379K045J725J892J009j153k847k687j584j428k665
60185F57064m186n081n428n590n656n659n717n919o278o730o980o622n619m375
60171E77224l229k277j739j880k296k015p37N84Q84K31n55j019j226j244j055
60156E59651p45l35L30J187J727J556R53N46P01J400K427L383L900M029M077L958
$$ plain form
60140 588745 592078 594533 596664 599249 602368 605697 609503 614501 620743 627416 633920 640411 647057 653386
60126 653386 658681 662560 664999 666311 667250 668565 670228 671666 672896 674766 677763 681269 684400 686904
60112 686904 688767 689622 689277 688340 687526 686602 684721 681676 678151 674763 671401 667552 662807 657062 650680
60097 650680 644529 639445 635578 632559 630309 629218 629353 629967 630138 629671 629060 628718 628655 628936 630006 632192
60081 632192 635077 637721 639551 640779 641845 642764 643119 642383 640014 635596 629314 622113 614905 607740 600171
60066 600171 592302 584843 578141 571797 565492 559534 554222 549209 544067 539168 535435 533239 531963 530626
60052 530626 528667 526224 523963 522666 522775 524303 527169 531383 536759 542758 548925 555292 562017 568859
60038 568859 575438 581873 588529 595039 600146 602901 603640 603414 602661 600899 597647 593157 588059 582615 576637
$$ packed form
60140E88745L333K455K131K585L119L329L806M998O242O673O504O491O646O329
60126F53386N295L879K439J312R39J315J663J438J230J870K997L506L131K504
60112F86904J863Q55l45r37q14r24j881l045l525l388l362l849m745n745o382
60097F50680o151n084l867l019k250j091J35O14J71m67o11l42o3K81J070K186
60081F32192K885K644J830J228J066R19L55p36k369m418o282p201p208p165p569
60066F00171p869p459o702o344o305n958n312n013n142m899l733k196j276j337
60052E30626j959k443k261j297J09J528K866M214N376N999O167O367O725O842
60038E68859O579O435O656O510N107K755P39k26p53j762l252m490n098n444n978
$$ plain form
60023 576637 569935 562570 554686 546382 537868 529563 521925 515259 509718 505257 501452 497483 492585 486605
60009 486605 480095 473918 468775 464880 461861 459029 456018 453192 451239 450378 450173 450190 450557 451692 453644
59994 453644 456044 458691 461861 465837 470338 474740 478864 483159 487958 492887 497367 501462 505686 510052
59980 510052 513827 516375 517732 518101 517226 514693 510601 505559 500172 494814 489704 484879 480185 475607 471527
59965 471527 468443 466581 465952 466518 467974 469629 470958 472130 473607 475375 477033 478482 479943 481296 482003
59950 482003 481894 481550 481647 482260 483115 484246 486003 488418 490846 492384 492626 491936 490933 489808 488286 486191
59934 486191 483795 481576 479942 479208 479489 480527 482005 484200 487803 492831 498290 503294 507978 512863 517967
59919 517967 523221 529188 536396 544360 552171 559810 567858 576024 583027 587938 590662 591108 589139 585611
$$ packed form
60023E76637o702p365p884q304q514q305p638o666n541m461l805l969m898n980
60009D86605o510o177n143l895l019k832l011k826j953q61k05J7L67J135J952
59994D53644K400K647L170L976M501M402M124M295M799M929M480M095M224M366
59980E10052L775K548J357L69q75k533m092n042n387n358n110m825m694m578m080
59965D71527l084j862o29N66J456J655J329J172J477J768J658J449J461J353P07
59950D82003j09l44R7O13Q55J131J757K415K428J538K42o90j003j125j522k095
59934D86191k396k219j634p34K81J038J478K195L603N028N459N004M684M885N104
59919E17967N254N967P208P964P811P639Q048Q166P003M911K724M46j969l528
$$ plain form
59905 585611 582276 580039 578212 575959 573524 571351 568970 565768 562266 559622 558130 557074 555966 555169
59891 555169 555239 556207 557620 559107 560898 563853 568680 574970 581428 587253 592837 598838 605183 611528 618097
59876 618097 625343 633076 640659 647795 654382 659716 662678 662903 661145 658254 654286 648896 642252 635130
59862 635130 628235 621708 615332 609118 603486 598838 595080 591807 588829 586213 583842 581429 579153 577800
59848 577800 577984 579581 582262 586246 592180 600473 611053 623433 636501 648404 657138 661510 661586 658560
59834 658560 654431 651408 651020 653572 658398 664288 669546 672281 671355 667067 660573 652783 644137 635139 626511
59819 626511 618774 612048 606274 601382 597310 594127 592022 590946 590423 589930 589239 588072 585809 582062 577359
59804 577359 572696 568505 564617 561111 558520 557017 555985 554664 552854 550750 548431 545820 542915 539848
$$ packed form
59905E85611l335k237j827k253k435k173k381l202l502k644j492j056j108p97
59891E55169P0R68J413J487J791K955M827O290O458N825N584O001O345O345O569
59876F18097P246P733P583P136O587N334K962K25j758k891l968n390o644p122
59862F35130o895o527o376o214n632m648l758l273k978k616k371k413k276j353
59848E77800J84J597K681L984N934Q293J0580J2380J3068J1903Q734M372P6l026
59834F58560m129l023l88K552M826N890N258K735r26m288o494p790q646q998q628
59819F26511p737o726n774m892m072l183k105j076n23m93o91j167k263l747m703
59804E77359m663m191l888l506k591j503j032j321j810k104k319k611k905l067
$$ plain form
59790 539848 536849 534277 532479 531413 530511 529044 526648 523550 520418 518005 516760 516634 517223 518066 518837
59775 518837 519485 520332 521861 524170 526783 529193 531448 533892 536465 538633 540064 541085 542336 544185 546535
59760 546535 549059 551537 554042 556817 559931 563130 566128 568898 571633 574583 578084 582463 587628 592878
59746 592878 597410 600951 603679 605737 607201 608378 609637 610919 611828 612286 612696 613292 613752 613734 613527 613828
59730 613828 614979 616668 618269 619283 619549 619325 619228 619803 621040 622401 623441 624209 624897 625330 625174 624637 624412
59713 624412 624745 624999 624562 623840 623777 624617 625762 626873 628394 630790 633880 637258 640914 645032 649549 654251
59697 654251 658982 663418 666984 669449 671421 673820 676984 680477 683563 685540 685901 684604 682176 679343
59683 679343 676645 674490 673151 672395 671391 669381 666232 662128 657110 651301 645150 638898 632134 624510
$$ packed form
59790E39848k999k572j798j066r02j467k396l098l132k413j245j26N89Q43P71
59775E18837O48Q47J529K309K613K410K255K444K573K168J431J021J251J849K350
59760E46535K524K478K505K775L114L199K998K770K735K950L501M379N165N250
59746E92878M532L541K728K058J464J177J259J282R09M58M10N96M60j8k07L01
59730F13828J151J689J601J014K66k24r7N75J237J361J040P68O88M33j56n37k25
59713F24412L33K54m37p22o3Q40J145J111J521K396L090L378L656M118M517M702
59697F54251M731M436L566K465J972K399L164L493L086J977L61j297k428k833
59683F79343k698k155j339p56j004k010l149m104n018n809o151o252o764p624
$$ plain form
59669 624510 616666 609812 604499 600437 597364 595296 593861 592140 589558 586480 583735 581940 581458 582481
59655 582481 584788 587696 590646 593801 597884 603377 609867 616097 620789 623582 625093 625913 625775 623972 620315
59640 620315 615197 608918 601566 593601 585947 579260 573519 568550 564602 562049 560753 560069 559407 558577 557574
59625 557574 556221 554184 551352 548030 544548 540777 536406 531680 527395 523882 520470 516320 511506 506870
59611 506870 503210 501033 500679 501999 504121 506249 508585 511827 515882 519802 522966 525487 527350 527989 527138
59596 527138 525496 524073 523227 522709 522303 522144 522539 523701 525485 527339 528772 529802 530583 530724 529601 527468
59580 527468 525537 524656 524375 523650 522025 519702 516956 513962 510974 508185 505531 502953 500739 499258 498431
59565 498431 497713 496551 494679 492129 489236 486597 484791 484043 484135 484644 485288 486090 487194 488468 489534 490384
$$ packed form
59669F24510p844o854n313m062l073k068j435j721k582l078k745j795m82J023
59655E82481K307K908K950L155M083N493O490O230M692K793J511Q20j38j803l657
59640F20315n118o279p352p965p654o687n741m969l948k553j296o84o62q30j003
59625E57574j353k037k832l322l482l771m371m726m285l513l412m150m814m636
59611E06870l660k177l54J320K122K128K336L242M055L920L164K521J863O39q51
59596E27138j642j423q46n18m06j59L95J162J784J854J433J030P81J41j123k133
59580E27468j931q81k81p25j625k323k746k994k988k789k654k578k214j481q27
59565D98431p18j162j872k550k893k639j806p48R2N09O44Q02J104J274J066Q50
$$ plain form
59549 490384 491747 494430 498314 502351 505521 507531 508719 509805 511794 515638 521801 530424 541860 556654
59535 556654 575010 596700 621279 647401 671650 689070 695974 692451 682062 669499 658578 651465
59523 651465 648586 649045 651627 655588 660445 665328 669032 670719 670286 668046 664255 658834 651360 641440 629327
59508 629327 616088 602991 590806 579744 569816 560953 552977 545775 539445 534084 529537 525565 522118
59495 522118 519203 516642 514283 512353 511283 511164 511602 512167 512802 513723 515092 516872 518870 520889 522887
59480 522887 525040 527568 530483 533578 536785 540511 545437 551814 559004 565924 571915 576994 581280 584576
59466 584576 586732 588067 589048 589705 589745 589142 588322 587899 588493 590617 594332 599132 604648 611356 620097 630863
59450 630863 642546 653901 664336 673744 682082 689273 695041 698693 699429 697022 691888 684526 675322 664897
$$ packed form
59549D90384J363K683L884M037L170K010J188J086J989L844O163Q623J1436J4794
59535E56654J8356K1690K4579K6122K4249J7420O904l523j0389j2563j0921p113
59523F51465k879M59K582L961M857M883L704J687m33k240l791n421p474r920j2113
59508F29327j3239j3097j2185j1062r928q863p976p202o330n361m547l972l447
59495E22118k915k561k359j930j070j19M38N65O35R21J369J780J998K019J998
59480E22887K153K528K915L095L207L726M926O377P190O920N991N079M286L296
59466E84576K156J335R81O57M0o03q20m23N94K124L715M800N516O708Q741J0766
59450F30863J1683J1355J0435R408Q338P191N768L652P36k407n134p362r204j0425
$$ plain form
59436 664897 654068 643369 633093 623846 616376 610622 605660 600960 597099 594802 593884 593773 594675 597490
59422 597490 602690 609820 618152 627427 637976 650311 664679 681011 699318 719918 742892 767621
59410 767621 793544 821125 850712 879716 901893 910698 903626 883343 855495 826130 800270 781183
59398 781183 770395 768679 776647 793296 813943 830854 837091 830075 811857 786798 759263 732481
59386 732481 708257 687222 669576 655705 646036 640393 637794 637003 637236 638317 640308 643149 646611 650406
59372 650406 654263 658051 661906 666062 670480 674824 678957 683142 687504 691619 695076 698177 701533 705131
59358 705131 708458 711527 715051 719431 724269 729222 734824 742050 751395 762642 775235 788715 803136
59345 803136 819111 837008 856046 874764 892438 909341 925420 939555 950560 958135 962334 962925
$$ packed form
59436F64897j0829j0699j0276r247p470n754m962m700l861k297r18j11R02K815
59422E97490N200P130Q332R275J0549J2335J4368J6332J8307K0600K2974K4729
59410G67621K5923K7581K9587K9004K2177Q805p072k0283k7848k9365k5860j9087
59398G81183j0788j716P968J6649K0647J6911O237p016j8218k5059k7535k6782
59386G32481k4224k1035j7646j3871r669n643k599p91K33J081J991K841L462L795
59372F50406L857L788L855M156M418M344M133M185M362M115L457L101L356L598
59358G05131L327L069L524M380M838M953N602P226R345J1247J2593J3480J4421
59345H03136J5975J7897J9038J8718J7674J6903J6079J4135J1005P575M199N91
$$ plain form
59333 962925 959981 954383 946805 936715 923343 907299 890305 873484 856831 840343 824767 810968
59321 810968 799116 788669 778821 768959 759127 750035 742304 735833 730171 725149 720596 715782 709929 703260
59307 703260 696778 690970 685367 679620 674384 670775 669223 669133 669582 670345 672379 677234 685853 698054 713135
59292 713135 730281 747744 762039 769062 766479 755004 737588 717801 698622 681699 667250 654930
59280 654930 644959 638172 635024 634972 636974 640318 644953 651313 659906 670824 683611 697651 712496 727624
59266 727624 742246 755742 768019 778925 787591 792921 794651 793360 789562 783435 775411 766335 756831
59253 756831 747009 736876 726620 716457 706716 698104 691319 686259 682168 678732 676463 675788 676328 677544
59239 677544 679647 683395 689144 696512 704856 713745 722916 731935 740028 746331 750409 752455 752941 752188 750422
$$ packed form
59333I62925k944n598p578j0090j3372j6044j6994j6821j6653j6488j5576j3799
59321H10968j1852j0447r848r862r832r092p731o471n662n022m553m814n853o669
59307G03260o482n808n603n747n236l609j552r0M49P63K034M855Q619J2201J5081
59292G13135J7146J7463J4295P023k583j1475j7416j9787j9179j6923j4449j2320
59280F54930r971o787l148n2K002L344M635O360Q593J0918J2787J4040J4845J5128
59266G27624J4622J3496J2277J0906Q666N330J730j291l798o127q024r076r504
59253G56831r822j0133j0256j0163r741q612o785n060m091l436k269o75N40J216
59239F77544K103L748N749P368Q344Q889R171R019Q093O303M078K046M86p53j766
$$ plain form
59224 750422 747963 744997 741321 736654 731158 725368 719735 714533 709978 705983 701919 697140 691746 686374
59210 686374 681299 676258 671163 666372 662148 658356 654865 651724 648743 645403 641539 637726 634668 632462
59196 632462 630723 629179 627848 626823 626197 626133 626836 628432 630958 634338 638310 642448 646368 649931 653309
59181 653309 656880 660928 665401 670021 674646 679269 683666 687468 690823 694555 699337 705083 711520 718916
59167 718916 727680 737515 747594 757427 766984 776169 784694 792347 798759 803052 804339 802531 798117 791340
59153 791340 782270 771495 759851 747399 733503 718181 702650 688260 675406 663709 652699 642102
59141 642102 631943 622639 614581 607520 600764 594035 587639 581812 576556 572192 569332 568036 567570 567221
59127 567221 566851 566564 566494 567094 568934 571945 575521 579630 585084 592391 601073 610584 621134 633050 645930
$$ packed form
59224G50422k459k966l676m667n496n790n633n202m555l995m064m779n394n372
59210F86374n075n041n095m791m224l792l491l141k981l340l864l813l058k206
59196F32462j739j544j331j025o26o4P03J596K526L380L972M138L920L563L378
59181F53309L571M048M473M620M625M623M397L802L355L732M782N746O437P396
59167G18916Q764R835J0079R833R557R185Q525P653O412M293J287j808m414o777
59153G91340r070j0775j1644j2452j3896j5322j5531j4390j2854j1697j1010j0597
59141F42102j0159r304q058p061o756o729o396n827n256m364k860j296m66l49
59127E67221l70k87p0O00J840L011L576M109N454P307Q682R511J0550J1916J2880
$$ plain form
59112 645930 659139 672583 686346 699955 712715 724524 735735 746409 756188 764772 772058 778008
59100 778008 782743 786565 789497 790998 790484 787970 783973 779069 773876 769133 765306 762277 759750 757763
59086 757763 756486 755740 755083 754151 752585 749833 745396 739237 731704 723206 714142 704868 695488 685908 676366
59071 676366 667615 660233 653991 648264 642907 638328 634731 631623 628159 623847 618949 614224 610221 606828
59057 606828 603613 600422 597338 594252 590996 587864 585359 583349 581105 578419 576021 574573 573858 573394 573235
59042 573235 573611 574214 574405 573918 572924 571774 571015 571267 572561 574129 575322 576390 577896 579796 581844 584600
59026 584600 589248 596329 605270 615278 626259 638659 652732 668096 683824 698931 712809 725168
59014 725168 735549 743211 747611 748817 747349 743951 739600 735284 731459 728079 725391 724217 725126 727774
$$ packed form
59112F45930J3209J3444J3763J3609J2760J1809J1211J0674R779Q584P286N950
59100G78008M735L822K932J501n14k514l997m904n193m743l827l029k527j987
59086G57763j277p46o57r32j566k752m437o159p533q498r064r274r380r580r542
59071F76366q751p382o242n727n357m579l597l108l464m312m898m725m003l393
59057F06828l215l191l084l086l256l132k505k010k244k686k398j448p15m64j59
59042E73235L76O03J91m87r94j150p59K52J294J568J193J068J506J900K048K756
59026E84600M648P081Q941J0008J0981J2400J4073J5364J5728J5107J3878J2359
59014G25168J0381P662M400J206j468l398m351m316l825l380k688j174R09K648
$$ plain form
59000 727774 731526 736235 741920 748092 754069 759771 765545 771298 776290 779798 781583 781769 780581 778179
58986 778179 774542 769675 763977 758019 751780 744650 736620 728905 722832 718608 715841 714830 716414 720753
58972 720753 727053 734478 742663 751463 760976 771769 784297 797973 811487 824188 836507 848866
58960 848866 860866 871829 881484 889688 895859 899176 899128 895631 888807 878888 866172 850985 833886
58947 833886 815902 798236 781484 765397 749571 734217 720109 707992 698197 690742 685549 682474
58935 682474 681150 680884 680893 680721 680317 679651 678515 676809 674744 672432 669541 665764 661445 657315 653655 650182
58919 650182 646756 643694 641227 639051 636723 634314 632366 631266 630897 630931 631328 632426 634515 637481 641053
58904 641053 645356 651017 658627 668309 679847 692985 707430 722798 738733 754948 771043 786549
$$ packed form
59000G27774L752M709N685O172N977N702N774N753M992L508J785J86j188k402
58986G78179l637m867n698n958o239p130q030p715o073m224k767j011J584M339
58972G20753O300P425Q185Q800R513J0793J2528J3676J3514J2701J2319J2359
58960H48866J2000J0963R655Q204O171L317m8l497o824r919j2716j5187j7099
58947H33886j7984j7666j6752j6087j5826j5354j4108j2117r795p455n193l075
58935F82474j324k66Rj72m04o66j136j706k065k312k891l777m319m130l660l473
58919F50182l426l062k467k176k328k409j948j100l69L4L97J098K089K966L572
58904F41053M303N661P610R682J1538J3138J4445J5368J5935J6215J6095J5506
$$ plain form
58892 786549 801372 816035 831297 847660 865325 884380 904865 926815 950236 974649 998535
58881 998535 1019751 1036935 1050229 1060268 1066779 1068672 1065314 1057224 1045485 1030853 1013509 993536
58869 993536 971583 949086 927683 908344 891258 876482 864206 854231 845724 837866 830338 822865
58857 822865 814773 805553 795569 785637 776074 766606 757021 747436 738034 728994 720647 713340 707141 701791
58843 701791 696772 691254 684428 676353 668206 661245 655614 650504 645185 639464 633431 627388 621966 617796
58829 617796 614923 612869 611224 609989 609421 609754 610938 612445 613621 614460 615699 617928 620938 624241 627736
58814 627736 631391 634742 637356 639517 641810 644210 646172 647450 648263 648781 648977 648881 648443 647187 644541 640527
58798 640527 635815 631186 627213 624145 621623 618726 614791 610058 605164 600363 595793 592111 590126 589874
$$ packed form
58892G86549J4823J4663J5262J6363J7665J9055K0485K1950K3421K4413K3886
58881I98535K1216J7184J3294J0039O511J893l358q090j1739j4632j7344j9973
58869I93536k1953k2497k1403j9339j7086j4776j2276r975q507p858p528p473
58857H22865q092r220r984r932r563r468r585r585r402r040q347p307o199n350
58843G01791n019n518o826q075q147o961n631n110n319n721o033o043n422m170
58829F17796k873k054j645j235n68L33J184J507J176Q39J239K229L010L303L495
58814F27736L655L351K614K161K293K400J962J278Q13N18J96r6m38j256k646m014
58798F40527m712m629l973l068k522k897l935m733m894m801m570l682j985k52
$$ plain form
58784 589874 590698 592184 594467 597712 601847 606759 612247 617867 623335 628952 635098 641349 646517 649440
58770 649440 649351 645844 639194 630602 621467 612435 603559 595120 587567 580815 574361 568128 562589 558092 554696
58755 554696 552681 552535 554296 557335 560864 564329 567467 570370 573335 576234 578374 579578 581038 584277
58741 584277 589464 595521 601755 608510 616251 624816 633697 642415 650586 658307 666473 675979 686514 696778
58727 696778 705850 713704 720470 725963 730033 732724 734020 734028 733379 732762 732233 731704 731951 734134 738306 743327
58711 743327 748384 753624 759113 764163 767985 770145 770055 766949 760817 752633 743170 732183 719150 704196
58697 704196 687891 670700 653051 635489 618407 602035 586974 574310 564863 558480 554164 550619
58685 550619 546864 542752 538822 535258 531256 526045 520175 514956 510855 507406 504500 502628 501827 501584 501985
$$ packed form
58784E89874Q24J486K283L245M135M912N488N620N468N617O146O251N168K923
58770F49440q9l507o650q592r135r032q876q439p553o752o454o233n539m497l396
58755E54696k015j46J761L039L529L465L138K903K965K899K140J204J460L239
58741E84277N187O057O234O755P741Q565Q881Q718Q171P721Q166R506J0535J0264
58727F96778R072P854O766N493M070K691J296Qo49o17n29n29K47K183M172N021
58711G43327N057N240N489N050L822K160r0l106o132q184r463j0987j3033j4954
58697G04196j6305j7191j7649j7562j7082j6372j5061j2664r447o383m316l545
58685E50619l755m112l930l564m002n211n870n219m101l449k906j872q01k43M01
$$ plain form
58670 501985 503855 507386 511692 516157 521323 528081 536835 547807 561163 576286 591618 605543 616743
58657 616743 623700 625221 622055 616794 611326 605220 597355 588175 579313 571614 564564 557413 550082 543120
58643 543120 537311 533134 530249 527857 525744 524541 524748 526131 528401 531760 536253 541137 545443 548843
58629 548843 551615 554112 556508 558619 559798 559488 558001 556221 554562 552959 551850 552170 554162 557195 561072
58614 561072 566483 573763 582162 590825 599519 607882 614945 620011 623132 624245 622951 619858 616955 615618
58600 615618 615071 613745 611349 608627 605922 603132 600502 598317 596214 593846 591888 591453 592821 595612 599922
58585 599922 606362 615096 625610 637359 650085 663587 677619 691748 705036 716329 725307 732805
58573 732805 739678 745954 751545 757076 763335 770523 778784 788960 802096 818643 838777 862910 891054
$$ packed form
58670E01985J870L531M306M465N166O758Q754J0972J3356J5123J5332J3925J1200
58657F16743O957J521l166n261n468o106p865r180q862p699p050p151p331o962
58643E43120n809m177k885k392k113j203K07J383K270L359M493M884M306L400
58629E48843K772K497K396K111J179l10j487j780j659j603j109L20J992L033L877
58614E61072N411P280Q399Q663Q694Q363P063N066L121J113j294l093k903j337
58600F15618n47j326k396k722k705k790k630k185k103k368j958m35J368K791M310
58585E99922O440Q734J0514J1749J2726J3502J4032J4129J3288J1293Q978P498
58573G32805O873O276N591N531O259P188Q261J0176J3136J6547K0134K4133K8144
$$ plain form
58560 891054 922102 954505 987369 1020161 1051610 1079629 1102246 1118272 1127536 1130959 1130088 1126026
58548 1126026 1119115 1109876 1099669 1089935 1081271 1073507 1065977 1057285 1045673 1030320 1011635 989900 964621
58535 964621 936000 906056 877171 850152 824719 801321 781306 765585 754023 745871 740027 735166
58523 735166 730531 726566 724268 724093 725725 728335 730666 731553 730956 729895 728926 727443 724990 722210 719711
58508 719711 716973 713385 709520 706267 703440 700428 697644 696114 695984 696497 697065 697422 697056 695516 693136
58493 693136 690729 688808 687618 687376 687852 688429 689328 692039 697715 705831 715262 725939 738495 753140
58479 753140 769975 789646 812445 837256 862370 886710 909205 927794 940345 946126 945390 938366
58467 938366 925882 910165 893475 876517 859543 844257 832843 825532 820868 818266 818702 822930 830559
$$ packed form
58560H91054L1048L2403L2864L2792L1449K8019K2617J6026R264L423q71m062
58548A126026o911r239j0207r734q664p764p530q692j1612j5353j8685k1735k5279
58535I64621k8621k9944k8885k7019k5433k3398k0015j5721j1562q152n844m861
58523G35166m635l965k298j75J632K610K331Q87n97j061r69j483k453k780k499
58508G19711k738l588l865l253k827l012k784j530j30N13N68L57l66j540k380
58493F93136k407j921j190k42M76N77Q99K711N676Q116R431J0677J2556J4645
58479G53140J6835J9671K2799K4811K5114K4340K2495J8589J2551N781p36p024
58467I38366j2484j5717j6690j6958j6974j5286j1414p311m664k602M36M228P629
$$ plain form
58454 830559 841018 854100 869330 885768 902439 918084 930736 938608 941221 938823 931264 918668
58442 918668 902756 886062 869905 854286 839546 826865 817168 810570 806769 805083 804469 804469 805785 809090
58428 809090 813939 819914 827961 839147 852735 867010 881450 896482 911501 924738 934811 941001
58416 941001 942463 938834 931400 922142 911845 900419 888468 876889 865415 853343 841300 830484
58404 830484 820633 810722 801336 794174 789356 785451 782256 781304 783230 786709 790511 794780 799722 804748
58390 804748 809503 814228 818591 821636 823342 824834 826723 828587 830361 832785 836198 840274 845165 851470
58376 851470 858802 865769 871598 876477 880290 882517 883614 885009 887528 891124 896109 903175 912164 922324
58362 922324 933782 947245 962281 977573 992833 1008749 1024997 1040015 1052710 1062696 1068992 1070636
$$ packed form
58454H30559J0459J3082J5230J6438J6671J5645J2652P872K613k398p559j2596
58442I18668j5912j6694j6157j5619j4740j2681r697o598l801j686o14%J316L305
58428H09090M849N975Q047J1186J3588J4275J4440J5032J5019J3237J0073O190
58416I41001J462l629p434r258j0297j1426j1951j1579j1474j2072j2043j0816
58404H30484r851r911r386p162m818l905l195r52J926L479L802M269M942N026
58390H04748M755M725M363L045J706J492J889J864J774K424L413M076M891O305
58376H51470P332O967N829M879L813K227J097J395K519L596M985P066Q989J0160
58362I22324J1458J3463J5036J5292J5260J5916J6248J5018J2695R986O296J644
$$ plain form
58350 1070636 1068814 1066371 1064822 1063551 1062146 1061530 1062393 1064368 1067216 1071319 1076713 1083211 1091522 1102581
58336 1102581 1115816 1129838 1144685 1161476 1179989 1198732 1217278 1236216 1254835 1271247 1284968
58325 1284968 1296919 1306728 1312560 1313989 1312674 1309945 1306173 1302702 1301531 1302557 1303824 1305077 1308298 1314130
58311 1314130 1320706 1326986 1334439 1344299 1355774 1368106 1381923 1397357 1413177 1428908 1445554 1463225
58299 1463225 1480248 1495629 1510215 1524627 1538292 1551285 1564809 1579183 1593678 1608802 1626209
58288 1626209 1645873 1666138 1686935 1709895 1734851 1759645 1784228 1811353 1842040 1873755 1904441
58277 1904441 1935012 1966533 1998329 2030451 2064743 2101784 2139822 2178143 2218366 2261027 2304281
58266 2304281 2347537 2393039 2442230 2493820 2546964 2602923 2662053 2722574 2783769 2846760 2910599
$$ packed form
58350A070636j822k443j549j271j405o16Q63J975K848M103N394O498Q311J1059
58336A102581J3235J4022J4847J6791J8513J8743J8546J8938J8619J6412J3721
58325A284968J1951R809N832J429j315k729l772l471j171J026J267J253L221N832
58311A314130O576O280P453R860J1475J2332J3817J5434J5820J5731J6646J7671
58299A463225J7023J5381J4586J4412J3665J2993J3524J4374J4495J5124J7407
58288A626209J9664K0265K0797K2960K4956K4794K4583K7125L0687L1715L0686
58277A904441L0571L1521L1796L2122L4292L7041L8038L8321M0223M2661M3254
58266B304281M3256M5502M9191N1590N3144N5959N9130O0521O1195O2991O3839
$$ plain form
58255 2910599 2971454 3027404 3080419 3132227 3182393 3232043 3284970 3343017 3404580 3469502 3540869
58244 3540869 3619978 3704350 3792956 3888600 3992809 4103379 4219416 4343607 4476878 4616187
58234 4616187 4760535 4913778 5078585 5253229 5437387 5635214 5849231 6077075 6317814
58225 6317814 6575519 6853116 7149079 7463839 7802858 8169607 8562529 8983044 9439288
58216 9439288 9937805 10479268 11066791 11710183 12417538 13191733 14040663 14981935 16032529
58207 16032529 17204406 18516604 20001568 21694287 23627976 25848487 28422503 31428368
58199 31428368 34958342 39144117 44171992 50273410 57728173 66897581 78248996 92355338
58191 92355338 109909598 131760727 158905315 192374261 232935717 280418685 332592833
$$ packed form
58255B910599O0855N5950N3015N1808N0166M9650N2927N8047O1563O4922P1367
58244C540869P9109Q4372Q8606R5644J04209J10570J16037J24191J33271J39309
58234D616187J44348J53243J64807J74644J84158J97827K14017K27844K40739
58225F317814K57705K77597K95963L14760L39019L66749L92922M20515M56244
58216I439288M98517N41463N87523O43392P07355P74195Q48930R41272J050594
58207A6032529J171877J312198J484964J692719J933689K220511K574016L005865
58199C1428368L529974M185775N027875O101418P454763R169408J1351415J4106342
58191I2355338J7554260K1851129K7144588L3468946M0561456M7482968N2174148
$$ plain form
58184 332592833 384222059 427507429 454516783 460465619 445645549 414768980 374553821
58177 374553821 331342022 289776695 252422473 219944451 191725426 166750264 144304866
58170 144304866 124148205 106291797 90756723 77479373 66302403 56987815 49259192
58163 49259192 42854926 37547152 33132546 29434799 26316843 23674277 21418083 19474100
58155 19474100 17791141 16332948 15062749 13944211 12951373 12065929 11268030 10538958 9868820
58146 9868820 9252797 8683289 8153201 7662527 7213739 6804017 6428450 6086581 5779025
58137 5779025 5501624 5249309 5021521 4817287 4628855 4446741 4267890 4093391 3922226
58128 3922226 3753435 3590796 3438814 3296605 3161113 3033348 2915960 2807536 2704751
$$ packed form
58184C32592833N1629226M3285370K7009354N948836j4820070l0876569m0215159
58177C74553821m3211799m1565327l7354222l2478022k8219025k4975162k2445398
58170A44304866k0156661j7856408j5535074j3277350j1176970r314588p728623
58163D9259192o404266n307774m414606l697747l117956k642566k256194j943983
58155A9474100j682959j458193j270199j118538r92838q85444p97899p29072o70138
58146I868820o16023n69508n30088m90674m48788m09722l75567l41869l07556
58137E779025k77401k52315k27788k04234j88432j82114j78851j74499j71165
58128C922226j68791j62639j51982j42209j35492j27765j17388j08424j02785
$$ plain form
58119 2704751 2607673 2517793 2433411 2352015 2274792 2203887 2137495 2072476 2009556 1951222 1896563
58108 1896563 1842812 1790018 1739773 1691311 1643210 1597018 1554821 1514977 1474425 1433447 1394132
58097 1394132 1356097 1318032 1281691 1249881 1221781 1194428 1167663 1143615 1122431 1102515 1084015
58086 1084015 1068270 1054603 1041216 1028389 1017376 1007001 994745 980395 965462 949912 932726
58075 932726 914705 897453 880374 861917 842979 825876 810633 795457 780267 766680 754937
58064 754937 743809 733131 723739 715375 707289 700279 695511 691861 687020 680626 673842 666582 657780 647775
58050 647775 637865 628116 618057 608731 601530 595780 589985 584544 580505 576599 570612 563070 556531 551698
58036 551698 547156 542513 538654 535146 530481 524898 519996 515433 508961 499978 490277 480956 471283 461043
$$ packed form
58119B704751r7078q9880q4382q1396p7223p0905o6392o5019o2920n8334n4659
58108A896563n3751n2794n0245m8462m8101m6192m2197l9844m0552m0978l9315
58097A394132l8035l8065l6341l1810k8100k7353k6765k4048k1184j9916j8500
58086A084015j5745j3667j3387j2827j1013j0375j2256j4350j4933j5550j7186
58075I32726j8021j7252j7079j8457j8938j7103j5243j5176j5190j3587j1743
58064G54937j1128j0678r392q364q086p010m768l650m841o394o784p260q802j0005
58050F47775r910r749j0059r326p201n750n795n441m039l906n987p542o539m833
58036E51698m542m643l859l508m665n583m902m563o472q983r701r321r673j0240
$$ plain form
58022 461043 451403 442860 434706 427038 421027 416647 412288 407147 402067 397634 393457 389667 387036 385181
58008 385181 382609 379063 375935 373926 372162 370087 368322 367089 365540 363284 360988 358950 356530 353495
57994 353495 350488 347810 345114 342626 341268 341344 342462 344868 349347 355576 361986 367408 371475 373533 372895
57979 372895 370398 367989 366374 364530 361721 358435 355123 351671 348518 346727 346504 346979 347733 349134 350957
57964 350957 352195 352544 352696 352936 352939 353082 354285 356248 357496 357576 357522 357679 356839 354288 351087 348488 346463
57947 346463 344652 343481 343392 344041 345064 346757 349389 352750 356895 362434 369616 378017 387441 398137 409885
57932 409885 422007 434526 448035 462020 474574 484317 491408 496177 498069 496630 492401 486071 477773
57919 477773 467927 457831 448549 439963 431545 423364 415808 409067 403379 399119 396159 393814 391832 390754
$$ packed form
58022D61043r640q543q154p668o011m380m359n141n080m433m177l790k631j855
58008C85181k572l546l128k009j764k075j765j233j549k256k296k038k420l035
57994C53495l007k678k696k488j358P6J118K406M479O229O410N422M067K058o38
57979C72895k497k409j615j844k809l286l312l452l153j791k23M75P54J401J823
57964C50957J238L49J52K40LJ43J203J963J248Q0n4J57q40k551l201k599k025
57947C46463j811j171q9O49J023J693K632L361M145N539P182Q401R424J0696J1748
57932D09885J2122J2519J3509J3985J2554R743P091M769J892j439m229o330q298
57919D77773r846j0096r282q586q418q181p556o741n688m260k960k345j982j078
$$ plain form
57905 390754 391002 392230 393732 394728 394134 391072 385971 380381 375364 370785 366268 361887 357817 354258 351858
57890 351858 351214 351794 352462 353173 354969 358068 361280 363701 365632 367317 368132 367791 367215 367312 367725 367487 366154
57873 366154 363736 360366 356652 353611 351785 351037 351403 353161 355875 358537 361103 364607 369228 373523 376335
57858 376335 378293 380560 383222 385856 388716 392238 396115 399850 403565 407389 410625 412409 412630 411525
57844 411525 408971 404979 400290 395671 391076 386218 381403 377046 372827 368116 362875 357601 352722 348578
57830 348578 345478 343228 341089 338787 337085 336854 338023 339964 342302 344738 346609 347390 347401 347457 347988 348863
57814 348863 349695 349986 349344 347933 346399 345086 343631 341412 337916 332710 325790 318061 310671 303716 296509
57799 296509 289343 283797 280785 279361 278229 277523 278306 280970 284993 289673 294419 298817 303044 307780 313208
$$ packed form
57905C90754K48J228J502R96n94l062n101n590n017m579m517m381m070l559k400
57890C51858o44N80O68P11J796L099L212K421J931J685Q15l41n76R7M13k38j333
57873C66154k418l370l714l041j826p48L66J758K714K662K566L504M621M295K812
57858C76335J958K267K662K634K860L522L877L735L715L824L236J784K21j105
57844D11525k554l992m689m619m595m858m815m357m219m711n241n274m879m144
57830C48578l100k250k139k302j702k31J169J941K338K436J871P81J1N6N31Q75
57814C48863Q32K91o42j411j534j313j455k219l496n206o920p729p390o955p207
57799B96509p166n546l012j424j132p06P83K664M023M680M746M398M227M736N428
$$ plain form
57784 313208 318703 323870 329135 334726 339918 344097 347887 352437 358058 364236 370485 376424 381470 385152
57770 385152 387438 388366 387807 385941 383335 380050 375371 368888 361205 353096 344736 336287 328347 321127 314083
57755 314083 307138 301398 297773 295669 293978 292650 292288 292812 293631 294611 295912 297317 298665 300568 303747
57740 303747 308046 312878 318117 323644 328619 332221 334729 336890 338668 339582 339822 339897 339579 338323 336531
57725 336531 335297 334959 334871 334373 333113 330671 326952 322816 319318 316405 313248 309690 306367 303521 300780
57710 300780 298077 295739 293611 291054 287942 284751 281558 277876 273667 269641 266331 263517 260803 258111
57696 258111 255534 253272 251762 251238 251155 250708 249904 249488 249831 250569 251296 251910 252250 252138 251821 251734 251887 252207
57678 252207 253438 256885 263187 272037 283135 296621 312647 331513 354491 383674 420825 467147
$$ packed form
57784C13208N495N167N265N591N192M179L790M550N621O178O249N939N046L682
57770C85152K286R28n59j866k606l285m679o483p683q109q360q449p940p220p044
57755C14083o945n740l625k104j691j328l62N24Q19R80J301J405J348J903L179
57740C03747M299M832N239N527M975L602K508K161J778R14K40P5l18j256j792
57725C36531j234l38q8m98j260k442l719m136l498k913l157l558l323k846k741
57710C00780k703k338k128k557l112l191l193l682m209m026l310k814k714k692
57696B58111k577k262j510n24q3m47q04m16L43P38P27O14L40j12l17q7J53L20
57678B52207J231L447O302Q850J1098J3486J6026J8866K2978K9183L7151M6322
$$ plain form
57666 467147 524203 593634 674638 761595 844194 909763 946590 947666 913637 852605 776294 695465
57654 695465 617663 547218 485921 433799 390192 354557 326341 304477 287521 274276 264052
57643 264052 256382 250755 246712 244027 242697 242650 243422 244191 244250 243474 242333 241501 241425 242068 242975 243799 244735 246188
57625 246188 247976 249295 249604 249104 248176 246846 245077 243095 241061 238851 236492 234301 232331 230324 228526
57610 228526 227784 228239 228773 228507 228027 228144 228251 227180 225226 223876 223671 223661 223028 222081 221421 221139 221061 220942
57592 220942 220215 218355 215684 213117 211027 209070 207084 205327 203707 201667 199051 196400 194327 193208
57578 193208 193427 195033 197100 198292 198154 197087 195197 192229 188688 185774 183847 181993 179533 176956 174968
57563 174968 173584 172704 172628 173372 174301 175041 176016 177498 178901 179627 179900 180111 180094 179849 180336 182615 186509 190871
$$ packed form
57666D67147N7056O9431Q1004Q6957Q2599O5569L6827J076l4029o1032p6311q0829
57654F95465p7802p0445o1297n2122m3607l5635k8216k1864j6956j3245j0224
57643B64052p670n627m043k685j330m7P72P69N9p76j141q32p6O43R07Q24R36J453
57625B46188J788J319L09n00r28j330j769j982k034k210k359k191j970k007j798
57610B28526p42M55N34k66m80J17J07j071j954j350k05j0o33r47o60k82p8j19
57592B20942p27j860k671k567k090j957j986j757j620k040k616k651k073j119
57578A93208K19J606K067J192j38j067j890k968l541k914j927j854k460k577j988
57563A74968j384q80p6P44R29P40R75J482J403P26K73K11j7k45M87K279L894M362
$$ plain form
57545 190871 194839 198195 200807 202502 203395 203784 203760 203303 202673 202366 202808 204235 206570 209181 211171 212221
57529 212221 212838 213518 214060 214012 213400 212640 212028 211616 211249 210458 208695 206019 203190 200821 198806 196896 195376
57512 195376 194676 194629 194541 193856 192492 190766 189262 188537 188658 189233 189986 190999 192281 193469 194168 194247 193714 192703
57494 192703 191620 190778 189816 188154 186180 185169 185664 186766 187526 188269 189788 191888 193673 194876 196023
57479 196023 197432 198893 200316 201983 203993 205925 207211 207575 207123 206224 205245 204181 202687 200612 198250
57464 198250 195856 193240 190201 187124 184779 183582 183313 183412 183333 182786 181858 180828 179788 178695 177802 177592
57448 177592 178113 178781 179088 179158 179368 179788 180217 180422 180135 179246 178228 177954 178769 180106 181260 182098 182786 183353
57430 183353 183853 184437 184981 185169 185289 186237 188209 190055 190575 189972 189314 189092 189023 188936 188974 189189 189667 190797 192645
$$ packed form
57545A90871L968L356K612J695Q93L89k4m57o30l07M42J427K335K611J990J050
57529B12221O17O80N42m8o12p60o12m12l67p91j763k676k829k369k015j910j520
57512A95376p00m7q8o85j364j726j504p25J21N75P53J013J282J188O99P9n33j011
57494A92703j083q42r62j662j974j011M95J102P60P43J519K100J785J203J147
57479A96023J409J461J423J667K010J932J286L64m52q99r79j064j494k075k362
57464A98250k394k616l039l077k345j197k69R9p9n47r28j030j040j093q93k10
57448A77592N21O68L07P0K10M20M29K05k87q89j018k74Q15J337J154Q38O88N67
57430A83353N00N84N44J88J20R48J972J846N20o03o58k22o9q7L8K15M78J130J848
$$ plain form
57411 192645 194247 194438 193416 192706 193400 195091 196705 197791 198636 199587 200640 201575 202182 202300 201780 200642
57395 200642 199407 198993 199773 200807 200677 199243 197915 197887 198866 200001 201280 203235 205860 208784 212127 216194
57379 216194 220482 223913 226093 227547 228709 229417 229595 229673 229990 230215 229642 227888 225230 222422 220104 218201
57363 218201 216111 213794 212286 212582 214241 215763 216298 216407 217133 218928 221563 224539 227358 229759 231877
57348 231877 234024 236289 238587 240940 243385 245696 247586 249157 250765 252436 253741 254290 254151 253793 253754
57333 253754 254238 254911 255305 255469 255851 256399 256363 255337 253894 252688 251577 250309 249471 249760 250734 251339 251491
57316 251491 252051 253224 254062 253825 252902 252072 251653 251738 252505 253745 254661 254679 254181 253964 254283 254766 255099 255396 255907
57297 255907 256566 256926 256649 256015 255722 256076 256774 257711 259478 262452 265810 268266 269673 271078 273177 275495
$$ packed form
57411A92645J602J91j022p10O94J691J614J086Q45R51J053R35O07J18n20j138
57395B00642j235m14P80J034j30j434j328k8R79J135J279J955K625K924L343M067
57379B16194M288L431K180J454J162P08J78P8L17K25n73j754k658k808k318j903
57363B18201k090k317j508K96J659J522N35J09P26J795K635K976K819K401K118
57348B31877K147K265K298K353K445K311J890J571J608J671J305N49j39l58l9
57333B53754M84O73L94J64L82N48l6j026j443j206j111j268q38K89R74O05J52
57316B51491N60J173Q38k37r23q30m19Q5P67J240R16J8m98k17L19M83L33K97N11
57297B55907O59L60k77o34k93L54O98R37J767K974L358K456J407J405K099K318
$$ plain form
57281 275495 277243 278219 278567 278237 277123 275364 273228 270882 268384 265695 262728 259671 257148 255668 255003
57266 255003 254563 254279 254606 255806 257785 260547 264041 267626 270500 272867 275893 280192 285004 289235 292736
57251 292736 296098 299721 303510 307166 310409 313179 315900 319237 323344 327586 331179 333909 336125 338383
57237 338383 341145 344476 347869 350723 353011 355149 357229 358905 360149 361524 363516 366088 369107 372749
57223 372749 377151 382070 387140 392143 396871 401152 405254 409840 415191 420789 425916 430476 435017 440238
57209 440238 446539 453717 460952 467421 473078 478540 484198 489864 495423 501292 508026 515801 524484 533823
57195 533823 543400 552828 562267 572376 583518 595261 606857 617967 628796 639776 651152 662537
57183 662537 672880 681294 688078 694567 701960 710642 720526 731477 743257 755630 768705 782797 797926
$$ packed form
57281B75495J748R76L48l30j114j759k136k346k498k689k967l057k523j480o65
57266B55003m40k84L27J200J979K762L494L585K874K367L026M299M812M231L501
57251B92736L362L623L789L656L243K770K721L337M107M242L593K730K216K258
57237C38383K762L331L393K854K288K138K080J676J244J375J992K572L019L642
57223C72749M402M919N070N003M728M281M102M586N351N598N127M560M541N221
57209D40238O301P178P235O469N657N462N658N666N559N869O734P775Q683R339
57195E33823R577R428R439J0109J1142J1743J1596J1110J0829J0980J1376J1385
57183F62537J0343Q414O784O489P393Q682R884J0951J1780J2373J3075J4092J5129
$$ plain form
57170 797926 813904 830907 849394 869421 890639 912970 936583 961156 985942 1010678 1035634
57159 1035634 1060551 1084474 1106988 1128830 1150742 1172450 1193226 1212807 1231261 1248651 1265422
57148 1265422 1282521 1300484 1318796 1336630 1353791 1370545 1387138 1403963 1421668 1440513 1460072
57137 1460072 1480077 1501080 1523778 1548155 1573773 1600478 1628277 1656966 1686452 1717107 1749360
57126 1749360 1783227 1818656 1855956 1895485 1937245 1981066 2026877 2074625 2124478 2177279 2234235
57115 2234235 2295998 2362776 2435527 2516129 2606110 2706179 2817325 2941263 3079239 3231631
57105 3231631 3399643 3586647 3797476 4037785 4315154 4639810 5023549 5479197 6022409
57096 6022409 6673284 7455912 8398011 9531706 10891903 12510677 14412556 16613898 19121663
$$ packed form
57170G97926J5978J7003J8487K0027K1218K2331K3613K4573K4786K4736K4956
57159A035634K4917K3923K2514K1842K1912K1708K0776J9581J8454J7390J6771
57148A265422J7099J7963J8312J7834J7161J6754J6593J6825J7705J8845J9559
57137A460072K0005K1003K2698K4377K5618K6705K7799K8689K9486L0655L2253
57126A749360L3867L5429L7300L9529M1760M3821M5811M7748M9853N2801N6956
57115B234235O1763O6778P2751Q0602Q9981J00069J11146J23938J37976J52392
57105C231631J68012J87004K10829K40309K77369L24656L83739M55648N43212
57096F022409O50875P82628R42099J133695J360197J618774J901879K201342K507765
$$ plain form
57087 19121663 21927725 25004179 28304893 31767895 35312425 38837348 42228926 45368436
57079 45368436 48125243 50346839 51876611 52603180 52501285 51625714 50069106 47927037
57071 47927037 45292537 42264544 38949593 35456415 31892223 28360653 24956336 21757319
57063 21757319 18820408 16180140 13849104 11820154 10072086 8576827 7304491 6225890
57055 6225890 5314271 4546398 3902055 3362808 2911783 2534305 2217972 1952118 1727601
57046 1727601 1536833 1373413 1231755 1107478 997862 901206 815702 739323 670585 608692
57036 608692 552959 502718 457872 418712 384789 354638 327148 302838 283371 270294 264830 268403
57024 268403 282668 309477 351645 412932 494526 589496 680947 747511 772808 751967 691647
$$ packed form
57087A9121663K806062L076454L300714L463002L544530L524923L391578L139510
57079D5368436K756807K221596J529772P26569j01895q75571j556608k142069
57071D7927037k634500l027993l314951l493178l564192l531570l404317l199017
57063B1757319k936911k640268k331036k028950j748068j495259j272336j078601
57055F225890r11619p67873o44343n39247m51025l77478l16333k65854k24517
57046A727601j90768j63420j41658j24277j09616r6656q5504p6379o8738o1893
57036F08692n5733n0241m4846l9160l3923l0151k7490k4310j9467j3077n464L573
57024B68403J4265K6809M2168O1287Q1594R4970R1451O6564K5297k0841o0320
$$ plain form
57013 691647 605266 507271 409182 318385 238879 172300 118345 75239 40825 13515 -7756 -23949
57001 -23949 -35768 -43522 -47664 -49308 -49668 -49183 -47736 -45499 -42883 -39742 -35408 -29637 -22837 -15194 -6158
56985 4958 18364 34004 51914 71809 92387 111164 124967 130968 127998 117266 101565 83643
56973 83643 65364 48011 32525 19278 8271 -137 -5220 -6866 -5896 -2997 2194 10423 21692 35546
56959 35546 52259 73061 98945 129406 162086 193155 218063 232698 234727 224446 204608 179252
56947 179252 152145 125791 101534 80284 62775 49251 39340 32530 28616 27717 30194 36693 47863
56934 47863 63808 84173 109038 139337 175692 216568 257567 292396 314735 320258 308292 282275
56922 282275 248218 211950 177139 145265 116775 91899 70698 53011 38716 27766 19679 13258
$$ packed form
57013F91647q6381r7995r8089r0797p9506o6579n3955m3106l4414A3515g756j6193
57001b3949j1819p754m142j644l60M85J447K237K616L141M334N771O800P643f158
56985D958J3406J5640J7910J9895K0578J8777J3803O001k970j0732j5701j7922
56973H3643j8279j7353j5486j3247H271a37n083j646R70K899B194Q229J1269J3854
56959C5546J6713K0802K5884L0461L2680L1069K4908J4635K029j0281j9838k5356
56947A79252k7107k6354k4257k1250j7509j3524r911o810l914q99K477O499J1170
56934D7863J5945K0365K4865L0299L6355M0876M0999L4829K2339N523j1966k6017
56922B82275l4057l6268l4811l1874k8490k4876k1201j7687j4295j0950q087o421
$$ plain form
56910 13258 7298 1651 -2897 -5939 -8111 -10230 -12273 -13715 -14520 -15140 -15645 -15468 -14059 -11368 -7696
56895 -7696 -3530 582 4530 9090 15404 23940 34477 47190 63111 83191 107262 133922 160792
56882 160792 184607 201865 210247 209556 201215 187298 170245 152828 137414 125082 115725 108977 104833
56869 104833 103604 105696 111501 121299 135304 153990 178352 209748 249515 298675 357361 423653
56857 423653 492387 555100 601846 624469 619866 591218 546221 493566 440224 390741 347690 312204
56845 312204 284513 264634 252661 248542 252052 263351 283264 312726 352328 402837 465983 544020
56833 544020 637879 745028 857974 964078 1047546 1094014 1096036 1056087 984881 896135 801495
56822 801495 708635 622390 546290 482622 431714 392251 362717 342478 331638 330419 338901 357045
$$ packed form
56910A3258n960A651b897l042k172k119k043j442q05o20n05J77J409K691L672
56895g696c530E82L948M560O314Q536J0537J2713J5921K0080K4071K6660K6870
56882A60792K3815J7258Q382o91q341j3917j7053j7417j5414j2332r357o748m144
56869A04833j229K092N805R798J4005J8686K4362L1396L9767M9160N8686O6292
56857D23653O8734O2713M6746K2623m603k8648m4997n2655n3342m9483m3051l5486
56845C12204k7691j9879j1973m119L510J1299J9913K9462L9602N0509O3146P8037
56833E44020R3859J07149J12946J06104Q3468M6468K022l9949p1206q8746r4640
56822H01495r2860q6245p6100o3668n0908l9463k9534k0239j0840j219Q482J8144
$$ plain form
56810 357045 384882 423010 472956 536238 612010 694904 774908 839573 877605 882440 854244 799218
56798 799218 726807 646707 567043 493533 429212 374877 330165 294477 267190 247609 235076
56787 235076 229048 229056 234862 246734 265225 290553 322378 359908 401333 442645 477553 499426 503923
56774 503923 490329 461278 421528 376352 330068 285617 245110 210121 181116 157152 136768
56763 136768 119086 103897 91105 80569 72204 65717 60396 55594 51266 47664 44737 42229 40173
56750 40173 38739 37673 36396 34704 32966 31594 30684 30222 30217 30516 30783 30817 30738 30734 30828 30909 30878 30728 30618 30860
56730 30860 31615 32613 33330 33525 33478 33628 34078 34593 35046 35708 36999 38971 41189 43134 44600 45649 46500
56713 46500 47614 49604 52635 56087 59137 61570 63645 65366 66479 67127 67846 68769 69428 69522 69372 69354 69448
$$ packed form
56810C57045K7837L8128M9946O3282P5772Q2894Q0004O4665L8032M835k8196n5026
56798G99218p2411q0100p9664p3510o4321n4335m4712l5688k7287j9581j2533
56787B35076o028QN806J1872J8491K5328L1825L7530M1425M1312L4908K1873M497
56774E03923j3594k9051l9750m5176m6284m4451m0507l4989k9005k3964k0384
56763A36768j7682j5189j2792j0536q365o487n321m802m328l602k927k508k056
56750D0173j434j066j277j692j738j372r10m62nK99K67L4p9mR4Q1l1j50j10K42
56730C0860P55R98P17J95m7J50M50N15M53O62J291J972K218J945J466J049Q51
56713D6500J114J990L031L452L050K433K075J721J113O48P19R23O59R4j50j8R4
$$ plain form
56696 69448 69599 70008 70693 71257 71482 71699 72104 72156 71250 69687 68439 68070 68354 68815 69169 69263 68992 68360 67487
56677 67487 66620 66214 66709 67939 68968 68866 67660 66319 65833 66345 67058 67009 66138 65558 66451 68707 71112
56660 71112 72805 73962 74946 75563 75580 75352 75422 75926 76801 78175 80059 82065 83862 85616 87607 89845 92397
56643 92397 95539 99124 102363 104812 107041 109706 112532 114942 117155 119637 121834 122582 121678 120051 118300
56628 118300 116075 113155 110256 108267 107211 106399 105252 103654 101778 99878 98106 96492 95108 94091
56614 94091 93238 91857 89492 86755 84857 84267 84263 83910 83096 82380 82171 82290 82222 81638 80681 79799 79331 79371 79961
56595 79961 81085 82331 82944 82557 81634 80925 80650 80521 80400 80580 81457 83102 85113 86890 88198 89419 90940
56578 90940 92405 93107 93070 93010 93157 93027 92676 93224 95472 98830 102358 106141 110709 115700 120151 123854 127515
$$ packed form
56696F9448J51M09O85N64K25K17M05N2r06j563j248l69K84M61L54R4k71o32q73
56677F7487q67m06M95J230J029j02j206j341m86N12P13m9q71n80Q93K256K405
56660G1112J693J157R84O17J7k28P0N04Q75J374J884K006J797J754J991K238K552
56643I2397L142L585L239K449K229K665K826K410K213K482K197P48r04j627j751
56628A18300k225k920k899j989j056q12j147j598j876j900j772j614j384j017
56614I4091q53j381k365k737j898n90ml53q14p16k09J19o8n84r57q82m68M0N90
56595G9961J124J246O13l87r23p09k75j29j21J80Q77J645K011J777J308J221J521
56578I0940J465P02l7o0J47j30l51N48K248L358L528L783M568M991M451L703L661
$$ plain form
56561 127515 131781 136986 143688 152606 163999 177619 192932 208686 222536 232115 236668 237199 235199
56548 235199 231787 227809 223952 220596 217859 215604 213138 209509 204683 199915 196264 193299 190037 186568
56534 186568 183740 181688 179798 177776 175716 173370 170426 167246 164257 160941 156608 151870 147996 145026
56520 145026 141962 138778 136592 135594 134372 131901 128886 126468 124689 122891 120698 118028 114976 112226
56506 112226 110785 110781 111207 111247 111106 111206 111445 111665 111994 112296 112045 111187 110436 110312 110641 111307 112648 114702 116835
56487 116835 118562 119993 121183 121918 122571 124133 126826 129514 131098 131711 131950 131850 131370 131113 131647 132663
56471 132663 133538 134275 135242 136433 137648 138960 140394 141522 141900 141562 140730 139536 138363 137846 138001 137995 137328
56454 137328 136684 136958 137960 138762 138911 138691 138516 138650 139282 140346 141416 142097 142354 142307 142096 142077 142605 143454
$$ packed form
56561A27515M266N205O702Q918J1393J3620J5313J5754J3850R579M553N31k000
56548B35199l412l978l857l356k737k255k466l629m826m768l651k965l262l469
56534A86568k828k052j890k022k060k346k944l180k989l316m333m738l874k970
56520A45026l064l184k186r98j222k471l015k418j779j798k193k670l052k750
56506A12226j441mM26M0j41J00K39K20L29L02k51q58p51j24L29O66J341K054K133
56487A16835J727J431J190P35O53J562K693K688J584O13K39j00m80k57N34J016
56471A32663Q75P37R67J191J215J312J434J128L78l38q32j194j173n17J55oo67
56454A37328o44K74J002Q02J49k20j75J34O32J064J070O81K57m7k11j9N28Q49
$$ plain form
56436 143454 144047 144491 145598 147532 149197 149506 148684 147756 147332 147400 147798 148306 148655 148893 149334 149889 149935 149165
56418 149165 147997 146846 145687 144659 144291 144665 145044 144875 144539 144630 145125 145790 146708 147861 148777 149087 148905
56401 148905 148299 147151 145907 145552 146286 147163 147680 148740 151229 154579 157718 160601 163687 166602 168568
56386 168568 169772 171168 173095 175038 176606 177951 179340 180935 182808 184741 186295 187478 188764 190122
56372 190122 190765 190498 190411 191400 192764 193275 192927 192613 192644 192778 193216 194337 195673 196364 196527 197150 198654 200486
56354 200486 202106 203492 204595 205151 205214 205293 205804 206723 207698 208248 208174 207969 208399 209346 209733 209079 208400 208999 211042
56335 211042 214012 217674 221723 225323 228130 231124 235230 239653 242842 244727 246767 250005 254206 258652
56321 258652 262547 264833 264927 263774 263058 263200 263070 261716 259462 257141 255157 253565 252378 251597 251416 252366
$$ packed form
56436A43454N93M44J107J934J665L09q22r28m24O8L98N08L49K38M41N55M6p70
56418A49165j168j151j159j028l68L74L79j69l36R1M95O65R18J153R16L10j82
56401A48905o06j148j244l55P34Q77N17J060K489L350L139K883L086K915J966
56386A68568J204J396J927J943J568J345J389J595J873J933J554J183J286J358
56372A90122O43k67q7R89J364N11l48l14L1J34M38J121J336O91J63O23J504J832
56354B00486J620J386J103N56O3P9N11R19R75N50p4k05M30R47L87o54o79N99K043
56335B11042K970L662M049L600K807K994M106M423L189J885K040L238M201M446
56321B58652L895K286R4j153p16J42j30j354k254k321j984j592j187p81j81R50
$$ plain form
56305 252366 254745 257971 261046 263507 265473 267055 268426 270145 272697 275916 279465 283520 288231 292899
56291 292899 296558 299152 301362 303570 305856 308711 312754 317843 323259 328673 334212 339792 345220 350769
56277 350769 356896 363482 370039 376479 383115 390247 398286 407779 418547 429364 439296 448885 459173
56264 459173 470315 482202 495699 511883 530491 550578 572446 597586 626860 660034 697006
56253 697006 738183 783752 833920 889970 953791 1026122 1106303 1193815 1288963 1391818 1501499
56242 1501499 1616636 1735674 1856553 1976869 2094349 2206377 2309225 2398720 2471744 2526457
56232 2526457 2561464 2575864 2570018 2545255 2502962 2444847 2373733 2292883 2204548 2110147 2011559
56221 2011559 1911113 1810504 1710951 1614239 1522323 1435885 1354440 1277837 1206549 1140574 1079256
$$ packed form
56305B52366K379L226L075K461J966J582J371J719K552L219L549M055M711M668
56291B92899L659K594K210K208K286K855M043N089N416N414N539N580N428N549
56277C50769O127O586O557O440O636P132Q039R493J0768J0817R932R589J0288
56264D59173J1142J1887J3497J6184J8608K0087K1868K5140K9274L3174L6972
56253F97006M1177M5569N0168N6050O3821P2331Q0181Q7512R5148J02855J09681
56242A501499J15137J19038J20879J20316J17480J12028J02848Q9495P3024N4713
56232B526457L5007J4400n846k4763m2293n8115p1114q0850q8335r4401r8588
56221B011559j00446j00609r9553r6712r1916q6438q1445p6603p1288o5975o1318
$$ plain form
56210 1079256 1022201 969348 920283 874553 832480 794519 760113 728426 699835 675180 653749
56199 653749 633656 614229 596455 580915 566927 554058 542963 534135 526950 520403 513998 507724
56187 507724 502077 498043 496096 495312 494408 493309 492513 491461 489107 485867 483378 482336 482050 481993 482274 482695
56171 482695 483037 484190 487262 491591 495356 498160 501234 505139 509266 513738 519640 526946 534234 541003
56157 541003 548387 557037 566216 575663 586515 599537 614114 629818 647375 667327 689263 713224
56145 713224 740591 772926 811238 856941 912216 978846 1057863 1150570 1258310 1380582 1514318
56134 1514318 1654807 1795705 1928427 2044285 2138749 2212966 2271359 2319432 2363237 2407549
56124 2407549 2452702 2494434 2527433 2547869 2553159 2542634 2519682 2490778 2460579 2428880 2392385
$$ packed form
56210A079256n7055n2853m9065m5730m2073l7961l4406l1687k8591k4655k1431
56199F53749k0093j9427j7774j5540j3988j2869j1095q828p185o547o405o274
56187E07724n647m034j947p84r04j099p96j052k354l240k489j042k86n7K81M21
56171D82695L42J153L072M329L765K804L074L905M127M472N902P306P288O769
56157E41003P384Q650R179R447J0852J3022J4577J5704J7557J9952K1936K3961
56145G13224K7367L2335L8312M5703N5275O6630P9017R2707J07740J22272J33736
56134A514318J40489J40898J32722J15858R4464P4217N8393M8073M3805M4312
56124B407549M5153M1732L2999K0436N290j0525k2952k8904l0199l1699l6495
$$ plain form
56113 2392385 2347052 2288008 2210228 2111753 1995589 1867785 1735070 1604468 1482499 1373065
56103 1373065 1277247 1195609 1128761 1075235 1031390 994668 964993 942115 923889 908342 895327
56092 895327 885029 876931 871241 868979 869455 870022 869604 870053 872627 875714 877743 879913 883951 889270 894366
56077 894366 899260 904639 910299 916171 923260 931965 941041 949683 958960 969876 981882 994589 1008911
56064 1008911 1025027 1041178 1056025 1070352 1085138 1099956 1114491 1129389 1144300 1157431 1168440
56053 1168440 1179349 1191250 1202667 1212705 1223044 1235189 1248477 1262531 1278792 1297691 1317238
56042 1317238 1336440 1357240 1380955 1405779 1429989 1454550 1480220 1505305 1528977 1553795 1582108
56031 1582108 1612750 1643939 1676420 1710957 1745845 1779958 1815292 1853459 1892663 1931183 1970723
$$ packed form
56113B392385m5333n9044p7780r8475j16164j27804j32715j30602j21969j09434
56103A373065r5818q1638o6848n3526m3845l6722k9675k2878j8226j5547j3015
56092H95327j0298q098n690k262M76N67m18M49K574L087K029K170M038N319N096
56077H94366M894N379N660N872P089Q705R076Q642R277J0916J2006J2707J4322
56064A008911J6116J6151J4847J4327J4786J4818J4535J4898J4911J3131J1009
56053A168440J0909J1901J1417J0038J0339J2145J3288J4054J6261J8899J9547
56042A317238J9202K0800K3715K4824K4210K4561K5670K5085K3672K4818K8313
56031A582108L0642L1189L2481L4537L4888L4113L5334L8167L9204L8520L9540
$$ plain form
56020 1970723 2013012 2056252 2098456 2141318 2187240 2235431 2284460 2335687 2390585 2447679 2505798
56009 2505798 2567270 2634242 2705034 2777833 2854624 2937467 3024312 3112746 3204533 3302190 3404527
55998 3404527 3509975 3620830 3739654 3865005 3995306 4133293 4281945 4439852 4605442
55989 4605442 4781801 4972305 5175704 5390626 5620413 5868091 6131531 6409505 6707493
55980 6707493 7031255 7379998 7752674 8155554 8596364 9076534 9596920 10165520 10791669
55971 10791669 11478794 12231541 13063958 13992192 15026596 16181168 17483980 18968756 20665084
55962 20665084 22609194 24857504 27480833 30560191 34208362 38592350 43927401 50468684
55954 50468684 58534373 68535392 80979007 96474103 115766455 139755842 169422419
$$ packed form
56020A970723M2289M3240M2204M2862M5922M8191M9029N1227N4898N7094N8119
56009B505798O1472O6972P0792P2799P6791Q2843Q6845Q8434R1787R7657J02337
55998C404527J05448J10855J18824J25351J30301J37987J48652J57907J65590
55989D605442J76359J90504K03399K14922K29787K47678K63440K77974K97988
55980F707493L23762L48743L72676M02880M40810M80170N20386N68600O26149
55971A0791669O87125P52747Q32417R28234J034404J154572J302812J484776J696328
55962B0665084J944110K248310K623329L079358L648171M383988N335051O541283
55954E0468684Q065689J0001019J2443615J5495096J9292352K3989387K9666577
$$ plain form
55947 169422419 205600062 248451159 296510892 345657771 389045717 418862074 429364934
55940 429364934 419276344 391908196 353212246 309371329 265300960 224238732 187906739
55933 187906739 156863715 130930486 109578726 92163143 78017056 66516361 57135486
55926 57135486 49453195 43122469 37859744 33451971 29741777 26598040 23909496 21595026
55918 21595026 19596799 17861775 16341194 15001941 13822445 12778975 11847112 11012245
55910 11012245 10265891 9594331 8981734 8421245 7912023 7447921 7019079 6622014 6258170
55901 6258170 5924513 5614574 5326764 5062801 4819676 4591366 4376837 4178532 3994624
55892 3994624 3820418 3655867 3504246 3364623 3232714 3107918 2992615 2885594 2782932
$$ packed form
55947A69422419L6177643M2851097M8059733M9146879M3387946K9816357J0502860
55940D29364934j0088590k7368148l8695950m3840917m4070369m1062228l6331993
55933A87906739l1043024k5933229k1351760j7415583j4146087j1500695r380875
55926E7135486p682291o330726n262725m407773l710194l143737k688544k314470
55918B1595026j998227j735024j520581j339253j179496j043470r31863q34867
55910A1012245p46354o71560o12597n60489n09222m64102m28842l97065l63844
55901F258170l33657l09939k87810k63963k43125k28310k14529j98305j83908
55892C994624j74206j64551j51621j39623j31909j24796j15303j07021j02662
$$ plain form
55883 2782932 2684716 2594523 2512917 2437463 2368445 2308526 2256866 2208825 2161059 2112100 2058958
55872 2058958 1998669 1932837 1865755 1798488 1729436 1659781 1593270 1531020 1471445 1414954 1363959
55861 1363959 1318402 1275872 1236049 1200656 1169092 1138543 1108564 1081410 1057637 1035236 1013355
55850 1013355 993153 974725 956595 938338 920432 901753 880593 857994 836694 817055 797485
55839 797485 778555 762851 750566 738899 726196 713399 701109 688545 675891 664548 654446
55828 654446 643966 632995 623374 615946 609770 604451 600473 596862 591207 582641 572613 562460 552453
55815 552453 543230 535645 528921 521296 512805 505308 499695 495302 492026 490618 490753 491151 491767 493778 497416
55800 497416 502000 508018 516692 527362 537532 545595 551320 553834 551725 545401 536915 527161 515495
$$ packed form
55883B782932r8216r0193q1606p5454o9018n9919n1660m8041m7766m8959n3142
55872B058958o0289o5832o7082o7267o9052o9655o6511o2250n9575n6491n0995
55861A363959m5557m2530l9823l5393l1564l0549k9979k7154k3773k2401k1881
55850A013355k0202j8428j8130j8257j7906j8679k1160k2599k1300j9639j9570
55839G97485j8930j5704j2285j1667j2703j2797j2290j2564j2654j1343j0102
55828F54446j0480j0971r621p428o176n319l978l611n655q566j0028j0153j0007
55815E52453r223p585o724p625q491p497n613m393l276j408J35L98O16K011L638
55800D97416M584O018Q674J0670J0170Q063N725K514k109o324q486r754j1666
$$ plain form
55787 515495 502287 489435 478019 467746 459007 453050 449570 446306 441579 435272 427140 416469 403982
55774 403982 391887 381436 372306 364725 360124 359188 361310 366268 374156 383087 389330 390706 388015 382490
55760 382490 373968 362454 349429 336334 323294 310240 297813 286293 275097 264173 254608 247185
55748 247185 241595 237541 235236 234338 233774 233071 232504 231683 229678 226898 225157 225263 226129 226768 227467 228406 228853
55731 228853 228520 228133 227894 226882 224779 222589 220824 218421 214444 209596 205170 201678 199188 197711 196453
55716 196453 194028 190327 187092 185847 186338 187663 189652 192323 195168 197921 201159 205393 210391 215815
55702 215815 221380 225924 227682 226257 223146 219608 215238 209401 202768 196441 190689 185636 182093 180531
55688 180531 179954 178969 177472 176456 176646 178022 180174 182477 184496 186717 190276 195484 201261 206415 210690
$$ packed form
55787E15495j3208j2852j1416j0273q739n957l480l264m727o307q132j0671j2487
55774D03982j2095j0451r130p581m601r36K122M958P888Q931O243J376k691n525
55760C82490q522j1514j3025j3095j3040j3054j2427j1520j1196j0924r565p423
55748B47185n590m054k305q98n64p03n67q21k005k780j741J06Q66O39O99R39M47
55731B28853l33l87k39j012k103k190j765k403l977m848m426l492k490j477j258
55716A96453k425l701l235j245M91J325J989K671K845K753L238M234M998N424
55702B15815N565M544J758j425l111l538m370n837o633o327n752n053l543j562
55688A80531n77r85j497j016J90J376K152K303K019K221L559N208N777N154M275
$$ plain form
55673 210690 214086 216087 216241 214901 212758 210195 207526 205262 203674 202609 202043 202183 202843 203436 203834 204525
55657 204525 205815 207723 210613 214790 219272 222263 223299 223797 224943 226196 226418 225333 223142 219655 214678
55642 214678 208550 201725 194494 187492 181592 176822 172253 167379 162694 158566 154654 150888 147871 145706
55628 145706 143533 140932 138688 137409 136483 135235 134117 133788 133882 133661 133077 132326 131121 129298 127506 126374
55612 126374 125584 124492 123043 121343 119065 116166 113616 112528 112854 113606 113993 113914 113853 114696 116956 119720
55596 119720 121090 120226 118258 116785 116236 116175 116183 115784 114443 112426 110858 110248 109781 108704 107429 106497 105559
55579 105559 104337 103550 103698 103857 102986 101699 101386 102120 102837 103204 103921 105325 106933 108424 110065 112005
55563 112005 113873 115177 115620 115187 114363 113940 114145 114343 114053 113673 113657 113651 113186 112555 112155 111603 110434 109193
$$ packed form
55673B10690L396K001J54j340k143k563k669k264j588j065n66J40O60N93L98O91
55657B04525J290J908K890M177M482K991J036M98J146J253K22j085k191l487m977
55642B14678o128o825p231p002n900m770m569m874m685m128l912l766l017k165
55628A45706k173k601k244j279r26j248j118l29R4k21n84p51j205j823j792j132
55612A26374p90j092j449j700k278k899k550j088L26P52L87p9o1Q43K260K764
55596A19720J370q64j968j473n49o1Ql99j341k017j568o10m67j077j275r32r38
55579A05559j222p87J48J59q71j287l13P34P17L67P17J404J608J491J641J940
55563A12005J868J304M43m33q24m23K05J98k90l80j6om65o31m00n52j169j241
$$ plain form
55545 109193 108778 109158 109680 110234 111095 111939 112165 111990 112259 113232 114478 115854 117682 119964 122227 124129 125536
55528 125536 126167 125875 125128 124460 123628 122062 119909 117800 115724 113092 109841 106608 103720 100909 98145
55513 98145 95965 94665 93795 92735 91375 89966 88620 87104 85019 82302 79690 78284 78366 79040 79459 79877
55497 79877 80932 82443 83769 84949 86502 88231 89151 88742 87534 86399 85823 85892 86363 86744 86812 86982 87685
55480 87685 88624 89224 89612 90343 91265 91540 90860 89834 89040 88429 87857 87480 87318 87032 86477 85956 85640 85182 84249
55461 84249 83035 81917 80947 80023 79254 78791 78469 78015 77591 77760 78755 79989 80563 80294 79927 80147 80687 80778
55443 80778 80264 79678 79295 78804 78090 77570 77428 77187 76605 76345 77071 78321 79035 79003 79061 79943 81510 83080 84064
55424 84064 84334 84332 84762 85815 86853 87223 87155 87430 88342 89446 90260 90790 91374 92283 93445 94399 94661 94289 93811
$$ packed form
55545A09193m15L80N22N54Q61Q44K26j75K69R73J246J376J828K282K263J902J407
55528A25536O31k92p47o68q32j566k153k109k076k632l251l233k888k811k764
55513I8145k180j300q70j060j360j409j346j516k085k717k612j406Q2O74M19M18
55497G9877J055J511J326J180J553J729R20m09j208j135n76O9M71L81O8J70P03
55480H7685R39O00L88P31R22K75o80j026p94o11n72l77j62k86n55n21l16m58r33
55461H4249j214j118r70r24p69m63l22m54m24J69R95J234N74k69l67K20N40R1
55443H0778n14n86l83m91p14n20j42k41n82k60P26J250P14l2N8Q82J567J570R84
55424H4064K70kM30J053J038L70o8K75R12J104Q14N30N84R09J162R54K62l72m78
$$ plain form
55405 93811 93507 93123 92417 91474 90248 88451 86307 84782 84444 84673 84657 84698 85657 87437 88912 89300 88821 88002
55387 88002 87050 86117 85620 85983 87242 88953 90399 91036 90893 90381 89637 88489 87183 86537 86963 87838 88307
55370 88307 88258 88084 87951 87857 87918 87994 87461 85964 84055 82453 81066 79379 77491 76082 75593 75954 76868 77860
55352 77860 78360 78221 77782 77130 75926 74438 73846 74744 76057 76393 75815 75278 75013 74676 74525 75085 75904 75990
55334 75990 75330 74793 74643 74352 73818 73518 73424 72997 72343 72261 72925 73613 73861 73915 73955 73980 74517 76218 78495 79798
55314 79798 79611 79055 79112 79345 78910 77748 76170 74182 71983 70377 69953 70398 71104 71956 73033 74093 74741
55297 74741 74751 74021 72794 72004 72659 74592 76537 77716 78551 79569 80540 81168 81767 82636 83400 83567 83162 82322
55279 82322 80897 78997 77393 76791 77116 77920 79006 80216 81137 81526 81631 81774 82020 82464 83270 84102 84238
$$ packed form
55405I3811l04l84p06r43j226j797k144j525l38K29j6M1R59J780J475L88m79q19
55387H8002r52r33m97L63J259J711J446O37j43n12p44j148j306o46M26Q75M69
55370H8307m9j74j33r4O1P6n33j497j909j602j387j687j888j409m89L61R14R92
55352G7860N00j39m39o52j204j488n92Q98J313L36n78n37k65l37j51N60Q19Q6
55334G5990o60n37j50k91n34l00r4m27o54q2O64O88K48N4M0K5N37J701K277J303
55314G9798j87n56N7K33m35j162j578j988k199j606m24M45P06Q52J077J060O48
55297G4741J0p30j227p90O55J933J945J179Q35J018R71O28N99Q69P64J67m05q40
55279H2322j425j900j604o02L25Q04J086J210R21L89J05J43K46M44Q06Q32J36
$$ plain form
55262 84238 83660 83393 84263 85894 87391 88377 88825 88542 87501 86265 85409 84941 84741 85038 85787 86120 85193 83325
55244 83325 81646 80829 80722 80903 81003 80703 80001 79402 79408 80014 80981 82198 83309 83517 82475 81083 80674 81504
55226 81504 82659 83352 83626 83761 83646 82985 81772 80348 79173 78572 78531 78705 78748 78583 78341 78268 78682 79725
55208 79725 81008 81870 82199 82624 83622 84798 85369 85059 84183 83194 82501 82397 82712 82754 82071 81103 80694 81116 81899
55189 81899 82465 82527 81990 80921 79691 78879 78921 79855 81236 82276 82371 81711 81126 81085 81157 80708 79853 79345 79671
55170 79671 80651 81843 82972 83889 84343 84051 83075 82057 81811 82487 83409 84019 84637 85776 87044 87513 87102
55153 87102 86703 86803 86908 86598 86231 86112 85823 85065 84493 84944 86321 87924 89458 91000 92359 93175 93428
55136 93428 93267 92654 91721 91072 91066 91145 90612 89771 89434 89578 89359 88392 87139 86018 85048 84473 84849 86139 87444
$$ packed form
55262H4238n78k67Q70J631J497R86M48k83j041j236q56m68k00K97P49L33r27j868
55244H3325j679q17j07J81J00l00p02n99OO06R67J217J111K08j042j392m09Q30
55226H1504J155O93K74J35j15o61j213j424j175o01m1J74M3j65k42p3M14J043
55208G9725J283Q62L29M25R98J176N71l10q76r89o93j04L15M2o83r68m09M22P83
55189H1899N66O2n37j069j230q12M2R34J381J040R5o60n85m1P2m49q55n08L26
55170G9671R80J192J129R17M54k92r76j018k46O76R22O10O18J139J268M69m11
55153H7102l99J00J05l10l67j19k89p58n72M51J377J603J534J542J359Q16K53
55136I3428j61o13r33o49oP9n33q41l37J44k19r67j253j121r70n75L76J290J305
$$ plain form
55117 87444 88090 88437 89157 90179 90861 90946 90815 90856 90976 90839 90402 90068 90288 91070 91962 92557 92858 93085 93304
55098 93304 93426 93423 93371 93350 93435 93675 93960 94076 94011 93987 94096 94182 94226 94480 94973 95314 95398 95868 97310 99177 100177
55077 100177 99753 98640 97936 98062 98738 99486 99953 100016 99870 99854 100068 100245 100058 99483 98717 97869 96800 95433
55059 95433 94167 93745 94454 95601 96178 95999 95703 95610 95252 94360 93704 94258 95847 97199 97280 96180 94785 94050
55041 94050 94458 95727 96933 97217 96458 95199 94037 93258 92824 92439 91801 91003 90534 90637 90915 90835 90381 89924
55023 89924 89723 89932 90808 92416 94230 95464 95753 95219 94040 92353 90505 89047 88430 88827 89986 91123
55007 91123 91398 90927 90908 92221 94256 95802 96705 97772 99115 99676 98786 97418 97295 99064 101733 103682
54991 103682 103916 102609 100823 99708 99711 100415 101131 101583 102080 103054 104434 105589 106081 106405 107489 109350 110795
$$ packed form
55117H7444O46L47P20J022O82Q5j31M1J20j37m37l34K20P82Q92N95L01K27K19
55098I3304J22ln2k1Q5K40K85J16o5k4J09Q6M4K54M93L41Q4M70J442J867J000
55077A00177m24j113p04J26O76P48M67O3j46j6K14J77j87n75p66q48j069j367
55059I5433j266m22P09J147N77j79k96r3l58q92o56N54J589J352Q1j100j395p35
55041I4050M08J269J206K84p59j259j162p79m34l85o38p98m69J03K78q0m54m57
55023H9924k01K09Q76J608J814J234K89n34j179j687j848j458o17L97J159J137
55007I1123K75m71j9J313K035J546R03J067J343N61q90j368j23J769K669J949
54991A03682K34j307j786j115LP04P16M52M97R74J380J155M92L24J084J861J445
$$ plain form
54974 110795 110870 110119 109800 110195 110464 110121 109842 110510 112041 113497 114134 114025 113785 113884 114248 114518 114619 114859 115423
54955 115423 116061 116465 116681 116883 117039 117100 117253 117646 118130 118577 119093 119537 119277 118005 116385 115268 114588 113834
54937 113834 113206 113292 113723 113315 111790 110381 110316 111504 113151 114906 116835 118885 121039 123646 127103 131469
54921 131469 136779 143315 151024 158952 165878 171472 176451 181578 186744 190944 192876 191681 187468 181254
54907 181254 174267 167276 160530 154081 148001 142368 137258 132743 128873 125675 123161 121262 119849 118918
54893 118918 118658 119102 119801 120134 119892 119282 118446 117395 116419 116092 116663 117842 119430 121845 125692 130994 137145
54876 137145 143572 150203 157299 164926 172564 179234 184086 186868 187761 186880 184136 179583 173638 166929 160072
54861 160072 153609 147936 143168 139174 135729 132610 129663 126903 124435 122124 119622 116955 114805 113761
$$ packed form
54974A10795P5p51l19L95K69l43k79O68J531J456O37j09k40R9L64K70J01K40N64
54955A15423O38M04K16K02J56O1J53L93M84M47N16M44k60j272j620j117o80p54
54937A13834o28Q6M31m08j525j409o5J188J647J755J929K050K154K607L457M366
54921A31469N310O536P709P928O926N594M979N127N166M200J932j195m213o214
54907A81254o987o991o746o449o080n633n110m515l870l198k514j899j413r31
54893A18918k60M44O99L33k42o10q36j051r76l27N71J179J588K415L847N302O151
54876A37145O427O631P096P627P638O670M852K782Q93q81k744m553n945o709o857
54861A60072o463n673m768l994l445l119k947k760k468k311k502k667k150j044
$$ plain form
54847 113761 113422 112757 111316 109641 108432 107801 107464 107231 107040 106777 106286 105468 104332 103107 102177 101652 101121
54830 101121 100211 99273 99079 99836 100955 101842 102453 103019 103681 104514 105478 106270 106669 107034 107903 109009 109388 108693
54812 108693 107743 107367 107359 107105 106701 106755 107335 107860 107926 107689 107444 107257 107060 106749 106236 105625 105244 105231 105279 105121 105082
54791 105082 105714 106958 108173 108970 109494 109863 109940 109929 110590 112329 114422 115764 116230 116652 117469 118188 118435 118800
54773 118800 120026 121883 123645 125412 128055 131949 136718 142406 149777 158868 168119 175827 181909 187366
54759 187366 192483 196497 198778 199304 198035 194796 189912 184117 177667 170317 162359 154875 148635 143441
54745 143441 138913 135220 132606 130809 129458 128574 128206 127988 127584 127257 127502 128293 129079 129386 129155 128739 128814
54728 128814 129985 132158 134557 136642 138792 141843 146233 151864 158452 165645 172965 179906 185944 190348
$$ packed form
54847A13761l39o65j441j675j209o31l37k33j91k63m91q18j136j225r30n25n31
54830A01121r10r38j94P57J119Q87O11N66O62Q33R64P92L99L65Q69J106L79o95
54812A08693r50l76qk54m04N4N80N25O6k37k45j87j97l11n13o11l81j3M8j58l9
54791A05082O32J244J215P97N24L69P7j1O61J739K093J342M66M22Q17P19K47L65
54773A18800J226J857J762J767K643L894M769N688P371R091R251P708O082N457
54759A87366N117M014K281N26j269l239m884n795o450p350p958p484o240n194
54745A43441m528l693k614j797j351q84l68k18m04l27K45P91P86L07k31m16P5
54728A28814J171K173K399K085K150L051M390N631O588P193P320O941O038M404
$$ plain form
54714 190348 192324 191599 188600 183881 177728 170526 163059 156049 149765 144398 140366 137742 135793 133779
54700 133779 132021 131523 132503 133873 134294 133392 131793 130259 128982 127609 125850 123954 122388 121082 119405
54685 119405 117101 114873 113675 113656 114127 114417 114413 114399 114670 115192 115427 114735 113176 111647 110895 110694 110429 110118
54667 110118 110229 110663 110676 109922 108986 108583 108639 108468 107632 106407 105575 105885 107500 109772 111623 112355 112133 111673
54649 111673 111487 111472 111213 110628 110133 110105 110331 110341 110162 110313 110965 111576 111649 111462 111634 112268 113001 113642 114281 114820
54629 114820 114935 114614 114332 114543 115256 116217 117284 118446 119608 120477 120692 120099 118945 117674 116505 115368
54613 115368 114351 113883 114193 114843 115205 115324 115806 116838 117766 117846 117051 115954 115096 114796 115324 116761 118610
54596 118610 119964 120319 120038 119752 119544 119066 118311 117721 117443 117088 116545 116425 117124 117885 117583 116287 115232 115210
$$ packed form
54714A90348J976p25k999m719o153p202p467p010o284n367m032k624j949k014
54700A33779j758m98R80J370M21r02j599j534j277j373j759j896j566j306j677
54685A19405k304k228j198j9M71K90mj4K71N22K35o92j559j529p52k01k65l11
54667A10118J11M34J3p54r36m03N6j71q36j225q32L10J615K272J851P32k22m60
54649A11673j86j5k59n85m95k8K26J0j79J51O52O11P3j87J72O34P33O41O39N39
54629A14820J15l21k82K11P13R61J067J162J162Q69K15n93j154j271j169j137
54613A15368j017m68L10O50L62J19M82J032R28Q0p95j097q58l00N28J437J849
54596A18610J354L55k81k86k08m78p55n90k78l55n43j20O99P61l02j296j055k2
$$ plain form
54578 115210 115714 115861 115445 114843 114511 114900 116227 117910 118742 118105 116649 115411 114671 114101 113596 113442 113886
54561 113886 114974 116571 118256 119506 120334 121313 122633 123636 123797 123661 124112 125020 125423 124862 123869 123202 123202
54544 123202 123904 125119 126409 127499 128754 130766 133461 136085 138080 139495 140552 141297 141716 141722 140996 139339
54528 139339 137230 135524 134452 133378 131746 129831 128325 127522 127172 126914 126656 126624 127102 127980 128592 128300 127254
54511 127254 126290 126017 126231 126399 126447 126834 127839 129010 129521 129150 128661 128858 129436 129314 128165 126911 126386 126292
54493 126292 126013 125811 126290 127150 127468 127121 126987 127635 128656 129445 129899 130127 130130 130097 130437 131187 131799 131926 132094
54474 132094 133275 135917 139428 142541 144284 144897 145575 146995 148397 148697 148107 147779 147964 147676 146316 144613
54458 144613 143531 143183 143398 144456 146442 148484 149531 149576 149409 149400 149185 148433 147290 146086 145018 144066 142954
$$ packed form
54578A15210N04J47m16o02l32L89J327J683Q32o37j456j238p40n70n05j54M44
54561A13886J088J597J685J250Q28R79J320J003J61j36M51R08M03n61r93o67%
54544A23202P02J215J290J090J255K012K695K624J995J415J057P45M19Op26j657
54528A39339k109j706j072j074j632j915j506q03l50k58k58l2M78Q78O12k92j046
54511A27254r64k73K14J68M8L87J005J171N11l71m89J97N78j22j149j254n25r4
54493A26292k79k02M79Q60L18l47j34O48J021P89M54K28Ll3L40P50O12J27J68
54474A32094J181K642L511L113J743O13O78J420J402L00n90l28J85k88j360j703
54458A44613j082l48K15J058J986K042J047M5j67rk15p52j143j204j068r52j112
$$ plain form
54441 142954 141350 139385 137734 136848 136384 135820 135259 135160 135567 136211 137151 138598 140149 140985 141019 141184 142207
54424 142207 143583 144213 143781 143032 142800 143164 143618 143732 143452 142912 142214 141423 140612 139781 138873 138007 137561 137767
54406 137767 138293 138585 138689 139355 141126 143628 146090 148264 150428 152577 154152 154722 154577 154357 154349 154484 154847
54389 154847 155780 157320 158860 159713 159846 159722 159482 158702 157151 155367 154127 153543 153087 152367 151509 150789 150361
54372 150361 150395 151124 152518 154171 155697 157061 158332 159310 159649 159311 158752 158568 159008 159838 160704 161569 162747
54355 162747 164558 167155 170599 174753 178878 181796 182964 183211 183936 185573 187191 187546 186155 183397 180024
54340 180024 176695 173599 170417 166893 163392 160536 158333 156178 153777 151545 149939 148909 148277 148148 148563
54325 148563 149106 149330 149369 149713 150516 151464 152265 152935 153593 154152 154295 153744 152574 151208 149941 148584 146861
$$ packed form
54441A42954j604j965j651q86m64n64n61r9M07O44R40J447J551Q36L4J65J023
54424A42207J376O30m32p49k32L64M54J14k80n40o98p91q11q31r08q66m46K06
54406A37767N26K92J04O66J771K502K462K174K164K149J575N70j45k20qJ35L63
54389A54847R33J540J540Q53J33j24k40p80j551j784j240n84m56p20q58p20m28
54372A50361L4P29J394J653J526J364J271R78L39l38n59j84M40Q30Q66Q65J178
54355A62747J811K597L444M154M125K918J168K47P25J637J618L55j391k758l373
54340A80024l329l096l182l524l501k856k203k155k401k232j606j030o32j29M15
54325A48563N43K24L9L44Q03R48Q01O70O58N59J43n51j170j366j267j357j723
$$ plain form
54308 146861 145120 144218 144536 145456 146019 145821 145054 143991 142857 142009 141821 142280 142915 143254 143301 143510 144265 145401
54290 145401 146352 146787 146903 146988 146971 146672 146230 145919 145754 145723 146216 147618 149533 151019 151613 151568 151029 149725 147672
54271 147672 145530 143938 143089 143201 144749 147719 151150 153928 155706 156722 157132 156979 156390 155399 153955 152475
54255 152475 151865 152456 153391 153702 153619 154128 155522 157110 158173 158499 158046 156846 155298 153956 152924 151884
54239 151884 150727 149685 148866 148186 147846 148283 149460 150653 151177 151017 150551 150004 149376 148676 148013 147517 147320
54222 147320 147545 148249 149441 151048 152809 154282 155127 155293 154851 153845 152476 151221 150468 150152 149944 149665
54206 149665 149310 148878 148477 148367 148574 148681 148346 147833 147601 147569 147304 146769 146375 146321 146425 146563 146733 146682 146084 145234
54186 145234 144987 145749 146966 147867 148291 148564 149006 149857 151245 152815 153674 153214 151855 150651 150247 150561 151310
$$ packed form
54308A46861j741r02L18R20N63j98p67j063j134q48j88M59O35L39M7K09P55J136
54290A45401R51M35J16Q5j7k99m42l11j65l1M93J402J915J486N94m5n39j304k053
54271A47672k142j592q49J12J548K970L431K778J778J016M10j53n89r91j444j480
54255A52475o10N91R35L11q3N09J394J588J063L26m53j200j548j342j032j040
54239A51884j157j042q19o80l40M37J177J193N24j60m66n47o28p00o63m96j97
54222A47320K25P04J192J607J761J473Q45J66m42j006j369j255p53l16k08k79
54206A49665l55m32m01j10K07J07l35n13k32l2k65n35l94n4J04J38J70n1n98q50
54186A45234k47P62J217R01M24K73M42Q51J388J570Q59m60j359j204m04L14P49
$$ plain form
54169 151310 152343 153356 153727 152951 151147 148992 147215 146222 146029 146311 146500 146128 145253 144430 144106 144133 144042 143681
54151 143681 143303 143062 142812 142476 142306 142623 143515 144879 146474 147802 148346 148192 148078 148488 149053 149228 149210 149628
54133 149628 150542 151376 151794 152044 152402 152809 153132 153304 153098 152302 151327 151092 151903 152862 152843 151839 150880 150746 151257
54114 151257 151866 152503 153531 155093 156837 158287 159219 159623 159542 159205 159157 159894 161298 162704 163526 163626 163054
54097 163054 161875 160399 159268 158963 159400 160154 160844 161190 161094 160909 161225 162111 162992 163627 164676 166715 169193
54080 169193 171181 172829 175227 178957 183774 189650 197056 205875 214914 222977 229685 234791 237436 236850
54066 236850 233312 227801 221046 213569 206266 200143 195435 191566 188003 184649 181465 178331 175533 173858
54052 173858 173789 174828 175943 176590 177053 177874 179274 181168 183448 185970 188415 190513 192480 194979 198505
$$ packed form
54169A51310J033J013L71p76j804k155j777r93j93K82J89l72q75q23l24K7r1l61
54151A43681l78k41k50l36j70L17Q92J364J595J328N44j54j14M10N65J75j8M18
54133A49628R14Q34M18K50L58M07L23J72k06p96r75k35Q11R59j9j004r59j34N11
54114A51257O09O37J028J562J744J450R32M04q1l37m8P37J404J406Q22J00n72
54097A63054j179j476j131l05M37P54O90L46r6j85L16Q86Q81O35J049K039K478
54080A69193J988J648K398L730M817N876P406Q819R039Q063O708N106K645n86
54066B36850l538n511o755p477p303o123m708l869l563l354l184l134k798j675
54052A73858o9J039J115O47M63Q21J400J894K280K522K445K098J967K499L526
$$ plain form
54037 198505 202950 207893 213071 218342 223473 228318 233140 238388 244167 250203 256215 261959 266936 270581
54023 270581 272884 274537 276282 278367 280689 283142 285621 288059 290673 293880 297704 301441 304231 305798
54009 305798 306434 306368 305458 303380 299874 294822 288328 280802 272830 264893 257233 249934 243014 236429 230155
53994 230155 224420 219848 217056 215815 214763 212386 208529 204561 201845 200331 198990 197180 195026 192794
53980 192794 190660 189101 188678 189167 189528 189088 188243 187656 187282 186682 185897 185409 185366 185387 185128 184712 184600 185265 186887
53961 186887 189094 191072 192204 192640 193064 193953 195248 196681 198130 199602 200988 201976 202297 202200 202598 204438
53945 204438 207743 211538 214908 217886 221075 224738 228787 233457 239336 246540 254363 262095 269783 277832
53931 277832 286150 294250 302205 310926 321311 333514 347324 362693 379132 394613 405866 410340
$$ packed form
54037A98505M445M943N178N271N131M845M822N248N779O036O012N744M977L645
54023B70581K303J653J745K085K322K453K479K438K614L207L824L737K790J567
54009C05798O36o6r10k078l506n052o494p526p972p937p660p299o920o585o274
53994B30155n735m572k792j241j052k377l857l968k716j514j341j810k154k232
53980A92794k134j559m23M89L61m40q45n87l74o00p85m88m3K1k59m16j12O65J622
53961A86887K207J978J132M36M24Q89J295J433J449J472J386R88L21r7L98J840
53945B04438L305L795L370K978L189L663M049M670N879P204P823P732P688Q049
53931B77832Q318Q100P955Q721J0385J2203J3810J5369J6439J5481J1253M474
$$ plain form
53919 410340 407851 400354 390504 380546 371913 365196 360455 357827 357641 359705 362923 366124 369083 372196
53905 372196 375370 377910 379409 380040 379911 378856 377013 374930 372799 370208 367047 364020 361716 359581 356464
53890 356464 351937 346557 340941 335091 328665 321536 313951 306274 298632 290877 283032 275681 269595 264917
53876 264917 261101 257717 254873 252629 250501 247957 245005 241934 238791 235571 232616 230290 228335 226064
53862 226064 223163 220045 217437 215865 215357 215286 214625 212718 209847 206860 204394 202633 201553 200986 200567 200005
53846 200005 199373 198915 198634 198373 198129 197974 197756 197228 196444 195765 195523 195899 196881 198048 198627 198211 197336 196889
53828 196889 197026 197115 196700 196093 195950 196693 198320 200361 201959 202434 201961 201369 201236 201461 201734 201986 202252 202528
53810 202528 203024 204218 206367 209160 212048 214787 217521 220527 223973 227773 231623 235368 239360 244149
$$ packed form
53919D10340k489p497r850r958q633o717m741k628j86K064L218L201K959L113
53905C72196L174K540J499O31j29j055j843k083k131k591l161l027k304k135l117
53890C56464m527n380n616n850o426p129p585p677p642p755p845p351o086m678
53876B64917l816l384k844k244k128k544k952l071l143l220k955k326j955k271
53862B26064k901l118k608j572n08p1o61j907k871k987k466j761j080n67m19n62
53846B00005o32m58k81k61k44j55k18n28p84o79k42L76R82J167N79m16q75m47
53828A96889J37Q9m15o07j43P43J627K041J598M75m73n92j33K25K73K52K66K76
53810B02528M96J194K149K793K888K739K734L006L446L800L850L745L992M789
$$ plain form
53796 244149 249719 255281 259975 263539 266242 268493 270766 273537 276922 280433 283329 285209 286206 286785 287472
53781 287472 288531 289641 289986 288952 286687 283848 280837 277450 273203 267851 261628 255180 249278 244406
53767 244406 240574 237542 235113 233104 231108 228616 225512 222314 219742 218047 216908 215971 215307 215130 215132 214367
53751 214367 212003 208205 204175 201214 199712 198981 198078 196855 196145 196815 198736 200892 202470 203491 204312
53736 204312 204935 205188 205260 205501 205762 205449 204382 203205 202722 203097 203913 204811 205786 206902 208009 208898 209705 210940
53718 210940 212913 215121 216605 217103 217504 218775 220658 222052 222624 223349 225205 227943 230610 232852 235057
53703 235057 237437 239687 241633 243703 246405 249621 252782 255621 258527 262086 266402 270948 275017 278279
53689 278279 280907 283211 285227 286659 287159 286675 285600 284594 284142 284204 284302 283982 283169 282099 281045 280182 279576
$$ packed form
53796B44149N570N562M694L564K703K251K273K771L385L511K896J880R97N79O87
53781B87472J059J110L45j034k265k839l011l387m247n352o223o448n902m872
53767B44406l832l032k429k009j996k492l104l198k572j695j139r37o64j77Kp65
53751B14367k364l798m030k961j502p31r03j223p10O70J921K156J578J021Q21
53736B04312O23K53P2K41K61l13j067j177m83L75Q16Q98R75J116J107Q89Q07J235
53718B10940J973K208J484M98M01J271J883J394N72P25J856K738K667K242K205
53703B35057K380K250J946K070K702L216L161K839K906L559M316M546M069L262
53689B78279K628K304K016J432N00m84j075j006m52O2R8l20q13j070j054q63o06
$$ plain form
53672 279576 279147 278680 278002 277117 276092 274909 273630 272642 272439 273014 273711 273854 273390 272652 271681 270248 268584
53655 268584 267601 268026 269566 271222 272262 272582 272312 271572 270694 270239 270568 271576 272892 274105 274784 274677 274082
53638 274082 273676 273799 274272 275060 276603 279012 281414 282785 283272 284025 285703 287839 289804 291676 293775 295941
53622 295941 297824 299602 301817 304622 307742 311139 315197 320005 324903 329107 332583 335987 339794 343873
53608 343873 347910 351932 356189 360817 365849 371386 377416 383547 389254 394411 399244 403755 407524 410225
53594 410225 411918 412638 412116 410307 407929 405980 404760 403700 402075 399636 396655 393781 391793 391053 391077
53579 391077 390896 389932 388304 386382 384448 382784 381611 380694 379379 377313 374900 372770 370992 369071 366669
53564 366669 364097 362103 361311 361800 363090 364513 365647 366381 366648 366326 365498 364627 364252 364517 365081 365491 365609
$$ packed form
53672B79576m29m67o78q85j025j183j279r88k03N75O97J43m64p38r71j433j664
53655B68584r83M25J540J656J040L20k70p40q78m55L29J008J316J213O79j07n95
53638B74082m06J23M73P88J543K409K402J371M87P53J678K136J965J872K099K166
53622B95941J883J778K215K805L120L397M058M808M898M204L476L404L807M079
53608C43873M037M022M257M628N032N537O030O131N707N157M833M511L769K701
53594D10225J693P20n22j809k378j949j220j060j625k439k981k874j988p40K4
53579C91077j81r64j628j922j934j664j173r17j315k066k413k130j778j921k402
53564C66669k572j994p92M89J290J423J134P34K67l22q28q71l75K65N64M10J18
$$ plain form
53547 365609 365727 366348 367783 369930 372367 374646 376488 377915 379309 381247 384020 387326 390598 393629 396701
53532 396701 400140 404009 408273 413127 419029 426417 435258 444776 453897 462329 471093 481525 493734 506406
53518 506406 518257 529281 540514 553020 567318 583287 600238 617348 634524 652725 673114
53507 673114 695934 720417 745613 771024 796577 822312 848058 873235 897114 919524 941110
53496 941110 962629 984099 1005041 1025328 1045298 1065060 1084311 1103001 1121625 1140553 1159486
53485 1159486 1177978 1196184 1214570 1233076 1251092 1268269 1284847 1301113 1317026 1332661 1348559
53474 1348559 1365114 1381762 1397296 1410963 1422801 1432843 1440535 1445293 1447218 1446801 1444112 1438797 1430825
53461 1430825 1420714 1408952 1395649 1381021 1365844 1351060 1336986 1323134 1308620 1292639 1274759
$$ packed form
53547C65609J18O21J435K147K437K279J842J427J394J938K773L306L272L031L072
53532C96701L439L869M264M854N902P388Q841R518R121Q432Q764J0432J2209J2672
53518E06406J1851J1024J1233J2506J4298J5969J6951J7110J7176J8201K0389
53507F73114K2820K4483K5196K5411K5553K5735K5746K5177K3879K2410K1586
53496I41110K1519K1470K0942K0287J9970J9762J9251J8690J8624J8928J8933
53485A159486J8492J8206J8386J8506J8016J7177J6578J6266J5913J5635J5898
53474A348559J6555J6648J5534J3667J1838J0042P692M758J925m17k689n315p972
53461A430825j0111j1762j3303j4628j5177j4784j4074j3852j4514j5981j7880
$$ plain form
53450 1274759 1255171 1234610 1213772 1192797 1171506 1150092 1129278 1109644 1091015 1072713 1054342
53439 1054342 1036197 1018956 1003232 989522 978374 970231 964864 961155 957696 953701 949305 945183 942147
53426 942147 941020 942369 946023 951085 956699 962773 969804 978191 988025 999411 1012567 1027505 1043868
53413 1043868 1061241 1079514 1098839 1119367 1141137 1164163 1188546 1214497 1242173 1271431 1301834
53402 1301834 1333101 1365519 1399693 1435926 1474136 1514465 1557571 1603986 1653321 1704395 1756112
53391 1756112 1808022 1860219 1913121 1967336 2023268 2080659 2138684 2196547 2253657 2309106 2361590
53380 2361590 2410334 2455913 2499618 2542061 2582794 2621152 2656884 2689753 2719065 2743950 2763960
53369 2763960 2779203 2790172 2797499 2801405 2800980 2794240 2779350 2755789 2724257 2685853 2641743 2593317
$$ packed form
53450A274759j9588k0561k0838k0975k1291k1414k0814j9634j8629j8302j8371
53439A054342j8145j7241j5724j3710j1148q143n367l709l459l995m396m122l036
53426I42147j127J349L654N062N614O074P031Q387R834J1386J3156J4938J6363
53413A043868J7373J8273J9325K0528K1770K3026K4383K5951K7676K9258L0403
53402A301834L1267L2418L4174L6233L8210M0329M3106M6415M9335N1074N1717
53391A756112N1910N2197N2902N4215N5932N7391N8025N7863N7110N5449N2484
53380B361590M8744M5579M3705M2443M0733L8358L5732L2869K9312K4885K0010
53369B763960J5243J0969P327L906m25o740j4890k3561l1532l8404m4110m8426
$$ plain form
53357 2593317 2541946 2488445 2433205 2376937 2320854 2265918 2212252 2159607 2108260 2059142 2013055
53346 2013055 1969864 1928538 1887946 1847589 1807477 1767425 1726843 1685427 1643737 1602771 1563153
53335 1563153 1525138 1489213 1456120 1426188 1399138 1374682 1352869 1333666 1316607 1301165 1287151
53324 1287151 1274428 1262437 1250274 1237174 1222784 1207313 1191620 1176902 1163869 1152257 1141333
53313 1141333 1130732 1120579 1111042 1102241 1094659 1089210 1086563 1086393 1087431 1088384 1088933 1089875 1092287 1096622
53299 1096622 1102718 1110475 1120104 1131710 1145101 1160323 1177919 1198275 1220882 1244700 1269139 1294336
53287 1294336 1320603 1348021 1376444 1405314 1433429 1459492 1483161 1505189 1526240 1545972 1563611
53276 1563611 1579045 1592721 1604590 1613725 1619160 1620709 1618851 1614148 1607019 1597769 1586523 1573204 1557746
$$ packed form
53357B593317n1371n3501n5240n6268n6083n4936n3666n2645n1347m9118m6087
53346B013055m3191m1326m0592m0357m0112m0052m0582m1416m1690m0966l9618
53335A563153l8015l5925l3093k9932k7050k4456k1813j9203j7059j5442j4014
53324A287151j2723j1991j2163j3100j4390j5471j5693j4718j3033j1612j0924
53313A141333j0601j0153r537q801p582n449k647j70J038R53N49R42K412M335
53299A096622O096P757R629J1606J3391J5222J7596K0356K2607K3818K4439K5197
53287A294336K6267K7418K8423K8870K8115K6063K3669K2028K1051J9732J7639
53276A563611J5434J3676J1869R135N435J549j858m703p129r250j1246j3319j5458
$$ plain form
53263 1557746 1540196 1520481 1498361 1473882 1447636 1420278 1392002 1362948 1333794 1305238 1276910
53252 1276910 1247659 1217243 1187025 1158498 1131744 1105989 1081088 1057553 1035295 1013315 990792
53241 990792 967765 944563 921207 897674 874190 850919 827714 804531 781808 760222 740335
53230 740335 722616 707420 694635 683592 673561 664172 655274 646720 638449 630381 622017 612541 601648
53217 601648 589902 577902 565420 551825 537121 522110 507599 493863 480787 468227 456236
53206 456236 445195 435613 427603 420716 414471 408704 403113 396892 389489 381475 373976 367255 360577 353481
53192 353481 346450 340000 333825 327361 320755 314668 309400 304774 300772 297660 295314 292945 289818 286069
53178 286069 282541 279896 278134 276950 276311 276447 277343 278415 278872 278386 277287 276032 274630 272784 270582
$$ packed form
53263A557746j7550j9715k2120k4479k6246k7358k8276k9054k9154k8556k8328
53252A276910k9251l0416l0218k8527k6754k5755k4901k3535k2258k1980k2523
53241I90792k3027k3202k3356k3533k3484k3271k3205k3183k2723k1586j9887
53230G40335j7719j5196j2785j1043j0031r389q898q554q271q068q364r476j0893
53217F01648j1746j2000j2482j3595j4704j5011j4511j3736j3076j2560j1991
53206D56236j1041r582q010o887o245n767n591o221p403q014p499o721o678p096
53192C53481p031o450o175o464o606o087n268m626m002l112k346k369l127l749
53178B86069l528k645j762j184o39J36Q96J072M57m86j099j255j402j846k202
$$ plain form
53163 270582 268719 267759 267334 266459 264677 262540 260838 259740 259001 258641 258925 259717 260416 260592 260387 260166 260059
53146 260059 259876 259171 257416 254504 251148 248411 246737 245775 245268 245495 246613 248112 249393 250504 251797
53131 251797 253165 254180 254872 255758 257120 258700 260166 261417 262310 262494 261738 260312 258874 258090 258296 259369
53115 259369 260860 262412 264020 265734 267235 268024 268086 268096 268778 270134 271362 271486 270071 267475 264498 261751
53099 261751 259311 256919 254439 252071 250139 248792 247930 247430 247327 247653 248041 247785 246541 244887 243803 243626
53083 243626 243804 243645 242983 242065 241182 240518 240025 239393 238493 237879 238312 239694 241101 242080 243232 245054 246849
53066 246849 247458 246654 245137 243453 241672 239950 238611 237656 236754 235868 235362 235412 235719 235940 236029 236078 236092 236072 236133
53047 236133 236508 237479 239124 240972 242199 242467 242315 242427 242807 242987 242675 241784 240221 238320 237108 237403 238712
$$ packed form
53163B70582j863r60m25q75j782k137j702j098p39l60K84P92O99J76k05k21j07
53146B60059j83p05j755k912l356k737j674r62n07K27J118J499J281J111J293
53131B51797J368J015O92Q86J362J580J466J251Q93J84p56j426j438p84K06J073
53115B59369J491J552J608J714J501P89O2J0O82J356J228J24j415k596k977k747
53099B61751k440k392k480k368j932j347q62n00j03L26L88k56j244j654j084j77
53083B43626J78j59o62r18q83o64m93o32r00o14M33J382J407R79J152J822J795
53066B46849O09q04j517j684j781j722j339r55r02q86n06N0L07K21Q9M9J4k0O1
53047B36133L75R71J645J848J227K68j52J12L80J80l12q91j563j901j212K95J309
$$ plain form
53030 238712 239736 239880 239601 239389 239247 239255 239835 241100 242498 243401 243662 243492 243254 243417 244253 245433 246326 246697
53012 246697 246711 246408 245793 245344 245603 246276 246596 246645 247375 248995 250354 250425 249602 248966 248959 249408 250136 250877 251205 251236
52992 251236 251910 253811 256165 257724 258202 258070 257430 256089 254566 253950 254690 256281 258209 260405 262644 264330
52976 264330 265349 266578 269085 272995 277419 281230 283708 284700 284514 283670 282634 281744 281215 281048 280978 280756
52960 280756 280475 280474 280927 281668 282362 282682 282398 281479 280074 278296 276169 273896 271962 270656 269672 268499 267086
52943 267086 265794 264751 263709 262531 261442 260635 259980 259267 258526 257866 257222 256450 255651 255223 255542 256566 257703
52926 257703 258117 257318 255577 253694 252301 251449 250886 250598 250858 251685 252516 252639 251950 251022 250419 250243 250368 250704
52908 250704 250984 250681 249683 248763 248792 249591 250169 250060 249714 249483 249010 248005 246927 246391 246404 246696 247407 248781
$$ packed form
53030B38712J024J44k79k12j42QN80J265J398R03K61j70k38J63Q36J180Q93L71
53012B46697J4l03o15m49K59O73L20M9P30J620J359P1q23o36pM49P28P41L28L1
52992B51236O74J901K354J559M78j32o40j341j523o16P40J591J928K196K239J686
52976B64330J019J229K507L910M424L811K478R92j86q44j036q90n29j67p0k22
52960B80756k81jM53P41O94L20k84r19j405j778k127k273j934j306r84j173j413
52943B67086j292j043j042j178j089q07o55p13p41o60o44p72p99m28L19J024J137
52926B57703M14p99j741j883j393q52n63k88K60Q27Q31J23o89r28o03j76J25L36
52908B50704K80l03r98r20K9P99N78j09l46k31m73j005j078n36J3K92P11J374
$$ plain form
52890 248781 250531 252128 253530 255072 256707 257888 258211 257760 256880 255947 255215 254487 253135 250999 249113 248912
52874 248912 250590 252822 254290 254968 255701 257009 258737 260579 262466 264449 266477 268404 270151 271817 273568
52859 273568 275320 276668 277335 277606 278004 278463 278166 276392 273320 269827 266580 263600 260595 257438 254223
52844 254223 251058 248082 245598 243930 242950 241954 240243 237761 234981 232322 230030 228471 227996 228344 228674
52829 228674 228520 228334 228766 229718 230569 231099 231673 232566 233533 234133 234206 233985 233840 233912 233880 233263 232079 230987 230646
52810 230646 231180 232486 234681 237810 241353 244513 246883 248450 249149 248852 247690 245925 243652 241082 238870
52795 238870 237496 236420 234647 232153 229971 228658 227557 226059 224770 224676 225631 226505 226655 226511 226716 227366
52779 227366 228265 229408 230930 232829 234985 237220 239148 240159 239912 238861 238091 238397 239489 240164 239375 237151
$$ packed form
52890B48781J750J597J402J542J635J181L23m51q80r33p32p28j352k136j886k01
52874B48912J678K232J468O78P33J308J728J842J887J983K028J927J747J666J751
52859B73568J752J348O67K71L98M59k97j774l072l493l247k980l005l157l215
52844B54223l165k976k484j668r80r96j711k482k780k659k292j559m75L48L30
52829B28674j54j86M32R52Q51N30N74Q93R67O00P3k21j45P2l2o17j184j092l41
52810B30646N34J306K195L129L543L160K370J567O99k97j162j765k273k570k212
52795B38870j374j076j773k494k182j313j101j498j289r4R55Q74J50j44K05O50
52779B27366Q99J143J522J899K156K235J928J011k47j051p70L06J092O75p89k224
$$ plain form
52763 237151 234455 232205 230589 229329 228380 228023 228277 228522 228058 227004 226366 227074 229098 231666 234094 236123
52747 236123 237617 238456 238861 239455 240728 242639 244827 246922 248489 249138 249068 249178 250236 252117 254197 256156
52731 256156 257934 259204 259668 259818 260651 262450 264427 265759 266346 266246 265058 262470 259031 255819 253454
52716 253454 251865 250799 250022 249185 248084 247179 247351 248918 251156 252934 253557 252908 251224 249083 247377 246751
52700 246751 247077 247733 248344 248976 249654 250173 250539 251148 252198 253250 253705 253536 253146 252743 252306 252062 252412 253320
52682 253320 254253 254872 255329 255769 256017 255974 255834 255625 254978 253747 252448 251659 251341 251173 251190 251516 251711 251070 249538
52663 249538 247799 246435 245459 244733 244386 244651 245597 247132 249106 251392 254064 257378 261357 265468 269046
52648 269046 271928 274285 275913 276120 274488 271512 268383 266205 265304 265132 264893 264398 264124 264333 264488 263871
$$ packed form
52763B37151k696k250j616j260r49l57K54K45m64j054o38P08K024K568K428K029
52747B36123J494Q39M05N94J273J911K188K095J567O49p0J10J058J881K080J959
52731B56156J778J270M64J50Q33J799J977J332N87j00j188k588l439l212k365
52716B53454j589j066p77q37j101r05J72J567K238J778O23o49j684k141j706o26
52700B46751L26O56O11O32O78N19L66O09J050J052M55j69l90m03m37k44L50R08
52682B53320R33O19M57M40K48m3j40k09o47j231j299p89l18j68J7L26J95o41j532
52663B49538j739j364r76p26l47K65R46J535J974K286K672L314L979M111L578
52648B69046K882K357J628K07j632k976l129k178r01j72k39m95k74K09J55o17
$$ plain form
52632 263871 262411 260565 258741 257350 257056 258281 260653 263493 266556 269583 271507 271171 268864 266182 264167
52617 264167 262433 260352 258152 256387 255121 254193 253713 253759 254060 254406 254910 255538 255921 256042 256543 257879 259682
52600 259682 261366 262837 264110 264794 264663 264244 264188 264417 264573 264911 265947 267471 268671 269172 269256 269203 269141 269465
52582 269465 270586 272117 273055 273041 272874 273512 274960 276465 277395 277678 277587 277397 277128 276530 275433 274096 273027
52565 273027 272465 272281 272270 272282 272112 271648 271146 270975 270985 270528 269274 267708 266625 266302 266352 266199 265570 264625 263772
52546 263772 263257 262930 262538 262160 262084 262219 262043 261330 260631 260691 261563 262601 263248 263520 263665 263728 263629 263530 263787 264555
52526 264555 265610 266640 267569 268496 269437 270265 270865 271138 270964 270369 269800 269975 271329 273720 276724 279999 283296
52509 283296 286436 289528 293014 297233 301948 306416 309741 311053 309710 305907 301016 296812 294086 292165
$$ packed form
52632B63871j460j846j824j391k94J225K372K840L063L027J924l36k307k682k015
52617B64167j734k081k200j765j266r28m80M6L01L46N04O28L83J21N01J336J803
52600B59682J684J471J273O84j31m19n6K29J56L38J036J524J200N01Q4n3o2L24
52582B69465J121J531R38j4j67O38J448J505R30K83r1j90k69n98j097j337j069
52565B73027n62j84j1J2j70m64n02j71J0m57j254j566j083l23N0j53o29r45q53
52546B63772n15l27l92l78p6J35j76p13o99O0Q72J038O47K72J45O3r9r9K57P68
52526B64555J055J030R29R27R41Q28O00K73j74n95n69J75J354K391L004L275L297
52509B83296L140L092L486M219M715M468L325J312j343l803m891m204k726j921
$$ plain form
52495 292165 289891 286851 283526 280550 278108 275999 274036 272330 271224 270959 271392 272103 272782 273381 273854 273956
52479 273956 273517 272801 272302 272174 272115 271910 271796 272154 273084 274572 276756 279574 282276 283904 284409 284836 286187
52462 286187 288549 291598 295360 299906 304612 308428 310826 311941 311810 310096 306713 302263 297602 293252
52448 293252 289375 286000 283053 280340 277671 274952 272208 269672 267749 266672 266259 266197 266330 266405 265847 264332
52432 264332 262430 261100 260688 260912 261599 262620 263287 262795 261420 260324 259956 259670 259253 259726 261870 264870
52416 264870 267255 268523 269068 269215 269314 270219 272610 276091 279849 283940 289023 295123 301715 309008 318107
52401 318107 329735 343425 357847 371069 380599 384403 382428 376488 368441 359099 349042 339426 331327
52388 331327 324866 319524 314958 311067 307741 305076 303536 303379 304078 304721 304913 305049 305792 307517 310143 313318
$$ packed form
52495B92165k274l040l325k976k442k109j963j706j106k65M33P11O79N99M73J02
52479B73956m39p16m99j28n9k05j14L58R30J488K184K818K702J628N05M27J351
52462B86187K362L049L762M546M706L816K398J115j31j714l383m450m661m350
52448B93252l877l375k947k713k669k719k744k536j923j077m13o2J33P5n58j515
52432B64332j902j330m12K24O87J021O67m92j375j096l68k86m17M73K144L000
52416B64870K385J268N45J47R9R05K391L481L758M091N083O100O592P293R099
52401C18107J1628J3690J4422J3222R530L804j975n940q047r342j0057r616q099
52388C31327o461n342m566l891l326k665j540j57O99O43J92J36P43J725K626L175
$$ plain form
52372 313318 316807 320719 325239 330230 335401 340808 346674 352569 357262 359740 360062 358966 356965 354212
52358 354212 351011 347992 345773 344699 344788 345720 346922 347890 348492 348882 349206 349491 349667 349595 349227 348887 349306 351145
52340 351145 354473 358756 363296 367625 371647 375591 379781 384347 389170 394211 399824 406585 414772 424113
52326 424113 434178 444916 456674 469674 483687 498350 513586 529428 545506 561141 576023
52315 576023 590519 605234 620574 636794 653988 671785 689494 706877 724460 742795 761807
52304 761807 781288 801473 822459 843431 863294 882026 900617 919627 938470 956209 972302
52293 972302 986339 997688 1005844 1010761 1012640 1011774 1008836 1004828 1000314 994995 988386 980716 972887 965654
52279 965654 959080 952737 946359 940319 935415 932052 929799 928061 927008 927352 929310 932383 936280 941420
$$ packed form
52372C13318L489L912M520M991N171N407N866N895M693K478L22j096k001k753
52358C54212l201l019k219j074Q9R32J202R68O02L90L24K85J76p2l68l40M19J839
52340C51145L328M283M540M329M022L944M190M566M823N041N613O761Q187R341
52326D24113J0065J0738J1758J3000J4013J4663J5236J5842J6078J5635J4882
52315E76023J4496J4715J5340J6220J7194J7797J7709J7383J7583J8335J9012
52304G61807J9481K0185K0986K0972J9863J8732J8591J9010J8843J7739J6093
52293I72302J4037J1349Q156M917J879q66k938m008m514n319o609p670p829p233
52279I65654o574o343o378o040m904l363k253j738j053L44J958L073L897N140
$$ plain form
52265 941420 948235 956484 965538 974970 984576 994253 1004271 1015310 1027873 1041826 1056825 1072902 1090313
52252 1090313 1108981 1128418 1148030 1167242 1185424 1201880 1215873 1226681 1233935 1238026 1239829 1239880
52240 1239880 1238159 1234851 1230819 1226872 1222877 1218048 1211962 1204890 1197229 1189021 1180075 1170336 1160113 1149977
52226 1149977 1140376 1131262 1122273 1113341 1104874 1097291 1090694 1085106 1080628 1077115 1074108 1071459 1069740 1069510
52212 1069510 1070358 1071156 1071329 1071554 1073179 1077066 1082990 1090015 1097372 1104903 1112579 1119842 1125892 1130669 1135022
52197 1135022 1139725 1144837 1150297 1156550 1164011 1172306 1180653 1188798 1196974 1205087 1212509 1218730 1223739 1227675
52183 1227675 1230416 1231581 1230689 1227357 1221631 1214051 1205192 1195223 1184200 1172616 1161311 1150893 1141578
52170 1141578 1133519 1126850 1121396 1116662 1112260 1108190 1104744 1102335 1101354 1101887 1103528 1105695 1108128 1110903
$$ packed form
52265I41420O815Q249R054R432R606R677J0018J1039J2563J3953J4999J6077J7411
52252A090313J8668J9437J9612J9212J8182J6456J3993J0808P254M091J803N1
52240A239880j721l308m032l947l995m829o086p072p661q208q946r739j0223j0136
52226A149977r601r114q989q932q467p583o597n588m478l513l007k649j719k30
52212A069510Q48P98J73K25J625L887N924P025P357P531P676P263O050M777M353
52197A135022M703N112N460O253P461Q295Q347Q145Q176Q113P422O221N009L936
52183A227675K741J165q92l332n726p580q859r969j1023j1584j1305j0418r315
52170A141578q059o669n454m734m402m070l446k409r81N33J641K167K433K775
$$ plain form
52156 1110903 1113997 1117058 1119546 1120938 1120887 1119490 1117427 1115621 1114710 1114843 1115797 1117141 1118406 1119361 1120035 1120441
52140 1120441 1120479 1120229 1119974 1119679 1118810 1117092 1115109 1113708 1113036 1112716 1112756 1113656 1115761 1119204 1124511 1132546 1143683
52123 1143683 1157610 1174132 1193556 1215906 1240254 1265322 1290507 1315947 1341790 1367762 1393390
52112 1393390 1418378 1442727 1466544 1489604 1511107 1530138 1546512 1561033 1574844 1588699 1602890
52101 1602890 1617498 1632462 1647559 1662576 1677354 1691454 1703915 1713614 1719835 1722315 1720816 1714938
52089 1714938 1704503 1690011 1672561 1653262 1632836 1611815 1590917 1570939 1552255 1534784 1518597
52078 1518597 1504246 1492211 1482300 1473992 1467187 1462131 1458758 1456693 1456006 1457376 1461243 1467219 1474615 1483186
52064 1483186 1492963 1503695 1514987 1526883 1539893 1554346 1570063 1586695 1604064 1621972 1639858
$$ packed form
52156A110903L094L061K488J392n1j397k063j806r11J33R54J344J265R55O74M06
52140A120441L8k50k55k95q69j718j983j401o72l20M0R00K105L443N307Q035J1137
52123A143683J3927J6522J9424K2350K4348K5068K5185K5440K5843K5972K5628
52112A393390K4988K4349K3817K3060K1503J9031J6374J4521J3811J3855J4191
52101A602890J4608J4964J5097J5017J4778J4100J2461R699O221K480j499n878
52089A714938j0435j4492j7450j9299k0426k1021k0898j9978j8684j7471j6187
52078A518597j4351j2035r911q308o805n056l373k065o87J370L867N976P396Q571
52064A483186R777J0732J1292J1896J3010J4453J5717J6632J7369J7908J7886
$$ plain form
52053 1639858 1656959 1672791 1687296 1700393 1711559 1720006 1725274 1727385 1726447 1722299 1714754 1704040 1690822
52040 1690822 1675884 1659911 1643420 1626622 1609402 1591683 1573804 1556309 1539387 1522811 1506516
52029 1506516 1490943 1476568 1463194 1449925 1435891 1420903 1405343 1389514 1373340 1356802 1340408
52018 1340408 1324905 1310592 1297301 1285035 1274058 1264206 1254716 1245137 1235952 1227785 1220388 1213005 1205290
52005 1205290 1197101 1187606 1175465 1160009 1141588 1120814 1098218 1074740 1051677 1029812 1009214 990030
51993 990030 972729 957263 942827 928928 915909 903841 891601 877894 862647 846581 829902
51982 829902 812369 794345 776705 759639 742457 724741 706907 689442 672320 655524 639544
51971 639544 625005 612265 601695 593862 589020 586838 586982 589616 594872 602145 610451 619267 628448 637346
$$ packed form
52053A639858J7101J5832J4505J3097J1166Q447N268K111r38m148p545j0714j3218
52040A690822j4938j5973j6491j6798j7220j7719j7879j7495j6922j6576j6295
52029A506516j5573j4375j3374j3269j4034j4988j5560j5829j6174j6538j6394
52018A340408j5503j4313j3291j2266j0977r852r490r579r185q167p397p383p715
52005A205290q189r495j2141j5456j8421k0774k2596k3478k3063k1865k0598j9184
51993I90030j7301j5466j4436j3899j3019j2068j2240j3707j5247j6066j6679
51982H29902j7533j8024j7640j7066j7182j7716j7834j7465j7122j6796j5980
51971F39544j4539j2740j0570p833m842k182J44K634N256P273Q306Q816R181Q898
$$ plain form
51957 637346 644601 648993 650231 648797 645257 639819 632302 622539 611090 599705 590601 584956 582247 581307
51943 581307 581818 584408 589499 596735 605715 616750 630410 646505 663890 681198 697436 711963 724335
51930 724335 734281 741516 745414 745190 740645 732477 721591 708235 692210 673921 654811 636565 620112
51917 620112 605606 593153 583209 576233 572317 571389 573605 579228 588019 598928 610417 620986 629442
51904 629442 634947 637118 636115 632566 627421 621760 616394 611411 606110 599504 590804 579463 565194 548321
51890 548321 529953 511437 493720 477494 463665 452959 445018 438634 433195 429431 428276 429436 431738
51877 431738 434681 439022 445782 455207 466846 480046 493942 507225 518467 526808 532150 534698 534552
51864 534552 531863 527169 521302 514907 508216 501346 494770 489358 485902 484599 484954 486223 487919 489944
$$ packed form
51957F37346P255M392J238j434l540n438p517r763j1449j1385r104n645k709r40
51943E81307N11K590N091P236Q980J1035J3660J6095J7385J7308J6238J4527J2372
51930G24335R946P235L898k24m545q168j0886j3356j6025j8289j9110j8246j6453
51917F20112j4506j2453r944o976l916r28K216N623Q791J0909J1489J0569Q456
51904F29442N505K171j003l549n145n661n366m983n301o606q700j1341j4269j6873
51890E48321j8368j8516j7717j6226j3829j0706p941o384n439l764j155J160K302
51877D31738K943M341O760R425J1639J3200J3896J3283J1242Q341N342K548j46
51864E34552k689m694n867o395o691o870o576n412l456j303L55J269J696K025
$$ plain form
51850 489944 492221 494371 495814 496077 494795 491498 485792 477950 469086 460475 452747 445872 439724 434386
51836 434386 429960 426370 423433 421029 419261 418546 419386 421847 425325 429004 432378 435182 437015 437444 436453
51821 436453 434459 431892 429011 426061 423285 420808 418761 417469 417230 417971 419467 421717 424593 427235 428487
51806 428487 428077 426803 425330 423420 420692 417587 415019 413408 412522 412043 411835 411850 412148 412903 413980 414615
51790 414615 413870 411450 408003 404737 402837 402855 404302 406019 407223 408005 408569 408462 407060 404609 402180 400606
51774 400606 399936 399922 400581 402239 405392 410608 418209 427898 438928 450651 462643 474337 484903 493634
51760 493634 500216 504524 506342 505371 501407 494609 485749 476066 466554 457390 448311 439396 431148 423878
51746 423878 417513 412000 407414 403597 400211 397390 395872 396179 398040 400962 405025 410655 417873 426220
$$ packed form
51850D89944K277K150J443K63j282l297n706p842q864q611p728o875o148n338
51836D34386m426l590k937k404j768p15Q40K461L478L679L374K804J833M29r91
51821D36453j994k567k881k950k776k477k047j292k39P41J496K250K876K642J252
51806D28487m10j274j473j910k728l105k568j611q86m79k08J5K98P55J077O35
51790D14615p45k420l447l266j900J8J447J717J204P82N64j07j402k451k429j574
51774D00606o70j4O59J658L153N216P601R689J1030J1723J1992J1694J0566Q731
51760D93634O582M308J818r71l964o798q860r683r512r164r079q915q248p270
51746D23878o365n513m586l817l386k821j518L07J861K922M063N630P218Q347
$$ plain form
51732 426220 435298 444842 454195 462124 467401 469461 468476 465132 460558 456290 453907 454396 457640 462405 466767
51717 466767 468823 467472 462941 456652 450407 445467 442248 440643 440259 440324 439780 437959 435172 432441 430731
51702 430731 430624 432421 435979 440307 443840 445481 445227 443718 441505 439004 436809 435548 435471 436434 438181
51687 438181 440268 441790 441631 439274 435137 430061 424657 419301 414451 410607 408039 406784 406869 408204 410240
51672 410240 412056 412955 412836 411926 410448 408846 408113 409475 413633 420504 429576 440194 451405 461847
51658 461847 470065 474968 476077 473644 468630 462325 455862 450262 446896 447395 452747 462628 475664 489939
51644 489939 503031 512157 515216 511852 503258 491010 476385 460580 444871 430359 417776 407559
51632 407559 399757 393893 389347 386001 384138 383657 383880 384324 385249 387118 389810 392677 395168 397066 398252
$$ packed form
51732D26220R078R544R353P929N277K060r85l344m574m268k383M89L244M765M362
51717D66767K056j351m531o289o245m940l219j605l84O5n44j821k787k731j710
51702D30731j07J797L558M328L533J641k54j509k213k501k195j261p7R63J747
51687D38181K087J522j59k357m137n076n404n356m850l844k568j255Q5J335K036
51672D10240J816Q99j19r10j478j602p33J362M158O871R072J0618J1211J0442
51658D61847Q218M903J109k433n014o305o463n600l366M99N352R881J3036J4275
51644D89939J3092R126L059l364q594j2248j4625j5805j5709j4512j2583j0217
51632D07559p802n864m546l346j863m81K23M44R25J869K692K867K491J898J186
$$ plain form
51617 398252 398526 397739 396072 394215 393175 393547 394884 396058 396385 396054 395326 393820 391079 387589 384677 383331
51601 383331 383419 384032 384326 384146 384231 385980 390664 398581 408946 420640 432959 445564 457782 468079
51587 468079 474450 475494 471264 463124 452906 442267 432509 424417 418109 413454 410921 411662 416450 424843
51573 424843 435779 448697 463591 480194 497772 515833 534509 554044 574244 594524 614176
51562 614176 632518 649356 665727 683944 706456 734630 768675 808359 853195 901655 950432
51551 950432 994830 1030315 1054084 1065463 1065008 1053441 1031588 1000970 963826 922313 878029 832410
51539 832410 787084 743404 701914 662794 626711 594758 567599 545101 526782 512123 500295
51528 500295 490172 481006 472829 465899 460052 454960 450736 447749 445898 444528 443151 441859 441017 440945 442013
$$ packed form
51617C98252K74p87j667j857j040L72J337J174L27l31p28j506k741l490k912j346
51601C83331Q8O13K94j80Q5J749M684P917J0365J1694J2319J2605J2218J0297
51587D68079O371J044m230q140j0218j0639r758q092o308m655k533P41M788Q393
51573D24843J0936J2918J4894J6603J7578J8061J8676J9535K0200K0280J9652
51562F14176J8342J6838J6371J8217K2512K8174L4045L9684M4836M8460M8777
51551I50432M4398L5485K3769J1379m55j1567k1853l0618l7144m1513m4284m5619
51539H32410m5326m3680m1490l9120l6083l1953k7159k2498j8319j4659j1828
51528E00295j0123r166q177o930n847n092m224k987j851j370j377j292q42p2J068
$$ plain form
51513 442013 444531 448215 452114 455459 458298 460887 462700 462655 460271 455957 450102 442593 433659 424664 417367
51498 417367 412543 409797 408493 408245 408474 408280 407175 405512 403837 402187 400444 399032 398618 399156 399795 399798
51482 399798 399037 397486 394882 391333 387776 385171 383432 381754 379894 378473 377848 377372 376146 373978 371159
51467 371159 367700 363469 358931 355066 352378 350448 348598 346638 344818 343401 342543 342261 342319 342352 342370 342862
51451 342862 344187 346142 348483 351598 356124 361992 368359 374606 381031 388485 397683 409021 422524 437457
51437 437457 452166 464759 474067 479906 482619 482761 481241 479234 477447 475365 471476 464559 454869 444028
51423 444028 433673 424276 415409 407011 399929 395079 392377 390868 389735 388834 388393 388644 389890 392439 396176
51408 396176 400351 404073 406893 408792 409893 410475 411126 412380 414143 415821 417145 418612 420888 423934 426913
$$ packed form
51513D42013K518L684L899L345K839K589J813m5k384m314n855p509q934q995p297
51498D17367m824k746j304k48K29j94j105j663j675j650j743j412m14N38O39L
51482C99798p61j551k604l549l557k605j739j678j860j421o25m76j226k168k819
51467C71159l459m231m538l865k688j930j850j960j820j417q58k82N8L3J8M92
51451C42862J325J955K341L115M526N868O367O247O425P454R198J1338J3503J4933
51437D37457J4709J2593R308N839K713J42j520k007j787k082l889o917r690j0841
51423D44028j0355r397q867q398p082m850k702j509j133r01m41K51J246K549L737
51408C96176M175L722K820J899J101N82O51J254J763J678J324J467K276L046K979
$$ plain form
51393 426913 428962 429985 430823 432720 436478 441974 448503 455639 463754 473733 486470 502738 523289 548751
51379 548751 579504 615852 658112 706229 759448 816884 878352 943891 1011881 1077866 1135770
51368 1135770 1180419 1209037 1220985 1216924 1198402 1167541 1126451 1076861 1020501 959759 897704
51357 897704 837260 780296 727462 678848 634755 595770 562198 533678 509518 489277 472813
51346 472813 459849 449709 441495 434264 427143 419612 411806 404306 397545 391572 386402 382218 379037 376417
51332 376417 373725 370589 367076 363650 361002 359480 358476 356831 354161 351371 349442 348211 346920 345596
51318 345596 345037 345574 346694 347929 349335 350916 352457 354263 357286 361999 367692 373385 378854 384210 388983
51303 388983 392403 394214 394560 393390 390765 387543 384807 382532 379598 375252 369869 364131 358252 352395
$$ packed form
51393D26913K049J023Q38J897L758N496O529P136Q115R979J2737J6268K0551K5462
51379E48751L0753L6348M2260M8117N3219N7436O1468O5539O7990O5985N7904
51368A135770M4649K8618J1948m061j8522l0861m1090m9590n6360o0742o2055
51357H97704o0444n6964n2834m8614m4093l8985l3572k8520k4160k0241j6464
51346D72813j2964j0140q214p231p121p531p806p500o761n973n170m184l181k620
51332C76417k692l136l513l426k648j522j004j645k670k790j929j231j291j324
51318C45596n59N37J120J235J406J581J541J806L023M713N693N693N469N356M773
51303C88983L420J811L46j170k625l222k736k275k934m346n383n738n879n857
$$ plain form
51289 352395 347158 343051 339906 337362 335635 335300 336504 338911 342329 346838 352270 358058 363754 369349
51275 369349 374823 379644 383095 385045 386064 386649 386652 385758 384362 383579 384322 386639 389995 393865 397838 401460
51259 401460 404303 406028 406195 404374 400812 396714 393333 390870 388694 386421 384182 381972 379505 376900
51245 376900 374861 373854 373608 373685 374029 374555 374666 373751 372020 370361 369406 368954 368299 366939 365037 363263 362063
51228 362063 361125 359791 357959 356168 354791 353628 352442 351354 350469 349665 349106 349493 351288 354017 356773
51213 356773 359115 361064 362621 363918 365582 368318 372155 376541 381077 385700 390271 394490 398224 401504
51199 401504 404241 406312 407853 409051 409689 409309 407791 405453 402659 399733 397070 394851 392695 390158 387564
51184 387564 385835 385371 385599 385750 385604 385295 384851 384264 383739 383524 383590 383680 383680 383857 384690 386328 388206 389478 390016
$$ packed form
51289C52395n237m107l145k544j727l35J204K407L418M509N432N788N696N595
51275C69349N474M821L451J950J019N85Lq94j396p83P43K317L356L870L973L622
51259D01460K843J725J67j821l562m098l381k463k176k273k239k210k467k605
51245C76900k039j007k46P7L44N26J11r15j731j659r55m52o55j360j902j774j200
51228C62063r38j334j832j791j377j163j186j088q85q04n59L87J795K729K756
51213C56773K342J949J557J297J664K736L837M386M536M623M571M219L734L280
51199D01504K737K071J541J198O38l80j518k338k794k926k663k219k156k537k594
51184C87564j729m64K28J51j46l09m44n87n25k15O6R0%J77Q33J638J878J272N38
$$ plain form
51165 390016 390594 391741 392837 392983 392418 392311 393211 394538 395741 397100 398997 401072 402705 403892 405090
51150 405090 406420 407483 407924 407859 407721 407803 407882 407268 405395 402419 399052 395850 392894 390094 387415 384793
51134 384793 382234 380060 378691 378111 377942 378081 378827 380214 381725 382904 383867 385027 386739 389339 393006
51119 393006 397213 400796 403000 404243 405580 407728 410837 414761 419115 423347 427180 430836 434581 438300
51105 438300 441700 444556 446554 447330 447117 446924 447579 448897 450212 451320 452268 452557 451408 448899 446176 444360
51089 444360 443639 443492 443319 442667 441318 439561 438206 438013 438982 440220 440564 439443 437279 435080 433643 433167
51073 433167 433467 434228 435061 435641 436019 436588 437622 439085 440965 443492 446867 451143 456586 463794 473281 485219
51057 485219 499791 517242 537102 557623 576387 591500 602274 609457 615319 622917 634495 650336
$$ packed form
51165C90016N78J147J096J46n65j07R00J327J203J359J897K075J633J187J198
51150D05090J330J063M41o5j38Q2P9o14j873k976l367l202k956k800k679k622
51134C84793k559k174j369n80j69J39P46J387J511J179R63J160J712K600L667
51119C93006M207L583K204J243J337K148L109L924M354M232L833L656L745L719
51105D38300L400K856J998P76k13j93O55J318J315J108R48K89j149k509k723j816
51089D44360p21j47j73o52j349j757j355j93R69J238L44j121k164k199j437m76
51073D33167L00P61Q33N80L78N69J034J463J880K527L375M276N443P208R487J1938
51057D85219J4572J7451J9860K0521J8764J5113J0774P183N862P598J1578J5841
$$ plain form
51045 650336 669127 688882 707322 722307 732880 739519 742621 741141 733701 720881 705445 690336
51033 690336 677233 666830 659141 652959 645883 635682 621567 604283 585651 568125 553826 543277
51021 543277 535431 529240 524804 522796 523467 526687 532351 540023 548552 556755 564463 572380 580924 589615
51007 589615 597647 604737 611369 618407 626537 635920 646288 657292 668650 679987 690820 700821 709996
50994 709996 718520 726532 734084 741083 747209 752048 755325 756978 757149 756374 755559 755383 755811 756633 758384 762127
50978 762127 768376 776913 787723 801207 816980 833316 848593 862962 877965 894899 914344 937080
50966 937080 964446 997471 1036090 1079535 1127182 1178882 1234782 1295032 1359500 1427557 1498154
50955 1498154 1570040 1641826 1711893 1778493 1840110 1895749 1944969 1987723 2024093 2054108 2077858
$$ packed form
51045F50336J8791J9755J8440J4985J0573O639L102j480p440j2820j5436j5109
51033F90336j3103j0403p689o182p076j0201j4115j7284j8632j7526j4299j0549
51021E43277p846o191m436k008O71L220N664P672Q529Q203P708P917Q544Q691
51007E89615Q032P090O632P038Q130R383J0368J1004J1358J1337J0833J0001R175
50994G09996Q524Q012P552O999O126M839L277J653J71p75q15j76M28Q22J751L743
50978G62127O249Q537J0810J3484J5773J6336J5277J4369J5003J6934J9445K2736
50966I37080K7366L3025L8619M3445M7647N1700N5900O0250O4468O8057P0597
50955A498154P1886P1786P0067O6600O1617N5639M9220M2754L6370L0015K3750
$$ plain form
50944 2077858 2095807 2108868 2118207 2125289 2132196 2141318 2154016 2169418 2184786 2197177 2204875 2207719
50932 2207719 2206608 2202684 2196427 2187225 2173926 2155841 2132972 2105257 2072021 2032427 1986268 1934056
50920 1934056 1876483 1814197 1748170 1680033 1611708 1544641 1479469 1416503 1356449 1300458 1249438
50909 1249438 1203513 1162274 1125361 1092535 1063266 1036713 1012313 990160 970455 952656 935541
50898 935541 918242 901003 884799 870388 857914 847262 838387 831190 825383 820697 817113 814709 813372
50885 813372 812734 812331 811773 810970 810384 810849 812913 816364 820601 825388 831022 837849 845841 854651 863914 873570
50869 873570 884117 896381 910709 926411 942371 958260 974908 993499 1014687 1038508 1064728
50858 1064728 1093168 1124048 1158200 1196680 1240112 1288733 1343187 1404736 1474373 1552122 1637627
$$ packed form
50944B077858J7949J3061R339P082O907R122J2698J5402J5368J2391P698K844
50932B207719j111l924o257r202j3299j8085k2869k7715l3236l9594m6159n2212
50920A934056n7573o2286o6027o8137o8325o7067o5172o2966o0054n5991n1020
50909A249438m5925m1239l6913l2826k9269k6553k4400k2153j9705j7799j7115
50898I35541j7299j7239j6204j4411j2474j0652q875p197n807m686l584k404j337
50885H13372o38m03n58q03n86M65K064L451M237M787N634O827P992Q810R263R656
50869H73570J0547J2264J4328J5702J5960J5889J6648J8591K1188K3821K6220
50858A064728K8440L0880L4152L8480M3432M8621N4454O1549O9637P7749Q5505
$$ plain form
50847 1637627 1731191 1833734 1945905 2067644 2198564 2338218 2485806 2639852 2798405 2959477
50837 2959477 3121044 3280463 3433813 3575984 3701846 3807718 3891950 3954407 3995857 4017922
50827 4017922 4023082 4014223 3994251 3966413 3934803 3904035 3878247 3860519 3853098 3857629 3874668 3902711
50815 3902711 3937713 3973692 4004133 4023247 4026396 4010075 3972130 3912019 3830388 3728124 3606142
50804 3606142 3466226 3311685 3146869 2976243 2804126 2634786 2472134 2319238 2178311
50795 2178311 2050843 1937342 1837223 1749548 1673871 1609996 1557166 1514141 1480070 1454583 1436782
50784 1436782 1424801 1416786 1411937 1410150 1410926 1413009 1414887 1415297 1413435 1409131 1402841 1395104 1385947 1375042
50770 1375042 1362388 1348496 1333797 1318054 1300600 1281015 1259440 1236303 1211938 1186573 1160655
$$ packed form
50847A637627R3564J02543J12171J21739J30920J39654J47588J54046J58553J61072
50837B959477J61567J59419J53350J42171J25862J05872Q4232O2457M1450K2065
50827D017922N160q859j9972k7838l1610l0768k5788j7728p421M531J7039K8043
50815C902711L5002L5979L0441J9114L149j6321l7945o0111q1631j02264j21982
50804C606142j39916j54541j64816j70626j72117j69340j62652j52896j40927
50795B178311j27468j13501j00119q7675p5677o3875n2830m3025l4071k5487j7801
50784A436782j1981q015m849j787P76K083J878M10j862m304o290p737r157j0905
50770A375042j2654j3892j4699j5743j7454j9585k1575k3137k4365k5365k5918
$$ plain form
50759 1160655 1135066 1110911 1088973 1069333 1051588 1035483 1021285 1009464 1000141 993143 988599 987029
50747 987029 988512 992036 996292 1001231 1008344 1019207 1034160 1052765 1075030 1101538 1132623 1168212
50735 1168212 1208619 1254640 1306523 1363434 1424590 1490486 1562189 1639432 1720187 1802283 1884850
50724 1884850 1967812 2050614 2132207 2212001 2290034 2365915 2438056 2504079 2561489 2607704 2640038
50713 2640038 2656454 2656507 2641394 2613299 2575098 2530583 2484349 2441022 2404404 2377000 2359790 2352352
50701 2352352 2353599 2362705 2379140 2401703 2427743 2453475 2474867 2488126 2489739 2476622 2446541 2398611
50689 2398611 2333666 2254249 2164015 2066908 1966878 1868025 1774215 1687981 1610015 1540146 1478730
50678 1478730 1426734 1384709 1352223 1328419 1312713 1304839 1304626 1312025 1327053 1349318 1377589 1410130
$$ packed form
50759A160655k5589k4155k1938j9640j7745j6105j4198j1821r323o998m544j570
50747I87029J483L524M256M939P113J0863J4953J8605K2265K6508L1085L5589
50735A168212M0407M6021N1883N6911O1156O5896P1703P7243Q0755Q2096Q2567
50724A884850Q2962Q2802Q1593P9794P8033P5881P2141O6023N7410M6215L2334
50713B640038J6416N3j5113k8095l8201m4515m6234m3327l6618k7404j7210p438
50701B352352J247R106J6435K2563K6040K5732K1392J3259J613j3117l0081m7930
50689B398611o4945p9417r0234r7107j00030r8853r3810q6234p7966o9869o1416
50678A478730n1996m2025l2486k3804j5706p874k13P399J5028K2265K8271L2541
$$ plain form
50666 1410130 1445434 1482375 1519572 1555007 1586737 1613982 1637200 1657099 1673958 1688052 1700165
50655 1700165 1711175 1721347 1730536 1738918 1746890 1754285 1760391 1765001 1768951 1773408 1779164 1786975 1798025
50642 1798025 1813488 1833845 1859036 1889032 1923921 1963605 2007766 2055925 2107149 2159895 2212445
50631 2212445 2263356 2311427 2355799 2396627 2435286 2473377 2511778 2550988 2591341 2631184 2664451
50620 2664451 2681470 2673692 2638555 2580598 2508828 2432951 2360585 2296296 2242296 2199722 2169088
50609 2169088 2149863 2140471 2139146 2144565 2155415 2169672 2184533 2196832 2203413 2201560 2189533 2166652
50597 2166652 2132781 2088009 2033115 1970045 1901557 1830320 1758347 1687059 1617661 1551514 1490170
50586 1490170 1434733 1385117 1340257 1299278 1262125 1228847 1198647 1170231 1142950 1117148 1093346
$$ packed form
50666A410130L5304L6941L7197L5435L1730K7245K3218J9899J6859J4094J2113
50655A700165J1010J0172R189Q382P972P395O106M610L950M457N756P811J1050
50642A798025J5463K0357K5191K9996L4889L9684M4161M8159N1224N2746N2550
50631B212445N0911M8071M4372M0828L8659L8091L8401L9210M0353L9843L3267
50620B664451J7019p778l5137n7957p1770p5877p2366o4289n4000m2574l0634
50609B169088j9225r392j325N419J0850J4257J4861J2299O581j853j2027k2881
50597B166652l3871m4772n4894o3070o8488p1237p1973p1288o9398o6147o1344
50586A490170n5437m9616m4860m0979l7153l3278l0200k8416k7281k5802k3802
$$ plain form
50575 1093346 1071494 1051220 1032621 1016620 1004492 997007 993944 994389 997455 1002600 1009410 1017508 1026877
50562 1026877 1037937 1050975 1065732 1081839 1099505 1119390 1141909 1167055 1194901 1225740 1259551
50551 1259551 1295661 1333145 1371251 1409193 1445874 1480315 1512376 1542652 1571581 1598980 1624672
50540 1624672 1649315 1674296 1700880 1729769 1761496 1796879 1836888 1882249 1933394 1990709 2054492
50529 2054492 2124577 2200210 2280604 2365827 2457191 2556600 2665235 2782685 2907252 3036884
50519 3036884 3169553 3302959 3434449 3561480 3681715 3792263 3889198 3968446 4027178 4064051
50509 4064051 4078265 4069035 4036123 3980491 3904161 3809683 3699889 3578001 3447864 3314266 3182962
50498 3182962 3059940 2950198 2857042 2782401 2727560 2693487 2680670 2688776 2716404 2761149 2819839
$$ packed form
50575A093346k1852k0274j8599j6001j2128p485l063M45L066N145O810Q098R369
50562A026877J1060J3038J4757J6107J7666J9885K2519K5146K7846L0839L3811
50551A259551L6110L7484L8106L7942L6681L4441L2061L0276K8929K7399K5692
50540A624672K4643K4981K6584K8889L1727L5383M0009M5361N1145N7315O3783
50529B054492P0085P5633Q0394Q5223R1364R9409J08635J17450J24567J29632
50519C036884J32669J33406J31490J27031J20235J10548R6935P9248N8732L6873
50509D064051J4214r230l2912n5632p6330r4478j09794j21888j30137j33598j31304
50498C182962j23022j09742r3156p4641n4841l4073j2817Q106K7628M4745N8690
$$ plain form
50487 2819839 2888431 2961398 3031553 3091002 3132533 3150259 3139851 3099432 3030626 2937959 2826715
50476 2826715 2701537 2566909 2427906 2289578 2155801 2029056 1910860 1801863 1701891 1610636
50466 1610636 1528358 1455630 1392567 1338559 1292459 1252619 1217192 1185177 1157158 1134461 1117533
50455 1117533 1105519 1097217 1091759 1088319 1085845 1083492 1081009 1078577 1076631 1075935 1077413 1081571 1088275 1097177
50441 1097177 1108112 1121026 1135811 1152293 1169951 1187476 1203008 1215114 1223484 1228743 1232046 1234933
50429 1234933 1238989 1245026 1252819 1261922 1272460 1284772 1298608 1313239 1328246 1343696 1359646 1376004
50417 1376004 1392982 1411241 1431464 1454119 1479813 1509485 1544056 1583997 1629353 1679960 1735571
50406 1735571 1795955 1860831 1929323 1999466 2068740 2135449 2199265 2260226 2317563 2369760 2415254
$$ packed form
50487B819839O8592P2967P0155N9449M1531J7726j0408m0419o8806r2667j11244
50476B826715j25178j34628j39003j38328j33777j26745j18196j08997r9972r1255
50466A610636q2278p2728o3063n4008m6100l9840l5427l2015k8019k2697j6928
50455A117533j2014q302n458l440k474k353k483k432j946o96J478M158O704Q902
50441A097177J0935J2914J4785J6482J7658J7525J5532J2106Q370N259L303K887
50429A234933M056O037P793R103J0538J2312J3836J4631J5007J5450J5950J6358
50417A376004J6978J8259K0223K2655K5694K9672L4571L9941M5356N0607N5611
50406A735571O0384O4876O8492P0143O9274O6709O3816O0961N7337N2197M5494
$$ plain form
50395 2415254 2452482 2479562 2494608 2496278 2483626 2455728 2412251 2354473 2285095 2207045 2123098
50384 2123098 2036632 1951659 1871491 1797970 1732375 1676386 1631512 1598197 1576307 1566040 1567456
50373 1567456 1579376 1599667 1626454 1658131 1692101 1724419 1750973 1768475 1774347 1766714 1745152 1710995
50361 1710995 1666493 1614012 1556071 1495376 1434223 1374223 1316817 1263388 1214346 1168714 1125345
50350 1125345 1084203 1045911 1010590 977987 948498 923066 902020 884794 870960 860790 854559
50339 854559 851999 852927 857952 867885 882531 900385 919350 937242 951656 960072 960787 953987 941735
50326 941735 926829 911595 897580 885845 877087 871520 868986 869249 872019 876762 882854 889971 898003
50313 898003 906565 915007 922934 930287 936762 941798 945501 949072 953797 959923 966979 974750 983355 992681
$$ packed form
50395B415254L7228K7080J5046J670j2652k7898m3477n7778o9378p8050q3947
50384B123098q6466q4973q0168p3521o5595n5989m4874l3315k1890j0267J416
50373A567456J1920K0291K6787L1677L3970L2318K6554J7502N872p633k1562l4157
50361A710995m4502n2481n7941o0695o1153o0000n7406n3429m9042m5632m3369
50350A125345m1142l8292l5321l2603k9489k5432k1046j7226j3834j0170o231
50339H54559k560R28N025R933J4646J7854J8965J7892J4414Q416P15o800j2252
50326I41735j4906j5234j4015j1735q758n567k534K63K770M743O092P117Q032
50313H98003Q562Q442P927P353O475N036L703L571M725O126P056P771Q605R326
$$ plain form
50299 992681 1002441 1012603 1023126 1033452 1043097 1052756 1064088 1078262 1095366 1115335 1138786 1166801
50287 1166801 1200594 1241383 1289138 1340053 1385507 1414892 1420719 1402087 1364412 1316432 1266623
50276 1266623 1220784 1181657 1150191 1126779 1111353 1102927 1099748 1100021 1102402 1106062 1110582 1115594 1120262
50263 1120262 1123364 1124295 1123790 1123162 1122975 1122946 1122994 1123638 1125229 1127527 1130456 1134772 1141390 1150337 1160981 1173255
50247 1173255 1188192 1207229 1231341 1260831 1295439 1334303 1376035 1419162 1462494 1505061 1545990
50236 1545990 1584772 1621602 1657223 1692322 1727128 1761346 1794148 1824082 1849136 1866958 1875006
50225 1875006 1870846 1852962 1821625 1778870 1727551 1670591 1611032 1551995 1495952 1444209 1397564
50214 1397564 1357158 1323900 1296950 1273406 1249840 1223857 1194258 1160671 1123861 1086090 1050152
$$ packed form
50299I92681R760J0162J0523J0326R645R659J1332J4174J7104J9969K3451K8015
50287A166801L3793M0789M7755N0915M5454K9385N827j8632l7675m7980m9809
50276A266623m5839l9127l1466k3412j5426q426l179K73K381L660M520N012M668
50263A120262L102R31n05o28j87k9M8O44J591K298K929M316O618Q947J0644J2274
50247A173255J4937J9037K4112K9490L4608L8864M1732M3127M3332M2567M0929
50236A545990L8782L6830L5621L5099L4806L4218L2802K9934K5054J7822Q048
50225A875006m160j7884l1337m2755n1319n6960n9559n9037n6043n1743m6645
50214A397564m0406l3258k6950k3544k3566k5983k9599l3587l6810l7771l5938
$$ plain form
50203 1050152 1017696 988687 962495 939012 918579 901242 886497 873615 861920 850865 840136
50192 840136 829791 820181 811631 804183 797593 791553 785949 780911 776534 772577 768649 764727 761180 758037
50178 758037 754534 749884 744454 739617 736299 734090 732066 730021 728421 727435 726645 725670 724616 723803 723439
50163 723439 723655 724534 725930 727509 729102 730867 733061 735936 739857 745169 751810 759422 767972 777880 789246
50148 789246 801314 813021 823777 833346 841291 847091 850788 853195 855411 858394 862831 869147 877700
50135 877700 889230 904995 926199 953420 986916 1027218 1074971 1130295 1192806 1262159 1337972
50124 1337972 1419038 1503081 1587468 1669887 1748544 1822525 1892432 1960160 2027544 2095290 2163168
50113 2163168 2230436 2295264 2353886 2401045 2431634 2442046 2430580 2397448 2344753 2275991 2195090
$$ packed form
50203A050152l2456k9009k6192k3483k0433j7337j4745j2882j1695j1055j0729
50192H40136j0345r610q550p448o590o040n604n038m377l957l928l922l547l143
50178G58037l503m650n430m837l318k209k024k045j600r86p90r75j054q13l64
50163G23439K16Q79J396J579J593J765K194K875L921N312O641P612Q550R908J1366
50148G89246J2068J1707J0756R569P945N800L697K407K216K983M437O316Q553
50135H77700J1530J5765K1204K7221L3496M0302M7753N5324O2511O9353P5813
50124A337972Q1066Q4043Q4387Q2419P8657P3981O9907O7728O7384O7746O7878
50113B163168O7268O4828N8622M7159L0589J0412j1466l3132n2695o8762q0901
$$ plain form
50102 2195090 2105688 2011118 1914587 1818992 1726574 1638887 1557111 1482230 1414844 1354891 1301752
50091 1301752 1254652 1212869 1175602 1141934 1111230 1083466 1058966 1037863 1020080 1005673 994756
50080 994756 987031 981789 978544 977297 977985 980108 983287 987817 994117 1001681 1009072 1015040 1019308 1022252
50066 1022252 1024217 1025363 1025838 1025713 1024799 1022799 1019713 1015955 1012000 1007986 1003702 998860 993284 986912 979826
50051 979826 972388 965176 958588 952508 946514 940425 934544 929421 925557 923378 923237 925326 929654 936156
50037 936156 944686 954922 966462 979122 992956 1007911 1023659 1039880 1056519 1073570 1090786 1107754
50025 1107754 1124062 1139160 1152216 1162483 1169829 1174746 1177958 1180291 1182793 1186520 1191920 1198608 1205811
50012 1205811 1212972 1219955 1227127 1235628 1247438 1264780 1289043 1320080 1356391 1395869 1436487 1476571
$$ packed form
50102B195090q9402r4570r6531r5595r2418q7687q1776p4881o7386n9953n3139
50091A301752m7100m1783l7267l3668l0704k7764k4500k1103j7783j4407j0917
50080I94756p725n242l245j247O88K123L179M530O300P564P391N968M268K944
50066A022252J965J146M75j25r14k000l086l758l955m014m284m842n576o372p086
50051I79826p438p212o588o080n994o089n881n123l864k179j41K089M328O502
50037I36156Q530J0236J1540J2660J3834J4955J5748J6221J6639J7051J7216J6968
50025A107754J6308J5098J3056J0267P346M917L212K333K502L727N400O688P203
50012A205811P161O983P172Q501J1810J7342K4263L1037L6311L9478M0618M0084
$$ plain form
50000 1476571 1514855 1550733 1584639 1618036 1652716 1689867 1729573 1770694 1810718 1845755 1871320
49989 1871320 1883692 1880702 1861365 1825309 1773103 1706995 1630779 1548617 1464055 1380017 1299192
49978 1299192 1224043 1156459 1097456 1047000 1004028 966998 934849 907337 884267 864652 847084
49967 847084 830910 816540 804503 794547 785874 777918 770626 764208 758872 754700 751559 749253 747882
49954 747882 747935 749855 753687 759278 766605 775590 785710 796050 805740 814227 821267 826879 831220 834306
49940 834306 835921 835973 834704 832265 828278 822197 814042 804363 793483 781114 766805 750461 732459
49927 732459 713650 695335 678782 664512 652246 641653 632868 626143 621317 617943 615752 614762 614968
49914 614968 616100 617646 619131 620447 621916 623900 626452 629582 633780 639846 648141 658306 669813 682413
$$ packed form
50000A476571L8284L5878L3906L3397L4680L7151L9706M1121M0024L5037K5565
49989A871320J2372k990j9337l6056n2206o6108p6216q2162q4562q4038q0825
49978A299192p5149o7584n9003n0456m2972l7030l2149k7512k3070j9615j7568
49967H47084j6174j4370j2037r956q673p956p292o418n336m172l141k306j371
49954G47882N3J920L832N591P327Q985J0120J0340R690Q487P040N612M341L086
49940H34306J615N2j269k439l987o081q155r679j0880j2369j4309j6344j8002
49927G32459j8809j8315j6553j4270j2266j0593q785o725m826l374k191r90K06
49914F14968J132J546J485J316J469J984K552L130M198O066Q295J0165J1507J2600
$$ plain form
49900 682413 695951 710193 725043 740447 755756 769627 781023 790071 797449 803139 806284 806152 802743
49887 802743 796403 787280 775367 760914 744717 728099 712447 698405 685488 672722 659702 646818
49875 646818 634599 623271 613080 604631 598454 594315 591187 588041 584633 581582 579763 579661 581248 584282
$$ packed form
49900F82413J3538J4242J4850J5404J5309J3871J1396R048P378N690L145j32l409
49887H02743o340r123j1913j4453j6197j6618j5652j4042j2917j2766j3020j2884
49875F46818j2219j1328j0191q449o177m139l128l146l408l051j819j02J587L034
$$ [...]
##END NTUPLES=NMR SPECTRUM
##END=
