
##TITLE=UV1288_M2_1207-1380_50_7534843_HtdeF4JgzA
##JCAMPDX= 6.0         $$ Bruker NMR JCAMP-DX V2.0
##DATA TYPE= NMR SPECTRUM
##DATA CLASS= NTUPLES
##ORIGIN= BRUKER
##OWNER= Administrator
$$ 1.72 TOPSPIN		Version 2.1
$$ 2013-02-21 22:25:40.372 -0500  Administrator@X
$$ Compression mode = diff/dup
##.OBSERVE FREQUENCY= 400.02188249412
##.OBSERVE NUCLEUS= ^1H
##.ACQUISITION MODE= SIMULTANEOUS (DQD)
##.ACQUISITION SCHEME= undefined
##.AVERAGES= 8
##.DIGITISER RES= 22
##SPECTROMETER/DATA SYSTEM= spect
##.PULSE SEQUENCE= zg30
##.SOLVENT NAME= COFFEE_meoh
##.SHIFT REFERENCE= INTERNAL, COFFEE_meoh, 1, 14.98509
##AUDIT TRAIL= $$ (NUMBER, WHEN, WHO, WHERE, PROCESS, VERSION, WHAT)
$$ ##TITLE= Audit trail, TOPSPIN		Version 2.1
$$ ##JCAMPDX= 5.01
$$ ##ORIGIN= Bruker BioSpin GmbH
$$ ##OWNER= Administrator
$$ $$ E:\/data/COFFEE/nmr/UV1288_M2_1207-1380_50_7534843_HtdeF4JgzA/10/pdata/1/auditp.txt
$$ ##AUDIT TRAIL=  $$ (NUMBER, WHEN, WHO, WHERE, PROCESS, VERSION, WHAT)
(   1,<2013-02-21 22:25:31.779 -0500>,<Administrator>,<X>,<go>,<TOPSPIN 2.1>,
      <created by zg
	started at 2013-02-21 22:24:26.592 -0500,
	POWCHK enabled, PULCHK disabled,
       configuration hash MD5:
       86 BA 57 50 F2 9D 5C 9B 26 00 A9 28 5F 66 2E 89
       data hash MD5: 64K
       BC 6E 55 47 56 1E E9 88 0C 69 4E 8F 64 3A 1E 0E>)
(   2,<2013-02-21 22:25:34.872 -0500>,<Administrator>,<X>,<proc1d>,<TOPSPIN 2.1>,
      <Start of raw data processing
       efp LB = 0 FT_mod = 6 PKNL = 1 PHC0 = 0 PHC1 = 0 SI = 32K 
       data hash MD5: 32K
       79 D3 A0 51 00 60 F4 FF 21 13 1F 5B DA A1 1D 84>)
(   3,<2013-02-21 22:25:35.372 -0500>,<Administrator>,<X>,<proc1d>,<TOPSPIN 2.1>,
      <pk PHC0 = 65.26978 PHC1 = 0 
       data hash MD5: 32K
       96 E4 D9 48 4B F4 D5 FB 17 E2 01 92 65 7F EC 9C>)
(   4,<2013-02-21 22:25:35.607 -0500>,<Administrator>,<X>,<proc1d>,<TOPSPIN 2.1>,
      <abs ABSG = 1 
       data hash MD5: 32K
       12 DF 15 BD A8 22 EF 0A 2B 12 72 D1 D7 40 62 DC>)
(   5,<2013-02-21 22:25:35.747 -0500>,<Administrator>,<X>,<proc1d>,<TOPSPIN 2.1>,
      <abs ABSG = 2 
       data hash MD5: 32K
       E4 78 C4 B8 59 FE F2 96 80 16 01 3F 57 EB CF D0>)
(   6,<2013-02-21 22:25:35.904 -0500>,<Administrator>,<X>,<proc1d>,<TOPSPIN 2.1>,
      <abs ABSG = 3 
       data hash MD5: 32K
       89 36 1D 02 F4 EF 36 EF 01 6F BF 4E 54 F6 AB 0A>)
(   7,<2013-02-21 22:25:36.060 -0500>,<Administrator>,<X>,<proc1d>,<TOPSPIN 2.1>,
      <abs ABSG = 4 
       data hash MD5: 32K
       24 22 64 B6 DE 74 25 00 AD D0 D4 8F F9 3D B0 7E>)
(   8,<2013-02-21 22:25:36.263 -0500>,<Administrator>,<X>,<proc1d>,<TOPSPIN 2.1>,
      <abs ABSG = 5 
       data hash MD5: 32K
       C9 79 F1 1C 2D B6 26 15 29 7B FA 1D CA E9 21 66>)
$$ ##END=
$$ 
$$ $$ hash MD5
$$ $$ E0 57 03 00 8B F8 3E B4 69 D9 44 86 47 A6 5B E6
##$RELAX= 
##$RELAX= 
##$RELAX= 
##$RELAX= 
##$RELAX= 
##$RELAX= 
##$RELAX= 
$$ Bruker specific parameters
$$ --------------------------
##$DU= <E:\>
##$EXPNO= 10
$$ [...]
##$TP= (0..7)
150 150 150 150 150 150 150 150
##$TP07= 0
##$TPNAME0= <>
##$TPNAME1= <>
##$TPNAME2= <>
##$TPNAME3= <>
##$TPNAME4= <>
##$TPNAME5= <>
##$TPNAME6= <>
##$TPNAME7= <>
##$TPOAL= (0..7)
0.5 0.5 0.5 0.5 0.5 0.5 0.5 0.5
##$TPOFFS= (0..7)
0 0 0 0 0 0 0 0
##$TUNHIN= 0
##$TUNHOUT= 0
##$TUNXOUT= 0
##$USERA1= <user>
##$USERA2= <user>
##$USERA3= <user>
##$USERA4= <user>
##$USERA5= <user>
##$V9= 5
##$VALIST= <valist>
##$VCLIST= <CCCCCCCCCCCCCCC>
##$VD= 0
##$VDLIST= <DDDDDDDDDDDDDDD>
##$VPLIST= <PPPPPPPPPPPPPPP>
##$VTLIST= <TTTTTTTTTTTTTTT>
##$WBST= 1024
##$WBSW= 4
##$XGAIN= (0..3)
0 0 0 0
##$XL= 0
##$YL= 0
##$YMAX_a= 547075
##$YMIN_a= -538930
##$ZGOPTNS= <>
##$ZL1= 120
##$ZL2= 120
##$ZL3= 120
##$ZL4= 120
##$ABSF1= 14.98509
##$ABSF2= -5.573092
##$ABSG= 5
##$ABSL= 3
##$ALPHA= 0
##$AQORDER= 0
##$ASSFAC= 0
##$ASSFACI= 0
##$ASSFACX= 0
##$ASSWID= 0
##$AUNMP= <proc_prof1d_extract_pilot.lims>
##$AXLEFT= 0
##$AXNAME= <>
##$AXNUC= <1H>
##$AXRIGHT= 0
##$AXTYPE= 0
##$AXUNIT= <>
##$AZFE= 0.1
##$AZFW= 0.1
##$BCFW= 0
##$BC_mod= 0
##$BYTORDP= 0
##$COROFFS= 0
##$CY= 15
##$DATMOD= 1
##$DC= 0
##$DFILT= <>
##$DTYPP= 0
##$F1P= 0
##$F2P= 0
##$FCOR= 0.5
##$FTSIZE= 32768
##$FT_mod= 6
##$GAMMA= 0
##$GB= 0
##$INTBC= 1
##$INTSCL= 1
##$ISEN= 128
##$LB= 0
##$LEV0= 0
##$LPBIN= 0
##$MAXI= 10000
##$MC2= 0
##$MEAN= 0
##$ME_mod= 0
##$MI= 0
##$NCOEF= 0
##$NC_proc= -8
##$NLEV= 6
##$NOISF1= 0
##$NOISF2= 0
##$NSP= 0
##$NTH_PI= 0
##$NZP= 0
##$OFFSET= 14.98509
##$PC= 1
##$PHC0= 65.26978
##$PHC1= 0
##$PH_mod= 1
##$PKNL= yes
##$PPARMOD= 0
##$PPDIAG= 0
##$PPIPTYP= 0
##$PPMPNUM= 2147483647
##$PPRESOL= 1
##$PSCAL= 4
##$PSIGN= 0
##$PYNMP= <proc.py>
##$REVERSE= no
##$SF= 400.02
##$SI= 32768
##$SIGF1= 0
##$SIGF2= 0
##$SINO= 400
##$SIOLD= 32768
##$SPECTYP= <>
##$SREGLST= <1H.CDCl3>
##$SSB= 0
##$STSI= 32768
##$STSR= 0
##$SW_p= 8223.68421052631
##$SYMM= 0
##$S_DEV= 0
##$TDeff= 65536
##$TDoff= 0
##$TI= <>
##$TILT= no
##$TM1= 0
##$TM2= 0
##$TOPLEV= 0
##$USERP1= <user>
##$USERP2= <user>
##$USERP3= <user>
##$USERP4= <user>
##$USERP5= <user>
##$WDW= 1
##$XDIM= 32768
##$YMAX_p= 451166086
##$YMIN_p= -683338
##$CURPLOT= <Network HP LaserJet P1505>
##$CURPRIN= <$Network HP LaserJet P1505>
##$DFORMAT= <normdp>
##$LAYOUT= <+/1D_H.xwp>
##$LFORMAT= <normlp>
##$PFORMAT= <normpl>
##$SURQMSG= 1
$$ End of Bruker specific parameters
$$ ---------------------------------
##NTUPLES= NMR SPECTRUM
##VAR_NAME=  FREQUENCY,     SPECTRUM/REAL,   SPECTRUM/IMAG
##SYMBOL=    X,             R,               I
##VAR_TYPE=  INDEPENDENT,   DEPENDENT,       DEPENDENT
##VAR_FORM=  AFFN,          ASDF,            ASDF
##VAR_DIM=   32768,         32768,           32768
##UNITS=     HZ,            ARBITRARY UNITS, ARBITRARY UNITS
##FACTOR=    0.250966925370066, 1,           1
##FIRST=     8223.43324360094, 67614,        25665
##LAST=      0,             -116804,         53878
##MIN=       0,             -683338,         0
##MAX=       8223.43324360094, 451166086,    0
$$ Real data points
##PAGE= N=1
##DATA TABLE= (X++(R..R)), XYDATA
$$ [...]
19546c19699F4105a46982o1598j8376c6023B47967a06417F0900a94791j31630
19536c26421a09272k10732A36364j794a6193D3247c13187A78854c14661A40616
19525B11378a77155M2591A30645e34985f9245K5159B9306J35803o6995a28558
19514b69731A1674c52081h7178C560a67920C88779A2943L6867c60293d3380h430
19502e2388r2088l65354b51779L95D1347O5101r622b85135o146P1928A52860f0716
19489A09417i8613A55959m8691c8026B61959G7187k7725b68720A26163h0521j50341
19478b30862h1440C3232C832L2649a81349g8438A42195b04919j8786b6589k6051
19467e2640A54395f9516L561B7575i4223d1885A9055b39668j3663F411d9984G3017
$$ plain form
19546 -319699 64105 -146982 -208580 -226956 -36023 247967 -106417 60900 -194791 -326421
19536 -326421 -109272 -320004 136364 134570 -16193 43247 -313187 178854 -314661 140616
19525 211378 -177155 -134564 130645 -534985 -69245 -44086 29306 165109 98114 -128558
19514 -269731 11674 -352081 -87178 3560 -167920 388779 12943 49810 -360293 -43380 -8430
19502 -52388 -144476 -509830 -251779 -251384 41347 106448 96826 -285135 -291281 -219353 152860 -60716
19489 109417 -98613 155959 107268 -38026 261959 77187 49462 -268720 126163 -80521 -230862
19478 -230862 -81440 33232 3832 36481 -181349 -78438 142195 -204919 -223705 -26589 -52640
19467 -52640 154395 -69516 -65955 27575 -94223 -41885 19055 -239668 -253331 6411 -49984 73017
19454A03162c72118J04828a26082e6821m2246D3054b78688A22245a66137A7551
19443b80382J06942A6648Q2364c72640a153j0466j3173j01149I8455k5090P597
19432H0962a26407M8789p5703f3004J8493j25387C13451g4782B24549a30847A23959
19420c3125k1753j63545E2413e8500j88340a15655a4557j4915j20069p3699I5358
19408b06815j52722Q1411A44521i0944a0292l23601G5767b03774b8412j25224
19398a53636d80A87598g5848q516k55833J40244A36190J1727a6530j03111N3761
19387f5880A47669B6646J12811c3465j87188b9892B75572e1750j4785G514M1021
19376D8535J91280i8108H307b8978F8292a10940j12347H3409J33246A07264R1023
$$ plain form
19454 103162 -372118 -267290 -126082 -56821 -99067 43054 -278688 122245 -166137 17551
19443 -280382 -173440 16648 99012 -372640 -1153 -11619 -24792 -125941 98455 73365 80962
19432 80962 -126407 -77618 -153321 -63004 -44511 -169898 313451 -74782 224549 -130847 123959
19420 -33125 -54878 -218423 52413 -58500 -246840 -115655 -14557 -29472 -149541 -223240 95358
19408 -206815 -359537 -278126 144521 -90944 -10292 -333893 75767 -203774 -28412 -153636
19398 -153636 -480 187598 -75848 -84364 -340197 -199953 136190 147917 -16530 -119641 -65880
19387 -65880 147669 26646 139457 -33465 -220653 -29892 275572 -51750 -66535 7514 48535
19376 48535 239815 -98108 8307 -28978 68292 -110940 -223287 83409 216655 107264 198287
19365A98287a89564E8818K65915F9141N9439j6392b52252j9812B9552c73640A05092
19353H583L5633N3027b57355D6726K3548J73734b11848E3452J30449B4766d6976
19341f8400A53563h5733D4669a23041A36356d2473B1311b13736O6485j83627I0502
19329F129J01545f2011k2324A13462D7946a31282b9912r1648l6173j9420H9197
19317a87326b3555E5244c11558i0736j01731P4056A6483R7661a35053A55931c34046
19305c3630J0573A35818O8771c55394d8442b2389j85957f2389j31427L5470A79268
19293b73939D0076J22336d9188j14721O2375b1402E3109O9587E5O729a0454D668
19280c24067a27918m8030P2221M0989m6946j16954J9467k12269B0073c18684N6347
$$ plain form
19365 198287 -189564 58818 324733 69141 128580 112188 -252252 -272064 29552 -373640 105092
19353 8583 44216 97243 -257355 46726 70274 244008 -211848 53452 183901 24766 -46976
19341 -68400 153563 -85733 44669 -123041 136356 -42473 21311 -213736 -147251 -330878 90502
19329 6129 107674 -62011 -84335 113462 47946 -131282 -29912 -121560 -157733 -177153 89197
19317 -187326 -23555 55244 -311558 -90736 -192467 -118411 16483 114144 -135053 155931 -334046
19305 -33630 -23057 135818 204589 -355394 -48442 -22389 -208346 -62389 -193816 -158346 179268
19293 -273939 40076 162412 -49188 -163909 -101534 -21402 53109 122696 55 6784 -10454 4668
19280 -324067 -127918 -175948 -103727 -62738 -109684 -226638 -207171 -419440 20073 -318684 -262337
19269b62337o2961a9370j05120k34542J33917A70511d02415B14177k9031h9127
19258d94947A67226a92573D876b48643a09143j0308B0394o144c71340D8750A9923
19246a0154l8265r7515A35245a37133D2240i8727j36758C32327m2360q9758N3674
19235B53883I7608B5369K2386d9130p0711c0296I5148b63176a29017A43230a26033
19223C65301d6159n8992q0789A10834J62784a3862j4167a0578r1532b9176j15242
19212a44418N2329l5807l0338g5257j67584a6991G5299a3803B13014a89807C1302
19200b46660F2405O9237l5940a63026j65243d4940B04658f1917F3774h7176j9061
19189a06237M8369j26584A35148c69034a05952d4016n08797J19956P8292a2128
$$ plain form
19269 -262337 -325298 -19370 -124490 -359032 -225115 170511 -402415 214177 185146 -89127
19258 -494947 167226 -192573 4876 -248643 -109143 -119451 20394 14250 -371340 48750 19923
19246 -10154 -48419 -145934 135245 -137133 42240 -98727 -235485 332327 289967 200209 253883
19235 253883 97608 25369 47755 -49130 -119841 -30296 95148 -263176 -129017 143230 -126033
19223 365301 -46159 -105151 -185940 110834 273618 -13862 -28029 -10578 -102110 -29176 -144418
19212 -144418 -92089 -127896 -158234 -75257 -242841 -16991 75299 -13803 213014 -189807 31302
19200 -246660 62405 131642 95702 -163026 -328269 -44940 204658 -61917 63774 -87176 -106237
19189 -106237 -57868 -184452 135148 -369034 -105952 -44016 -552813 -432857 -354565 -12128
19178i2231l8419e9778B37706g2837A8998c9469q492H9650R3518R5376b80445
19166c76646A8086b56320d9468k43987A54906e8955F9840k4674a53476f4139A6025
19154c62752f7206j37322B85618a82938c7137j36291K7266g266j77942M0045l8226
19143a83389E4550P2207e6595r5430I9200a16945n8533j99887D54395j34025f6522
19131a23733f0669A15740m2352b1614f673A56059f6997j8695l7439A3224M7778
19120F1002l464J25545c8393l50497g0813j07696k31078a85246g8900q0008b4889
19108B59854f0007o7408m9592C2436b75889a9796l53150a16288C05391n2473H7824
19096C91335a05245j00060h3351l5328B7580c72195J82028E4914K17465c7730
$$ plain form
19178 -92231 -130650 -59778 237706 -72837 18998 -39469 -47961 89650 183168 278544 -280445
19166 -376646 18086 -256320 -49468 -293455 154906 -58955 69840 45166 -153476 -64139 16025
19154 -362752 -67206 -204528 285618 -182938 -37137 -173428 -146162 -7266 -185208 -145163 -183389
19143 -183389 54550 126757 -56595 -152025 99200 -116945 -175478 -375365 454395 320370 -66522
19131 -123733 -60669 115740 73388 -21614 -6673 156059 -66997 -85692 -123131 13224 61002
19120 61002 57538 183083 -38393 -388890 -70813 -178509 -409587 -185246 -78900 -158908 -24889
19108 259854 -60007 -127415 -177007 32436 -275889 -19796 -372946 -116288 305391 252918 87824
19096 391335 -105245 -205305 -83351 -118679 27580 -372195 -190167 54914 272379 -37730
19085d55042H3828J97858G8026A6685J35855J00386c81795g5072o6942k0133k12004
19074c74151d9387j75987A28517J45419b29223r193P0893a2128o8543C3513a75257
19062B9896e6752A25519M5012i2992d069A23345J4952b46396I8752M3465J04843
19051B47060A02165a2304o9224b602C7872b0158C60609C7107a84455B7059c7392
19039i1111C67721A76081G1227R4882b1056A08696a82722A77660j0675D4149N2561
19028I6710J98349d06602A55888D767K45347e1138B03239c0671j46746M7836F5822
19016i6658p6676L2443j21362D7199B326a10058E1718O759d968j21109A0105K68771
19004B78876A3092J31908b34834B41752b39773a18515f775j65565A22149b25785
$$ plain form
19085 -455042 83828 281686 78026 16685 152540 252926 -381795 -75072 -142014 -162147 -374151
19074 -374151 -49387 -225374 128517 273936 -229223 -238416 -167523 -12128 -80671 33513 -175257
19062 29896 -56752 125519 170531 -92992 -4069 123345 138297 -246396 98752 142217 247060
19051 247060 102165 -12304 -81528 -2602 37872 -20158 360609 37107 -184455 27059 -37392
19039 -91111 367721 176081 71227 166109 -21056 108696 -182722 177660 166985 44149 96710
19028 96710 295059 -406602 155888 4767 250114 -51138 203239 -30671 -177417 -129581 65822
19016 -96658 -173334 -140891 -262253 47199 2326 -110058 51718 58477 -4968 -126077 10105 278876
19004 278876 13092 145000 -234834 241752 -239773 -118515 -6775 -172340 122149 -225785
18993c63415a3872q0215o3597p2246D2274R2184D6795a44846B29886o5411d80719
18981e9731j9738l7860B2935i7185L4924D4543b4646l6245A69572c39557a34119
18969C732d1695l4658k11454h682A3397a26657q5336A01675f3740j34971c3005
18957A7774c3634q0745l69267i6567R889L4085J9745D1996Q212R8297i6591j5932
18945a12523k23924a17818m6810O0750D9944L12556a0477A09671C4468J64705
18935A99173j3312K59734a14459N4144k85427a3566E687M0163e5932I2688b79532
18923E6547c45742d965H1283a27163j82726B05072f0290F3259b65692A43510A7247
18911i9704j09111q1027B06782a92014r1441A78043E323a28724o4537d5688D4787
$$ plain form
18993 -363415 -13872 -94087 -157684 -229930 42274 134458 46795 -144846 229886 164475 -480719
18981 -59731 -79469 -117329 22935 -97185 -62261 44543 -24646 -60891 169572 -339557 -134119
18969 3732 -41695 -76353 -287807 -8682 13397 -126657 -211993 101675 -63740 -198711 -33005
18957 17774 -33634 -114379 -483646 -96567 -86678 -52593 -32848 41996 50208 148505 -96591 -112523
18945 -112523 -336447 -117818 -164628 -103878 49944 362500 -10477 109671 34468 199173
18935 199173 185861 445595 -114459 -60315 -345742 -13566 5687 45850 -55932 92688 -279532
18923 56547 -345742 -4965 81283 -127163 -309889 205072 -60290 63259 -265692 143510 17247
18911 -99704 -208815 -289842 206782 -192014 -283455 178043 5323 -128724 -193261 -45688 44787
18899a06230j56952J31051K1793C19252b91776a02202C0851d06003a74867B04999
18888a38242k1613A1606R7443n3925b5394k24076E9649d7639j58378A74532f359
18876g1888l00103A83967c26412c2270D19203H0107A5365J7700a5348B3979J3539
18865C7518a62458G1349K00057c87842e3232k34923f8804H4778a19649j61393
18855b81042J5893A09657H761b0672k06951C9390h5863A23a59772C2839c22384
18843B61134a99159o9016B13663a59665A08226b15015m7758a15363E7160i2218
18832a96385A23834a4569A44769l7032J64123a08532E2616a51484f8586j63742
18822b32328R7437N8234r0899I9411d1033l8597p9019D66478B06828b9783a0669
$$ plain form
18899 -106230 -263182 -132131 -110338 319252 -291776 -102202 30851 -406003 -174867 204999
18888 -138242 -159855 11606 109049 55124 -25394 -249470 59649 -47639 -206017 174532 -6359
18876 -71888 -371991 183967 -326412 -32270 419203 80107 15365 33065 -15348 23979 37518
18865 37518 -162458 71349 271406 -387842 -53232 -288155 -68804 84778 -119649 -281042
18855 -281042 -265149 109657 8761 -20672 -227623 39390 -85863 123 -159772 32839 -322384
18843 261134 -199159 -268175 213663 -159665 108226 -215015 -262773 -115363 57160 -92218
18832 -196385 123834 -14569 144769 107737 271860 -108532 52616 -151484 -68586 -232328
18822 -232328 -134891 -76657 -167556 99411 -41033 -79630 -158649 466478 206828 -29783 -10669
18810F7005b95379A41784P7138f9353j68523c5161a5291G9441a14664e2001B51775
18798A38760A6599F706d208j87505A82058g9202o6611d1429A67640a85173B93987
18786b44539C1600b525B08254F9119a09030L5234E4326c36730H2832a22893O0069
18775f2824r8422j80818f2543C24971A23073f8684A98169b68305J28695I496N28288
18764E37784f6835m18455a90680c5457A70122f3914A48586b13212A22763n4435
18754F8328P5208F0976k8988d9775M528G3475e7467C2875J4786d1303b95D2276
18741d1940k14565n1041i3968M4202k52418b7098j11519k6302d0431j60293A98884
18729b59415D47615e124j54241i360B59976b63273B60137a59200l8106A35130
$$ plain form
18810 67005 -295379 141784 218922 -69353 -237876 -35161 -15291 79441 -114664 -52001 251775
18798 138760 16599 6706 -4208 -191713 182058 -79202 -145813 -41429 167640 -185173 293987
18786 -244539 31600 -2525 208254 69119 -109030 -73796 54326 -336730 82832 -122893 -62824
18775 -62824 -161246 -342064 -62543 324971 123073 -68684 198169 -268305 -139610 9496 537784
18764 537784 -66835 -485290 -190680 -35457 170122 -63914 148586 -213212 122763 68328
18754 68328 143536 60976 31988 -49775 -45247 73475 -57467 32875 47661 -41303 -295 42276
18741 -41940 -256505 -307546 -93968 -49766 -302184 -27098 -138617 -164919 -40431 -200724 198884
18729 -259415 447615 -5124 -159365 -9360 259976 -263273 260137 -159200 -197306 135130
18718c87027e3813j77157Q4292J0568A47061k2562a98783m4928r334g7648k6429
18707a04077k84567a11692I2948J4396a38957j9347f0761j58547C7249d13294
18696h5206B8838a59754A52097p0192a48390J601j90772I0248b2767k41952F9338
18684i1442A7267a54097I1170a54384k77659e473D0572a39877n387m98696a30623
18672f7271A046L4439a68469Q1054D84i2722p8729F6741N1442a72442f7141C6245
18659a00980N071A56107E1376O6632b43356M8067G6866n9g7222r1110j79493a49319
18646b95815A81534H9137a28369k75219B57194a63754d724l10627A72866L0528
18636B03394a21629F8295b828j27200j18247A90606J83987a19841e5248j99454
$$ plain form
18718 -387027 -53813 -230970 -146678 -136110 147061 124499 -198783 -243711 -253045 -77648 -104077
18707 -104077 -388644 -111692 92948 107344 -138957 -158304 -60761 -219308 37249 -413294
18696 -85206 28838 -159754 152097 81905 -148390 -146789 -337561 90248 -22767 -264719 69338
18684 -91442 17267 -154097 91170 -154384 -432043 -5473 40572 -139877 -145264 -643960 -130623
18672 -67271 1046 35485 -168469 -87415 484 -92722 -171451 66741 118183 -172442 -67141 36245
18659 -100980 -95909 156107 51376 118008 -243356 -195289 76866 76807 -77222 -168332 -347825 -149319
18646 -295815 181534 89137 -128369 -403588 257194 -163754 -4724 -315351 172866 203394
18636 203394 -121629 68295 -2828 -130028 -248275 190606 374593 -119841 -55248 -254702
18626b54702k3832M8937c1607j28200o5598A19969N044b61640A15664a26868D0979
18614a84114Q0584m42123b9741B68787G1454d2951j04896O6557A40901k3937m9292
18603F7672a39435I7708b60807H3357f3477B3823K03269b5343j00378N2416m9749
18592a23054N7697B41398d19952a75117O3651c2929A17721B9845J78858c43314
18581B20884g4527A09326a45971F7114a15391k81525A8154c8149K137j9387o1077
18570a16476b666k03420R0937m463k154A2403i3065H7242b0504l767m45370a4450
18557i9991j92072d6810k24360d5702C7010b08990q708A24296G219f589j40806
18546a47395j4421j41247a68j34753q1258f6482l4329A42872a28883j81173J31231
$$ plain form
18626 -254702 -278534 -229597 -31607 -159807 -225405 119969 125013 -261640 115664 -126868 40979
18614 -184114 -103530 -545653 -29741 268787 71454 -42951 -147847 -81290 140901 116964 67672
18603 67672 -139435 97708 -260807 83357 -63477 23823 227092 -25343 -125721 -73305 -123054
18592 -123054 -65357 241398 -419952 -175117 -111466 -32929 117721 29845 208703 -343314
18581 220884 -74527 109326 -145971 67114 -115391 -396916 18154 -38149 -36012 -55399 -116476
18570 -116476 -2666 -206086 -115149 -119612 -121766 12403 -93065 87242 -20504 -24271 -469641 -14450
18557 -99991 -292063 -46810 -271170 -45702 37010 -208990 -217698 124296 7219 -6589 -147395
18546 -147395 -161816 -303063 -168 -134921 -216179 -66482 -100811 142872 -128883 -310056 -178825
18535a78825c6771k7490K7749k14895P777E4100b08210q4814g5559E8149o155
18524E1994O260J41455m31B4899a89932K459d2984l57481A61660n3568J82064
18513B90156b51669F0871a79587j40881D1281h610k85079B56842b0059m6054A65461
18501D8225b21853D5411d9465E6983L2013l3596e4500C4460b5707j3567a5122
18489A35353a79200h5206B23306f395j40971L0366r6901C4622a36206A66868a34908
18477E9740e4378r0081j38271F2980a89548j0420j0667b3552B2691b03926R5766
18466a08160A17127f652q5051k37585R0633A66222G0530f9095F187O3442M7990
18455A17619J20275a76780M2422J7950B99497c6834A23043c01507J29494P8642
$$ plain form
18535 -178825 -36771 -64261 -36512 -251407 -243630 54100 -208210 -293024 -75559 58149 51994
18524 51994 58254 199709 199278 24899 -189932 -187473 -42984 -400465 161660 108092 290156
18513 290156 -251669 60871 -179587 -320468 41281 -8610 -293689 256842 -20059 -66113 165461
18501 48225 -221853 45411 -49465 56983 88996 55400 -54500 34460 -25707 -39274 -15122
18489 135353 -179200 -85206 223306 -6395 -147366 -117000 -213901 34622 -136206 166868 -134908
18477 59740 -54378 -144459 -282730 62980 -189548 -199968 -210635 -23552 22691 -203926 -108160
18466 -108160 117127 -6652 -91703 -329288 -238655 166222 70530 -69095 6187 69629 117619
18455 117619 237894 -176780 -134358 -116408 299497 -36834 123043 -301507 -172013 -93371
18445i3371H4519a59686j3695A12244e3515A64132b59298n3672a42141A50795
18434d04071J96012j04549h4758o8906j39740A25102a73172k44060A00504L21931
18424D22435a28167c890l1597A58852R4432F4301a00712B56641e9181B35378N2406
18413B87784g9242c4447j89459d8117j8272j154K8916A31155l6011O7910a8344
18401D6366M3817J37810C7048a31258A19212R709e2906K4204A87933o1577K265
18390A28621b39250K5264m8477o8154A4537a56510D2941K5789b741k57247d9222
18378c4820A93362m2168a80062E5586k2918b99615g5818c7275m48574b7482j71852
18367a99334A28183j4865a84374A07205b70666C18350a79282A25298L25267A96196
$$ plain form
18445 -93371 84519 -159686 -173381 112244 -53515 164132 -259298 -312970 -142141 150795
18434 -404071 -208059 -312608 -84758 -153664 -293404 125102 -173172 -417232 100504 422435
18424 422435 -128167 -3890 -35487 158852 253284 64301 -100712 256641 -59181 235378 287784
18413 287784 -79242 -34447 -223906 -48117 -66389 -67543 -38627 131155 95144 163054 -18344
18401 46366 90183 227993 37048 -131258 119212 128921 -52906 -28702 187933 126356 128621
18390 128621 -239250 -213986 -262463 -330617 14537 -156510 42941 68730 -2741 -259988 -49222
18378 -34820 193362 151194 -180062 55586 32668 -299615 -75818 -37275 -485849 -27482 -199334
18367 -199334 128183 113318 -184374 107205 -270666 318350 -179282 125298 450565 196196
18356c19212F4370a5116P296A23796a75710a0215l54126F7378h1459A29995j4491
18345A15504O7835L4000b03089b8813j4104f848E8694k0487N961h4110J4589A81110
18332a64081n2466A42085B3905K06040d4754j0169i33B69632r8788i9287A50794
18320a36223b7939l28214h6182C50996i9347N023k74143a81285C4308a98832P0768
18309a28064j70999f9859p7007A01229b7251B95206a56407A42049J2070N055b51372
18297a0124j3909n1888A03730L028J0423i4982D9776K9331g0747k22796a35643
18285A47049a70308E1630Q2163b3156n3835m9484N1123A48717c34049i3787A53411
18273e986q0268j29605E3753o400O0582A5444K3077a15877E1242c5294B01069
$$ plain form
18356 -319212 64370 -15116 -7820 123796 -175710 -10215 -364341 67378 -81459 129995 115504
18345 115504 183339 217339 -203089 -28813 -42917 -6848 58694 38207 44168 -84110 -69521 181110
18332 -164081 -216547 142085 23905 229945 -44754 -54923 -933 269632 170844 -99287 150794
18320 -136223 -27939 -356153 -86182 350996 -99347 -94324 -368467 -181285 34308 -198832 -128064
18309 -128064 -299063 -69859 -146866 101229 -27251 295206 -156407 142049 154119 159174 -251372
18297 -10124 -24033 -75921 103730 106758 117181 -94982 49776 79107 -70747 -293543 -135643
18285 147049 -170308 51630 133793 -23156 -76991 -126475 -75352 148717 -334049 -93787 153411
18273 -5986 -86254 -215859 53753 47353 107935 15444 38521 -115877 51242 -35294 201069
18261b61752P2132m1334j96542f217j53292a2855A49426a4400G0568a25134B08831
18249a19723k34086d2194C26902c28693a32309A97444a27595j91144F6445J10431
18239A76876d9915a345k63810a09594j8350a1030j630j2162B37947A13496i8871
18227A33785h8828M4048j43790B62991c40879h9344k1319I8080a08522c3322B22926
18215a52099B04898g8935q386r944J7738B85884a9453l0183n6884A03579b07163
18203b17956i7876F0998d0437G076c6876o9993a2572o6467A16545a12433K71A4267
18190H2382i225D7407K06144G7350J150a50681b9145m0579n1715n9061L9700j12540
18178b53340D2638e5328j74982h3659k58737D4533a3574j30686e7836B53207f4075
$$ plain form
18261 -261752 -189620 -230954 -427496 -6217 -159509 -12855 149426 -14400 70568 -125134 208831
18249 -119723 -353809 -42194 326902 -328693 -132309 197444 -127595 -318739 66445 176876
18239 176876 -49915 -1345 -265155 -109594 -127944 -11030 -12660 -24822 237947 113496 -98871
18227 133785 -88828 -44780 -188570 262991 -340879 -89344 -110663 98080 -108522 -33322 222926
18215 -152099 204898 -78935 -87321 -97265 -79527 285884 -19453 -49636 -106520 103579 -207163
18203 -217956 -97876 60998 -40437 7076 -36876 -106869 -12572 -79039 116545 -112433 -112162 14267
18190 82382 -9225 47407 253551 77350 78500 -150681 -29145 -69724 -121439 -180500 -140800 -253340
18178 -253340 42638 -55328 -230310 -83659 -342396 44533 -13574 -144260 -57836 253207 -64075
18166B69393a89553j65275a08172b3438p8997b1353B8927K18285d6722k80896
18156c27618c2440k13328O3539e2908C4320b7516j41179D2793g0127B25779a8414
18144D5798b08848B27853O38b20960b1383j56677A36126a25962L9575J6653j62067
18133b31801A10270P7764i1883j90232K6619D47965b31409C72660b48488B69459
18122a03415A80941p4266j7738b26104K0771b2942A64427a15870r7058B78670
18111h3731j46734R6919G4462b05983B53689G9240j6628K4989A5854K2464a59935
18099a12041j57311Q8015o1716F6407a06013c9445m9377F267K14304D2127J08885
18088A51012F3639f6078I6828h5426C9466b07017B27404r8215l9122J1191D7717
$$ plain form
18166 269393 -189553 -354828 -108172 -23438 -102435 -21353 28927 247212 -46722 -327618
18156 -327618 -32440 -245768 -182229 -52908 34320 -27516 -168695 42793 -70127 225779 -18414
18144 45798 -208848 227853 228491 -220960 -21383 -178060 136126 -125962 -86387 -69734 -231801
18133 -231801 110270 188034 -91883 -282115 -255496 447965 -231409 372660 -248488 269459
18122 -103415 180941 106675 88937 -226104 -205333 -22942 164427 -115870 -212928 278670
18111 -83731 -230465 -133546 74462 -205983 253689 79240 62612 87601 15854 38318 -159935
18099 -112041 -269352 -181337 -243053 66407 -106013 -39445 -88822 6267 220571 42127 151012
18088 151012 63639 -66078 96828 -85426 39466 -207017 227404 129189 90067 101258 47717
18076a00262A18248a97432D9474a60367o4073B49730A14597a86608B88592a58245
18065E8160a55984j4013M3518j04625A7196L19062b87099H2965O486J94829A32624
18053C4004P0241D2917J48722a83825q4808F6839b48615l950A48810c93421b4719
18041A51560a10934I903h6868j2803d0404E0511a76523M6458A57734G6469c3885
18029h6203C3996b36387b9030p9081C43389h8086A20886a2004j02554j48790J21179
18018a42169r3363C48501H1517d1012A15890f7484l1990j72141A64834j593G2335
18006e0278j18252I5610J25242M4803r7947R458d5308j63080A09741E3446c16101
17994I8720m0314d2309m9743j60344G1119c7733k17545P24B48548a08904A56515
$$ plain form
18076 -100262 118248 -197432 49474 -160367 -224440 249730 114597 -186608 288592 -158245
18065 58160 -155984 -169997 -126479 -231104 17196 336258 -287099 82965 89451 284280 132624
18053 34004 104245 42917 191639 -183825 -268633 66839 -248615 -252565 148810 -393421 -24719
18041 151560 -110934 9903 -86868 -99671 -40404 50511 -176523 -130065 157734 76469 -33885
18029 -86203 33996 -236387 -29030 -108111 343389 -88086 120886 -12004 -114558 -263348 -142169
18018 -142169 -235532 348501 81517 -41012 115890 -67484 -99474 -271615 164834 163241 72335
18006 -50278 -168530 95610 220852 265655 167708 177166 -45308 -208388 109741 53446 -316101
17994 98720 58406 -42309 -92052 -252396 71119 -37733 -255278 -254554 248548 -108904 156515
17982D8995a18319A58568C3482a29371d279A77526b37653E6107A0305a73648A67372
17970c01537C312b75166J13743A5288J5572Q5181F68b6143j0125j70051A82747
17958A08599B8569D979J1857K47498A13377a56639c8457j42070F5066R6572a39363
17946b73072a15233M5614C721J9309J59934K4936b88782f6180J2830A04761b12771
17934B34116i7149L216B18423d1860A9150c81373R0693a13581A61810a81542B3330
17922a26289e0655B54622j11191g0330J9437r6793D20871D1024b11398A59698
17911A8944a824A25945d50103A16817K97410j53347A12340M4968c20221b2396
17900A27931l7864A6770f4331K3206A0011g5766J7931A03732i4291A35319a79795
$$ plain form
17982 48995 -118319 158568 33482 -129371 -4279 177526 -237653 56107 10305 -173648 167372
17970 -301537 3312 -275166 -161423 15288 30860 116041 668 -26143 -36268 -206319 182747
17958 108599 28569 4979 16836 264334 113377 -156639 -38457 -180527 65066 161638 -139363
17946 -273072 -115233 -69619 3721 23030 182964 207900 -288782 -66180 -53350 104761 -212771
17934 234116 -97149 -93933 218423 -41860 19150 -381373 -290680 -113581 161810 -181542 23330
17922 -126289 -50655 254622 143431 -70330 -50893 -147686 420871 41024 -211398 159698
17911 18944 -1824 125945 -450103 116817 414227 260880 112340 157308 -320221 -22396
17900 127931 90067 16770 -64331 -41125 10011 -75766 -57835 103732 -94291 135319 -179795
17888a88491D02735C4952c63073g6142G460e3851C8388a19134B59047A350a64488
17876c62414a27209j00349L6767A0048g013A333f4021A80843l0876c42421a12903
17864B24093c6945A86274J66549b96878B59716m4837a86802I4494f5312M446B42919
17852E1602a36320A8139b70013O7983P152j2293j02185L0235B90826B5624N2168
17841G7792e468j60969N8799G79g5302B51407a81064f7996G6285c10001H9449
17829a47072D9414j0314b58578A33671b0106j36765C14267a01602k63643B32267
17818i5113A6415a34394B15235h1515r6596J8297J7612e7116j5232C40422A13648
17806b49097K6840f8262B5580K34052k7372C3834L8673A9500R0687N4038J3488
$$ plain form
17888 -188491 402735 34952 -363073 -76142 7460 -53851 38388 -119134 259047 1350 -164488
17876 -362414 -127209 -227558 -190791 10048 -7013 1333 -64021 180843 149967 -342421 -112903
17864 224093 -36945 186274 352823 -296878 259716 214879 -186802 94494 -65312 -60866 242919
17852 51602 -136320 18139 -270013 -202030 -194878 -207171 -309356 -279121 290826 25624 77792
17841 77792 -5468 -166437 -107638 779 -75302 251407 -181064 -67996 76285 -310001 89449
17829 -147072 49414 39100 -258578 133671 -20106 -156871 314267 -101602 -365245 232267
17818 -95113 16415 -134394 215235 -81515 -178111 -159814 -142202 -57116 -72348 340422 113648
17806 -249097 -222257 -68262 25580 259632 232260 33834 72507 19500 110187 164225 177713
17795A77713m1936c7515D3219J05675C8408O5694a55403c3975A46763N5956a0884
17783B63123e8507e23j02485j14887C44635A12798b02258A11489K3317a44323
17772b36833C02923r339h2194P090C24933j29057q5201O7069b78604A85390a38898
17760a90177J0687b9295B13934n5361a02123E7258a12738A19746k494a80390B78668
17748A09685C9322a66218d3674D22972A09210J40272b33320H0672R0402b84845
17737A84252A4558J17930A2743J54183H081J85895b3055C08795b05604A59139
17726a79417d5422B43420b3310m4503G3907a68435B42893c0766A54784a1830p0577
17715h2407b262m48466a68391C8490h9782h690A33940e7475B6144J25384c4778
$$ plain form
17795 177713 135777 -37515 43219 148894 38408 104102 -155403 -33975 146763 202719 -10884
17783 263123 -58507 -523 -103008 -217895 344635 112798 -202258 111489 134806 -144323
17772 -236833 302923 293584 -82194 -75104 324933 195876 110675 177744 -278604 185390 -138898
17760 -190177 -179490 -29295 213934 158573 -102123 57258 -112738 119746 117252 -180390 278668
17748 109685 39322 -166218 -43674 422972 109210 249482 -233320 80672 171074 -284845
17737 184252 14558 132488 12743 166926 8081 193976 -23055 308795 -205604 159139
17726 -179417 -45422 243420 -23310 -67813 73907 -168435 242893 -30766 154784 -11830 -82407
17715 -82407 -2262 -450728 -168391 38490 -89782 -8690 133940 -57475 26144 151528 -34778
17703a99868B18363n3930c00160A7296g700E244J64698a95805A15242a52693a4781
17691i6754J32B08223e9877B5035f2704r7408O1637B40940D9609g1078j5917A63106
17678A84920b60997J24764C7595c26379Q8172G9766l0792C045L40905C5507J38477
17667A73984m4204L4239Q5505b50942h0364A00688a24162A80408E1728a88198
17656f0670l4883B23001r4272K8251B4517L73057H569a01421B08458b9576q580
17645c8156p4362A66211d0504j20405h059j74958M8039e1411A7285J56429a23381
17633a18048J8179C80886i9322A5004J17863J6511a56284A92269r3255b41599
17622d9722r6962j1764K8712B0848J53829N1356e5884A72192e6198j21083A71418
$$ plain form
17703 -199868 218363 164433 -300160 17296 -7700 5244 169942 -195805 115242 -152693 -14781
17691 -96754 -96622 208223 -59877 25035 -62704 -160112 -98475 240940 49609 -71078 -86995 163106
17678 184920 -260997 -136233 37595 -326379 -238207 79766 48974 3045 343950 35507 173984
17667 173984 129780 164019 249524 -250942 -80364 100688 -124162 180408 51728 -188198
17656 -60670 -95553 223001 128729 156980 24517 397574 8569 -101421 208458 -29576 -38156
17645 -38156 -112518 166211 -40504 -160909 -8059 -183017 -134978 -51411 17285 173714 -123381
17633 -118048 -99869 380886 -99322 15004 132867 149378 -156284 192269 99014 -241599
17622 -49722 -146684 -158448 -129736 20848 174677 226033 -55884 172192 -56198 -177281 171418
17610c0703B05016M7132a37295A73355G2253f0377r6111C3516N7579b8003h453
17598G442a8111B10733a00587k79856a84177B40942o3343k0647a24532H2482P0472
17587A52954n2076J19053d7784G9381Q0579d7211p2711A01548K19223b64300H0840
17575h7687B65603B2781J11156d60399A1058K85072l9024b2428A18785b3695A24191
17563a36129b8374A80809H0305i58A69848m7479b13081h2413K9724B0442O16318
17552F36760a22846a3705j84114F5936L4648a7790A85487J7625a16166G6682b0046
17540A83784c7996C60171H1570M06204B2830J29419a05354E0279R855k1105a63786
17528A7066c5009n5897B25475A1506L9073a8584B06139a36695A60395q398k2368
$$ plain form
17610 -30703 205016 252148 -137295 173355 72253 -60377 -156488 33516 91095 -28003 -8453
17598 7442 -18111 210733 -100587 -380443 -184177 240942 177599 156952 -124532 82482 152954
17587 152954 100878 219931 -47784 79381 159960 -47211 -119922 101548 320771 -264300 80840
17575 -87687 265603 22781 133937 -460399 11058 296130 257106 -22428 118785 -23695 124191
17563 -136129 -28374 180809 80305 -958 169848 122369 -213081 -82413 -52689 20442 636760
17552 636760 -122846 -13705 -197819 65936 100584 -17790 185487 203112 -116166 76682 -20046
17540 183784 -37996 360171 81570 487774 22830 152249 -105354 50279 60134 39029 -163786
17528 17066 -35009 -90906 225475 11506 50579 -18584 206139 -136695 160395 151997 129629
17517A29629P3259E6852K60823d0254G7168J56369c7807C7581K36844D1223J26688
17506A67911N3997E6278R3261K2130g3952L1961j23737B64072j09928j8458a35255
17494F9255M3178L27962e4845G5796O6566M6771p7763m2749L67728A51731o4997
17483H6734a31803B19305c3447A2236J63899a06448l7986C0890J32067n8136h5800
17471d1681E6997J15836J3339J91802m4917G5085P7340C2656K71075M2862q577
17460C38016F0474c0260D40273A09559N4736k577n4Q3292M6998J71673j27821
17449C35806A53872D8836j8530K96054J52421A27814J2420J56614n041o2270r4941
17438A34596k942M63939j38896a61452B13343K09132K3843p320j99245M3867j02114
$$ plain form
17517 129629 202888 56852 317675 -40254 77168 233537 -37807 37581 274425 41223 167911
17506 167911 221908 56278 149539 171669 -73952 -41991 -165728 264072 154144 135686 -135255
17494 69255 112433 440395 -54845 75796 142362 189133 111370 68621 436349 151731 86734
17483 86734 -131803 219305 -33447 12236 176135 -106448 -144434 30890 162957 104821 -85800
17471 -41681 56997 172833 186172 377974 333057 75085 152425 32656 303731 346593 338016
17460 338016 60474 -30260 440273 109559 164295 161718 161664 244956 291954 463627 335806
17449 335806 153872 48836 30306 326360 478781 127814 140234 296848 291807 229537 134596
17438 134596 131654 595593 456697 -161452 213343 422475 446318 438998 239753 283620 181506
17427A81506M8743K0837A1236K1508J61118N7948K98806o7500c3191B80329J49729
17416D30058J11142k45380D3572J94487K41892a14578B28229H2509K1353L0704
17406A34566B5847R4221k3439R9787R7639c4866C79613r0302L3800P9309j01317
17395C01103e8808A95930m1289R3532m0111J0994J38358N3175A83942M3825d6824
17383F3206p347J0312o529B22K72502F0475P4361N2880D3274K87213B0310K55481
17371B75791B8365f1872C87207A79975L22683A24802M3210K18171A52928J78506
17361C31434K4454d7240D12159B3295R8646L19252A36177a1567A35835J76586
17351C12421a0606H9491a66214B10419q2652A3822M9568D40J79070N2078J60433
$$ plain form
17427 181506 230249 251086 11236 32744 193862 251810 550616 483116 -33191 280329 430058
17416 430058 541200 295820 43572 238059 479951 -114578 228229 82509 103862 134566
17406 134566 25847 120068 96629 196416 294055 -34866 379613 289311 323111 402420 301103
17395 301103 -58808 195930 154641 248173 208062 219056 357414 410589 183942 227767 -46824
17383 63206 55859 66171 59642 222 272724 60475 134836 187716 43274 330487 20310 275791
17371 275791 28365 -61872 387207 179975 502658 124802 168012 386183 152928 331434
17361 331434 355888 -47240 412159 23295 121941 441193 136177 -11567 135835 312421
17351 312421 -10606 89491 -166214 210419 127767 13822 63390 440 179510 231588 392021
17340C92021j48274j03704J03816C015K18091I848J17352d5733B01222g0954E7986
17328B11274H5271J92083b926D28710A92659f3299A36978K4644K91898q6629A69893
17316E1282A3170J36160d3248D7617N8919K10964C8133J35870b5761G65635D8729
17304D32229b1061D18727b9560Q030H7500O5943E1241L01757a37094A37294J17644
17293B54938A25776K359F16K52159C4936a57148b5072D39637j21062j31559n7802
17282A29214j0190h5588B58032O846A03052K17109a00233b7401D02517j50105
17272B52412E1759K85777R6361A63661N7419P7843p2144m6367H7416L27709j02247
17261C12878j0106D5509K4906B4960K45934r7273b54321B31478F9709K50138L0173
$$ plain form
17340 392021 243747 140043 243859 3015 221106 9848 127200 -45733 201222 -70954 57986
17328 211274 85271 277354 -2926 428710 192659 -63299 136978 161622 453520 366891 169893
17316 51282 13170 149330 -43248 47617 106536 317500 38133 174003 -25761 765635 48729
17304 432229 -21061 418727 -29560 -21530 87500 153443 51241 352998 -137094 137294 254938
17293 254938 125776 128135 616 252775 34936 -157148 -25072 439637 318575 187016 129214
17282 129214 119024 -85588 258032 264878 103052 320161 -100233 -27401 402517 252412
17272 252412 51759 337536 433897 163661 221080 298923 226779 180412 87416 415125 312878
17261 312878 302772 45509 70415 24960 270894 173621 -254321 231478 69709 319847 350020
17250C50020d0539C67682A67399K44562I4589b7445B72667M1254k9956j34700
17240A49265L7617o5610J28449j11129I822K00402a39308A14993C7587J59575
17230A97162J25009Q921G9356K0771O69939H0395M05745A93599M7806J15337C7097
17218D09274D4765L91691A47079n086J09070J81717q1827M3086L2190J43869A06698
17206C53737a0322D37558A58735J14973p6270J40077p1239j23800R1774J26842
17196C61092j15388i853B1577L3994K91039j71696M0017b0244D39065K08300A19069
17184C76038A76827J21917J8136k845j5649m000j02987k5241g5694D53117j82687
17173B70430K42078G6549J68521K4292N9741n0247p8645F8703L24898k1930H4591
$$ plain form
17250 350020 -40539 367682 167399 411961 94589 -27445 272667 313921 283965 149265
17240 149265 186882 121272 249721 138592 9822 210224 -139308 114993 37587 197162
17230 197162 322171 331092 79356 100127 770066 80395 486140 193599 241405 356742 37097
17218 409274 44765 436456 147079 141993 251063 432780 350953 394039 426229 570098 106698
17206 353737 -10322 437558 158735 273708 197438 337515 266276 142476 234250 361092
17196 361092 245704 -9853 21577 55571 346610 174914 214931 -20244 439065 647365 119069
17184 376038 176827 298744 316880 314035 298386 294386 191399 166158 -75694 453117 270430
17173 270430 512508 76549 245070 269362 329103 278856 200211 68703 393601 371671 84591
17161D52263L8051j93562b1479C91535j50704j03569K96168a03389A20620K83311
17151D03931H9897O0427l4621k6168J16637r3753D258M22130A52995K35240p8141
17140C10094P7470I0980J29510n007M5112J77003k5317j09093J15524j82609K0068
17129B56171P4611K02307M4710j39354n7531j39073o4843P7126C5060L89007j02196
17118C21871A58897B9666N39272j19621k14065J11129j52721k8624L50881O0427
17108E76344k07728A35833J90978K95618C05762o5028K10088J76212I5534O78389
17098G73923k00827j58707j02131O5214K1735K57859j25983j42372J10885R0116
17088E89712k8112K2616B25205M96316j12648j94160j58844M65652A20513K92410
$$ plain form
17161 452263 490314 296752 -21479 391535 240831 137262 433430 -103389 120620 403931
17151 403931 89897 150324 115703 89535 206172 112419 4258 426388 152995 388235 310094
17140 310094 387564 90980 220490 215483 260595 437598 412281 303188 418712 236103 256171
17129 256171 330782 533089 577799 438445 380914 241841 176998 254124 35060 424067 321871
17118 321871 158897 29666 568938 449317 235252 346381 193660 165036 515917 576344
17108 576344 368616 135833 326811 622429 305762 240734 450822 627034 95534 773923
17098 773923 573096 414389 312258 377472 399207 657066 531083 388711 499596 589712
17088 589712 561600 584216 225205 721521 608873 414713 255869 721521 120513 412923
17078D12923R2796B05772M07831k75068K96877N2888A69919L56811K15464k53685
17068D88509J75529k59730R2144k6336J66184M7388j42572J02642A85939L73588
17058E59527j16274J27524k20287K68959j89983R6681M3507J20634m7096k83028
17048C60164N01032l60137r9884P719n2205M87456l16568K46980C73222o384K89569
17037F56407N6446k96733K40454p8726l2450N5007J83046k41213J52210K36067
17027I30515k85106l93k03549j02858K99263J04784K502j05468n402l16116L59659
17016F77831K34133J06810k92927l4977j59483L53910j77592Q9245Q9423l08464
17006E77909K75980L14252j98439P9624k02892J39395m57315J95240k2900J33851
$$ plain form
17078 412923 505719 205772 613603 338535 635412 688300 169919 526730 742194 488509
17068 488509 664038 404308 496452 470116 636300 683688 541116 643758 185939 559527
17058 559527 443253 570777 350490 619449 429466 526147 569654 690288 643192 360164
17048 360164 861196 501059 401175 408894 356689 844145 527577 774557 373222 366838 656407
17037 656407 712853 416120 656574 577848 545398 600405 783451 542238 694448 930515
17027 930515 645409 645016 441467 338609 637872 742656 745158 639690 634288 318172 677831
17016 677831 911964 1018774 725847 690870 531387 885297 707705 796950 886373 577909
17006 577909 853889 1168141 969702 1049326 846434 985829 528514 723754 700854 834705
16996H34705k27644P5741N0525k8777N04744n73448L23931m2701K87175k08473
16986I95778k35308j46942K88450L4428q3967L61149n07046J68645j09371K09171
16976I74987q3952j20767R6939J32579M7479L8723J22174j0444l60135J43092
16966I80675M4753J37080l71930J51142J41763l27584L00386j74591p9192M07523
16956A210025o9955j53928K13579k95231N8373L61631p6203J1186k44243j75502
16946H39732M91804j37497q8149L18471k11616j49567J86240J60354k18847J47725
16936A338650j37545M2180J52815n3034j27522J49676M3920j35488J04554R2751
16926A470957q6747j07687p243K14447m04682N16031j6314m54367M46184l47375
$$ plain form
16996 834705 607061 682802 733327 704550 1209294 635846 959777 917076 1204251 995778
16986 995778 760470 613528 901978 936406 852439 1213588 706542 875187 765816 974987
16976 974987 891035 770268 867207 999786 1047265 1085988 1208162 1197718 837583 980675
16966 980675 1025428 1162508 790578 941720 1083483 755899 1056285 881694 802502 1210025
16956 1210025 1140070 986142 1199721 904490 962863 1324494 1248291 1259477 1015234 839732
16946 839732 1331536 1194039 1105890 1424361 1212745 1063178 1249418 1409772 1190925 1338650
16936 1338650 1201105 1243285 1396100 1343066 1215544 1365220 1409140 1273652 1378206 1470957
16926 1470957 1384210 1276523 1269280 1483727 1079045 1595076 1578762 1124395 1570579 1223204
16916A223204J94814J00287J5994J97350k3848O7463l10195K72737n241m2537
16906A690028J44744K42684n14154J18412K24712k19651M31472k45244j59407
16897A713596L37280k51475K22642j64177K46067j60928K68139j06426p8762J1000
16887B036956L06299j16939j38376J78554R9830r8978J4572R3893K56214k13833
16877B418192J54969j61471Q4480K55850k09851j86007K46002K21763J93947j21840
16867B896034k42482K08658j1454O3595j70367L34532k83400j90732K07399J70178
16857B981961L93879m45119L21051k30723o020Q7900L11215K95329N1821j11581
16847C649713j17169K20409J40955p3714k27978M39813P9682J82257r1939P0295
$$ plain form
16916 1223204 1418018 1518305 1534299 1731649 1707801 1775264 1465069 1737806 1732565 1690028
16906 1690028 1834772 2077456 1563302 1681714 1906426 1686775 2118247 1873003 1713596
16897 1713596 2050876 1799401 2022043 1857866 2103933 1943005 2211144 2104718 2025956 2036956
16887 2036956 2343255 2226316 2087940 2266494 2366324 2267346 2281918 2375811 2632025 2418192
16877 2418192 2573161 2411690 2496170 2752020 2542169 2356162 2602164 2823927 3017874 2896034
16867 2896034 2653552 2862210 2850756 2914351 2743984 3078516 2795116 2604384 2811783 2981961
16857 2981961 3375840 2930721 3251772 3021049 3015029 3102929 3414144 3709473 3761294 3649713
16847 3649713 3532544 3752953 3893908 3820194 3592216 4032029 4111711 4293968 4202029 4272324
16837D272324j41893Q1804J50388M3957q7830M71776k30582J46361N12610l57544
16827D861371K77402r9534Q2508P242L09798K61771J84498Q0669k39547L46182
16817F072360K31528K28338j22232L09513m1673k59771L14936J33726J75603L05017
16807G347345L24797R1174J47965P9054L4792M66839K2191J36084L61526N5760
16797I067527L08702J78098K80759L35326r3387N93868K68501K56152L58334N064
16787A1558944N27475M38636J61069J76160M53240J95899L65711N80204P55192
16778A5212530L34279K35667O28401N89096M52058N55418R72004N62392P88296
16769B0330141O67622M31492O08509R15256J349607L89892J002369J205825P80135
$$ plain form
16837 4272324 4130431 4212235 4362623 4406580 4318750 4790526 4559944 4706305 5218915 4861371
16827 4861371 5138773 5039239 5121747 5128989 5438787 5700558 5885056 5965725 5726178 6072360
16817 6072360 6303888 6532226 6409994 6719507 6677834 6418063 6732999 6866725 7042328 7347345
16807 7347345 7672142 7763316 7911281 7990335 8025127 8491966 8514157 8650241 9011767 9067527
16797 9067527 9376229 9554327 9835086 10170412 10077025 10670893 10939394 11195546 11553880 11558944
16787 11558944 12086419 12525055 12686124 12862284 13315524 13511423 13877134 14457338 15212530
16778 15212530 15546809 15782476 16410877 16999973 17452031 18007449 18979453 19541845 20330141
16769 20330141 20997763 21429255 22037764 22953020 24302627 24692519 25694888 26900713 27680848
16760B7680848J291574J156972J643286P39183J752570J583941J467596J943577
16752C9259547J653071J986725J918057K592317K085073K693260K864799K517572
16744E7570421L047203L568969L311708L678311L882471M394546M513514M512235
16736H8479378N379311N539431N291166N832921O353717O617579O128286P116015
16728A36737804O540898O649647O383306O179184N739325M981049M254999L161953
16720A80628165K359280J801410k4065j234688j320576l711356l746163n024846
16712A69727161n297048o125030o638816o540465o690599p211384o664591o297453
16704A18261775o486244o487240n357637n907700n058602n243143m686863m434988
$$ plain form
16760 27680848 28972422 30129394 31772680 32511863 34264433 35848374 37315970 39259547
16752 39259547 40912618 42899343 44817400 47409717 49494790 52188050 55052849 57570421
16744 57570421 60617624 64186593 67498301 71176612 75059083 79453629 83967143 88479378
16736 88479378 93858689 99398120 104689286 110522207 116875924 123493503 129621789 136737804
16728 136737804 143278702 149928349 156311655 162490839 168230164 173211213 177466212 180628165
16720 180628165 182987445 184788855 184764790 183530102 182209526 178498170 174752007 169727161
16712 169727161 164430113 158305083 151666267 145125802 138435203 131223819 124559228 118261775
16704 118261775 111775531 105288291 99930654 94022954 88964352 83721209 79034346 74599358
16696G4599358m373168l516789l555825l404909l121147k749162l163121k152637
16688D8562600k653404k177597k085562j997486j768593j867910j510952j581343
16680C2919753j692717j319276j191833j134342j068871q53501j440761p48616
16672B3469836q86352o03205j092198p42461o93154q32929n30459o37414o89988
16663A6761676n35856l13615q77944l91438j71328n83564l39084n81357m09205
16654A2558285m32624l8579q40443J50763q69793j05400m76643K26199j68297
16645A0003468n16109n52683k39187j28747k60624M5562m0281k09828l44831k97205
16635G459535o0981k85059j97227q6314j87710m26563m8439K36836m47034r8472
$$ plain form
16696 74599358 70226190 66709401 63153576 59748667 56627520 53878358 50715237 48562600
16688 48562600 45909196 43731599 41646037 39648551 37879958 36012048 34501096 32919753
16680 32919753 31227036 29907760 28715927 27581585 26512714 25659213 24218452 23469836
16672 23469836 22583484 21980279 20888081 20145620 19452466 18619537 18089078 17451664 16761676
16663 16761676 16225820 15912205 15034261 14642823 14471495 13887931 13548847 12967490 12558285
16654 12558285 12125661 12087082 11246639 11397402 10527609 10422209 9945566 10171765 10003468
16645 10003468 9487359 8934676 8695489 8566742 8306118 8351680 8311399 8101571 7756740 7459535
16635 7459535 7398554 7113495 6916268 6829954 6642244 6215681 6167242 6404078 5957044 5858572
16625E858572M9942l06329k73822Q7195l29190M03014l05724R2330k42600j23524
16615D909864k77035k37627j81957J65680n9363K70957m62085K21213m00915J73344
16605D122076k20350k58265J07731q7578L58631m17281n8166k20305J3018J27540
16595C467051j85114q3406O0406L6970l99521Q4858K1232K22534m42712K13093
16585B995391k11288l7896j74307L63320l82131l71896M29992k54913J54619K3008
16575B533899m90474K14854J45789j50190K97626m02162n829M8690q8577J14592
16565B218218m3124j04972l8409O9702k60058J85478j49621n8206K55838l35185
16555A739661n8163l1405K54241j72907J87065o0081J75200l84136J26065m42590
$$ plain form
16625 5858572 5908514 5602185 5328363 5415558 5086368 5489382 5183658 5275988 5033388 4909864
16615 4909864 4632829 4395202 4213245 4378925 4319562 4590519 4128434 4349647 3948732 4122076
16605 4122076 3901726 3643461 3751192 3663614 4022245 3604964 3546798 3326493 3339511 3467051
16595 3467051 3281937 3198531 3258937 3295907 2896386 2981244 3002476 3225010 2782298 2995391
16585 2995391 2784103 2746207 2571900 2935220 2553089 2181193 2611185 2356272 2510891 2533899
16575 2533899 2043425 2258279 2404068 2253878 2551504 2149342 2143513 2192203 2103626 2218218
16565 2218218 2175094 2070122 2031713 2101415 1841357 2026835 1877214 1819008 2074846 1739661
16555 1739661 1681498 1650093 1904334 1731427 1918492 1858411 2033611 1649475 1775540 1332950
16545A332950L66589k80055K86456k98761M14J30400j006k71708N324J2256l4639
16534A248220R7818K40359J32918k94124r4380j36273K72534K23635n60255N3009
16524A183461N793J64650K8128q8019N8171k73719L85760l90285o6833J68112
16514A175219J02030J9466l9352M0182j76062k07037P5435K67034l71198K01350
16504A087067n5456O0917j76123K13774k65001j84824K46876k9637P3375m06653
16494E64315K97132J11622K05075j55065o5758Q5878k06683k15918K91759j15257
16484G97100j69075N6323O9949J47572M4002k34159j58784N77988E55793K09839
16474G65632j79748j4758J37383j84533J28923K23327p2913l48364O3428J59416
$$ plain form
16545 1332950 1699539 1419484 1705940 1407179 1407593 1537993 1536987 1265279 1270603 1282859 1248220
16534 1248220 1346038 1586397 1719315 1425191 1330811 1194538 1467072 1690707 1130452 1183461
16524 1183461 1189254 1353904 1382032 1294013 1352184 1078465 1464225 1073940 1007107 1175219
16514 1175219 1277249 1296715 1257363 1297545 1121483 914446 989881 1256915 885717 1087067
16504 1087067 1031611 1092528 916405 1130179 865178 680354 927230 897593 970968 564315
16494 564315 861447 973069 1178144 1023079 957321 1043199 836516 620598 912357 797100
16484 797100 628025 684348 754297 901869 945871 711712 552928 1130916 555793 765632
16474 765632 585884 571126 708509 523976 652899 876226 803313 454949 518377 677793
16464F77793L1159j29438R4130J22009J82961r1710j60012j13151J47320j76666
16454E84395J48302n3056n0153J6829j5783j98561K50325k78536K20626k39481
16444C84907K06899J40927k26866j66226L47677o2946l3230J4754j29245N4436
16434E31087p9503j05326J59452K29322l49233K58395j79307r1251k2781R4433
16424D45288k12427L76741j04240J20101j85011J20656L484B78139K01466K531
16414D82136L3974A034O16574j46458k018j3558q4135R7322A43413i4455D3156
16402B06629L88519B31783L00098p4272j15709J15280Q4187j37504m9736l1051
16392C23076L96778l47815k8502A01147J79205K22190j93901K98065f0475D34215
$$ plain form
16464 677793 708952 579514 673644 795653 978614 886904 726892 613741 761061 584395
16454 584395 732697 679641 629488 646317 630534 431973 682298 403762 624388 384907
16444 384907 591806 732733 505867 339641 687318 624372 591142 605896 476651 531087
16434 531087 451584 346258 505710 735032 385799 644194 464887 373636 350855 445288
16424 445288 232861 609602 505362 625463 440452 561108 564592 278139 479605 482136
16414 482136 516110 1034 617608 471150 469132 455574 371439 468761 143413 -94455 43156
16402 206629 595148 231783 531881 457609 341900 457180 541367 403863 354127 323076
16392 323076 719854 372039 343537 101147 280352 502542 308641 606706 -60475 434215
16381B90384m6225L27224A31620C8848J04405J74453j50376K31000C4716O9778
16371A04494a3230C1371K23524K51662B28266o7081K85708k0648I7039L48233
16361D45272A51840M4156J35260K21603B53510K4000K627K5862k5765J62867A50293
16349D00422C8945L5788K62709e8345A87421K01638j05850A41369J55218K4542
16339C21129K5810P4530q3741B0134K76355o8713Q4638E4258N6447K31670a45747
16327B77058f3720B03275P764b4569F22535B20765I0263b04995B79208J96367
16317D75575B4569J88486O2260j28552Q875K20200I6474J2553K036J34691R4567
16306C40321L1667J1752A02800J64603A12050K13743H3406L84603B03628k4833
$$ plain form
16381 290384 244159 571383 131620 38848 143253 317706 167330 398330 34716 104494
16371 104494 -13230 31371 254895 506557 228266 161185 446893 426245 97039 445272
16361 445272 151840 195996 331256 552859 253510 277510 280137 305999 280234 443101 150293
16349 400422 38945 74733 337442 -58345 187421 389059 283209 141369 296587 321129
16339 321129 346939 421469 337728 20134 296489 227776 312414 54258 110705 342375 -145747
16327 277058 -63720 203275 211039 -24569 622535 220765 90263 -204995 279208 475575
16317 475575 24569 213055 275315 146763 155638 375838 96474 109027 111063 245754 340321
16306 340321 371988 383740 102800 267403 112050 325793 83406 468009 203628 178795
16296A78795J09399d0501p6419C33559a50560B21906a18277A42156f0609A49868
16285B00222r6109Q4542K40501A71195E4596i4238B35794a30269E81061B13306
16274A27424B4923L04218m8754A14541a19400A78344H3071n906J86676b6083D8406
16262E4836K14840C4239L49612A24888N2779n7204c76755C9775Q1785b5292B99500
16250a72431j73307C36568p8649b2931B47306b2552F22599a1978A9845c5066B16720
16238B59309a65868A56501J21788k0140J74195e2920A91398o6698J73606a0261
16227B37149C4239K44043B3136K14867a65052B19024b03128E4484L2846a42255
16216c1840I1600O4016a89988a2490C56879c2801A63595a18450c2539j35665B54305
$$ plain form
16296 178795 288194 -40501 -116920 333559 -150560 221906 -118277 142156 -60609 149868
16285 200222 104113 188655 429156 171195 54596 -94238 235794 -130269 581061 213306
16274 127424 24923 329141 280387 114541 -119400 178344 83071 77165 263841 -26083 48406
16262 54836 269676 34239 383851 124888 177667 120463 -376755 39775 121560 -25292 299500
16250 -172431 -345738 336568 257919 -22931 247306 -22552 622599 -11978 19845 -35066 216720
16238 259309 -165868 156501 278289 258149 432344 -52920 191398 124700 298306 -10261
16227 237149 34239 278282 23136 238003 -165052 219024 -203128 54484 87330 -142255
16216 -31840 91600 155616 -189988 -12490 356879 -32801 163595 -118450 -32539 -168204 254305
16204I2941N8014p3665L43114a3863G6903H903M9459H668J12022J57663j29334
16193A49019P8707L8248a85559A44846c22211J1043A68205J39030D0586M42899
16183D83485i6452A24600a77204B55196f1117j12027d5241E7400e0653B10770
16172A90690H3899L2338J32028H6797a33268o2638A51173A355L33725E4853L08742
16161C63595j51863H511O0106K22078c26354F7283C1567L938J34886G4067a29569
16149A46961J65421h3766j95713A6369P2373a58410o9106K0671O9314A0909L5241
16138D6150b24293G7370L7248C811c71901d8571A6661f5384D8156a92528F7489
16126A6022a53420A20336a59656D8817g3594A13090L3839h277A09159a32735p8317
$$ plain form
16204 92941 150955 77290 420404 -13863 76903 8903 58362 8668 120690 278353 149019
16193 149019 227726 265974 -185559 144846 -322211 -311168 168205 307235 40586 483485
16183 483485 -96452 124600 -177204 255196 -61117 -173144 -45241 57400 -50653 210770
16172 190690 83899 116237 248265 86797 -133268 -195906 151173 1355 335080 54853 363595
16161 363595 211732 8511 68617 290695 -326354 67283 31567 35505 170391 74067 -129569
16149 146961 312382 -83766 -279479 16369 88742 -158410 -227516 -206845 -137531 10909 46150
16138 46150 -224293 77370 114618 3811 -371901 -48571 16661 -65384 48156 -192528 67489
16126 16022 -153420 120336 -159656 48817 -73594 113090 146929 -8277 109159 -132735 -211052
16115b11052A16132D4030c9335B03478n4180i136j48357A02342R4631O1274n7099
16104B01148a31633f049C90669b81174B28531J0840F5201a42230B64755a16957
16093d711A98469g3203j360A97539a81664a9479A33952c17011A55478n2067c51010
16081a83554o1325A54401B4977i2175n62j13669C9680L49546c76225G7402K1085
16070I8487a29301A43456c4756l18566J71326e7639C30697G0514Q3973b08637
16059H3827j6432F005i2516l2150L3120E6365K05974b03170d9670B4867J35303
16048A60170I230K62269b12976d9221A73033o5894a81428B66883j16598i1041
16037A93445r4742b2050D6220b08076P6719A03525b83986a9131B45467i8336j58679
$$ plain form
16115 -211052 116132 44030 -39335 203478 149298 -9136 -157493 102342 196973 258247 201148
16104 201148 -131633 -6049 390669 -281174 228531 239371 65201 -142230 264755 -116957
16093 -4711 198469 -73203 -74563 197539 -181664 -19479 133952 -317011 155478 103411 -351010
16081 -183554 -244879 154401 24977 -92175 -92737 -206406 39680 389226 -376225 77402 98487
16070 98487 -129301 143456 -34756 -353322 -181996 -57639 330697 70514 154487 -208637
16059 83827 67395 6005 -92516 -124666 -91546 56365 262339 -203170 -49670 24867 160170
16048 160170 9230 271499 -212976 -49221 173033 107139 -181428 266883 150285 -91041
16037 193445 98703 -22050 46220 -208076 -131357 103525 -283986 -19131 245467 -98336 -257015
16026b57015A60166F1351J14935i4604D6062J59005a1429B63465P2691a03269
16015A46137a74448a4965n0013C7810g6537A4141a96392c4033a0807I8675R8178
16004A96853d5780m88571g1947j28711d0301j64980N4115k9902l5885D9105n101
15993D4004L34546d1621n3429D7396a63544P2103A99438p1543J97187I4168h48
15981A58508i741A62137P9056a22561B64038c2995A53258E7243J27097D2354a49764
15969a54626K9290E5138J88162K06247b1109C30607a31556A31707b95801j8235
15959c14036A4076m370b64227A05779K48610a0487k99372i6596n4371j6857j17023
15948b84847p5655a5131j05852j26849B17064a0996A39188d5455k26878G3574
$$ plain form
16026 -257015 160166 61351 176286 -94604 46062 205067 -11429 263465 336156 -103269
16015 146137 -174448 -14965 -64978 37810 -76537 14141 -196392 -34033 -10807 98675 196853
16004 196853 -45780 -534351 -71947 -200658 -40301 -205281 -151166 -181068 -216953 49105 44004
15993 44004 378550 -41621 -95050 47396 -163544 -91441 199438 127895 325082 94168 -848
15981 158508 -9741 162137 241193 -122561 264038 -32995 153258 57243 184340 42354 -149764
15969 -154626 -125336 55138 243300 449547 -21109 330607 -131556 131707 -295801 -314036
15959 -314036 14076 9706 -264227 105779 354389 -10487 -309859 -96596 -150967 -167824 -284847
15948 -284847 -360502 -15131 -120983 -247832 217064 -10996 139188 -45455 -272333 73574
15937A37564M9694A6354L16000B2783a87710C84433H6669a60435N9272k26571
15927c27734a39757q5956I6932C1963a43652J9115n9026a836p4102B1220a86864
15915C328b12C8463J70406g3157p1842B02882D1997J2426J23821d62727a50230
15903A64489B7919K25611E24b61762B36817c43406E648g6465e365B04831a03393
15891i0918C49803A23179B2133O5377a75139A88628l2597j5461a60122E0610b44798
15879d0562A91423b47481A07990a07370A1222d04539a04004B76426G4355a71867
15868C5199b39542M1194B6985e5225A06079b17653J04194A48590A6274R3485J08756
15857B18515b66189F3897a0911E086P072g9222B11841D7587a16658A4019d26801
$$ plain form
15937 137564 187258 16354 332354 22783 -187710 384433 86669 -160435 -101163 -327734
15927 -327734 -139757 -225713 96932 31963 -143652 -124537 -183563 -1836 -75938 21220 -186864
15915 3328 -212 38463 208869 -73157 -144999 202882 41997 54423 178244 -462727 -150230
15903 164489 27919 253530 524 -261762 236817 -343406 5648 -76465 -5365 204831 -103393
15891 -90918 349803 123179 22133 87510 -175139 188628 156031 140570 -160122 50610 -244798
15879 -40562 191423 -247481 107990 -107370 11222 -404539 -104004 276426 74355 -171867
15868 35199 -239542 -198348 26985 -55225 106079 -217653 -113459 148590 16274 109759 218515
15857 218515 -266189 63897 -10911 5086 12158 -79222 211841 47587 -116658 14019 -426801
15845a60749I1906J06128O4766A07421m4763k0990J92266F6157b18956D6325c42822
15833B5992a97551A80462p0177a46037C047b0659D2401N0457a18416j51050g4446
15821c08765C9111a65645F6585Q81K12133f83338b67915A88114c6036A053b28970
15809F1032N7097c86648A02798A9761a52426p9807I9620R5480G31N2058i0253
15797a38846A00869k3372B8078b63149i7112K5738G8203b02532p4111A18611j2172
15786A06439C1908a17270L4983K6889j3221J8197q0073j91085C29152A7998J02614
15775A20612b37948d849A4679O8637a28573o8985m9388H8362l9194h0971n7482
15764a38453E6192J64152C3364b25662A15134i6229M1294j95389A05285J6232
$$ plain form
15845 -160749 91906 198034 262800 107421 62658 41668 233934 66157 -218956 46325 -342822
15833 25992 -197551 180462 110285 -146037 3047 -20659 42401 92858 -118416 -269466 -74446
15821 -308765 39111 -165645 66585 67466 279599 -683338 -267915 188114 -36036 1053 -228970
15809 61032 118129 -386648 102798 19761 -152426 -232233 99620 195100 731 52789 -90253
15797 -138846 100869 77497 28078 -263149 -97112 -71374 78203 -202532 -276643 118611 106439
15786 106439 31908 -117270 -82287 -55398 -68619 -50422 -130495 -321580 329152 17998 120612
15775 120612 -237948 -4849 14679 83316 -128573 -197558 -246946 88362 49168 -80971 -138453
15764 -138453 56192 220344 33364 -225662 115134 -96229 -54935 -250324 105285 121517
15754A21517f0947A19781M2690B2365c17763C03231a24956e2969C0685c14427
15743g1902A01204H942b48642j30477a00654j72755c8361r9858C09257E5874b61995
15731B42124H8805J18232i315C40634E4544K0853M5276d7888j19937B79956a77354
15719a91157B11271b1774A79523M9952a66230b253m18453a85060m5986g5892P964
15708f7928k2040o9054M4089A88221g328r9043F3250f4157C3591K4862a82735
15696a04941j82634A70313H2169N5180a81239h0351C06336A12873a38416A07901
15685b38872b362B34506q6873n6894B1891M1426a36052E1298K2073g59k27888
15674b28647j122I0425b4734A41869A4457a85056d7728q7995j1365A698b17923
$$ plain form
15754 121517 -60947 119781 162471 22365 -317763 303231 -124956 -52969 30685 -314427
15743 -71902 101204 8942 -248642 -379119 -100654 -273409 -38361 -138219 309257 55874 -261995
15731 242124 88805 207037 -9315 340634 54544 75397 120673 -47888 -167825 279956 -177354
15719 -191157 211271 -21774 179523 229475 -166230 -2253 -420706 -185060 -231046 -75892 -67928
15708 -67928 -89968 -159022 -114933 188221 -7328 -106371 63250 -64157 33591 58453 -182735
15696 -104941 -287575 170313 82169 137349 -181239 -80351 306336 112873 -138416 107901
15685 -238872 -2362 234506 147633 90739 21891 63317 -136052 51298 73371 -759 -228647
15674 -228647 -229769 90425 -24734 141869 14457 -185056 -47728 -135723 -147088 1698 -217923
15662A308R6767a82505j8686n2078A82743c88288a5737k80152A49826a87724g3012
15650a03082e591B32429B0351C2b01603f8823D1485c5140B7749c909A0756c60358
15637C40754a78512B27561b9423n0458j55122f3110D4104M63439b79500J03243
15627a76257e5662B5031a28573n177A72658m1487e323B03070J4544P4310F9017
15615F693c6518G6340d4190A40529J87971c2391k14674B94119b7707r901A9653
15603D6413a28913c7900A30409G264b13527A82899a47379B46844a217A02195B1385
15591d3845j51490A54962K4009c7645B45071f6751D06932A5133D84K27400a15434
15579H8172b761k8867C8672b55647G5875R455J39750a03784K1489J6503P322k11613
$$ plain form
15662 1308 98075 -182505 -201191 -253269 182743 -388288 -15737 -295889 149826 -187724 -73012
15650 -103082 -5591 232429 20351 32 -201603 -68823 41485 -35140 27749 -3909 10756 -360358
15637 340754 -178512 227561 -29423 -79881 -235003 -63110 44104 507543 -279500 -176257
15627 -176257 -55662 25031 -128573 -133750 172658 131171 -5323 203070 217614 291924 69017
15615 6693 -36518 76340 -44190 140529 328500 -32391 -247065 294119 -27707 -37608 19653
15603 46413 -128913 -37900 130409 7264 -213527 182899 -147379 246844 -1217 102195 21385
15591 -43845 -195335 154962 178971 -37645 245071 -66751 406932 15133 484 227884 -115434
15579 88172 -2761 -31628 38672 -255647 75875 85330 225080 -103784 -82295 -65792 -58470 -270083
15567b70083g9458A2045L21092j58817N9392a17263K5159B77540G5310i7585q678
15556a06263j31908A59494G1025J3424k0830b1066j55932P6955I7274G179d35182
15544A14018a07264d6107j02337B29584a54125Q217E6630f212j08442B62681f6047
15532a65461A86226A131L28024i0431H2703c0154r127A24015b82031D5954M0362
15521H6316J27617l3341B5849P1604J15741J74023l0460a08808A31050J53464
15511B84514p7263H1777i8040M4925F8944b8136k61716a03310A15724b91056a6483
15499A32697M3082E144b75927a0209A80498E4737b156I3944d539B05280c56280
15487A47547K06712b27594i0187j05938c1922B77579p7851G0443B8943J35536
$$ plain form
15567 -270083 -79458 12045 333137 174320 233712 -117263 -92104 277540 75310 -97585 -106263
15556 -106263 -238171 159494 71025 84449 63619 -21066 -176998 -100043 97274 7179 -435182
15544 114018 -107264 -46107 -148444 229584 -154125 -145908 56630 -6212 -114654 262681 -66047
15532 -165461 186226 1131 329155 -90431 82703 -30154 -39281 124015 -282031 45954 86316
15521 86316 213933 180592 25849 97453 213194 387217 356757 -108808 131050 284514
15511 284514 207251 81777 -98040 -53115 68944 -28136 -289852 -103310 115724 -291056 -16483
15499 132697 175779 5144 -275927 -10209 180498 54737 -2156 93944 -4539 205280 -356280
15487 147547 354259 -227594 -90187 -196125 -31922 277579 199728 70443 28943 164479
15477A64479L573F528J09686c7140A83896a55271p6664d4812q7226d1101k30350
15466b71451N8903Q4926n7666d4627j730C51933F6391a58155B35520b71541A25677
15454D1004J45616c04270a3647A65205F2341M4986J34229d6228l8425a3102G1754
15442C40716j41750L3293c3500j25937p7417M8150O3214A50917C9863J78575c81397
15430f7958A5497J03462a18932L7060C60274e8613n2417k3546B7569J6617f5816
15418B09412p9525a0879A58785J09022g5713A14855a86043r7308B82665A16064
15407B57602G202C173b22480J5978L6241c068A22283M3130K6444D2878a61768
15395A1781a11463A23139b91210k53696A7272J39044g8474q3932C93007d7042
$$ plain form
15477 164479 168052 6528 116214 -37140 183896 -155271 -231935 -44812 -132038 -41101 -271451
15466 -271451 -212548 -127622 -185288 -44627 -46357 351933 66391 -158155 235520 -271541 125677
15454 41004 186620 -304270 -13647 165205 62341 107327 241556 -46228 -84653 -13102 71754
15442 340716 198966 232259 -33500 -159437 -236854 -188704 -125490 150917 39863 218438 -381397
15430 -67958 15497 118959 -118932 -81872 360274 -58613 -111030 -134576 27569 44186 -65816
15418 209412 129887 -10879 158785 267807 -75713 114855 -186043 -283351 282665 116064
15407 257602 7202 3173 -222480 -206502 -170261 -3068 122283 165413 191857 42878 -161768
15395 11781 -111463 123139 -291210 -544906 17272 156316 -78474 -162406 393007 -47042
15384a88225A78755J4440e2533q9419C60590A58797K59494b07399N3983C15061
15373a42538A479h1096k95223J85163A24102N2009c8363G1474i1665H4617a28032
15361a66542A972J70880a15031k205a7205B43008b1208B21068a58407n5618P5554
15350a38471B3120G143a54932A5611L37892a02473b5121o5554B11863j3496a12316
15338A66389a51964A36163l3828a3652k45697B75192E3724f0058P391C7111J09131
15327A46242D7599K47521B9231c29166a29494j64327O4159B15567E0094L2926
15317H3020g9658c8491B72409f7394D01352E2969K53650a13471B33542I2831r08
15306I1923J20166H7085N3666A3499a87765P1806K6245B84307C1314Q7506k8040
$$ plain form
15384 -188225 178755 193195 -52533 -141952 360590 158797 418291 -207399 -153416 315061
15373 -142538 1479 -81096 -376319 -191156 124102 176111 -38363 71474 -91665 84617 -128032
15361 -166542 1972 172852 -115031 -117236 -17205 243008 -21208 221068 -158407 -214025 -138471
15350 -138471 23120 7143 -154932 15611 353503 -102473 -25121 -90675 211863 198367 -112316
15338 166389 -151964 136163 102335 -13652 -259349 275192 53724 -60058 -52667 37111 146242
15327 146242 47599 295120 29231 -329166 -129494 -293821 -229662 215567 50094 83020
15317 83020 -79658 -38491 272409 -67394 401352 52969 306619 -113471 233542 92831 91923
15306 91923 212089 87085 140751 13499 -187765 -115959 -89714 284307 31314 118820 90780
15295I0780d5292B22592b3980A0562i4224A80865a54207e2330B3672Q5434l0637
15284G8469a91267F543M484b15686J0927o3283Q6801B86407K82657j89511n4659
15273C24894G4673l6843R8696F3234Q0393J05700a0642l13184a49975G8659f8492
15261H7591O4811j7521R5239H5299L1030K08771j1709E8851K72028B4991K56184
15250B81175n6726L22910p1627R34359K12601j0747k11512n80454B24460q9391
15240A35069k8587p380Q7562E0097J25592G2787h2103C0140J65293K03424b15836
15228A76067B2296e7392m9348G757L8000j8952P9104N3512a60880J0449A77257
15216H2338J20330K1823K28311A58768c7065A81153O565e0735A60834a23123A71687
$$ plain form
15295 90780 -45292 222592 -23980 10562 -94224 180865 -154207 -52330 23672 109106 78469
15284 78469 -191267 6543 11027 -215686 -204759 -268042 -181241 286407 569064 379553 324894
15273 324894 74673 37830 136526 63234 143627 249327 -10642 -323826 -149975 78659 -68492
15261 87591 152402 134881 230120 85299 116329 325100 313391 58851 330879 24991 281175
15250 281175 224449 547359 475732 1410091 1622692 1611945 1400433 819979 224460 135069
15240 135069 106482 99102 186664 50097 175689 72787 -82103 30140 195433 398857 -215836
15228 176067 22296 -57392 -106740 7757 45757 26805 105909 159421 -160880 -150431 177257
15216 82338 202668 224491 452802 158768 -37065 181153 187718 -50735 160834 -123123 171687
15204a03707j8517G4953P4390J68545F0708A0791h580B70306g5514A19767g3576
15192A958Q852g8258k47557D49465F851J34348m5937b2975A59169J06181h275
15180i1256B76162c23366G109O9401g9022A30074a8525a885D13482A12043c12901
15168I1238J55333q3070l7902a07473A54904F6301R0881i2955C3574J95807o8873
15157A60508P0973J71650n0682a25533B05551M4020a85626A47362c00520F0298
15146I0960N12141e6548A88078e6544I4309c6503A42594j3397N7976B1799a08700
15134a88067D13332D0755L48009D8222J10561K9751J33945A39921b28010i3010
15123B40885q5357L1557P0029F2988M06178A03334K82473G9617i7885H7625g3744
$$ plain form
15204 -103707 -122224 74953 149343 317888 60708 10791 -8580 270306 -75514 119767 -73576
15192 1958 10810 -78258 -325815 449465 6851 141199 95262 -22975 159169 265350 -8275
15180 -91256 276162 -323366 7109 76510 -79022 130074 -18525 -1885 413482 112043 -312901
15168 91238 246571 163501 125599 -107473 154904 66301 157182 -92955 33574 229381 160508
15157 160508 231481 403131 352449 -125533 205551 249571 -185626 147362 -300520 60298
15146 90960 603101 -56548 188078 -56544 94309 -36503 142594 129197 187173 21799 -108700
15134 -188067 413332 40755 388764 48222 158783 188534 322479 139921 -228010 -93010
15123 240885 155528 187085 257114 62988 469166 103334 385807 79617 -97885 87625 -73744
15111I7243j4852e0103C60314h0868C53695A73728q2214O1351c20472B21730J81968
15100D03698j18846A36276b41061B76959a9282C60170A53711R459F8760K24334
15090B93094M4442j18938j05558K47225j18875J28000a7169F4160o744a35947
15079C12590a1462H0759J75705A5896a8883A39043d4231A08174J14951a26322
15068A13214J37217j08995F9140K4166J21646J46921b3568E62780k10079G3772
15057G8216L03120J44923C9144J19385o1603L17807B8255Q3625J22564J07006
15047C41450J41499D5550L19966d2070A47873j7249J76306G6038K24601A19210
15036b79330f8849A4747M9806Q7785k1885L26210d6608A68139j4285o5405L33509
$$ plain form
15111 97243 82391 -50103 360314 -80868 353695 173728 91514 152865 -320472 221730 403698
15100 403698 284852 136276 -241061 276959 -19282 360170 153711 163170 68760 293094
15090 293094 337536 218598 113040 360265 241390 369390 -17169 64160 57416 -135947
15079 312590 -11462 80759 256464 15896 -18883 139043 -44231 108174 223125 -126322
15068 113214 250431 141436 69140 93306 214952 361873 -23568 562780 352701 73772
15057 78216 381336 526259 39144 158529 96926 414733 28255 111880 234444 341450
15047 341450 482949 45550 365516 -42070 147873 130624 306930 76038 300639 119210
15036 -279330 -68849 14747 64553 152338 130453 456663 -46608 168139 153854 88449 421958
15025D21958A72996K45375j12755A08524d0962A37554b8719H1091K44902J1658
15015C37651j59084A2233K33130F5307d2968B11799H0993K76209j04987j25929
15005A26286k0348C8915L07213j4340j36450L7265q5099J18186J80504j56344
14995B89850o4558I4751L58472A44750K16840j46125J57626A55123O5715J28399
14985C49237F3804L68639A45858b5878B92724n9464R5239J84431B16744E4682
14974E54292B50444P3370A57224K92403A90728Q3540J54038j22539F8853K43807
14964C12660G8362P0523G848M23438G9446K82966L9835L0534B10020K18466A09583
14952A71193M521p8886J66534o2569E0081J42720K49867m9152L9210A68043K36094
$$ plain form
15025 421958 172996 418371 305616 108524 -40962 137554 -28719 81091 325993 337651
15015 337651 178567 12233 245363 65307 -42968 211799 80993 357202 252215 126286
15005 126286 105938 38915 346128 331788 195338 232603 147504 265690 446194 289850
14995 289850 225292 94751 453223 144750 361590 215465 373091 155123 220838 349237
14985 349237 63804 432443 145858 -25878 292724 233260 328499 512930 216744 54682
14974 554292 250444 323814 157224 449627 190728 274268 428306 305767 68853 312660
14964 312660 78362 148885 7848 431286 79446 362412 402247 432781 210020 428486 109583
14952 171193 175714 96828 263362 200793 50081 192801 442668 393516 432726 168043 404137
14941D04137I8110K36255m4492k8571N9445A29576Q3443K35222r7103j05668p1198
14930A74272O8837L5950q0659r6769M36133B32272a35232A52100J96484K63183
14920F11767k56524q9962K67691A75187o0119K85359J24281k35086J47183K73752
14910G10557B09434J93192j14800q0634K51528k06141o7104L66906n2761L05635
14900H05255j64159j24800o0809p251A74001K98021n408B10654J25897r0440b38054
14888E95088k0667j77276m2549n1063J01749l7713A64009L74206K1691j07599
14878D52307N5301j47644j65501N1578n4975L10198j31425J2881A66774N01518
14868F68292k38577k8248A52148O3318J4425M86033l14444A87168K29216R6653
$$ plain form
14941 404137 98110 334365 289873 261302 320747 129576 213019 448241 351138 245470 174272
14930 174272 243109 279059 198400 101631 537764 232272 -135232 152100 348584 611767
14920 611767 355243 265281 532972 175187 115068 400427 524708 289622 436805 710557
14910 710557 209434 402626 287826 207192 458720 252579 185475 552381 499620 805255
14900 805255 641096 516296 455487 448236 174001 472022 466614 210654 336551 246111 -238054
14888 595088 574421 397145 354596 303533 405282 367569 164009 538215 559906 452307
14878 452307 507608 359964 194463 246041 191066 501264 369839 382720 166774 668292
14868 668292 429715 401467 152148 215466 229891 715924 401480 187168 416384 513037
14858E13037O052k7943J28378B73482J98884J78451B82031J98541m6076K80021
14848G14517C36848Q0410L21810F0278L50470A05416L14432j00102M13198k20242
14838E12702B04946M51754k97301M8776J18449O5534n1244o9435j317n8658P1046
14827D82550j44468N3721N4033K8730J78385l8700M7789B89646K38430j70960
14817C57116L06898j77951N3885J5853K61157B67107L55247j46229L29549k10071
14807E95603p6804B24485K01451J89367j94266R2188J37045L6493C29241K13146
14797E42387o2545m17l0228L5949P3816j36099K93098B94604L79714r8296K69317
14786H45339m16583J80103j35043J39118j93213K63864o4582J18537j19502j06792
$$ plain form
14858 513037 519089 491146 619524 273482 472366 650817 282031 480572 434496 714517
14848 714517 336848 417258 739068 60278 410748 105416 419848 319746 732944 512702
14838 512702 204946 656700 359399 408175 526624 592158 540914 471479 470162 411504 482550
14827 482550 338082 391803 445836 474566 652951 614251 662040 289646 528076 357116
14817 357116 664014 486063 539948 555801 816958 267107 622354 476125 805674 595603
14807 595603 518799 224485 425936 615303 421037 513225 650270 686763 329241 542387
14797 542387 479842 479425 449197 485146 558962 422863 715961 294604 674318 576022 845339
14786 845339 428756 608859 473816 612934 419721 683585 619003 737540 618038 511246
14776E11246O0929B37110L64373m7989o0677J17084R0387q1115N3234j58713m4046
14765D69648J66251l3452N2430J10176K3056k52280J37022p8897p6093K56414
14755G74275l28591N21936l72777J23127m414k37754J76131B46233L18876j22876
14745D42233K13466O9980n5426J45916j53691p8525K47624j57327Q2900j01298
14735F55852L7287P6094k96789M62699k27274l0081J48426l04816L17908l59972
14725D79334M38159l72284K96188J31799j0253j02002j05207q7351J67474N1511
14715H87368J39179j35384j13085j7277J33215j57378q1640J68768P461l7745
14705G93482r9023J9617L55170k76967Q8594q9892J56457K00934l13355J23442
$$ plain form
14776 511246 572175 237110 601483 553494 492817 609901 700288 619173 672407 513694 469648
14765 469648 635899 602447 654877 765053 788109 535829 672851 593954 517861 774275
14755 774275 445684 967620 594843 717970 713556 475802 651933 246233 565109 442233
14745 442233 655699 725679 670253 816169 662478 583953 831577 674250 757150 655852
14735 655852 693139 769233 472444 935143 707869 677788 826214 521398 839306 479334
14725 479334 917493 545209 841397 973196 962943 860941 755734 668383 835857 887368
14715 887368 1026547 891163 778078 760801 894016 736638 654998 823766 831227 793482
14705 793482 694459 714076 1069246 792279 880873 790981 947438 1148372 835017 958459
14695I58459j72376j01289L19206K37031l40954K9004O4867k67641J36747J87352
14685A050406k91049J72869r4866M08375l50086j3375l9774J87551j27005m4902
14675H58144K66257j09111k94321L02306o8408L10180k0461n21943Q87234m89047
14665A120830j72164J68496j03828K58578o6889j17727l3282M8487l1247l4684
14655A036570J49495R6920q296n7267J7026o5244J13717l24773N74654k04895
14645A327907k55942N17132n05302P0223j01655J70520Q2483k18505K51379J12786
14635A451026j75532J41891j07330j08730L50925j05401m820J76828l73856M01904
14625A646905k41526J03972J06123K24183k82534j53035K00999k91181J19233
$$ plain form
14695 958459 786083 684794 1004000 1241031 900077 929081 993948 726307 863054 1050406
14685 1050406 759357 932226 837360 1245735 895649 882274 842500 1030051 903046 858144
14675 858144 1124401 1015290 720969 1023275 954867 1265047 1244586 722643 1609877 1120830
14665 1120830 948666 1117162 1013334 1271912 1205023 1087296 1054014 1102501 1071254 1036570
14655 1036570 1186065 1282985 1274689 1217422 1234448 1169204 1282921 958148 1532802 1327907
14645 1327907 1071965 1589097 1083795 1154018 1052363 1222883 1305366 1086861 1338240 1451026
14635 1451026 1275494 1417385 1310055 1201325 1552250 1446849 1442029 1618857 1245001 1646905
14625 1646905 1405379 1509351 1615474 1839657 1557123 1404088 1605087 1313906 1433139
14616A433139j49868N97619k41558k66156M26252j70225j15967o8666Q7518L11577
14606A843665k94926J14542J1123J7021m0259K47723j08230J06030l01827K51793
14596A846655J47891m25240M87606J5961l00532J0849L11136N2062j87631l16444
14586A642313L07625O9062k12079k67541N47060J9581j50714K27058J29585m06029
14576A905921J17172K1526J69567k14302K74527j39368J06062j16401N9953n1146
14566B133511J4633L26159o2445J1439J03933J36424j10691K61178L39971j09670
14556C044442J65522k35192N66824J76900M50686L22504P09098J712164M172871
14547A1085819R498753J8317619Q905930k2947666A1161282E147904k179273o59885
$$ plain form
14616 1433139 1283271 1880890 1639332 1373176 1799428 1629203 1513236 1444570 1532088 1843665
14606 1843665 1548739 1663281 1674404 1691425 1651166 1898889 1790659 1896689 1594862 1846655
14596 1846655 1994546 1569306 2056912 2072873 1772341 1783190 2094326 2146388 1958757 1642313
14586 1642313 1949938 2019000 1806921 1539380 2086440 2106021 1955307 2182365 2311950 1905921
14576 1905921 2023093 2044619 2214186 1999884 2274411 2135043 2241105 2124704 2184657 2133511
14566 2133511 2148144 2474303 2411858 2423297 2527230 2663654 2552963 2814141 3154112 3044442
14556 3044442 3209964 2974772 3541596 3718496 4169182 4491686 5200784 6912948 11085819
14547 11085819 20584572 38902191 47808121 24860455 11161282 5147904 2968631 2308746
14539B308746m4518P5206l63503j27640N38290n44931K4462j56471M60986r1502
14529B079125k35462N15094J8080n7554K77604j62586R1277q4651K51120o9564
14519B622483k0953O3039J42855j51366K18876k5283O442o9639K15629K13269
14509C215352m11409J08378M19886m87003M56594j21206k55810K95449j39517
14500C080714j8060k5086k5576M13339K43261j48422k43267l6745P9731N18958
14490C838847k46015J94289j93965O4166o3621J58740L52527j33091j82489R1260
14480C880648p7852K9387n682L21524P815m6142J53372j86168J54770J00606M5589
14469D377867N2463K77885k90304K45534J30908k24182K91255J94639P6285l71221
$$ plain form
14539 2308746 2264228 2339434 1975931 1848291 2386581 1841650 1866112 1709641 2170627 2079125
14529 2079125 1843663 2358757 2376837 2319283 2596887 2434301 2525578 2440927 2692047 2622483
14519 2622483 2601530 2664569 2807424 2656058 2874934 2849651 2856093 2786454 3002083 3215352
14509 3215352 2803943 2912321 3332207 2845204 3301798 3180592 2924782 3220231 3080714
14500 3080714 3062654 3037568 3011992 3425331 3668592 3520170 3276903 3240158 3319889 3838847
14490 3838847 3592832 3787121 3593156 3657322 3593701 3752441 4104968 3971877 3789388 3880648
14480 3880648 3802796 3832183 3826501 4148025 4155840 4109698 4263070 4076902 4231672 4332278 4377867
14469 4377867 4430330 4708215 4417911 4663445 4794353 4570171 4861426 5056065 5132350 4761129
14459D761129N65957m41529O0922M27645k7832j16657L93211k50750N34561m55325
14449E451332O502m89L94326m2864J16103J11771M9983J31415j02761J53993R7493
14438F366804K67642K21303j90983K40721m7078n9553L19885J29938r2766J0193
14428G166106J49110J39887K52278m6734M56431n96608M06378K40422Q2480L4862
14418H284612J09613K7835J79710k78840Q52775m2675K67164m91203M36624N60470
14408I906085l10560L60482R7701j10323J75321J48457K91693K71479J21358K39265
14398A1190958j73689K04543Q52507o02675O63013j25457O27705L551K67237M0485
14388A2948178L71748M01909L69676j80323N28755j93510K91509N40427L25504
$$ plain form
14459 4761129 5327086 4885557 4946479 5374124 5346292 5229635 5622846 5372096 5906657 5451332
14449 5451332 5457834 5457345 5851671 5808807 5924910 6036681 6086664 6218079 6115318 6269311 6366804
14438 6366804 6634446 6855749 6664766 6905487 6858409 6798856 7118741 7248679 7155913 7166106
14428 7166106 7315216 7455103 7707381 7660647 8117078 7520470 7926848 8167270 8249750 8284612
14418 8284612 8394225 8422060 8601770 8322930 9175705 9133030 9400194 8908991 9345615 9906085
14408 9906085 9595525 9956007 10053708 9943385 10118706 10267163 10558856 10830335 10951693 11190958
14398 11190958 11017269 11221812 12074319 11471644 12134657 12009200 12636905 12640456 12907693 12948178
14388 12948178 13319926 13721835 14091511 13911188 14439943 14246433 14537942 15078369 15403873
14379A5403873J45111L74881J78169L42969K59801M24571p3393R44812J55758
14370A8156552P16580k64962O41186L31700N18382L43505M09348N35579L28747
14361B1716617N30661P35609R7431P54787L47842P70732L29860O61067Q49047
14352B6793653K67689Q72283M12116N73003J052282O11899J382203M10925Q69125
14343C3245178P29732J014068J108433O44599J125363R81499J468951O88729R70342
14334D1976894J260671J596394J146591J729149J275142J219647J782232J963314
14326E3950034J461695J880461J886300J651496K366257J990909K319926K745800
14318G0252878K103595K765262K733666L359035L172076L095778L492651L904402
$$ plain form
14379 15403873 15548984 15923865 16102034 16445003 16704804 17129375 17055982 18000794 18156552
14370 18156552 18873132 18608170 19249356 19581056 20099438 20442943 20852291 21387870 21716617
14361 21716617 22247278 22982887 23080318 23835105 24182947 24953679 25283539 25944606 26793653
14352 26793653 27061342 27933625 28345741 28918744 29971026 30582925 31965128 32376053 33245178
14343 33245178 33974910 34988978 36097411 36742010 37867373 38848872 40317823 41006552 41976894
14334 41976894 43237565 44833959 45980550 47709699 48984841 50204488 51986720 53950034
14326 53950034 55411729 57292190 59178490 60829986 63196243 65187152 67507078 70252878
14318 70252878 72356473 75121735 77855401 81214436 84386512 87482290 90974941 94879343
14310I4879343L438453M398049M436318M774004M449873N315772N542691N524874
14302A32759377O054960O437229P074498P004565P714494Q031518Q929310Q656999
14294A92662950R459598J0610241J0051549J1589764J1637146J1998373J2767813
14287B70777434J3326905J3837374J3635569J4598528J4369648J4498455J4225994
14280C69269907J4126549J3727761J2377871J1943595J0167954Q763811O689181
14273D47066629L836739K62718k041430l119615k455900k833071l322004o546650
14265D30847416r547755j0845645j2476733j3594809j4063203j4565336j4565239
14258C41188696j4802590j4593740j4746642j3686742j3284158j2233628j2242007
$$ plain form
14310 94879343 98317796 102715845 107152163 111926167 116376040 121691812 127234503 132759377
14302 132759377 138814337 145251566 152326064 159330629 167045123 175076641 184005951 192662950
14294 192662950 202122548 212732789 222784338 234374102 246011248 258009621 270777434
14287 270777434 284104339 297941713 311577282 326175810 340545458 355043913 369269907
14280 369269907 383396456 397124217 409502088 421445683 431613637 440377448 447066629
14273 447066629 450903368 451166086 449124656 446005041 443549141 440716070 437394066 430847416
14265 430847416 421299661 410454016 397977283 384382474 370319271 355753935 341188696
14258 341188696 326386106 311792366 297045724 283358982 270074824 257841196 245599189
14251B45599189j1967356j1422132j0651930j0251087r694551r162876q656673
14244A73792584p742298p695221p007297p231514o464061o247998n156291n365164
14236A20882740n185305n122088m589904m073664m340017l402156l624883l483645
14228H7061078l445030l343747k725824l090078k499626k831148k405306k020089
14220F4700230k124413j799678k198520j939192k124041j687866j312850j165768
14212E0347902j738293j418012j688543j549111r29751r63233j264034j081533
14204C9715392j293630r37935r38720j086860p60776r55256r50562p52497j084541
14195C0954615p48219n66153p87037p30666r23821l83078o04238n96055q63665
$$ plain form
14251 245599189 233631833 222209701 211557771 201306684 191612133 182449257 173792584
14244 173792584 166050286 158355065 151347768 144116254 137652193 131404195 126247904 120882740
14236 120882740 115697435 110575347 105985443 101911779 97571762 94169606 90544723 87061078
14228 87061078 83616048 80272301 77546477 74456399 71956773 69125625 66720319 64700230
14220 64700230 62575817 60776139 58577619 56638427 54514386 52826520 51513670 50347902
14212 50347902 48609609 47191597 45503054 43953943 43024192 42060959 40796925 39715392
14204 39715392 38421762 37483827 36545107 35458247 34697471 33742215 32791653 32039156 30954615
14195 30954615 30206396 29640243 28853206 28122540 27198719 26815641 26211403 25615348 24751683
14186B4751683k90971n71927l01032j034393l75479n13571n03518j27019p22254
14177B0311519q4595o41868k58274l00174l78541m37041M5055p82572o38564j31651
14167A6703294L6447n66573k03544l35117o1495o93817k51284J76034k49795k60821
14157A4293329n08986j53206j53921m73281j71604m20232m0033K51716n60769
14148A2063013j345j97071k64739j11343j01117k38043j73532l66714L5754k18453
14138A0426410L867j37201l38216r5713o7763k51195l88681J93634j32381n8861
14128I153900k71577j49379R9875m42990K17685j55183l41947j96758o0374O4438
14118G917690m65685L31168j55823j58036l45006K22532k7576R11n29039N3077
$$ plain form
14186 24751683 24460712 23888785 23587753 22553360 22177881 21664310 21160792 21033773 20311519
14177 20311519 20226924 19585056 19326782 19026608 18648067 18211026 18256081 17473509 16834945 16703294
14167 16703294 16739741 16173168 15969624 15634507 15573012 14879195 14627911 14803945 14554150 14293329
14157 14293329 13784343 13631137 13477216 13003935 12832331 12412099 12372066 12623782 12063013
14148 12063013 12061668 11864597 11599858 11488515 11387398 11149355 10975823 10609109 10644863 10426410
14138 10426410 10430277 10293076 9954860 9859147 9791384 9540189 9151508 9345142 9212761 9153900
14128 9153900 8882323 8732944 8832819 8389829 8607514 8452331 8110384 7913626 7853252 7917690
14118 7917690 7452005 7783173 7627350 7469314 7124308 7346840 7319264 7320175 6791136 6844213
14108F844213J80306k50363k04351j32692M5505l21808L05954j71494j80033K25732
14098F340969k43027q0134j90403J55765l7347l30004k0683n5282J33773l51578
14088E322049M2180Q8054l12264K40669j7172p02738J51804J14738l5960K9782
14078D921142r9211p3241L130Q2894r7612m8768n9516J0143J51856k71823k94831
14067D224163J80083k30208m3102o5381K79635l48733K05576R3691j51861L6918
14057D180781j38029k47922J50014l1834j30000R8567J5560l26540k36045J81286
14047C515838J6295K36120m06701q6835L12210j58651l69581K36786J55520j50340
14037C300661k09501r6345J97688J87072k66708j3309j08010k8575M9616Q6203
$$ plain form
14108 6844213 7024519 6774156 6569805 6437113 6482618 6160810 6466764 6295270 6115237 6340969
14098 6340969 6097942 6017808 5827405 5983170 5945823 5615819 5595136 5539854 5673627 5322049
14088 5322049 5364229 5452283 5140019 5380688 5363516 4660778 4812582 4927320 4891360 4921142
14078 4921142 4821931 4748690 4751820 4834714 4737102 4688334 4628818 4638961 4790817 4518994 4224163
14067 4224163 4404246 4174038 4130936 4065555 4345190 3996457 4202033 4295724 4143863 4180781
14057 4180781 4042752 3794830 3944844 3913010 3783010 3881577 3897137 3570597 3334552 3515838
14047 3515838 3532133 3768253 3361552 3274717 3586927 3428276 3058695 3295481 3451001 3300661
14037 3300661 3091160 2994815 3192503 3379575 3112867 3099558 2991548 2962973 3012589 3098792
14027C098792k52622J04762q1674K48483m25765L7060j31101L16477j37120n2443
14017B724849r6600j15328M2917k39021j3529K55672k49130J38440K01753k38582
14007B411441o3487n4624L5396N793N8955l04334M20197j15227k5180n80240K55968
13996B044658J38871J26119k30698k85411L25548J2531N4121N76747L022176P085653
13986A2870315J7921904J7520572j7708524A4219080n997673k168214j255881
13979D797312m70166o91730l75686k84934Q684O8108m94570Q0258j28980j19652
13969B388644N0542n5629k34918R1368J40896k78407J40030k28418n4427m843
13959A954838J71588j18331J96537j64255K30700q5426J3185m73164K21789k51691
$$ plain form
14027 3098792 2846170 2950932 2869258 3117741 2691976 2729036 2597935 2914412 2777292 2724849
14017 2724849 2628249 2512921 2555838 2316817 2303288 2558960 2309830 2448270 2650023 2411441
14007 2411441 2347954 2293330 2328726 2334519 2393474 2089140 2509337 2394110 2368930 1788690 2044658
13996 2044658 2183529 2309648 2078950 1793539 2119087 2131618 2185739 2762486 5784662 12870315
13986 12870315 30792219 48312791 30604267 14219080 8221407 6053193 4797312
13979 4797312 4327146 3635416 3259730 2974796 2983480 3051588 2557018 2637276 2508296 2388644
13969 2388644 2439186 2383557 2148639 2240007 2380903 2102496 2242526 2014108 1959681 1954838
13959 1954838 2126426 2008095 2204632 2040377 2271077 2185651 2198836 1725672 1947461 1695770
13949A695770J72521J1799j198M4955J7417l25J30371l14716J75797j27666m365
13938A800360l8495J9491k09620L81009k79188k79192K73709p9256K5738J80555
13928A795111M4282j14212j96037k48704K11290R031J10904l43346K70929j17753
13918A421495r3658N11004k87186l6359m5108J56278o175k93542O6720j18574
13908A274895J4075j47270M33584M8296j95720l42640J93929K6247K17584K27074
13898A750054m00834J42011j75511J26864J50349k71985J81711k78950l6510Q9135
13888A276334J73964P7340j28386l09746K0691K95485l55766K4443J32834l1676
13878A175517M9335k28394J22260p3020P2684j38550K42688j07431j43092J57228
$$ plain form
13949 1695770 1868291 1880090 1878892 1923847 1941264 1940939 2071310 1756594 1932391 1804725 1800360
13938 1800360 1761865 1781356 1571736 1952745 1673557 1394365 1668074 1588818 1614556 1795111
13928 1795111 1839393 1725181 1529144 1280440 1491730 1500761 1611665 1268319 1539248 1421495
13918 1421495 1327837 1838841 1551655 1515296 1470188 1626466 1620291 1326749 1393469 1274895
13908 1274895 1288970 1141700 1575284 1623580 1427860 1085220 1279149 1305396 1522980 1750054
13898 1750054 1349220 1491231 1315720 1442584 1592933 1320948 1502659 1223709 1187199 1276334
13888 1276334 1450298 1527638 1399252 1089506 1110197 1405682 1049916 1074359 1207193 1175517
13878 1175517 1224852 996458 1118718 1045698 1118382 979832 1222520 1115089 971997 1129225
13868A129225j59486N09662j96275l75410p0509P3084J62997j61346K61983J11079
13858A285004j41093j39755K83253k96647J80357k82457M18974j93420k42563
13849H71653J10096O7540m057M3019m00308J40286K44817N9496k02243j15307
13839H14992J65732j38715J48279K3196j95828R9059J14112m8193j18933J47467
13829A011168m19198K72784j81542K30342O764m4433J8864k06081k3335J00462
13819G65795J75393o0457M1438m0019r1502J52396j37099m9506M54779m94064
13809G17154K0455J72205J21855k84641L72884E36214K13301p6205K75280J77206
13799A125796l12120Q5415r3608j78995J79961P5820J46865n5485k95590L46309
$$ plain form
13868 1129225 969739 1479401 1283126 907716 837207 910291 1073288 911942 1173925 1285004
13858 1285004 1143911 1004156 1287409 990762 1171119 888662 1307636 1114216 871653
13849 871653 981749 1049289 1045232 1088251 687943 828229 1073046 1132542 930299 814992
13839 814992 980724 842009 990288 1013484 817656 916715 1030827 982634 863701 1011168
13829 1011168 591970 864754 683212 913554 920318 875885 894749 688668 665333 765795
13819 765795 941188 880731 922169 882150 790648 943044 805945 756439 1211218 717154
13809 717154 737609 909814 1031669 747028 1119912 536214 749515 673310 948590 1125796
13799 1125796 813676 899091 805483 626488 806449 882269 1029134 973649 678059 1024368
13789A024368K1513m08262J31915L0001M747k24786J2645k7957M08713k75878
13779F97019j02600L44889k68807q302K2172j0539p5658L74307k75496M0283K2061
13768G59329j98448L399K34719k26797J79677k1579j47115K84029r7720k22538
13758E46956J21921j20267J03654j73008J16276r8503j03325J42571n5654O7583
13748E48204J53272m501J35028j86913p0536L09530k76325P7581j85688K13977
13738G13629J26493l37931M8264K36382j57945j50030J28766j39726L70398j52427
13728F85873n7697K49859C86734k6767N31224k22153J84898l12703r7953K6619
13718D69899K92235P0117m4694l15168J10770j87690j58296J35048J88628M9920
$$ plain form
13789 1024368 1045881 637619 769534 799535 804282 579496 592141 564184 972897 697019
13779 697019 594419 939308 670501 662199 684371 673832 598174 972481 696985 737268 759329
13768 759329 560881 564280 798999 572202 751879 730300 583185 867214 769494 546956
13758 546956 668877 548610 652264 479256 595532 497029 393704 536275 480621 548204
13748 548204 701476 696975 832003 645090 574554 884084 607759 685340 499652 713629
13738 713629 840122 502191 550455 786837 628892 478862 607628 467902 838300 685873
13728 685873 628176 878035 386734 359967 891191 669038 853936 541233 443280 469899
13718 469899 762134 832251 787557 472389 583159 395469 237173 372221 560849 610769
13708F10769L25309D35740A02270N46492C10831O0410k2140M55794l43043l5940
13698D25912M5954q4700L2663N47963D01887o5970M34276k91820L54796k41986
13688E91183m6188K7508o9993J55731J41390k16941J0490M4371P0156L8380C36311
13676B83580J47768J05287o2602k01040P3588k9460A19201L51279o6287L2945
13666D37138j84710K29047j53153J00343B09958K46900K20686k35985r435G9300
13655D76356L1474j53051L34292k98229N4747j38337C9642J97164r9146L47559
13645D85219j45709L5091l0031m428K54976A87594M57715m3161k91695Q2878l8900
13634C54431J93451k01085j32605o528N5172q2684K23551j86958J0965m8931L00806
$$ plain form
13708 610769 936078 435740 102270 648762 310831 371241 349101 804895 461852 425912
13698 425912 471866 387166 419829 967792 401887 335917 770193 478373 833169 591183
13688 591183 544995 572503 502510 658241 799631 582690 593180 637551 707707 746087 336311
13676 283580 431348 536635 474033 272993 346581 317121 119201 470480 404193 437138
13666 437138 252428 481475 328322 428665 209958 456858 677544 441559 432124 79300
13655 476356 507830 354779 689071 390842 445589 307252 39642 236806 137660 485219
13645 485219 339510 374601 344570 340142 595118 187594 645309 602148 310453 393331 354431
13634 354431 547882 346797 214192 207664 262836 180152 403703 216745 227710 178779 479585
13623D79585A83036K28095P4142j63446I7439L28766j21400L35357k88070L16755
13613F68847J0061k85480D0379L22991J64914k46487N2239J46682j20962K75459
13603F35215r1767n5412B25655J55478D458L03166N4258n5811D6025N6008J51922
13592B53955j15097L65533K67421j32217k05277L11910C06742K7938K09474A87000
13581F18594j80049B15697M85508k11065B43092D4407L14577o0309P8444N1418
13571D28537l2236A17051J20551n0190J47255r8719Q0823n7296Q6958q7081A19044
13559A88496L58555j64613J31402j20131L05485B59509L5356j33175L34258J23005
13549F18953B90955k9157L1449N2791G9202K71942j7762N5945J08768k01370D5333
$$ plain form
13623 479585 183036 411131 485273 321827 97439 426205 304805 640162 352092 668847
13613 668847 678908 393428 40379 363370 528284 281797 334036 480718 359756 635215
13603 635215 543448 488036 225655 381133 4458 307624 361882 306071 46025 102033 253955
13592 253955 138858 504391 771812 639595 434318 746228 306742 334680 544154 187000
13581 618594 438545 215697 701205 490140 243092 44407 358984 298675 377119 428537
13571 428537 396301 117051 237602 187412 334667 235948 316771 259475 346433 259352 119044
13559 188496 547051 382438 513840 393709 699194 259509 294865 161690 495948 618953
13549 618953 290955 261798 293247 346038 79202 351144 333382 389327 498095 296725 45333
13537A61978J9222J07927N900K3621j58196K55225k07112B0301N04059I8343N9351
13526A57694J99651F2908P462J53356J14034O5748j21830G9707b08387C51896
13515C62537j34973J26886N1395P2182A35821J45911K08402j83155k3297J62067
13505D45749I6937f0962A42016O9941P8981Q3112C9293K33835a4766D3761N20814
13494E64575j85781A44395J239J27024P0161Q1952A83648d3342B3451L04703J33972
13483D62126G4978K43178M0841P4287B15755p2140J42876J10494K467g3003B09003
13471D83345j86919h151B10009I6681J15038q2006M48229A36090C2171i044I3816
13459B4320K45368p9234C3133M1176O0719M35497R890A72409J55374A1579N49821
$$ plain form
13537 161978 181200 289127 295027 318648 160452 415677 208565 20301 524360 98343 157694
13526 157694 357345 62908 70370 223726 337760 403508 281678 79707 -208387 351896
13515 362537 227564 354450 405845 478027 135821 281732 490134 306979 283682 445749
13505 445749 96937 -60962 142016 211957 290938 374050 39293 273128 -14766 43761 564575
13494 564575 378794 144395 145634 272658 342819 424771 183648 -43342 23451 328154 462126
13483 462126 74978 318156 358997 433284 215755 143615 286491 396985 399452 -73003 209003
13471 483345 296426 -8151 210009 96681 211719 129713 577942 136090 32171 -9044 93816
13459 24320 269688 190454 33133 74309 135028 570525 580415 172409 327783 11579 561400
13448E61400A30521D0611K55485l2968L7845i6442H9401J70899K9231j184Q5114
13437C73461G9367J81824r8527G9068L00461A71591b6038q9339B43353l9219b8833
13425E2274K61327l3045A5230K97700N2672m292A04637J29666j12963K89803A9023
13413a58718B74664p9873k4265a21534C83784q8442J17193A57061J56962N4229
13403C68252j73996b26067C46162J30814A13629L25730A24490l6979k2792k4510
13393D0209K48488l9162L94186b1016I4416K81184q7830l4772A05418a41498F5538
13381A62189g6991C88114E3276K32582j06132J07604J80541B15401J96017A99020
13370B40744K0664D0431L3600J9998c4694E26653B8306J23362J07681j09847e0663
$$ plain form
13448 561400 130521 40611 296096 263128 300973 -96442 89401 260300 289531 288347 373461
13437 373461 79367 261191 162664 79068 379529 171591 -26038 -115377 243353 204134 -28833
13425 52274 313601 280556 15230 312930 365602 361310 104637 234303 121340 411143 19023
13413 -158718 274664 194791 170526 -121534 383784 295342 412535 157061 314023 368252
13403 368252 194256 -226067 346162 476976 113629 439359 124490 87511 64719 40209
13393 40209 288697 249535 643721 -21016 94416 375600 287770 252998 105418 -141498 65538
13381 162189 -76991 388114 53276 285858 179726 287330 467871 215401 411418 199020
13370 240744 261408 40431 74031 94029 -34694 526653 28306 151668 259349 149502 -50663
13358a38188B28941p7978i827D3991J73849I8023J25314r9053M555L0014J3407
13347A72260K43337q174l4555p9742k4216L12455k11521n9213L26662j46725A29387
13335B94445H719L77435A10356M0059j7267K77343j18388g8668F9439J29404J52442
13324C51285j17720i2692C23850A61516m9971Q9076K12133A59218g6053j86898
13314b62951B08404M5994b02523D08802j86859C7985J14170C4663a29744A01488
13303C0185K70547f6833B99591b56558f6405h11C33751A15506J50947K10696H7280
13291e3387B88930J59935j88949a12678C25682A09248f5700G2391b22661C04732
13280A35113J17875k1255F6935J67451B5479J18696q595m5302L091A9128M2929
$$ plain form
13358 -138188 228941 150963 -9827 43991 217840 98023 223337 124284 128839 158853 172260
13347 172260 415597 407423 372868 293126 268910 581365 369844 310631 637293 490568 129387
13335 294445 8719 386154 110356 150415 133148 410491 292103 -78668 69439 198843 351285
13324 351285 233565 -92692 323850 161516 111545 200621 412754 159218 -76053 -262951
13314 -262951 208404 254398 -202523 408802 221943 37985 152155 34663 -129744 101488
13303 30185 300732 -66833 299591 -256558 -66405 -811 333751 115506 266453 477149 87280
13291 -53387 288930 448865 259916 -112678 325682 109248 -65700 72391 -222661 304732
13280 135113 252988 231733 66935 234386 25479 144175 135580 90278 93369 19128 62057
13269F2057a91650B28600H5284L00814p1738j06478F5166K26468b00255D9890
13258B96146j16521J05635a29491a9864j17162n7550j01115A02387k5943K66259
13248C42703e0470B91886d1992Q300H5236K6035h3693E0938K35998D029L55392
13237C59421a62632A83790f7677j59342B79636A08187a08481A84416J4689J6950
13227B16055M6647r2678a6669A62268C1876Q6381M57832A48178F9600b0138C13974
13215A23047J54990b0047e601o2428A7916D06L48455A49677K3153J69081F2640
13203B5845a90718A61865J02642G0237R5205n2667J8266o4341B4692J52414k2347
13192A54759l4909K77392j35965I5008C6132O8445k810K19270j50488b36362O6503
$$ plain form
13269 62057 -191650 228600 85284 386098 314360 207882 65166 291634 -200255 49890
13258 296146 179625 285260 -129491 -19864 -137026 -194576 -295691 102387 76444 342703
13248 342703 -50470 291886 -41992 -33692 85236 111271 -83693 50938 286936 4029 359421
13237 359421 -162632 183790 -67677 -227019 279636 108187 -108481 184416 199105 216055
13227 216055 262702 170024 -16669 162268 31876 118257 576089 148178 69600 -20138 313974
13215 123047 278037 -20047 -5601 -68029 17916 406 348861 149677 172830 341911 62640
13203 25845 -190718 161865 264507 70237 165442 112775 131041 66700 24692 177106 154759
13192 154759 119850 397242 261277 95008 36132 104577 101767 321037 170549 -236362 -169859
13181a69859a7371H1295M70958j48222I7235g4852A09900R6198b13666F2305J72739
13170B35044E8265P9291j2879J14392q0907J49472F9319M6327d3117A10600N2462
13159A63062K3512a30076C323M2145a8006j12406O02A94613G0822O7403J33378
13148B71603J40643H2794a01756G8419J32894D1155a88088D27042a18461F6145
13137A16287c7060A84511M7294I7456J99332A44882d62935b1622D897K61526H6083
13125C78403e1328A53596a17776c8019A37469k1662A0638b7299j07212k280C88606
13113F2749a46213n0732Q0022A18018E0589M36104A22342H095c9177m565C22664
13101G0804N179K8569J26108b26627G5036m948c4523q5489B95798c8570I2150
$$ plain form
13181 -169859 -17371 81295 552253 404031 97235 -74852 109900 206098 -213666 62305 235044
13170 235044 58265 137556 124677 239069 158162 307634 69319 115646 -43117 110600 163062
13159 163062 186574 -130076 3323 45468 -18006 -130412 -129810 194613 70822 138225 271603
13148 271603 412246 82794 -101756 78419 211313 41155 -188088 427042 -118461 66145
13137 116287 -37060 184511 231805 97456 296788 144882 -462935 -21622 4897 266423 86083
13125 378403 -51328 153596 -117776 -38019 137469 115807 10638 -27299 -134511 -136791 388606
13113 62749 -146213 -196945 -116923 118018 50589 486693 122342 8095 -39177 -43742 322664
13101 70804 75983 104552 230660 -226627 75036 70088 -34523 -120012 295798 -38570 92150
13089g9790j61021f647j07180B32639l1292a18524C82156F8431J23107F0340k5926
13078C4414K32190h5872A49262g8835k56553A14034m4893h5023j64418E8354l132
13067E5222f3727R50D3960P229G197J01725H316L70937A17942a9936B90535f1317
13054a18949A40840L5232h3782B15305G204R2326J44984a15746A83922K245A4597
13042G047a30953A70034A1626J21005h7532c2984k15515B48798a11294A6295R3125
13031A09420l4049J60203G4570J00964j595J84505d7190K054A51223O7036N348
13020B23607l1781J64629F1937K53488A12682K8819b37192H8763O9339N8249r8218
13009A18133J33521F295K53729n3593b29036I5888R6215F4076J63379A06966N6157
$$ plain form
13089 -79790 -240811 -6647 -113827 232639 201347 -118524 382156 68431 191538 60340 34414
13078 34414 266604 -85872 149262 -78835 -335388 114034 69141 -85023 -249441 58354 55222
13067 55222 -63727 -62777 43960 51189 7197 108922 8316 379253 117942 -19936 290535 -61317
13054 -118949 140840 176072 -83782 215305 7204 99530 244514 -115746 183922 186167 14597
13042 7047 -130953 170034 11626 132631 -87532 -32984 -248499 248798 -111294 16295 109420
13031 109420 75371 235574 74570 175534 173939 358444 -47190 -45136 151223 218259 223607
13020 223607 191826 356455 61937 315425 112682 141501 -237192 88763 158102 216351 118133
13009 118133 251654 6295 260024 206431 -229036 95888 192103 64076 227455 106966 163123
12998A63123K1464J3227b01824b8654A66031F3127i3128D5403h311q6005B00878
12986c1717N764A83356b13748a2167N997k1952B78411I1489m544h0907B1279b3232
12973e28632a91698F5722O1163D9465O0636m6671a35685j44839c4755m3109A08693
12961A25082J9760i9742B48697a57362B85998n9425q3209b26704f2094B64769
12950b98158A2529a06839j70705B00052g9551a5842B34899D3586f9851r7982N5594
12939a12239B71442a78776c8419B30615o4274a04434A73535a50139p2381B07312
12928a35292N3724A18711c1382A37281B3547a38052I2803b79066A89786o6478
12918A23308J45568a55803D5711J52372d25000A51218a43722j88499A48442R7177
$$ plain form
12998 163123 184587 197814 -201824 -28654 166031 63127 -93128 45403 -8311 -94316 200878
12986 -31717 -25953 183356 -213748 -12167 -6170 -28122 278411 91489 86945 -80907 21279 -23232
12973 -528632 -191698 65722 126885 49465 110101 63430 -135685 -280524 -34755 -77864 108693
12961 125082 144842 -99742 248697 -157362 285998 226573 143364 -226704 -62094 264769
12950 -298158 12529 -106839 -277544 200052 -79551 -15842 234899 43586 -69851 -167833 -112239
12939 -112239 271442 -178776 -38419 230615 166341 -104434 173535 -150139 -222520 207312
12928 -135292 -81568 118711 -31382 137281 23547 -138052 92803 -279066 189786 123308
12918 123308 268876 -155803 45711 198083 -425000 151218 -143722 -332221 148442 245619
12908B45619b0327B93292m6956b33067F7288h2371j0804B65138r3889J38079A00640
12896b54900C321b395k09715k58750A48271d5658k29947A50004J36087G8415K52788
12885C31203a06621B66974m0666H6400b54679E5796J25651N0452h1260J1274j10384
12874a80370k587I6236a14523j46187B16996p4515m8900a2386B81811r3152G6698
12862B31680o9235a12023b8509A71380d9210E7117d8209J6297A9959K58716b44705
12850D57716I3064h4327B89101a9986o5756A40433a32240A36405Q4408b69907
12839A37694D6954a66635H2154K44338i9114r5626L0524A91026a50106C7321K13760
12828B51081a1588k0771I9562i4228D9399a2639D83129A86874d3315F1882B3637
$$ plain form
12908 245619 -20327 293292 246336 -233067 67288 -82371 -93175 265138 171249 309328 100640
12896 -254900 3321 -2395 -212110 -470860 148271 -45658 -275605 150004 286091 78415 331203
12885 331203 -106621 266974 226308 86400 -254679 55796 181447 231899 -81260 -69986 -180370
12874 -180370 -182957 96236 -114523 -260710 216996 142481 93581 -12386 281811 188659 76698
12862 231680 162445 -112023 -28509 171380 -49210 57117 -48209 -31912 19959 278675 -244705
12850 457716 93064 -84327 289101 -19986 -85742 140433 -132240 136405 220813 -269907
12839 137694 46954 -166635 82154 326492 -99114 -194740 -164216 191026 -150106 37321 251081
12828 251081 -11588 -32359 99562 -94228 49399 -12639 483129 186874 -43315 61882 23637
12816a00950a6968r4646A31089C3161i1877B80172b65437K8570c977H6524K09486
12805B96010A06099c13624E1066K9678c49772J46407G2204J69267b33675E4165
12794e0975k32774A05369D4222J94472c54621P0837a02868C9433N2258a4249O234
12783h015C5085D742a24027L3205A35686n0767a34118B89282k9540b14826C16274
12771H6242J32500f1833I3212F291f6064G9358Q2004R8450f7875i810E601a89945
12758c8796B48571a61700B32858q4964c3047A03716b18622A06040Q5650f0320
12747A90208a9284B07612c71953B32244J4539d4687C40097j45517L8426H0244
12736F7337a66297E7201a6549j67378L2893k20145i2864C1942J32508l8817d0205
$$ plain form
12816 -100950 -16968 -111614 131089 33161 -91877 280172 -265437 -236867 -3977 86524 296010
12805 296010 106099 -313624 51066 80744 -349772 -203365 72204 241471 -233675 54165
12794 -50975 -283749 105369 44222 238694 -354621 -283784 -102868 39433 91691 -14249 -8015
12783 -8015 35085 4742 -124027 -90822 135686 84919 -134118 289282 259742 -214826 316274
12771 86242 218742 -61833 93212 6291 -66064 79358 161362 259812 -67875 -9810 5601 -189945
12758 -38796 248571 -161700 232858 147894 -33047 103716 -218622 106040 191690 -60320
12747 190208 -19284 207612 -371953 232244 246783 -44687 340097 194580 233006 80244
12736 67337 -166297 57201 -16549 -183927 -151034 -371179 -92864 31942 164450 125633 -40205
12724H1939J07672a7444r7070B48095F3043a1602C97b27537F8483a78034N7444
12713a20590G928a17288H7689a9057I9451l5318J82522G2974K79072r4514J02740
12702C60272I0710K33069R1149d9177D1443J82808P0061f1961j06224A49684a1108
12690h0278j4381a8353j80721B91884h8828l26689D8115a8023p3480G010J10791
12679A17801Q6288J13258j089g8109D8113D921c21153a21586A76458l3292i5198
12667C49304f9224B629K59959F4240b82839A00695G013L3578J98024f1961H0527
12655d9831j37714o616l7426A24518j897J96181A09276B994G23J00418c3412o00
12643c4012j61066i3262i108k67466A17715d7823j26417g5851l4526B47117F4159
$$ plain form
12724 81939 189611 -17444 -114514 248095 63043 -11602 397 -227537 68483 -178034 -120590
12713 -120590 7928 -117288 87689 -19057 99451 64133 246655 72974 352046 257532 360272
12702 360272 90710 323779 414928 -49177 41443 224251 294312 -61961 -168185 149684 -11108
12690 -80278 -94659 -18353 -199074 291884 -88828 -415517 48115 -18023 -91503 7010 117801
12679 117801 204089 317347 316258 -78109 48113 4921 -321153 -121586 176458 143166 -95198
12667 349304 -69224 2629 262588 64240 -282839 100695 7013 40591 238615 -61961 80527
12655 -49831 -187545 -194161 -231587 124518 122621 318802 109276 2994 723 101141 -33412 -34012
12643 -34012 -195078 -93262 -9108 -276574 117715 -47823 -174240 -75851 -110377 247117 64159
12631h8851c3674A56866R1778J28951F2042M4940K22746j61009l3675J27521F9629
12619B4801L2226J52971i9737A91723A5821c67040A41546a39711B0473K78160
12609B98633b87077O7185B70142p8371J35K23008a51478B16494a69538A46454
12598B81339D3184P8172K20997A60337L5032g1826H4252Q1125J14593G8783j3611
12587F5172a03245A50358Q0979i7208F7178J74055J58651A9078Q5822J32206c3044
12575A140a60564C6191i1874p3062g1713j15634j65040G4798J43114J07957j14675
12564B11194b55601m3844A04973K05203i3489j07206d5814E0362A6386J79861
12554A96247J92627c8132B78801C8497M7882J39256G0370a59749l17261B14140
$$ plain form
12631 -88851 -33674 156866 248644 377595 62042 106982 329728 168719 135044 262565 69629
12619 24801 57027 209998 -99737 191723 15821 -367040 141546 -139711 20473 298633
12609 298633 -287077 -219892 270142 191771 191906 414914 -151478 216494 -169538 146454
12598 281339 43184 121356 342353 160337 195369 -71826 84252 165377 279970 78783 65172
12587 65172 -103245 150358 231337 -97208 67178 241233 399884 19078 104900 237106 -33044
12575 1140 -160564 36191 -91874 -164936 -71713 -187347 -352387 74798 217912 325869 211194
12564 211194 -255601 -299445 104973 310176 -93489 -200695 -45814 50362 16386 196247
12554 196247 388874 -38132 278801 38497 86379 225635 70370 -159749 -477010 214140
12543d18A78488c10177A09342K43054f3963F4963F506c06937d2814q2371A02288
12531c8549P22E6752g1973I664a49869j07896a03153A20806G857a89971A51468
12519b6539D0774a81694A55521j6541a64650P4293l1557k46572B49304A02283
12508I7767a73156r7049i8453c1635k2565C48789j60232o2879A6732O8032M669
12497H9433J9219J24148O6972b24284B44231g7219b5576l6298F108K1335b21950
12485A01429c0453m4667A94778J30435a60249K9453H5956F544K92529J16528A88724
12473a46327M2522B73100d01358A98999J5317b930r8558A0342C591J92869D565
12461H9402c0138p4354p3866E6564A8357K91038A449b27906B02333i7347A60446
$$ plain form
12543 -418 178488 -310177 109342 352396 -63963 64963 6506 -306937 -42814 -125185 102288
12531 -38549 -37827 56752 -71973 9664 -149869 -257765 -103153 120806 7857 -189971 151468
12519 -26539 40774 -181694 155521 138980 -164650 -90357 -121914 -368486 249304 102283
12508 97767 -173156 -270205 -98453 -31635 -54200 348789 188557 125678 16732 84764 89433
12497 89433 108652 232800 299772 -224284 244231 -77219 -25576 -61874 6108 27443 -221950
12485 101429 -30453 -75120 194778 325213 -160249 -130796 85956 6544 299073 415601 188724
12473 -146327 -103805 273100 -401358 198999 214316 -2930 -101488 10342 3591 196460 4565
12461 89402 -30138 -104492 -178358 56564 18357 309395 1449 -227906 202333 -97347 160446
12449A86941a2105d706j01940A78972b9428A43877A8014a35815d1563G3763M2430
12438A16193a54329B2472K72211O5338b2740D60563b2451p1154A77504n1300C3199
12426A16788j3699d0386j13837A30173c45340h5274A3730e1892o4912j10397B1888
12414b65741B1025K96836a4730I1522b99912b4535H2405K07246o2341o7333L4890
12403A94867h6505A49117D0268c13853A45968d9980q607j00411e1953k26742P1372
12392b07323e0326A27529a11747o6191G7165a11366A3031J90986F2375P3700F3270
12380A60385e0293p5283l11539A43782b1014C2948K9651a02385M2003j72312f6385
12368E8214i9m71777a5851A57072e6784H8313d4593C48448d1865A03952j678A6545
$$ plain form
12449 186941 -12105 -4706 -106646 178972 -29428 143877 18014 -135815 -41563 73763 116193
12438 116193 -154329 22472 294683 360021 -22740 460563 -22451 -93605 177504 126204 33199
12426 116788 103089 -40386 -154223 130173 -345340 -85274 13730 -51892 -116804 -227201 21888
12414 -265741 21025 317861 -14730 91522 -299912 -24535 82405 289651 227310 159977 194867
12403 194867 -86505 149117 40268 -313853 145968 -49980 -58587 -158998 -51953 -278695 -207323
12392 -207323 -50326 127529 -111747 -177938 77165 -111366 13031 204017 62375 136075 63270
12380 160385 -50293 -125576 -437115 143782 -21014 32948 62599 -102385 -60382 -232694 -66385
12368 58214 -99 -471876 -15851 157072 -56784 88313 -44593 348448 -41865 103952 102274 16545
12355C5735d2704C18145a0122B9547J88206J97706a23072B811c76706h2917B90496
12343A49704a08151A25243J21911n8541a23382B02745b82826a25148L9517C7390
12332I1731a0786E5111J14658h1397j93555E3857L20841G8312g4822r6195k7723
12321a98740d6352b2791a492r151B73343a97893a3480I8090l3134K14483I9622
12309c1915p797B0774c5790B38940b87987M7614D6738g7403d082j62275A0757
12297B42642G6216B7067a82132j75895d8613J5785L337j41024A31937E8193a00634
12285a78616B88812a32689p1182A72184c8706q795r4991L7183A59666J81400h3823
12273B68464K61583d494k11070g370C98628H4829a39460N9002A31723J10615a75978
$$ plain form
12355 35735 -42704 318145 -10122 29547 217753 415459 -123072 2811 -376706 -82917 290496
12343 149704 -108151 125243 247154 188613 -123382 202745 -282826 -125148 -85631 37390
12332 91731 -10786 55111 169769 -81397 -274952 53857 374698 78312 -74822 -171017 -198740
12321 -198740 -46352 -22791 -1492 -10643 273343 -197893 -13480 98090 64956 279439 99622
12309 -31915 -39712 20774 -35790 238940 -287987 -240373 46738 -77403 -4082 -166357 10757
12297 242642 76216 27067 -182132 -358027 -48613 -32828 -29491 -170515 131937 58193 -100634
12285 -178616 288812 -132689 -203871 172184 -38706 -47501 -142492 -105309 159666 341066 -83823
12273 268464 530047 -4494 -215564 -7370 398628 84829 -139460 -80458 131723 242338 -175978
12261d6989m2198r711F1760O6207n8756P2651b4863l6696A89055J27612K2002
12250C38669E6939L66714p2434j18288G724g6190A26229e8382B75260K19559A13477
12238A3129J68117N241k8397b69985E3765J95791l9405G2067P2384c0310O659
12227b3651B05885P912K03183q5244A38337f5053r0713B38308r0213J32177a76314
12215B83360F9859a7825C00794M0171A20301O005e5127B63249p5435P123a98409
12203B23725Q910A05609a3076I3718J36305e8395B07178R6197j5886K4879r5591
12192B16777L9759l5035c1951C57590l1395i8304D67303b25776Q5969A16489D1073
12180a91845G2273M21304A85587J42210D7287J09482l6381e2854j07015C3058
$$ plain form
12261 -46989 -89187 -98898 61760 127967 69211 141862 -24863 -61559 189055 316667 338669
12250 338669 56939 423653 351219 232931 7724 -76190 126229 -58382 275260 494819 113477
12238 13129 181246 186487 158090 -269985 53765 249556 210151 72067 144451 -30310 -23651
12227 -23651 205885 213797 416980 331736 138337 -65053 -155766 238308 148095 280272 -176314
12215 283360 69859 -17825 300794 340965 120301 126306 -55127 263249 187814 194937 -198409
12203 223725 232635 105609 -13076 93718 230023 -58395 207178 303375 287489 312368 216777
12192 216777 256536 221501 -31951 357590 326195 -98304 467303 -225776 -139807 116489 41073
12180 -191845 72273 493577 185587 327797 47287 156769 120388 -52854 -159869 33058
12169A02524A2322L74925b39468H6374J47809J0511L8321b51258A79802f9029
12158B59121i1195C8868R2975m4280h060m7016D70768j94159j29540a40277j12674
12147b52951A31694m338a43299A51958g388C65269L7843c6008o6952b7100A07473
12135f0494m5547A28157f9784m4481A41110P3661h2454I1285b65654e4185j41337
12124a95522D30467f2395D787a71966O5197C9939J6243a41330r4770B11449G9366
12112D0810a3649l96698a73061A57944a13969G0284K03174j07187b19030B59087
12101a85336a0383j33965f1572o6937j23241J04987C06182a94003A3140d2499
12090e5271B04682a17131B00924i8213G9362e6000j51469R841B46046b69267A07801
$$ plain form
12169 102524 12322 387247 -239468 86374 234183 244694 283015 -251258 179802 -69029
12158 259121 -91195 38868 131843 87563 -8060 -55076 470768 276609 147069 -140277 -252951
12147 -252951 131694 127356 -143299 151958 -7388 365269 403112 -36008 -102960 -27100 107473
12135 -60494 -106041 128157 -69784 -114265 141110 214771 -82454 91285 -265654 -54185 -195522
12124 -195522 430467 -62395 4787 -171966 -106769 39939 56182 -141330 -236100 211449 79366
12112 40810 -13649 -410347 -173061 157944 -113969 70284 273458 166271 -219030 259087
12101 -185336 -10383 -144348 -61572 -128509 -251750 -146763 306182 -194003 13140 -42499
12090 -55271 204682 -117131 200924 -98213 79362 -56000 -207469 -197628 246046 -269267 107801
12078h5385D7230e5996B24878c07063b2028D24078Q55155O02204o68044B95241
12067b568l933B95257a34797A22439N2797a60029A31067a56201A90500D2853a00426
12055F0385j380d7802B21491Q7058a24701A87974J41536c60703G9307a05250A42566
12043b6980A29251f1725j73646B9965Q9711l0761c5700A3677d13883N4103A7501
12031g0758q7266l1707j33044F6466h4391A46387a77369Q8454L7437j69573C204
12019C71830e9545A7973J24380o9764J4020c9398j1350j18560B25108a66545H2775
12007c50905D8989Q7976o3885J7250a05677C42644h8376C16364a75763G572c9490
11995B9500K5346J33634e0908F2253c1031F5133b11594a3162k46776A9069a76363
$$ plain form
12078 -85385 47230 -55996 224878 -307063 -22028 424078 1279233 1881437 1213393 295241
12067 -2568 -6501 295257 -134797 122439 175236 -160029 131067 -156201 190500 42853 -100426
12055 60385 59005 -47802 221491 308549 -124701 187974 329510 -360703 79307 -105250 142566
12043 -26980 129251 -61725 -235371 29965 119676 88915 -35700 13677 -413883 -359780 17501
12031 -70758 -158024 -189731 -322775 66466 -84391 146387 -177369 -88915 -51478 -221051 3204
12019 371830 -59545 17973 142353 72589 86609 -39398 -50748 -169308 225108 -166545 82775
12007 -350905 48989 136965 73080 90330 -105677 342644 -88376 316364 -175763 7572 -39490
11995 29500 54846 188480 -50908 62253 -31031 65133 -211594 -13162 -259938 19069 -176363
11983d1615C7949L18953h6005C17860A20611i0936a3028l48345a66620F0625O5627
11972A26252a41364E42498A07109J47017E5066K9387K33660c899m8922H0952k0940
11961F0012a62308H1874a443H950g8305j07736C0259b01001d5916A13656i7315
11949H7720b61764A45694b92818d7212j22260a4850B09599C2742J50810e7535
11938F5387P5584a87606B8425i4210A22751A2130J39343i2505j55530A8447b61588
11926e2317n7939j4112A94196a6233k24364B1698i654j2019j6552a0479A12536
11914a1034l79595J35522H1833C9947Q4862M0314E5375Q7859j8873C3237b06634
11902D5832K6M1590b8359j88540B32592a01310d3301A31O3985P822a29160E7344
$$ plain form
11983 -41615 37949 356902 -86005 317860 120611 -90936 -13028 -361373 -166620 60625 126252
11972 126252 -141364 542498 107109 254126 55066 84453 318113 -3899 -52821 80952 60012
11961 60012 -162308 81874 -1443 8950 -78305 -186041 30259 -201001 -45916 113656 -97315
11949 87720 -261764 145694 -292818 -47212 -169472 -14850 209599 32742 183552 -57535
11938 65387 140971 -187606 28425 -94210 122751 12130 151473 -92505 -248035 18447 -261588
11926 -52317 -110256 -124368 194196 -16233 -240597 21698 -9654 -21673 -38225 -10479 112536
11914 -11034 -390629 -255107 81833 39947 124809 165123 55375 143234 124361 33237 -206634
11902 45832 45858 87448 -28359 -216899 232592 -101310 -43301 131 64116 71938 -129160 57344
11889A46169a23811q0267B42053j02480a35919p9396A29906a01563A20003A3172
11878i8792A42487a63620h0817J7298B08656A2643b12945C30007a09136l60164
11868d69300D5459a97174J7492A15316m7494c76649G7051J06625i6069j76541
11858b72610D0631O0798a47468m8857A17967a79155A26646J22665b17562A02689
11847E13059b19346L5879N4768k0284E1997a02535G5675L9845a95055h8207j30577
11836b18784b4899j32882b662j75584n0874q1369g8103o8502C3380b17236B7161
11824c1113o9677p6412k7243b5507j62550n9693I9120J16715c44633A44234a68129
11812d2018B93061c00582B0870J73458b04530R0401k04339a45662o5830D1882
$$ plain form
11889 146169 -123811 -204078 242053 139573 -135919 -215315 129906 -101563 120003 13172
11878 -98792 142487 -163620 -80817 -63519 208656 12643 -212945 330007 -109136 -469300
11868 -469300 45459 -197174 -179682 115316 67822 -376649 77051 183676 -96069 -272610
11858 -272610 40631 101429 -147468 -196325 117967 -179155 126646 249311 -217562 102689
11847 513059 -219346 -183467 -128699 -148983 51997 -102535 75675 115520 -195055 -88207 -218784
11836 -218784 -24899 -157781 -2662 -178246 -229120 -310489 -78103 -146605 33380 -217236 27161
11824 -31113 -100790 -177202 -204445 -25507 -188057 -247750 99120 215835 -344633 144234 -168129
11812 -42018 293061 -300582 20870 194328 -204530 -114129 -318468 -145662 -211492 41882
11801A5515M1302a14438p7783E9871a67868A19603d7251B20847a04814k69413
11791c74227A42228e8862J6929A28437K06692i3547A85052a57128n1074f9752
11780D9553L7399c04865e2374j70460A30310c4971A42753a10536A90324C4668
11769C07444a31436r1166A00399a44626j673C4064b12778A4026f033B20346c42665
11757C8483b78115E1788h76q1739B38267r2987i5562F5101J2666a31583f2136
11745G9375j8450g8559m2513k9829l2149g9706q8068A3315c10159e5025k09410
11734b64435B36886i101A4731J13043C0710a85628a4290j652j08395C0652b502
11722B19359a91384g3356j09242c9901j57984L6695f3667A01707a94514g3464
$$ plain form
11801 15515 56817 -114438 -192221 59871 -167868 119603 -47251 220847 -104814 -374227
11791 -374227 142228 -58862 -41933 128437 335129 -93547 185052 -157128 -208202 -69752
11780 49553 86952 -304865 -52374 -222834 130310 -34971 142753 -110536 190324 34668
11769 307444 -131436 -222602 100399 -144626 -146299 34064 -212778 14026 -6033 220346 -342665
11757 38483 -278115 51788 -876 -82615 238267 145280 -95562 65101 77767 -131583 -62136
11745 79375 60925 -78559 -121072 -150901 -183050 -79706 -167774 13315 -310159 -55025 -264435
11734 -264435 236886 -9101 14731 127774 30710 -185628 -14290 -15942 -124337 30652 -2502
11722 219359 -191384 -73356 -182598 -39901 -197885 -161190 -63667 101707 -194514 -73464
11711h3238l4990L5767A89362a49832B10251a0675B26242h6269p7609c7683F6302
11699H9416K7796b24333c0387A98064A3203J56226K9322e41j2739C41413A66816
11687c289j06555j4888B55696j10633J07962N269A4149C097a34536A62545E1979
11675g644E3259L7110l6380A8325a02117D4908J59087b786A19656h5013A45665
11663B4080K18342m9825A914a8069g977F3130J00103J9223a97651A20353E0383
11651c2710E6554g1780C91741j69251D5289b9873A17686B1484R073a42263A82717
11639G8017e8345B68101j33554a58648A7113j641P5714i0523F7185g5801D7012
11627B10053L2933F3857K71492a3999I0213K50499e8930k52698A21489j0398M1188
$$ plain form
11711 -83238 -118228 -82461 189362 -149832 210251 -10675 226242 -86269 -163878 -37683 66302
11699 89416 117212 -224333 -30387 198064 13203 169429 198751 -541 -13280 341413 166816
11687 -3289 -109844 -124732 255696 145063 253025 258294 14149 3097 -134536 162545 51979
11675 -7644 53259 90369 53989 18325 -102117 44908 203995 -2786 119656 -85013 145665
11663 24080 242422 192597 1914 -18069 -7977 63130 163233 182456 -197651 120353 50383
11651 -32710 56554 -71780 391741 222490 45289 -29873 117686 21484 30557 -142263 182717
11639 78017 -58345 268101 134547 -158648 17113 15472 91186 -90523 67185 -75801 47012
11627 210053 242986 63857 335349 -13999 90213 340712 -58930 -311628 121489 111091 152279
11616A52279a73634a8208k21865B18964a7254B45682j07308D5223J62906P2825
11606B80954D9836c9332C78275m670b7092A85514d3279A8061b2488j05558A10097
11594C13127f3472C13394A6022J25675F5588b07945B24532b23921c1129E9715
11583A60298K124a9198D32562C7504R3431h895B29115G5921J80906h1848j37061
11572b18909B65790a5559J010j37875b3360n2435H1177b5218C9246g8355C39162
11560a81849M3480B16070a7472B73112L10464a75327A6224e3631G2357b31790
11549B38266c2281D34489A29073a25296C12254C1932J52965o4550f407j2971C16421
11537a9793p4056J4698A07548C2974P4062J94389L0372j44835C8009d1733C59870
$$ plain form
11616 152279 -173634 -18208 -240073 218964 -17254 245682 138374 45223 208129 280954
11606 280954 49836 -39332 378275 373605 -27092 185514 -43279 18061 -22488 -128046 110097
11594 313127 -63472 313394 16022 141697 65588 -207945 224532 -223921 -31129 59715
11583 160298 162422 -19198 432562 37504 130935 -8895 229115 75921 256827 -81848 -218909
11572 -218909 265790 -15559 -14549 -152424 -23360 -75795 81177 -25218 39246 -78355 339162
11560 -181849 -138369 216070 -17472 273112 583576 -175327 16224 -53631 72357 -231790
11549 238266 -32281 434489 129073 -125296 312254 31932 184897 120347 -6407 -19378 316421
11537 -19793 -93849 -79151 107548 32974 107036 301425 331797 186962 38009 -41733 359870
11525i8632C09856l8512j18658a4947A22153j7625E1911B3307K73377G7536K55977
11514C33513E7639J27142g1846H4842c2060A0101J10493a56127B59312r9488Q4055
11503B43879K019E7494M67357c59848A98373b64656H416L95097G4242N3550J17004
11492B44796J4264A28482O2345f9693j07856G3610C0140J93627b08064d3032B36983
11480B32116b9486A23659J02453a0016A88672G9195B5190K0373j1387c1669j90177
11469b21846A28156J97075j08772A00362J53176J17638b72235d4146A61055k5093
11459A35962K8640R9316o4968J24545j00402G1228j0729a48811C87800g6348c0596
11447a35825M706l8778A7379a60297C95978I1256K08405f5571A16720o600d6424
$$ plain form
11525 -98632 309856 271344 152686 -14947 122153 104528 51911 23307 296684 77536 333513
11514 333513 57639 184781 -71846 84842 -32060 10101 120594 -156127 259312 159824 243879
11503 243879 245898 57494 524851 -359848 198373 -264656 8416 403513 74242 127792 244796
11492 244796 259060 128482 190827 -69693 -177549 73610 30140 223767 -208064 -43032 236983
11480 232116 -29486 123659 226112 -10016 188672 79195 25190 45563 34176 -31669 -221846
11469 -221846 128156 325231 216459 100362 253538 371176 -272235 -44146 161055 135962
11459 135962 164602 263918 198950 323495 223093 71228 60499 -148811 387800 -76348 -30596
11447 -135825 -131119 -169897 17379 -160297 395978 91256 299661 -65571 116720 110120 -46424
11435d4043J8094A61700a92017O0780A15428j5232a82038l86241D71492d89261
11424f1259b2071A19859a05133J1467A74590a30568c8696l83866a09993n9959
11414a69952F8567O8816P4242F5343g4656j29315A79338a00011H727L2241J33307
11403A74275R0752G2759J13692B552b22885L8687a4521k86364E7193c8600C71480
11391B17820b08027R7655F5026Q5981J19599F2180J10904a42771J5882j12286
11381b39175C15355E086b65571a12646H5984R8096c7396D38407c3057N101B25119
11369a36240B51199f1488J5081A24846K1067D137h5595A30220b7467I3319b7964
11357D9559K17088b70797g9182I8044a14371C82859A13588f645B50425a36972
$$ plain form
11435 -44043 -25949 161700 -192017 -131237 115428 100196 -182038 -568279 471492 -489261
11424 -61259 -22071 119859 -105133 -93666 174590 -130568 -38696 -422562 -109993 -169952
11414 -169952 68567 137383 211625 65343 -74656 -203971 179338 -100011 8727 40968 174275
11403 174275 265027 72759 186451 2552 -222885 -184198 -14521 -300885 57193 -38600 371480
11391 217820 -208027 -110372 65026 151007 270606 62180 173084 -142771 -126889 -239175
11381 -239175 315355 5086 -265571 -112646 85984 184080 -37396 438407 -33057 -27956 225119
11369 -136240 251199 -61488 -46407 124846 145913 4137 -85595 130220 -27467 93319 -27964
11357 49559 266647 -270797 -79182 98044 -114371 382859 113588 -6645 250425 -136972
11346h4106j23149L7116H5564d3399A57760E5448M51964D4463P6131a08189j48315
11335b56504h5319j80883O5061n2981F8196c77237A78149E6427K37361j45247
11325A48541a91858A06686a99797a9838j58793M1419L0125M0470B980O883d0773
11313C1665K3612n194d4196l7495A25957K6856k0778b34399j20358b3966B18033
11301D7792h4017r0921L8207L0704a8376k82651J28976B5733f0185b0196I2176
11289e5939j98556A6827b37232f0124I8835e23B99079L7761b57281h3624A0497
11277b61133C5450c0950O991B23580c0276j57807n0430P1709B19288b39783B84225
11265c63017a29910d9815p8486E9159b35182P9346F8321L7628L58995b73154A54421
$$ plain form
11346 -84106 -207255 -170139 85564 -43399 157760 55448 507412 44463 120594 -108189 -256504
11335 -256504 -85319 -266202 -201141 -254122 68196 -377237 178149 56427 293788 148541
11325 148541 -191858 106686 -199797 -19838 -178631 -137212 -107087 -66617 2980 9863 -40773
11313 31665 55277 50083 -44196 -81691 125957 152813 132035 -234399 -354757 -23966 218033
11301 47792 -84017 -174938 -136731 -106027 -18376 -301027 -172051 25733 -60185 -20196 92176
11289 -55939 -254495 16827 -237232 -60124 98835 -523 299079 336840 -257281 -83624 10497
11277 -261133 35450 -30950 -23959 223580 -30276 -188083 -238513 -166804 219288 -239783 284225
11265 -363017 -129910 -49815 -128301 59159 -235182 -155836 68321 105949 464944 -273154 154421
11253H4962L6547N4323b88363J11504H3563d86456a99208R6492d187F5876d15228
11241A1803Q9251d8047j01957G002R4323Q1846a54324A21184K42473c00C29111
11229g7292o8913i670b162k76167B27854a9690m49067C9096b21277B00940A5309
11217E2876c88599a76206J9982q5699h3665M0806G0770d2172k18833f645A58209
11205d6650E4390I144a43538O3292m21241b23855i0002B77550a06094B53848a79266
11193a68428F1322a56485C00124a33115A65010E9033b47207A17085a84795j01853
11183b86648C20829j06282b3549B79992a46184L4526F0825g4318A50392J3156
11173A63548b61273C0517a79065A36573k1188A0157M5b06635c2451A16483c7604
$$ plain form
11253 84962 121509 175832 -288363 -176859 83563 -486456 -199208 -102716 -4187 65876 -415228
11241 11803 101054 -48047 -150004 7002 101325 183171 -154324 121184 363657 -300 329111
11229 -77292 -146205 -9670 -2162 -278329 227854 -19690 -468757 39096 -221277 200940 15309
11217 52876 -388599 -176206 -156224 -241923 -83665 -42859 70770 -42172 -261005 -6645 158209
11205 -46650 54390 9144 -143538 -80246 -501487 -223855 -90002 277550 -106094 253848 -179266
11193 -168428 61322 -156485 300124 -133115 165010 59033 -247207 117085 -184795 -286648
11183 -286648 320829 214547 -23549 279992 -146184 -111658 60825 -74318 150392 163548
11173 163548 -261273 30517 -179065 136573 115385 10157 10202 -206635 -32451 116483 -37604
11161B77690e4871j23081C56378b23936p1700E9822g9003o4450m7712j1402L9061
11150a63506a1864A32338h4790A11399b18344F990a59929D388c01920G5043J51064
11139B26107k9723o797c59665a02366F5399b2448E6471P3174K15033d28681B45373
11127A08283d8317k33829l4397N4054I7502L32005j32037a6162j78930C83270
11116B37424o9744B4491J45800J7151b35511B73861a34533A14415K03596j31112
11106A86899f8445H8674K06414G0769K94551B8487L20536r9264a99845B74592
11095B47912N6399q4479K0945G3252j4931b09569A4275J54940J10366O8986G8613
11083B53222m2429r6431O1073q4011J16983R735K25233B07933K51270D226P3343
$$ plain form
11161 277690 -54871 -177952 356378 -223936 -295636 59822 -79003 -143453 -191165 -202567 -163506
11150 -163506 -11864 132338 -84790 111399 -218344 6990 -159929 4388 -301920 75043 226107
11139 226107 196384 189587 -359665 -102366 65399 -22448 56471 129645 344678 -428681 245373
11127 108283 -48317 -282146 -316543 -262489 97502 429507 297470 -16162 -195092 383270
11116 237424 167680 24491 170291 187442 -235511 273861 -134533 114415 318011 186899
11106 186899 -68445 88674 295088 70769 365320 28487 349023 249759 -199845 274592
11095 247912 304311 219832 240777 73252 58321 -209569 14275 169215 279581 348567 78613
11083 253222 210793 114362 175435 91424 208407 218142 443375 207933 459203 4226 77569
11072G7569P1890Q9613O5719P7777J33384j85563L41205k60847n809J32227A87059
11060E01060k41773K24452J53482j12883K33339K31004j72290k18602R1022n9682
11050F29129o4253J94385q9882M8536J52299l50027P6916L99411m77715O3285
11040E82084K31076K48109l17846n3586q8332J80212k90469L45800C79233J96743
11030E75976j01462J2196L42409p5530m3205K0980K87509l50715k35536K03893
11020F36515K30601j08323j66734J74349n7529p5441k70738J88142j27337K08468
11010F31973J43721k39517L19643l03238K43639M795j65030J36414o5724j90059
11000E16617J70114L7229Q865J34510k17897N9814J66204j99767L5388r9510m4486
$$ plain form
11072 77569 149459 239072 304791 382568 515952 330389 671594 410747 404938 537165 187059
11060 501060 259287 483739 637221 524338 757677 988681 816391 597789 688811 629129
11050 629129 564876 759261 669379 717915 870214 520187 597103 996514 518799 582084
11040 582084 813160 1061269 743423 689837 601505 781717 491248 837048 379233 575976
11030 575976 474514 486710 829119 753589 710384 731364 1018873 668158 432622 636515
11020 636515 867116 758793 592059 766408 708879 633438 362700 550842 423505 631973
11010 631973 775694 536177 855820 552582 796221 801016 635986 772400 706676 516617
11000 516617 686731 723960 732825 867335 649438 709252 875456 675689 711077 611567 567081
10989E67081K41285N9711O146J22354M0141j06887k00113M34518J59253j95840
10979A127649Q4979J68395K71402N7206L86830J59959K28898J89844R6934K00259
10969B972355j83636m13040L66367o75349L0558m67415P8529J57991k2645j07433
10959A736282J44412n0386N8554J5103j66786j69118j25970j53602k99685l69415
10949F19389k2670N941P8933q0815J05943A24700M62692B15501J27158l4065r130
10938B99464a17842E664K44028j00714K22057I1807K05793q6020R0094A18660
10927D22256A80931o2438b6390A6416K89424b2051k23564A69429b64912A38532
10916c03172a33573M7608j38676A00928b46301a01127F1457a57097N051D0129
$$ plain form
10989 567081 808366 868077 874223 996577 1036718 929831 729718 1164236 1323489 1127649
10979 1127649 1212628 1381023 1652425 1709631 2096461 2256420 2485318 2675162 2772096 2972355
10969 2972355 2788719 2375679 2742046 2066697 2097255 1629840 1708369 1866360 1843715 1736282
10959 1736282 1880694 1830308 1888862 1903965 1737179 1568061 1442091 1288489 988804 619389
10949 619389 596719 602660 681593 600778 706721 124700 587392 215501 342659 308594 299464
10938 299464 -117842 5664 249692 148978 371035 91807 297600 211580 301674 118660
10927 422256 180931 118493 -26390 16416 305840 -22051 -245615 169429 -264912 138532
10916 -303172 -133573 -85965 -224641 100928 -246301 -101127 61457 -157097 -152046 40129
10905e9305m28465b0724B00139r5767P6883H0600B0135g2584b8646A45695a95091
10893d83510a22723j01096L2175K732E0869h2571I5982a76825H222J08008g8074
10881b61574A04877J03554A2308M2076A994R337K53536m4932c1698j96940d4769
10869h33A56479A035R4024N796a1024B714P5140a5809j31443k71882C44542A7532
10856f2420A00447D9419J60151a35639n8543C29473d4296I2489Q2064o3495Q3790
10845A94848a51288j28544E7892h2153k59566b1326A57864G6588B4659d11470
10834a19780M8204A56253p2297q800c88167C0834j0492A373K31418A5691a59268
10822c29101g0202h347l36236B89805i008c895p3007p1538m2792d7391k19317
$$ plain form
10905 -59305 -487770 -20724 200139 104372 181255 80600 20135 -72584 -28646 145695 -195091
10893 -483510 -122723 -223819 -191644 -188912 50869 -82571 95982 -176825 8222 116230 -78074
10881 -261574 104877 208431 12308 54384 1994 11331 264867 219935 -31698 -228638 -44769
10869 -833 156479 1035 95059 100855 -11024 2714 77854 -15809 -147252 -419134 344542 17532
10856 -62420 100447 49419 209570 -135639 -194182 329473 -44296 92489 174553 111058 194848
10845 194848 -151288 -279832 57892 -82153 -341719 -21326 157864 76588 24659 -411470
10834 -119780 -71576 156253 83956 75156 -388167 30834 20342 1373 232791 15691 -159268
10822 -329101 -70202 -8347 -344583 289805 -9008 -3895 -76902 -148440 -191232 -47391 -266708
10811b66708C9870a38531F8730j9091J84130F6668b95779O9330H4822a13046b1701
10799b7175A51584f2751B4389a06675B02048R3a49346P022B46742a00946q92C0329
10786G9684a77486f2685A00896a35496o967B31198H9641K271a46710L1954A33462
10774D7179a78983B52484i768j16186n1345d879r5716M5704E731c8683A36776
10762h0568J6415k13142e3143K0918n7576d4458a241j61045k09665E0083B2446
10750B42867q9184b07904k33664a9439k9170E1237a81428A51209c72291a62296
10739a81639j77910H5524b81863B39906a5952j00939j22971A48863i3691E1425
10728A60614b22686k2764e0241k59550A01343b95426J8062a38554h239o1319q7403
$$ plain form
10811 -266708 39870 -138531 68730 49639 233769 66668 -295779 -226449 84822 -113046 -21701
10799 -27175 151584 -62751 24389 -106675 202048 202141 -149346 -142324 246742 -100946 -101838 30329
10786 79684 -177486 -62685 100896 -135496 -142463 231198 89641 91912 -146710 -114756 133462
10774 47179 -178983 252484 -9768 -125954 -177299 -4879 -100595 -54891 5731 -38683 136776
10762 -80568 -64153 -277295 -53143 -32225 -89801 -44458 -1241 -162286 -371951 50083 22446
10750 242867 153683 -207904 -441568 -19439 -48609 51237 -181428 151209 -372291 -162296
10739 -181639 -359549 85524 -281863 239906 -15952 -116891 -239862 148863 -93691 51425
10728 160614 -222686 -245450 -50241 -309791 101343 -295426 -277364 -138554 -8239 -69558 -156961
10717a56961B8445J32545c48225D4195J0488a23910j70777J30059j01525a591
10706e8807m2011p1260g2853j20145F5794a9717A6318D221K02658a81745F5985
10694D53849A17189j1266i8418m01179a49924j7688A57291e8001A44636a36656
10683C06884C6153P8576m6951j90a76505B40792a37449j04665A499a7646k315
10672a9961k10680c6198B5914E542d7158F2499d05826h9376A74294d5531q1991
10661a27522A4835f8559C28160A5350g8293k28331A29151a5159j0891k25404d0233
10649e161A21525a99607B2673O1305P0070d0105j64160P4524d1882n5330A61489
10637F1656b46494Q2941b5537B46430b88105F2966a48748O366A88495f4978k22124
$$ plain form
10717 -156961 28445 160990 -348225 44195 54683 -123910 -294687 -164628 -266153 -1591
10706 -58807 -100818 -172078 -72853 -192998 65794 -19717 16318 4221 206879 -181745 65985
10694 453849 117189 105923 -98418 -499597 -149924 -167612 157291 -58001 144636 -136656
10683 306884 36153 114729 67778 67588 -176505 240792 -137449 -242114 1499 -17646 -19961
10672 -19961 -230641 -36198 25914 5542 -47158 62499 -405826 -89376 174294 -45531 -127522
10661 -127522 14835 -68559 328160 15350 -78293 -306624 129151 -15159 -26050 -251454 -40233
10649 -5161 121525 -199607 22673 83978 154048 -40105 -204265 -129741 -41882 -97212 161489
10637 61656 -246494 -163553 -25537 246430 -288105 62966 -148748 -142382 188495 -64978 -287102
10626b87102a15169l9495a3610j31075C5513K3442L31436c3275p2754j50608Q9983
10615a66654H9798k5839L04937a93048G70a80653D3186b81180G3041J45033r3446
10604A24628D8807e9558A23664B1123e8912J9119j57610p3877E3979J25524d4579
10592f1106B29109A596g9348F3282b42620a02188A2172J13046P5662d16114A73508
10580a10542o5666a1203A82658a52704j62451D6233P0753a84261C08280C9216
10569B84354a04170A15045A595K0562h1743l0027A05220b31424d316k95049A48795
10557A23766M5305d38587a755B48961H193b92149A16898b11226i8272j17689l8886
10546b54847A53268L7597g3204k58554d1354B23125i0815c3708I5395A790a62181
$$ plain form
10626 -287102 -115169 -154664 -13610 -144685 35513 58955 390391 -33275 -106029 -256637 -166654
10615 -166654 89798 63959 368896 -193048 770 -180653 43186 -281180 73041 218074 124628
10604 124628 48807 -59558 123664 21123 -58912 -39793 -197403 -271280 53979 179503 -44579
10592 -61106 229109 1596 -79348 63282 -242620 -102188 12172 125218 200880 -416114 173508
10580 -110542 -176208 -11203 182658 -152704 -315155 46233 116986 -184261 308280 39216
10569 284354 -104170 115045 1595 22157 -81743 -111770 105220 -231424 -4316 -299365 148795
10557 123766 169071 -438587 -1755 248961 8193 -292149 116898 -211226 -98272 -215961 -254847
10546 -254847 153268 190865 -73204 -331758 -41354 223125 -90815 -33708 95395 1790 -162181
10534b25735n5835h7140k5487j5176a4913j92259e3985q1174G8475a29335l4319
10523a63654j49575A7990P2873a79696B90463g6695j48479n2998b3832j83064
10513b06896G5684k1902i3996a2654k0868B28697n0739c05288E6283a26212A30109
10501h686A19269L2262K21075C5067b51500g6335j0133a2897p616F7289J19351
10490A86640a32571J4467j58575a14080E705J42170E3003J20484B0276O09886
10480F30162B80572J13157P4573j65456q702Q3918A83470e0821I3518K519f4688
10468a56631P6924K9863a7509C57109a26248J5189E0825b19061I241J85908b30136
10456I666L53427a14845A45443R6066r6582Q9815b37929A12147c60248A17446
$$ plain form
10534 -225735 -281570 -87140 -112627 -127803 -14913 -207172 -53985 -135159 78475 -129335 -163654
10523 -163654 -313229 17990 90863 -179696 290463 -76695 -225174 -278172 -23832 -206896
10513 -206896 75684 53782 -93996 -12654 -33522 228697 177958 -305288 56283 -126212 130109
10501 -8686 119269 151531 372606 35067 -251500 -76335 -86468 -12897 -20513 67289 186640
10490 186640 -132571 -118104 -276679 -114080 5705 147875 53003 173487 20276 630162
10480 630162 280572 393729 468302 302846 294144 378062 183470 -50821 93518 96037 -64688
10468 -156631 -79707 -49844 -17509 357109 -126248 -111059 50825 -219061 9241 195149 -230136
10456 9666 363093 -114845 145443 241509 144927 234742 -237929 112147 -360248 117446
10445c7121j54918A00984a41922E3546c8149h622B8631d7151E1055c4058F4791
10433C8534h8108l35537C188Q9923g3900B45448k3653a12502K2561l19921A59341
10421f741n2878j38296B85169C4256b3091j61023a6696A00983J20533a46474A05014
10409c31505B1772J27679a63151j7067C3308J26553p1236b07371j36065B05563
10398c23675A81329K3067d9910k62901A03516J45909J23733A1817J53208O1421
10388B26446i9423a3462a838k07180A31256b32207A71389L76877f9023A37102
10377B72135Q263q0460K02061q6288O8694A70209n5042K44546C5872K49319A31505
10365C92503J53337j32346k6160b8443B89720Q7414A00934Q59J3014k2191B2806
$$ plain form
10445 -37121 -192039 100984 -141922 53546 -38149 -8622 28631 -47151 51055 -34058 64791
10433 38534 -88108 -423645 3188 93111 -73900 245448 221795 -112502 -89941 -409862 159341
10421 -6741 -59619 -197915 285169 34256 -23091 -184114 -16696 100983 221516 -146474 105014
10409 -331505 21772 149451 -163151 -180218 33308 159861 88625 -207371 -343436 205563
10398 -323675 181329 204396 -49910 -312811 103516 249425 373158 11817 165025 226446
10388 226446 -99423 -13462 -1838 -209018 131256 -232207 171389 548266 -69023 137102
10377 272135 280398 199938 401999 315711 384405 170209 115167 359713 35872 285191 131505
10365 392503 545840 413494 387334 -28443 289720 377134 100934 101793 114807 92616 22806
10353A59679K95162A73162M15599K43432j64442j60697o6j37418b38365D42430
10342D48676A23902J88750h2982A52740F3472L9594J51493K28566C2332J89443
10332B21775j04598A9714J97226a405q9733o246b8519A24893d03014I0273L34704
10321D24977L31578C59413j16222p9933N5993K9022J50513A08779L6369M05680
10311E50828k31407j25735b4019B7050i0430A08647k1500C3749h8233E9698r477
10300E0221K8581k4525a57034a4798A09088a03287K339C20782a55713e3701m24817
10289d78518i8583j25040J09924B88345A19024a32176O2278N019I1378e6106C9004
10277A1878d6915B23906b08894c3B422d39891a00272b2785A76368a34308B54418
$$ plain form
10353 159679 454841 173162 588761 832193 667751 507054 506988 369570 -238365 442430
10342 448676 123902 312652 -82982 152740 63472 103066 254559 483125 32332 221775
10332 221775 117177 19714 216940 -1405 -91138 -97384 -28519 124893 -403014 90273 424977
10321 424977 756555 359413 243191 163258 219251 248273 398786 108779 145148 550828
10311 550828 319421 193686 -24019 27050 -90430 108647 87147 33749 -88233 59698 50221
10300 50221 78802 54277 -157034 -14798 109088 -103287 -100948 320782 -155713 -53701 -478518
10289 -478518 -98583 -223623 -113699 288345 119024 -132176 -69898 -64879 91378 -56106 39004
10277 11878 -46915 223906 -208894 -33 2422 -439891 -100272 -22785 176368 -134308 254418
10265a21844E0904Q4614A8212O6383O6225o7380J93642j25218c3596D02886E3697
10253A49914K00164E1598B1860K03873I5881a6587B17429o6332e8534k32728A21119
10241e8665H708e1847l7874A05803c2552C73024e0714E3065P4010A9951M7560
10230F7511a54537c6788J2602q7995G6885b77613J26657c2309H5654a61242r1154
10219b52396J06044D8624b03226B98312b30027J08276k1324C94526I0771a79013
10208b78462n3152F5718K891B3147K5918b25355l2121i1169c5916A57892J25028
10197B82920j11934b455j5300n3370K1716k01388a2821J978k2400j15984j01830
10186b51057A59616b3621j96663a2024A6203a65029D1496J6019a97983k7629l2052
$$ plain form
10265 -121844 50904 135518 18212 84595 150820 83440 277082 151864 -33596 402886 53697
10253 149914 350078 51598 21860 225733 95881 -16587 217429 151097 -58534 -291262 121119
10241 -58665 8708 -51847 -89721 105803 -32552 373024 -50714 53065 127075 19951 67511
10230 67511 -154537 -36788 -24186 -112181 76885 -277613 -150956 -32309 85654 -161242 -252396
10219 -252396 -146352 48624 -203226 298312 -230027 -121751 -143075 394526 90771 -179013
10208 -278462 -331614 65718 68609 23147 49065 -225355 -257476 -91169 -35916 157892 282920
10197 282920 170986 -2455 -17755 -71125 -49409 -250797 -12821 -10843 -33243 -149227 -251057
10186 -251057 159616 -23621 -220284 -12024 16203 -165029 41496 57515 -197983 -225612 -257664
10175b57664i4916G0594B5618L3425K29639a05298A23208g0208C3655a34845J2835
10164a22010F0230a91744J3205A72439d2992j13448k8885j24288a08544k58777
10154c67321a61441C44249A49630n6415a55861g0146L3980j20338k21034P4665
10144c02873J20961f1468F2258b79001J09875A62989h6361B14850a80226A0157
10133G7568b97820C4614L1794R5362a13072j42621g922a376k28229a0547k07793
10122b18340A987N6678a37983A5601e6476l14532C10620F568b93808A05284a72750
10110A27915L9210a61044E792N146L6341a94292d2916j21848F8046i2563k69031
10099c61594f1516E7569a06255A55532c7326j22925A22539a75510J5536f7036
$$ plain form
10175 -257664 -94916 70594 25618 59043 288682 -105298 123208 -70208 33655 -134845 -122010
10164 -122010 60230 -191744 -178539 172439 -42992 -156440 -185325 -309613 -108544 -367321
10154 -367321 -161441 344249 149630 93215 -155861 -70146 -36166 -156504 -377538 -302873
10144 -302873 -181912 -61468 62258 -279001 -169126 162989 -86361 214850 -180226 10157
10133 77568 -297820 34614 66408 161770 -113072 -255693 -7922 -1376 -229605 -10547 -218340
10122 -218340 1987 58665 -137983 15601 -56476 -371008 310620 6568 -293808 105284 -172750
10110 127915 167125 -161044 5792 10938 47279 -194292 -42916 -164764 68046 -92563 -361594
10099 -361594 -61516 57569 -106255 155532 -37326 -160251 122539 -175510 -159974 -67036
10088b36813H1665C1831b38807J10228F7203a84001q182R5734j05976B6080J7256
10077D3336J84761j0041q6603J27677b29828C05874A31193J39099a95062R1587
10067a03475m07537G9016b80232F2573Q2134k6737a66256j18406J03170a5016
10056a22959I5475P0675b61481A34690a59888C12723b42444j62729J67162J17635
10046a20376A4427a53712J7874F0019L0819P8121a17769m2126a5230j22409j0010
10035a47649N0545J7152A7945e8269l66761A97384a23028j83087A1998b28870
10024A53000a17029a055j03325B07231c16706a32088l2954c1653A0503a21538
10013b001k79259a12127r7207E1339a19692I01J76961a8117A277b11690K8719
$$ plain form
10088 -236813 81665 31831 -238807 -128579 67203 -184001 -192183 -96449 -202425 26080 43336
10077 43336 228097 218056 131453 259130 -229828 305874 131193 270292 -195062 -103475
10067 -103475 -511012 79016 -280232 62573 144707 117970 -166256 -284662 -181492 -15016
10056 -122959 95475 166150 -261481 134690 -159888 312723 -242444 -405173 -238011 -120376
10046 -120376 14427 -153712 -135838 60019 90838 168959 -117769 -159895 -15230 -137639 -147649
10035 -147649 -97104 -79952 17945 -58269 -425030 197384 -123028 -306115 11998 -228870
10024 153000 -117029 -1055 -104380 207231 -316706 -132088 -165042 -31653 10503 -121538
10013 -2001 -281260 -112127 -209334 51339 -119692 901 177862 -18117 1277 -211690 -182971
10002a82971A57206h1492c4652A98157a55418A5006M8582R1985d6326A76140f0179
9990b66957C4016a25188B713P7254A54d0928K0153k93941L8666j42327b155q3199
9978h5354I5271h4821H6226b21725D5168b30936A26010g8226F2750K83553b70633
9966b9306n4620H9904b79514Q5162A55500b46187P3075B39465J95071j61404c15300
9954a42066j60693a31401o7551b2409C891d01333A16677D169R3905b04732A00037
9942a63247N875M0869a0833I7617c495A09832a74324j49281R1204b4381R134r2180
9930a07427J2469B321a32413B16441a84621B55855a43319L4028l4777a9329C8794
9918b43934J04217K3006j26129O8297A55302o2866a07948a4084l1544a192k50556
$$ plain form
10002 -182971 157206 -81492 -34652 198157 -155418 15006 63588 155573 -46326 176140 -60179
9990 -266957 34016 -125188 2713 79967 154 -40928 -20775 -314716 -276050 -418377 -2155 -85354
9978 -85354 95271 -84821 86226 -221725 45168 -230936 126010 -78226 62750 346303 -270633
9966 -29306 -83926 89904 -279514 -194352 155500 -246187 -173112 239465 434536 273132 -315300
9954 -142066 -302759 -131401 -198952 -22409 3891 -401333 116677 4169 98074 -204732 100037
9942 -163247 -157372 -116503 -10833 97617 -3495 109832 -174324 -323605 -232401 -24381 -15247 -107427
9930 -107427 -94958 2321 -132413 216441 -184621 255855 -143319 -109291 -144068 -19329 38794
9918 -243934 -139717 -116711 -242840 -174543 155302 92436 -107948 -14084 -45628 -1192 -251748
9907b51748I5222f8723k8119m1206H6404l14K00813G9568C2401J02165e687k56967
9895b62654A57394J12786a51092j00125A15683a94006j92178J90318b132p4166
9885g6298a8387A57463i8818e620j5010A04799R6564a55353k11902E6141P0064
9874A26205j1098k6087d15307K00554K6606B8081a14240K8187K1815B27264D7582
9862b2795n9606o6631J0381l33383a79703I2410a98372b1824r7677k08756a17736
9850c9940m6816B94335p4986P267n8223e60982a44888j33583C9706J04300b71798
9838g5438o6715b2249k18367r4259d6723A68442l3363b16924B82006D2547b5350
9826a19720B10238A00103j0747d2678c159m09156A63013b06552c6629k8655r0497
$$ plain form
9907 -251748 95222 -68723 -96842 -138048 86404 86090 286903 79568 32401 134566 -5687 -262654
9895 -262654 157394 270180 -151092 -251217 115683 -194006 -386184 -195866 -2132 -76298
9885 -76298 -18387 157463 -98818 -5620 -20630 104799 201363 -155353 -367255 56141 126205
9874 126205 115107 89020 -415307 -214753 -188147 28081 -114240 -86053 -64238 227264 47582
9862 -22795 -82401 -149032 -138651 -472034 -179703 92410 -198372 -21824 -119501 -328257 -117736
9850 -39940 -86756 294335 219349 226616 168393 -560982 -144888 -278471 39706 144006 -271798
9838 -75438 -142153 -22249 -240616 -334875 -46723 168442 135079 -216924 282006 42547 -25350
9826 -119720 210238 100103 89356 -42678 -3159 -412315 163013 -206552 -36629 -65284 -155781
9815a55781J8081b0492k06386i6895a4351E9803e4147a6581l1523j42598j5462
9804b06164I0460B68O1560g1467j50921H1541a42296D0419K8088c35369G7678
9792E4842d8213G8832J7266J37040d49075e2429D1915D953c19718A18743e9383
9780a74213j57152q934F9952k122k7972g2614m4946o7380j28325f5078n8794m5551
9768a69423B4427L0320b83586A52132g4375c2300G7385a03734l32149J39346O4680
9757b31857B25835I9472N2540d42122J79753H0856f5135D4825b88481j49813f0443
9745b66664E4190c16898p0311R9859i0688p8982A40495d2237k08376e6895j84737
9734b41632a06679K6667o5318A60081c48924J50087n3629R9205k7700A50464O8235
$$ plain form
9815 -155781 -137700 -20492 -226878 -96895 -14351 59803 -54147 -16581 -48104 -190702 -206164
9804 -206164 90460 268 61828 -71467 -222388 81541 -142296 40419 68507 -335369 77678
9792 54842 -48213 78832 96098 233138 -449075 -52429 41915 4953 -319718 118743 -59383
9780 -174213 -331365 -340299 69952 67830 39858 -72614 -117560 -184940 -313265 -65078 -123872 -169423
9768 -169423 24427 54747 -283586 152132 -74375 -32300 77385 -103734 -435883 -296537 -231857
9757 -231857 225835 99472 152012 -442122 -262369 80856 -65135 44825 -288481 -438294 -60443
9745 -266664 54190 -316898 -387209 -287350 -90688 -169670 140495 -42237 -250613 -56895 -241632
9734 -241632 -106679 -80012 -145330 160081 -348924 -198837 -252466 -153261 -180961 150464 218699
9723B18699q6742K88959h0627K930p9792c6349k46700a446A2666M0686a06637
9711c88191M1521A21343e10704a33789C0158c60012D7427b59972A06495a32006
9700b98545d137j87401A05335a52179N4828K4208n3907j05934n1138A3119b1311
9688b57524l8049N980a03588k53743i447m43294A20752J99773b10259g7208C52260
9676A15562a19737H8649a72250O1265E6426K59018G8342l1371a69392n6307K8448
9665a97251h5953k90768J62082B37468A02643P4178h0510A28353c46456A44930
9654i0556B40562H9978O115J42833a33293o6209G4092a93226F1069C0109M7371
9643G7480C631c52218a20051B8422d8162k18609A24077j8176b47340K7831J08577
$$ plain form
9723 218699 131957 420916 -80627 -77697 -157489 -36349 -283049 -1446 12666 53352 -106637
9711 -388191 -346670 121343 -510704 -133789 30158 -360012 47427 -259972 106495 -132006
9700 -298545 -4137 -191538 105335 -152179 -97351 -73143 -127050 -232984 -284122 13119 -21311
9688 -257524 -295573 -289593 -103588 -357331 -9447 -452741 120752 320525 -210259 -77208 352260
9676 115562 -119737 88649 -172250 -110985 56426 315444 78342 46971 -169392 -225699 -197251
9665 -197251 -85953 -376721 -214639 237468 102643 176821 -80510 128353 -346456 144930
9654 -90556 240562 89978 96093 238926 -133293 -199502 74092 -193226 61069 30109 77480
9643 77480 3631 -352218 -120051 28422 -48162 -266771 124077 105901 -247340 -219509 -110932
9632a10932L3321B30699e41915A64594e245n1686C0654b30719J6624K7938f0898
9620c3993R043E9711e18409J85534B37126c1141k26942a1779j36253J3006i892
9608c25361a55562K551C7235e2321B05305O948a71485C23210b28249A6322e5076
9596a12836j62989M5908B7993K20830I7593b29707I5017a9701k2749q880A93076
9584d52271f2836m3914J0271j2827j3054C27259h6943j5393j46947j51589B90562
9572B92581b645A58932l7953g9648m6126A82381K73120a24972k06253J53003A14941
9560B58601C786f0164m1297j71521J21855N5451p1239A2295c14453a47220m9662
9549a96882G944d20923a40629l7367J8975m7327l2229O4558P3756B96563b53523
$$ plain form
9632 -110932 -77611 230699 -541915 164594 -5245 -56931 30654 -230719 -214095 -186157 -60898
9620 -33993 -24950 59711 -518409 -332875 237126 -31141 -258083 -11779 -148032 -135026 -9892
9608 -325361 -155562 -153011 37235 -52321 205305 212253 -171485 323210 -228249 16322 -55076
9596 -112836 -275825 -229917 27993 248823 97593 -229707 95017 -19701 -42450 -51330 193076
9584 -452271 -62836 -106750 -96479 -109306 -122360 327259 -86943 -102336 -249283 -400872 290562
9572 292581 -2645 158932 120979 -79648 -125774 182381 455501 -124972 -331225 -178222 114941
9560 258601 3786 -60164 -101461 -272982 -151127 -95676 -166915 12295 -314453 -147220 -196882
9549 -196882 7944 -420923 -140629 -177996 -159021 -206348 -238577 -174019 -100263 296563 -253523
9537g5311p3254J8090b4383f938k574p2770B34272D9877J23314a34049l552N5303
9525h2298b0567k08766g4478F8449c6420I2756B6872i2687l7866b1729j73202
9514a94931A00532b42704b476B35610c1142j62036n0540a09753k23135o2337a39717
9502A21043b67756a03428A51538a26020j00478K8957f1728A20050e9699m5654
9492a05353p5484k78089P8377F4346b43874Q4472I1766e3377j82002K0945L8214
9481a76220Q4021k44528A27970b22883P2987i91A28844c8051p5846l3996C97759
9469D2506d5837j5827j32921B0799J0925a87232A99852b31418J14592J957K3872
9458i0997j81513C1435J10380c46134B7283b95966j32805a86259j32882A00184
$$ plain form
9537 -75311 -148565 -130475 -24383 -6938 -9512 -82282 234272 49877 173191 -134049 -137601 -82298
9525 -82298 -20567 -229333 -74478 68449 -36420 92756 26872 -92687 -130553 -21729 -194931
9514 -194931 100532 -242704 -2476 235610 -31142 -193178 -243718 -109753 -332888 -395225 -139717
9502 121043 -267756 -103428 151538 -126020 -226498 -197541 -61728 120050 -59699 -105353
9492 -105353 -180837 -458926 -380549 64346 -243874 -159402 91766 -53377 -235379 -214434 -176220
9481 -176220 -92199 -336727 127970 -222883 -149896 -991 128844 -38051 -113897 -147893 397759
9469 42506 -45837 -61664 -194585 20799 31724 -187232 199852 -231418 -116826 -114869 -90997
9458 -90997 -272510 31435 141815 -346134 27283 -295966 -428771 -186259 -319141 100184
9447a91683j66018A20580a51706p9188e6896A30849E2233b1134l20928J50138
9437a91924M0370k6076H5437b18755L2021A20570L1133G3170a73615k05128a68211
9425d0447A49007H905c71589a75750A10366c43551F7793a84567j12948C08365
9414a58023K2281e9800K5513l95415A3213a66704j55618a29855E4773P9482n3270
9403H0985Q3386D945d5169k08278J13863b0310j17576k6166h0710C1048B856L48110
9391C50966G4001b57847D4121c67A7830e7302G1961a57981f1031l6870B71366
9379D580a32031A4758a11094j61184R5945D5058K61413D2147J16729C2677a53049
9367e8202b7730k1920q5537B08588j4513a76394A01818K26819f2802n9777B21271
$$ plain form
9447 -191683 -357701 120580 -151706 -230894 -56896 130849 52233 -21134 -342062 -191924
9437 -191924 -151554 -177630 85437 -218755 -186734 120570 151703 73170 -173615 -378743 -168211
9425 -40447 149007 8905 -371589 -175750 110366 -343551 67793 -184567 -297515 308365
9414 -158023 -135742 -59800 -34287 -429702 13213 -166704 -322322 -129855 54773 134255 80985
9403 80985 164371 4945 -45169 -253447 -139584 -20310 -137886 -164052 -80710 31048 2856 350966
9391 350966 74001 -257847 44121 -367 17830 -57302 71961 -157981 -61031 -97901 271366
9379 4580 -132031 14758 -111094 -272278 -176333 45058 306471 42147 158876 32677 -153049
9367 -58202 -27730 -49650 -135187 208588 194075 -176394 101818 328637 -62802 -122579 221271
9355C40842a01953A80078d3067m9759k4660j19807A35403e0667A20832a91292
9344a31397K8706N540a9288j9532B8080h1817p8608H747M9943g5754k68550a44893
9331B23722i1227D4604a56802M7810b097l7791A32325K3554i2411a2027I3309
9319B4138b76284J04251O7456g134q6610G6509c05547A67496B2055a36944e952
9307a35386k20329B40495p3627e4046p6996q5119K0177Q8504k5705l7062m8768
9296b19015O0859L2875J0270j14022F876J93283i256k7573k00763e0318P983j71265
9284b13600j7348k48755B44354A8145c0912J901j78732h026n12n5123h002k03580
9272b11582Q952b4749k08723O2461a3266l36652B60939a06418j64062P0921e6111
$$ plain form
9355 340842 -101953 180078 -43067 -92826 -117486 -237293 135403 -50667 120832 -191292
9344 -131397 -102691 -97151 -19288 -38820 28080 -81817 -160425 8747 58690 -75754 -344304 -144893
9331 223722 -91227 44604 -156802 -108992 -2097 -39888 132325 155879 -92411 -12027 93309
9319 24138 -276284 -172033 -104577 -7134 -93744 76509 -305547 167496 22055 -136944 -5952
9307 -135386 -355715 240495 166868 -54046 -131042 -216161 -195984 -107480 -133185 -170247 -219015
9296 -219015 -158156 -125281 -115011 -229033 6876 200159 -9256 -36829 -237592 -50318 -42335 -213600
9284 -213600 -230948 -479703 244354 18145 -30912 -29011 -207743 -8026 -8538 -63661 -8002 -211582
9272 -211582 -202630 -24749 -233472 -171011 -13266 -349918 260939 -106418 -270480 -199559 -56111
9260H4683N4116b27861A96074f7467d301j97553H4964c125A89460b03713K2248
9249a81465b1239c076j14748i188A69857b97551e4215m2815L254A46022b06914
9237A2835g0633j07202p9533O2169M5771n1293m9572K9728A82439F0386P8402
9226A38788b2607n7955j21228A08853L9438a59737O1354A52388c70808D02922
9215d09021A90118A4326a50668d9689l4402N290l2543q3589g9289c3571D6075
9203i9518j00816j66947f5445B29790a22981r511A3114a72506B30333a3122k01393
9192b14515Q4814H4021c3108j98222r833C41652a85678D03974c67060d2639J9387
9181b3252C11340B0412Q7375C5675c17714E0000j7464O4815d46358J855J37255
$$ plain form
9260 84683 138799 -227861 196074 -67467 -4301 -201854 84964 -3125 189460 -203713 -181465
9249 -181465 -21239 -3076 -117824 -9188 169857 -297551 -54215 -97030 -93776 146022 -206914
9237 12835 -70633 -177835 -257368 -195199 -149428 -200721 -250293 -220565 182439 60386 138788
9226 138788 -22607 -80562 -201790 108853 148291 -159737 -98383 152388 -370808 402922
9215 -409021 190118 14326 -150668 -49689 -84091 -78801 -111344 -194933 -79289 -33571 46075
9203 -99518 -200334 -367281 -65445 229790 -122981 -132492 13114 -172506 230333 -13122 -214515
9192 -214515 -129701 84021 -33108 -231330 -241163 341652 -185678 403974 -367060 -42639 -23252
9181 -23252 311340 20412 107787 35675 -317714 50000 32536 97351 -446358 -444503 -307248
9170c07248J11773p1401c3091m02768a56153G6391C3557b95769J35644B39064
9159A12843b86250A66024D9006M4950e5947D04936b10919F4886a83500P7195o1956
9148a68261E8216M2374O1971p1943a42292M6378k16743a07465l7597A31737f9124
9136a37184l03171i9483j62462l093A07878b4011k87374J24064C8443c07972p2177
9125c80149J50226f0421q3183M0645p2548Q6085k87109D8019R6117a61912k63559
9114d25471l9801b2967B961M5946e5422q5590A23119a35741L6033i755j32787
9103a42542p406A838J27640a6981j20195j69109a29472h196k16231h4361b1591
9091c0258G7119c2020E4516a76634l2365g7346A3245c71A7263Q6283M7574b39450
$$ plain form
9170 -307248 -195475 -266876 -33091 -435859 -156153 76391 33557 -295769 -160125 239064
9159 112843 -286250 166024 49006 93956 -55947 404936 -210919 64886 -183500 -106305 -168261
9148 -168261 58216 100590 162561 90618 -142292 -95914 -312657 -107465 -145062 131737 -69124
9136 -137184 -440355 -99483 -261945 -265038 107878 -24011 -311385 -187321 38443 -307972 -380149
9125 -380149 -229923 -60421 -143604 -102959 -175507 -89422 -376531 48019 144136 -161912 -425471
9114 -425471 -465272 -22967 2961 48907 -55422 -141012 123119 -135741 -99708 -9755 -142542
9103 -142542 -149948 1838 129478 -16981 -137176 -306285 -129472 -8196 -224427 -84361 -21591
9091 -30258 77119 -32020 54516 -176634 -208999 -77346 13245 -371 17263 103546 151120 -239450
9078a11750L1269I7019a15921q5879i6939j79362r5673J57547E6807e7139G2944
9066C5300J23498c79482I8317c904G3814j0886J12826k1746d3501m6827m0118
9055a30446j78730J49287P6939a6532H9297K37214I2461a20161P901H5570K70820
9044C56390c962j7993A78686a92274A10470b46254A98677D5565a62135B65653
9033B69225A2520i0370A28035D6961k147L7661f5565F1634M3154R711a74584A67026
9020c70364a2395C36448A41974a33988a3622k83713a6335n5614b7315j12166b7936
9008B01973G6244g9337A64008C1445K17300b6403j21689p873c6191D35590C8599
8996A88008F6484a27437n5499j78328J37508i3426k72161A37392a1340F4504d6638
$$ plain form
9078 -111750 -80481 97019 -115921 -201800 -96939 -276301 -371974 -214427 56807 -57139 72944
9066 35300 158798 -379482 98317 -3904 73814 62928 175754 154008 -43501 -90328 -130446
9055 -130446 -309176 -159889 -82950 -16532 89297 326511 92461 -120161 -112260 85570 356390
9044 356390 -3962 -21955 178686 -192274 110470 -246254 198677 45565 -162135 265653
9033 269225 12520 -90370 128035 46961 44814 82475 -65565 61634 104788 114499 -174584 167026
9020 -370364 -12395 336448 141974 -133988 -13622 -297335 -16335 -71949 -27315 -139481 -27936
9008 201973 76244 -79337 164008 31445 248745 -26403 -148092 -155965 -36191 435590 38599
8996 188008 66484 -127437 -182936 -361264 -223756 -93426 -365587 137392 -11340 64504 -46638
8984g6387j36457A7462b01779D1939a61163j75722A1083L5458i0272j38014B4997
8972a92629d980j91420L3742o0699A56362l8725J39460g201l13957C1544c66925
8960b3962p7432K6706m8454H170J25775D1991A2998a38048j19023R499B41626
8948a48448A11644b62423B22259a55182M1358m2577F7859b4495r3191H8237a1747
8936a98923n9614A57216M8816F3117i8178A75084m2254f9532c1244p6690l9714
8925a47648A70043N27008J036534M075321O730966E362681I06675l30862j83523
8916C92290J25810k47516j1447F8940a61698A46449E7352J88402J6171b38081
8905A51680j2764m1653e7896m1417a0030l04285a17194a9595e710p8668j36627
$$ plain form
8984 -76387 -212844 17462 -201779 41939 -161163 -336885 11083 46541 -90272 -228286 24997
8972 -192629 -4980 -196400 -162658 -223357 156362 117637 257097 -7201 -321158 31544 -366925
8960 -23962 -101394 -74688 -123142 8170 133945 41991 12998 -138048 -257071 -247572 241626
8948 -148448 111644 -262423 222259 -155182 -113824 -156401 67859 -24495 -117686 88237 -11747
8936 -198923 -258537 157216 206032 63117 -98178 175084 132830 -69532 -31244 -107934 -147648
8925 -147648 170043 697051 1733585 5808906 12539872 5362681 906675 575813 392290
8916 392290 518100 270584 259137 68940 -161698 146449 57352 245754 261925 -238081
8905 151680 138916 97263 -57896 -99313 -10030 -314315 -117194 -19595 -5710 -84378 -221005
8894b21005H6305Q7863a53875k07953e3112B85614e4248j47726J5800h9214D4328
8882c28359f1233p6107E1711a10278l24961a86275k21230a64962F08a24223J4880
8871a09343G5283J03303g2982K621j19340P8795j74822F8469b58076Q0912b4048
8859a43162l09686A25571n5892j8238J85316a27054e426l4262m09317F3973K80609
$$ plain form
8894 -221005 86305 174168 -153875 -361828 -53112 285614 -54248 -201974 -186174 -89214 44328
8882 -328359 -61233 -137340 51711 -110278 -435239 -186275 -407505 -164962 608 -124223 -109343
8871 -109343 75283 178586 -72982 -70361 -189701 -110906 -285728 68469 -258076 -177164 -24048
8859 -143162 -452848 125571 69679 51441 236757 -127054 -5426 -39688 -449005 63973 344582
$$ [...]
##END NTUPLES=NMR SPECTRUM
##END=
