
##TITLE=UV1288_M2_1207-1380_50_7534843_HtdeF4JgzA
##JCAMPDX= 6.0         $$ Bruker NMR JCAMP-DX V2.0
##DATA TYPE= NMR SPECTRUM
##DATA CLASS= NTUPLES
##ORIGIN= BRUKER
##OWNER= Administrator
$$ 1.72 TOPSPIN		Version 2.1
$$ 2013-02-21 22:38:43.768 -0500  Administrator@X
$$ Compression mode = diff/dup
##.OBSERVE FREQUENCY= 400.02188249412
##.OBSERVE NUCLEUS= ^1H
##.ACQUISITION MODE= SIMULTANEOUS (DQD)
##.ACQUISITION SCHEME= undefined
##.AVERAGES= 64
##.DIGITISER RES= 22
##SPECTROMETER/DATA SYSTEM= spect
##.PULSE SEQUENCE= noesygpps1d.comp
##.SOLVENT NAME= COFFEE_meoh
##.SHIFT REFERENCE= INTERNAL, COFFEE_meoh, 1, 14.9612
##AUDIT TRAIL= $$ (NUMBER, WHEN, WHO, WHERE, PROCESS, VERSION, WHAT)
$$ ##TITLE= Audit trail, TOPSPIN		Version 2.1
$$ ##JCAMPDX= 5.01
$$ ##ORIGIN= Bruker BioSpin GmbH
$$ ##OWNER= Administrator
$$ $$ E:\/data/COFFEE/nmr/UV1288_M2_1207-1380_50_7534843_HtdeF4JgzA/12/pdata/1/auditp.txt
$$ ##AUDIT TRAIL=  $$ (NUMBER, WHEN, WHO, WHERE, PROCESS, VERSION, WHAT)
(   1,<2013-02-21 22:38:37.643 -0500>,<Administrator>,<X>,<go>,<TOPSPIN 2.1>,
      <created by zg
	started at 2013-02-21 22:27:07.341 -0500,
	POWCHK enabled, PULCHK disabled,
       configuration hash MD5:
       86 BA 57 50 F2 9D 5C 9B 26 00 A9 28 5F 66 2E 89
       data hash MD5: 64K
       EF BB 9B A0 80 15 B3 6C 52 62 37 11 8A 9E D7 66>)
(   2,<2013-02-21 22:38:40.831 -0500>,<Administrator>,<X>,<proc1d>,<TOPSPIN 2.1>,
      <Start of raw data processing
       efp LB = 0.3 FT_mod = 6 PKNL = 1 PHC0 = 0 PHC1 = 0 SI = 128K 
       data hash MD5: 128K
       83 92 E1 47 72 EB 33 A0 8C D0 1C CF 7E BB 93 9C>)
(   3,<2013-02-21 22:38:41.925 -0500>,<Administrator>,<X>,<proc1d>,<TOPSPIN 2.1>,
      <pk PHC0 = 248.9063 PHC1 = 0 
       data hash MD5: 128K
       5E C0 5B 40 C5 41 9D 7B 20 24 46 8F 88 3B DE DA>)
(   4,<2013-02-21 22:38:42.706 -0500>,<Administrator>,<X>,<proc1d>,<TOPSPIN 2.1>,
      <abs ABSG = 1 
       data hash MD5: 128K
       2D C4 9A 59 11 E9 64 E6 5D 83 BC D4 8D CA 90 22>)
(   5,<2013-02-21 22:38:42.893 -0500>,<Administrator>,<X>,<proc1d>,<TOPSPIN 2.1>,
      <abs ABSG = 2 
       data hash MD5: 128K
       F2 29 DC 6D BF 2B F8 AA C6 4E 59 A3 1F 1E BA 73>)
(   6,<2013-02-21 22:38:43.065 -0500>,<Administrator>,<X>,<proc1d>,<TOPSPIN 2.1>,
      <abs ABSG = 3 
       data hash MD5: 128K
       89 A9 8C 0E 75 D1 B1 1A AA 75 1E F3 20 34 61 1D>)
(   7,<2013-02-21 22:38:43.253 -0500>,<Administrator>,<X>,<proc1d>,<TOPSPIN 2.1>,
      <abs ABSG = 4 
       data hash MD5: 128K
       04 E1 B1 D4 5A 54 9C 19 DC 80 A8 94 E3 D3 18 6E>)
(   8,<2013-02-21 22:38:43.409 -0500>,<Administrator>,<X>,<proc1d>,<TOPSPIN 2.1>,
      <abs ABSG = 5 
       data hash MD5: 128K
       70 C7 60 0A 6C 7B 7F DE 3A 2C C6 CE DE C3 4C 2A>)
$$ ##END=
$$ 
$$ $$ hash MD5
$$ $$ 10 D7 39 AB DD 57 2B 91 0F 7D 91 D6 07 CE CB 70
##$RELAX= 
##$RELAX= 
##$RELAX= 
##$RELAX= 
##$RELAX= 
##$RELAX= 
##$RELAX= 
##$RELAX= 
$$ Bruker specific parameters
$$ --------------------------
##$DU= <E:\>
##$EXPNO= 12
$$ [...]
150 150 150 150 150 150 150 150
##$TP07= 0
##$TPNAME0= <>
##$TPNAME1= <>
##$TPNAME2= <>
##$TPNAME3= <>
##$TPNAME4= <>
##$TPNAME5= <>
##$TPNAME6= <>
##$TPNAME7= <>
##$TPOAL= (0..7)
0.5 0.5 0.5 0.5 0.5 0.5 0.5 0.5
##$TPOFFS= (0..7)
0 0 0 0 0 0 0 0
##$TUNHIN= 0
##$TUNHOUT= 0
##$TUNXOUT= 0
##$USERA1= <user>
##$USERA2= <user>
##$USERA3= <user>
##$USERA4= <user>
##$USERA5= <user>
##$V9= 5
##$VALIST= <valist>
##$VCLIST= <CCCCCCCCCCCCCCC>
##$VD= 0
##$VDLIST= <DDDDDDDDDDDDDDD>
##$VPLIST= <PPPPPPPPPPPPPPP>
##$VTLIST= <TTTTTTTTTTTTTTT>
##$WBST= 1024
##$WBSW= 4
##$XGAIN= (0..3)
0 0 0 0
##$XL= 0
##$YL= 0
##$YMAX_a= 6253572
##$YMIN_a= -11609644
##$ZGOPTNS= <>
##$ZL1= 120
##$ZL2= 120
##$ZL3= 120
##$ZL4= 120
##$ABSF1= 14.9612
##$ABSF2= -5.596982
##$ABSG= 5
##$ABSL= 3
##$ALPHA= 0
##$AQORDER= 0
##$ASSFAC= 0
##$ASSFACI= 0
##$ASSFACX= 0
##$ASSWID= 0
##$AUNMP= <proc_prof1d_extract.lims>
##$AXLEFT= 0
##$AXNAME= <>
##$AXNUC= <1H>
##$AXRIGHT= 0
##$AXTYPE= 0
##$AXUNIT= <>
##$AZFE= 0.1
##$AZFW= 0.1
##$BCFW= 0
##$BC_mod= 0
##$BYTORDP= 0
##$COROFFS= 0
##$CY= 15
##$DATMOD= 1
##$DC= 0
##$DFILT= <>
##$DTYPP= 0
##$F1P= 0
##$F2P= 0
##$FCOR= 0.5
##$FTSIZE= 131072
##$FT_mod= 6
##$GAMMA= 0
##$GB= 0
##$INTBC= 1
##$INTSCL= 1
##$ISEN= 128
##$LB= 0.3
##$LEV0= 0
##$LPBIN= 0
##$MAXI= 10000
##$MC2= 0
##$MEAN= 0
##$ME_mod= 0
##$MI= 0
##$NCOEF= 0
##$NC_proc= -2
##$NLEV= 6
##$NOISF1= 0
##$NOISF2= 0
##$NSP= 0
##$NTH_PI= 0
##$NZP= 0
##$OFFSET= 14.9612
##$PC= 1
##$PHC0= 248.9063
##$PHC1= 0
##$PH_mod= 1
##$PKNL= yes
##$PPARMOD= 0
##$PPDIAG= 0
##$PPIPTYP= 0
##$PPMPNUM= 2147483647
##$PPRESOL= 1
##$PSCAL= 4
##$PSIGN= 0
##$PYNMP= <proc.py>
##$REVERSE= no
##$SF= 400.020009558307
##$SI= 131072
##$SIGF1= 0
##$SIGF2= 0
##$SINO= 400
##$SIOLD= 131072
##$SPECTYP= <>
##$SREGLST= <1H.CDCl3>
##$SSB= 0
##$STSI= 131072
##$STSR= 0
##$SW_p= 8223.68421052631
##$SYMM= 0
##$S_DEV= 0
##$TDeff= 65536
##$TDoff= 0
##$TI= <>
##$TILT= no
##$TM1= 0
##$TM2= 0
##$TOPLEV= 0
##$USERP1= <user>
##$USERP2= <user>
##$USERP3= <user>
##$USERP4= <user>
##$USERP5= <user>
##$WDW= 1
##$XDIM= 131072
##$YMAX_p= 428478113
##$YMIN_p= -12155
##$CURPLOT= <Network HP LaserJet P1505>
##$CURPRIN= <$Network HP LaserJet P1505>
##$DFORMAT= <normdp>
##$LAYOUT= <+/1D_H.xwp>
##$LFORMAT= <normlp>
##$PFORMAT= <normpl>
##$SURQMSG= 1
$$ End of Bruker specific parameters
$$ ---------------------------------
##NTUPLES= NMR SPECTRUM
##VAR_NAME=  FREQUENCY,     SPECTRUM/REAL,   SPECTRUM/IMAG
##SYMBOL=    X,             R,               I
##VAR_TYPE=  INDEPENDENT,   DEPENDENT,       DEPENDENT
##VAR_FORM=  AFFN,          ASDF,            ASDF
##VAR_DIM=   131072,        131072,          131072
##UNITS=     HZ,            ARBITRARY UNITS, ARBITRARY UNITS
##FACTOR=    0.0627417313425164, 1,          1
##FIRST=     8223.62146879497, -17,          -61233
##LAST=      0,             813,             -61534
##MIN=       0,             -12155,          0
##MAX=       8223.62146879497, 428478113,    0
$$ Real data points
##PAGE= N=1
##DATA TABLE= (X++(R..R)), XYDATA
$$ [...]
61639D46712K074K308K362K167J661Q69Nn97p20n95q80j995l488m396m286l665
$$ 446712 448786 451094 453456 455623 457284 458153 458158 457561 456841 456246 455366 453371 449883 445487 441201 437536
61623D37536l187k897k464j853j352j179j324j605j673j210l52K60J19o67j662
$$ 437536 434349 431452 428988 427135 425783 424604 423280 421675 420002 418792 418440 418700 418819 418152 416490
61608D16490k687l827n072o160o701o369n240m004l462l653l864l631l310l355
$$ 416490 413803 409976 404904 398744 392043 385674 380434 376430 372968 369315 365451 361820 358510 355155
61594C55155l558l485l206l086l142l098k871k520j988j345j009j236j584j495
$$ 355155 351597 348112 344906 341820 338678 335580 332709 330189 328201 326856 325847 324611 323027 321532
61580C21532j151j171j600j864j658j280r99p67n89o42q61r04o59l74j93%J68
$$ 321532 320381 319210 317610 315746 314088 312808 311809 311042 310453 309811 308950 308046 307387 307013 306820 306820 306988
61563C06988J00j11l8L83O66N54N13J014J719J924J544J175J165J194Q90M77M70
$$ 306988 307088 306977 306939 307322 307988 308542 309055 310069 311788 313712 315256 316431 317596 318790 319680 320157 320627
61546C20627R36J351J261Q44O44Q84J234J218P42K09K31J156K628L721L787L213
$$ 320627 321563 322914 324175 325019 325663 326547 327781 328999 329741 329950 330181 331337 333965 337686 341473 344686
61530C44686K913L076K898J725J2j271j698j524j124q61j149k051k953l174k783
$$ 344686 347599 350675 353573 355298 355310 354039 352341 350817 349693 348832 347683 345632 342679 339505 336722
61515C36722k324j900j131K0R87J322J138P57L35J4l0R9j2n83j298j641j391p53
$$ 336722 334398 332498 331367 331387 332374 333696 334834 335591 335926 335940 335910 336009 335997 335414 334116 332475 331084 330331
61497C30331j68j0k43m09j86J60J72q9j50J74N65Q04J006J235J318J232J262J548
$$ 330331 330163 330153 329910 329501 329315 329475 329647 329558 329408 329582 330147 330951 331957 333192 334510 335742 337004 338552
61479C38552J777J565Q96J41k03K19J232J936J430r3j284j001M73J807J932Q59
$$ 338552 340329 341894 342790 342931 342728 342947 344179 346115 347545 347452 346168 345167 345640 347447 349379 350238
61463C50238n87j560j816j702j605j438q63J13J045J545J606J428J238J280J594
$$ 350238 349651 348091 346275 344573 342968 341530 340667 340780 341825 343370 344976 346404 347642 348922 350516
61448C50516J834J670J365J483J974K086J373L35j91J22J087K357L490M047M017
$$ 350516 352350 354020 355385 356868 358842 360928 362301 362636 362445 362567 363654 366011 369501 373548 377565
61433C77565L841L745L426K736K228K493L170L320K658J873J666J948K224K285
$$ 377565 381406 385151 388577 391313 393541 396034 399204 402524 405182 407055 408721 410669 412893 415178
61419D15178K251K162J878J429J157J349J788J917J459O71j30j005k090l093l519
$$ 415178 417429 419591 421469 422898 424055 425404 427192 429109 430568 431239 431109 430104 428014 424921 421402
61404D21402l322k938k622k246j762j435j419j502j471j385j317j206j173j505
$$ 421402 418080 415142 412520 410274 408512 407077 405658 404156 402685 401300 399983 398777 397604 396099
61390C96099k111k422k143j664j347r33j58M80L14m06p37l01L83Q08J079J474
$$ 396099 393988 391566 389423 387759 386412 385479 385321 385801 386115 385709 384972 384671 385054 385862 386941 388415
61374C88415K023K677L424L908L536K325J262J288K135K625K105J155P38J061
$$ 388415 390438 393115 396539 400447 403983 406308 407570 408858 410993 413618 415723 416878 417616 418677
61360D18677J561J856K251L160M347N117N229N219N720O751P870Q752R302R412
$$ 418677 420238 422094 424345 427505 431852 436969 442198 447417 453137 459888 467758 476510 485812 495224
61346D95224R022Q338P617O689N219L435K238K235K981L530L533L442L654L862
$$ 495224 504246 512584 520201 526890 532109 535544 537782 540017 542998 546528 550061 553503 557157 561019
61332E61019L399J997R4j545k393k521k437k599l037l449l571l313k616j449j01
$$ 561019 564418 566415 566509 564964 562571 560050 557613 555014 551977 548528 544957 541644 539028 537579 537478
61317E37478Q75J219J320J780K704L705M492N104N638O192P058Q566J0477J1918
$$ 537478 538353 539572 540892 542672 545376 549081 553573 558677 564315 570507 577565 586131 596608 608526
61303F08526J2267J1880J1587J1587J1117R197N586J107k820n156n974o225o726
$$ 608526 620793 632673 644260 655847 666964 676161 681747 682854 680034 674878 668904 662679 655953
61290F55953p534q279q717q767q421p937p832q243q592q225p214o136n233m250
$$ 655953 648419 640140 631423 622656 614235 606298 598466 590223 581631 573406 566192 560056 554823 550573
61276E50573k893j081J115L314M848N401N466N720O110O184O021O082O249N930
$$ 550573 547680 546599 547714 551028 555876 561277 566743 572463 578573 584757 590778 596860 603109 609039
61262F09039N220N111O206P960R546J0823J1912J2427J1749R858P415N189L625
$$ 609039 614259 619370 625576 633536 643082 653905 665817 678244 689993 699851 707266 712455 716080
61249G16080K680J899Q12m82j458j929k319l028l930m694n159n215m782m158l887
$$ 716080 718760 720659 721471 720989 719531 717602 715283 712255 708325 703631 698472 693257 688475 684317 680430
61234F80430m085m296m240m109l858k920j105P89J837K057K123K488L254M397
$$ 680430 676345 672049 667809 663700 659842 656922 655817 656606 658443 660500 662623 665111 668365 672762
61220F72762N501N702M678L351K928L506M306M964N685O399O584O032M932L264
$$ 672762 678263 683965 688643 691994 694922 698428 702734 707698 713383 719782 726366 732398 737330 740594
61206G40594R00j490k522j534N92K408L270L587M146N579Q059J1158J4153J6660
$$ 740594 741494 740004 737482 735948 736540 738948 742218 745805 749951 755530 763589 774747 788900 805560
61192H05560J8789K0553K1438K0873J8917J6207J3294J0254P058M117K220J687
$$ 805560 824349 844902 866340 887213 906130 922337 935631 945885 952943 957060 959280 960967
61180I60967J741J168l04j771k533l185m730p008q838r638j0040j0781j1738j2417
$$ 960967 962708 963876 963572 961801 959268 956083 951353 944345 935507 925869 915829 905048 893310 880893
61166H80893j2804j3221j3705j4023j4125j4242j4590j5127j5581j5581j4948
$$ 880893 868089 854868 841163 827140 813015 798773 784183 769056 753475 737894 722946
61155G22946j3870j2635j1170r116o386l386n77J819L606M492M371L464J950k06
$$ 722946 709076 696441 685271 676155 669769 666383 665806 667625 671231 675723 680094 683558 685508 685302
61141F85302k821n268o977p953q446q420p744o628n372l816j625Q65K715L484
$$ 685302 682481 677213 670236 662283 653837 645417 637673 631045 625673 621857 620232 621097 623812 627296
61127F27296L833M734O488Q767J1270J3891J6417J8522K0069K1216K2215K3349
$$ 627296 631129 635863 642351 651118 662388 676279 692696 711218 731287 752503 774718 798067
61115G98067K4890K6753K8282K8776K8297K7582K7143K6833K6354K5615K4484
$$ 798067 822957 849710 877992 906768 935065 962647 989790 1016623 1042977 1068592 1093076
61104A093076K2662K0161J7423J4587J1151O812K190j951n789j0029j4594j8617
$$ 1093076 1115738 1135899 1153322 1167909 1179060 1185872 1188062 1186111 1180322 1170293 1155699 1137082
61092A137082k1690k4247k6560k8227k8943k9105k9179k8997k8183k6861k5491
$$ 1137082 1115392 1091145 1064585 1036358 1007415 978310 949131 920134 891951 865090 839599
61081H39599k4262k3013k1605k0057j8471j6981j5567j3895j1602q880o410m663
$$ 839599 815337 792324 770719 750662 732191 715210 699643 685748 674146 665266 658856 654193
61069F54193l599l023k798k630k175j498r56n13K82J523K806L994N424P056Q186
$$ 654193 650594 647571 644773 642143 639968 638470 637514 637001 637283 638806 641612 645606 651030 658086 666272
61054F66272Q441Q373Q644R342J0497J2456J5084J7327J8346J8595J9136K0426
$$ 666272 674713 683086 691730 701072 711569 724025 739109 756436 774782 793377 812513 832939
61042H32939K2320K4597K6721K7830K7814K7830K8793K9989L0195K9607K9491
$$ 832939 855259 879856 906577 934407 962221 990051 1018844 1048833 1079028 1108635 1138126
61031A138126L0318L1438L2410L3449L4607L5591L6410L7387L8484L9416M0199
$$ 1138126 1168444 1199882 1232292 1265741 1300348 1335939 1372349 1409736 1448220 1487636 1527835
61020A527835M0922M1424M1999M3862M7839N3204N9046O6106P5616Q6962R8446
$$ 1527835 1568757 1610181 1652180 1696042 1743881 1797085 1856131 1922237 1997853 2084815 2183261
61009B183261J10140J23993J41373J62979J91250K30156K81916L46600M25855
$$ 2183261 2293401 2417394 2558767 2721746 2912996 3143152 3425068 3771668 4197523
61000D197523N24225O45780P93182R71700J188708J442872J714970J972911K180991
$$ 4197523 4721748 5367528 6160710 7132410 8321118 9763990 11478960 13451871 15632862
60991A5632862K295072K253269J995887J520201R19915L54745l6364k02668j78080
$$ 15632862 17927934 20181203 22177090 23697291 24617206 24971951 24935587 24732919 24554839
60982B4554839l5339J39964K44695J69442j47789o68126j260742j775102k113976
$$ 24554839 24519500 24659464 24904159 25073601 24925812 24257686 22996944 21221842 19107866
60973A9107866k254378k223329k067631j837925j580248j328121j099408r00734
$$ 19107866 16853488 14630159 12562528 10724603 9144355 7816234 6716826 5816092
60965E816092p33465n95945m84035l93008l19449k61059k15580j80566j53600
$$ 5816092 5082627 4486682 4002647 3609639 3290190 3029131 2813551 2632985 2479385
60956B479385j32309j14669r9598q6721p5477o5084n5336m6656l9162l2402k6193
$$ 2479385 2347076 2232407 2132809 2046088 1970611 1905527 1850191 1803535 1764373 1731971 1705778
60945A705778k1126j8004j7118j8148k0191k1991k2721k2642k2531k2615k2518
$$ 1705778 1684652 1666648 1649530 1631382 1611191 1589200 1566479 1543837 1521306 1498691 1476173
60934A476173k2103k1591k1037k0420k0180k0778k1839k2512k2738k3222k4067
$$ 1476173 1454070 1432479 1411442 1391022 1370842 1350064 1328225 1305713 1282975 1259753 1235686
60923A235686k4551k4422k4436k5052k5588k5252k4254k3247k2343k1352k0403
$$ 1235686 1211135 1186713 1162277 1137225 1111637 1086385 1062131 1038884 1016541 995189 974786
60912I74786j9631j8681j7223j5606j4426j3716j3126j2632j2377j2104j1331
$$ 974786 955155 936474 919251 903645 889219 875503 862377 849745 837368 825264 813933
60901H13933j0081q846p878o990o149n765o205p271q311q799q710q352p884p156
$$ 813933 803852 795006 787128 780138 773989 768224 762019 754748 746437 737638 728928 720576 712692 705536
60887G05536o107n164m831n024n223n335n797o669p275p132o724o845p527q165
$$ 705536 699429 694265 689434 684410 679187 673852 668055 661386 654111 646979 640255 633410 625883 617718
60873F17718q356q082p363o312n444n256n513n437m670l636k901k637k721k935
$$ 617718 609362 601280 593917 587605 582161 576905 571392 565955 561285 557649 554748 552111 549390 546455
60859E46455k920k371j435o33l14m16p65j213j439j173p68r84j874k424j797n32
$$ 546455 543535 541164 539729 539096 538782 538366 537601 536388 534949 533776 533008 532024 530150 527726 525929 525397
60843E25397J29j68p67j289k157l559m753n051m940n435o489o961o191m827l733
$$ 525397 525526 525358 524591 523302 521145 517586 512833 507782 502842 497407 490918 483957 477766 472939 469206
60828D69206k776j408L9N75J01k05N31J618J769R57M62J078K069K243J457N72
$$ 469206 466430 465022 465061 465636 465737 465532 466063 467681 469450 470407 470869 471947 474016 476259 477716 478288
60812D78288K57M07N61M20j08q98j555j745j647j729k011j969j367p62p54j157
$$ 478288 478545 478952 479513 479933 479825 478927 477372 475627 473980 472251 470240 468271 466904 466142 465388 464231
60796D64231j367j391j844k938m039m467m337m256m441m498m000l039k127j710
$$ 464231 462864 461473 459629 456691 452652 448185 443848 439592 435151 430653 426653 423614 421487 419777
60782D19777j862k369k967l430l552l264k836k641k592k125j041j8K21K2M00J546
$$ 419777 417915 415546 412579 409149 405597 402333 399497 396856 394264 392139 391098 391080 391301 391323 391723 393269
60766C93269K477K444J954J921K388K735K854L236L939M214L471K203J551K012
$$ 393269 395746 398190 400144 402065 404453 407188 410042 413278 417217 421431 424902 427105 428656 430668
60752D30668K905L106K230R67L04N25J140J626J877J902J496N10p82j961k957
$$ 430668 433573 436679 438909 439876 440180 440705 441845 443471 445348 447250 448746 449256 448474 446513 443556
60737D43556l998n114o017o467o537o484o498o553o361n581m271k984k247j961
$$ 443556 439558 434444 428427 421960 415423 408939 402441 395888 389527 383946 379675 376691 374444 372483
60723C72483j667j246j055j299j647j625j253j000j225j710j834j214k05L56M1
$$ 372483 370816 369570 368515 367216 365569 363944 362691 361691 360466 358756 356922 355708 355503 355859 355900
60708C55900o60q93m90j21l36p89p08J6O76P68P37J295K234K553J866J054J061
$$ 355900 355240 354347 353857 353736 353400 352611 351903 351919 352595 353363 354100 355395 357629 360182 362048 363102 364163
60691C64163J539J483Q73P58J582K444K503K318K921M159M873M618M271M713N652
$$ 364163 365702 367185 368058 368816 370398 372842 375345 377663 380584 384743 389616 394234 398505 403218 408870
60676D08870O150N841N204M771M528M099L316K374J546R14M81L08J92n59k442
$$ 408870 415020 420861 426065 430836 435364 439463 442779 445153 446699 447613 448094 448402 448594 448035 445593
60661D45593m830o305o188n199m296l494k413j337r04j018r63m84N2M72J010J579
$$ 445593 440763 434458 428270 423071 418775 415281 412868 411531 410627 409609 408646 408162 408214 408686 409696 411275
60645D11275J681J218O74K84k87j188j987k472l112m221n214n300m520l536k668
$$ 411275 412956 414174 414848 415132 414845 413657 411670 409198 406086 401865 396651 391351 386831 383295 380627
60630C80627j771q32j16K26K67Q3j91k33J38N94O71M47M10O87Q02L34m72r64p62
$$ 380627 378856 378024 377908 378134 378401 378484 378293 378060 378198 378792 379463 379910 380320 381007 381809 382143 381671 380707 379945
60611C79945r1M26L03l63r42q54j08P79J319J369J104Q08O12L24l38j214j605
$$ 379945 379854 380280 380583 380220 379278 378424 378316 379095 380414 381783 382887 383695 384307 384631 384293 383079 381474
60594C81474r91L14J514K199K550K834L041L079K941K615K080J456R33N14N7l53
$$ 381474 380483 380797 382311 384510 387060 389894 392935 396014 398955 401570 403650 405106 406039 406553 406610 406257
60578D06257m40j04M71J158J944K568K536J875J558K627M933P161Q246Q505R160
$$ 406257 405817 405713 406184 407342 409286 411854 414390 416265 417823 420450 425383 432544 440790 449295 458455
60563D58455J0835J2812J3843J3537J2640J1871J0869Q762N513K138n42k759n082
$$ 458455 469290 482102 495945 509482 522122 533993 544862 553624 559137 561275 560733 557974 552892
60550E52892p351q796q905p759n756l512j775q36j05J222L155N113O953R033J1248
$$ 552892 545541 536745 527840 520081 514325 510813 509038 508202 508097 509319 512474 517587 524540 533573 544821
60535E44821J2880J3689J4420J5733J7250J8108J7894J6513J3808J0007O091K865
$$ 544821 557701 571390 585810 601543 618793 636901 654795 671308 685116 695123 701214 704079
60523G04079o3l571p409j0149j0809r807q199o661n457m827m901n403n709n197
$$ 704079 704016 700445 693036 682887 672078 662271 654072 647411 641954 637127 632226 626823 621114 615917
60509F15917l769k085j102r78p34N38K522M326N932Q163J1332J4907J8601K2749
$$ 615917 612148 610063 608961 607983 607249 607787 610309 614635 620567 628730 640062 654969 673570 696319
60495F96319K7391L1885L5827L9553M3238M6314M8243M9106M8885M6856M2496
$$ 696319 723710 755595 791422 830975 874213 920527 968770 1017876 1066761 1113617 1156113
60484A156113L6396K9466K1735J2676K431q040j7842k6570l4075m0395m5706m9847
$$ 1156113 1192509 1221975 1243710 1256386 1258817 1250777 1232935 1206365 1172290 1131895 1086189 1036342
60472A036342n2095n2016n0171m7521m4415m0703l6551l2435k8586k5088k2229
$$ 1036342 984247 932231 882060 834539 790124 749421 712870 680435 651849 626761 604532
60461F04532k0165j8416j6369j4129j2206j0626r059p584o546n808m974m229m058
$$ 604532 584367 565951 549582 535453 523247 512621 503562 495978 489432 483624 478650 474421 470363
60448D70363m254m107l579l307l351l006k069j272j028p87j77J14n82j652j894
$$ 470363 466109 462002 458423 455116 451765 448759 446690 445418 444390 443603 443426 443540 442958 441306 439412
60433D39412j042N8N79L78j91o26n57j44o3p05j573j865j447q78o10n77n39m68
$$ 439412 438370 438428 439007 439385 439194 438568 438011 437867 437804 437099 435526 433661 432214 431336 430726 430149 429610 429142
60415D29142m51m55k76J77O50P27M17L72J175K485L291L078K292J615J310J349
$$ 429142 428691 428236 427960 428137 428787 429514 429931 430303 431478 433963 437254 440332 442624 444239 445549 446898
60399D46898J700K178K466K487K467K395K020J531J666K614L482L407K818K760
$$ 446898 448598 450776 453242 455729 458196 460591 462611 464142 465808 468422 471904 475311 478129 480889
60385D80889L294L458K793K094K235K970L350L001K442K208K173J880J276Q11
$$ 480889 484183 487641 490434 492528 494763 497733 501083 504084 506526 508734 510907 512787 514063 514874
60371E14874Q66J323J740J847J706J578J642J820J772J257O22N77J308K094K183
$$ 514874 515740 517063 518803 520650 522356 523934 525576 527396 529168 530425 531047 531624 532932 535026 537209
60356E37209J875K135L244M398M784M644M966O362Q443J0235J1102J1277J1327
$$ 537209 539084 541219 544463 548861 553645 558289 563255 569617 578060 588295 599397 610674 622001
60343F22001J1167J0029P603M644J938p58l968p074q810r009q797q891q844q248
$$ 622001 633168 643197 650800 655444 657382 656624 652656 645582 636772 627763 618966 610075 601231 592983
60329E92983p556p121o506n469m725m840n105m584l702l592m193m199k923j217
$$ 592983 585427 578306 571800 566331 561606 556766 551661 547077 543375 539783 535590 531391 528468 527251
60315E27251k26n8m1K88R01J624K400L319M557O312Q697J1673J4951J7975K0226
$$ 527251 527025 526967 526926 527214 528115 529739 532139 535458 540015 546327 555024 566697 581648 599623 619849
60300F19849K1731K2916K3752K3414K1071J6733J1013M403k677r435j4921j8717
$$ 619849 641580 664496 688248 711662 732733 749466 760479 764882 762205 752770 737849 719132
60288G19132k0915k1527k0439j8047j5411j3451j2206j1012r359p461o088n782
$$ 719132 698217 676690 656251 638204 622793 609342 597136 586124 576765 569304 563216 557434
60276E57434o234o614o501o219o104n911n314m576m183m017l596k943k576k540
$$ 557434 551200 544586 538085 531866 525762 519851 514537 509961 505778 501761 498165 495222 492646 490106
60262D90106k167j110k4K72j30n01n71p43j216j507j110k34N16R29J210J389J205
$$ 490106 487939 486829 486805 487077 486947 486446 485875 485132 483916 482409 481299 481065 481581 482510 483720 485109 486314
60245D86314P49N78R33J317J227R56J021J147N62p63j807j648l98J082J972J947
$$ 486314 487063 487641 488574 489891 491118 492074 493095 494242 494804 494041 492234 490586 490188 491270 493242 495189
60229D95189J380J142J769K806L431L643M051M598M492L680L275L946M847M930
$$ 495189 496569 497711 499480 502286 505717 509360 513411 518009 522501 526181 529456 533402 538249 543179
60215E43179M523M699N639O629P273P696P814P420O966P254Q234Q881Q498P498
$$ 543179 547702 552401 558040 564669 571942 579638 587452 594872 601838 609092 617326 626207 634705 642203
60201F42203O657O215N963N729N421M880L987K763J321j71j450k306k779l026
$$ 642203 648860 655075 661038 666767 672188 677068 681055 683818 685139 684968 683518 681212 678433 675407
60187F75407l103l094l349m214n495o471o563n867n012m558m556m636m492m211
$$ 675407 672304 669210 665861 661647 656152 649681 643118 637251 632239 627681 623125 618489 613997 609786
60173F09786l994l766l390l086l115l058k149m96P15O23l25j141j447j391j031
$$ 609786 605792 602026 598636 595550 592435 589377 587228 586732 587447 588070 587745 586604 585157 583766 582735
60158E82735m79j78l18l93P1P24J001J072J419J826J727J304J303J799K098J925
$$ 582735 582256 582078 581760 581367 581438 582162 583163 584235 585654 587480 589207 590511 591814 593613 595711 597636
60142E97636J897K547L577M338M562M485M564N150O083O677O486N887N483N183
$$ 597636 599533 602080 605657 609995 614557 619042 623606 628756 634839 641516 648002 653889 659372 664555
60128F64555M517L576K904K511J918J138Q10J185J762K152K583L195L514L126
$$ 664555 669072 672648 675552 678063 679981 681119 681929 683114 684876 687028 689611 692806 696320 699446
60114F99446K383J962J997K022J617Q32j9q09j768l068m300m759m431m167m532
$$ 699446 701829 703791 705788 707810 709427 710259 710240 709431 707663 704595 700295 695536 691105 686938 682406
60099F82406m967m771m299m327m595m130k887j922j756j654r04J76R73J530K152
$$ 682406 677439 672668 668369 664042 659447 655317 652430 650508 648752 647098 646194 646370 647343 648873 651025
60084F51025K715K930K886K762K387J559N58r2k88n04j375l143n345p043p667
$$ 651025 653740 656670 659556 662318 664705 666264 666822 666730 666442 665938 664563 661420 656075 649032 641365
60069F41365p563p483p640p675p397o996o609o263o179o514o772o202m819l436
$$ 641365 633802 626319 618679 611004 603607 596611 590002 583739 577560 571046 564274 558072 553253 549817
60055E49817k599k157j904j893j956j676j034m03K84J532L259M606N211N786O944
$$ 549817 547218 545061 543157 541264 539308 537632 536598 536195 536479 538011 541270 545876 551087 556873 563817
60040E63817Q156Q471P735O545N445M633M060L362K142N47q03j749k799m154n222
$$ 563817 571973 580444 588179 594724 600169 604802 608862 612224 614366 614913 614110 612361 609562 605408 600186
60025F00186n536n555n998o975q155r243r837r418q097o765n996n370m415l557
$$ 600186 594650 589095 583097 576122 567967 558724 548887 539469 531372 524607 518611 513241 508826 505269
60011E05269l434l875m249m350m185l486k229j154r04j082r97q28j034j065K3
$$ 505269 501835 497960 493711 489361 485176 481690 479461 478307 477403 476321 475324 474496 473462 472397 472420
59996D72420J871K949K552J570J090J230J652K249K862L131L124L462M296M822
$$ 472420 474291 477240 479792 481362 482452 483682 485334 487583 490445 493576 496700 500162 504458 509280
59982E09280M315L166K236J629P54n74j798k388k458k521k981l876m824n144m395
$$ 509280 513595 516761 518997 520626 521380 520806 519008 516620 514162 511641 508660 504784 499960 494816 490421
59967D90421k919j648j139j018n86J98P11N81J28j82l33m90m86lQ57J607J892
$$ 490421 487502 485854 484715 483697 483111 483309 484020 484601 484729 484547 484214 483724 483238 483235 484092 485699 487591
59950D87591J698J146M59qn3J44M44J152K323L001K068k7j396r84J20K28q28j867
$$ 487591 489289 490435 490894 490886 490833 490977 491421 492573 494896 497897 499965 499938 498542 497558 497678 497906 497078 495211
59932D95211k055j523o02O51K049L153L749M092M471M924N368N768O061O137O041
$$ 495211 493156 491633 491031 491682 493731 496884 500633 504725 509196 514120 519488 525256 531317 537454 543495
59917E43495O010O300O942P579P568O475M651L032K165J588M63j330k978l651
$$ 543495 549505 555805 562747 570326 577894 584369 589020 592052 594217 595805 596268 594938 591960 588309
59903E88309l404l083l388m076m226l335j961j036p37m60K01R71J481J838K373
$$ 588309 584905 581822 578434 574358 570132 566797 564836 563800 563063 562603 562804 563775 565256 567094 569467
59888E69467L166M026M683M947M878M866N236N794O121O252O567P071P322P145
$$ 569467 572633 576659 581342 586289 591167 596033 601269 607063 613184 619436 626003 633074 640396 647541
59874F47541O752O169N083L530J961M82j304l413n163o112o646p195p590p639
$$ 647541 654293 660462 665545 669075 671036 671518 670214 666801 661638 655526 648880 641685 634095 626456
59860F26456p635p681p182n761m144l337l211k702j243O41K060K651K802L366
$$ 626456 618821 611140 603958 598197 594053 590716 587505 584803 583560 584201 586261 588912 591714 595080
59846E95080M944P215R171J0191J0498J0394R675Q080N845L380J001p19j011J86
$$ 595080 600024 607239 616410 626601 637099 647493 657168 665248 671093 674473 675474 674755 673744 673930
59832F73930J918L308M257M668L827J422j628m227o269p948q677p941o682o364
$$ 673930 675848 679156 683413 688081 691908 693330 691702 687475 681206 673258 664581 656640 649958 643594
59818F43594o879o739n369l900l429l649l648l242k873k795k826k742k642k926
$$ 643594 636715 629976 624607 620707 617278 613629 609981 606739 603866 601071 598245 595503 592861 589935
59804E89935l807m733m726l602k364j913j948j770j580j986k659k691k076j739
$$ 589935 586128 581395 576669 573067 570703 568790 566842 565072 563492 561506 558847 556156 554080 552341
59790E52341k043k348k221k033k097k065j623j033o49m03j16J24J86R3o5j29J46
$$ 552341 550298 547950 545729 543696 541599 539534 537911 536878 536229 535826 535710 535834 536020 536113 536048 535919 536065
59773E36065P36J159J159J310K232L435L763L005K131J880J985J980J960K119
$$ 536065 536801 537960 539119 540429 542661 546096 549859 552864 554995 556875 558860 560840 562800 564919
59759E64919K292K261K062J723J249R76J455K663L896M602M855M854M544L929
$$ 564919 567211 569472 571534 573257 574506 575482 576937 579600 583496 588098 592953 597807 602351 606280
59745F06280L294K829K463K157K014J974J802J426R43L38l16n60m0P37Q62K34
$$ 606280 609574 612403 614866 617023 619037 621011 622813 624239 625182 625520 625204 624644 624604 625341 626203 626437
59729F26437l13k37J53L96M97N60M94L20K68L55L69M20Q84J690K187J946J186
$$ 626437 626124 625887 626040 626436 626933 627493 627987 628307 628575 628930 629299 629719 630603 632293 634480 636426 637612
59712F37612L37l50o50m04J78P83J534K613L455L218K184J701K420L447L753L520
$$ 637612 637949 637599 636949 636545 636723 637506 639040 641653 645108 648326 650510 652211 654631 658078 661831 665351
59696F65351L519L806L819L321K625K095J878J889J744R49n48k192l336l667l175
$$ 665351 668870 672676 676495 679816 682441 684536 686414 688303 690047 690996 690448 688256 684920 681253 678078
59681F78078k213j557j884k922l729l962m274n214o349o837o495n876n589n729
$$ 678078 675865 674308 672424 669502 665773 661811 657537 652323 645974 639137 632642 626766 621177 615448
59667F15448n763n022l555k358k235k704k657j894j104n24K58J194J669J742K246
$$ 615448 609685 604663 601108 598750 596515 593811 591154 589260 588156 587632 587890 589084 590753 592495 594741
59652E94741L273L782L287K722K841K928K093Q34J83qp25k205l776m970n813o199
$$ 594741 598014 601796 605083 607805 610646 613574 615667 616501 616684 616676 615951 613746 609970 605000 599187 592988
59636E92988n908n138m343l655k984k480k327k286k036j713j598j622j744k369
$$ 592988 587080 581942 577599 573944 570960 568480 566153 563867 561831 560118 558520 556898 555154 552785
59622E52785l674m858m894l833k703k165k042k039k182k434k518k286j827j161
$$ 552785 549111 544253 539359 535526 532823 530658 528616 526577 524395 521961 519443 517157 515330 514169
59608E14169k34Q01J664K328K988L627L975L839L226K230J060J02l98n99p66p81
$$ 514169 513935 514736 516400 518728 521716 525343 529318 533157 536383 538613 539673 539775 539377 538778 538012 537231
59592E37231l40M56R71O68k66r78p06L97J244Q89m53j715k202k102j801j437j195
$$ 537231 536891 537347 538318 538986 538720 537742 537036 537433 538677 539566 539113 537398 535196 533094 531293 529856 528661
59575E28661j423k040k444k369k299k656l066k975k478k029j697j207n44RJ98
$$ 528661 527238 525198 522754 520385 518086 515430 512364 509389 506911 504882 503185 501978 501434 501443 501641
59560E01641q1o47q51l0J455K271J685N34R2M85R47J154J406J789K095K498L477
$$ 501641 501560 500913 500062 500032 501487 503758 505443 505977 506069 506554 507501 508655 510061 511850 513945 516443 519920
59543E19920M927O086O538O828P826R846J2506J5187J7481J9227K0124J9415J6328
$$ 519920 524847 530933 537471 544299 552125 561971 574477 589664 607145 626372 646496 665911 682239
59530F82239J1050M944m48m338o511o840n500l297j160N53J887K728K913K575
$$ 682239 693289 698233 697785 693447 686936 680096 674596 671299 670139 670692 672579 675307 678220 680795
59516F80795J885N46j854n028q014j0066j1148j1601j1644j1372j0931j0556j0362
$$ 680795 682680 683226 681372 676344 668330 658264 647116 635515 623871 612499 601568 591012 580650
59503E80650j0094r215p509n547m201l608l093k167j194q08j077j540j722j389
$$ 580650 570556 561341 553832 548285 544084 540476 537383 535216 534022 533214 532137 530597 528875 527486
59489E27486o46P9M22N83J039J719K005J658J191J178J758K894M484N972O624
$$ 527486 526840 526919 527341 527924 528963 530682 532687 534345 535536 536714 538472 541366 545850 551822 558446
59474E58446O437O136O073N896N437N034M655L774K490J736J820J895J434J093
$$ 558446 564883 571019 577092 582988 588425 593459 598114 601888 604378 606114 607934 609829 611263 612356
59460F12356J377J702J743K464M531O781P730P789Q422R786J0753J0846J0587
$$ 612356 613733 615435 617178 619642 624173 630954 638684 646473 654895 664681 675434 686280 696867
59447F96867J0071Q770O707M592K655M61k113m672p070r356j1097j1655j1129
$$ 696867 706938 715708 722415 727007 729662 730123 728010 723338 716268 706912 695815 684160 673031
59434F73031j0147q950p530o370n895n511m339k706j679j199LK546N682Q519J0876
$$ 673031 662884 653934 646404 640034 634139 628628 624289 621583 619904 618705 618708 621254 626936 635455 646331
59419F46331J2743J3986J4912J6130J7721J9309K0893K2677K4164K4494K3634
$$ 646331 659074 673060 687972 704102 721823 741132 762025 784702 808866 833360 856994
59408H56994K1970J8824J2727L572o592j5178k0538k1937j9479j4461q597k601
$$ 856994 878964 897788 910515 914087 907495 892317 871779 849842 830363 815902 807305 804704
59396H04704L438Q242R425N907r60r037j6801k2793k5464k4641k1933j8774j5140
$$ 804704 808142 816384 825809 831716 830756 821719 804918 782125 756661 732020 710087 691313 676173
59383F76173j0982p534n877n247m077k044J05K009L677M608M311L436L182L718
$$ 676173 665191 657657 651780 646533 642456 640412 640517 642526 646203 650811 655122 658558 661740 665458
59369F65458M185M193M281M852N572N966N924N537M976M622M782N242N502N443
$$ 665458 669643 673836 678117 682969 688541 694507 700431 705968 710944 715566 720348 725590 731092 736535
59355G36535N407N714O495P877R863J1988J3492J4054J4156J4605J5718J6914
$$ 736535 741942 747656 754151 762028 771891 783879 797371 811425 825581 840186 855904 872818
59343H72818J7242J6417J5200J4460J4010J2789J0160O500K518j362m810p468
$$ 872818 890060 906477 921677 936137 950147 962936 973096 979596 982114 980752 975942 968474
59331I68474r431j1353j3674j6021j7641j8162j7746j6809j5784j4823j3664j2076
$$ 968474 959043 947690 934016 917995 900354 882192 864446 847637 831853 817030 803366 791290
59319G91290j0384r070p983o669n392m957n335n487m877m223m256m664m884n058
$$ 791290 780906 771836 763853 757184 751792 746835 741500 736013 731136 726913 722657 717993 713109 708051
59305G08051n376n252m137k622j678j146J06K595N659Q406J0516J2025J2913J2966
$$ 708051 702675 697423 693286 690664 688986 687840 687946 690541 696200 704606 715122 727147 740060 753026
59291G53026J1700Q487L194l303r565j4449j7422j8377j7585j5623j2942r667
$$ 753026 764726 773213 776407 773104 763539 749090 731668 713291 695706 680083 667141 657474
59279F57474o043k707n9K251M665O879Q312R217J0542J2580J4426J4986J4146
$$ 657474 651431 648724 648665 650916 655581 662460 670772 679989 690531 703111 717537 732523 746669
59266G46669J2691J1356J0214Q827O822M284J637q23l147n472p739r767j1364
$$ 746669 759360 770716 780930 789757 796579 800863 802500 801677 798530 793058 785319 775552 764188
59253G64188j2276j2201j1120r464p778o358n259m490l921l215k135q54K75J252
$$ 764188 751912 739711 728591 719127 711349 704991 699732 695242 691321 688106 685971 685117 685392 686644
59239F86644K524M437O663Q333Q856Q576Q335Q355P924O414M241K358J125J72
$$ 686644 689168 693605 700268 708601 717457 726033 734368 742723 750647 757061 761302 763660 764785 764957
59225G64957p94j743k757m070n490o397o462n984n407m866m374m001l807l852
$$ 764957 764163 762420 759663 755593 750103 743706 737244 731260 725853 720987 716613 712612 708805 704953
59211G04953m287n070n761n977n915n837n409m275l089k954l743m063l167j927
$$ 704953 700666 695596 689835 683858 677943 672106 666697 662422 659333 656379 652636 648573 645406 643479
59197F43479j453j663j778j555j263r83n25J75J045J939K501K405J959J969K736
$$ 643479 642026 640363 638585 637030 635767 634784 634259 634434 635479 637418 639919 642324 644283 646252 648988
59182F48988L654M121M265M469M741M963N243N560N571N150M774M915N498O264
$$ 648988 652642 656763 661028 665497 670238 675201 680444 686004 691575 696725 701499 706414 711912 718176
59168G18176P250Q482R594J0170J0240J0138J0093J0022R494P972N478K832N81
$$ 718176 725426 733908 743502 753672 763912 774050 784143 794165 803659 811631 817109 819941 820522
59155H20522j964n683r773j2266j2608j2354j2853j3543j3360j2560j2071j1984
$$ 820522 818558 812875 803102 790836 778228 765874 753021 739478 726118 713558 701487 689503
59143F89503j1803j1533j1402j1075j0146r011q350q054p512o586n586m666l941
$$ 689503 677700 666167 654765 643690 633544 624533 616183 608129 600617 594031 588445 583779 579838
59130E79838l675l664l004j306M47J174J261J809K853L567L963M968O759Q256
$$ 579838 576163 572499 569495 568189 568636 569810 571071 572880 575733 579300 583263 588231 594990 603246
59116F03246Q650Q525Q986J0326J1952J3128J3495J3159J2496J1809J1164J0570
$$ 603246 611896 620421 629407 639733 651685 664813 678308 691467 703963 715772 726936 737506
59104G37506R996R081P320M931L003K261K076J357j3j320k256l110l902m154l685
$$ 737506 747502 756583 763903 768834 771837 774098 776174 777531 777518 776198 773942 770832 766930 762776 759091
59089G59091k954k440k113j732j327j198j555k259k975l685m880o816q720r451
$$ 759091 756137 753697 751584 749852 748525 747327 745772 743513 740538 736853 731973 725157 716437 706986
59075G06986q956q344q328q465q188p676p124o179m827l979m244m866m740l946
$$ 706986 698030 689686 681358 672893 664705 657029 649905 643726 638899 634920 630676 625810 621070 617124
59061F17124l300l050k940l078l672m232m081l400k892k663k303j817j573j553
$$ 617124 613824 610774 607834 604756 601084 596852 592771 589371 586479 583816 581513 579696 578123 576570
59047E76570j448j313j372j378r15j74L12L75J08n60j449j806j217l27J97P68
$$ 576570 575122 573809 572437 571059 570144 569970 570282 570657 570765 570205 568756 566950 565733 565406 565603 566371
59031E66371J970L174L444L298M121N992P580Q208Q652R652J0953J2097J3061
$$ 566371 568341 571515 574959 578257 582378 588370 595950 604158 612810 622462 633415 645512 658573
59018F58573J3751J3768J3026J1766R890P126L984J527J5j216k409k982k769k485
$$ 658573 672324 686092 699118 710884 720774 727900 731884 733411 733426 732210 729801 726819 724050 721565
59004G21565k445j809J17K603M350N113N673O511P175P054O223N336M782M186
$$ 721565 719120 717311 717428 720031 724381 729494 735167 741678 748853 755907 762130 767466 772248 776434
58990G76434L001J404K13k13n01j346k666m073n555p016p713o958n037k807o79
$$ 776434 779435 780839 781052 780839 780338 778992 776326 772253 766698 759682 751969 745011 739974 737167 736488
58975G36488J301K887L971N052O603Q299R619J0736J1926J2736J2750J2588J3009
$$ 736488 737789 740676 744647 749699 756302 764601 774220 784956 796882 809618 822368 834956 847965
58962H47965J3496J3085J2053J1351J0675Q775N544K223n68l463o816j0058j2943
$$ 847965 861461 874546 886599 897950 908625 917400 922944 925167 924599 921136 914320 904262 891319
58949H91319j5891j8662k0105j9835j8891j8141j7147j5264j2817j0575q853p635
$$ 891319 875428 856766 836661 816826 797935 779794 762647 747383 734566 723991 715138 707503
58937G07503o775n715l917j918r95j465k239k418k302k418k623k711k910l247
$$ 707503 700728 695013 691096 689178 688183 686718 684479 682061 679759 677341 674718 672007 669097 665850
58923F65850l269k837k377k045j532r92j050j535j460o88l55j000j549j001O9
$$ 665850 662581 659744 657367 655322 653790 652798 651748 650213 648753 648065 647710 646710 645161 644160 644229
58908F44229P34J268K470M213N862P444R355J1431J3229J4781J6177J6955J6747
$$ 644229 644963 646231 648701 652914 658776 666220 675575 687006 700235 715016 731193 748148 764895
58895G64895J6094J5844J6087J6442J6901J7639J8426J9048J9955K1618K3533
$$ 764895 780989 796833 812920 829362 846263 863902 882328 901376 921331 942949 966482
58884I66482K4568K4225K2899K1016J8465J4867J0058M488p31m601p364j0357
$$ 966482 991050 1015275 1038174 1059190 1077655 1092522 1102580 1107068 1106337 1101736 1094372 1084015
58872A084015j4345j8499k1428k2685k2751k2088k0890j9414j7893j6265j4487
$$ 1084015 1069670 1051171 1029743 1007058 984307 962219 941329 921915 904022 887757 873270
58861H73270j2880j1777j1055j0456j0031r904r847r532r046q740q787r060r370
$$ 873270 860390 848613 837558 827102 817071 807167 797320 787788 778742 770002 761215 752155 742785
58848G42785r480r204q595p924p344o875o691p042p723q071p643o679n727n175
$$ 742785 733305 724101 715506 707582 700238 693363 686672 679630 671907 663836 656193 649514 643787 638612
58834F38612n105n292n264m772m087l568l101k401j585r19k46O50J461J895K468
$$ 638612 633507 628215 622951 618179 614092 610524 607423 605022 603437 602518 602272 602922 604383 606278 608746
58819F08746L802N341N893N324M603M220L733K973K406K101J517O63K66N15O90
$$ 608746 612548 617889 623782 629106 633709 637929 641662 644635 647041 649142 650659 651322 651588 652103 652793
58804F52793L74p5n46j448k680l538m011m857o005o315n478m737m964n422n199
$$ 652793 653167 653092 652546 651098 648418 644880 640869 636012 630007 623692 618214 613477 608513 603091 597892
58789E97892m547l892k834j171K70R17J471K613L733M032L910M052M117L497K589
$$ 597892 593345 589453 586619 585448 585718 586635 588106 590719 594452 598484 602394 606446 610563 614060 616649
58774F16649K100J841J274N27j61j205k861m387n175n772o690p145o323n040m571
$$ 616649 618749 620590 621864 622391 622230 621025 618164 613777 608602 602830 596140 588995 582672 577632 573061
58759E73061m529l535j547J33R57J582K292K543K248K158K576K820K419J989K464
$$ 573061 568532 564997 563450 563583 564540 566122 568414 570957 573205 575363 577939 580759 583178 585167 587631
58744E87631L950N671O708O729O258O095O361O480O266O371P163P946P977P602
$$ 587631 591581 597252 603960 610689 616947 623042 629403 635883 642149 648520 655683 663629 671606 679208
58730F79208P609P980Q161P996P586O635M917L018J779J251R82R74J515K435L280
$$ 679208 686817 694797 702958 710954 718540 725175 730092 733110 734889 736140 737122 738096 739611 742046 745326
58715G45326M043M938N781O232O358O256N554L929J798j95k012l920n836p650
$$ 745326 749369 754307 760088 766320 772678 778934 784488 788417 790215 790020 788008 784088 778252 770602
58701G70602r693j2208j4701j6550j7750j8488j8583j8020j7414j7068j6212j4072
$$ 770602 760909 748701 734000 717450 699700 681212 662629 644609 627195 610127 593915 579843
58689E79843j1179q698o960n588m568m245m514n016n736o574o718n411l111j083
$$ 579843 568664 559966 553006 547418 542850 538605 534091 529075 523339 516765 510047 504636 501525 500442
58675E00442j6K75K04J84O84J788L002M020N201O717P979Q588R140J0223J1307
$$ 500442 500426 500701 500905 501089 501773 503561 506563 510583 515784 522501 530480 539068 548208 558431 569738
58660E69738J1508J0756R319O976L682L89j980l747n642p410q280q301q066p668
$$ 569738 581246 592002 601321 608297 611979 612368 610388 606641 600999 593589 585309 577008 568942 561274
58646E61274p001o483o334n809m343k802k242k094j020R16K436L079L503M095
$$ 561274 554273 547790 541456 535647 531304 528502 526260 524166 523146 524062 526498 529577 533080 537175
58632E37175M668N335O208O377M726J765o29j416j144o22n5L94M28K62N41J444
$$ 537175 541843 547178 553386 559763 564489 566254 565625 564209 563065 562443 562388 562782 563210 563472 564013 565457
58616E65457K655M005N447O576P090P382P841P891O734M705K916J773Q54j43j159
$$ 565457 568112 572117 577564 584140 591230 598612 606453 614344 621078 625783 628699 630472 631326 631183 630024
58601F30024k206l103l359l057l150l897m018k659j203j424k678k790j226O05
$$ 630024 627818 624715 621356 618299 615149 611252 607234 604575 603372 601948 599270 596480 595254 595859
58587E95859J921L431N530P533Q979J0199J1323J2039J2471J3050J3432J2755
$$ 595859 597780 601211 606741 614274 623253 633452 644775 656814 669285 682335 695767 708522
58575G08522J1031R100P371N794M876N350O908Q526J0025J2067J4799J7736K0838
$$ 708522 719553 728653 736024 741818 746694 752044 758952 767478 777503 789570 804369 822105 842943
58562H42943K4316K7596K9762L0801L1141L0341K7671K3592J9141J4247Q346K279
$$ 842943 867259 894855 924617 955418 986559 1016900 1044571 1068163 1087304 1101551 1109897 1112176
58550A112176k244m965p008q682r226q711q270q338q516r200j1421j4868j8012
$$ 1112176 1109932 1104967 1097959 1089277 1080051 1071340 1063070 1054732 1046216 1037016 1025595 1010727 992715
58537I92715k0454k3180k6107k7473k6332k3898k1644j9699j7732j5869j3977
$$ 992715 972261 949081 922974 895501 869169 845271 823627 803928 786196 770327 756350
58526G56350j1456q395n719l682j529Q34K303K219J345O44K57P1J17j0r65k514
$$ 756350 744894 736499 730780 727098 725569 726403 728706 730925 732270 732914 733171 733242 733359 733349 732384 729870
58510G29870l657m074m346m718m840m753m814m604l334j431l13m73j125j717k406
$$ 729870 726213 722139 717793 713075 708235 703482 698668 694064 690730 689299 688986 688513 687388 685671 683265
58495F83265k991k943k501k306j959n49J524K978L781N105P129Q743R519J0170
$$ 683265 680274 677331 674830 672524 670565 670016 671540 674518 678299 683404 690533 699276 708795 718965
58481G18965J1002J1742J2940J5565J9010K1365K1754K0644J8037J3610Q471M363
$$ 718965 729967 741709 754649 770214 789224 810589 832343 852987 871024 884634 893105 897468
58469H97468R47l601r079j2974j4132j4079j3993j3056j0747q183n987l152P68
$$ 897468 898415 894814 885735 872761 858629 844550 830557 817501 806754 798571 792584 789432 790200
58456G90200M441O922R023J1374J3059J3315J2777J1923J0011O548K242k264o921
$$ 790200 794641 801563 810586 821960 835019 848334 861111 873034 883045 889593 891835 889571 882650
58443H82650j1030j3327j3965j4402j4786j3650j0758p860n875l697q23J385K197
$$ 882650 871620 858293 844328 829926 815140 801490 790732 782872 776997 773300 772477 773862 776059
58430G76059K885M356N672O221P120R151J1322J2757J3911J4791J4109J1460Q187
$$ 776059 778944 783300 788972 795193 802313 811464 822786 835543 849454 864245 878354 889814 898001
58417H98001N011J051l633p041q204q781j0153j1366j1456j1455j2188j2420j1126
$$ 898001 903012 904063 900430 893389 885185 876404 866251 854885 843429 831974 819786 807366 796240
58404G96240r534r000q728p483n788m609l601k250j117m65O07K297L258K912K564
$$ 796240 786706 777706 768978 761495 755707 751098 747497 745247 744130 743665 744272 746569 749827 752739 755303
58389G55303K899K589Q99o51q20o60j320j996j850j697k100j840n6K188L997O140
$$ 755303 758202 760791 761690 761039 760219 759559 758239 756243 754393 752696 750596 748756 748700 750888 754885 761025
58373G61025Q853J0586J0686J0840J2109J2950J2170J1231J1610J2335J2324J2652
$$ 761025 769878 780464 791150 801990 814099 827049 839219 850450 862060 874395 886719 899371
58361H99371J4239J5641J5450J4650J4342J3512J1262Q907P541N890K890L2j167
$$ 899371 913610 929251 944701 959351 973693 987205 998467 1007374 1014915 1020805 1023695 1023727 1022560
58348A022560j658k470k413n68J367J866K254M066O149P035P753R640J1715J2860
$$ 1022560 1020902 1018432 1016019 1015451 1016818 1018684 1020938 1025004 1031153 1038188 1045941 1055581 1067296 1080156
58334A080156J4124J6336J7853J7470J6867J7545J7912J6226J3699J1804R400
$$ 1080156 1094280 1110616 1128469 1145939 1162806 1180351 1198263 1214489 1228188 1239992 1249392
58323A249392N525K192J156P05j050k511j674L9N45R77L090N489O176O352P928
$$ 1249392 1254917 1257109 1258265 1258970 1257920 1255409 1253735 1253774 1254319 1255296 1258386 1263875 1270051 1276403 1284331
58308A284331R762J0046R938J1160J2565J2624J2710J4282J5611J5034J4445J5765
$$ 1284331 1294093 1304139 1314077 1325237 1337802 1350426 1363136 1377418 1393029 1408063 1422508 1438273
58296A438273J7072J6193J4940J5602J6557J5772J5286J7480K0240K0665K0355
$$ 1438273 1455345 1471538 1486478 1502080 1518637 1534409 1549695 1567175 1587415 1608080 1628435
58285A628435K1958K3719K2820K1024K1563K3400K3873K4027K5942K7865K7620
$$ 1628435 1650393 1674112 1696932 1717956 1739519 1762919 1786792 1810819 1836761 1864626 1892246
58274A892246K7575L0521L3941L4367L3996L6667M0663M2183M2635M5554M9449
$$ 1892246 1919821 1950342 1984283 2018650 2052646 2089313 2129976 2172159 2214794 2260348 2309797
58263B309797N0890N1697N5559O0321O1191N9130N8602N9483N8686N7217N8032
$$ 2309797 2360687 2412384 2467943 2528264 2589455 2648585 2707187 2766670 2825356 2882573 2940605
58252B940605N9444N8302N7032N9810O4625O7084O8886P4236Q1144Q5093Q8075
$$ 2940605 3000049 3058351 3115383 3175193 3239818 3306902 3375788 3450024 3531168 3616261 3704336
58241C704336R4802J03223J08301J11970J19486J29170J35989J42043J52824J66288
$$ 3704336 3799138 3902361 4010662 4122632 4242118 4371288 4507277 4649320 4802144 4968432
58231D968432J76590J85480J98701K14453K27135K39036K56223K76542K94388
$$ 4968432 5145022 5330502 5529203 5743656 5970791 6209827 6466050 6742592 7036980
58222G036980L13319L40427L72490M01921M32019M71174N16758N61133O08818
$$ 7036980 7350299 7690726 8063216 8465137 8897156 9368330 9885088 10446221 11055039
58213A1055039O70159P42853Q18465R02356J007262J132465J270905J431487J631350
$$ 11055039 11725198 12468051 13286516 14188872 15196134 16328599 17599504 19030991 20662341
58204B0662341J872437K151452K486810K908389L428972M058266M837550N824939
$$ 20662341 22534778 24686230 27173040 30081429 33510401 37568667 42406217 48231156
58196D8231156P055581Q557890J0399944J2674296J5450849J8793648K2773529
$$ 48231156 55286737 63844627 74244571 86918867 102369716 121163364 143936893
58189A43936893K7327107L2060846L6276259L9189882L9992818L7708085L1356900
$$ 143936893 171264000 203324846 239601105 278790987 318783805 356491890 387848790
58182C87848790K0711371O997231p344572j9782316k8718510l3716576l5178453
$$ 387848790 408560161 415557392 408212820 388430504 359711994 325995418 290816965
58175B90816965l4013329l1375451k8302888k5382665k2731080k0257812j7894900
$$ 290816965 256803636 225428185 197125297 171742632 149011552 128753740 110858840
58168A10858840j5632414j3481800j1477011r671928q101199o761133n635142
$$ 110858840 95226426 81744626 70267615 60595687 52494488 45733355 40098213
58161D0098213m709854l959995l346294k839317k426382k091672j810982j570354
$$ 40098213 35388359 31428364 28082070 25242753 22816371 20724699 18913717 17343363
58153A7343363j370429j208237j071650r54175q58194p80903p12484o50051n98491
$$ 17343363 15972934 14764697 13693047 12738872 11880678 11099775 10387291 9737240 9138749
58144I138749n56034n13367m68384m27828l93091l57963l21810k91516k68547
$$ 9138749 8582715 8069348 7600964 7173136 6780045 6422082 6100272 5808756 5540209
58135E540209k46716k24646k08445j99831j92957j84966j78974j74859j67597
$$ 5540209 5293493 5068847 4860402 4660571 4467614 4282648 4103674 3928815 3761218
58126C761218j56733j47549j41090j32598j21341j12407j07059j00675r2108q5869
$$ 3761218 3604485 3456936 3315846 3183248 3061907 2949500 2842441 2741766 2649658 2563789
58116B563789q3080p9084p2300o7031o5077o2586n7652n3439n1442m8850m4896
$$ 2563789 2480709 2401625 2329325 2262294 2197217 2134631 2076979 2023540 1972098 1923248 1878352
58105A878352m2897m3721m3779m1651m0325m0966m0621l8125l6266l6152l5193
$$ 1878352 1835455 1791734 1747955 1706304 1665979 1625013 1584392 1546267 1510001 1473849 1438656
58094A438656l2523l0805l0959l0456k8430k7177k7161k5786k2525k0116j9359
$$ 1438656 1406133 1375328 1344369 1313913 1285483 1258306 1231145 1205359 1182834 1162718 1143359
58083A143359j7910j5358j4366j5534j6298j6058j7171j9706k0514j8859j7797
$$ 1143359 1125449 1110091 1095725 1080191 1063893 1047835 1030664 1010958 990444 971585 953788
58072I53788j8525j8484j6561j5059j4933j4067j1944j1094j2148j2198j0006
$$ 953788 935263 916779 900218 885159 870226 856159 844215 833121 820973 808775 798769
58061G98769q191q375q605p542o837p473p867p414p859r447r800q286p409q144
$$ 798769 790578 782203 773598 766056 759219 751746 743879 736465 728606 719159 709359 701073 693664 685520
58047F85520q115o244m989n863o703n699m339m179m212l659l906n508o458n639
$$ 685520 677405 671161 666172 660309 653606 647907 643568 639389 635177 631518 627612 622104 615646 610007
58033F10007m886n683o781o937p032p671p649o598o253p294p847o850n935o329
$$ 610007 605121 599438 592657 585720 578688 571017 563368 556770 550517 543223 535376 528526 522591 516262
58019E16262o770o252n944o545o547n031l553l446l735l300k721k457j762p70
$$ 516262 509492 503240 497296 490751 484204 479173 475620 472174 468439 465139 462418 459961 458199 457429
58005D57429r94k402k719j092M01L90L84J668K886K714K277K931M002M584N247
$$ 457429 456435 454033 451314 450222 450623 451013 451397 453065 455951 458665 460942 463873 467875 472459 477706
57990D77706O219O156M422K405J017p65l345n014m752m143m765n863o324o656
$$ 477706 483925 490081 494503 496908 497925 497160 493815 488801 484049 479906 475141 469278 462954 456298
57976D56298p320p309o060m762m173l308j728p69r74p67O04J261j97k137k442
$$ 456298 448978 441669 435609 430847 426674 423366 421638 420869 419895 419128 419732 420993 420796 418659 416217
57961D16217j495o93r0N29K61j151k090j479o79j134k036k117j913k322k659k014
$$ 416217 414722 414029 413939 414468 414729 413578 411488 410009 409330 408196 406160 404043 402130 399808 397149 395135
57945C95135r61k05P91K292L240L285L883N789P433P584P513Q651J0138J0720
$$ 395135 394174 393969 394760 397052 400292 403577 407460 413249 420682 428266 435779 444430 454568 465288
57931D65288J0982J1680J1760J0228Q157O674M824J676j330k628l273m959o874
$$ 465288 476270 487950 499710 509938 518095 524769 529593 531269 529939 527311 524038 519079 512205
57918E12205p222o529o676p706q196p876p456o700n055l397k911k957k163r43
$$ 512205 504983 498454 491778 484072 475876 468000 460544 453844 448789 445392 442481 439524 437361 436418
57904D36418p57j558k090k170k665l616m239m431m593m460l599k569k135k035
$$ 436418 435661 434103 432013 429843 427178 423562 419323 414892 410299 405839 402240 399671 397536 395501
57890C95501j724j535j733j471j69J187J573J612K133K360J379J25l6L24j71j230
$$ 395501 393777 392242 390509 389038 388869 390056 391629 393241 395374 397734 399113 399238 399202 399526 399355 398125
57874C98125j612j417j574j799j232m13m98j083q77L2N75Q82J912L302L704L086
$$ 398125 396513 395096 393522 391723 390491 390078 389580 388497 387620 387652 388227 389109 391021 394323 398027 401113
57858D01113K706K971L123K946L026L330L218K757K541K375J620N79L6l16j452
$$ 401113 403819 406790 409913 412859 415885 419215 422433 425190 427731 430106 431726 432305 432341 432025 430573
57843D30573l228m539n060n447n955o225o231o192n834n018m533m967n261l983
$$ 430573 427345 422806 417746 412299 406344 400119 393888 387696 381862 376844 372311 367344 362083 358100
57829C58100j613mJ59j51j02K48P79J509K055K122K249K935L482K957J743Q19
$$ 358100 356487 356483 356642 356491 356389 356637 357416 358925 360980 363102 365351 368286 371768 374725 376468 377287
57813C77287J45p29j252p62k83j381l597m984m998m933n484n921n845n893o204
$$ 377287 377432 376703 375451 374689 374406 373025 369428 364444 359446 354513 349029 343108 337263 331370 325166
57798C25166n873m518l009k101j452m71Q45K195L268L671L436L427M312N353N347
$$ 325166 319293 314775 311766 309665 308213 307742 308587 310782 314050 317721 321157 324584 328896 334249 339596
57783C39596M519M230M908N635N719N398M951M346L909M158M855N194M959M491
$$ 339596 344115 348345 353253 358888 364607 370005 374956 379302 383211 387369 392224 397418 402377 406868
57769D06868L621J800p39l033m667n975p081p730q055q419q531p711o073m498
$$ 406868 410489 412289 411550 408517 403850 397875 390794 383064 375009 366590 358059 350348 344275 339777
57755C39777l392k372j126J59J190J735J658J319J459K080K150J224M24P24J266
$$ 339777 336385 334013 332887 333046 334236 335971 337629 338948 340407 342487 344637 345861 346285 347009 348275
57740C48275P58l48o95l10l21q90j170j005q97o39K87J167P57n57j102m25K77
$$ 348275 349033 348685 347990 347680 347359 346469 345299 344294 343397 342758 343045 344212 344969 344412 343310 342885 343162
57723C43162K19j71o53j562k575k816k469k723l788m501m259l744l445k941k186
$$ 343162 343381 343210 342557 340995 338420 335604 333135 330412 326624 322123 317864 314120 310675 307734 305548
57708C05548j981k643l431l819m093m345m083l313k774k684k381j556p91n16n14
$$ 305548 303567 300924 297493 293674 289581 285236 281153 277840 275066 272382 270001 268445 267654 267138 266624
57693B66624o52j054j360j018l92l84q62p53J81J029J373J809K584L156L473M249
$$ 266624 265972 264918 263558 262540 262148 261764 260902 260149 260330 261359 262732 264541 267125 270281 273754 278003
57677B78003N612O870Q060J0308J4097J8489K2705K7260L2967L9866M7532N5335
$$ 278003 283615 290485 298545 308853 322950 341439 364144 391404 424371 464237 511769 567104
57665E67104O1862O5086O3461N6016M1738K0609m422k8142m6463n8138o3339o2557
$$ 567104 628966 694052 757513 813529 855267 875876 871454 843312 796849 738711 675372 612815
57653F12815n7495n0963m4667l8263l1339k4818j9605j5383j1800r515q877q730
$$ 612815 555320 504357 459690 421427 390088 365270 345665 330282 318482 308967 300090 291360
57641B91360p735n933m072k386r68l06m86p04m45k18l44j66O73J243O89l78r73
$$ 291360 283625 277692 273620 271234 270266 269960 269474 268770 268325 268107 267763 267597 268270 269513 270202 269824 268851
57624B68851j267j904k549k395j599j105j345j946k361k217j461o38m68p92o60
$$ 268851 267584 265680 263131 260736 259137 258032 256687 254741 252380 250163 248702 248064 247596 246804 246144
57609B46144J40O51L20j24oJ99o0l94m23o31j216j192J17J588J653M71n92j057
$$ 246144 246284 246935 247255 247131 247125 247324 247264 246870 246447 245816 244600 243408 243525 245113 246766 247237 246645 245588
57591B45588j565k393l019l097k824k466k199k230k399k086j158m86p33j246j081
$$ 245588 244023 241630 238611 235514 232690 230224 228025 225795 223396 221310 220152 219666 218933 217687 216606
57576B16606m99m58j084j754k330l101l700l250j785m95l32r82j489j348p93l66
$$ 216606 216107 215649 214565 212811 210481 207380 203680 200430 198645 198150 197818 196836 195347 193999 193206 192840
57560A92840l28m38k88P3K34J56K94P56R67N53J4L9O28J338J953K398K460K017
$$ 192840 192512 192074 191786 191859 192093 192249 192543 193299 194266 194819 194833 194872 195500 196838 198791 201189 203649 205666
57542B05666J257L31p17j500j396m80L47N19M00L62R6o30j309j488j467j564j433
$$ 205666 206923 207254 206537 205037 203641 203161 203508 204027 204427 204789 204885 204255 202946 201458 199991 198427 196994
57525A96994q31l43n04q19n21K80R92J546K134K491K370K258K693L267L257K898
$$ 196994 196163 195820 195316 194497 193976 194256 195248 196794 198928 201419 203789 206047 208740 212007 215264 218162
57509B18162L010L567L631K748J536P49M82L96K84J88K60M69L70n14j947k948
$$ 218162 221172 224739 228370 231118 232654 233403 233885 234281 234565 234753 235013 235482 235852 235338 233391 230443
57493B30443k909k271j795j649j605j613j705j688j453j193r75n14K99J057J419
$$ 230443 227534 225263 223468 221819 220214 218601 216896 215208 213755 212562 211587 211073 211372 212429 213848
57478B13848J488J308O77k09o48m50l98j066j923k229k135k160k224j956j472
$$ 213848 215336 216644 217321 217112 216464 216014 215616 214550 212627 210398 208263 206103 203879 201923 200451
57463B00451j106q15m23o5J90O06J212J510J226P80N20K37j64l47l83q69j632
$$ 200451 199345 198530 198107 198042 198232 198838 200050 201560 202786 203566 204086 204323 204159 203812 203429 202560 200928
57446B00928j476m8J267J372J152J834K790K588J326J97n43j381j795p32J222
$$ 200928 199452 199404 200671 202043 203195 205029 207819 210407 211733 211930 211387 210006 208211 207479 208701
57431B08701K130J340K45J8J78p6n15o03n39p41j030r63m99J27P34J120J070O88
$$ 208701 210831 212171 212416 212434 212612 212536 212021 211418 210879 210138 209108 208145 207646 207773 208507 209627 210697 211385
57413B11385L72L07L53M22N83P91Q48P00M17L5l65n38l71m4K85O52R21P42J86
$$ 211385 211757 212064 212417 212839 213422 214213 215061 215761 216178 216213 215848 215310 214939 214895 215180 215832 216753 217495 217681
57394B17681j19R7L49L25M40Q97J080O45M67J472L139M176M151L546K741J901
$$ 217681 217562 217659 218008 218333 218773 219670 220750 221395 221862 223334 226473 230649 234800 238346 241087 242988
57378B42988J407J370J200N19m3N3J14o46j570j569j012j095j751j838j159o10
$$ 242988 244395 245765 246965 247484 247441 247494 247608 246962 245392 243823 242811 241716 239965 238127 236968 236358
57362B36358m55p8M66L02n90j122p92l10j66J16Q40J507J764J938K210K278K071
$$ 236358 235903 235825 236291 236593 236003 234881 234089 233779 233613 233729 234569 236076 237840 239778 241988 244266 246337
57345B46337J843J417M03o69p36J09N68J37k08K01O12K88k03o7L78L69m9k86j28
$$ 246337 248180 249597 250000 249331 248595 248704 249272 249409 249201 249402 250014 250302 250099 250032 250410 250779 250730 250444 250316
57326B50316K74Q31J317J297P04O8k48l98m53j48L79M53j02n02j61M50O42N75
$$ 250316 250590 251421 252738 254035 254739 254807 254559 254161 253708 253560 253939 254392 254290 253788 253627 254077 254719 255294
57308B55294P93J284J610J599J427J269J325J728K167K062J406Q78Q30P49J59
$$ 255294 256087 257371 258981 260580 262007 263276 264601 266329 268496 270558 271964 272842 273672 274421 274580
57293B74580m74l16P51K066K936L067K588J955J692J963K550L244L909M223L920
$$ 274580 274106 273790 274541 276607 279543 282610 285198 287153 288845 290808 293358 296602 300511 304734 308654
57278C08654L309L021L146L152K808K570K902L655M380M754M661M262M029M234
$$ 308654 311963 314984 318130 321282 324090 326660 329562 333217 337597 342351 347012 351274 355303 359537
57264C59537M429M032L289K948L008K659J578N08K05N91J157J550J554J140P74
$$ 359537 363966 367998 371287 374235 377243 379902 381480 381988 382193 382784 383941 385491 387045 388185 388959
57249C88959J079J945K594K605K296K058J983K214K873L529L522K885K231J740
$$ 388959 390038 391983 394577 397182 399478 401536 403519 405733 408606 412135 415657 418542 420773 422513
57235D22513J164P83J224K198K641K380K415L190L833L686L359L523L800L738
$$ 422513 423677 424460 425684 427882 430523 432903 435318 438508 442341 446027 449386 452909 456709 460447
57221D60447L833M609N496N670N349N245N284M955M483M679N717O864P331O935
$$ 460447 464280 468889 474385 480055 485404 490649 495933 500888 505371 510050 515767 522631 529962 536897
57207E36897O059N386N403N874O108N923N863O259O784P244P973Q994R622R527
$$ 536897 542956 548342 553745 559619 565727 571650 577513 583772 590556 597800 605773 614767 624389 633916
57193F33916R460J0181J1353J2195J2587J2808J2753J2330J2100J2593J3369J3593
$$ 633916 643376 653557 664910 677105 689692 702500 715253 727583 739683 752276 765645 779238
57181G79238J3257J3037J3219J3600J4247J5445J6935J7973J8216J7991J7679
$$ 779238 792495 805532 818751 832351 846598 862043 878978 896951 915167 933158 950837
57170I50837J7323J6846J6243J5597J5194J5453J6388J7399J8009J8529J9533
$$ 950837 968160 985006 1001249 1016846 1032040 1047493 1063881 1081280 1099289 1117818 1137351
57159A137351K0971K2357K3617K5063K6611K7673K7942K7872K8125K8874K9759
$$ 1137351 1158322 1180679 1204296 1229359 1255970 1283643 1311585 1339457 1367582 1396456 1426215
57148A426215L0353L0615L0941L1803L3272L4945L6383L7504L8549L9819M1478
$$ 1426215 1456568 1487183 1518124 1549927 1583199 1618144 1654527 1692031 1730580 1770399 1811877
57137A811877M3439M5349M6951M8398N0040N1941N4014N6491N9786O3758O7623
$$ 1811877 1855316 1900665 1947616 1996014 2046054 2097995 2152009 2208500 2268286 2332044 2399667
57126B399667P0836P3736P7086Q1321Q6396R2096R8243J04767J11814J19765J29041
$$ 2399667 2470503 2544239 2621325 2702646 2789042 2881138 2979381 3084148 3195962 3315727 3444768
57115C444768J39930J52453J66347J81352J97752K16456K38331K63652K92576
$$ 3444768 3584698 3737151 3903498 4084850 4282602 4499058 4737389 5001041 5293617
57106E293617L25984L65627M13514M71342N40635O23629P24362Q48661J002685
$$ 5293617 5619601 5985228 6398742 6870084 7410719 8034348 8758710 9607371 10610056
57097A0610056J191741J421068J696769K024035K404064K833473L305700L810306
$$ 10610056 11801797 13222865 14919634 16943669 19347733 22181206 25486906 29297212
57089B9297212M330906M846656N336547N779936O153869O436189O614556O687295
$$ 29297212 33628118 38474774 43811321 49591257 55745126 62181315 68795871 75483166
57081G5483166O649671O480702O145475N605134M821172L762274K428511Q78392
$$ 75483166 82132837 88613539 94759014 100364148 105185320 108947594 111376105 112254497
57073A12254497p74888k401982l895178n177969o198510o929346p370910p544985
$$ 112254497 111479609 109077627 105182449 100004480 93805970 86876624 79505714 71960729
57065G1960729p482326p218502o796516o264079n665668n039479m419495l833762
$$ 71960729 64478403 57259901 50463385 44199306 38533638 33494159 29074664 25240902
57057B5240902l299327k822634k405645k048528j747085j492649j276757j093851
$$ 25240902 21941575 19118941 16713296 14664768 12917683 11425034 10148277 9054426
57049I054426r39211q07550o94889n99422n19479m52420l96000l48875l09381
$$ 9054426 8115215 7307665 6612776 6013354 5493875 5041455 4645455 4296580 3987199
57040C987199k75679k47243k24174k05017j87272j70160j54734j41133j27960
$$ 3987199 3711520 3464277 3240103 3035086 2847814 2677654 2522920 2381787 2253827
57031B253827j14460j01059q7489p2653n6636m0509k3917n299J5125L5163N3604
$$ 2253827 2139367 2038308 1950819 1878166 1821530 1781021 1757104 1751805 1766930 1802093 1855697
57020A855697O9913P9664P3960M6694J516n0015r6072j29519j48015j52693j46943
$$ 1855697 1925610 2005274 2079234 2125928 2127444 2077429 1981357 1851838 1703823 1551130 1404187
57009A404187j34736j19347j03364q8787p6261o5060n4527m5019l6992l0251k4627
$$ 1404187 1269451 1150104 1046740 957953 881692 816632 762105 717086 680094 649843 625216
56998F25216k0398j7483j5188j3261j2290j2466j2947j2946j2429j1372r351o473
$$ 625216 604818 587335 572147 558886 546596 534130 521183 508237 495808 484436 475085 468612
56986D68612l547p95K510O494R838J1097R830N983n50q851j6621k1975k4905k6268
$$ 468612 465065 464270 466780 473274 483112 494209 504039 510022 509472 500621 484000 462025 437120 410852
56972D10852k6198k4400k1233j7575j4033j0838q006n153j751K105N822R392J3413
$$ 410852 384654 360254 339021 321446 307413 296575 288569 283416 281665 283770 289592 298984 312397
56959C12397J7793K1504K4062K6032K7373K6370K1190J1911M03j1066k0557k6805
$$ 312397 330190 351694 375756 401788 429161 455531 476721 488632 489035 477969 457412 430607
56947D30607k9725l0158k8707k5424k0856j6334j2607r102n223j442J672M748
$$ 430607 400882 370724 342017 316593 295737 279403 266796 257694 252471 251029 252701 257449
56935B57449Q984J4684K1075K7149L2169L5692L7408L6533L1416K0814N895r819
$$ 257449 266433 281117 302192 329341 361510 397202 434610 471143 502559 523373 529268 519449
56923E19449k3064l2672l8763m1445m0972l8297l4476l0099k5606k1474j7689
$$ 519449 496385 463713 424950 383505 342533 304236 269760 239661 214055 192581 174892
56912A74892j3892j0439q373p881p771p014n852m808l698k347j258p81m00L81
$$ 174892 161000 150561 142188 134307 126536 119522 113670 108862 105164 102817 101559 100778 100378 100759
56898A00759J263J876K471L278M080N107P313J0976J4899J7907K0334K3131K6260
$$ 100759 102022 103898 106369 109647 113727 118834 126147 137123 152022 169929 190263 213394 239654
56885B39654K8726K9542K7957K3527J6774R044J207o680j3870j8491j9545j8251
$$ 239654 268380 297922 325879 349406 366180 375224 376431 369751 355881 337390 317845 299594
56873B99594j6327j3897j0322o036j987K049P056J3091J9359K5715L2801M0794
$$ 299594 283267 269370 259048 253012 251025 253074 260130 273221 292580 318295 351096 391890
56861C91890M8990N6524O2480O5450O3814N6521M3332K4877L268j7937l5294m7041
$$ 391890 440880 497404 559884 625334 689148 745669 789001 813878 817146 799209 763915 716874
56849G16874n2898n3206m9003m2157l4222k5500j5862n939L508J2813K3010L4501
$$ 716874 663976 610770 561767 519610 485388 459888 444026 438087 441595 454408 477418 511919
56837E11919M7015O0377P4369Q7870R8947J05462J05021R5005P3958M3141O533
$$ 511919 558934 619311 693680 781550 880497 985959 1090980 1185985 1259943 1303084 1309617
56826A309617l0441o2152q4295r5742r8638r5814q8448p6841o2448m7718l4199
$$ 1309617 1279176 1217024 1132729 1036987 938349 842535 754087 677246 614798 567080 532881
56815E32881k1937j0536K36J0765K1518L2600M3860N5095O5392P2644P4383O8904
$$ 532881 510944 500408 500644 511409 532927 565527 609387 664482 729874 802518 876901 945805
56803I45805N5305L3558N757k3376m8565o6691p7125q0366p7583p0846o2237n2676
$$ 945805 1001110 1034668 1040425 1017049 968484 901793 824668 744302 666719 595873 533636 480960
56791D80960m2451l2494k3930j6634r456j820N857J3200K0217K6677L2016L5835
$$ 480960 438509 406015 382085 365451 355995 354175 360032 373232 393449 420126 452142 487977
56779D87977L7603L6060K9881J9008M785j0879k5797l7558m4600m7260m6983m4638
$$ 487977 525580 561640 591521 610529 615314 604435 578638 541080 496480 449220 402237 357599
56767C57599m0411l4961k9515k4872k1128j8257j6116j4092j1625q989o842n310
$$ 357599 317188 282227 252712 227840 206712 188455 172339 158247 146622 137633 130791 125481
56755A25481m204l692l803l782k993k075k082k770k961k295j515j127r85j049
$$ 125481 121277 117585 113782 110000 107007 104932 102850 100080 97119 94824 93309 92182 91197 90148
56741I0148j403j588j064k07J41nLJ88Q2q7L26J019J062N18L45O05L33n36o56
$$ 90148 88745 87157 86093 85886 86027 86022 86025 86213 86295 86208 86534 87553 88615 89133 89478 90083 90416 89880 89224
56722H9224P29K556L438L340L040K799K319J553Q88O74Q92J076P37J05R9J005
$$ 89224 89953 92509 95947 99287 102327 105126 107445 108998 109886 110560 111452 112528 113265 113370 113469 114474
56706A14474J748J355N54P69J862K309J485L57k40n83r86j115q70q65j423j965
$$ 114474 116222 117577 118131 118900 120762 123071 124556 124913 124673 124090 123104 121989 121119 120254 118831 116866
56690A16866j947j622j453j457j538j783k053j899j201m05M9J28l7k77l13n1J79
$$ 116866 114919 113297 111844 110387 108849 107066 105013 103114 101913 101508 101557 101685 101648 101371 101058 101007 101186
56673A01186J66K72P29R96N87M8J28N13N36O18J630L174M036M097M233M492L998
$$ 101186 101352 101624 102353 103349 103936 103984 104112 104625 105161 105779 107409 110583 114619 118716 122949 127441 131439
56656A31439K850K354L067M117M797N327N680N324M607M795O104P138O932O113
$$ 131439 134289 136643 139710 143827 148624 153951 159631 164955 169562 174357 180461 187599 194531 200644
56642B00644N352M249K556J143O14J87r71k351l072l316l742m318m700n032n461
$$ 200644 205996 210245 212801 213944 214558 214745 213774 211423 208351 205035 201293 196975 192275 187243 181782
56627A81782n573n152m825n105n480n201m390l588k830j924j155r66j294j712
$$ 181782 176209 171057 166232 161127 155647 150446 146056 142468 139638 137714 136559 135593 134299 132587
56613A32587j860j432k70J148J962J909J459Q22k45j451j793r24K32P26N90J70
$$ 132587 130727 129295 129025 130173 132135 134044 135503 136325 136080 134629 132836 131912 132144 132870 133460 133630
56597A33630m86j067q66J12Q71Q25N93P76R63P11M28M98M87J08O8R28J937K043
$$ 133630 133144 132077 131211 131323 132194 133019 133612 134388 135351 136062 136490 136988 137475 137583 137651 138579 140516 142559
56579A42559J416J015J175J533J827J932J577Q66N67J179K123K570K529K513K706
$$ 142559 143975 144990 146165 147698 149525 151457 153034 153900 154467 155646 157769 160339 162868 165381 168087
56564A68087L147M142N804P623R179J0693J2364J3715J4266J4125J3347J1400
$$ 168087 171234 175376 181180 188803 197982 208675 221039 234754 249020 263145 276492 287892
56552B87892Q109M456J677N5q13j250j617k433l591m107l482k607k551l182l845
$$ 287892 296001 300457 302134 302189 301376 300126 298509 296076 292485 288378 284896 282289 279738 276556 272711
56537B72711m631n832o783o468n045l711l293l710m501n133n043m210l398l203
$$ 272711 268080 262248 255465 248997 243952 240241 236948 233238 228737 223604 218561 214351 210953 207750
56523B07750l217k747j837r45j32N82O05n00k072l016l109k855k435j756j260
$$ 207750 204533 201786 199949 199004 198872 199454 200059 199559 197487 194471 191362 188507 186072 184316 183056
56508A83056j664k864l874l904k985j662o35m37r75j459j306q36p00q85q48l09
$$ 183056 181392 178528 174654 170750 167765 166103 165468 165031 164056 162597 161291 160455 159755 158870 158022 157713
56492A57713M91J118J225Q09M19O31J135R97R6n06q6P41J116J163J326J322P02
$$ 157713 158204 159322 160547 161356 161775 162406 163541 164538 164634 164128 164042 164783 165899 167062 168388 169710 170412
56475A70412q4k16L28R15J305J719K171K370K164J595Q22K55L23P12N63k96j008
$$ 170412 170328 170112 170440 171355 172660 174379 176550 178920 181084 182679 183501 183756 184079 184791 185354 185058 184050
56458A84050j019q01p44l42O53J321Q78Oj66K43M10L67P46J357J349O96L14O89
$$ 184050 183031 182230 181486 181144 181797 183118 183996 184002 183836 184079 184489 184856 185602 186959 188308 189004 189318 190007
56440A90007J332J625J484J076N43P4j62j83r0J6j22o92j334j395q80m54l64j96
$$ 190007 191339 192964 194448 195524 196067 196141 195979 195796 195706 195722 195600 194908 193574 192179 191299 190845 190481 190285
56422A90285J31J76O6N59J543J752P49j60J43R46J154J034J304J519Q62k72q46
$$ 190285 190416 190592 190658 191217 192760 194512 195261 195101 195244 196190 197344 198378 199682 201201 202063 201791 200945
56405B00945p56n87m06k0J68k41o63k72P69J787K670L508L938L823L851M366M422
$$ 200945 200189 199602 199196 199176 199344 199103 198440 198168 198937 200724 203394 206902 210840 214663 218514 222880 227302
56388B27302L139J169l16j225j954k142j450o65n55m62M55J391J007l00r66o09
$$ 227302 230441 231610 231294 230069 228115 225973 224523 223858 223303 222841 223296 224687 225694 225394 224428 223819
56372B23819j47k5J06L45O79J599L164M041L141J570J167J758J767J053R63J759
$$ 223819 223672 223647 223753 224098 224777 226376 229540 233581 236722 238292 239459 241217 242984 244037 245000 246759
56356B46759K204J791J435J688K023K144K419K760K555J932J621J532Q92j56o07
$$ 246759 248963 250754 252189 253877 255900 258044 260463 263223 265778 267710 269331 270863 271755 271599 270992
56341B70992l12j37k58J36J226K093K187J957J835J796J958K484K846K424J771
$$ 270992 270680 270543 270285 270421 271647 273740 275927 277884 279719 281515 283473 285957 288803 291227 292998
56326B92998J941K744L067K789K846L401L488K615J303l9j395k260j992j110q59
$$ 292998 294939 297683 300750 303539 306385 309786 313274 315889 317192 317153 315758 313498 311506 310396 309537
56311C09537j308j336n10M04R69J605K379K694K428K223K389K670L080L839M588
$$ 309537 308229 306893 306383 306787 307756 309361 311740 314434 316862 319085 321474 324144 327224 331063 335651
56296C35651M818M852N205N339M487L312L114L698L801L328L331L902M131M091
$$ 335651 340469 345321 350526 355865 360352 363664 366778 370476 374277 377605 380936 384838 388969 393060
56282C93060M876O412P253O893O484O893P722Q538R447J0164J0147R888J0532
$$ 393060 397936 404348 411601 418494 424978 431871 439593 448131 457578 467742 477889 487777 498309
56269D98309J1997J3101J3570J4237J5225J5828J6310J7914K0790K3747K6333
$$ 498309 510306 523407 536977 551214 566439 582267 598577 616491 637281 661028 687361
56258F87361K9373L3180L7128M1276M6555N2998N9544O5929P3036Q1172Q9717
$$ 687361 716734 749914 787042 828318 874873 927871 987415 1053344 1126380 1207552 1297269
56247A297269R8483J07551J15800J21823J26265J30915J35356J36915J34225J28256
$$ 1297269 1395752 1503303 1619103 1740926 1867191 1998106 2133462 2270377 2404602 2532858
56237B532858J19503J06935R0513P1990N2240L0393O684j6336l6763n5213p2459
$$ 2532858 2652361 2759296 2849809 2921799 2974039 3004432 3011116 2994780 2958017 2902804 2830345
56226B830345q7404r8786j06946j12584j15600j16305j15949j14835j11753j06378
$$ 2830345 2742941 2644155 2537209 2424625 2309025 2192720 2076771 1961936 1850183 1743805
56216A743805j00401r5164q9956q3793p7142p0800o4770n9193n4683n0964m6917
$$ 1743805 1643404 1548240 1458284 1374491 1297349 1226549 1161779 1102586 1047903 996939 950022
56205I50022m2656l9543l7519l4712l0556k6827k4536k2306j9095j6113j4478
$$ 950022 907366 867823 830304 795592 765036 738209 713673 691367 672272 656159 641681
56194F41681j3257j1394r565q564p786o717o017n815m962l288k398k912l180k172
$$ 641681 628424 617030 607465 598901 591115 584398 578381 572566 567604 564316 561918 559006 555826 553654
56180E53654j252j477j567m86L57l99j481j073K94J080J341J958K755L280L991
$$ 553654 552402 550925 549358 548872 549229 548830 547349 546276 546570 547650 548991 550949 553704 556984 560975
56165E60975N009N264M425M036N123O473O844P016Q011R167R728J0543J2319J4070
$$ 560975 565984 571248 575673 579709 584832 591305 598149 605165 613176 622343 632071 642614 654933 669003
56151F69003J5052J6412J9103K2019K4076K6336L0224L5415M1305M8718N8310
$$ 669003 684055 700467 719570 741589 765665 792001 822225 857640 898945 947663 1005973
56140A005973O9065Q0065R1908J04682J16504J25745J32444J35798J32916J22444
$$ 1005973 1075038 1155103 1247011 1351693 1468197 1593942 1726386 1862184 1995100 2117544
56130B117544J07364R1905P7732O5194N5618M9515M4423L7364K8009J7297N102
$$ 2117544 2224908 2316813 2394545 2459739 2515357 2564872 2609295 2646659 2674668 2691965 2697067
56119B697067q190j9892k7770l3184l9122m6713n5919o7683q2550r8513j12596
$$ 2697067 2688877 2668985 2641215 2608031 2568909 2522196 2466277 2398594 2316044 2217531 2104935
56108B104935j23269j29475j29352j22358j11043r8385q5083p1261n8546m8158
$$ 2104935 1981666 1852191 1722839 1600481 1489438 1391053 1305970 1234709 1176163 1128005
56098A128005l9091l0478k3563j9142j5508j1294p809o100m464j588O73O10N2
$$ 1128005 1088914 1058436 1034873 1015731 1000223 988929 981120 975020 970556 968968 969641 970251 970303
56085I70303J235L028L502L677N248P074P418P301Q307R381R192R097J0398J1331
$$ 970303 971538 974566 978068 981745 986993 994067 1001485 1008786 1017093 1026474 1035666 1044763 1055161 1066492
56071A066492J0282R242J0414J2224J2491J2607J4498J6428J6158J5380J6510
$$ 1066492 1076774 1086016 1096430 1108654 1121145 1133752 1148250 1164678 1180836 1196216 1212726
56060A212726J7911J7058J5602J6348J7777J6831J4650J4308J5105J4429J3149
$$ 1212726 1230637 1247695 1263297 1279645 1297422 1314253 1328903 1343211 1358316 1372745 1385894
56049A385894J3827J5527J5728J5416J7008J9208J9273J8473J9851K2512K3499
$$ 1385894 1399721 1415248 1430976 1446392 1463400 1482608 1501881 1520354 1540205 1562717 1586216
56038A586216K3395K4604K6115K5625K4809K6717K9914L0964L0808L2792L6350
$$ 1586216 1609611 1634215 1660330 1685955 1710764 1737481 1767395 1798359 1829167 1861959 1898309
56027A898309L8514L9684M1965M4080M3939M3719M6221M8939M8366M7199N0123
$$ 1898309 1936823 1976507 2018472 2062552 2106491 2150210 2196431 2245370 2293736 2340935 2391058
56016B391058N5324N7806N8371O1280O5714O7849O9101P3661P9868Q2762Q3267
$$ 2391058 2446382 2504188 2562559 2623839 2689553 2757402 2826503 2900164 2980032 3062794 3146061
56005C146061Q6213R1220R4327R6554J01825J08564J12578J15974J23630J33480
$$ 3146061 3232274 3323494 3417821 3514375 3616200 3724764 3837342 3953316 4076946 4210426
55995D210426J40296J46267J57101J70517J80094J87761K00378K16551K29549
$$ 4210426 4350722 4496989 4654090 4824607 5004701 5192462 5392840 5609391 5838940
55986E838940K40895K57735K78942K97714L15802L40810L71416M00357M29851
$$ 5838940 6079835 6337570 6616512 6914226 7230028 7570838 7942254 8342611 8772462
55977H772462M68237N13707N58258O05390O65800P37981Q12573Q93684R95067
$$ 8772462 9240699 9754406 10312664 10918054 11583854 12321835 13134408 14028092 15023159
55968A5023159J117368J251950J405482J596461J829527K100136K423414K829813
$$ 15023159 16140527 17392477 18797959 20394420 22223947 24324083 26747497 29577310
55960B9577310L335049L948243M708953N679041O898810Q393649J0224110J2482110
$$ 29577310 32912359 36860602 41569555 47248596 54147406 62541055 72765165 85247275
55952H5247275J5240860J8564450K2539898K7162830L2115544L6723211M0160936
$$ 85247275 100488135 119052585 141592483 168755313 200870857 237594068 277755004
55945B77755004M1587171M0031718L4440917K4290086J0373217n120919j9501916
$$ 277755004 319342175 359373893 393814810 418104896 428478113 423357194 403855278
55938D03855278l0697992l7772499m0774549m0381136l7597715l3479697k8883158
$$ 403855278 373157286 335384787 294610238 254229102 216631387 183151690 154268532
55931A54268532k4367304k0251893j6693094j3716678j1263930r260789p646292
$$ 154268532 129901228 109649335 92956241 79239563 67975633 58714844 51068552
55924E1068552o353741n308952m458141l772439l221646k767795k386801k072279
$$ 51068552 44714811 39405859 34947718 31175279 27953633 25185838 22799037 20726758
55916B0726758j814015j593044j400074j238307j104818r87131q80422p90450
$$ 20726758 18912743 17319699 15919625 14681318 13576500 12589369 11708947 10918497
55908A0918497p16921o50363n87832n35829m95024m56986m18653l85884l59914
$$ 10918497 10201576 9551213 8963381 8427552 7932528 7475542 7056889 6671005 6311091
55899F311091l33866l05599k81289k63205k45757k26532k10042j97807j85354
$$ 6311091 5977225 5671626 5390337 5127132 4881375 4654843 4444801 4246994 4061640
55890D061640j71627j61117j54292j45742j34106j24291j17694j09733r9149r0497
$$ 4061640 3890013 3728896 3574604 3428862 3294756 3170465 3052771 2943038 2843889 2753392
55880B753392q5038p8205o8657o1272n8622n7601n6801n9076o4317o7564o7055
$$ 2753392 2668354 2590149 2521492 2460220 2401598 2343997 2287196 2228120 2163803 2096239 2029184
55869B029184o6768o8450o8337o4355n9604n6181n2058m6602m2757m1387l9517
$$ 2029184 1962416 1893966 1825629 1761274 1701670 1645489 1593431 1546829 1504072 1462685 1423168
55858A423168l6293l4672l5245l4517l1346k9008k8935k8411k6503k6096k7878
$$ 1423168 1386875 1352203 1316958 1282441 1251095 1222087 1193152 1164741 1138238 1112142 1084264
55847A084264k8350k6168k4649k5534k6009k4353k2939k2953k1748j8330j6086
$$ 1084264 1055914 1029746 1005097 979563 953554 929201 906262 883309 861561 843231 827145
55836H27145j6949j7803j5895j3243j2405j2222j0887r430r114q856p814p238
$$ 827145 810196 792393 776498 763255 750850 738628 727741 718311 709197 700341 692527 685289
55824F85289p543p010n439n400p823r972r955r540j0443j1362j0960j0287j0037
$$ 685289 677746 670736 665297 659897 652074 642102 632147 622607 612164 600802 589842 579555 569518
55811E69518q715n654k778j408l30J243K043J735K234M322O190O924P986R698
$$ 569518 560803 555149 552371 550963 550633 551876 553919 555654 557888 562210 568400 575324 583310 593008
55797E93008R832P548N075L610J196l213p257r118j0462j2894j4754j4159j2265
$$ 593008 602840 610388 615463 619073 620269 617056 609799 600681 590219 577325 562571 548412 536147
55784E36147j0848r368p013n110m973n668o200p473r916j1528j0672q546o833
$$ 536147 525299 515931 508918 503808 498835 493167 486967 479494 469578 458050 447378 438832 431999
55771D31999n054k355L60K188L913N877O345M040L75k761n430q124r920j0080
$$ 431999 426945 424590 424950 427138 431051 436928 443273 447313 447688 444927 439497 431373 421453 411373
55757D11373r498q931p744n887m840n023m610k703j223j804l202l734l973m947
$$ 411373 401875 392944 385200 379313 374473 369450 364840 362137 360914 359110 355908 352174 348201 343254
55743C43254n893n919n838o353o432n426m634m878m638k788r68j016k057k349
$$ 343254 337361 331442 325604 319251 312819 307393 302759 297881 293243 290455 289487 288471 286414 284065
55729B84065k120k327k489k002j893k976m071m047l952m850n503m498k955k645
$$ 284065 281945 279618 277129 275127 273234 270258 266187 262140 258188 253338 247835 243337 240382 237737
55715B37737k998k435j228n92k67O86J870K611L697N800P439O802M532K521J003
$$ 237737 234739 232304 231076 230484 230217 230903 232773 235384 239081 244881 252320 259122 263654 266175 267178
55700B67178q53k665l480l836m920o371o940o580n982m958l126j376o84l75O32
$$ 267178 266325 263660 260180 256344 251424 245053 238113 231533 225551 220593 217467 216091 215407 215032 215664
55685B15664J810K041J782K178K939L040K798L344M684N915O651O648N043J755
$$ 215664 217474 219515 221297 223475 226414 229454 232252 235596 240280 246195 252846 259494 264537 266292
55671B66292j292k256j840j980k933l533l446l200k722j680p20n47n06L35J411
$$ 266292 265000 262744 260904 258924 255991 252458 249012 245812 243090 241410 240690 240143 239637 239972 241383
55656B41383J640J392J719K454K750K728K860K618J469K78j43q87l264o220p597
$$ 241383 243023 244415 246134 248588 251338 254066 256926 259544 261013 261291 261148 260261 256997 250777 243180
55641B43180p285o839o688o015n057n047n947o353n722m879m301l656k991k713
$$ 243180 235895 229056 222368 216353 211296 206249 200302 193949 188227 183348 179047 175391 172400 169687
55627A69687k552k020j601j987k494j989q95n78j087j306j129j484k444l066l080
$$ 169687 167135 165115 163514 161527 159033 157044 156149 155571 154484 153178 152049 150565 148121 145055 141975
55612A41975l050k976k365j537j176q24M01J837J866M31q66j234j366j618j346
$$ 141975 138925 135949 133584 132047 130871 130047 130448 132285 134151 134582 133716 132482 131116 129498 128152
55597A28152m55J76J97K82O85P26L8q42j390j549j246n45j91p60j477j148m1N84
$$ 128152 127697 127873 128070 128352 129037 129763 129801 128959 127569 126020 124774 124229 124038 123278 121801 120653 120612 121196
55579A21196M88N04P34M86n4J88J294K125K165K086K229K125J736J656J757J173
$$ 121196 121684 122188 122922 123408 123354 123542 124836 126961 129126 131212 133441 135566 137302 138958 140715 141888
55563A41888L9l24N16J293Q85k67j199j717k059k250k290k194j639m25O87O48
$$ 141888 141927 141603 142119 143412 144297 144030 142831 141114 139055 136805 134515 132321 130682 130257 130944 131592
55547A31592k80q43o74o01r17q33J6R31J480K144L031L275K369J060K72R9L78
$$ 131592 131312 130469 129795 129194 128277 127444 127460 128391 129871 132015 135046 138321 140690 141750 142022 142121 142499
55530A42499J207K217K341J086o58j734k036k248k799l573m101l857k811j796
$$ 142499 143706 145923 148264 149350 148692 146958 144922 142674 139875 136302 132201 128344 125533 123737
55516A23737j684k204k408k167k194k476k008m98Q30Q15j90j112j638k179k840
$$ 123737 122053 119849 117441 115274 113080 110604 108596 108098 108928 109743 109553 108441 106803 104624 101784
55501A01784l208k919k116j376j313j912k373j995j023j23O59J665K659L080L086
$$ 101784 98576 95657 93541 92165 90852 88940 86567 84572 83549 83426 84085 85750 88409 91489 94575
55486I4575L318L646L242K036R72N97M27M2k31j45j03l71n51l22J7J39K21L99
$$ 94575 97893 101539 104781 106817 107789 108386 108813 108855 108624 108479 108376 108005 107454 107132 107149 107288 107509 107908
55468A07908L12l36j188j641j432p10J00M14k9p07q38m16j09j48n4L80O07K00
$$ 107908 108220 107884 106696 105055 103623 102913 103013 103427 103398 102691 101853 101437 101328 101180 101126 101506 102113 102313
55450A02313l89m14K13Q32O81m21j818k491k021r48k2O00J054J218R81O67N69
$$ 102313 101924 101510 101723 102555 103236 102815 100997 98506 96485 95537 95515 96115 97169 98387 99368 100035 100604
55433A00604M22j3l19o5L85M54K57J34j35p05r21k69M74K91m21n34k4L06M56J005
$$ 100604 101026 101013 100694 100629 101014 101468 101725 101859 101724 101019 100098 99829 100303 100594 100173 99639 99615 99921 100377 101382
55413A01382J561J197K95J49P15N93n67j477j428j237j466j451q61n75j057j340
$$ 101382 102943 104140 104435 104584 105299 105892 105325 103848 102420 101183 99717 98266 97405 96830 95773 94433
55397I4433o52J78N7o80j008p58m81m57o08q22p58K5J194J667R96J4l65k35j15
$$ 94433 93781 93959 94016 93336 92328 91570 91089 90632 90024 89202 88444 88469 89663 91330 92326 92340 91975 91740 91625
55378I1625j03j16k07k54K0L62J81l73m49J36O22P05J078K060K822K642J859J058
$$ 91625 91522 91406 91199 90945 90965 91327 91508 91135 90686 90822 91444 92149 93227 95287 98109 100751 102610 103668
55360A03668K89l28l00L03O60M72L26L15l49j569j767j87J513J361k65j442j394
$$ 103668 103957 103629 103329 103632 104292 104764 105090 105405 105056 103487 101720 101533 103046 104407 104142 102700 101306
55343A01306q82n18j89J53K74K00K6m68j256j553p85L48P32L64J08K34K20j59
$$ 101306 100424 99906 99717 99870 100144 100344 100370 99902 98646 97093 96308 96656 97388 97752 97860 98094 98314 98155
55325I8155m79m03l5L94P18P51N52N06P75R60P26L91L91N52M66J50j64n07q89
$$ 98155 97676 97273 97238 97632 98350 99101 99653 100159 100934 101894 102620 103011 103402 103954 104420 104570 104406 103899 103010
55306A03010j007p46n39o57o47l3P88J019N24j64n83n72j26N33J009J210J398
$$ 103010 102003 101257 100718 100061 99414 99381 100169 101188 101712 101548 100965 100393 100267 100800 101809 103019 104417
55289A04417J533J141J89n97p42o67p92p59j83M58N20K14J67M31O03N15J97l34
$$ 104417 105950 107091 107280 106683 105941 105274 104482 103723 103540 103998 104518 104732 104899 105330 105933 106448 106645 106311
55271A06311p38l98N92J159O80m4o4K77J54j99qN30N22r4n26n24o29j039j268
$$ 106311 105573 105175 105767 106926 107606 107562 107498 107775 107929 107730 107722 108252 108774 108680 108154 107630 107001 105962 104694
55252A04694j081q40p73o85n44o13q58q40l66K44O02N62J56l70n52k63n0m18r93
$$ 104694 103613 102773 102000 101315 100771 100158 99300 98460 98094 98338 98940 99502 99658 99288 98736 98473 98423 98005 97012
55233I7012r80k52N92J126J345J253P88J89j47j62k7L01R14J437J313N32l67r76
$$ 97012 96032 95780 96372 97498 98843 100096 100884 101073 100926 100764 100737 101038 101952 103389 104702 105234 104867 103891
55215A03891j187r30k72L18L97J95K83O41O36No81p41j47N44P77M27j66n59o45
$$ 103891 102704 101774 101502 101820 102217 102412 102695 103336 103972 103977 103296 102555 102408 102952 103729 104156 103990 103431 102786
55196A02786o87q37q67n24J36Q65J407J403O66l46p66l72J13Q3j64r4J63J75J3
$$ 102786 102099 101262 100395 99871 100007 100872 102279 103682 104348 104002 103236 102864 102977 103060 102896 102802 102965 103140 103153
55177A03153P1L89O52O66M05j28p43j059r08m79J32R47J615J599J114J010J355
$$ 103153 103224 103613 104265 104931 105336 105208 104465 103406 102498 102019 102151 103098 104713 106312 107426 108436 109791
55160A09791J149m1j161j189n12N2N98J294J262k13j966k110o17P81J095J006
$$ 109791 110940 110899 109738 108549 108037 108089 108687 109981 111243 111030 109064 106954 106337 107118 108213 109219
55144A09219J231J501J440J231R20J38j034j729j384n25p4l19q38j009n09L08
$$ 109219 110450 111951 113391 114622 115542 115680 114646 112917 111533 111008 110934 110615 109777 108768 108259 108567
55128A08567N66j78j261j674j269o25oP29J381J418Q06Q4l60m61n2R30J869J885
$$ 108567 109133 108955 107694 106020 104751 104126 104120 104849 106230 107648 108454 108538 108178 107717 107665 108595 110464 112349
55110A12349R66l9m85l42L00J290J976J665O06k13m18n19p63o65L8P61R15P04
$$ 112349 113315 113276 112791 112449 112749 114039 116015 117680 118286 118073 117655 117136 116373 115708 115746 116507 117422 118126
55092A18126O28P42P57N21R8l66o02l95P3L01k7p97j585j754p72J026K323K056
$$ 118126 118754 119496 120253 120774 120872 120506 119904 119509 119582 119883 119856 119059 117474 115720 114948 115974 118297 120353
55074A20353O75m41n87j18M83J060J393J188O08J04k77p93j290j345j014p27m87
$$ 120353 121028 120587 120000 119882 120365 121425 122818 124006 124614 124718 124441 123648 122358 121013 119999 119272 118785
55057A18785pM89M93J96K47N43L23l87o15j7M98K06l85n48m65o93j145j341j140
$$ 118785 118778 119267 119760 119956 120203 120746 121069 120682 120067 120050 120548 120754 120369 119821 119356 118663 117518 116177 115037
55038A15037o93j49K67L19K48N52J013P35m74j547j553r67p74r95q27P7J228J901
$$ 115037 114344 114195 114462 114781 115029 115581 116594 117329 116855 115308 113755 112788 112014 111019 110192 110269 111497 113398
55020A13398J609L42j137j594n27J164K239K461K359K062J237or39j137r83r83
$$ 113398 115007 115349 114212 112618 112091 113255 115494 117955 120314 122376 123613 123607 122668 121531 120548 119565
55004A19565j094r60m66J45N77P18O60O48Q48J143J206Q95M93L61M30K41m46j263
$$ 119565 118471 117511 117045 117190 117767 118485 119145 119793 120641 121784 122990 123885 124378 124739 125169 125410 124964 123701
54986A23701j723j820j845j694r84J43R00Q46M51L57N52P12R17J374J813J751
$$ 123701 121978 120158 118313 116619 115635 115778 116678 117524 117975 118332 118884 119596 120513 121887 123700 125451
54970A25451J179N03l4l77l88m3L18M14M89Q29J156J073P68O68O61L80J6L0L03
$$ 125451 126630 127133 127099 126722 126334 126291 126609 127023 127512 128341 129497 130570 131338 132006 132667 133047 133063 133093 133396
54951A33396K94p0l76m65m73k76K74P81P25L74L74O40N23J9j98L1J48l4l2L38
$$ 133396 133690 133620 133244 132779 132306 132030 132304 133085 133810 134184 134558 135198 135721 135740 135542 135573 135721 135687 135655 135993
54931A35993O10N51N66R69J633K493L609M582M742M174L737L912M383M968N904
$$ 135993 136603 137154 137720 138689 140322 142815 146424 151006 155748 159922 163659 167571 171954 176922 182826
54916A82826O959P183O005L914J654n55k648m269n143n411n353n251n460o020
$$ 182826 189785 196968 202973 206887 208541 207986 205338 201069 195926 190515 185162 179911 174451 168431
54902A68431o213n337l835k830k555k264j675j320j333j119n93m99j033j296o41
$$ 168431 162218 156881 153046 150216 147661 145397 143722 142402 141069 139950 139357 138858 137825 136529 135888
54887A35888M49J338K057K585K458J703J243J644K366K833L383M495N896O998
$$ 135888 136337 137675 139732 142317 144775 146478 147721 149365 151731 154564 157947 162442 168338 175336
54873A75336P500P108N600L536J944Q59o80k820m456n058n484o162o131m965m052
$$ 175336 182836 189944 195544 199080 201024 201883 201203 198383 193927 188869 183385 177223 171092 166127 162075
54858A62075m532n305m753l284k436k305j748n41L71M80P5o94j676k081j389o14
$$ 162075 157543 152238 147485 144201 141765 139460 137712 137171 137542 138022 138097 137403 135727 133646 132257 131643
54842A31643j109k339k472j094K43L32k84n76l97r5K22M95N34L81K95K44m1m20
$$ 131643 130534 128195 125723 124629 124872 125204 124920 124344 123947 123852 124074 124569 125103 125484 125779 126023 125982 125562
54824A25562m69j57J45L11M91N93L82j0l11n75q80q12r6N91L52m94p22R3J037
$$ 125562 125093 124936 125081 125392 125883 126476 126858 126848 126537 125962 125082 124270 124174 124765 125117 124623 123901 123994 125031
54805A25031J145M94j63j71O04J652K111J663R22N21K37l24p67n23mo2n55n94
$$ 125031 126176 126670 126507 126336 126940 128592 130703 132366 133288 133809 134046 133722 132955 132432 132428 132366 131811 131217
54787A31217J0O13R90J524K133K129J441Q68Q95J087R87P51O68P71J172K089L280
$$ 131217 131227 131840 132830 134354 136487 138616 140057 140925 141820 142907 143894 144645 145313 146084 147256 149345 152625
54770A52625M148M513M728M967N106N302N903O709P083O843O272N247L278N95
$$ 152625 156773 161286 166014 170981 176087 181389 187292 194001 201084 207927 214199 219446 222724 223319
54756B23319j788l298m288n091n514n553n686o020n966n231m415m076l895l289
$$ 223319 221531 218233 213945 208854 203340 197787 192101 186081 180115 174884 170469 166393 162498 159209
54742A59209k371j763j774k122k271j860j023k94J07O80J761K541J928L33m64
$$ 159209 156838 155075 153301 151179 148908 147048 146025 145731 145838 146518 148279 150820 152748 153081 152617
54727A52617M87K216L324L652L928M555N365O076O421O187N498M689L696K090
$$ 152617 153104 155320 158644 162296 166224 170779 176144 182220 188641 194828 200326 205015 208711 210801
54713B10801q4k047l207l790m301m881n460n972o111n477m286l442l472l908l984
$$ 210801 210717 208670 205463 201673 197372 192491 187031 181059 174948 169471 165185 161743 158271 154363 150379
54698A50379l435k385j069MK17l76r63j000q34r07j034q55m94k21qJ53m5o26r25
$$ 150379 146944 144559 143490 143494 143711 143335 142372 141372 140538 139631 138597 137742 137248 137027 137019 137172 137127 136501 135576
54679A35576l75N91J023N47l84j136j380j138p42n48n07k71J83M32K90J23K18
$$ 135576 135201 135792 136815 137362 136978 135842 134462 133324 132582 132034 131527 131256 131439 131871 132161 132284 132502
54662A32502L71M15N45P58N29l88j331j447p41Q5N44O03L77P6MJ85K29o8l42k59
$$ 132502 132873 133288 133833 134591 135120 134732 133401 131954 131213 131298 131842 132445 132822 132898 132902 133087 133316 133248 132906 132647
54642A32647o5l3J69Q93J632J511N76j82j87M8j83o88o36L28J513J833R46l34
$$ 132647 132582 132549 132718 133611 135243 136754 137330 137148 136961 137009 136826 136138 135502 135830 137343 139176 140122 139788
54624A39788q83m76M1k06j172k059k131j258M4J027J337J287J325J328Q69R7l18
$$ 139788 138905 138429 138470 138264 137092 135033 132902 131644 131688 132715 134052 135339 136664 137992 138861 138958 138640
54607A38640j63P5J67N65J452K096J803R21K39k25j023k153k874k622j556k23
$$ 138640 138477 138552 138719 139284 140736 142832 144635 145556 145795 145570 144547 142394 139520 136898 135342 135119
54591A35119Q78J457J546J421J196O44k93j150j443j265r60n03K35Q58P63M1m96
$$ 135119 135997 137454 139000 140421 141617 142261 141968 140818 139375 138110 137150 136647 136882 137740 138503 138544 138048
54574A38048k53N65J312J481R24l8p26o76j83P3j05k70m0M28Q13J059J237J210
$$ 138048 137795 138360 139672 141153 142077 142039 141313 140637 140454 140527 140422 140152 140112 140540 141353 142412 143649 144859
54556A44859P79P5m46m52p7K44K74Q7k13o46j060r92k27O89J046R63J196J904
$$ 144859 145638 145713 145267 144815 144738 144982 145256 145343 145130 144484 143424 142432 142205 142894 143940 144903 146099 148003
54538A48003K298J827R92N35M00J19k46k22K01N07M09J11o2M6M82J063J281P51
$$ 148003 150301 152128 153120 153655 154055 154174 153928 153706 153907 154414 154823 154934 154872 154918 155400 156463 157744 158495
54520A58495k18r16j022q21o23m39j94K8J03J2k35n82q54q68o41m14m14o34p78
$$ 158495 158277 157361 156339 155518 154895 154456 154262 154290 154393 154405 154170 153588 152734 151866 151225 150811 150397 149763 148985
54501A48985m99J21M45K5n89l96O09J226O94k43m85j53j07m31m80k26l56r38j067
$$ 148985 148486 148607 149052 149077 148488 148092 148701 149927 150621 150378 149893 149740 149633 149202 148722 148496 148140 147202 146135
54482A46135k47Q30J397J656K023K092J271N8l58K45P41K15p54q71K38J647K264
$$ 146135 145888 146718 148115 149771 151794 153886 155157 155215 154857 155102 155843 156058 155304 154433 154671 156318 158582
54465A58582J902J171O50M18K84J96L05O68J080J228R89N15pn14r67j165r44n13
$$ 158582 160484 161655 162305 162723 163007 163203 163508 164176 165256 166484 167473 167988 167981 167467 166500 165335 164391 163878
54447A63878l84p91j367j576j284p20r1M85P17L21n01j062q60j08N51O93L60j57
$$ 163878 163494 162703 161336 159760 158476 157756 157665 158150 158867 159188 158687 157625 156765 156657 157208 157901 158261 158104
54429A58104n97q12o88j23Q40J860K472K525K186J576O62l00p56n54k52l15m40
$$ 158104 157507 156695 156007 155884 156724 158584 161056 163581 165767 167343 168005 167705 166949 166395 166143 165828 165388
54412A65388k65k06p89j507j344k92O30Q77Q13O38P5n74k88J108K329K332J707
$$ 165388 165123 164917 164128 162621 161277 160985 161615 162492 163305 163943 164018 163444 163156 164264 166593 168925 170632
54395A70632J510J578J152M19K36O27P32K24k58j93J93M77N51L82j32p98j138
$$ 170632 172142 173720 174872 175291 175527 176154 176886 177110 176852 176659 176852 177329 177880 178262 178130 177332 176194
54378A76194r37n37m20p14j075r58j21R49J417J086P05R48J410J234M19j12K92
$$ 176194 175257 174720 174300 173586 172511 171553 171432 172381 173798 174884 175589 176537 177947 179181 179600 179488 179780
54361A79780J249J880J728J094O36P02J054J364J810K714L617L519K263R94O62
$$ 179780 181029 182909 184637 185731 186367 187069 188123 189487 191297 194011 197628 201147 203410 204404 205066
54346B05066Q60O62l2p74j505k338k884k738k283k121k088j805j661k163k668
$$ 205066 205926 206588 206556 205782 204277 201939 199055 196317 194034 191913 189825 188020 186359 184196 181528
54331A81528k185j173j070j916k103q75M26M20l36m50J57L75k96j207j574j259
$$ 181528 179343 178170 177100 175184 173081 172206 172632 173052 172716 172266 172423 172798 172502 171295 169721 168462
54315A68462n68J32N27N08J98k47o89q55m99J60N61N25M51N85O24K94j37l12l85
$$ 168462 167894 168026 168553 169061 169259 169012 168323 167468 166969 167129 167690 168215 168666 169251 169875 170169 170032 169720 169335
54296A69335p18j280j629j412o71J87O68O75O57J007J408J271P17M60O85Q25N86
$$ 169335 168617 167337 165708 164296 163625 163812 164480 165155 165812 166819 168227 169498 170215 170675 171360 172185 172771
54279A72771L92N44P15O96P47P48n3j700k793k130m44N45M10J50L41M69J87J0
$$ 172771 173163 173707 174422 175118 175865 176613 176560 174860 172067 169937 169493 170038 170448 170598 170939 171408 171595 171605
54261A71605L13N87L37j7K20R60J463J312P11M5m14m37O1Q00J253J105N22j54
$$ 171605 171918 172505 172842 172825 173045 174005 175468 176780 177491 177536 177122 176685 176746 177546 178799 179904 180426 180272
54243A80272p32j229j580j564j067m27j94m84p37m03L41Q17Q06P65J027J177O52
$$ 180272 179540 178311 176731 175167 174100 173673 173479 172995 172258 171855 172196 173013 173819 174584 175611 176788 177440
54226A77440l56j002q46l00L3R9J69K26K9l21l64N2M94N38L21K56M27N17K18m98
$$ 177440 177084 176082 175236 174936 174969 175068 175237 175463 175492 175171 174807 174859 175353 175891 176212 176468 176895 177412 177630 177132
54206A77132j395j994j784p07O29J433J413Q07l0q01j196j011l77L11O84M89k82
$$ 177132 175737 173743 171959 171252 171881 173314 174727 175534 175504 174703 173507 172496 172119 172430 173114 173603 173321
54189A73321j134j254l79P46J201R55N64J45n52j230j195n17j48m97p82l28L23
$$ 173321 172187 170933 170554 171300 172501 173456 174020 174165 173613 172383 171188 170671 170523 170026 169244 168916 169239
54172A69239L25p9k3N09O73J77k03K23J026J167L04q13j160n45J80L2r72j790
$$ 169239 169564 169485 169462 169971 170644 170821 170618 170841 171867 173034 173338 172525 171365 170820 171000 171032 170060 168270
54154A68270j547n17K85K98j49m41m22l86n02m46K65J486K239J642R2j053j024
$$ 168270 166723 166206 166491 166789 166640 166199 165777 165391 164889 164443 164708 166194 168433 170075 170167 169114 168090
54137A68090m12j12j37L9M19N65M65N35P46N50j37o19l98R2K01L6J59O60J029
$$ 168090 167678 167566 167429 167468 167887 168452 168917 169452 170198 170748 170611 169992 169594 169686 169887 169923 170082 170742 171771
54118A71771R36O16M48O04J162K146L239L712L056J617L75K2L73O71L26n98j476
$$ 171771 172707 173323 173771 174375 175537 177683 180922 184634 187690 189307 189682 189704 190077 190748 191074 190476 189000
54101A89000j642j039l05j01k97j44O35J253P91n34j584j701j326r85m09Q04K109
$$ 189000 187358 186319 186014 185913 185616 185472 186107 187360 188151 187617 186033 184332 183006 182021 181612 182416 184525
54084A84525K448J714J051J397K375K985L010L085L645M450N209O061P142Q094
$$ 184525 186973 188687 189738 191135 193510 196495 199505 202590 206235 210685 215894 221955 229097 237191
54070B37191Q342P668O169L904R86k066m536o136p112p698p724o935n476l891
$$ 237191 245533 253201 259370 263274 264260 262194 257658 251522 244410 236712 228988 222053 216577 212686
54056B12686k760k314k236j852q30L26P42K53l73l51L16J108J651J884J902J970
$$ 212686 209926 207612 205376 203524 202694 203020 203762 204015 203642 203291 203607 204715 206366 208250 210152 212122
54040B12122K458L381M211M444M169L873L903M363N235O215O716O459N846N379
$$ 212122 214580 217961 222172 226616 230785 234658 238561 242924 248159 254374 261090 267549 273395 278774
54026B78774M960M241L398K932K879K791K495K261K110J633P12j9J90J309K524
$$ 278774 283734 287975 291373 294305 297184 299975 302470 304731 306841 308474 309186 309167 309357 310666 313190
54011C13190K982K518J695J113P09n0j248k211k506k646l334m324m883n060n540
$$ 313190 316172 318690 320385 321498 322207 322157 320909 318698 316192 313546 310212 305888 301005 295945 290405
53996B90405o289o452n808n267n443n668n131m283m101m417m056k604j088n97
$$ 290405 284116 277664 271856 266589 261146 255478 250347 246064 241963 237546 233490 230886 229798 229201
53982B29201r64j313j353j477j737j558o89J85L27J9P6M72L34o52j667j982j848
$$ 229201 228237 226924 225571 224094 222357 220799 220110 220295 220622 220641 220717 221189 221523 220871 219204 217222 215374
53965B15374j697j246k01Q85J319J395J774K209J935J076N34N74O33N33P52J327
$$ 215374 213677 212431 212230 213115 214434 215829 217603 219812 221747 222823 223357 223931 224564 225097 225849 227176
53949B27176J642J534J576J989K319K515L232M552N490N400M975N123N675N888
$$ 227176 228818 230352 231928 233917 236236 238751 241983 246535 252025 257425 262400 267523 273198 279086
53935B79086N627N270N079N289O214P711R048R906J0907J2587J4536J6116J7294
$$ 279086 284713 289983 295062 300351 306565 314276 323324 333230 344137 356724 371260 387376 404670
53922D04670J7961J7147J3892Q529K385l342p714r767r237p277n494m329l168
$$ 404670 422631 439778 453670 462199 464584 461242 453528 443761 434524 427247 421753 417424 414256
53909D14256j753n19L58J254K230K630J829Oj963l116l082k402k058k378k767
$$ 414256 412503 411984 412342 413596 415826 418456 420285 420291 418328 415212 412130 409728 407670 405292 402525
53894D02525k758k762l338m204m767n104n675o307o400n999n862o470p529q431
$$ 402525 399767 397005 393667 389463 384696 379592 373917 367610 361210 355211 349349 342879 335350 326919
53880C26919q664p979o672n540n005m573l679k692k368k689l003l079l183l314
$$ 326919 318255 310276 303604 298064 293059 288486 284807 282115 279747 277058 274055 270976 267793 264479
53866B64479l229l057l101l078k476j597j390k129l017l203k564j488n13j64n30
$$ 264479 261250 258193 255092 252014 249538 247941 246551 244422 241405 238202 235638 234150 233637 233473 232943
53851B32943j062j316j578k082k127r82N85R70q5j206j361q94l82K53R81J179
$$ 232943 231881 230565 228987 226905 224778 223796 224381 225351 225266 224060 222699 221805 221423 221676 222657 223836
53835B23836O04l2r0J45J53j2j26k80m41k10M40Q99Q82R59J489J834J298L02k57
$$ 223836 224440 224408 224318 224463 224616 224604 224478 224198 223757 223547 223987 224886 225768 226727 228216 230050 231348 231650 231393
53816B31393k86l42n68n21M3R11J804K539K905K858K688K754L169L931M957N762
$$ 231393 231107 230765 230197 229676 229719 230630 232434 234973 237878 240736 243424 246178 249347 253278 258235 263997
53800B63997N593M434L372L470M488N276N107M210L196K562K531K941L236L000
$$ 263997 269590 274024 277396 280866 285354 290630 295737 299947 303143 305705 308236 311177 314413 317413
53786C17413K382J780J332R99Q68R18P00k70j859l395m393m888n166n368n372
$$ 317413 319795 321575 322907 323906 324774 325692 326392 326122 324263 320868 316475 311587 306421 301053 295681
53771B95681m947m113l376l322l892m429m492m249l923l372k546j893j862k325
$$ 295681 290734 286621 283245 279923 276031 271602 267110 262861 258938 255566 253020 251127 249265 246940
53757B46940k831l130l085k499j488o72m90o34o07m95o64r98j102j011j036j066
$$ 246940 244109 240979 237894 235395 233907 233235 232745 232111 231504 231009 230345 229347 228245 227234 226198 225132
53741B25132o70O6M86K36l10o17m74J19J029J820J960J472R71Q46Q05M62qj37
$$ 225132 224462 224528 225014 225250 224940 224323 223849 223968 224997 226817 228777 230249 231220 232066 232871 233333 233325 233188
53723B33188J56N40Q69J328J957K340K045J270P53R60J562J899J802J659J746
$$ 233188 233344 233884 234753 236081 238038 240378 242423 243693 244446 245406 246968 248867 250669 252328 254074
53708B54074J876J854J947K568L567M181L773K517J329J062J793K841L540L796
$$ 254074 255950 257804 259751 262319 265886 270067 273840 276357 277686 278748 280541 283382 286922 290718
53694B90718L873L892L861M020M604N268N183L954K068L50p89j405j713j880j935
$$ 290718 294591 298483 302344 306364 310968 316236 321419 325373 327441 327791 327002 325597 323884 322004 320069
53679C20069j662r55k07l4m99j038j277j338j253o12O90J898K109J300K41m01
$$ 320069 318407 317452 317245 317211 316712 315674 314397 313059 311806 311194 311884 313782 315891 317191 317432 317031
53663C17031n24l82l40o21j054j258j197j191j240q76m2N17K15n20r52j064j258
$$ 317031 316507 316125 315785 315164 314110 312852 311655 310464 309224 308348 308306 308823 309038 308518 307566 306502 305244
53646C05244j426j200p57n91o34m31n5k7l35l26L75J462K506L213L230K486J717
$$ 305244 303818 302618 301861 301270 300636 300205 300150 300123 299788 299462 299837 301299 303805 307018 310248 312734 314451
53629C14451J825K572K859K387K066K481L020L069K951K975K562J386N46J283
$$ 314451 316276 318848 321707 324094 326160 328641 331661 334730 337681 340656 343218 344604 345150 346433
53615C46433L043M105L966L742M160M587M462M435N210O230O514O235O355P036
$$ 346433 349476 353581 357547 361289 365449 370036 374498 378933 384143 390373 396887 403122 409477 416513
53601D16513P411O978O254N824N495M834L936L150K351J092p01k525l777m154
$$ 416513 423924 430902 437156 442980 448475 453309 457245 460395 462746 463838 463137 460612 456835 452681
53587D52681l714k829k053j738j779j872j931k024k090k029j970k103k270k112
$$ 452681 448967 446138 444085 442347 440568 438696 436765 434741 432651 430622 428652 426549 424279 422167
53573D22167j631j265j300j531j607j383r07l82j95o00j246j408r03l29j93k39
$$ 422167 420536 419271 417971 416440 414833 413450 412543 412161 411966 411366 410120 408712 407809 407480 407287 407048
53557D07048qL33K85j26l50p8M45R47J436J887K015J598Q49K35Q4M16J068J773
$$ 407048 407040 407373 407658 407532 407182 407104 407549 408496 409932 411819 413834 415432 416281 416516 416600 417016 418084 419857
53539D19857K258K448K655L296M355N193N235M765M766N736P089P925Q107Q159
$$ 419857 422115 424563 427218 430514 434869 440062 445297 450062 454828 460564 467653 475578 483685 491844
53525D91844Q399Q727R161R947J1010J1905J2479J3099J4029J5029J5800J6368
$$ 491844 500243 508970 518131 528078 539088 550993 563472 576571 590600 605629 621429 637797
53513F37797J6878J7427J8334J9988K2093K3683K4343K4859K6083K7583K8163
$$ 637797 654675 672102 690436 710424 732517 756200 780543 805402 831485 859068 887231
53502H87231K7474K6326K5489K4871K4049K3049K2290K1977K1821K1355K0482
$$ 887231 914705 941031 966520 991391 1015440 1038489 1060779 1082756 1104577 1125932 1146414
53491A146414J9687J9469J9703J9829J9705J9734K0029K0119J9786J9610K0073
$$ 1146414 1166101 1185570 1205273 1225102 1244807 1264541 1284570 1304689 1324475 1344085 1364158
53480A364158K0656K0446J9382J8223J7544J7341J7372J7252J6328J4115J0884
$$ 1364158 1384814 1405260 1424642 1442865 1460409 1477750 1495122 1512374 1528702 1542817 1553701
53469A553701P455M439K028J52j639m079p339j0552j2769j4120j5254j6088j6029
$$ 1553701 1561156 1565595 1567623 1567775 1566136 1562057 1554718 1544166 1531397 1517277 1502023 1485935 1469906
53456A469906j5296j4907j5322j6102j7014j8432k0354k1959k2679k2871k2977
$$ 1469906 1454610 1439703 1424381 1408279 1391265 1372833 1352479 1330520 1307841 1284970 1261993
53445A261993k2763k1931k0851k0089j9644j9193j8656j8023j6951j5058j2416
$$ 1261993 1239230 1217299 1196448 1176359 1156715 1137522 1118866 1100843 1083892 1068834 1056418
53434A056418r495o833m883l735k846j530N2J047J282J715L078M803N988O777
$$ 1056418 1046923 1040090 1035207 1031472 1028626 1027096 1027148 1028195 1029477 1031192 1034270 1039073 1045061 1051838
53420A051838P973R742J1617J3498J5675J7943J9642K0598K1335K2204K3034K3870
$$ 1051838 1059811 1069553 1081170 1094668 1110343 1128286 1147928 1168526 1189861 1212065 1235099 1258969
53408A258969K5275K7544L0085L2092L3373L4215L4789L5267L6237L8411M1763
$$ 1258969 1284244 1311788 1341873 1373965 1407338 1441553 1476342 1511609 1547846 1586257 1628020
53397A628020M5391M8409N0746N2891N5019N6728N7657N8017N8361N8966N9670
$$ 1628020 1673411 1721820 1772566 1825457 1880476 1937204 1994861 2052878 2111239 2170205 2229875
53386B229875O0170O0221N9562N8030N5913N3863N2235N0624M8356M5326M2045
$$ 2229875 2290045 2350266 2409828 2467858 2523771 2577634 2629869 2680493 2728849 2774175 2816220
53375B816220L8845L5369L1164K6539K2410J9081J5610J0771M473k226q529j4682
$$ 2816220 2855065 2890434 2921598 2948137 2970547 2989628 3005238 3016009 3020482 3018256 3009727 2995045
53363B995045k1247k8171l5043m1695m7913n2876n5703n6600n6831n7458n8532
$$ 2995045 2973798 2945627 2910584 2868889 2820976 2768100 2712397 2655797 2598966 2541508 2482976
53352B482976n9449n9574n8463n6065n2884m9624m6659m4185m2702m2626m3500
$$ 2482976 2423527 2363953 2305490 2249425 2196541 2146917 2100258 2056073 2013371 1970745 1927245
53341A927245m4290m4563m4571m4177m2697m0140l7628l5910l4324l1952k9068
$$ 1927245 1882955 1838392 1793821 1749644 1706947 1666807 1629179 1593269 1558945 1526993 1497925
53330A497925k6568k4515k2249j9551j6889j4734j3381j3154j3981j4958j5197
$$ 1497925 1471357 1446842 1424593 1405042 1388153 1373419 1360038 1346884 1332903 1317945 1302748
53319A302748j4921j4888j4924j4115j2380j0789j0060r708r025p983o672m768
$$ 1302748 1287827 1272939 1258015 1243900 1231520 1220731 1210671 1200963 1191938 1183955 1177283 1172515
53307A172515k231J37J584K428L526N053O424P286P964R030J0870J3543J6620
$$ 1172515 1170284 1170421 1172005 1174433 1177959 1183012 1189436 1196722 1204686 1213716 1224586 1238129 1254749
53294A254749J9282K1037K2272K3689K5369K6812K7820K8717K9654L0241L0106
$$ 1254749 1274031 1295068 1317340 1341029 1366398 1393210 1421030 1449747 1479401 1509642 1539748
53283A539748K9378K8308K6795K4583K1803J8995J6648J4801J3023J0659P353
$$ 1539748 1569126 1597434 1624229 1648812 1670615 1689610 1706258 1721059 1734082 1744741 1752094
53272A752094L480j58l199o082r275j2450j4881j6540j8207k0458k2981k5120
$$ 1752094 1755574 1755416 1752217 1746135 1736860 1724410 1709529 1692989 1674782 1654324 1631343 1606223
53260A606223k6681k7899k8897k9618l0097l0498l0889l1209l1410l1412l1072
$$ 1606223 1579542 1551643 1522746 1493128 1463031 1432533 1401644 1370435 1339025 1307613 1276541
53249A276541l0363k9521k8790k8113k7353k6629k6194k6006k5786k5492k5365
$$ 1276541 1246178 1216657 1187867 1159754 1132401 1105772 1079578 1053572 1027786 1002294 976929
53238I76929k5492k5585k5331k4670k3694k2508k1209j9803j8142j6194j4269
$$ 976929 951437 925852 900521 875851 852157 829649 808440 788637 770495 754301 740032
53227G40032j2703j1363r958q750q380q860r415r519r570j0140j1193j2367j3494
$$ 740032 727329 715966 706008 697258 688878 680018 670603 661084 651514 641374 630181 617814 604320
53214F04320j4324j4392j3803j3566j4310j5107j4558j2771j1115j0199r291p959
$$ 604320 589996 575604 561801 548235 533925 518818 504260 491489 480374 470175 460884 452925
53202D52925p013p164p843q070p787p438p001o328n922o273o767o363n244m630
$$ 452925 445912 438748 430905 422835 415048 407610 400609 394281 388359 382086 375319 368956 363712 359082
53188C59082m875m981m323l723m065m732m461l192k096j918k285k573k692k725
$$ 359082 354207 349226 344903 341180 337115 332383 327922 324730 322634 320716 318431 315858 313166 310441
53174C10441k546k084j618j415j408j417j395j302j051p88q98j439j812j399m21
$$ 310441 307895 305811 304193 302778 301370 299953 298558 297256 296205 295417 294519 293080 291268 289869 289448
53159B89448K03j33j107j844j789j104m12j65k96m29l47j85j91n00j080j729k087
$$ 289448 289651 289518 288411 286567 284778 283674 283262 283097 282801 282372 282025 281840 281649 281149 280069 278340 276253
53142B76253j845j061j57M11M40%n69p74l53M10J021J367J641J869J907J883K019
$$ 276253 274408 273347 273190 273601 274041 274041 273472 272698 272345 272755 273776 275143 276784 278653 280560 282443 284462
53125B84462K007J334L05k3O74J397J221N33J83K22K63M75J103J560J094J41j82
$$ 284462 286469 287803 288108 288085 288759 290156 291377 291910 292093 292315 292578 293053 294156 295716 296810 296951 296769
53108B96769K17L51k12p98r65j223k058l123l846m009l462k111n73R5k06l59K96
$$ 296769 296986 297337 297125 296327 295362 294139 292081 288958 285112 281103 277641 275530 274957 275052 274846 274487 274783
53091B74783R45N87m22j058j101j038r49n20J23M45K97o3n95j389k037j829o84
$$ 274783 275728 276315 275893 274835 273734 272696 271747 271227 271350 271795 272092 272029 271434 270045 268008 266179 265495
53074B65495O16J242J021L81p4J2L98M24k17j041j449j473j440j254o26J40K88
$$ 265495 266111 267353 268374 268755 268681 268693 269091 269515 269298 268257 266808 265335 263895 262641 262015 262155 262443
53057B62443l94j228j385o26O76J810K081J339K47k67R2Q66J507J839J871J559
$$ 262443 262049 260821 259436 258810 259486 261296 263377 264716 264963 264696 264788 265654 267161 269000 270871 272430
53041B72430Q70p3r79j455j256o39k03j94k64r3J13R4R5L89N79L7j121k104k388
$$ 272430 273300 273227 272248 270793 269537 268898 268695 268501 268237 268144 268257 268351 268446 268835 269414 269451 268330 266226 263838
53022B63838k051j310l16N90J070J334J869K603K857K228J086L6n73n58J14J022
$$ 263838 261787 260477 260161 260751 261821 263155 265024 267627 270484 272712 273798 273834 273261 272703 272817 273839
53006B73839J433J035K39l78o12n33k63LJ35L24Q15J280J015k0q73o86K69J029
$$ 273839 275272 276307 276546 276168 275556 275023 274760 274763 274898 275222 276037 277317 278332 278312 277439 276753 277022 278051
52988B78051J112Q13N74N06N40O61R56J467K075K438K185J370N77M68J176K177
$$ 278051 279163 279976 280550 281056 281596 282257 283213 284680 286755 289193 291378 292748 293325 293793 294969 297146
52972B97146K795K802K509K233J816J000J57J19R55J528Q28o08j300p00L24P86
$$ 297146 299941 302743 305252 307485 309301 310301 310458 310577 311532 313060 313888 313280 311980 311280 311604 312390
52956C12390N68jp55j506j892j886j962k439k989l170l054k958k871k550j925
$$ 312390 312958 312957 312202 310696 308804 306918 304956 302517 299528 296358 293304 290346 287475 284925 283000
52941B83000j112k42M55O55L48p7l31n43q21r12p05o20r60j234p49K61Q21M93
$$ 283000 281888 281646 282101 282756 283104 283027 282696 282153 281332 280420 279715 279095 278135 276901 276152 276413 277234 277727
52923B77727r7k04J34L83L13J29K0j30m42p47o65p6O31R40Q25P83J113J451J230
$$ 277727 277630 277426 277560 277943 278256 278385 278405 278275 277833 277086 276421 276345 276976 277916 278741 279524 280637 282088 283318
52904B83318M27m49r85j166j114q45m38j53k06m68n25p0P32J292J153N39J64L68
$$ 283318 283745 283296 282311 281145 280031 279186 278748 278595 278389 277921 277396 277326 278058 279350 280503 281042 281206 281574
52886B81574O87M82j53n57m65l45o31j053j028m86J10M78P72J085J103N81p6n6
$$ 281574 282261 282743 282590 282033 281568 281223 280592 279539 278511 278025 278135 278613 279385 280470 281573 282154 282078 282022
52868B82022R77K459L402L199K079R56P12J361J939J568N36o3J66M06j31j090
$$ 282022 282999 285458 288860 292059 294138 295094 295806 297167 299106 300674 301210 301147 301313 301719 301588 300498
52852C00498j650j841k354l249l658l027j953j474j914k739l254l187k790k540
$$ 300498 298848 297007 294653 291404 287746 284719 282766 281292 279378 276639 273385 270198 267408 264868
52838B64868k586k509j866r19l52k61j4O52J046N38l86p03k14L42L81J3m54r34
$$ 264868 262282 259773 257907 256988 256636 256375 256361 257013 258059 258597 258211 257508 257294 257636 258017 258030 257576 256642
52820B56642j304j260p52j54K04M50P97J082J033Q04Q42J256J719K025K348K715
$$ 256642 255338 254078 253326 253172 253376 253826 254623 255705 256738 257542 258384 259640 261359 263384 265732 268447
52804B68447K633J605p3j488k084k143k214k378k346k046j735j632j636j464r53
$$ 268447 271080 272685 272612 271124 269040 266897 264683 262305 259959 257913 256178 254546 252910 251446 250493
52789B50493j95M69O73L30k72o85o42j20O66J325J555J549J867K678L342L070
$$ 250493 250298 250767 251440 251770 251498 250813 250171 250051 250717 252042 253597 255146 257013 259691 263033 266103
52773B66103J861M94l18m82l39k96o29j318j955k064j548p34n5J66j58p26r77
$$ 266103 267964 268458 268140 267658 267319 267023 266394 265076 263121 261057 259509 258775 258720 258886 258728 258002 257025
52756B57025o79k51j53k37o0L28N03M57N70Q86J021R28J078J700K372K648K593
$$ 257025 256346 256095 255942 255705 255645 255973 256476 256933 257503 258389 259410 260338 261416 263116 265488 268136 270729
52739B70729K387K015J537J251J207R94L73k49l62M6O98J441K021J903Q72l83
$$ 270729 273116 275131 276668 277919 279126 280120 280493 280244 279882 279928 280626 282067 284088 285991 286863 286480
52723B86480q77m49R9j4q14j712k110j824j124m49l2J53Q7l66j130j755j789j170
$$ 286480 285603 285154 285253 285239 284425 282713 280603 278779 277655 277206 277174 277327 277414 277048 275918 274163 272374 271204
52705B71204k30N59Q41P07P20J204J611J112j17r82r47o41o08l79O11J850K333
$$ 271204 270974 271533 272374 273081 273801 275005 276616 277728 277611 276629 275682 275041 274433 274054 274665 276515 278848
52688B78848J889J156O39N16Q77J417J224j40j671j992j241p47j033j256q47l87
$$ 278848 280737 281893 282532 283048 283925 285342 286566 286426 284755 282763 281522 280775 279742 278486 277639 277252
52672B77252m39n76k83Q4K5j19K36Q46J048Q79R21J188J107N91L02O05J005R76
$$ 277252 276813 276237 275954 276038 276063 275944 276180 277026 278074 278953 279874 281062 282169 282760 283062 283667 284672 285648
52654B85648P88J045J769K455K792K834K566J812O19o09j487j910j873j400q25
$$ 285648 286436 287481 289250 291705 294497 297331 299897 301709 302328 301719 300232 298322 296449 295049 294224
52639B94224p78j501k383k538j770o06M46J278J856K114K215K490K850K733J881
$$ 294224 293446 291945 289562 287024 285254 284648 285094 286372 288228 290342 292557 295047 297897 300630 302511
52624C02511P70l4n60j119j650j938k136k514k767k272j074o7J27l2L06J144J613
$$ 302511 303281 303247 302687 301568 299918 297980 295844 293330 290563 288291 287217 287150 287277 287245 287551 288695 290308
52607B90308J154L02j8K97M93J13k87PP87J197J010Q49J036J010K49p36r62k31
$$ 290308 291462 291764 291746 292043 292536 292649 292362 292369 293156 294353 295363 296212 297248 298258 298507 297771 296809 296578
52589B96578P26J134Q12J01l64L0J239K333K356J411N05L22O34Q69Q15N81K51
$$ 296578 297304 298438 299250 299351 298987 299017 300256 302589 304945 306356 306861 307183 307817 308686 309501 310082 310333
52572C10333j69p19j425k153k496k094j121j77K96L18R8k00l79k71p1k57r28j497
$$ 310333 310164 309445 308020 305867 303371 301277 300156 299979 300275 300593 300691 300491 300112 299841 299770 299513 298585 297088
52554B97088j319n36R8J90J06K54L70r3r76j405r36j62J23o0k32m41j075j836
$$ 297088 295769 295233 295331 295521 295627 295881 296251 296158 295182 293777 292841 292679 292802 292742 292510 292069 290994 289158
52536B89158j864r98j20J23J43M62Q19P63N68P10R78R14P48J032J571J626J111
$$ 289158 287294 286296 286176 286299 286442 286904 287723 288486 289054 289764 290742 291656 292404 293436 295007 296633 297744
52519B97744P29Q76J159J114Q04N54N80R89J664K179K234K158K440K846K662J789
$$ 297744 298473 299349 300508 301622 302426 302980 303560 304549 306213 308392 310626 312784 315224 318070 320732 322521
52503C22521R80P83Q47M56o74k255l645m196l817l159k800k465j629o95n74j192
$$ 322521 323501 324284 325131 325587 324913 322658 319013 314817 311000 307841 305041 302576 300947 300252 299678 298486
52487B98486j410o87K23N87P00R98J086M80l48n57r3M40P25Q42P95N82N08P80
$$ 298486 297076 296389 296612 297199 297899 298897 299983 300463 300115 299558 299465 299905 300630 301472 302267 302849 303357 304137
52469C04137J032R16Q61J473K417K701K158J797K410L477L878L199J973Q65N7
$$ 304137 305169 306085 306946 308419 310836 313537 315695 317492 319902 323379 327257 330456 332429 333294 333351
52454C33351o56j442k236k876l375l869m259m163l418k502k064k118k079j638
$$ 333351 332695 331253 329017 326141 322766 318897 314638 310475 307057 304555 302491 300373 298294 296656
52440B96656j166j110j293j168n83O9M18M94M72L41R9L4L79Q25P33K2n87m69J67
$$ 296656 295490 294380 293087 291919 291336 291405 291823 292317 292789 293130 293229 293263 293642 294467 295200 295222 294635 294166 294333
52421B94333P21J087J578K153K332J895J188O22K90K04M51R35J408J978L182N205
$$ 294333 295054 296141 297719 299872 302204 304099 305287 305909 306199 306403 306854 307789 309197 311175 314357 319562
52405C19562P350Q698R164R493J0215J0928J0725R103O354L104l09l821p061r181
$$ 319562 326912 335610 344774 354267 364482 375410 386135 395238 401592 404696 404387 400566 393505 384324
52391C84324r585q714p700p161o666n489l635j900j005p90m34N40J554J666R32
$$ 384324 374739 366025 358325 351164 344498 339009 335374 333474 332469 331679 331245 331785 333339 335005 335937
52376C35937N11J160K224K761L064M056N478N943N000L986M210N163N256L809
$$ 335937 336448 337608 339832 342593 345657 349713 355191 361134 366134 370120 374330 379493 384749 388558
52362C88558J496p03k223k774k315j322n46l38l45q0M49P47M71j04l13J08P48
$$ 388558 390054 389351 387128 384354 382039 380717 380171 379833 379488 379408 379857 380604 381075 380971 380658 380766 381514
52345C81514J144J392J772K084J967J685J889K596L166L350L627M257M872N363
$$ 381514 382658 384050 385822 387906 389873 391558 393447 396043 399209 402559 406186 410443 415315 420678
52331D20678O306P938R420R953J0016J0755J2418J4185J5356J5897J5977J5685
$$ 420678 426984 434922 444342 454295 464311 475066 487484 501669 517025 532922 548899 564584
52319E64584J5307J5365J6056J6937J7278J6707J5606J5033J5864J7864J9758
$$ 564584 579891 595256 611312 628249 645527 662234 677840 692873 708737 726601 746359
52308G46359K0478K0097J9434J9106J9223J9596J9948K0108K0245K0559K0665
$$ 746359 766837 786934 806368 825474 844697 864293 884241 904349 924594 945153 965818
52297I65818J9850J8154J6513J5346J3815J1066P620M685K531M71j850m021n603
$$ 965818 985668 1003822 1020335 1035681 1049496 1060562 1068182 1072867 1075398 1075869 1074019 1069998 1064395
52284A064395o536o840o623o359o526o930o959o406n594m770l886k893j708j07
$$ 1064395 1057859 1051019 1044396 1038037 1031511 1024581 1017622 1011216 1005622 1000852 996966 994073 992365 992258
52270I92258J785L279M009M756O471Q662R873R745R572J0442J1886J2848J3205
$$ 992258 994043 997322 1001331 1006087 1012558 1021220 1031093 1040838 1050410 1060852 1072738 1085586 1098791
52257A098791J3630J4484J5522J6392J6998J7453J7936J8431J8528J7748J6096
$$ 1098791 1112421 1126905 1142427 1158819 1175817 1193270 1211206 1229637 1248165 1265913 1282009
52246A282009J3950J1424Q359N050K355P57j85j217k650m440o444q199q964q554
$$ 1282009 1295959 1307383 1315742 1320792 1323147 1323904 1323719 1322502 1319852 1315412 1308968 1300769 1291805 1283251
52232A283251p831p860q703r447r355q632q058q160q737r055q521p258n944n047
$$ 1283251 1275420 1267560 1258857 1249410 1240055 1231423 1223365 1215205 1206468 1197413 1188892 1181634 1175690 1170643
52218A170643m387l533k449j486r06o06k90K91J249K564M062N412O297O686O919
$$ 1170643 1166256 1162723 1160274 1158788 1157882 1157276 1156986 1157277 1158526 1161090 1165152 1170564 1176861 1183547 1190466
52203A190466P326P800P899P405O565N799N406N642O561P646Q158Q133Q530R784
$$ 1190466 1197792 1205592 1213491 1220896 1227461 1233260 1238666 1244308 1250869 1258515 1266673 1274806 1283336 1293120
52189A293120J0773J0074P856N621M190K916J029j189l053m538o094p794r254
$$ 1293120 1303893 1313967 1321823 1327444 1331634 1334550 1335579 1334390 1331337 1326799 1320705 1312911 1303657
52176A303657j0203j0717j0924j0769j0169r292q573q261p987p086n506m008l123
$$ 1303657 1293454 1282737 1271813 1261044 1250875 1241583 1233010 1224749 1216762 1209676 1204170 1200162 1197039
52163A197039k432j324l1Q23J342K124L089L478L019K192J326L02o48r08n35l61
$$ 1197039 1194607 1193283 1193252 1194075 1195417 1197541 1200630 1204108 1207127 1209319 1210645 1210947 1210299 1209391 1208856 1208495
52147A208495p07q55l15L59N79O81J118J408Q54k50j080j528k090k717k735j864
$$ 1208495 1207788 1206933 1206618 1206977 1207556 1208237 1209355 1210763 1211617 1211367 1210287 1208759 1206669 1203952 1201217 1199353
52131A199353n46P68K049L370M781O573R150J2438J5822J8722K0984K2706K4011
$$ 1199353 1198807 1199575 1201624 1204994 1209775 1216348 1225498 1237936 1253758 1272480 1293464 1316170 1340181
52118A340181K5114K6225K7230K7631K6986K5447K3749K2579K1901K1085J9855
$$ 1340181 1365295 1391520 1418750 1446381 1473367 1498814 1522563 1545142 1567043 1588128 1607983
52107A607983J8827J8691J9070J8913J7892J6755J6063J5461J4540J3587J2897
$$ 1607983 1626810 1645501 1664571 1683484 1701376 1718131 1734194 1749655 1764195 1777782 1790679
52096A790679J2022J0417Q280N998L217o82n461j0134j4032j7049j9079j9951
$$ 1790679 1802701 1813118 1821398 1827396 1830613 1829931 1824470 1814336 1800304 1783255 1764176 1744225
52084A744225j9916j9474j8717j7448j5844j4356j2978j1298r254p277n594m058
$$ 1744225 1724309 1704835 1686118 1668670 1652826 1638470 1625492 1614194 1604940 1597663 1592069 1588011
52072A588011k642j496m21J091L160N447P778J0143J2027J2635J2141J1844J2652
$$ 1588011 1585369 1583873 1583452 1584543 1587703 1593150 1600928 1611071 1623098 1635733 1647874 1659718 1672370
52059A672370J4071J5151J5757J6214J6377J5865J4860J3840J2706J0933Q464
$$ 1672370 1686441 1701592 1717349 1733563 1749940 1765805 1780665 1794505 1807211 1818144 1826608
52048A826608N776L094K60k620n200p653j0664j4233j7176j8357j8016j7345j7043
$$ 1826608 1832384 1835478 1835738 1833118 1827918 1820265 1809601 1795368 1778192 1759835 1741819 1724474 1707431
52035A707431j6896j6572j6142j5771j5440j5182j5125j5161j4980j4609j4558
$$ 1707431 1690535 1673963 1657821 1642050 1626610 1611428 1596303 1581142 1566162 1551553 1536995
52024A536995j5106j5828j6162j6153j6165j6130j5652j4762j3972j3470j2859
$$ 1536995 1521889 1506061 1489899 1473746 1457581 1441451 1425799 1411037 1397065 1383595 1370736
52013A370736j1836j0655r699q976q421q294q827r723j0459j1103j2369j4787
$$ 1370736 1358900 1348245 1338546 1329570 1321149 1312855 1304028 1294305 1283846 1272743 1260374 1245587
52001A245587j8015k1082k3121k3830k3453k2456k1237j9998j8779j7572j6443
$$ 1245587 1227572 1206490 1183369 1159539 1136086 1113630 1092393 1072395 1053616 1036044 1019601
51990A019601j5554j5084j5055j5312j5737j6372j7236j8104j8659j8788j8590
$$ 1019601 1004047 988963 973908 958596 942859 926487 909251 891147 872488 853700 835110
51979H35110j8210j7833j7686j7806j7849j7470j6696j5709j4396j2515j0171
$$ 835110 816900 799067 781381 763575 745726 728256 711560 695851 681455 668940 658769
51968F58769p647m882j723J418L824N433O877Q334R053Q384O654M647K735Q73
$$ 658769 651122 646240 644517 645935 649759 655192 662069 670403 679456 687840 694494 699141 701876 702749
51954G02749j025l131n587p972r420r592q995p959o074l157k9K485M648P087R495
$$ 702749 701724 698593 693006 685034 675614 666022 657027 649068 642994 639837 639808 642293 646941 654028 663523
51939F63523J1131J2184J3480J4992J5673J4966J3414J1715R959P970N656K826
$$ 663523 674654 686838 700318 715310 730983 745949 759363 771078 781037 789007 794663 797489
51927G97489o47m334p569j0305j2963j5447j7061j7530j7224j6272j4353j1639
$$ 797489 796842 792508 784939 774634 761671 746224 729163 711633 694409 678137 663784 652145
51915F52145q981o738m206p67L154O793R925J2394J3557J2926J0902Q137M728
$$ 652145 643164 636426 632220 631453 634607 641400 651325 663719 677276 690202 701104 709241 713969
51902G13969P97k712m831n875o994q607j0151j1444j3147j5642j8207j9785k0029
$$ 713969 714766 712054 707223 701348 694354 685747 675596 664152 651005 635363 617156 597371 577342
51889E77342j9211j7630j5562j3484j1734j0052p798m749j489J073K567L504M787
$$ 577342 558131 540501 524939 511455 499721 489669 481871 477122 475633 476706 479273 482777 487564
51876D87564O802R056J0766J1665J2016J2009J1457J0121Q092N598K689o01l805
$$ 487564 494366 503422 514188 525853 537869 549878 561335 571456 579548 585146 587835 587234 583429
51863E83429o085o962o877o690o569n750l671j057P17J245J408J902K186J406
$$ 583429 577344 570382 563505 556815 550246 544496 540825 539768 540485 541730 543138 545040 547226 548632
51849E48632k32j766k872m025n338o217o385o481p050p646p566o970o487o004
$$ 548632 548400 546634 543762 539737 534399 528182 521797 515316 508266 500620 493054 486084 479597 473593
51835D73593m778k736q02L36J027J828K536K647K286J983J780J245L79l11o48
$$ 473593 468815 466079 465277 465613 466640 468468 471004 473651 475937 477920 479700 480945 481324 481013 480365
51820D80365j048j714k205k182k001k042j852o69J341L001L360K579J417K93q93
$$ 480365 479317 477603 475398 473216 471215 469173 467321 466652 467993 470994 474354 476933 478350 478643 477750
51805D77750k213l335l760l360k628k256k404k484j814m08R92J642J364M79n72
$$ 477750 475537 472202 468442 465082 462454 460198 457794 455310 453496 453088 454080 455722 457086 457565 456993
51790D56993j470k060k280k139j771j471j491j688j591r35o3M37L64ll29m89m55
$$ 456993 455523 453463 451183 449044 447273 445802 444311 442623 441032 440097 440034 440471 440835 440832 440503 440014 439559
51773D39559j14P61K419M859P491R369J0052J0087J0336J0944J1257J0655R038
$$ 439559 439445 440206 442625 447484 454975 464344 474396 484483 494819 505763 517020 527675 536713
51760E36713O614L664O35j946l861n316o597p804q893r722j0027r587q516p140
$$ 536713 543327 546991 547626 545680 541819 536503 529906 522102 513209 503487 493460 483873 475357 468217
51746D68217n752m644m190m310m038k330N04K838L539L148K929L297L871M510
$$ 468217 462465 457821 453631 449321 445283 442953 443457 446295 449834 452982 455911 459208 463079 467589
51732D67589N506O753P487P092N655L648J491l73j405j378o58K14J024J685J701
$$ 467589 473095 479848 487335 494427 500082 503730 505221 504848 503443 502065 501407 501621 502645 504330 506031
51717E06031M44j954m334n537n439m711l792k595j142J3L40o7o85j061r00OJ471
$$ 506031 506475 504521 500187 494650 489211 484500 480708 478113 476971 476984 477324 477257 476572 475511 474611 474617 476088
51700D76088K728L009K291J203K58m86j066j376j253o18M45J529J980J493M81
$$ 476088 478816 481825 484116 485319 485577 485091 484025 482649 481396 480778 481223 482752 484732 486225 486706
51685D86706n12j533k925m441n336n326m754l827k377o49M83N77L11N55J154J240
$$ 486706 486194 484661 481736 477295 471959 466633 461879 458052 455675 455026 455509 456086 456397 456952 458106 459346
51669D59346M95m64q53m02P42K367M362O608Q688R730Q882O164K640m46k576l876
$$ 459346 459841 459377 458524 458122 458864 461231 465593 472201 480889 490619 499501 505665 508305 507859 505283 501407
51653E01407m468m194k826l32K933O238Q883J0662J1574J1008P987K591l398p958
$$ 501407 496939 492745 489919 489587 492520 498758 507641 518303 529877 540885 548872 551463 548065 540107
51639E40107j0609j2203j3343j3807j3416j2509j1342r684p393m919k921j680
$$ 540107 529498 517295 503952 490145 476729 464220 452878 443194 435801 430882 427961 426281
51627D26281j116j018r48k51J300L012L781L190J849O76M1k84n70q24r69j094
$$ 426281 425165 424147 423199 422948 424248 427260 431041 434231 436080 436756 436797 436513 435943 435119 434150 433056
51611D33056j338j654j806j578r52j47M05K96m35j199j372q52Q4J311K849M462
$$ 433056 431718 430064 428258 426680 425728 425581 425986 426282 425847 424648 423276 422424 422508 423819 426668 431130
51595D31130N727O640P671Q996J0098J0323R527P878N440K301j069m049o224p376
$$ 431130 436857 443497 451168 460164 470262 480585 490112 497990 503430 505731 504662 500613 494389 487013
51581D87013p307o069m138k018J85K596N136P611J0063J2665J5308J7619J9288
$$ 487013 479706 473637 469499 467481 467666 470262 475398 483009 493072 505737 521045 538664 557952
51568E57952K0217K0505K0511K0711K1181K1489K1479K1862K3605K6868L1021
$$ 557952 578169 598674 619185 639896 661077 682566 704045 725907 749512 776380 807401
51557H07401L5499M0001M3905M6163M6053M3521L8616L1151K1282R998j385j2106
$$ 807401 842900 882901 926806 972969 1019022 1062543 1101159 1132310 1153592 1163590 1162205 1150099
51545A150099k1989l0851l8258m3841m7560m9549m9881m8608m5888m2016l7366
$$ 1150099 1128110 1097259 1059001 1015160 967600 918051 868170 819562 773674 731658 694292
51534F94292l2342k7468k3294k0118j7765j5789j3875j1957j0034q175o654n749
$$ 694292 661950 634482 611188 591070 573305 557516 543641 531684 521650 513475 506821 501072
51522E01072n280m694l733k704j870j002J10J112J550J655K046K759L143K766
$$ 501072 495792 491098 487365 484661 482791 481789 481899 483011 484561 486216 488262 491021 494164 496930
51508D96930J883Q63l34j852l426m544n019n115n162n139m663l497k000r98j019
$$ 496930 498813 499676 499342 497490 494064 489520 484501 479386 474224 469085 464422 460925 458925 457927 456908
51493D56908j778k523k752k482j979j537j330j311j281j269j631k492l400l810
$$ 456908 455130 452607 449855 447373 445394 443857 442527 441216 439935 438666 437035 434543 431143 427333
51479D27333l784l705l549l010k183j550j242r22n45n56j139j770j959j965k346
$$ 427333 423549 419844 416295 413285 411102 409552 408310 407388 406843 406287 405148 403378 401419 399454 397108
51464C97108l048l431l072k183j208l90K38O28O56L31r6k85j19K87R75K255M171
$$ 397108 394060 390629 387557 385374 384166 383776 384014 384642 385298 385629 385533 385248 385129 385416 386391 388646 392817
51447C92817O023O884O675O397P059Q663J0382J1610J2489J3365J3912J3090J0194
$$ 392817 398840 405724 412399 418796 425855 434518 444900 456510 468999 482364 496276 509366 519560
51434E19560N849J686j103k567l333l716l859m308n602p469r035r884j0302j0343
$$ 519560 525409 527095 525992 523425 520092 516376 512517 508209 502607 495138 486103 476219 465917 455574
51420D55574r450p338m757k854j997j578q62K94J451K142K366K650L420M409M841
$$ 455574 446124 438786 434029 431175 429178 427600 426738 427032 428483 430625 432991 435641 439061 443470 448311
51405D48311M283L093J999J440J391J564J672J668J751K061K359K312K064K267
$$ 448311 452594 455687 457686 459126 460517 462081 463753 465421 467172 469233 471592 473904 475968 478235
51391D78235L410N217O844P656P865Q461J0347J3475J7091K0919K5555L1364L7570
$$ 478235 481645 486862 493706 501362 509227 517688 528035 541510 558601 579520 605075 636439 674009
51378F74009M3161M8212N3432N8666O2838O5361O6427O5633O1430N2643L9915
$$ 674009 717170 765382 818814 877480 940318 1005679 1072106 1137739 1199169 1251812 1291727
51367A291727K5083R744n179j9039l1378m1995n0669n7068o1192o3443o3953o2316
$$ 1291727 1316810 1326554 1321375 1302336 1270958 1228963 1178294 1121226 1060034 996591 932638 870322
51355H70322n8438n3212m7843m2823l7954l3007k7960k3003j8655j5485j3291
$$ 870322 811884 758672 710829 668006 630052 597045 569085 546082 527427 511942 498651
51344D98651j1121q593o627o201o826p091o428n461m764m179l448k819k702l103
$$ 498651 487530 478937 472310 466109 459283 452192 445764 440303 435539 431360 427912 425093 422391 419288
51330D19288l622l807l515l069k933l127l151k774k391k299k046j090K20R87Q63
$$ 419288 415666 411859 408344 405275 402342 399215 396064 393290 390899 388600 386554 385464 385684 386671 387534
51315C87534L04l5L53J690L502M661M582M066M204M771M667L723K858K494J985
$$ 387534 387838 387803 388156 389846 393348 398009 402591 406657 410861 415632 420299 424022 426880 429374 431359
51300D31359R10k06r26j617k613l521m032m584n509o239o090n279m392l403k067
$$ 431359 432269 432063 431137 429520 426907 423386 419354 414770 409261 403022 396932 391653 387261 383858 381791
51285C81791p67n9L85J359K796L775L971M104M756N497N614N068M257L303K105
$$ 381791 381024 380965 381350 382709 385505 389280 393251 397355 402111 407608 413222 418290 422547 425850 427955
51270D27955Q89J54J17N25R30J083J081J304K034K977L405K914J831O78m96j860
$$ 427955 428844 428998 429115 429640 430570 431653 432734 434038 436072 439049 442454 445368 447199 447877 447381 445521
51254D45521l187l949l986l552k855k045j634k127l062l190k074p77l39k97L28
$$ 445521 442334 438385 434399 430847 427992 425947 424313 422186 419124 415934 413860 413083 412744 412447 412775
51239D12775J175R11o48k098k372j978j854k068k210k256k208j661n08M68N27
$$ 412775 413950 414861 414213 412115 409743 407765 405911 403843 401633 399377 397169 395508 395000 395468 395995
51224C95995Ll34m52p13q42l22M62O32K54L62J351K433K936L219L816M509M751
$$ 395995 395998 395664 395212 394499 393657 393335 393797 394429 394683 395045 396396 398829 401765 404984 408800 413309 418060
51207D18060M507M195M092M161M129L630K604J639J394J651J503O19l69r12j265
$$ 418060 422567 426762 430854 435015 439144 442774 445378 447017 448411 450062 451565 452184 451815 450903 449638
51192D49638j772k195k236k176k371k621k552k267k025j670r98l58k13k91P1Q07
$$ 449638 447866 445671 443435 441259 438888 436267 433715 431448 429423 427753 426755 426397 426184 425893 425964 426771
51176D26771J051M01l90l42N23J257J193O24K10R8q8m45n43j49L14M22M83J007
$$ 426771 427822 428223 427833 427491 428014 429271 430464 431088 431298 431396 431308 430863 430320 430171 430485 430907 431390 432397
51158D32397J689J783J328J143J460J520Q92K70M17J021J264R33L61k40p17p50
$$ 432397 434086 435869 437197 438340 439800 441320 442212 442482 442899 443920 445184 446117 446478 446238 445521 444771
51142D44771m30o14j881l494m195l777l086k653k244j652j008k84O76J479J386
$$ 444771 444341 443727 441846 438352 434157 430380 427294 424641 422397 420745 419737 419453 420129 421608 422994
51127D22994M61k30Q5R85J609J715J628J612J748K122K661K937K546J672J056
$$ 422994 423455 423225 423310 424295 425904 427619 429247 430859 432607 434729 437390 440327 442873 444545 445601
51112D45601J360K566L927M586M361L843L563L338K717J868J414J600K100K590
$$ 445601 446961 449527 453454 458040 462401 466244 469807 473145 475862 477730 479144 480744 482844 485434
51098D85434K911K687J492l74j900k433k224j766j211p30p73j425k048k041j582
$$ 485434 488345 491032 492524 492150 490250 487817 485593 483827 482616 481886 481113 479688 477640 475599 474017
51083D74017j149p55k54M9j79n15k31N94J147J084R40J137J359J219R68J094J615
$$ 474017 472868 472113 471859 471908 471729 471214 470983 471577 472724 473808 474748 475885 477244 478463 479431 480525 482140
51066D82140K276L110M264N489O364P002Q027R718J1677J3500J5258J6903J7661
$$ 482140 484416 487526 491790 497279 503643 510645 518672 528390 540067 553567 568825 585728 603389
51053F03389J6702J4324J1870J0427J0153J0899J2678J5078J6884J7092J5907
$$ 603389 620091 634415 646285 656712 666865 677764 690442 705520 722404 739496 755403
51042G55403J4127J1806Q338L722j193n735r811j3069j4633j4209j2731j1395
$$ 755403 769530 781336 789674 793396 792203 786468 776657 763588 748955 734746 722015 710620
51030G10620j0614j0476j1444j3677j6055j6922j5831j3785j1734r557o741l376
$$ 710620 700006 689530 678086 664409 648354 631432 615601 601816 590082 580525 573784 570408
51018E70408j49K291L765M656N682P233Q866R754R681R186Q680P961O877O006
$$ 570408 570259 572550 576315 580971 586653 593886 602752 612506 622187 631373 640053 648014 654891 660897
51004F60897O202P644R709J1592J2838J3346J3199J2597J1792J0999J0255R363
$$ 660897 667099 674743 684452 696044 708882 722228 735427 748024 759816 770815 781070 790433
50992G90433Q082O529N243M584M160L278J856N35j93l91r6J030L105N556P740
$$ 790433 798515 805044 810287 814871 819031 822309 824165 824700 824507 824116 824020 825050 828155 833711 841451
50977H41451R751J2040J4476J6314J7034J6798J6240J6226J7720K1254K6373L1990
$$ 841451 851202 863242 877718 894032 911066 927864 944104 960330 978050 999304 1025677 1057667
50965A057667L7330M2220M6633N0506N4121N8029O2293O6155O8762O9901O9925
$$ 1057667 1094997 1137217 1183850 1234356 1288477 1346506 1408799 1474954 1543716 1613617 1683542
50954A683542O9264O8135O6308O2975N7399N0018M2427L5915L0425K5386K0956
$$ 1683542 1752806 1820941 1887249 1950224 2007623 2057641 2100068 2135983 2166408 2191794 2212750
50943B212750J7715J5639J4280J3724J4357J5591J5835J4093J0880P119K969j681
$$ 2212750 2230465 2246104 2260384 2274108 2288465 2304056 2319891 2333984 2344864 2351983 2354952 2353271
50931B353271o217r752j2379j5265j9398k4767l0760l6897m2988m8921n4600n9913
$$ 2353271 2347054 2337302 2324923 2309658 2290260 2265493 2234733 2197836 2154848 2105927 2051327 1991414
50919A991414o4661o8514p1029p1785p0698o8308o5473o2546n9012n4299m8729
$$ 1991414 1926753 1858239 1787210 1715425 1644727 1576419 1510946 1448400 1389388 1335089 1286360
50908A286360m3307l8660l4658l1061k7998k5653k3847k2266k0819j9519j8199
$$ 1286360 1243053 1204393 1169735 1138674 1110676 1085023 1061176 1038910 1018091 998572 980373
50897I80373j6675j5081j3713j2555j1229r520p770o499n709m801l317j540j36
$$ 980373 963698 948617 934904 922349 911120 901600 893830 887331 881622 876821 873504 871964 871828
50884H71828O96J358K095K628K711K632K760L016L305M136O077Q653J0624J1481
$$ 871828 872524 873882 875977 878605 881316 883948 886708 889724 893029 897165 903242 911895 922519 934000
50870I34000J1948J2752J3613J4022J4369J5528J7631K0002K2201K4466K7031
$$ 934000 945948 958700 972313 986335 1000704 1016232 1033863 1053865 1076066 1100532 1127563
50859A127563K9680L2198L4875L8284M2749M8195N4356O0969O7996P5720Q4434
$$ 1127563 1157243 1189441 1224316 1262600 1305349 1353544 1407900 1468869 1536865 1612585 1697019
50848A697019R3899J03315J12002J19999J27841J35821J43546J50229J55253J58449
$$ 1697019 1790918 1894233 2006235 2126234 2254075 2389896 2533442 2683671 2838924 2997373
50838B997373J59816J58986J55073J47215J35305J20137J02800Q4116O4699M5391
$$ 2997373 3157189 3316175 3471248 3618463 3753768 3873905 3976705 4060821 4125520 4170911
50828D170911K7341J1632j093j0550j6523j8781j7313j2502n085L952J3398K1837
$$ 4170911 4198252 4209884 4208791 4198241 4181718 4162937 4145624 4133122 4128037 4131989 4145387 4167224
50816D167224K7837L0144K7808K0408Q277p674k6532m7610o9936r1974j12384
$$ 4167224 4195061 4225205 4253013 4273421 4281698 4274024 4247492 4199882 4129946 4037972 3925588
50805C925588j30815j47290j60954j70305j74837j75487j73067j67128j57123
$$ 3925588 3794773 3647483 3486529 3316224 3141387 2965900 2792833 2625705 2468582
50796B468582j44047j29928j16085j02698q9839p7840o6685n5994m5799l6628
$$ 2468582 2324535 2194607 2078522 1975824 1885985 1808145 1741460 1685466 1639667 1603039
50786A603039k8680k1679j5670j1129q037n707l871l101l583m360m506m452n264
$$ 1603039 1574359 1552680 1537010 1525881 1517844 1512137 1508266 1505165 1501582 1497222 1492716 1488264 1483000
50773A483000p107r227j1128j2868j4423j5682j6997j8842k0836k2005k2108k2016
$$ 1483000 1475893 1466666 1455538 1442670 1428247 1412565 1395568 1376726 1355890 1333885 1311777 1289761
50761A289761k2441k3072k3289k3060k2623k1766k0044j7476j4550j1664q888
$$ 1289761 1267320 1244248 1220959 1197899 1175276 1153510 1133466 1115990 1101440 1089776 1080888
50750A080888o149l377o16J893L950N876Q358J1568J4792J7421K0019K3803K9137
$$ 1080888 1074739 1071362 1070746 1072639 1076589 1082465 1090823 1102391 1117183 1134604 1154623 1178426 1207563
50737A207563L5115M0679M5594N0237N5008O0218O6030P2001P6989Q0063Q1515
$$ 1207563 1242678 1283357 1328951 1379188 1434196 1494414 1560444 1632445 1709434 1789497 1871012
50726A871012Q2432Q3311Q3547Q2442Q0214P7630P4954P1598O6749N9932N0999
$$ 1871012 1953444 2036755 2120302 2202744 2282958 2360588 2435542 2507140 2573889 2633821 2684820
50715B684820M0064K7608J4393J119j1638k2986l1508l5970l6200l3094k7749
$$ 2684820 2724884 2752492 2766885 2768004 2756366 2733380 2701872 2665902 2629702 2596608 2568859
50704B568859k0773j2455l349N487J2836J7860K0369K0516J8223J2999M417p287
$$ 2568859 2548086 2535631 2532282 2537769 2550605 2568465 2588834 2609350 2627573 2640572 2644989 2637702
50692B637702k1229l6378n1893o6939q0388r0892r7335r9435r7876r3755q7778
$$ 2637702 2616473 2580095 2528202 2461263 2380875 2289983 2192648 2093213 1995337 1901582 1813804
50681A813804q0093p0998o1395n2172m3347l4257k4643j5110o374J476Q765J5599
$$ 1813804 1733711 1662713 1601318 1549146 1505799 1471542 1446899 1431789 1425415 1426891 1435656 1451255
50669A451255K1742K6987L1228L4265L5730L5328L3140K9689K5776K2071J8874
$$ 1451255 1472997 1499984 1531212 1565477 1601207 1636535 1669675 1699364 1725140 1747211 1766085
50658A766085J6230J4300J3305J3116J3045J2381J1033R611Q857R003R633J0144
$$ 1766085 1782315 1796615 1809920 1823036 1836081 1848462 1859495 1869106 1877963 1886966 1896599 1906743
50646A906743J0478J1305J3384J6764K0913K5543L0859L6828M2659M7377N0720
$$ 1906743 1917221 1928526 1941910 1958674 1979587 2005130 2035989 2072817 2115476 2162853 2213573
50635B213573N3117N4916N5909N5625N3833N0777M7186M4001M1892M0843M0216
$$ 2213573 2266690 2321606 2377515 2433140 2486973 2537750 2584936 2628937 2670829 2711672 2751888
50624B751888L9081L6402L0970K1433O786j2598l4074n3229o6090p1319p0167
$$ 2751888 2790969 2827371 2858341 2879774 2886560 2873962 2839888 2786659 2720569 2649250 2579083
50613B579083o4459n5334m3920l2078k1492j2460m458K262O576P864O616L459
$$ 2579083 2514624 2459290 2415370 2383292 2361800 2349340 2344882 2347144 2353720 2361584 2368200 2371659
50601B371659j673r066j8503k9269m0441n0900n9529o5862p0242p3081p4182p3141
$$ 2371659 2369986 2360920 2342417 2313148 2272707 2221807 2162278 2096416 2026174 1953093 1878911 1805770
50589A805770p0176o6174o2001n7943n3772m9228m4455l9952l6122l2935l0242
$$ 1805770 1735594 1669420 1607419 1549476 1495704 1446476 1402021 1362069 1325947 1293012 1262770
50578A262770k8099k6428k4555k1746j8190j4822j2060r378o359l383q64J523
$$ 1262770 1234671 1208243 1183688 1161942 1143752 1128930 1116870 1107492 1101133 1097750 1096886 1098409
50566A098409M219O932R149J1027J3042J5060J6593J7842J9624K2230K5091K7704
$$ 1098409 1102628 1109560 1118709 1129736 1142778 1157838 1174431 1192273 1211897 1234127 1259218 1286922
50554A286922L0174L2618L4707L6194L7330L8341L8854L8352L6890L4957L2800
$$ 1286922 1317096 1349714 1384421 1420615 1457945 1496286 1535140 1573492 1610382 1645339 1678139
50543A678139L0356K7851K6079K5894K7484L0286L3575L7167M1433M6681N2672
$$ 1678139 1708495 1736346 1762425 1788319 1815803 1846089 1879664 1916831 1958264 2004945 2057617
50532B057617N8914O5196P1598P8132Q4767R1718R9272J07229J15004J22329J29332
$$ 2057617 2116531 2181727 2253325 2331457 2416224 2507942 2607214 2714443 2829447 2951776 3081108
50521C081108J35663J40111J41539J39868J35656J28957J19187J06003Q9757P1022
$$ 3081108 3216771 3356882 3498421 3638289 3773945 3902902 4022089 4128092 4217849 4288871
50511D288871N0222K7878M791j8393m1425o3946q4855j02579j15951j24621j28748
$$ 4288871 4339093 4366971 4371762 4353369 4311944 4247998 4163143 4060564 3944613 3819992 3691244
50500C691244j28576j24396j16510j05027q9890p1406n0673k9243q386J1123K8592
$$ 3691244 3562668 3438272 3321762 3216735 3126845 3055439 3004766 2975523 2967137 2978260 3006852
50489C006852M3173N4065O0587O1801N6519M4192K5660K701k3087n0373p7190
$$ 3006852 3050025 3104090 3164677 3226478 3282997 3327189 3352849 3355550 3332463 3282090 3204900
50478C204900j00753j18786j30844j37961j41140j40656j36732j30251j22349
$$ 3204900 3104147 2985361 2854517 2716556 2575416 2434760 2298028 2167777 2045428
50469B045428j13629j04131r4089q4224p5132o6763n8776n1225m4454l8444l2751
$$ 2045428 1931799 1827668 1733579 1649355 1574223 1507460 1448684 1397459 1353005 1314561 1281810
50458A281810k7172k2006j7408j2991q500m516j940r55q82r50o83K34J909L952
$$ 1281810 1254638 1232632 1215224 1202233 1193733 1189217 1187277 1186322 1185440 1184490 1183807 1184041 1185950 1189902
50444A189902N810P428R218J1262J3165J4666J5796J6277J5512J3512J1208R346
$$ 1189902 1195712 1203140 1212358 1223620 1236785 1251451 1267247 1283524 1299036 1312548 1323756 1333102
50432A333102P704N942M658M811O389Q431J0179J1552J2599J3276J3802J4586
$$ 1333102 1340806 1346748 1351406 1356217 1362606 1371037 1381216 1392768 1405367 1418643 1432445 1447031
50420A447031J5590J6347J6827J7788J9986K3349K7186L0963L4775L9158M4551
$$ 1447031 1462621 1478968 1495795 1513583 1533569 1556918 1584104 1615067 1649842 1689000 1733551
50409A733551N0728N6817O2029O6249O9628P1882P2544P1718O9860O6825O1891
$$ 1733551 1784279 1841096 1903125 1969374 2039002 2110884 2183428 2255146 2325006 2391831 2453722
50398B453722N4984M7126L9195L0834K1052R425l758j8105l3112m7809o1021p1967
$$ 2453722 2508706 2555832 2595027 2625861 2646913 2656338 2652580 2634475 2601363 2553554 2492533 2420566
50386B420566q0171q5079q6277q4019p8998p1693o2492n2199m1691l0961j9347
$$ 2420566 2340395 2255316 2169039 2085020 2006022 1934329 1871837 1819638 1777947 1746986 1727639
50375A727639p076M225J3050J9455K4300K7515K7976K4962J8870J0340m50j3104
$$ 1727639 1720563 1724788 1737838 1757293 1781593 1809108 1837084 1862046 1880916 1891256 1890806 1877702
50363A877702k6245l8106m7700n4955n9925o2542o3092o2195o0165n6888n2677
$$ 1877702 1851457 1813351 1765651 1710696 1650771 1588229 1525137 1462942 1402777 1345889 1293212
50352A293212m8632m5644m3411m0935l7785l4272l0559k6347k1601j6986j3190
$$ 1293212 1244580 1198936 1155525 1114590 1076805 1042533 1011974 985627 964026 947040 933850
50341I33850j0097o901k940J689O232R932J2731J5098J7017J7343J4848R797L950
$$ 933850 923753 916852 913912 915601 921833 931765 944496 959594 976611 993954 1008802 1018599 1022549
50328A022549j176n374q889j1390j2269j1527r648o953l657l18K409M339N592
$$ 1022549 1021373 1015999 1007110 995720 983451 971924 962276 955323 951666 951348 953757 958096 963688
50315I63688O087N795N327N541O464P209P126O495N953N672N442N207N124N310
$$ 963688 969775 975570 980897 986438 992902 1000111 1007237 1013732 1019685 1025357 1030799 1036006 1041130 1046440
50301A046440N720O203O578O775O985P523Q536R952J1662J3509J5281J6978J9027
$$ 1046440 1052160 1058363 1064941 1071716 1078701 1086224 1094760 1104712 1116374 1129883 1145164 1162142 1181169
50288A181169K1821K5086K8016K9987L0583K8833K3210J2991m17j3913k4466l0506
$$ 1181169 1202990 1228076 1256092 1286079 1316662 1345495 1368705 1381696 1381279 1367366 1342900 1312394
50276A312394l2033k9959k5500j9856j4044q701m018j5L015M586M693M106L603
$$ 1312394 1280361 1250402 1224902 1205046 1191002 1182301 1178283 1178268 1181283 1185869 1190562 1194668 1198271
50263A198271L176K379J250L49r3m02p41p73k50N76J375K190L247M698O775R726
$$ 1198271 1201447 1203826 1205076 1205425 1205332 1204930 1204189 1203416 1203166 1203742 1205117 1207307 1210554 1215252 1222027 1231753
50247A231753J3345J7025K0514K4266K8641L3193L7024L9576M0808M0948M0380
$$ 1231753 1245098 1262123 1282637 1306903 1335544 1368737 1405761 1445337 1486145 1527093 1567473
50236A567473L9390L7799L5326L2516L0642L0148K9740K7662K3336J7091Q961
$$ 1567473 1606863 1644662 1679988 1712504 1743146 1773294 1803034 1830696 1854032 1871123 1880084
50225A880084j170j2496k3460l3085m1242m7603n1350n2191n0862m8218m4444
$$ 1880084 1878914 1866418 1842958 1809873 1768631 1721028 1669678 1617487 1566625 1518407 1473963
50214A473963l9602l4362k9738k6494k5145k6027k8847l2396l5270l6741l6744
$$ 1473963 1434361 1399999 1370261 1343767 1318622 1292595 1263748 1231352 1196082 1159341 1122597
50203A122597l5299l2454k8630k4611k1020j8087j5859j4440j3785j3426j2665
$$ 1122597 1087298 1054844 1026214 1001603 980583 962496 946637 932197 918412 904986 892321
50192H92321j1181r422q178p710p494o921o028n293m971m896m833m759m794n059
$$ 892321 881140 871718 863540 855830 848336 841415 835387 830094 825123 820227 815394 810635 805841 800782
50178H00782n494n674n070l765k552k072k104k149k244k575k660j806k85Q02Q62
$$ 800782 795288 789614 784544 780779 778227 776155 774051 771902 769658 767083 764423 762617 762332 763134 763996
50163G63996L98J15L26J130K449L658M106M217N135O983Q458Q689Q454Q837R581
$$ 763996 764394 764509 764835 765965 768414 772072 776178 780395 785530 792513 800971 809660 818114 826951 836532
50148H36532R757R254Q537P548O009M423L601L333K738J949K289M548Q072J1876
$$ 836532 846289 855543 864080 871628 877637 882060 885661 888994 891732 893681 895970 900518 908590 920466
50134I20466J5778K0085K4905L0309L6505M3342N0124N6333O2178O7908P2964
$$ 920466 936244 956329 981234 1011543 1048048 1091390 1141514 1197847 1260025 1327933 1400897
50123A400897P6282P7351P6605P4880P2782P0519O8108O5783O4088O3317O2654
$$ 1400897 1477179 1554530 1631135 1706015 1778797 1849316 1917424 1983207 2047295 2110612 2173266
50112B173266O0214N4193M3992L0231J3965l741k1701l8518n2934o4351p2998
$$ 2173266 2233480 2287673 2331665 2361896 2375861 2372120 2350419 2311901 2258967 2194616 2121618
50101B121618p9458q3941q6089q5626q3031p9232p4696o9175o2424n4882m7528
$$ 2121618 2042160 1958219 1872130 1786504 1703473 1624241 1549545 1480370 1417946 1363064 1315536
50090A315536m1255l6438l2842k9804k6716k3524k0529j7760j4844j1587q302
$$ 1315536 1274281 1237843 1205001 1175197 1148481 1124957 1104428 1086668 1071824 1060237 1051935
50079A051935n315k499L44K851M331M613M287M069M206M561M959N244N152M497
$$ 1051935 1046620 1044121 1044465 1047316 1051647 1056260 1060547 1064616 1068822 1073383 1078342 1083586 1088738 1093235
50065A093235L430K339J384K62j335l236m918o120o970p481p426o891o591p039
$$ 1093235 1096665 1099004 1100388 1100650 1099315 1096079 1091161 1085041 1078071 1070590 1063164 1056273 1049682 1042643
50051A042643p713p600o593n688n613n806n200l603j808m76O17K187M581P512
$$ 1042643 1034930 1027330 1020737 1015049 1009436 1003630 998430 994827 993019 992543 993160 995347 999928 1007440
50037A007440J0371J2641J4076J4752J5091J5675J6767J7965J8473J7884J6510
$$ 1007440 1017811 1030452 1044528 1059280 1074371 1090046 1106813 1124778 1143251 1161135 1177645
50026A177645J4868J3200J1646J0490R745Q755O880M503K758K126K015J815J744
$$ 1177645 1192513 1205713 1217359 1227849 1237594 1246349 1253229 1257732 1260490 1262616 1264631 1266446 1268190
50013A268190K200K934L586M571O780J0486J5129K0126K5243L0104L3958L6245
$$ 1268190 1270390 1273324 1276910 1281481 1288261 1298747 1313876 1334002 1359245 1389349 1423307 1459552
50001A459552L7161L7400L7447L7309L6794L5947L5175L4810L4476L2965K9046
$$ 1459552 1496713 1534113 1571560 1608869 1645663 1681610 1716785 1751595 1786071 1819036 1848082
49990A848082K2286J2963J412j2093k6812m1427n4678o5781p4031p8544p8944
$$ 1848082 1870368 1883331 1884743 1872650 1845838 1804411 1749733 1683952 1609921 1531377 1452433
49979A452433p6137p1718o6552o0388n3038m5391l8759l3542k9168k5204k1853
$$ 1452433 1376296 1304578 1238026 1177638 1124600 1079209 1040450 1006908 977740 952536 930683
49968I30683j9186j6649j3924j1759j1067j1347j0845q579n514l289k260j426
$$ 930683 911497 894848 880924 869165 858098 846751 835906 827327 821813 818524 816264 814838
49956H14838M9J909L423M331M938N722O992Q735J0441J1309J0833R228P121M962
$$ 814838 814887 816796 820219 824550 829488 835210 842202 850937 861378 872687 883520 892748 899869 904831
49942I04831K906J168J07k57n80j758m087p032r880j2386j4693j6820j8505j9452
$$ 904831 907737 908905 909012 908755 908175 906417 902330 895298 885418 873032 858339 841519 823014 803562
49928H03562j9502j8654j7155j5537j4240j3148j1733r731p485n518m026k824
$$ 803562 784060 765406 748251 732714 718474 705326 693593 683862 676377 670859 666833 664009
49916F64009j606j23J560K959L568L516L481L791M105M236M795O442Q810J0898
$$ 664009 662403 662280 663840 666799 670367 673883 677364 681155 685260 689496 694291 700733 709543 720441
49902G20441J2331J3638J5115J6234J6421J5843J4977J3845J2141R913P578N320
$$ 720441 732772 746410 761525 777759 794180 810023 825000 838845 850986 860899 868477 873797
$$ [...]
##END NTUPLES=NMR SPECTRUM
##END=
