
##TITLE=UV1289_M2_1207-1380_70_7534623_obKTzA1Bue
##JCAMPDX= 6.0         $$ Bruker NMR JCAMP-DX V2.0
##DATA TYPE= NMR SPECTRUM
##DATA CLASS= NTUPLES
##ORIGIN= BRUKER
##OWNER= Administrator
$$ 1.72 TOPSPIN		Version 2.1
$$ 2013-02-21 21:49:14.605 -0500  Administrator@X
$$ Compression mode = diff/dup
##.OBSERVE FREQUENCY= 400.02188249412
##.OBSERVE NUCLEUS= ^1H
##.ACQUISITION MODE= SIMULTANEOUS (DQD)
##.ACQUISITION SCHEME= undefined
##.AVERAGES= 8
##.DIGITISER RES= 22
##SPECTROMETER/DATA SYSTEM= spect
##.PULSE SEQUENCE= zg30
##.SOLVENT NAME= COFFEE_meoh
##.SHIFT REFERENCE= INTERNAL, COFFEE_meoh, 1, 14.98509
##AUDIT TRAIL= $$ (NUMBER, WHEN, WHO, WHERE, PROCESS, VERSION, WHAT)
$$ ##TITLE= Audit trail, TOPSPIN		Version 2.1
$$ ##JCAMPDX= 5.01
$$ ##ORIGIN= Bruker BioSpin GmbH
$$ ##OWNER= Administrator
$$ $$ E:\/data/COFFEE/nmr/UV1289_M2_1207-1380_70_7534623_obKTzA1Bue/10/pdata/1/auditp.txt
$$ ##AUDIT TRAIL=  $$ (NUMBER, WHEN, WHO, WHERE, PROCESS, VERSION, WHAT)
(   1,<2013-02-21 21:49:06.105 -0500>,<Administrator>,<X>,<go>,<TOPSPIN 2.1>,
      <created by zg
	started at 2013-02-21 21:47:59.996 -0500,
	POWCHK enabled, PULCHK disabled,
       configuration hash MD5:
       86 BA 57 50 F2 9D 5C 9B 26 00 A9 28 5F 66 2E 89
       data hash MD5: 64K
       A1 07 52 1A 3E B1 A9 15 8D 58 02 82 79 A1 AD 09>)
(   2,<2013-02-21 21:49:09.261 -0500>,<Administrator>,<X>,<proc1d>,<TOPSPIN 2.1>,
      <Start of raw data processing
       efp LB = 0 FT_mod = 6 PKNL = 1 PHC0 = 0 PHC1 = 0 SI = 32K 
       data hash MD5: 32K
       BE A2 4A 94 13 46 2E 10 B0 7F 09 1F FC E5 60 A2>)
(   3,<2013-02-21 21:49:09.730 -0500>,<Administrator>,<X>,<proc1d>,<TOPSPIN 2.1>,
      <pk PHC0 = 68.91174 PHC1 = 0 
       data hash MD5: 32K
       39 16 23 81 C0 9D 69 FA 1A 8F 93 CD BD 04 DB 50>)
(   4,<2013-02-21 21:49:09.980 -0500>,<Administrator>,<X>,<proc1d>,<TOPSPIN 2.1>,
      <abs ABSG = 1 
       data hash MD5: 32K
       AD 68 66 98 D9 47 45 73 16 DD EF 6E 8D C8 16 6B>)
(   5,<2013-02-21 21:49:10.183 -0500>,<Administrator>,<X>,<proc1d>,<TOPSPIN 2.1>,
      <abs ABSG = 2 
       data hash MD5: 32K
       2A 3A 7A 1E 69 14 48 88 CF 14 E7 AA 1F E2 F5 BF>)
(   6,<2013-02-21 21:49:10.324 -0500>,<Administrator>,<X>,<proc1d>,<TOPSPIN 2.1>,
      <abs ABSG = 3 
       data hash MD5: 32K
       4B BB AC 81 B3 E8 6D A4 9B F1 2C D3 D5 38 51 C4>)
(   7,<2013-02-21 21:49:10.464 -0500>,<Administrator>,<X>,<proc1d>,<TOPSPIN 2.1>,
      <abs ABSG = 4 
       data hash MD5: 32K
       4B 14 FA A0 91 D6 9C 7A 81 3A 27 A5 1A DF 46 76>)
(   8,<2013-02-21 21:49:10.605 -0500>,<Administrator>,<X>,<proc1d>,<TOPSPIN 2.1>,
      <abs ABSG = 5 
       data hash MD5: 32K
       18 7F E0 D0 8F B4 60 4F 84 12 86 6D 6E 75 00 ED>)
$$ ##END=
$$ 
$$ $$ hash MD5
$$ $$ 5C FA E9 7B 8E 5C 6A DC 5B 33 E6 22 51 B6 AF 13
##$RELAX= 
##$RELAX= 
##$RELAX= 
##$RELAX= 
##$RELAX= 
##$RELAX= 
##$RELAX= 
$$ Bruker specific parameters
$$ --------------------------
##$DU= <E:\>
##$EXPNO= 10
$$ [...]
##$TP= (0..7)
150 150 150 150 150 150 150 150
##$TP07= 0
##$TPNAME0= <>
##$TPNAME1= <>
##$TPNAME2= <>
##$TPNAME3= <>
##$TPNAME4= <>
##$TPNAME5= <>
##$TPNAME6= <>
##$TPNAME7= <>
##$TPOAL= (0..7)
0.5 0.5 0.5 0.5 0.5 0.5 0.5 0.5
##$TPOFFS= (0..7)
0 0 0 0 0 0 0 0
##$TUNHIN= 0
##$TUNHOUT= 0
##$TUNXOUT= 0
##$USERA1= <user>
##$USERA2= <user>
##$USERA3= <user>
##$USERA4= <user>
##$USERA5= <user>
##$V9= 5
##$VALIST= <valist>
##$VCLIST= <CCCCCCCCCCCCCCC>
##$VD= 0
##$VDLIST= <DDDDDDDDDDDDDDD>
##$VPLIST= <PPPPPPPPPPPPPPP>
##$VTLIST= <TTTTTTTTTTTTTTT>
##$WBST= 1024
##$WBSW= 4
##$XGAIN= (0..3)
0 0 0 0
##$XL= 0
##$YL= 0
##$YMAX_a= 568914
##$YMIN_a= -565433
##$ZGOPTNS= <>
##$ZL1= 120
##$ZL2= 120
##$ZL3= 120
##$ZL4= 120
##$ABSF1= 14.98509
##$ABSF2= -5.573092
##$ABSG= 5
##$ABSL= 3
##$ALPHA= 0
##$AQORDER= 0
##$ASSFAC= 0
##$ASSFACI= 0
##$ASSFACX= 0
##$ASSWID= 0
##$AUNMP= <proc_prof1d_extract_pilot.lims>
##$AXLEFT= 0
##$AXNAME= <>
##$AXNUC= <1H>
##$AXRIGHT= 0
##$AXTYPE= 0
##$AXUNIT= <>
##$AZFE= 0.1
##$AZFW= 0.1
##$BCFW= 0
##$BC_mod= 0
##$BYTORDP= 0
##$COROFFS= 0
##$CY= 15
##$DATMOD= 1
##$DC= 0
##$DFILT= <>
##$DTYPP= 0
##$F1P= 0
##$F2P= 0
##$FCOR= 0.5
##$FTSIZE= 32768
##$FT_mod= 6
##$GAMMA= 0
##$GB= 0
##$INTBC= 1
##$INTSCL= 1
##$ISEN= 128
##$LB= 0
##$LEV0= 0
##$LPBIN= 0
##$MAXI= 10000
##$MC2= 0
##$MEAN= 0
##$ME_mod= 0
##$MI= 0
##$NCOEF= 0
##$NC_proc= -8
##$NLEV= 6
##$NOISF1= 0
##$NOISF2= 0
##$NSP= 0
##$NTH_PI= 0
##$NZP= 0
##$OFFSET= 14.98509
##$PC= 1
##$PHC0= 68.91174
##$PHC1= 0
##$PH_mod= 1
##$PKNL= yes
##$PPARMOD= 0
##$PPDIAG= 0
##$PPIPTYP= 0
##$PPMPNUM= 2147483647
##$PPRESOL= 1
##$PSCAL= 4
##$PSIGN= 0
##$PYNMP= <proc.py>
##$REVERSE= no
##$SF= 400.02
##$SI= 32768
##$SIGF1= 0
##$SIGF2= 0
##$SINO= 400
##$SIOLD= 32768
##$SPECTYP= <>
##$SREGLST= <1H.CDCl3>
##$SSB= 0
##$STSI= 32768
##$STSR= 0
##$SW_p= 8223.68421052631
##$SYMM= 0
##$S_DEV= 0
##$TDeff= 65536
##$TDoff= 0
##$TI= <>
##$TILT= no
##$TM1= 0
##$TM2= 0
##$TOPLEV= 0
##$USERP1= <user>
##$USERP2= <user>
##$USERP3= <user>
##$USERP4= <user>
##$USERP5= <user>
##$WDW= 1
##$XDIM= 32768
##$YMAX_p= 465573107
##$YMIN_p= -834276
##$CURPLOT= <Network HP LaserJet P1505>
##$CURPRIN= <$Network HP LaserJet P1505>
##$DFORMAT= <normdp>
##$LAYOUT= <+/1D_H.xwp>
##$LFORMAT= <normlp>
##$PFORMAT= <normpl>
##$SURQMSG= 1
$$ End of Bruker specific parameters
$$ ---------------------------------
##NTUPLES= NMR SPECTRUM
##VAR_NAME=  FREQUENCY,     SPECTRUM/REAL,   SPECTRUM/IMAG
##SYMBOL=    X,             R,               I
##VAR_TYPE=  INDEPENDENT,   DEPENDENT,       DEPENDENT
##VAR_FORM=  AFFN,          ASDF,            ASDF
##VAR_DIM=   32768,         32768,           32768
##UNITS=     HZ,            ARBITRARY UNITS, ARBITRARY UNITS
##FACTOR=    0.250966925370066, 1,           1
##FIRST=     8223.43324360094, 35436,        161001
##LAST=      0,             25349,           -30237
##MIN=       0,             -834276,         0
##MAX=       8223.43324360094, 465573107,    0
$$ Real data points
##PAGE= N=1
##DATA TABLE= (X++(R..R)), XYDATA
$$ [...]
19540E3424k6383e9552D2988b12238d9973I401Q8049b0250j72597j59655J74298
$$ 53424 27041 -59552 42988 -212238 -49973 9401 97450 -20250 -192847 -352502 -178204
19529a78204D7402b16048J02147C38038h068j41022F0034b15342B7692J8127a05181
$$ -178204 47402 -216048 -113901 338038 -8068 -149090 60034 -215342 27692 45819 -105181
19517b41356l227a7823j2197r1419j5206D3207M5256c8113A42013m2291a56522
$$ -241356 -244583 -17823 -30020 -121439 -136645 43207 88463 -38113 142013 99722 -156522
19505a4382I627b22575R6681J4464d598k8839j07213I5862a48897b9698j69970
$$ -14382 9627 -222575 -125894 -111430 -4598 -33437 -140650 95862 -148897 -29698 -199668
19494a99668K2807j35362A14183c2757l35303A42555L4074G8239h8392B6317b08199
$$ -199668 -176861 -312223 114183 -32757 -368060 142555 176629 78239 -88392 26317 -208199
19482A62914A5587J38362c88442A2569a66478A20933c10564k1284A08344K16623
$$ 162914 15587 153949 -388442 12569 -166478 120933 -310564 -331848 108344 324967
19472C24967e9388n3462N963L4654J172D9773b44104j47826e2677o7630n8246
$$ 324967 -59388 -112850 -106887 -72233 -71061 49773 -244104 -391930 -52677 -120307 -178553
19461a78553A99677q6958P9824H8305K88655a75106k3030m7705e7273j35452a9896
$$ -178553 199677 112719 192543 88305 376960 -175106 -198136 -245841 -57273 -192725 -19896
19449b8751p6149j34218c1907j23247c0979G4707a41976B0615a11605A70999a01061
$$ -28751 -104900 -239118 -31907 -155154 -30979 74707 -141976 20615 -111605 170999 -101061
19437e2985B10645B1643b14675j62701D7555L43912G3367b56058h9034F9639a61533
$$ -52985 210645 21643 -214675 -377376 47555 391467 73367 -256058 -89034 69639 -161533
19425a66912j36979A3237b08567N002e4563j61484n227J04123j72334P7891A16697
$$ -166912 -303891 13237 -208567 -203565 -54563 -216047 -221274 -117151 -289485 -211594 116697
19413f7375p6458B46697D7640b46882i626B2083Q2676B1510b18939a9070o5967
$$ -67375 -143833 246697 47640 -246882 -9626 22083 104759 21510 -218939 -19070 -85037
19402h5037l56458B2446b31608J03627e0926K2586C511a0330k1918D08903i2201
$$ -85037 -441495 22446 -231608 -127981 -50926 -28340 3511 -10330 -32248 408903 -92201
19390D15545A43826J73202b69400E9120a34624a2140A87936c35410A1251g6330
$$ 415545 143826 317028 -269400 59120 -134624 -12140 187936 -335410 11251 -76330
19379G4385d6039A57002g5418a574A88948c35135B79695e6966H3157L29818j32534
$$ 74385 -46039 157002 -75418 -1574 188948 -335135 279695 -56966 83157 412975 280441
19368B80441D5802b18038j57532i2654D1394J94660a86137r7480K5447J2752R6546
$$ 280441 45802 -218038 -375570 -92654 41394 236054 -186137 -283617 -258170 -245418 -148872
19357a48872E9529J50640c03158J39933k17884a04484b2724B2888K5460i7273
$$ -148872 59529 210169 -303158 -163225 -381109 -104484 -22724 22888 48348 -97273
19346a493j05515N877j4827o0544p9066j13270i5286j5257d965C08600C4521J1061
$$ -1493 -107008 -101131 -115958 -176502 -255568 -368838 -95286 -110543 -4965 308600 34521 45582
19334D5582N8428b92139j25891a74487j69909F889i4797k41315a33698B42324
$$ 45582 104010 -292139 -418030 -174487 -344396 6889 -94797 -336112 -133698 242324
19323c00839a30020F311K4111b83695a40544B24664G3668g9602b8413r8821j26209
$$ -300839 -130020 6311 30422 -283695 -140544 224664 73668 -79602 -28413 -127234 -253443
19312b53443F6523j4710b98113c4389A6995i639j06815l5577j65501J2614J06872
$$ -253443 66523 51813 -298113 -34389 16995 -9639 -116454 -152031 -317532 -304918 -198046
19301a98046c1191B14370J16407a44051K4704n0645A13972a3515p0837j30882
$$ -198046 -31191 214370 330777 -144051 -119347 -169992 113972 -13515 -84352 -215234
19291b15234C2519a50517I0633c43591A5624J57911b78884D5216d85716K38218
$$ -215234 32519 -150517 90633 -343591 15624 173535 -278884 45216 -485716 -247498
19281b47498j32883O643A62563b26416b1134E9868D0Q9653a51803A53216m4438
$$ -247498 -380381 -373738 162563 -226416 -21134 59868 40 89693 -151803 153216 108778
19270A08778d47682J88311k9416A81989a22164A4220a31884M4066A75034g6210
$$ 108778 -447682 -259371 -288787 181989 -122164 14220 -131884 -87818 175034 -76210
19259D1253c22253i8684j1553k57209D4200j3208d6396A56460E6204b81187d9424
$$ 41253 -322253 -98684 -110237 -367446 44200 30992 -46396 156460 56204 -281187 -49424
19247d32643a6648l9340k01835B01200a55663B29658k0169a08496F6302a17124
$$ -432643 -16648 -55988 -257823 201200 -155663 229658 209489 -108496 66302 -117124
19236A31796a38574H4052B9812P9840a01310A03771b67877D298O5298J06078c86914
$$ 131796 -138574 84052 29812 109652 -101310 103771 -267877 4298 69596 175674 -386914
19224b29527A96225a6270o916r992q9641c1621A54556k6386M0855O698G2713P0065
$$ -229527 196225 -16270 -23186 -33178 -122819 -31621 154556 128170 169025 175723 72713 142778
19212A42778a66300B0631I322a90038d7872D4055a98616L0232l5116f540B9961
$$ 142778 -166300 20631 9322 -190038 -47872 44055 -198616 -168384 -203500 -6540 29961
19200A87808i8956a3219I3623g9660n2812B44396f1098C0301a65266h1169j38172
$$ 187808 -98956 -13219 93623 -79660 -132472 244396 -61098 30301 -165266 -81169 -219341
19189b19341j17226J61251D8073K71140D0682K27554l5871b77075A54539a97873
$$ -219341 -336567 -175316 48073 319213 40682 268236 232365 -277075 154539 -197873
19178c06457R3847B1852e1888C8027J09427a50955C7384b05514N2281B75838b03342
$$ -306457 -212610 21852 -51888 38027 147454 -150955 37384 -205514 -153233 275838 -203342
19166d03295B87670a13591C08129c9408G3207a35428N3474q258j29312i9031l55352
$$ -403295 287670 -113591 308129 -39408 73207 -135428 -81954 -90212 -219524 -99031 -454383
19155d54383H1589M2254G659b36975A23871a59576j45961A65743a17321F0601
$$ -454383 81589 123843 7659 -236975 123871 -159576 -305537 165743 -117321 60601
19144g3076m129m6846n0854C3300a21380H423a0825r6823a9835C61992G0510b55293
$$ -73076 -77205 -124051 -174905 33300 -121380 8423 -10825 -107648 -19835 361992 70510 -255293
19131G4965a81590q1029a2996r0483j40800P3274H311J03976a07667J229d2638
$$ 74965 -181590 -262619 -12996 -103479 -244279 -171005 8311 112287 -107667 -106438 -42638
19119G3403J5625a05197k01751c0929p1894l8831A33782a89615c8448j80614k5400
$$ 73403 89028 -105197 -306948 -30929 -102823 -141654 133782 -189615 -38448 -219062 -244462
19108b44462A14263a31507B15632D8853a51883D72133c02540K9237C2865N4504
$$ -244462 114263 -131507 215632 48853 -151883 472133 -302540 -273303 32865 87369
19098H7369a26917A6543f0422j33278e508F0053J11202c02113f4101q4637J77
$$ 87369 -126917 16543 -60422 -193700 -5508 60053 171255 -302113 -64101 -148738 -148561
19087a48561L071O3888J0729K9516c207A65715L0888I1269g4478A64472l985b03642
$$ -148561 -145490 -81602 -70873 -41357 -3207 165715 196603 91269 -74478 164472 160487 -203642
19074c3647j7163b534k75859O3665J04907A21073B5797f9355A34244K4671L3443
$$ -33647 -50810 -2534 -278393 -214728 -109821 121073 25797 -69355 134244 158915 192358
19063A92358a55244A45344b56435o84L3359O4897e4328G2877i9479A08548c67816
$$ 192358 -155244 145344 -256435 -257119 -223760 -158863 -54328 72877 -99479 108548 -367816
19051F1991b2116F2020a71781G7969N3748a68691k4147j16009G7001B2247b5124
$$ 61991 -22116 62020 -171781 77969 131717 -168691 -192838 -308847 77001 22247 -25124
19039a47072N3211j4866N2077k74839A99772e7351k00573B84482b819H7382L8432
$$ -147072 -93861 -108727 -56650 -331489 199772 -57351 -257924 284482 -2819 87382 125814
19028A25814M9410m4081L2097a50590H8886B7942d4964A74331O5680b99231B3534
$$ 125814 175224 131143 163240 -150590 88886 27942 -44964 174331 240011 -299231 23534
19016B20578b31186B33115r4376N0617b45096a05975c1856B81411a71945g9909
$$ 220578 -231186 233115 138739 189356 -245096 -105975 -31856 281411 -171945 -79909
19005A55110h3415p5484B62370H1063f52j96654j09760A96792k6028l83l4500
$$ 155110 -83415 -158899 262370 81063 -652 -197306 -307066 196792 170764 170381 135881
18994A35881a26013L5431j46024B17890I454L44895a07160A49249b28340B4546
$$ 135881 -126013 -90582 -236606 217890 9454 354349 -107160 149249 -228340 24546
18983b91165a3458F115b42239E336J32916a45681C36919b44362f9125F4b3949
$$ -291165 -13458 6115 -242239 5336 138252 -145681 336919 -244362 -69125 64 -23949
18971D0409j8187d3448j51211i700l4836j25726P5408l43786E6942j463J32676
$$ 40409 22222 -43448 -194659 -9700 -44536 -170262 -94854 -438640 56942 55479 188155
18960A88155c10689B16839b15283G9381B8114A547a53390R860p3218B65135a17665
$$ 188155 -310689 216839 -215283 79381 28114 1547 -153390 -143530 -216748 265135 -117665
18948A92174e5781K2294j13137B51823a64461G7116d51607C7193i7990G3404e6401
$$ 192174 -55781 -33487 -146624 251823 -164461 77116 -451607 37193 -97990 73404 -56401
18936A09701a4857C2470b65701B17593a04182j29895P3q511N7219g8256b5823
$$ 109701 -14857 32470 -265701 217593 -104182 -234077 -234004 -242515 -185296 -78256 -25823
18924g8244H7085e8594k8766B66048f8559j44366L0902C22725p9211a75885C5677
$$ -78244 87085 -58594 -87360 266048 -68559 -212925 -182023 322725 243514 -175885 35677
18912a1662k14965R1434d023j68845G9631a82461j80692a8856l0621q7532E8547
$$ -11662 -226627 -135193 -4023 -172868 79631 -182461 -363153 -18856 -49477 -137009 58547
18900a79812g6411A33048L8238C665O2768d0042p3081M9760H9678b93719A87939
$$ -179812 -76411 133048 171286 3665 66433 -40042 -113123 -63363 89678 -293719 187939
18888e7355A23812g5620K4024k97975J31936P8084A34402J28k4195N2558c43776
$$ -57355 123812 -75620 -51596 -349571 -217635 -139551 134402 134530 110335 162893 -343776
18876F5534c01601K835I8374O5371a07454M8654j66455l028A30140P3301a89296
$$ 65534 -301601 -298766 98374 163745 -107454 -58800 -225255 -228283 130140 203441 -189296
18864A88786b22256N1310A0112i0549B8290a99G3747b51625f0506B70490J61994
$$ 188786 -222256 -170946 10112 -90549 28290 -199 73747 -251625 -60506 270490 432484
18853D32484H1595j8173K78313A12373a44218B00081G5753Q7191b5129A21444
$$ 432484 81595 63422 341735 112373 -144218 200081 75753 162944 -25129 121444
18842A32432K8762b32619h8131g03o9890q0414A04620a0288l58934a22475l3334
$$ 132432 161194 -232619 -88131 -703 -70593 -151007 104620 -10288 -369222 -122475 -155809
18831a55809o3817k06556A83906a29727F6335f1433j5334k9091L1129F3772d6006
$$ -155809 -219626 -426182 183906 -129727 66335 -61433 -76767 -105858 -74729 63772 -46006
18819F2239h3325j48295h673A23679J17764a70452D77429a77703B06243a16598
$$ 62239 -83325 -231620 -8673 123679 241443 -170452 477429 -177703 206243 -116598
18808A90521g7367B66289E1912h7489e14p786B06921c7187l6400r8994N9113a648
$$ 190521 -77367 266289 51912 -87489 -514 -8300 206921 -37187 -73587 -172581 -113468 -1648
18795b41784A59081k904F6004a03076j16863I1479h0290m6140B46778a58093b7506
$$ -241784 159081 156177 66004 -103076 -219939 91479 -80290 -126430 246778 -158093 -27506
18783a56001f9042k31384d5810I1285L140D06c32609B26135b65170C8077a5218
$$ -156001 -69042 -300426 -45810 91285 94425 406 -332609 226135 -265170 38077 -15218
18771I8805b7083k31368O1747M4478K086C4479a25506A1104b47499k37197C30544
$$ 98805 -27083 -258451 -196704 -152226 -150140 34479 -125506 11104 -247499 -484696 330544
18759a93398e5385j04230A15992p236l7634J8864b92325B5535e4998J4222Q677
$$ -193398 -55385 -159615 115992 108756 71122 89986 -292325 25535 -54998 -40776 -32099
18748c2099k92838G1806a47163E8195b24388B64831e2744m90888H4707k4190a01590
$$ -32099 -324937 71806 -147163 58195 -224388 264831 -52744 -543632 84707 60517 -101590
18736B07265a6547A41212c4433j7087A0024a12439j5242m3983c3192C08377a9759
$$ 207265 -16547 141212 -34433 -51520 10024 -112439 -127681 -171664 -33192 308377 -19759
18724a93603B57721l9074a17268D03602j60435d51570B14434c3358j12066m5718
$$ -193603 257721 218647 -117268 403602 243167 -451570 214434 -33358 -145424 -191142
18714a91142o5069f3763K8571o3328K9012A02577m4561a32871B33506m6302f174
$$ -191142 -256211 -63763 -35192 -98520 -69508 102577 58016 -132871 233506 187204 -6174
18702c0536l8105c857A47942f3995m8045M2791j10090F6702B6016b21396a1418
$$ -30536 -68641 -3857 147942 -63995 -112040 -69249 -179339 66702 26016 -221396 -11418
18690G4704a89139A09553c0721A26453a16111d1270k54398L9172f8772D09328
$$ 74704 -189139 109553 -30721 126453 -116111 -41270 -295668 -256496 -68772 409328
18679A51308a8843l21154f139k51270d4948k14619d0009o3864M6150r0566n518
$$ 151308 -18843 -339997 -6139 -257409 -44948 -259567 -40009 -103873 -57723 -148289 -153807
18668a53807A27230b16214D6087c61725a20029k71070J62494E8250a27620H229
$$ -153807 127230 -216214 46087 -361725 -120029 -391099 -228605 58250 -127620 8229
18657A14849E6705e29487b04667c0528H7666a74433C03080b07601j08927a08409
$$ 114849 56705 -529487 -204667 -30528 87666 -174433 303080 -207601 -316528 -108409
18646I5606m1441a43525A55456K13477G5593f3025B21709c22559a28386k5549
$$ 95606 54165 -143525 155456 368933 75593 -63025 221709 -322559 -128386 -153935
18636a53935A772N0161K44084a86095O8785j80053e5906B3016a14995j2436A20686
$$ -153935 1772 51933 296017 -186095 -117310 -297363 -55906 23016 -114995 -127431 120686
18624h9644p3724j9022G6716a44867A32952b88958J43845d144k35577A40465C3723
$$ -89644 -163368 -182390 76716 -144867 132952 -288958 -145113 -4144 -239721 140465 33723
18612b58586A29050j6740d0086j9864a6819q6270A18728B1391P092c72547c6012
$$ -258586 129050 112310 -40086 -59950 -16819 -103089 118728 21391 28483 -372547 -36012
18600A77429q4919b78717A1255K41012b79517a8473r5650A71822a75105j29815
$$ 177429 92510 -278717 11255 252267 -279517 -18473 -114123 171822 -175105 -304920
18590c04920a50889A42695k5275b18034O0217C504d4263N234G0136b73496C02282
$$ -304920 -150889 142695 117420 -218034 -157817 3504 -44263 -39029 70136 -273496 302282
18578a84336o6285A14357D4604a14111A49896h9070a7622o0659A16904g7611B91198
$$ -184336 -250621 114357 44604 -114111 149896 -89070 -17622 -78281 116904 -77611 291198
18566F2171B8763a17499j07547h88k57681A98259l7496P7864a50628L9631N0370
$$ 62171 28763 -117499 -225046 -888 -258569 198259 160763 238627 -150628 -110997 -60627
18555f0627B49580c92245b5984l59250f3106o8969E5691b05900C3773a02106D8240
$$ -60627 249580 -392245 -25984 -385234 -63106 -132075 55691 -205900 33773 -102106 48240
18543d29690C2643i333k58158l3933a8198j40649A35503E7050a36953B31951b0383
$$ -429690 32643 -9333 -267491 -301424 -18198 -158847 135503 57050 -136953 231951 -20383
18531b55056g6378B30419a23060K8415A76249b01827g2152c2631j11282o9985
$$ -255056 -76378 230419 -123060 -94645 176249 -201827 -72152 -32631 -143913 -213898
18521b13898J7548A28522b3197A57958J53562f8694j1737B08103f0056j25425
$$ -213898 -196350 128522 -23197 157958 311520 -68694 -80431 208103 -60056 -185481
18511a85481B15481a08411c9848O115j16396O131q3376q43o3828e3551L805B0443
$$ -185481 215481 -108411 -39848 -33733 -150129 -143998 -227374 -228217 -292045 -53551 -49746 20443
18498D5828a30400j06881A72627C780d13978J63998B40690c72476A35122J28626
$$ 45828 -130400 -237281 172627 3780 -413978 -249980 240690 -372476 135122 263748
18488B63748a05934F6995p347b66753O8451K1670j1259B92834d42086a51368H7364
$$ 263748 -105934 66995 59648 -266753 -198302 -176632 -187891 292834 -442086 -151368 87364
18476b94312a46528j79414A45102c4741B17634f8028D9983a13094c7010C2102
$$ -294312 -146528 -325942 145102 -34741 217634 -68028 49983 -113094 -37010 32102
18465C15702f5065j93514d6404A15577C8503L0088M359O6322a41623j2357g5656
$$ 315702 -65065 -258579 -46404 115577 38503 68591 72950 139272 -141623 -153980 -75656
18453A77938o1134m9289A7829F887h0191k266k04009A56568D7466d7166D12603
$$ 177938 116804 67515 17829 6887 -80191 -82457 -286466 156568 47466 -47166 412603
18441h271o3654B3027a03259B15707c2361D8000O6403j7771g5737k63028h9782
$$ -8271 -71925 23027 -103259 215707 -32361 48000 114403 96632 -75737 -338765 -89782
18429a21285j47868b947k6793j8507a312j32507A21554f2925m51799H1168i7060
$$ -121285 -269153 -2947 -29740 -48247 -1312 -133819 121554 -62925 -514724 81168 -97060
18417c38735A04109J0861g6716A66698d51724C88617A33798a37804q2544G5333
$$ -338735 104109 114970 -76716 166698 -451724 388617 133798 -137804 -220348 75333
18406A13179j8161J16984a90384A30883L4687p9878a69823O2463C1049K1569b27629
$$ 113179 95018 212002 -190384 130883 165570 85692 -169823 -107360 31049 52618 -227629
18394i271j80550P5546j18411A7949J38423a69487c8134J1467o2362j92674a27350
$$ -9271 -189821 -114275 -232686 17949 156372 -169487 -38134 -26667 -89029 -281703 -127350
18382b6237k85924B28546d49900G7880a41803h568n4342b4449F8347d32838J83909
$$ -26237 -312161 228546 -449900 77880 -141803 -8568 -62910 -24449 68347 -432838 -248929
18371b48929B71540g0431l273b8403G1163J33783i9780o7837B25351b18599I7259
$$ -248929 271540 -70431 -73704 -28403 71163 204946 -99780 -167617 225351 -218599 97259
18359F3143b19583J8157C22327a98329k29796b6159j02870A03528f4472j18080
$$ 63143 -219583 -201426 322327 -198329 -428125 -26159 -129029 103528 -64472 -182552
18349a82552K5157A34446a33283C2525b00046i0621j01757B17863a00317q0028
$$ -182552 -157395 134446 -133283 32525 -200046 -90621 -192378 217863 -100317 -180345
18339a80345I6752a09166I9483j9402N2493e3266q0357m1196N5147n6061F2658
$$ -180345 96752 -109166 99483 80081 132574 -53266 -133623 -174819 -119672 -175733 62658
18327e54l69355A2984a3405F2891J6684R9196L1767D7199K70334D5971j4566a20661
$$ -554 -369909 12984 -13405 62891 79575 178771 210538 47199 317533 45971 31405 -120661
18314a98394a2093A79030f7263b5693j82334q293m6569A76441F8046b37820B11911
$$ -198394 -12093 179030 -67263 -25693 -208027 -216320 -262889 176441 68046 -237820 211911
18302a22819M6163H9890e02381B24863o5498a48185N2088A98849r6453e6609G7771
$$ -122819 -76656 89890 -502381 224863 159365 -148185 -96097 198849 102396 -56609 77771
18290I9481d6156m41423J97730A98665n7708c4677l84077A17360b395F21c46456
$$ 99481 -46156 -487579 -289849 198665 140957 -34677 -418754 117360 -2395 621 -346456
18278C34184a62453B04544p6649k4777i3917o2744L1183D7583b05831C2607b46426
$$ 334184 -162453 204544 127895 103118 -93917 -156661 -125478 47583 -205831 32607 -246426
18266a75409B04057j9936e8068o8616B15954m0809c23372J27125A52650g9762
$$ -175409 204057 184121 -58068 -126684 215954 175145 -323372 -196247 152650 -79762
18255A15297f0494A31247b79714b4079l9231A47679b00892C99074b75691B21787
$$ 115297 -60494 131247 -279714 -24079 -63310 147679 -200892 399074 -275691 221787
18244e2475j32130A15180b71443B54530A02437C3997b35569C6265Q8430n7207
$$ -52475 -184605 115180 -271443 254530 102437 33997 -235569 36265 124695 67488
18234F7488c0626J5046A51546b14117g5540G8952k284M2848a73559b0453q3923
$$ 67488 -30626 -15580 151546 -214117 -75540 78952 76668 119516 -173559 -20453 -104376
18223a04376k650j38317A56777h8396J8310p848p4591I535a4300q2552B21522
$$ -104376 -107026 -245343 156777 -88396 -70086 -77934 -152525 9535 -14300 -96852 221522
18211A3243K07727p5870b2283B81006g7583E7408f8605F9536A1556a85723K1084
$$ 13243 220970 145100 -22283 281006 -77583 57408 -68605 69536 11556 -185723 -164639
18200a64639B54541a10760K248k2935j18427d0310j2776A38610D6431a68365j73359
$$ -164639 254541 -110760 -108512 -131447 -249874 -40310 -53086 138610 46431 -168365 -341724
18189c41724a4667C42502d8867C8026N5723A1423a40792j29751E4650J48068J18021
$$ -341724 -14667 342502 -48867 38026 93749 11423 -140792 -270543 54650 202718 320739
18178C20739c57201a17105q9724k3897a6074B24388c90159d5163I4542b4912E2020
$$ 320739 -357201 -117105 -206829 -230726 -16074 224388 -390159 -45163 94542 -24912 52020
18166A20551C6587A0329b44177F0294a44320l7429e9506D3663h8980C46074c09813
$$ 120551 36587 10329 -244177 60294 -144320 -181749 -59506 43663 -88980 346074 -309813
18154h3352A98586d5064E8593a05142D8731d3220k63461A31067d00550B68027
$$ -83352 198586 -45064 58593 -105142 48731 -43220 -306681 131067 -400550 268027
18143C11788j43556n1765b92627A08090K6824d6041j04490m2341H8516k6579O7244
$$ 311788 168232 116467 -292627 108090 134914 -46041 -150531 -192872 88516 61937 129181
18132A29181b19342j06743a48649k59758E3720J34044E1625b46114I8755i7173
$$ 129181 -219342 -326085 -148649 -408407 53720 187764 51625 -246114 98755 -97173
18121c70741C6214a29257j38124b7561D11430E6511a6791G5809a86739d3288D7163
$$ -370741 36214 -129257 -267381 -27561 411430 56511 -16791 75809 -186739 -43288 47163
18109a1520A37120f6370C3665a52572B7176K15522a24212D5739i3203l8948N9501
$$ -11520 137120 -66370 33665 -152572 27176 242698 -124212 45739 -93203 -132151 -72650
18098g2650l9141j39712R8599A40472d07347H6023J87155E0021j4282a7549j19563
$$ -72650 -111791 -251503 -152904 140472 -407347 86023 273178 50021 35739 -17549 -137112
18087a37112o5017D9069f8724b9487r1926m2638c0460j0123A00647a05412A94424
$$ -137112 -202129 49069 -68724 -29487 -121413 -164051 -30460 -40583 100647 -105412 194424
18075b08746g2633B04431I1688L9420b2364j2435M080A01988E974P1058i5393
$$ -208746 -72633 204431 91688 131108 -22364 -34799 -30719 101988 5974 77032 -95393
18063e6858J1771E69327d3743k6424j21494G4140a66242c1268k27661H4229k1928
$$ -56858 -45087 569327 -43743 -70167 -191661 74140 -166242 -31268 -258929 84229 62301
18052F2301a06306J335r5980q6165B27906c44058E5735a0965l41934d7164b0046
$$ 62301 -106306 -104971 -200951 -287116 227906 -344058 55735 -10965 -352899 -47164 -20046
18040d2150o6757A80383a39144o8315A54518A2028L39188i3765a5121p3647A43995
$$ -42150 -108907 180383 -139144 -207459 154518 12028 351216 -93765 -15121 -88768 143995
18028b46279a5542q6684A95114b02732B80431b3335j76038G1627a17553j42760
$$ -246279 -15542 -102226 195114 -202732 280431 -23335 -199373 71627 -117553 -260313
18018b60313J27105j15936l4907A56373c38971B41710b8411j20764A17239Q0970
$$ -260313 -133208 -249144 -284051 156373 -338971 241710 -28411 -149175 117239 198209
18008A98209q0664C4638a4749C2774R0462b44198A63333J01614N5830A25313c20246
$$ 198209 117545 34638 -14749 32774 123236 -244198 163333 264947 320777 125313 -320246
17996a94739e9741j8318A99598h3731k02333K0409o6331G8102k5843d2199p0044
$$ -194739 -59741 -78059 199598 -83731 -286064 -265655 -331986 78102 52259 -42199 -112243
17985a12243E0215J74372O5883j19249m4651F1909c33142J66193H0141N2355a47780
$$ -112243 50215 224587 290470 171221 126570 61909 -333142 -166949 80141 132496 -147780
17973b03518j59103A18003a6858l7215k13476O4636e7879e532m3468j00281a8021
$$ -203518 -362621 118003 -16858 -54073 -267549 -202913 -57879 -5532 -49000 -149281 -18021
17961B167g6390r0583G9703K73412i8607L3902A91894H9044a22659b006l05245
$$ 2167 -76390 -166973 79703 353115 -98607 -64705 191894 89044 -122659 -2006 -307251
17950c07251g8525A78670h7501l15137H045h4897A32444M7597b14180D02400j17715
$$ -307251 -78525 178670 -87501 -402638 8045 -84897 132444 180041 -214180 402400 284685
17939B84685A04473c8457j41155d2513l6086a3244k23833B16444c06719f5444
$$ 284685 104473 -38457 -179612 -42513 -78599 -13244 -237077 216444 -306719 -65444
17928a03643L4251b8821A01511i4004k23943a56182A5700J80506j5020i713k37575
$$ -103643 -69392 -28821 101511 -94004 -317947 -156182 15700 196206 181186 -9713 -247288
17917b47288A17949L1243a81879h3090O261o9620m2960c4656A44087D427a50655
$$ -247288 117949 149192 -181879 -83090 -76829 -146449 -189409 -34656 144087 4427 -150655
17905c36620B012b73992E2457b2303p0538A33522e4188j20347B0627b9486A6743
$$ -336620 2012 -273992 52457 -22303 -92841 133522 -54188 -174535 20627 -29486 16743
17893A65781D4505b52627C8435K68215e5578A03621o701a1602l1628A07308b13257
$$ 165781 44505 -252627 38435 306650 -55578 103621 96920 -11602 -43230 107308 -213257
17881B81789b51844j519a3611C9008c78193f5604A97595E7962Q8112i8544A17639
$$ 281789 -251844 -253363 -13611 39008 -378193 -65604 197595 57962 146074 -98544 117639
17869b6728A19554D0214h854A83691a38608M5662j1620B05691c6647B41878d2796
$$ -26728 119554 40214 -8854 183691 -138608 -92946 -104566 205691 -36647 241878 -42796
17857H1738C6751G361Q2185O7721c0323j40551C40181m6607j06763E8426a87430
$$ 81738 36751 7361 89546 157267 -30323 -170874 340181 293574 186811 58426 -187430
17845d03974B28488G6590p347C2574p317L39292F699i3834k52919H2826K2117
$$ -403974 228488 76590 69243 32574 25257 364549 6699 -93834 -346753 82826 104943
17834A04943i705A28291b21160P8477j33558o9078g9016c165B75430k6229a40350
$$ 104943 -9705 128291 -221160 -142683 -276241 -345319 -79016 -3165 275430 249201 -140350
17822A07058b3372l03888J08889l55762B63719D0640c1623j05961O6509k3310
$$ 107058 -23372 -327260 -218371 -574133 263719 40640 -31623 -137584 -71075 -94385
17812i4385d2277B33873a41328A78329K8708F565g7943n6214H1403f7219C48892
$$ -94385 -42277 233873 -141328 178329 207037 6565 -77943 -134157 81403 -67219 348892
17800h8679H9745a82983L8125E55943A38768c68200C5191d6726o4750A76744A2616
$$ -88679 89745 -182983 -144858 555943 138768 -368200 35191 -46726 -111476 176744 12616
17788B27737b94569F1607f4597q6525A17997K32691B2766a08222j62084a04924
$$ 227737 -294569 61607 -64597 -151122 117997 350688 22766 -108222 -270306 -104924
17777g1278b5289B30419q2147b35636H2303k1595B824b07261P2122J8892a3608
$$ -71278 -25289 230419 148272 -235636 82303 60708 2824 -207261 -135139 -116247 -13608
17765g8473D0369M9999b07376B60336E9219a91212E4651J67700F8739K9666d312
$$ -78473 40369 90368 -207376 260336 59219 -191212 54651 222351 68739 98405 -4312
17753C71718b56591D8452J32023h9185D7210J38112j505c4600E0566a97235I0000
$$ 371718 -256591 48452 180475 -89185 47210 185322 183817 -34600 50566 -197235 90000
17741A71299p2085c01481c610D16884f4576B50598a39362a7730E2582J13331i1319
$$ 171299 99214 -301481 -3610 416884 -64576 250598 -139362 -17730 52582 165913 -91319
17729A56686a02241B28850B8186c42608Q7231A54192b94868L2655R7285A47845
$$ 156686 -102241 228850 28186 -342608 -255377 154192 -294868 -262213 -164928 147845
17718G9468a38312B02514O2823F5472a1541E6429R1652c6275D6493j1735J26158
$$ 79468 -138312 202514 265337 65472 -11541 56429 148081 -36275 46493 34758 160916
17707A60916A4187L24001d7904A03699a58554G5646c9798j13253J99A48388a35316
$$ 160916 14187 338188 -47904 103699 -158554 75646 -39798 -153051 -152852 148388 -135316
17695B45249E6857c7176p651j91957G0479J30301e3781A48465J08445C8726G146
$$ 245249 56857 -37176 -44827 -236784 70479 200780 -53781 148465 256910 38726 7146
17683b10889h0422A13131l9553B9931a06476F7941h0012k09516c0766n6076n4950
$$ -210889 -80422 113131 73578 29931 -106476 67941 -80012 -289528 -30766 -86842 -141792
17672a41792e4551A62626a5251B1859d1198E7497K30496n9613C9978b19496b3572
$$ -141792 -54551 162626 -15251 21859 -41198 57497 287993 228380 39978 -219496 -23572
17660A18747J2165a60162f06I4962P8436h6669B8310i4866D1638a29494e9843
$$ 118747 130912 -160162 -606 94962 173398 -86669 28310 -94866 41638 -129494 -59843
17648E735a51872I9386b79240g0674k51944J42244C5677h8677A01898J10250g6590
$$ 5735 -151872 99386 -279240 -70674 -322618 -180374 35677 -88677 101898 212148 -76590
17636a42113A92129G9932k5347a243o4420j222k40447L9061C3939J82254i1650
$$ -142113 192129 79932 54585 -1243 -65663 -66885 -307332 -268271 33939 216193 -91650
17624F5289K93435A00038G501c0556A3065i3061B3700M4810a49178A9425J7584
$$ 65289 358724 100038 7501 -30556 13065 -93061 23700 68510 -149178 19425 37009
17613C7009K67934f7288H2505d8201l9127n3552d9728j71425F8308b14790e2626
$$ 37009 304943 -67288 82505 -48201 -87328 -140880 -49728 -221153 68308 -214790 -52626
17601a79978h5226C19443i0804A866h2098A50731d3366k50703G7501c2187m8728
$$ -179978 -85226 319443 -90804 1866 -82098 150731 -43366 -294069 77501 -32187 -80915
17590h0915A1982g4669A00979c98415H689J24643m3416K3391k6647a1638A69593
$$ -80915 11982 -74669 100979 -398415 8689 133332 89916 113307 86660 -11638 169593
17578A21089J32584h9173c3743j51495A6055b02655h0531K58r5478O991k853B27887
$$ 121089 253673 -89173 -33743 -185238 16055 -202655 -80531 -80273 -175751 -168760 -171613 227887
17565A49494G4476q41P8858k2350b36380d9068B0938J78560e8761j75131H9298
$$ 149494 74476 73635 152493 130143 -236380 -49068 20938 199498 -58761 -233892 89298
17553a30489c1468D27628i3421A47158g1070j49082i5216B49957g6445j81516
$$ -130489 -31468 427628 -93421 147158 -71070 -220152 -95216 249957 -76445 -257961
17543b57961N3979C24892C7685d2666l5171G5711A7461N0349a11843B23002P7067
$$ -257961 -203982 324892 37685 -42666 -77837 75711 17461 67810 -111843 223002 300069
17532C00069d46876A26143n6129J01111Q2403j09090P3607C0451L57134F2222
$$ 300069 -446876 126143 70014 171125 253528 144438 218045 30451 387585 62222
17521A71256d4220A2610b25428E4784K64117j58358a80944E1206R6002K29917
$$ 171256 -44220 12610 -225428 54784 318901 160543 -180944 51206 147208 377125
17511C77125A65822p5546c55192A24310b8757k09283B54390j06122Q2843B2812
$$ 377125 165822 90276 -355192 124310 -28757 -238040 254390 148268 231111 22812
17500b2790r9127L5872H3611K20702j50983m3009K70336A35182D9771a34589B88758
$$ -22790 -121917 -86045 83611 304313 153330 110321 380657 135182 49771 -134589 288758
17488b8444B20849H3250O1829n1586J07154m6801a25872d9643B75039q7131K35879
$$ -28444 220849 83250 145079 93493 200647 153846 -125872 -49643 275039 187908 423787
17477D23787A01650L27901A67221a30852k16746D38969A78251O1951a24057D79462
$$ 423787 101650 429551 167221 -130852 -347598 438969 178251 240202 -124057 479462
17466H0139N5115D3709K61563g9727J1723E5979O7842L70564g1084b6668A20293
$$ 80139 135254 43709 305272 -79727 -68004 55979 123821 494385 -71084 -26668 120293
17454G0845l3466J51598m9553Q8973l214m446f7541B39062k2875J9320D2752L44751
$$ 70845 37379 188977 139424 228397 225183 220737 -67541 239062 216187 235507 42752 387503
17442C87503k0147M5566b809A05185L31183A76620J87451A47842a67312A6268
$$ 387503 367356 412922 -2809 105185 436368 176620 364071 147842 -167312 16268
17431B31115G6857c5314C93866n7141d4962B24716J63383A63891M0364R968k8278
$$ 231115 76857 -35314 393866 336725 -44962 224716 388099 163891 204255 214223 185945
17420A85945N9834O7240j5374A37724m8362K27292L18085A23590P334J65894A27024
$$ 185945 245779 313019 297645 137724 89362 316654 634739 123590 130924 296818 127024
17408B03134J32334A55461j194b28006A02826R3407n0679o4192K03174I5228J34203
$$ 203134 335468 155461 154267 -228006 102826 196233 145554 81362 284536 95228 229431
17397B29431K8041o6674a09000C43563A19387E818a94311B37535J22407j25826
$$ 229431 257472 190798 -109000 343563 119387 5818 -194311 237535 359942 234116
17387B34116B536M38580j82731a81625d7592C63192A39931J61717b7457I0701
$$ 234116 2536 441116 258385 -181625 -47592 363192 139931 301648 -27457 90701
17376B86482j07042H9178j166J91704F9166L40795a01430D44898C1855K83660
$$ 286482 179440 89178 88012 279716 69166 409961 -101430 444898 31855 315515
17366C15515A12388N4745J33944q4736J18774B6611L0183K55873m0599a09321
$$ 315515 112388 167133 301077 216341 335115 26611 56794 312667 272068 -109321
17355b8410H4266K34518j7741A04406K14556A51944L56494k47773f1848A88769
$$ -28410 84266 318784 301043 104406 318962 151944 508438 260665 -61848 188769
17344A82555D7777J91701e8184A77776n9713n5450d5211F7537h1224c1687k4673
$$ 182555 47777 239478 -58184 177776 118063 62613 -45211 67537 -81224 -31687 -56360
17333e6360B170L00789j02165P6447I6444J24879R2792C5925J62945o7010K11474
$$ -56360 2170 302959 200794 277241 96444 221323 314115 35925 198870 131860 343334
17322C43334a72803C88366B7150b31763A10275J44293q4356K18036q0307j2914
$$ 343334 -172803 388366 27150 -231763 110275 254568 170212 388248 307941 295027
17312B95027j22558J82952j66950k3770J5266K182j6991a3793C09018D0642L2008
$$ 295027 172469 355421 188471 164701 179967 182149 165158 -13793 309018 40642 72650
17301G2650c1535C79268A30553n2508J77318J67743q0286j27759J08262A02717
$$ 72650 -31535 379268 130553 78045 255363 423106 342820 215061 323323 102717
17290G8864K31449D7270K57457n8926J24282o0815D0670L47840d7392A86030E110
$$ 78864 310313 47270 304727 245801 370083 309268 40670 388510 -47392 186030 5110
17278A73586O0417a40133B30534A05221J92304c38417B85963j14976a08056F2504
$$ 173586 234003 -140133 230534 105221 297525 -338417 285963 170987 -108056 62504
17267I7456a58681l724C99222a586j55456C56251j48799N9651A07197k3833M1531
$$ 97456 -158681 -162405 399222 -1586 -157042 356251 207452 267103 107197 83364 124895
17256A24895J38634a22713A85864H8559j3931l2072K54475p1973a74791P4287
$$ 124895 263529 -122713 185864 88559 74628 42556 297031 225058 -174791 -100504
17246a00504C13782a85022B07966K52867m7925k691j58709m5098k9142B9139c6797
$$ -100504 313782 -185022 207966 460833 412908 410217 251508 206410 177268 29139 -36797
17234C63299j68293j6609d6827D91722m1536D8906J67586l1585K04712A34217
$$ 363299 195006 178397 -46827 491722 450186 48906 216492 184907 389619 134217
17223G2253d442B46709J56731j06311J9587A04857K9500L15569A80543O7132N1909
$$ 72253 -4442 246709 403440 297129 316716 104857 134357 449926 180543 247675 299584
17212B99584L6606R681q1168m9978K4498J97801F4823K74181A35596L39025j73221
$$ 299584 336190 345871 264703 214725 239223 437024 64823 339004 135596 474621 301400
17201C01400q1492J37073F1022J14067e9540B05651e4243A9782L18206e2549A49142
$$ 301400 219908 356981 61022 175089 -59540 205651 -54243 19782 337988 -52549 149142
17189e3409D64946j08639M40939H0292M79523I0415J38388l6665F0451J96494
$$ -53409 464946 356307 797246 80292 559815 90415 228803 192138 60451 256945
17179B56945G1830L33526p9172p0390a31858A08870K04038j14910M5599M6740
$$ 256945 71830 405356 326184 255794 -131858 108870 312908 197998 243597 290337
17169B90337J48491j09484p6621L81683k66377n6338a18263A80769J59426K0854
$$ 290337 438828 329344 252723 634406 368029 311691 -118263 180769 340195 361049
17159C61049o5267L17119I6882l1922N86454j94280n9321J79640q4649c8902D31872
$$ 361049 295782 612901 96882 64960 651414 457134 397813 577453 492804 -38902 431872
17147C05331i2300D03586K39641E0814K17894O3036k5854q4355F0473L91820A91972
$$ 305331 -92300 403586 643227 50814 268708 331744 305890 221535 60473 452293 191972
17135E83484o2846j87812J74577A79644M62447C2368J52394L84682o6163L3631
$$ 583484 520638 332826 507403 179644 642091 32368 184762 569444 503281 536912
17125E36912o8460k3089P8422j45215j53878M2347A23061K30661J94405A52569
$$ 536912 468452 445363 523785 378570 224692 267039 123061 353722 548127 152569
17114B59386K08350B8470P41909l51976A74654L81197m9666B44352P8694J12828
$$ 259386 467736 28470 770379 418403 174654 555851 506185 244352 323046 435874
17104D35874i9042D04195M1806K15537l19856j0523K70249J53484k99366Q4133
$$ 435874 -99042 404195 446001 661538 341682 331159 601408 754892 455526 539659
17094E39659L32282B38837K70485q7444P0919D9620N46905m3754k27716K94496
$$ 539659 871941 238837 509322 421878 492797 49620 596525 552771 325055 619551
17084F19551k78688L4950j70297N96578n5692k86869o2963M6949R15J35895j11276
$$ 619551 340863 375813 205516 802094 746402 459533 396570 443519 444434 580329 469053
17073D69053A92991L20886l495k19317K89965O6694p2039B47915K15709J0022
$$ 469053 192991 513877 510382 291065 581030 647724 575685 247915 463624 473646
17063D73646m6069L02070k21575o4686J89977j66630L6408K24419l43183L36348
$$ 473646 427577 729647 508072 443386 633363 466733 503141 727560 384377 720725
17053G20725k00346N4448K110j72413K39349m8170o2689j78954m3806M09512B66558
$$ 720725 520379 574827 576937 404524 643873 595703 533014 354060 310254 719766 266558
17041E68410m6802M8120p6501J07149p9332k43352J55572j25664N85549r4573
$$ 568410 521608 569728 493227 600376 521044 277692 433264 307600 893149 798576
17031G98576l68761N0746M30632l17808Q7605m8472j82126R0803L14199k2388
$$ 798576 429815 480561 911193 593385 680990 632518 450392 541195 855394 833006
17021H33006j18126j11280l9052Q1962R9117l01028L46265K50882l00338R9051
$$ 833006 714880 603600 564548 646510 745627 444599 790864 1041746 741408 840459
17011H40459k02407O1921k90118J64531M06506C87411N00085q9681J6998q2955
$$ 840459 638052 699973 409855 574386 980892 387411 887496 797815 814813 731858
17001G31858J56096j50035J10949K73882l11240l38657K08494k42131N48407k86712
$$ 731858 887954 737919 848868 1122750 811510 472853 681347 439216 987623 700911
16991G00911j90977M92123N2024j35361k36165o688J84791j93228O36M48089n2932
$$ 700911 509934 1002057 1054081 918720 682555 675867 860658 667430 668066 1116155 1063223
16980A063223r579j37229J3298k893R6224k60281o1137Q6199Q2692j00968q0073
$$ 1063223 1053644 916415 929713 926820 1023044 762763 701626 787825 870517 769549 689476
16969F89476K90965j3346j39110J39018J14581j2050j93203K86171P3702m4946
$$ 689476 980441 967095 827985 967003 1081584 1069534 876331 1162502 1236204 1191258
16959A191258j80535q4249M00305j28741l08777j3446O070K78061j22498P8338
$$ 1191258 1010723 926474 1326779 1198038 889261 875815 881885 1159946 1037448 1115786
16949A115786J11137K79913J77872l83714J43813p6146O0300J3515k21070M70601
$$ 1115786 1226923 1506836 1684708 1300994 1444807 1368661 1428961 1442476 1221406 1692007
16939A692007m89487N1350K00226m10668J78070J48628l59628N82898r3144l00107
$$ 1692007 1202520 1253870 1454096 1043428 1221498 1370126 1010498 1593396 1500252 1200145
16929A200145M29634q275k09507l00577J53651K7095N38780J57190k01173m60872
$$ 1200145 1629779 1621504 1411997 1111420 1265071 1292166 1830946 1988136 1786963 1326091
16919A326091M81427j00893R0731m57647K10232J88668k30194M27200k95452J88588
$$ 1326091 1807518 1706625 1797356 1339709 1549941 1738609 1508415 1935615 1640163 1828751
16909A828751J4994m79245L64110J92758O4970j48983N9987j22118J2516K7392
$$ 1828751 1843745 1364500 1728610 1921368 1986338 1837355 1897342 1775224 1787740 1815132
16899A815132n1499l3423J00614L38972J30667j43115j14402Q0462l76698M92520
$$ 1815132 1763633 1730210 1830824 2169796 2300463 2157348 2042946 2123408 1746710 2239230
16889B239230j97464J90936Q0369L8790N9971l76841L14665M28816k45366r0739
$$ 2239230 2041766 2232702 2313071 2351861 2411832 2034991 2349656 2778472 2533106 2442367
16879B442367P1985k61599J23982N6944J55243j67196L92813k40499K41488l16358
$$ 2442367 2514352 2252753 2376735 2433679 2588922 2421726 2814539 2574040 2815528 2499170
16869B499170J51885k22581L22065J14885R0002r6325j6693m2148J45532J5120
$$ 2499170 2651055 2428474 2750539 2865424 2955426 2859101 2842408 2800260 2945792 2960912
16859B960912R4149K6034L63139j58855R2266J84457q4955m03754K63239N8253
$$ 2960912 3055061 3081095 3444234 3285379 3377645 3562102 3477147 3073393 3336632 3394885
16849C394885N3207K35662n8667J55921n8159K21692j56929J47524J35827L4932
$$ 3394885 3448092 3683754 3625087 3781008 3722849 3944541 3787612 3935136 4070963 4105895
16839D105895M00492n92568N27840k66204M40900l87008J32626P05900k88648
$$ 4105895 4506387 3913819 4441659 4175455 4616355 4229347 4361973 5067873 4779225
16830D779225L91306m47670L90130j19042p7770N41493M4876L9800l9605K27653
$$ 4779225 5170531 4722861 5112991 4993949 4916179 5457672 5502548 5542348 5502743 5730396
16820E730396j95439L54573R3720j25379K46434J70277L55913n23558P73553L74151
$$ 5730396 5534957 5889530 5983250 5857871 6104305 6274582 6630495 6106937 6880490 7254641
16810G254641k43518K83789J51657j90191L05253J75765K49947J60060Q0757K53853
$$ 7254641 7011123 7294912 7446569 7256378 7561631 7737396 7987343 8147403 8228160 8482013
16800H482013L85366J40633K22112K45547n6294O36749K14906j40242M78929J64651
$$ 8482013 8867379 9008012 9230124 9475671 9419377 10056126 10271032 10130790 10609719 10774370
16790A0774370M40837L76950K57601J50325L25915K84968J45487N83691N50026
$$ 10774370 11215207 11592157 11849758 12000083 12325998 12610966 12756453 13340144 13890170
16781A3890170L21518M30924J55493N71371Q01353Q5090P82045J1454Q06767P48215
$$ 13890170 14211688 14642612 14798105 15369476 16170829 16255919 17037964 17049418 17856185 18604400
16771A8604400N92740O13031R29137K89825R03362O34838R61012J005170P30931
$$ 18604400 19197140 19810171 20739308 21029133 21932495 22567333 23528345 24533515 25264446
16762B5264446Q80589J090687J235757P90733J388864J531184J157209J558235
$$ 25264446 26145035 27235722 28471479 29262212 30651076 32182260 33339469 34897704
16754C4897704J425617J489451J759442J767725K074538K072664K355013J918239
$$ 34897704 36323321 37812772 39572214 41339939 43414477 45487141 47842154 49760393
16746D9760393K412213K886187K701806L275701L180273L622327L788123L534549
$$ 49760393 52172606 55058793 57760599 61036300 64216573 67838900 71627023 75161572
16738G5161572M491056M339825M367609N384918N261822N718190O020534N820225
$$ 75161572 79652628 83992453 88360062 93744980 99006802 104724992 110745526 116565751
16730A16565751O573419O353673O609024P015313O626212O827689O366985O257872
$$ 116565751 123139170 129492843 136101867 143117180 149743392 156571081 162938066 169195938
16722A69195938N817043M902328M363470L172674K438099Q91609L75375j343045
$$ 169195938 175012981 179915309 184278779 187451453 189889552 190781161 191156536 189813491
16714A89813491j751036l448448m093569n028361n868890o268877o151960o991676
$$ 189813491 188062455 184614007 180520438 175492077 169623187 163354310 157202350 150210674
16706A50210674o720099p300103o925460o496108o850976o065004o110774n486406
$$ 150210674 143490575 136190472 129265012 122768904 115917928 109852924 103742150 98255744
16698I8255744n759464n078852m548532m328325m495798l739905l990844l448799
$$ 98255744 92496280 87417428 82868896 78540571 74044773 70304868 66314024 62865225
16690F2865225l398923l023073k884913k629738k629280k067580k061460k141263
$$ 62865225 59466302 56443229 53558316 50928578 48299298 46231718 44170258 42028995
16682D2028995k071346j991069j585113j626091j590269j737338q73913j223158
$$ 42028995 39957649 37966580 36381467 34755376 33165107 31427769 30553856 29330698
16674B9330698j120365j167626r08057j134028j172482p39720o78372j071277
$$ 29330698 28210333 27042707 26134650 25000622 23828140 23088420 22410048 21338771
16666B1338771p60854q70227k88780j039725m86629p22326l17794r68819K3279
$$ 21338771 20577917 19707690 19418910 18379185 17892556 17170230 16852436 15883617 15906896
16657A5906896l98972o96712k26301p24946m71683n4107o62458n57070q9240j39651
$$ 15906896 15507924 14811212 14584911 13859965 13388282 13334175 12671717 12114647 12025407 11885756
16647A1885756o59477n74135K81483m66140q8265o94054J08495o23770O8551o03028
$$ 11885756 11226279 10652144 10933627 10467487 10379222 9685168 9793663 9169893 9238444 8635416
16637H635416l9837j82584P3911n15900J92270o51994l6041j57519L19602o45029
$$ 8635416 8595579 8412995 8486906 7971006 8163276 7511282 7475241 7317722 7637324 6992295
16627F992295k43087O9508n64567k20026J18489k12675j55224J2923R0864l21529
$$ 6992295 6749208 6818716 6254149 6034123 6152612 5939937 5784713 5797636 5888500 5566971
16617E566971j03379j15116p9134p7982j31810J87300j57829j12276k96883l89395
$$ 5566971 5463592 5348476 5269342 5191360 5059550 5246850 5089021 4976745 4679862 4290467
16607D290467j93825M71888N1785k96539k61810K86629j15048k40259R9911l40908
$$ 4290467 4096642 4568530 4620315 4323776 4061966 4348595 4233547 3993288 4093199 3752291
16597C752291K51041M01370q37902K28978m14642J87383k54289J93612k02626
$$ 3752291 4003332 4404702 3566800 3795778 3381136 3568519 3314230 3507842 3305216
16588C305216K73900j53398j52598k83946j59435J69106P5269j05941Q5723m04819
$$ 3305216 3579116 3425718 3273120 2989174 2829739 2998845 3074114 2968173 3053896 2649077
16578B649077j26465r7085J04658J51691l1242l17448L2960K7713J31017k38889
$$ 2649077 2522612 2425527 2530185 2681876 2650634 2333186 2366146 2393859 2524876 2285987
16568B285987K23176k41360k13039J62024L6393k42925J22492l5794J69705n03970
$$ 2285987 2509163 2267803 2054764 2216788 2253181 2010256 2132748 2096954 2266659 1762689
16558A762689J88156j09725K02641L6448k28055K08988m62946J80776P8193K22041
$$ 1762689 1950845 1841120 2043761 2080209 1852154 2061142 1598196 1778972 1857165 2079206
16548B079206l25014J62917m22576N09566j73785j81776q6436J17025n8897K26272
$$ 2079206 1754192 1917109 1494533 2004099 1830314 1648538 1562102 1679127 1620230 1846502
16538A846502M7192k51467j53043L6267l4512J58327k98648L29964m17439J89228
$$ 1846502 1893694 1642227 1489184 1525451 1490939 1649266 1350618 1680582 1263143 1452371
16528A452371j20001J10073L67453n07319j33961J19417J10148m32780J67278
$$ 1452371 1332370 1442443 1809896 1302577 1168616 1288033 1398181 965401 1132679
16519A132679N07729m15643J14731K4558P0393o77064N03412j32225J78544j72622
$$ 1132679 1640408 1224765 1339496 1364054 1434447 757383 1260795 1128570 1307114 1134492
16509A134492p2553J37238N4760k36613j46218K33699j1151J84707k40703n4599
$$ 1134492 1061939 1199177 1253937 1017324 871106 1104805 1093654 1278361 1037658 983059
16499I83059k71642J87949J70911J6065j37938J81881j44047L6849l74783J91264
$$ 983059 711417 899366 1070277 1086342 948404 1130285 986238 1023087 648304 839568
16489H39568J03226r0796l69918M74768L4224j61749J48762K1977r5462J97954
$$ 839568 942794 851998 482080 956848 991072 829323 978085 1000062 904600 1102554
16479A102554m78804O6905J34936J82386j22268l96427O93915l75333B78437L24268
$$ 1102554 623750 690655 825591 1007977 885709 489282 1183197 807864 278437 602705
16469F02705K35597K697k60670K79973K56436m38021p0473K74314D40485P0715
$$ 602705 838302 840999 580329 860302 1116738 678717 608244 882558 440485 511200
16459E11200j19007L22936j0132C20314K51268p8420L96027D42134R5859n3409
$$ 511200 392193 715129 704997 320314 571582 493162 889189 442134 537993 484584
16449D84584J93070K1192k72708M09809C48887N8177M84995k87662Q6113j05842
$$ 484584 677654 698846 426138 835947 348887 407064 892059 604397 690510 584668
16439E84668K17785C23441L39477M1443J47736D18203m0413J94376K36k45534
$$ 584668 802453 323441 662918 704361 852097 418203 377790 572166 572402 326868
16429C26868M4374k5139K11447j23708J62512k04196m3616J29796j25264L38725
$$ 326868 371242 346103 557550 433842 596354 392158 348542 478338 353074 691799
16419F91799C07219K11802j23466L16055k62993A73872M91973A37725L54029j14904
$$ 691799 307219 519021 395555 711610 448617 173872 665845 137725 491754 376850
16409C76850P5540M4908r330K4052n6830J10296B37314J72417J79109A17093J77725
$$ 376850 452390 497298 487968 512020 455190 565486 237314 409731 588840 117093 294818
16398B94818J44033r3468m0832R7201o3621L85152C41308L86575k24790A48772
$$ 294818 438851 345383 304551 401752 338131 723283 341308 727883 503093 148772
16387C27620K83376k95677J17758o601R551J28433L2284k60356N2302j60820I7014
$$ 327620 610996 315319 433077 426476 436027 564460 596744 336388 388690 227870 97014
16375A24976L09381B14271L64710A95687l5284L62688A70399E8758J07981G6898
$$ 124976 434357 214271 578981 195687 160403 523091 170399 58758 166739 76898
16364C43014L62137B95487J80269k28506F9560M04352j56889N1291P8818J23632
$$ 343014 705151 295487 475756 247250 69560 473912 317023 368314 447132 570764
16354E70764e8747I5720L87309B13593M725r0225Q8832K65051J0346f2215B86316
$$ 570764 -58747 95720 483029 213593 218318 128093 216925 481976 492322 -62215 286316
16342A74313J41602J36042A13017K96627A16049J64463K04291o8315h8318C13214
$$ 174313 315915 451957 113017 409644 116049 280512 484803 416488 -88318 313214
16331C64302A38557J07917P2088A03564K13924q9542J9175J85547I3939B142L03324
$$ 364302 138557 246474 318562 103564 317488 227946 247121 432668 93939 2142 305466
16320C05466K07656J3308A48482m1269A556M48334K15849k74932A00487K14994
$$ 305466 513122 526430 148482 107213 1556 449890 665739 390807 100487 315481
16310C15481O3897a5621A05802J02900a52161A96308Q4215j9101a980B79526j22019
$$ 315481 379378 -15621 105802 208702 -152161 196308 280523 261422 -1980 279526 157507
16299A57507J32961b4056B61605E0439K03510B7025I638L03965a06819B56957
$$ 157507 290468 -24056 261605 50439 253949 27025 9638 313603 -106819 256957
16288C23506A30866J38069d9109B89843M7160A4830L37024a06654L8342D17353
$$ 323506 130866 268935 -49109 289843 337003 14830 351854 -106654 -68312 417353
16277C16209o0352H3917J22237q3056O449R9522p9297p2602N17216B05199Q308
$$ 316209 255857 83917 206154 123098 129547 229069 149772 77170 594386 205199 213507
16266B13507N5717p2355q2181J10956c4956B19888a21486H6044I023g9111A35193
$$ 213507 269224 196869 114688 225644 -34956 219888 -121486 86044 9023 -79111 135193
16254D28301I6635O2446K03040A80165f7334h116A47325j7995Q7115P7641K7184
$$ 428301 96635 159081 362121 180165 -67334 -8116 147325 129330 216445 294086 321270
16243C21270J36317F2156J23815E8711O7568m8849J75239R4721q643A20017N9513
$$ 321270 457587 62156 185971 58711 126279 77430 252669 347390 338747 120017 179530
16232A79530J09417h6691A41682n7204H048a81840A75159f5670I4982J8054b9186
$$ 179530 288947 -86691 141682 84478 8048 -181840 175159 -65670 94982 113036 -29186
16220B0165J51910F345a33424c3977p5704I5631d55317A76220a78531A54591a25728
$$ 20165 172075 6345 -133424 -33977 -109681 95631 -455317 176220 -178531 154591 -125728
16208d6924A31542J430O6746r3864B4896a36153A3882J99078F556M09351G5061
$$ -46924 131542 132972 199718 105854 24896 -136153 13882 212960 6556 415907 75061
16196a55544B13439B9046B341d1249G5241K86859b58659c4993N659A44532k5993
$$ -155544 213439 29046 2341 -41249 75241 362100 -258659 -34993 -29334 144532 118539
16185A18539d3782B87225J08613a25609M9338C29167f3867a0567A28201C4621
$$ 118539 -43782 287225 395838 -125609 -76271 329167 -63867 -10567 128201 34621
16174c9915j19493P546N3748A8869J48002m705D6402J319h3640K4537j5586A56208
$$ -39915 -159408 -151862 -98114 18869 166871 162166 46402 47721 -83640 -59103 -74689 156208
16161a1943D3452K4000a98151b3628E325b15439N9763A96644o1027i3036A66380
$$ -11943 43452 67452 -198151 -23628 5325 -215439 -155676 196644 135617 -93036 166380
16149e4613B43907b08276M1336m9690C0391i944A39847d7969A29011L78880A12634
$$ -54613 243907 -208276 -166940 -216630 30391 -9944 139847 -47969 129011 507891 112634
16137d4427J556A73139a47533A13338B5030K31534j25068f3786B62697l7898h4521
$$ -44427 -42871 173139 -147533 113338 25030 256564 131496 -63786 262697 224799 -84521
16125E9801g1089B40456B7286i2850g725H2588L1010M0137f9084j03413F1633
$$ 59801 -71089 240456 27286 -92850 -7725 82588 113598 153735 -69084 -172497 61633
16113e8169F8323J93067a33332K7447A89378K218B6249e9452D05816a6052G5217
$$ -58169 68323 261390 -133332 -105885 189378 191596 26249 -59452 405816 -16052 75217
16101B30288l0627r6633m8239K71548E4853K32373a83953B54953F1337J32404
$$ 230288 199661 103028 54789 326337 54853 287226 -183953 254953 61337 193741
16091A93741e44472d9207F7478i8129B62006D4099P834a6074j65361m7379B34492
$$ 193741 -544472 -49207 67478 -98129 262006 44099 51933 -16074 -181435 -228814 234492
16079c7365B8190R2318E8092a08109J5094B40555i6245K7516B17116a79442E0462
$$ -37365 28190 120508 58092 -108109 -93015 240555 -96245 -68729 217116 -179442 50462
16067H1535B9726O3356e1109B74138j28625h8868A26329e1422B40862j04389a52494
$$ 81535 29726 93082 -51109 274138 145513 -88868 126329 -51422 240862 136473 -152494
16055A0418P1611C9954C117c8784B38987J99348c10229a8170d581A08029R3445
$$ 10418 82029 39954 3117 -38784 238987 438335 -310229 -18170 -4581 108029 201474
16044B01474h0907K2421j19745g6680K9295b3179j8858A58267f2231G812f1859
$$ 201474 -80907 -58486 -178231 -76680 -47385 -23179 -42037 158267 -62231 7812 -61859
16032A78734g4608j26883C07228l6440f659k8528a6484B20380r1868b77502G9049
$$ 178734 -74608 -201491 307228 270788 -6659 -35187 -16484 220380 128512 -277502 79049
16020b09702K7763C3257K21085b0221k44249C6643M7330l5430a64020r9981B50934
$$ -209702 -181939 33257 254342 -20221 -264470 36643 83973 48543 -164020 -264001 250934
16008A65593O944e9237A13542J65888j36164M3782b90631p72N302a24083l25143
$$ 165593 172537 -59237 113542 279430 143266 187048 -290631 -291403 -286101 -124083 -449226
15997d49226c4772k59234a21360C68316a21234B87178j15546P3761G0201J16830
$$ -449226 -34772 -294006 -121360 368316 -121234 287178 171632 245393 70201 187031
15987A87031p6539a53752C4895A6377M25713b3172B48541J32724j71275A04016
$$ 187031 110492 -153752 34895 16377 442090 -23172 248541 381265 209990 104016
15976A71996C8475a04620A22614m5068e1961m5985C56106a07806B95278a00866
$$ 171996 38475 -104620 122614 77546 -51961 -97946 356106 -107806 295278 -100866
15965D8566a72413B91365a19001B55872d2415j07245c9248n5655G3082J92905
$$ 48566 -172413 291365 -119001 255872 -42415 -149660 -39248 -94903 73082 265987
15955B65987b22872M9423j26291E4327a49353L003J5009p3992D4048K03900d57285
$$ 265987 -222872 -173449 -299740 54327 -149353 -146350 -131341 -205333 44048 247948 -457285
15943f8476J9283k42759A83376n6350g9912j76263A44483a0109j70213N8605d1153
$$ -68476 -49193 -291952 183376 127026 -79912 -256175 144483 -10109 -180322 -121717 -41153
15931c20451J15353I8078A5336J86918n9832b68712A02535c90450A16539M1680
$$ -320451 -205098 98078 15336 202254 142422 -268712 102535 -390450 116539 158219
15921A58219b3135C7449K11821d30062E5565K18325a45713J2217d7247j24533
$$ 158219 -23135 37449 249270 -430062 55565 273890 -145713 -133496 -47247 -171780
15911a71780q7504A8232Q1121D6248R7118k5352b13049A98405b39370A61608b6316
$$ -171780 -259284 18232 99353 46248 143366 118014 -213049 198405 -239370 161608 -26316
15899C5710c8333C01650r8931O6763b75259a21052A93476b54291A88919O0681
$$ 35710 -38333 301650 202719 269482 -275259 -121052 193476 -254291 188919 249600
15889B49600a6792I3721j4494a21629a1999k355k6804B522c0035A76723a10342
$$ 249600 -16792 93721 79227 -121629 -11999 -14354 -41158 2522 -30035 176723 -110342
15877c71025a1230C32514b33474H962h6596M2723G2483B694b31973a14647J7208
$$ -371025 -11230 332514 -233474 8962 -86596 -43873 72483 2694 -231973 -114647 -97439
15866i7439l05810a78823E2226a40493A06073R857a82196H5343a64658e4296C14097
$$ -97439 -403249 -178823 52226 -140493 106073 115930 -182196 85343 -164658 -54296 314097
15854D9951b16500E3932A0353f1962b3103C453J89930A1011L527Q8655J7581J51068
$$ 49951 -216500 53932 10353 -61962 -23103 3453 193383 11011 14538 103193 120774 271842
15842B71842h9447A63416b20659d6905l05153Q1629J23173M5517q5097c7914m8317
$$ 271842 -89447 163416 -220659 -46905 -352058 -270429 -147256 -101739 -186836 -37914 -86231
15831h6231A8488P6253g4689I2963K962f5603A27338F401a75058G8959c30129
$$ -86231 18488 94741 -74689 92963 95925 -65603 127338 6401 -175058 78959 -330129
15819a30630J8205A8399a69431B9515J03401a72435A56013a40778k2257f3851
$$ -130630 -112425 18399 -169431 29515 132916 -172435 156013 -140778 -163035 -63851
15808h5550A83045H1277J50463b05414b2621G8805b18446F7906B2013e5847n515
$$ -85550 183045 81277 231740 -205414 -22621 78805 -218446 67906 22013 -55847 -61362
15797f1362A0678a95977A77066b00392O1567a8662m86256A27065j1265K48229
$$ -61362 10678 -195977 177066 -200392 -138825 -18662 -504918 127065 115800 364029
15787C64029a47113A55622L6918j4147K09715a08551A01207J13761a69248J9843
$$ 364029 -147113 155622 192540 178393 388108 -108551 101207 214968 -169248 -149405
15777a49405k4360C196N1178c55894a10362K3258j1174E7188L1622b81412i8413
$$ -149405 -173765 3196 54374 -355894 -110362 -87104 -98278 57188 88810 -281412 -98413
15765d2131A45693d2438A09324a2587j49660j3323A43801J51745a7882A11258
$$ -42131 145693 -42438 109324 -12587 -162247 -175570 143801 295546 -17882 111258
15754b51385B56128i50A93095b50923N7956p6371A44538K2364J44191c6911A06974
$$ -251385 256128 -950 193095 -250923 -192967 -269338 144538 166902 311093 -36911 106974
15742B1693L4326Q4585c27498N836e0804B75414j34023i764B6381h3732B1141
$$ 21693 56019 140604 -327498 -321662 -50804 275414 141391 -9764 26381 -83732 21141
15730b87923f9481q2729j75633i7314P664a5703m17812c725k29133d5495H5906
$$ -287923 -69481 -152210 -327843 -97314 -89650 -15703 -433515 -3725 -232858 -45495 85906
15718g8889k7908k902C6999a60264O3670F7390K42556d88835I190c11724P4255
$$ -78889 -106797 -109699 36999 -160264 -96594 67390 309946 -488835 9190 -311724 -237469
15707b37469M5570E1637d7224A36013J98137j29809J83327B8020a09319j37539
$$ -237469 -191899 51637 -47224 136013 334150 204341 387668 28020 -109319 -246858
15697b46858B73700a49496A50580K1198g7988A72803E558J99993K45886A8621
$$ -246858 273700 -149496 150580 171778 -77988 172803 5558 205551 451437 18621
15686b53201A90895h8260J0835j6994j19136p445i0800I9972b80362C6284h4231
$$ -253201 190895 -88260 -77425 -94419 -213555 -221000 -90800 99972 -280362 36284 -84231
15674C07551P5055F696b69101A61016A1518J93413G5482a98996P6196d4666A31509
$$ 307551 382606 6696 -269101 161016 11518 204931 75482 -198996 -122800 -44666 131509
15662b45275k07212h1186j58772G4271C5665J28180C8341J18115n6042b2744d500
$$ -245275 -452487 -81186 -239958 74271 35665 163845 38341 156456 100414 -22744 -4500
15650A28094b57283I4663O3025L8145b29127e4817a1792I1873Q1606d07285E1089
$$ 128094 -257283 94663 157688 195833 -229127 -54817 -11792 91873 173479 -407285 51089
15638i6117M0416A08005g7180m6242j8342G0308b0297A81599c75910a2915o9979
$$ -96117 -55701 108005 -77180 -123422 -141764 70308 -20297 181599 -375910 -12915 -82894
15627h2894F1946L7831i5168j46135J18253J1673j9159I4801a5474A15069c461
$$ -82894 61946 99777 -95168 -241303 -123050 -111377 -130536 94801 -15474 115069 -3461
15615A84366a52543P1525B3656K53950D9506d04418J95037N7334q1949j51540
$$ 184366 -152543 -81018 23656 277606 49506 -404418 -209381 -152047 -233996 -385536
15605c85536C1015c15474i7584k41676a25411L8837l88405A55434o6261b02723
$$ -385536 31015 -315474 -97584 -339260 -125411 -86574 -474979 155434 89173 -202723
15594b93347G2552b37495A83589d8527F6411c74609A36969a42421F8394a82022
$$ -293347 72552 -237495 183589 -48527 66411 -374609 136969 -142421 68394 -182022
15583B7536K74373f2314A08755a98377d7447A89104H6473J55726q1456F4458f0387
$$ 27536 301909 -62314 108755 -198377 -47447 189104 86473 242199 160743 64458 -60387
15571i0589E4440g9338m3207j03276L2543E7280B240P2723a61857A25083h0989
$$ -90589 54440 -79338 -122545 -225821 -193278 57280 2240 74963 -161857 125083 -80989
15559A02929a04417A24725A9667J22401b9569B390J86702C4495J7358b34799B44043
$$ 102929 -104417 124725 19667 142068 -29569 2390 189092 34495 51853 -234799 244043
15547a93572a8019L089F9805J90195a81222j0671h344p5028A27394a99484E2190
$$ -193572 -18019 -14930 69805 260000 -181222 -191893 -8344 -83372 127394 -199484 52190
15535C40923C4906J35388c09199a13963j78633B29847b5420j07205I3310a12372
$$ 340923 34906 170294 -309199 -113963 -292596 229847 -25420 -132625 93310 -112372
15524b05914B49742g7128Ea05593L9844j77891a19497K0795A33880c79020A13944
$$ -205914 249742 -77128 5 -105593 -65749 -243640 -119497 -98702 133880 -379020 113944
15512A16392b61338B12820G8992R6020b64725e5158G0503J60044b66317b6861
$$ 116392 -261338 212820 78992 175012 -264725 -55158 70503 230547 -266317 -26861
15501G0318c22146J37638A37929a88334d8948n11229a64574B02701d2228B33263
$$ 70318 -322146 -184508 137929 -188334 -48948 -560177 -164574 202701 -42228 233263
15490a3138B9470b21002E2422a61166B94809b81537g9914m2771I2737J25163a32602
$$ -13138 29470 -221002 52422 -161166 294809 -281537 -79914 -122685 92737 217900 -132602
15478b17518d5512C1821a128A30868A3470b10595F22992E9894a76090C519b21601
$$ -217518 -45512 31821 -1128 130868 13470 -210595 622992 59894 -176090 3519 -221601
15466B00887k1140a17494b0751A08296K89120G1268a22411A47201C3429j6509
$$ 200887 179747 -117494 -20751 108296 397416 71268 -122411 147201 33429 16920
15456A6920J80478h9613n3813A3138J62380a42582k01741C89474A11892a30740
$$ 16920 197398 -89613 -143426 13138 175518 -142582 -344323 389474 111892 -130740
15445h9366o8138E5812f2740j25296B25736a3218o5692D7532a34500F7690J52262
$$ -89366 -157504 55812 -62740 -188036 225736 -13218 -78910 47532 -134500 67690 219952
15434B19952M6268I6645e0443E419b4214k667j56014l7602A82249G4949K40584
$$ 219952 266220 96645 -50443 5419 -24214 -26881 -182895 -220497 182249 74949 315533
15423C15533I8681d9362D023b7566A83021A785L93480f6575A81583H292J18561
$$ 315533 98681 -49362 4023 -27566 183021 1785 395265 -66575 181583 8292 126853
15412A26853b71135K1241h1981l9536l3776B8508N8318b9436k3979R286G2921
$$ 126853 -271135 -249894 -81981 -121517 -155293 28508 86826 -29436 -53415 -44129 72921
15400B02238E7576a17972A15157d17961a87066N8170l355o744e4287j34979B6474
$$ 202238 57576 -117972 115157 -417961 -187066 -128896 -132251 -138995 -54287 -189266 26474
15388a89168K232A56175b3562j39509H7948a47045I8245j1032a3934B32347N7159
$$ -189168 -186936 156175 -23562 -163071 87948 -147045 98245 87213 -13934 232347 289506
15377B89506j17593m198p1787a3409D7321M8163J48322b23906A9012M1072b21264
$$ 289506 171913 167715 95928 -13409 47321 95484 243806 -223906 19012 60084 -221264
15365i6805j27994C6334j1196e5948F1133K13082o9992H6077a35727a2554A46354
$$ -96805 -224799 36334 25138 -55948 61133 274215 204223 86077 -135727 -12554 146354
15353a646D2122J68912o5134o991b7499A14744d01966D9630c05536B28018a90001
$$ -1646 42122 211034 145900 138909 -27499 114744 -401966 49630 -305536 228018 -190001
15341b74685D51765I517a14503H3717h445l2415H7336b5541F6101J54315a29435
$$ -274685 451765 9517 -114503 83717 -8445 -40860 87336 -25541 66101 220416 -129435
15329g0466j26965j75538C4897R1786J52692D6476a1776k25433k6089A14119C1856
$$ -70466 -197431 -372969 34897 126683 279375 46476 -11776 -237209 -263298 114119 31856
15317a89402B46975a26851d3041a3376D34058B6140J64233a53794I8193i9808
$$ -189402 246975 -126851 -43041 -13376 434058 26140 190373 -153794 98193 -99808
15306I5977C6618J32638a17008k55456e2010B06171p5648c08775a27798B14203
$$ 95977 36618 169256 -117008 -372464 -52010 206171 130523 -308775 -127798 214203
15295B87730o0370b19618C16791i0845a7626j08440M3290D05742j53651A00445
$$ 287730 227360 -219618 316791 -90845 -17626 -126066 -82776 405742 252091 100445
15284A29823o0294A0254N5331c05797B08068B402L13913f1836C9010K28202E0472
$$ 129823 69529 10254 65585 -305797 208068 2402 316315 -61836 39010 267212 50472
15272B47895D1785h6134j01626B71457b87073C75542c1283B5271h1220m7355j8166
$$ 247895 41785 -86134 -187760 271457 -287073 375542 -31283 25271 -81220 -128575 -146741
15261a46741H5548J70781c7865o4483B21271b70964B64913a9856C00707j592b35158
$$ -146741 85548 256329 -37865 -102348 221271 -270964 264913 -19856 300707 299115 -235158
15249I1186L83520K30576Q31387L9648k56545R14410A099703C013b36032B23614
$$ 91186 474706 705282 1536669 1576317 1319772 2234182 1099703 3013 -236032 223614
15238A82921J0786a53326L2240g510m07691p2145A37737l1385J6356a28385k017
$$ 182921 193707 -153326 -121086 -7510 -415201 -487346 137737 106352 122708 -128385 -130402
15227a30402R823k55111h0309j1395A70709J82497q8155I8811A2850J79414J31178
$$ -130402 -120579 -375690 -80309 -91704 170709 353206 265051 98811 12850 192264 323442
15216C23442b63366B9483A3624c34844A50121P1726h7290C41252A44050k0960
$$ 323442 -263366 29483 13624 -334844 150121 221847 -87290 341252 144050 123090
15206A23090c31251A07637j3184K28340e00670I1822P0727J9679O8299h7212I9402
$$ 123090 -331251 107637 94453 322793 -500670 91822 162549 182228 250527 -87212 99402
15194e1784l8932E26376a78092C69576A56230a09500n7912A86430b1263m5210
$$ -51784 -90716 526376 -178092 369576 156230 -109500 -167412 186430 -21263 -66473
15184f6473J1596G7094K282a99165B53189m1937M2916a16379e2148k5953A09626
$$ -66473 -54877 77094 79376 -199165 253189 211252 254168 -116379 -52148 -78101 109626
15172A29368K38830A71959C2993K33220J24328H0165k5348b6720C58269b06935
$$ 129368 368198 171959 32993 266213 390541 80165 54817 -26720 358269 -206935
15161B41371B3440i1813O339D5838J61693C8400J74893b9423I4798K9833C8554
$$ 241371 23440 -91813 -85474 45838 207531 38400 213293 -29423 94798 124631 38554
15149h3571A30042K75335j0729C9488b12979E1384J65483a6146E53053g6253B08266
$$ -83571 130042 405377 394648 39488 -212979 51384 216867 -16146 553053 -76253 208266
15137A7194e6301A96515k1689p5892L06482E4905N4843a20681L9104B69957A23258
$$ 17194 -56301 196515 174826 98934 405416 54905 109748 -120681 -81577 269957 123258
15125A05437K68721j82914e8409C32679A36440J99389A48592k5168a54882B64170
$$ 105437 374158 191244 -58409 332679 136440 335829 148592 123424 -154882 264170
15114C80858d8239E4829K34834A7203K66545a19517D2303k0054b73097A88551
$$ 380858 -48239 54829 289663 17203 283748 -119517 42303 22249 -273097 188551
15103B94369G3573A1831c9457D5117J79517J6447c9988A74881m7894J27885p5210
$$ 294369 73573 11831 -39457 45117 224634 241081 -39988 174881 126987 254872 179662
15092A79662Q3244C3903J0107K36303a33502H2787J33038a48371N7910A00355
$$ 179662 262906 33903 44010 280313 -133502 82787 215825 -148371 -90461 100355
15081A11611a76616C12919a59956B42094A13768a15680E24156o2919A90317e7637
$$ 111611 -176616 312919 -159956 242094 113768 -115680 524156 461237 190317 -57637
15070B42184n7062J71555A14223l3627K92423A20038e8235A70504r332k9397J14524
$$ 242184 185122 356677 114223 80596 373019 120038 -58235 170504 161172 131775 246299
15059B46299f0491D07640b1528B20569o2080N3659B4467J58675q1031b07751F5235
$$ 246299 -60491 407640 -21528 220569 158489 212148 24467 183142 102111 -207751 65235
15047C33346K1964c3128C88800A19811L3336L01150r8163I7487Q6381r723M837
$$ 333346 355310 -33128 388800 119811 153147 454297 356134 97487 183868 174145 178982
15036A78982l9505J93723o301e1312D2889a08540B8718L21508c7130A60791R1142
$$ 178982 139477 333200 326899 -51312 42889 -108540 28718 350226 -37130 160791 251933
15025B51933N3813j17904J85857j83581K42007j04375r5630k0504C1554b375B15162
$$ 251933 305746 187842 373699 190118 432125 327750 232120 211616 31554 -2375 215162
15013I946J18339L12029B5867K20561F2201M5689L46933A30402K86528J82720
$$ 9946 128285 440314 25867 246428 62201 107890 454823 130402 416930 599650
15003E99650A25752O7823J57749A57390P8691a09500A03116J18325h9299j91822
$$ 599650 125752 193575 351324 157390 236081 -109500 103116 221441 -89299 -281121
14993b81121M9847C18884G7594K16556O1372L5784o3214A49315L54474E0997J69235
$$ -281121 -231274 318884 77594 294150 355522 391306 328092 149315 503789 50997 220232
14982B20232m3074m5546N61898k26078A11978J69520r5389D4071J45068J84252
$$ 220232 177158 131612 693510 467432 111978 281498 186109 44071 189139 373391
14972C73391A62236K4855M1167O907J67859b3710D77812A30220m0328i9048q1484
$$ 373391 162236 187091 228258 235165 403024 -23710 477812 130220 89892 -99048 -180532
14961a80532D03946J55578b659B33629J1644k1981F4616K82806J08505A71357
$$ -180532 403946 559524 -2659 233629 245273 223292 64616 347422 455927 171357
14950a4925B73166A24313O4515K0131J54542m8269j4487R1399P433E7511L27455
$$ -14925 273166 124313 188828 208959 363501 315232 300745 392144 399577 57511 384966
14939C84966p7689A45806J32527N4493J04768A44943J72148j873j20692J43159
$$ 384966 307277 145806 278333 332826 437594 144943 317091 315218 194526 337685
14929C37685j56021K27636J3018j59768K75719B43629j09686K23846A16362J25951
$$ 337685 181664 409300 422318 262550 538269 243629 133943 357789 116362 242313
14919B42313L12531R4773j35850k24083P5807I1938K33680j8136j11968J06790
$$ 242313 554844 649617 513767 289684 365491 91938 325618 307482 195514 302304
14909C02304N2055o4728L96058K1059C28871K56520F2942L59614j34766K07089
$$ 302304 354359 289631 685689 706748 328871 585391 62942 422556 287790 494879
14899D94879A39968b0788D02520J81643B08003J49123k1771L78271k81290j93513
$$ 494879 139968 -20788 402520 584163 208003 357126 335355 713626 432336 238823
14889B38823l8743K06262L7973o2465A15387L22404j93090E2677L93707J69944
$$ 238823 200080 406342 444315 381850 115387 437791 244701 52677 446384 616328
14879F16328j9962o0387j35849F5492O9705M78234F2098N13478A14146P0456L35447
$$ 616328 596366 535979 400130 65492 135197 613431 62098 575576 114146 184602 520049
14868E20049j92724J27900J84411K3791r3249k11630P385P826N6381j94312p8986
$$ 520049 327325 455225 639636 663427 570178 358548 365933 373759 430140 235828 156842
14857A56842m8220M23908p6549k5018O4001p0255J28659B56205J92255N14836
$$ 156842 108622 532530 455981 430963 494964 424709 553368 256205 448460 963296
14847I63296l18250k64305L6835j38846k4314N14290C61436R1023q3732A69035
$$ 963296 645046 380741 417576 278730 254416 768706 361436 452459 368727 169035
14836A66161K36629L0356o9857J33478j67857K9090K25667j78337K3472n1238
$$ 166161 402790 433146 363289 496767 328910 358000 583667 405330 428802 377564
14826C77564Q4488K87779B99692J10028l219J47520k19134M10310C06485J55246
$$ 377564 462052 749831 299692 409720 406501 554021 334887 745197 306485 461731
14816D61731q2154J99145k20481j9862L03700o1577A63065M04781J34579R746
$$ 461731 379577 578722 358241 338379 642079 580502 163065 567846 702425 712171
14806G12171j89918P4885k54219K20952B79032M58111k74400j80688J45095P7
$$ 712171 522253 597138 342919 563871 279032 737143 462743 282055 427150 427227
14796D27227J37265J833j04699q5174L23656j11245J26117j4547C28657J82894
$$ 427227 564492 566325 461626 376452 700108 588863 714980 700433 328657 511551
14786E11551o6307K79220o1041k24476m6107M829A51518L28198L77662k35972
$$ 511551 445244 724464 663423 438947 392840 397669 151518 479716 857378 621406
14776F21406N7343K99877k60477p3294J28572K04704k62246r5919j89332K4721
$$ 621406 678749 978626 718149 644855 773427 978131 715885 619966 430634 455355
14766D55355K62069k37010L73610k33440Q1733o6860K64921j74464j84337L0961
$$ 455355 717424 480414 854024 620584 702317 635457 900378 725914 541577 572538
14756E72538n8207K40402k17710J83149m0044p5179J94504j4021p9311q0595K75814
$$ 572538 514331 754733 537023 720172 680128 604949 799453 785432 706121 625526 901340
14745I01340k83569B91204M04591K8659K16717l01083K07431j36620j38776K59818
$$ 901340 617771 291204 695795 724454 941171 640088 847519 710899 572123 831941
14735H31941K01731l42322J80393J51170l85191K67395k82431L08090l57723L30095
$$ 831941 1033672 691350 871743 1022913 637722 905117 622686 930776 573053 903148
14725I03148j11662q1707r5166M23161k23999K87445J02236j34384R2601B97020
$$ 903148 791486 709779 614613 1037774 813775 1101220 1203456 1069072 1161673 297020
14714I48111P7182m61095R9675L69009J3500k73393K1088j73956L14483K91380
$$ 948111 1025293 564198 663873 1032882 1046382 772989 794077 620121 934604 1225984
14704A225984m58882J52510O6683P7390p8789L3152j56356K78303D78400M06193
$$ 1225984 767102 919612 986295 1063685 984896 1018048 861692 1139995 478400 884593
14694H84593l8258J4990O7861N6031j30270M89026k39811l12610K99010k12399
$$ 884593 846335 861325 929186 985217 854947 1343973 1104162 791552 1090562 878163
14684H78163N3696L04086p2292k81221K98880m67243L54892L90593m96037l8299
$$ 878163 931859 1235945 1163653 882432 1181312 714069 1068961 1459554 963517 925218
14674I25218j17500J96790M2914r3343O174k5017L11114m31148M17049k37233
$$ 925218 807718 1004508 1047422 954079 960253 935236 1246350 815202 1232251 995018
14664I95018J11077n8695K28184k07051J06164l2417q5350Q3409P9092k75540
$$ 995018 1106095 1047400 1275584 1068533 1174697 1142280 1056930 1140339 1219431 943891
14654I43891J17684K11770J09526j23544k28640P6508K08169j26126J84072J05082
$$ 943891 1061575 1273345 1382871 1259327 1030687 1107195 1315364 1189238 1373310 1478392
14644A478392m42536J51133r8647K4799J66605Q3265J67406p294l79234J96718
$$ 1478392 1035856 1186989 1088342 1113141 1279746 1363011 1530417 1523123 1143889 1340607
14634A340607k00233M09438l26690J43827j29918L39740j65244K50412k47158
$$ 1340607 1140374 1549812 1223122 1366949 1237031 1576771 1411527 1661939 1414781
14625A414781r4437K74964l61669J31904J57412N0075j34182J93158k38405K550
$$ 1414781 1320344 1595308 1233639 1365543 1522955 1573030 1438848 1632006 1393601 1396151
14615A396151M16322M3590l73702L96125k83270R799M8351j06755Q1824K89618
$$ 1396151 1812473 1856063 1482361 1878486 1595216 1605015 1653366 1546611 1628435 1918053
14605A918053m01646M13546k75005K05876Q4068l73706r2024L34817J48064l39266
$$ 1918053 1516407 1929953 1654948 1860824 1944892 1571186 1479162 1813979 1962043 1622777
14595A622777K45226j26723J69950o4463n4023K64590m48514p7869M69112j33680
$$ 1622777 1868003 1741280 1911230 1846767 1792744 2057334 1608820 1530951 2000063 1866383
14585A866383J77164r1147m0668j23240J86879M91460k04762l23579J06718M6937
$$ 1866383 2043547 1952400 1911732 1788492 1975371 2466831 2262069 1938490 2045208 2092145
14575B092145Q4055O2808K23338k87359M58004m41436m080J49772j29998O7340
$$ 2092145 2176200 2239008 2462346 2174987 2632991 2191555 2187475 2337247 2207249 2274589
14565B274589K01235p1218N651M16554j77770L30912k36748J36806K1174N77842
$$ 2274589 2475824 2404606 2410257 2826811 2649041 2979953 2743205 2880011 2901185 3479027
14555C479027R0752Q0327K64135P54833K75755R48712R45694L637388O773593
$$ 3479027 3569779 3650106 3914241 4669074 4944829 5893541 6839235 10476623 17250216
14546A7250216J9865839J8306143B4736015j1841251o377463k682618j350263
$$ 17250216 37116055 55422198 24736015 12894764 6517301 3834683 2484420
14539B484420r7697o2787k28081k10482L15598l38629M67845j58118Q3939L98412
$$ 2484420 2386723 2323936 2095855 1885373 2200971 1862342 2330187 2172069 2256008 2654420
14529B654420m89548M67477k79598k18807K08929R387K36664J06785j18826R3147
$$ 2654420 2164872 2632349 2352751 2133944 2342873 2352260 2588924 2695709 2576883 2670030
14519B670030m4422M68J19825K00753m54864M98425r4976J41311k37706J22271
$$ 2670030 2625608 2626076 2745901 2946654 2491790 2990215 2895239 3036550 2798844 2921115
14509B921115N4350J74097n3497l26890M18281l8122j71823K63138J40562J44077
$$ 2921115 2975465 3149562 3096065 2769175 3187456 3149334 2977511 3240649 3381211 3525288
14499C525288q6493j77382J06920O6408P4806J46264l75611L07938J25469J72314
$$ 3525288 3438795 3261413 3368333 3434741 3509547 3655811 3280200 3588138 3713607 3885921
14489C885921L2686M8554j96052R9176N75927n11876k47934O90390m31696R4716
$$ 3885921 3918607 3967161 3771109 3870285 4446212 3934336 3686402 4376792 3945096 4039812
14479D039812L23163p4549l14364P15569l97360K17799R0313K37247k40647l83281
$$ 4039812 4362975 4288426 3974062 4689631 4292271 4510070 4600383 4837630 4596983 4213702
14469D213702J66093N11916m51837O06088j31742j53439L71444q5174L39643m67354
$$ 4213702 4379795 4891711 4439874 5045962 4914220 4760781 5132225 5047051 5386694 4919340
14459D919340J09866K30303N8997J74988q0281o8144K75717J11391O7049J02674
$$ 4919340 5029206 5259509 5318506 5493494 5413213 5345069 5620786 5732177 5799226 5901900
14449E901900r5702K68641j7074l8542K79314J60976J98917K3659l55034L59811
$$ 5901900 5806198 6074839 6057765 6019223 6298537 6459513 6658430 6682089 6327055 6686866
14439F686866p7865O498L84343m11654M18241n2475K6114L15365O5912J52309
$$ 6686866 6609001 6615499 6999842 6588188 7006429 6953954 6980068 7295433 7361345 7513654
14429G513654l3173k4724J59617j64638N17090O3378M19768j17161k16886K63885
$$ 7513654 7480481 7455757 7615374 7450736 7967826 8031204 8450972 8333811 8116925 8380810
14419H380810L04713K08591J62037J11790J13271l4111J66301N0408j26115M38533
$$ 8380810 8685523 8894114 9056151 9167941 9281212 9247101 9413402 9463810 9337695 9776228
14409I776228r0211K44914K50337J50489J06482N54877m92338N04022J74132K0392
$$ 9776228 9686017 9930931 10181268 10331757 10438239 10993116 10500778 11004800 11178932 11199324
14399A1199324J81716L49685L31768k47449L43588K94352M98335n66818P98804
$$ 11199324 11381040 11730725 12062493 11815044 12158632 12452984 12951319 12384501 13183305
14390A3183305j52518K48971O88301k5354L08136J40327M97301K18293J63008
$$ 13183305 13030787 13279758 13968059 13942705 14250841 14391168 14888469 15106762 15269770
14381A5269770N25163K65662J26741M56217J59484K15604K72916K84791L49450
$$ 15269770 15794933 16060595 16187336 16643553 16803037 17018641 17291557 17576348 17925798
14372A7925798M58777O75982J28764L79693J19990Q54537N0117M20995O94784
$$ 17925798 18384575 19060557 19189321 19569014 19689004 20543541 20593658 21014653 21709437
14363B1709437M68684O21677M34920K49670L89210N34259P85966O16508Q26988
$$ 21709437 22178121 22799798 23234718 23484388 23873598 24407857 25193823 25810331 26637319
14354B6637319M46404O27288K45884R46580O07716J126860M0059P85151J293473
$$ 26637319 27083723 27711011 27956895 28903475 29511191 30638051 30678110 31463261 32756734
14345C2756734M16351J107285J027463O64894Q67771J417702P45900J245642J372930
$$ 32756734 33173085 34280370 35307833 35972727 36840498 38258200 39004100 40249742 41622672
14336D1622672R59654J052224J011123J648914J492337J373496J591249J677344
$$ 41622672 42582326 43634550 44645673 46294587 47786924 49160420 50751669 52429013
14328E2429013J267690J665694K044560J871177J820978K255335K271446J911336
$$ 52429013 53696703 55362397 57406957 59278134 61099112 63354447 65625893 67537229
14320F7537229K517361K449517K665504K466140K729764L089033L224144L877169
$$ 67537229 70054590 72504107 75169611 77635751 80365515 83454548 86678692 90555861
14312I0555861L204395L483964M323873L820988M777118M590340M948563N337339
$$ 90555861 93760256 97244220 101568093 105389081 110166199 114756539 119705102 125042441
14304A25042441N308932N763903O350015O562379O795275P328600P882900P698033
$$ 125042441 130351373 136115276 142465291 149027670 155822945 163151545 171034445 178732478
14296A78732478Q666169R394371R695167R676319J0996411J1133484J1807521
$$ 178732478 187398647 196793018 206488185 216164504 227160915 238294399 250101920
14289B50101920J2396480J2742296J3487331J3498397J4041620J4519884J4283002
$$ 250101920 262498400 275240696 288728027 302226424 316268044 330787928 345070930
14282C45070930J4271430J4443589J4305592J3729106J2943677J2190107J0904600
$$ 345070930 359342360 373785949 388091541 401820647 414764324 426954431 437859031
14275D37859031R740461P972166N550471K397200J428730O25048n95836n987220
$$ 437859031 447599492 455571658 461122129 463519329 464948059 465573107 464977271 458990051
14267D58990051m423079n856615q405210r848124j0882459j2679924j3544366
$$ 458990051 454566972 448710357 440305147 430457023 419574564 406894640 393350274
14260C93350274j4291922j4574441j4953682j5075629j4557439j4445837j4143741
$$ 393350274 379058352 364483911 349530229 334454600 319897161 305451324 291307583
14253B91307583j2367381j3248162j2733634j2021867j1482287j0767477j0143930
$$ 291307583 278940202 265692040 252958406 240936539 229454252 218686775 208542845
14246B08542845j0332808r062804q216086q188251q319342o962996p432118o354984
$$ 208542845 198210037 189147233 180931147 172742896 164423554 157460558 150028440 143673456
14238A43673456o349618n615122n932407n017553n015401m768814m328454l896511
$$ 143673456 137323838 131708716 125776309 120758756 115743355 110974541 106646087 102749576
14230A02749576l698088m055453l735459l386753l302217l057812l045037k834473
$$ 102749576 99051488 94996035 91260576 87873823 84571606 81513794 78468757 75634284
14222G5634284k750331k299422k520639j927457k237403k198030k245931j733628
$$ 75634284 72883953 70584531 68063892 66136435 63899032 61701002 59455071 57721443
14214E7721443j627215j147792k026083j703925j690308j444621j003116r96975
$$ 57721443 56094228 54946436 52920353 51216428 49526120 48081499 47078383 46081408
14206D6081408q37487j932529j444190j306537j136053r88010j75008j158253
$$ 46081408 45243921 43311392 41867202 40560665 39424612 38436602 38261594 37103341
14198C7103341j194235j171471p34618r64617n30520p35401q66309q68766n85070
$$ 37103341 35909106 34737635 34003017 33038400 32507880 31772479 30906170 30037404 29452334
14189B9452334o64269q66084q12357m41017n91672o86732l99103o45668l26379
$$ 29452334 28788065 27921981 27109624 26668607 26076935 25390203 24991100 24345432 24019053
14180B4019053n72612l37665p10473n83366l98278k65917k94275m27511m76776
$$ 24019053 23446441 23108776 22398303 21814937 21416659 21150742 20856467 20428956 19952180
14171A9952180j45811p95694j09662m74884m86782N5009m16115l76742m33258
$$ 19952180 19806369 19010675 18901013 18426129 17939347 17994356 17578241 17201499 16768241
14162A6768241j29820k91909k31101m64408K9838o39798m01362L31705n40739
$$ 16768241 16638421 16346512 16115411 15651003 15680841 15041043 14639681 14971386 14430647
14153A4430647k97216k04705j45201k17208j13323k62866l02420m26300n7846
$$ 14430647 14133431 13928726 13783525 13566317 13452994 13190128 12887708 12461408 12403562
14144A2403562J40796k33478l25633k50165k31612k68703J19333m10126j75110
$$ 12403562 12544358 12310880 11985247 11735082 11503470 11234767 11354100 10943974 10768864
14135A0768864l8881l1276k93035k05389l34326J77174m05579o7296L12115n78633
$$ 10768864 10729983 10698707 10405672 10200283 9865957 10043131 9637552 9570256 9882371 9303738
14125I303738L7453m06001J15841k29828k02274L34763n07166j35969N2805k63934
$$ 9303738 9341191 8935190 9051031 8821203 8618929 8953692 8446526 8310557 8363362 8099428
14115H099428k10158J15390l70609M82140l57093P7276l97622n4151O6272k74382
$$ 8099428 7889270 8004660 7634051 8116191 7759098 7836374 7438752 7384601 7450873 7176491
14105G176491K52676m29776k76320J11150k33880P6176n3195l1905l6430j01708
$$ 7176491 7429167 6999391 6723071 6834221 6600341 6676517 6623322 6591417 6554987 6453279
14095F453279M4774k34997q0887j26415Q3062J45891l50379J61890k23402k12006
$$ 6453279 6498053 6263056 6182169 6055754 6138816 6284707 5934328 6096218 5872816 5660810
14085E660810j41827l2968o8004K39917k526k88972k70295L2325k60408L27003
$$ 5660810 5518983 5486015 5418011 5657928 5655402 5366430 5096135 5128460 4868052 5195055
14075E195055R8537j15496J19977j32974j00499K7151n30176K32968j80896L41329
$$ 5195055 5293592 5178096 5298073 5165099 5064600 5091751 4561575 4794543 4613647 4954976
14065D954976m41177j11192r1650M15668m03656N7020N51861k80340l83507K62789
$$ 4954976 4513799 4402607 4310957 4726625 4322969 4379989 4931850 4651510 4268003 4530792
14055D530792j34150j26526J05114m20700J64290j16756k63858q9498K48812K01537
$$ 4530792 4396642 4270116 4375230 3954530 4118820 4002064 3738206 3648708 3897520 4099057
14045D099057k74826J67098m78701m7206L27992r1136j50577J13459m4630n5622
$$ 4099057 3824231 3991329 3512628 3465422 3793414 3702278 3551701 3665160 3620530 3564908
14035C564908k55616k10439M96316j73308r535k22960J58827j94203K8550J43947
$$ 3564908 3309292 3098853 3595169 3421861 3412326 3189366 3348193 3153990 3182540 3326487
14025C326487p9871r4283m67823K97375K49875J16765m16601K05009l1533j60371
$$ 3326487 3246616 3152333 2684510 2981885 3231760 3348525 2931924 3136933 3105400 2945029
14015B945029l4790j54210K68603j60183k24385o0354K01250m1785m35140M56112
$$ 2945029 2910239 2756029 3024632 2864449 2640064 2579710 2780960 2739175 2304035 2760147
14005B760147j21379l32884J68841l9517M3296J12129l77085J08787l1950R4123
$$ 2760147 2638768 2305884 2474725 2435208 2478504 2590633 2213548 2322335 2290385 2384508
13995B384508J11969l42118k1375J81901N25367n8419P92143J623230M536114
$$ 2384508 2496477 2154359 2132984 2314885 2840252 2781833 3573976 5197206 9733320
13986I733320J7032671K9998236k5577478j5283776o552581k781980j190858p13208
$$ 9733320 26765991 56764227 31186749 15902973 9350392 6568412 5377554 4664346
13978D664346o81527j26995m10576O8435l24189j18747j36220j1065m79657N20022
$$ 4664346 3982819 3855824 3445248 3513683 3189494 3070747 2934527 2923462 2443805 2963827
13968B963827k45542j78775L7754P5704J09822m06481K30792l45682K99017m17686
$$ 2963827 2718285 2539510 2577264 2652968 2762790 2356309 2587101 2241419 2540436 2122750
13958B122750L76666l99398L64158k71629J68738L6386j19551N5046j87072n9917
$$ 2122750 2499416 2100018 2464176 2192547 2361285 2397671 2278120 2333166 2146094 2086177
13948B086177M9531j23702K90626l13766q4211J75138m8865q0657J03156J11585
$$ 2086177 2135708 2012006 2302632 1988866 1904655 2079793 2030928 1950271 2053427 2165012
13938B165012j57104n6432J13831l10932J77439Q5718k38579R2259o4391J33798
$$ 2165012 2007908 1951476 2065307 1754375 1931814 2017532 1778953 1871212 1806821 1940619
13928A940619j4798L3490l05520j89263M43891j19102r8867n7994j49942J3213
$$ 1940619 1925821 1959311 1653791 1464528 1908419 1789317 1690450 1632456 1482514 1495727
13918A495727J74789M7960j65597K72533j39331J26162j15833M1121m30545M67604
$$ 1495727 1670516 1718476 1552879 1825412 1686081 1812243 1696410 1737531 1306986 1774590
13908A774590k64120J89130k01730J75642k6563r0920p2492K635R216K9741J73168
$$ 1774590 1510470 1699600 1497870 1673512 1646949 1556029 1483537 1486172 1495388 1525129 1698297
13897A698297j90740O1123k23954j116J26351J33241k04138K82788j52032k02500
$$ 1698297 1507557 1568680 1344726 1343610 1469961 1603202 1399064 1681852 1529820 1327320
13887A327320J41490o0925J84913l70157Q0571j76692L23991j74316J59169J34810
$$ 1327320 1468810 1407885 1592798 1222641 1303212 1126520 1450511 1276195 1435364 1570174
13877A570174j74350j84429l53090M53250P5356j34513J37222j35851o4600L36669
$$ 1570174 1395824 1211395 858305 1311555 1386911 1252398 1389620 1253769 1189169 1525838
13867A525838j59991m8416l49365K24527Q6039J0636J62391m09784K4932J26953
$$ 1525838 1365847 1317431 968066 1192593 1278632 1289268 1451659 1041875 1066807 1193760
13857A193760o5316J5357K1586k51224K03025o3150K6508M7187J91643m19650
$$ 1193760 1128444 1143801 1165387 914163 1117188 1054038 1080546 1127733 1319376 899726
13847H99726P20007j43782m79575K43036k51923J36799j17218j00744J6860K18271
$$ 899726 1619733 1475951 996376 1239412 987489 1124288 1007070 906326 923186 1141457
13837A141457q328o5883j03300M6774M55436l06385k15944L48662l510n30050
$$ 1141457 1133129 1067246 963946 1010720 1466156 1159771 943827 1292489 1288979 758929
13827G58929N05919m2146l46310R2212L03936p5182l23125M81700k28119k47441
$$ 758929 1264848 1222702 876392 968604 1272540 1197358 874233 1355933 1127814 880373
13817H80373j41886L96332O1175k30797K96942m48362j1054J87985l6888K66491
$$ 880373 738487 1134819 1195994 965197 1262139 813777 802723 990708 953820 1220311
13807A220311l48922k7243L11895k46915m6044j47070J69179o2170n2595K52637
$$ 1220311 871389 844146 1156041 909126 863082 716012 885191 823021 770426 1023063
13797A023063j16442N6270l30953J30898L0570K06498j75477J12047n2690k5301
$$ 1023063 906621 962891 631938 762836 793406 999904 824427 936474 883784 858483
13787H58483J24004J16873l67918j1909K38J16334J00133K10089r3173j92709
$$ 858483 982487 1099360 731442 719533 719771 836105 936238 1146327 1053154 860445
13777H60445J07962P1042l7711j33247l23733L29865R5887m36047M24555N6659
$$ 860445 968407 1039449 1001738 868491 544758 874623 970510 534463 959018 1015677
13767A015677j85970O382N3825k3658j85668Q9100J77794l64162J1983M43029
$$ 1015677 829707 836089 889914 866256 680588 769688 947482 583320 595303 1038332
13757A038332j57032l66406L17167k3011p851q5703k66980J48098L87323r6990
$$ 1038332 881300 514894 832061 809050 801199 715496 448516 596614 983937 886947
13747H86947j33710j0219j47577j70773M88188k09815o3251L54310l72216j20366
$$ 886947 753237 743018 595441 424668 912856 703041 639790 994100 621884 501518
13737E01518J79335k6730K5345k0411j44451M04851j15811j65017J14766Q0982
$$ 501518 680853 654123 679468 659057 514606 919457 803646 638629 753395 834377
13727H34377k62276N5957K03433m00241L44720l4797J58434j51960r2877J37467
$$ 834377 572101 628058 831491 431250 775970 741173 899607 747647 654770 792237
13717G92237J17075C69072M38592l21722J45667p2327K34623k31031N6008J37893
$$ 792237 909312 369072 807664 485942 631609 559282 793905 562874 618882 756775
13707G56775J03125q0473j72673j32092L86590k49545j55312K36253M9392l42253
$$ 756775 859900 779427 606754 474662 861252 611707 456395 692648 742040 399787
13697C99787J72778N5016r9262J58270l1049K1913J86513C21893P38827D79414
$$ 399787 572565 627581 528319 686589 655540 677453 863966 321893 1060720 479414
13686E93639K7612B52930J99729L3083J39330K52990C99205K37217n4212J16813
$$ 593639 621251 252930 452659 485742 625072 878062 399205 636422 582210 699023
13676F99023j63748R1589p2262j04292J70386o0814K679j20043j06966o7185o0596
$$ 699023 535275 626864 554602 450310 620696 559882 562561 442518 335552 268367 207771
13665B07771M23779j24850j31244K40769k12048K2345m4677J42315j39414k5527
$$ 207771 631550 506700 375456 616225 404177 426522 381845 524160 384746 359219
13655C59219K75853k46099J87912B16769M33896j86715j40210L60298r6433R3017
$$ 359219 635072 388973 576885 216769 650665 463950 323740 684038 587605 680622
13645F80622k38508q6838p8262K79487j48053J49145j88624L20982k88860j4035
$$ 680622 442114 355276 277014 556501 408448 557593 368969 689951 401091 387056
13635C87056K67964B29725K94455k27689M14074k92127P9035J91333j18391K2187
$$ 387056 655020 229725 524180 296491 710565 418438 497473 688806 570415 592602
13625E92602k74261M22941C17047A18339K22801P3739r2739J13106N5594j62876
$$ 592602 318341 741282 317047 118339 341140 414879 322140 435246 490840 327964
13615C27964J9384R2511J37276k32805L2930K50681l13344m0876L16163k29920
$$ 327964 347348 439859 577135 344330 377260 627941 314597 273721 589884 359964
13605C59964m2912q7457L61675B12782L8337J99307l4413H6215J40954K91612
$$ 359964 317052 229595 591270 212782 251119 450426 416013 86215 227169 518781
13595E18781j73496j35948K73465o1502E4869J95918O9962K93144k73096K18574
$$ 518781 345285 209337 482802 421300 54869 250787 320749 613893 340797 559371
13585E59371K4215j26135J99066B83756J02070G7182L22628J42168p1357n1783
$$ 559371 583586 457451 656517 283756 385826 77182 399810 541978 470621 418838
13575D18838J79193B31033K6793Q0262J01594a9867C63652N1027A84914J87708
$$ 418838 598031 231033 257826 338088 439682 -19867 363652 414679 184914 372622
13565C72622l1518A68990J52318L02972l10486J74515r2785N9458j54700m8381
$$ 372622 341104 168990 321308 624280 313794 488309 395524 454982 300282 251901
13555B51901J01022k9665K02815q605A22967B661M28912B15594K36242A39825
$$ 251901 352923 323258 526073 517468 122967 2661 431573 215594 451836 139825
13544E66049k16317L8070j90296J53955K786b8195A55047a7005E77564j00970
$$ 566049 349732 387802 197506 351461 354247 -28195 155047 -17005 577564 476594
13534D76594K39290k07064j78635j31087L92172A72489J39822K0803A61521J77796
$$ 476594 715884 508820 330185 199098 591270 172489 312311 333114 161521 339317
13524C39317A42282M61542B32862J06979p7449J60095Q0539j47062k3890L04346
$$ 339317 142282 603824 232862 339841 262392 422487 503026 355964 332074 636420
13514F36420j64705D3128J42430L27749G7996K49820l8810O358H1847K13605j1923
$$ 636420 471715 43128 185558 513307 77996 327816 289006 295364 81847 295452 283529
13503B83529C6018L36008L583r0331J95112q1108J7165N7327o6199k235q2433
$$ 283529 36018 372026 375609 285278 480390 399282 416447 473774 407575 405340 322907
13492C22907a12823D28912j52905G7854D777M08608j83596J25236j10747K66356
$$ 322907 -112823 428912 276007 77854 4777 413385 229789 355025 244278 510634
13482E10634j5870A65422J83927K71125k81019j33210r0481M11101j04083j4333
$$ 510634 494764 165422 349349 620474 339455 206245 115764 526865 422782 408449
13472D08449A87946J6401L03375j79424k6118j32108M4877M3180q3703H5082K09994
$$ 408449 187946 204347 507722 328298 302180 170072 214949 258129 174426 85082 295076
13461B95076l7957D0529M82066B35512M2883q7758L61130m2005A05156J64469
$$ 295076 257119 40529 522595 235512 278395 190637 551767 509762 105156 269625
13451B69625A34067j7953b2029A07140L42433j71519K93155B50717j14973L9535
$$ 269625 134067 116114 -22029 107140 449573 278054 571209 250717 135744 175279
13441A75279K83090j95293L23920B10380d7731j17530C41998e8962G5962J26365
$$ 175279 458369 263076 586996 210380 -47731 -165261 341998 -58962 75962 202327
13431B02327J56671O7245q4106C5911J61847J51506j71143J93599J41558A52616
$$ 202327 358998 426243 342137 35911 197758 349264 178121 371720 513278 152616
13420C85195j89358J7013n1410Q8724m4094J89883A69468J20060J2268n8762J65013
$$ 385195 195837 212850 161440 250164 206070 395953 169468 289528 301796 243034 408047
13409D08047j83626O2874K85225a31145H8079L20987j92843K00855j01969P7258
$$ 408047 224421 287295 572520 -131145 88079 409066 216223 417078 315109 392367
13399C92367l7266E9974N04804B70419B8774M7893R7429K62275A49676M54952
$$ 392367 355101 59974 564778 270419 28774 76667 174096 436371 149676 604628
13389F04628A76222B0363R6234K34360a07665B13969p1087N267J97879E2039M48138
$$ 604628 176222 20363 116597 350957 -107665 213969 142882 148149 346028 52039 500177
13378E00177B3554J05292P5616j8468K77603k30173O8673o4811k2737G5547J17452
$$ 500177 23554 128846 204462 185994 463597 233424 302097 237286 214549 75547 192999
13367A92999g4261D75262k18390k5570J9049A04821J92313f1995E09783j77126
$$ 192999 -74261 475262 256872 231302 250351 104821 297134 -61995 509783 332657
13357C32657A33775P1709m8425K27198C1114M39524A77263L26786A75877q3852
$$ 332657 133775 205484 157059 384257 31114 470638 177263 504049 175877 92025
13347I2025K28229j16830K74132k22721O4588N1695J67510A90229K09149j84964
$$ 92025 320254 203424 477556 254835 319423 371118 538628 190229 399378 214414
13337B14414J43670P0973A46859l565g1976C89977O6794A58719J27239D1500L08010
$$ 214414 358084 429057 146859 143294 -71976 389977 456771 158719 285958 41500 349510
13326C49510j16715B7759J93754a57903F4207J35039K7332A1418N24690A34706
$$ 349510 232795 27759 221513 -157903 64207 199246 226578 11418 536108 134706
13315B50251j01775J76314L7351j16493a33920B64420P4372D2079J1969J64357
$$ 250251 148476 324790 362141 245648 -133920 264420 338792 42079 54048 218405
13305B18405j02547a24953B04213D3256l907Q7070k7594P3139L1761m9276e0269
$$ 218405 115858 -124953 204213 43256 39349 126419 98825 171964 203725 154449 -50269
13293B48388J26469h1276A56335E9402N41603a61984E37732b302C02457c8126
$$ 248388 374857 -81276 156335 59402 601005 -161984 537732 -2302 302457 -38126
13282A57040M9393J13714a34812A79170O9308H577J51223J56966M4353j42181
$$ 157040 206433 320147 -134812 179170 248478 8577 159800 316766 361119 218938
13272B18938k3722k7915K23591D8803Q2005l4155k3945O4539Q6525L9255g3291
$$ 218938 195216 167301 390892 48803 130808 96653 72708 137247 223772 263027 -73291
13260A83113o2077B142K36376d8511A12940N7422J50542g5066c6717A56229J18306
$$ 183113 121036 2142 238518 -48511 112940 170362 320904 -75066 -36717 156229 274535
13249B74535O678d9724A42329K6479Q0328J61219A26908D2821a99978Q7364N1501
$$ 274535 281213 -49724 142329 168808 249136 410355 126908 42821 -199978 -112614 -61113
13238f1113j60911A85942J69420A47521N6263l9815d1712D33850G2348K69935
$$ -61113 -222024 185942 355362 147521 203784 163969 -41712 433850 72348 342283
13228C42283p0842p7482J47014a37627A4954J44975g9422j47434F0956J37421
$$ 342283 271441 193959 340973 -137627 14954 159929 -79422 -226856 60956 198377
13218A98377r6233J32904K6548e3286C4831b4835r666C17583l7922c7579A89388
$$ 198377 102144 235048 261596 -53286 34831 -24835 -34501 317583 279661 -37579 189388
13206a44449A79729K64583C3141g7170A65087b6722C99645A9684K89752j19367
$$ -144449 179729 444312 33141 -77170 165087 -26722 399645 19684 309436 190069
13196A90069H0869j076a27620F5008J42871K27779R346B22366o7529K30007i9797
$$ 190069 80869 79793 -127620 65008 207879 435658 445004 222366 154837 384844 -99797
13184B67977J80907A93930H9691L8781p840n7409O6096a51307K5139A26406a521
$$ 267977 448884 193930 89691 128472 120632 63223 129319 -151307 -126168 126406 -1521
13172d511r4479A16509d6349A07587m2158K45785p1024E5392K00382F8142M1426
$$ -4511 -98990 116509 -46349 107587 65429 311214 240190 55392 255774 68142 109568
13161A09568m4228a64803g1354A31006M2952h9766F0402J97120r2406n0310K55981
$$ 109568 65340 -164803 -71354 131006 173958 -89766 60402 257522 165116 114806 370787
13150C70787q5647a86539i0103K0865B94925p8999a2885E7284J23789E0321P7287
$$ 370787 285140 -186539 -90103 -69238 294925 215926 -12885 57284 181073 50321 127608
13139A27608j4606k3047L20535A7335f0150B74196j08346K3398P2061p1910L21023
$$ 127608 113002 89955 410490 17335 -60150 274196 165850 189248 261309 189399 510422
13128E10422e5748E66896B23492A7848c4775B0436L1441K61893a23370L6664A96348
$$ 510422 -55748 566896 223492 17848 -34775 20436 51877 313770 -123370 -86706 196348
13116H3888c1831j16877k62386h9346B35813J01287j47865F0276N5706k8009J24799
$$ 83888 -31831 -148708 -411094 -89346 235813 337100 189235 60276 115982 87973 212772
13105B12772L3552M6797C2478J49287A6749b27861Q8037A3727a41807A78306G8868
$$ 212772 246324 293121 32478 181765 16749 -227861 -139824 13727 -141807 178306 78868
13093h5231E2761O6420K18937l2607Q1582b69898f3398e143B03073J27165p5183
$$ -85231 52761 119181 338118 305511 387093 -269898 -63398 -5143 203073 330238 255055
13082B55055k3423a817B48440b12359A79992f867A00636K29398c09D46669q8291
$$ 255055 231632 -1817 248440 -212359 179992 -6867 100636 330034 -309 446669 358378
13071C58378a7459A34692j8886D4869a28404C32465A0782c892A85042L2659E3921
$$ 358378 -17459 134692 115806 44869 -128404 332465 10782 -3892 185042 217701 53921
13059I4347a27581A4473J82201h8365I9752O0515a54250B99194F7060R8915M6852
$$ 94347 -127581 14473 196674 -88365 99752 160267 -154250 299194 67060 165975 212827
13048B12827K99399A45456b47138H9559P6732D9239a89407A54098L9952c29821
$$ 212827 512226 145456 -247138 89559 166291 49239 -189407 154098 194050 -329821
13037A33090J82034h9441n868b9831k9908C7655L70206A33645J01076q1043a13957
$$ 133090 315124 -89441 -95309 -29831 -59739 37655 407861 133645 234721 153678 -113957
13025B82626H0349P5239Q6317L10344h2564A15906J13080E8875a15506J7037A17110
$$ 282626 80349 155588 241905 552249 -82564 115906 228986 58875 -115506 -98469 117110
13013b11957a04097E2242a00878G2926j3198J54287K37147M6462B04510a32965
$$ -211957 -104097 52242 -100878 72926 59728 214015 451162 497624 204510 -132965
13002G5939Q5584m9741c78354B80160j4947L3286a99389d2825B23413M6578P4057
$$ 75939 161523 111782 -378354 280160 265213 298499 -199389 -42825 223413 269991 344048
12991C44048n3318l9632k3737G5332a76987A23934h883E1608p750N4759a23059
$$ 344048 290730 251098 227361 75332 -176987 123934 -8883 51608 43858 98617 -123059
12979A70579a32699A93576j1797e2944F8753b0962D6197c87192A83639J38269
$$ 170579 -132699 193576 181779 -52944 68753 -20962 46197 -387192 183639 321908
12969C21908j02383m9671a4416C21663A28361l1326M8492R4444F0627K96033H7571
$$ 321908 219525 169854 -14416 321663 128361 97035 145527 239971 60627 356660 87571
12957b36635A14945Q4245K61185A07160O8549b45027c0109k12357M0189A19450
$$ -236635 114945 199190 460375 107160 175709 -245027 -30109 -242466 -202277 119450
12946i1815A86043c7829I53a65357B6700M21782A68685a6995q901q6860B4657
$$ -91815 186043 -37829 953 -165357 26700 448482 168685 -16995 -25896 -112756 24657
12934B25434e5565G51J84369C8886K17739i1459c2866H3626j6972K95264M1447
$$ 225434 -55565 751 185120 38886 256625 -91459 -32866 83626 66654 361918 403365
12923D03365j22497a51612A26015f4696B52961c1264j6899A83379K7035A5508
$$ 403365 280868 -151612 126015 -64696 252961 -31264 -48163 183379 210414 15508
12912B145L0013J60590C3309P0682g9307A91948C6628K07324J70937A10718B4130
$$ 2145 32158 192748 33309 103991 -79307 191948 36628 243952 414889 110718 24130
12900A46340b4438k82585a43659f2711A91003H0386a03318e1583o0902a234D5268
$$ 146340 -24438 -307023 -143659 -62711 191003 80386 -103318 -51583 -112485 -1234 45268
12888H8222J62846a9833A38133D670R2944J64074c70835a40957f0702B38267c49156
$$ 88222 251068 -19833 138133 4670 97614 261688 -370835 -140957 -60702 238267 -349156
12876B68384a68805Q0069H3721b80721e0635k01431K1037C33501B1883J29267
$$ 268384 -168805 -88736 83721 -280721 -50635 -252066 -231029 333501 21883 151150
12866A51150L8933a89357B17064K23106F4148J03885J18170d4029A01930J9337
$$ 151150 190083 -189357 217064 440170 64148 168033 286203 -44029 101930 121267
12856A21267P301B5362L344K63327b93759F2702b84437I2141k1514b13300c4009
$$ 121267 128568 25362 28706 292033 -293759 62702 -284437 92141 70627 -213300 -34009
12844I4536a10435C8049J2052J91023A14209b90569f2750m5052C79294A28590
$$ 94536 -110435 38049 50101 241124 114209 -290569 -62750 -107802 379294 128590
12833A03945a30271j74104A54692h9493j57506B18988j00292a88521d0992j4027
$$ 103945 -130271 -304375 154692 -89493 -246999 218988 118696 -188521 -40992 -55019
12823e5019j55160E9570P3309O9018q9455c9894C331L1321L08205b32040A03334
$$ -55019 -210179 59570 132879 201897 112442 -39894 3331 34652 342857 -232040 103334
12811b23041C02781j43726l7454b64635c7693j33701E7408e1043k0720A22855
$$ -223041 302781 159055 121601 -264635 -37693 -171394 57408 -51043 -71763 122855
12800F2855a26192B4593M0405J30445I2115A5063J97053G7843O9714j1976b38338
$$ 62855 -126192 24593 64998 195443 92115 15063 212116 77843 147557 135581 -238338
12788D4932d4874H5352J87747a46238m4745j573C5931R8400k0975E0625n506b67934
$$ 44932 -44874 85352 273099 -146238 -190983 -192556 35931 134331 113356 50625 45119 -267934
12775b88476O5714M8336K7837r9525E2995c01872h0130F3592A0398J43389o2403
$$ -288476 -222762 -174426 -146589 -246114 52995 -301872 -80130 63592 10398 153787 91384
12764I1384J5663K5582B0993b32978B31795B8606a84405c213l43811A85152f4251
$$ 91384 107047 132629 20993 -232978 231795 28606 -184405 -3213 -347024 185152 -64251
12752a36336F9482R2308G7505a60124G9927r646b2862G3280b86162D18608a93378
$$ -136336 69482 161790 77505 -160124 79927 70281 -22862 73280 -286162 418608 -193378
12740A42760b89708A57061N9607A04919K28751a77647G7859a5652j6953B02886
$$ 142760 -289708 157061 216668 104919 333670 -177647 77859 -15652 -32605 202886
12729A9934M53974A49018a48945A08054J4160D5944e6578k01957H559J73277K4683
$$ 19934 473908 149018 -148945 108054 122214 45944 -56578 -258535 8559 181836 206519
12718B06519k1858N4384E202J15814a67272A80881l6272j3135K91962j66003A14092
$$ 206519 184661 239045 5202 121016 -167272 180881 144609 131474 423436 257433 114092
12706A59831c07011B9187J83321M6721L05266j42541e6372C77629A19362A0462
$$ 159831 -307011 29187 212508 259229 564495 421954 -56372 377629 119362 10462
12695b3229D8424J85656B186P2646a48092A98419A7443J38312k2733e1387D0390
$$ -23229 48424 234080 2186 74832 -148092 198419 17443 155755 133022 -51387 40390
12683G9771J58553K400a33143A92620p6132J95909D5008a21336A26927K91095
$$ 79771 238324 240724 -133143 192620 116488 312397 45008 -121336 126927 418022
12673D18022A70609a0363A38838c0702B7295c38523B82666F3721p898a99443C55101
$$ 418022 170609 -10363 138838 -30702 27295 -338523 282666 63721 55823 -199443 355101
12661D49020H7844J40109c9861B22481G3488c0979C12927O6191j04541I5337C9834
$$ 449020 87844 227953 -39861 222481 73488 -30979 312927 379118 274577 95337 39834
12649D55017A32673k0149M34027a17480A21431a33366N8155l2102B0399c48343
$$ 455017 132673 112524 546551 -117480 121431 -133366 -75211 -107313 20399 -348343
12638b0517E1961a3836m4531l6176B28148H0826M2583R1474N1473p0260A9833
$$ -20517 51961 -13836 -58367 -94543 228148 80826 123409 214883 266356 196096 19833
12626g3237B46487j04758J36825D305J28827K07551m8985H68O1180c6317A35928
$$ -73237 246487 141729 278554 4305 133132 340683 291698 868 62048 -36317 135928
12614a57073A36961K46231k6319a91525R3780j72383B28273b76208R7705d9632
$$ -157073 136961 383192 356873 -191525 -97745 -270128 228273 -276208 -178503 -49632
12603a7303A89014B1587J4322J7768O8041f2897F2444j9117K97142c6507A63322
$$ -17303 189014 21587 35909 53677 121718 -62897 62444 43327 340469 -36507 163322
12591B70419j1362d4530k54647E52362A13207a85267A01634l6275a9879j00839
$$ 270419 259057 -44530 -299177 552362 113207 -185267 101634 65359 -19879 -120718
12581a20718B6786f634A24846K2926K2492a07026A36837K15940I3107g3260G0925
$$ -120718 26786 -6634 124846 147772 170264 -107026 136837 352777 93107 -73260 70925
12569g1227k0548d3802B2866L43468a21864d0978F3940J96268b84901f1701m7668
$$ -71227 -91775 -43802 22866 366334 -121864 -40978 63940 260208 -284901 -61701 -109369
12558a09369A38746O8114H4403d9090D03570a86902m0129f5457A72352A1825L6184
$$ -109369 138746 206860 84403 -49090 403570 -186902 -227031 -65457 172352 11825 48009
12547D8009L9165J24223H0819b61358I4254A2956a13108A72328a81945f7032E5680
$$ 48009 87174 211397 80819 -261358 94254 12956 -113108 172328 -181945 -67032 55680
12535B57877m5779h6130F1335g9481A62970K03117A60531D9461M11673A21857
$$ 257877 212098 -86130 61335 -79481 162970 366087 160531 49461 461134 121857
12524A99243o0757e9310k21542J39528j43546M6406i4021A01123a82234B54a04516
$$ 199243 138486 -59310 -280852 -141324 -284870 -238464 -94021 101123 -182234 254 -104516
12512a09131A46884J21040b85464a0869j99540P2659G7170K24096a60388C6189
$$ -109131 146884 267924 -285464 -10869 -210409 -137750 77170 301266 -160388 36189
12501c14601c7699k80252N1191B87745e8071C39607a01136G5840e74376c623j5689
$$ -314601 -37699 -317951 -266760 287745 -58071 339607 -101136 75840 -574376 -3623 -19312
12490a9312l1948A75206L16986a02535A09339a95200F2877k8600h6936f360B81360
$$ -19312 -51260 175206 492192 -102535 109339 -195200 62877 34277 -86936 -6360 281360
12478C00282a9675l773k64467c7061A6822a06009j567A62785c35073L4022N1358
$$ 300282 -19675 -23448 -287915 -37061 16822 -106009 -107576 162785 -335073 -301051 -249693
12467b49693F9066a86130J0942k9908l4178C66808A4062f7430k05029A35696c141
$$ -249693 69066 -186130 -175188 -205096 -239274 366808 14062 -67430 -272459 135696 -3141
12455E9521h8415B52212a05789n4429C19646a35661A9116J28984B7196J91883
$$ 59521 -88415 252212 -105789 -160218 319646 -135661 19116 148100 27196 219079
12445B19079g9085a3377A34097c4840p042j5904a9901E6026e040m2206A07212
$$ 219079 -79085 -13377 134097 -34840 -41882 -57786 -19901 56026 -5040 -47246 107212
12433a90075K93M9589J2677B58966d14023P2323c9420A32115b01390i1446B59340
$$ -190075 -189782 -140193 -127516 258966 -414023 -341700 -39420 132115 -201390 -91446 259340
12421b53065f268D5439J57533r5082j9493j2315d8123E8928A5912L84569A8248
$$ -253065 -6268 45439 202972 107890 88397 76082 -48123 58928 15912 400481 18248
12409a0502r0122A18694H798K25251C4653a62108N2457E316K90040j42876f5912
$$ -10502 -100624 118694 8798 234049 34653 -162108 -109651 5316 295356 152480 -65912
12397A42420O7890I6095a65555A48332m1985d8166D7926M7820J68489C6484P1347
$$ 142420 210310 96095 -165555 148332 106347 -48166 47926 95746 264235 36484 107831
12386A07831b25225h3633E2051b04608C42296h5290l9682B5247L2913H549a60675
$$ 107831 -225225 -83633 52051 -204608 342296 -85290 -124972 25247 58160 8549 -160675
12374F2793K14564F8409b09856A64696O4247a61334j50226i7484n0261a9994E8057
$$ 62793 277357 68409 -209856 164696 228943 -161334 -311560 -97484 -147745 -19994 58057
12362f8255r3174d2542j18461A29399h616A07166L4578m9521J42366b91063B1180
$$ -68255 -161429 -42542 -161003 129399 -8616 107166 141744 92223 234589 -291063 21180
12350A9844J16777A1645J07264c00086i2368A93790m5227E928b83518c0439I173
$$ 19844 136621 11645 118909 -300086 -92368 193790 148563 5928 -283518 -30439 9173
12338I2097g2297k61848N1503J12083L8726A88631e401A57746m4019J16886a54535
$$ 92097 -72297 -334145 -282642 -170559 -131833 188631 -5401 157746 113727 230613 -154535
12326B58964a14101l93361B95498k9520H1590b0280C5200a21618f305I3440a72807
$$ 258964 -114101 -507462 295498 265978 81590 -20280 35200 -121618 -6305 93440 -172807
12314a33876J1429A51814J51733B2353Q6607J43118Q0090b62737C33207a53736
$$ -133876 -122447 151814 303547 22353 108960 252078 332168 -262737 333207 -153736
12303d7881B59670p4552a76559l0223j86615Q3855A49594j5149c238I7546e0417
$$ -47881 259670 185118 -176559 -206782 -393397 -309542 149594 134445 -3238 97546 -50417
12291D04726D0257R1944h9956a5983r6582A99951A2666M62677a09994B26652c07183
$$ 404726 40257 132201 -89956 -15983 -112565 199951 12666 475343 -109994 226652 -307183
12279B83415k4379j01246J718a43001B75005j29154k8023A49J71223d3589B13154
$$ 283415 259036 157790 159508 -143001 275005 145851 117828 149 171372 -43589 213154
12267A52626K46485b2228F2112J62222m0865l8119J42314d8935k01642B35229
$$ 152626 399111 -22228 62112 224334 183469 145350 287664 -48935 -250577 235229
12256B82597I7553m2052f4816K5309m6125B22855p4383M2670a03900f32A08896
$$ 282597 97553 55501 -64816 -39507 -85632 222855 148472 191142 -103900 -632 108896
12244A58409P2786A08802j8180B1124J34471J35146j37834l2866a18531D2641
$$ 158409 231195 108802 90622 21124 155595 290741 152907 120041 -118531 42641
12233a9009j55629B32747D27a23103j13367A58090J47195I3983K4826J30994r4359
$$ -19009 -174638 232747 427 -123103 -236470 158090 305285 93983 118809 249803 155444
12222A55444K7185q1943c489A52522a1613B37407K50562l3658L8679C1219J59625
$$ 155444 182629 100686 -3489 152522 -11613 237407 487969 454311 492990 31219 190844
12211A90844J86634j51739P4054A01780L88580A80314a6066B76984B2126K64833
$$ 190844 377478 225739 299793 101780 490360 180314 -16066 276984 22126 286959
12201B86959I6154K94781A23232D0232M04802A85418n7693K20263l4948q1153
$$ 286959 96154 390935 123232 40232 445034 185418 127725 347988 313040 231887
12191B31887D6828J48758B5479K21607r3739j8003L2398a8110p7503B79989r7616
$$ 231887 46828 195586 25479 247086 153347 135344 167742 -18110 -95613 279989 182373
12180A82373K62929B04840E7478K18972P3051C5685K5729L442b6053B61687j22099
$$ 182373 445302 204840 57478 276450 349501 35685 61414 64856 -26053 261687 139588
12169A39588M6716d439H0215P6792C2804J98573d06431B19549H8003N0884C8451
$$ 139588 186304 -4439 80215 157007 32804 231377 -406431 219549 88003 138887 38451
12157B68687b312k58789k0598p772a24195J5775A40921F916J17472J99509K11531
$$ 268687 -2312 -261101 -281699 -289471 -124195 -108420 140921 6916 124388 323897 535428
12146E35428a19811c6674k9156B5196P5100N669J13238i3682M0875A39077a51917
$$ 535428 -119811 -36674 -65830 25196 100296 105965 219203 -93682 -52807 139077 -151917
12134B00252a58194B19961E7287a87869B35796C5051f9417D9877J98363b27161
$$ 200252 -158194 219961 57287 -187869 235796 35051 -69417 49877 248240 -227161
12123A38160d1998a5075A73357c09166J40098C2588L64191a03125D16752h34276
$$ 138160 -41998 -15075 173357 -309166 -169068 32588 396779 -103125 416752 -834276
12112A03632P758N0372q0854c10044e2962j40466C43379a59341A22951n2478J52666
$$ 103632 111390 161762 80908 -310044 -52962 -193428 343379 -159341 122951 70473 223139
12101B23139J0484B0140a20048e2091C3904P5938a166m438B81099b33111d5996
$$ 223139 233623 20140 -120048 -52091 33904 109842 -1166 -5604 281099 -233111 -45996
12089c6019F0321b68572a6938j72724A12965l8895J44536d5180A23524a31427
$$ -36019 60321 -268572 -16938 -189662 112965 74070 218606 -45180 123524 -131427
12078B17727a90787C1568K62809c72599A988K56909M60316J562772p82402A99975
$$ 217727 -190787 31568 294377 -372599 1988 258897 719213 2281985 1499583 199975
12067C71849E5174h0195r227m7485G1659K3443D2502K27736a03404B03870e3016
$$ 371849 55174 -80195 -89422 -136907 71659 95102 42502 270238 -103404 203870 -53016
12055H9151N9522a17581D3756a31984q1665A2845a19549D0192A3926K00464R3586
$$ 89151 148673 -117581 43756 -131984 -213649 12845 -119549 40192 13926 214390 307976
12044C07976a57277F0004b7678l75447h3219k9451A26485A7636b86907P0861A47053
$$ 307976 -157277 60004 -27678 -403125 -83219 -112670 126485 17636 -286907 -216046 147053
12032B987f7143j19130m756d0920n1637j48981A78903H1573R3629D3197i9172
$$ 2987 -67143 -186273 -191029 -40920 -92557 -241538 178903 81573 175202 43197 -99172
12020a82372N0333H3744K2990Q868o381K26265l36O818A00343K2357a63543I0942
$$ -182372 -132039 83744 106734 115602 109221 335486 335150 341968 100343 122700 -163543 90942
12007a49009B01520f3076A92635c05574A63171d920B33092e2684H8522a34439
$$ -149009 201520 -63076 192635 -305574 163171 -4920 233092 -52684 88522 -134439
11996d96681A12791b19184I2546J00047R2738a822G9173b60953P9369m1991C49557
$$ -496681 112791 -219184 92546 192593 285331 -1822 79173 -260953 -181584 -223575 349557
11984c3523k69913B72053a14569j0379A02072A0684O9381i2599c2154K393A16488
$$ -33523 -303436 272053 -114569 -124948 102072 10684 80065 -92599 -32154 -29761 116488
11972d08623B8663b88011J39509o7434C41464A20792a88204C6001f3033k2901
$$ -408623 28663 -288011 -148502 -215936 341464 120792 -188204 36001 -63033 -85934
11962h5934B44888d5830A87109c35j84021j8329c6841l15094I0671B7499K08204
$$ -85934 244888 -45830 187109 -335 -184356 -202685 -36841 -351935 90671 27499 235703
11951B35703C2553f2024G3153k0538a36671B4530c2139A27534B686K88785g0953
$$ 235703 32553 -62024 73153 52615 -136671 24530 -32139 127534 2686 291471 -70953
11939b14383d891H5272e8860j34777A36147b59125C8238b13497F5646K61545b57207
$$ -214383 -4891 85272 -58860 -193637 136147 -259125 38238 -213497 65646 327191 -257207
11927a81422M8458A18700D3157R6842J71163i7046C03461A24220b4352l58049
$$ -181422 -132964 118700 43157 139999 311162 -97046 303461 124220 -24352 -382401
11917c82401A77639e8879C37557j37211F6117P7058a38667A88925a29629K2693
$$ -382401 177639 -58879 337557 200346 66117 143175 -138667 188925 -129629 -106936
11907a06936j59138a6106A88147K2804b2781k1810j81764A76919h0610O693j33013
$$ -106936 -266074 -16106 188147 210951 -22781 -44591 -226355 176919 -80610 -73917 -206930
11896b06930A39261d16526a5934k9155b1958j07546J4414b4579p9341c7140I8887
$$ -206930 139261 -416526 -15934 -45089 -21958 -129504 -115090 -24579 -103920 -37140 98887
11884A73294a76148O0225A03820b57798b4470o8002B4557f4460G5075a92387H6825
$$ 173294 -176148 -115923 103820 -257798 -24470 -92472 24557 -64460 75075 -192387 86825
11872G9577a09314m384B02452c85396A32547P9347A02599a76687k0692c4073A89615
$$ 79577 -109314 -113698 202452 -385396 132547 211894 102599 -176687 -197379 -34073 189615
11860A6678c9366j46939b6511H9138J14594k2225a38410A12483a06265b2136A36875
$$ 16678 -39366 -186305 -26511 89138 203732 181507 -138410 112483 -106265 -22136 136875
11848H4426k6406Q7181a29220A28087j8114A1133K6325J1443J64778a68459B16246
$$ 84426 58020 145201 -129220 128087 109973 11133 37458 48901 213679 -168459 216246
11836a5002M6D3528P3638a33620A0588P4984K6462a37938A06996a12740p9320
$$ -15002 -14956 43528 117166 -133620 10588 85572 112034 -137938 106996 -112740 -192060
11825a92060A91559D9678a05336k2561M0983k26679J6662F699i3760M3089l27882
$$ -192060 191559 49678 -105336 -127897 -86914 -313593 -296931 6699 -93760 -50671 -378553
11814c78553A13767c82887B08154I3528a96266h8516A00293j101a83539A91665
$$ -378553 113767 -382887 208154 93528 -196266 -88516 100293 99192 -183539 191665
11803F7986k300B8681g0189p5985K714f608n6530C09482c36664O7808H0362R5415
$$ 67986 65686 28681 -70189 -146174 -143460 -6608 -63138 309482 -336664 -268856 80362 175777
11791A75777H7173A4726L0102i6868D341J72472b34108I9603K10640b44787O7263
$$ 175777 87173 14726 44828 -96868 4341 176813 -234108 99603 310243 -244787 -177524
11780a77524G3763C6505J18784b56542M3971B5548d31877a29574A54399J37900
$$ -177524 73763 36505 155289 -256542 -212571 25548 -431877 -129574 154399 292299
11770B92299I0418L1685a05725K7502G9145l4203d6568p6529C2527J0126e709
$$ 292299 90418 122103 -105725 -78223 79145 44942 -46568 -123097 32527 42653 -5709
11758i3873j14356F6244B8080a4578k26466B5962c15596a10466g991j33816b5804
$$ -93873 -208229 66244 28080 -14578 -241044 25962 -315596 -110466 -7991 -141807 -25804
11746b58213A92953D8756a69660d1364G2867q956q551P0632j0226a5146j62620
$$ -258213 192953 48756 -169660 -41364 72867 63911 55360 125992 115766 -15146 -177766
11735a77766G9358O8691b78601d1109j50181B17363b93526I7655b51232M0176
$$ -177766 79358 148049 -278601 -41109 -191290 217363 -293526 97655 -251232 -211056
11725b11056H7862J1654D0833P0578a20922j49981B2506P988L22602I3367L8175
$$ -211056 87862 99516 40833 111411 -120922 -270903 22506 30494 353096 93367 131542
11714A31542A6632Q2296B7755b4847B39389b5011n268f860k76797D578O5791N682
$$ 131542 16632 98928 27755 -24847 239389 -25011 -30279 -6860 -283657 4578 70369 76051
11702G6051a50724I1004h9035c0507B25438F0987M3957K73766c9228B5550h2832
$$ 76051 -150724 91004 -89035 -30507 225438 60987 104944 378710 -39228 25550 -82832
11690A25119P4602h1866b8006E2390J28420a61218A91473P0868k9988b57430a19107
$$ 125119 199721 -81866 -28006 52390 180810 -161218 191473 262341 232353 -257430 -119107
11678a70573B4850a39038A11504j5879a30204C58031a07216k31446D09498a34560
$$ -170573 24850 -139038 111504 95625 -130204 358031 -107216 -338662 409498 -134560
11667a9788k97620A1798O8198h2777B83698p9870F241a93240Q715A39327c3181
$$ -19788 -317408 11798 79996 -82777 283698 203828 6241 -193240 -184525 139327 -33181
11655A48266K7653c6286F0708J26217K54284r0604j6966A31737f8885o0607N3420
$$ 148266 175919 -36286 60708 186925 441209 350605 333639 131737 -68885 -129492 -76072
11644g6072H9002K3885k4932a74847B28836d0258E0247N1505l2715a4083p1683
$$ -76072 89002 112887 87955 -174847 228836 -40258 50247 101752 69037 -14083 -85766
11633h5766q220j193A4875a27153I6456b50050A66800F2300J51830m5370o6846
$$ -85766 -93986 -95179 14875 -127153 96456 -250050 166800 62300 214130 168760 101914
11622A01914C0770R9143Q5278o796D3458c0450C08115F8885B5037b3616J0212
$$ 101914 30770 129913 215191 208395 43458 -30450 308115 68885 25037 -23616 -13404
11611a3404C29764b68223E7755J83024o728D6618h7215L7484l1486j70628C8762
$$ -13404 329764 -268223 57755 240779 234051 46618 -87215 -49731 -81217 -251845 38762
11599B68327j11558K587J04164j18548c57329c7260A92780l8751J4978J2678J49635
$$ 268327 156769 159356 263520 144972 -357329 -37260 192780 154029 169007 181685 331320
11588C31320j30175a99310B11449f292B25153A04649b5139D70687f7174E51222
$$ 331320 201145 -199310 211449 -6292 225153 104649 -25139 470687 -67174 551222
11577A13020E6372h7942J1647A47413n4084k8226L23838A7951N7230l5892a16584
$$ 113020 56372 -87942 -76295 147413 93329 65103 388941 17951 75181 39289 -116584
11565c0067p5120B41366c42878a31812D475K37111e3752A16100a39548B66053
$$ -30067 -105187 241366 -342878 -131812 4475 241586 -53752 116100 -139548 266053
11554a35863A76983b7852C18352C0113a0705r0526o1167k2498A53166E7390Q5353
$$ -135863 176983 -27852 318352 30113 -10705 -101231 -162398 -184896 153166 57390 142743
11543A42743k3354J54464b95911A2035L29505F636L23656j6013a25666B18878
$$ 142743 119389 273853 -295911 12035 341540 6636 330292 314279 -125666 218878
11532i0851B42602D8669J76989o0387b31640f9708K6002j8630a3191A85957J9749
$$ -90851 242602 48669 225658 165271 -231640 -69708 -43706 -62336 -13191 185957 205706
11521B05706a5143j1620E2099M89160a22974A33457c29771C68405d0000B8982
$$ 205706 -15143 -26763 52099 541259 -122974 133457 -329771 368405 -40000 28982
11510c9631C4144b04373E32545A50741e6620C30533B1604h9921B81556J33449
$$ -39631 34144 -204373 532545 150741 -56620 330533 21604 -89921 281556 415005
11500D15005B5858K24627J1429D8605K16517a07848E4271R6561k2536m5017c7234
$$ 415005 25858 250485 261914 48605 265122 -107848 54271 150832 128296 83279 -37234
11488C4577J08458P2817c9100H5909K0461J35415i6211B54890A9074K23029q6429
$$ 34577 143035 215852 -39100 85909 106370 241785 -96211 254890 19074 242103 155674
11477A55674k0494o2480A2188P9948d8262F140K28139G4691b7281C56689j13621
$$ 155674 135180 72700 12188 92136 -48262 6140 234279 74691 -27281 356689 243068
11466B43068J7584F7345K9651E258a17079C06730i4648A78011L22530c5505A5352
$$ 243068 260652 67345 96996 5258 -117079 306730 -94648 178011 500541 -35505 15352
11454H5959J64179D6356L2361L7147N4684P459m1320a87602c1244B16605a09518
$$ 85959 250138 46356 78717 115864 170548 178007 136687 -187602 -31244 216605 -109518
11442B72955A26312Q9186c30980A21484a33495I266K275Q357f8533C45077a83437
$$ 272955 126312 215498 -330980 121484 -133495 9266 11541 19898 -68533 345077 -183437
11430A45226F4443K32177m1372j20847j0585h9155j1539k5085K2265A872J25803
$$ 145226 64443 296620 255248 134401 123816 -89155 -100694 -125779 -103514 1872 127675
11419A27675P7143b64268Q8283p80A47159a39263K3911A48651a03678m2979n8617
$$ 127675 204818 -264268 -175985 -176765 147159 -139263 -115352 148651 -103678 -146657 -205274
11408b05274A34468L53723a77260G8723k4992J2745M3875a12405B9706Q6337c9373
$$ -205274 134468 488191 -177260 78723 53731 66476 110351 -112405 29706 116043 -39373
11396A74307b04116A3528J64099P5770a85537A48480b71454e5384a9759A23204
$$ 174307 -204116 13528 177627 253397 -185537 148480 -271454 -55384 -19759 123204
11385A0533J77996d599B55225c45817G9744i4160C10573j54259a6008r5703E4869
$$ 10533 188529 -4599 255225 -345817 79744 -94160 310573 156314 -16008 -111711 54869
11373b2242j02391H2363C0994a50060k18962B23809j8928H0425k1554b19331j01667
$$ -22242 -124633 82363 30994 -150060 -369022 223809 204881 80425 58871 -219331 -320998
11362c20998a59081B98051b79110m9210A3894e0591j49909A01766J22125k0409
$$ -320998 -159081 298051 -279110 -328320 13894 -50591 -200500 101766 223891 203482
11352B03482a59205M7273A59503n5499g8844k11814P7719f9357C00047C8927K09905
$$ 203482 -159205 -111932 159503 104004 -78844 -290658 -212939 -69357 300047 38927 248832
11341B48832E0526d0887k07211g6850j46416M8236g8722j43895A50948b76246
$$ 248832 50526 -40887 -248098 -76850 -223266 -175030 -78722 -222617 150948 -276246
11330C3295b42898D8303K65756J41005c1420A62706a38948o479C8898j4263b19214
$$ 33295 -242898 48303 314059 455064 -31420 162706 -138948 -145427 38898 24635 -219214
11318a6227k64819G3109R9032b30711j30542A38074J49286A33890a78568j24187
$$ -16227 -281046 73109 172141 -230711 -361253 138074 287360 133890 -178568 -302755
11308c02755d259A56518p5833B4152J1102b12798g5071D1153b37125B31021F0420
$$ -302755 -4259 156518 80685 24152 35254 -212798 -75071 41153 -237125 231021 60420
11296E2806j0085e9143j15774D5268h9049q059m9709e8084K3041j86315d9232
$$ 52806 42721 -59143 -174917 45268 -89049 -97108 -146817 -58084 -35043 -221358 -49232
11284d5815B24451B7044A1169N6572O1254b72599J08188B74686E6796b77410G2211
$$ -45815 224451 27044 11169 67741 128995 -272599 -164411 274686 56796 -277410 72211
11272H2999a52335o5194A19183K44337J5033D1095i0881n6237I2862a28384B0012
$$ 82999 -152335 -217529 119183 363520 378553 41095 -90881 -147118 92862 -128384 20012
11260E7880b00960C01596G904K93192A37041a39393a4327n01968A523a32063N2089
$$ 57880 -200960 301596 7904 301096 137041 -139393 -14327 -516295 1523 -132063 -79974
11249g9974B83677m832a19849A95964b25254F3b32282j02681A16737a80343A76283
$$ -79974 283677 278845 -119849 195964 -225254 63 -232282 -334963 116737 -180343 176283
11237a03495C92379f600C945a31402I4769c63147J28570D983M3323c3330l46105
$$ -103495 392379 -6600 3945 -131402 94769 -363147 -234577 4983 48306 -33330 -379435
11226c79435A65531a80620A11062J17684L4613H80J30757j0499J99373j57458
$$ -379435 165531 -180620 111062 228746 263359 880 131637 121138 320511 163053
11216A63053g3503k51332A40673o0946a6764B14486b19733A87387h7053H0488
$$ 163053 -73503 -324835 140673 79727 -16764 214486 -219733 187387 -87053 80488
11205D6211a25279b7426A06555a41384o7922F9518J86973A14165b48741P5325
$$ 46211 -125279 -27426 106555 -141384 -209306 69518 256491 114165 -248741 -173416
11195a73416c0343m4122C7902a71805A21874c13798a33488j61384A17120Q4825
$$ -173416 -30343 -74465 37902 -171805 121874 -313798 -133488 -294872 117120 201945
11185B01945a28352k54733A63464f2998B6433L3372a3298j45398B19386H923a52272
$$ 201945 -128352 -383085 163464 -62998 26433 59805 -13298 -158696 219386 8923 -152272
11173b28262j33166J64452R4197k2104b9136l01915e6952j05582q234k72325A53941
$$ -228262 -361428 -196976 -102779 -124883 -29136 -331051 -56952 -162534 -170768 -443093 153941
11161C49550a11997C4677A3205J9129i4859A98263a02226j11557o6981D164N3335
$$ 349550 -111997 34677 13205 32334 -94859 198263 -102226 -213783 -280764 4164 57499
11150E7499a19899r5658o3714G5788a71825B62542F6437c3115J0989r7596A12991
$$ 57499 -119899 -215557 -279271 75788 -171825 262542 66437 -33115 -22126 -119722 112991
11138A04490K84477a91041h8005A51542b9874A04539m9404a87576E8533b62635
$$ 104490 388967 -191041 -88005 151542 -29874 104539 55135 -187576 58533 -262635
11127B59108q1998a8943C264a08921K0825J4092A61779p8622J49124a75390G290
$$ 259108 177110 -18943 3264 -108921 -88096 -74004 161779 83157 232281 -175390 7290
11115b06222E8670a28300O2320A10902e26121B42973p9664G5140c310C2076R5862
$$ -206222 58670 -128300 -65980 110902 -526121 242973 163309 75140 -3310 32076 127938
11104A27938J16605b61585D37984j1362p5827O7974I9437N1675D5440b6946C06009
$$ 127938 244543 -261585 437984 426622 350795 418769 99437 151112 45440 -26946 306009
11092A74856J06335P1480p5510J52016c0962B82410E4627e8772m9463A42345a26069
$$ 174856 281191 352671 277161 429177 -30962 282410 54627 -58772 -108235 142345 -126069
11080B56995b6542B9987A1325O81706A40425D7951R4756J49229p6784Q0373e4178
$$ 256995 -26542 29987 11325 693031 140425 47951 142707 291936 215152 295525 -54178
11068C18010a06809C03713J18235p4187N9362A27606M13973K06927j89103J45539
$$ 318010 -106809 303713 421948 347761 407123 127606 541579 748506 559403 704942
11058G04942l6300m3566O3764n1092j72553K45029J53734j33908l2582K79676
$$ 704942 668642 625076 688840 637748 465195 710224 863958 730050 697468 977144
11048I77144k96232r40K44513j87453L04975m09654Q0468J76607l30169J21446
$$ 977144 680912 679972 924485 737032 1042007 632353 712821 889428 559259 680705
11038F80705j12K10846k39734n8646q0329L97740k12726J10839l1736J12887q4908
$$ 680705 680593 891439 651705 593059 512730 910470 697744 808583 776847 889734 804826
11027H04826k5331l80241L25361P7451j00138k6291J64158l11705J8647N0556
$$ 804826 779495 399254 724615 802066 701928 675637 839795 528090 546737 597293
11017E97293l2705N9799m0980M6693n6000M53167m11531R7037J84042K74355n72241
$$ 597293 564588 624387 583407 630100 574100 1027267 615736 712773 896815 1171170 598929
11006E98929q1974r3829M84099j33442j76166R1303k01778L30391o8630L16983
$$ 598929 516955 423126 907225 773783 597617 688920 487142 817533 748903 1065886
10996A065886m07040j23803L04420k03564p0170K78077O7347Q6625l12030M39
$$ 1065886 658846 535043 839463 635899 565729 843806 911153 997778 685748 686187
10986F86187o4924m55K60414K30106q8987j2803M63202j34488J46365K64520J6882
$$ 686187 621263 620808 881222 1111328 1022341 1009538 1472740 1338252 1484617 1749137 1766019
10975A766019J72777K54780J75760J44777O05665j00241l9669P6019k47194r8586
$$ 1766019 1938796 2193576 2369336 2514113 3119778 3019537 2979868 3055887 2808693 2710107
10965B710107k38248n75600M41410n93279l2794J26667K294J88679j06016j21228
$$ 2710107 2471859 1896259 2337669 1744390 1711596 1838263 1840557 2029236 1923220 1801992
10955A801992N9870j38862k37262k03984J971n74182m0695R59M2271l31779K62411
$$ 1801992 1861862 1723000 1485738 1281754 1283725 709543 668848 669807 712078 380299 642710
10944F42710k60714j77369J65435q7295J4757G2647J42217A9133K10084L6225
$$ 642710 381996 204627 370062 282767 297524 72647 214864 19133 229217 265442
10934B65442c7485G09a2947A63374J14601n0214l0185M5167K5102H4568J31319
$$ 265442 -37485 709 -12947 163374 277975 227761 197576 242743 267845 84568 215887
10923B15887a52192o782A36872C4003d8068I7010J31217b67177B16733J22923
$$ 215887 -152192 -158974 136872 34003 -48068 97010 228227 -267177 216733 339656
10913C39656I4840J58511a2112r4244G1845l2495L28576L8129C4745f4396j36767
$$ 339656 94840 253351 -12112 -106356 71845 39350 367926 406055 34745 -64396 -201163
10902b01163P8267L7502j66572F1092a12985k1520L7832D8192e3339O923A81837
$$ -201163 -122896 -85394 -251966 61092 -112985 -134505 -96673 48192 -53339 -46416 181837
10890A23764r980a09788k515A06810b03452G2412b48632Q9562F0010b33884H9772
$$ 123764 113784 -109788 -112303 106810 -203452 72412 -248632 -159070 60010 -233884 89772
10878E02358e4441n9777E03972C2453b28823I3887L18268I1409O126i2212E4445
$$ 502358 -54441 -114218 503972 32453 -228823 93887 412155 91409 97535 -92212 54445
10866a89216A81156d3598B08101J5750J8580p2113H5028P4695C3182b26333Q9336
$$ -189216 181156 -43598 208101 223851 242431 170318 85028 159723 33182 -226333 -136997
10855a36997c44j86005d2782k5141B26666P2173b8860A41718m4624h8086H1671
$$ -136997 -344 -186349 -42782 -67923 226666 298839 -28860 141718 97094 -88086 81671
10843i4110k18726C9101b64213k33084h2604A9041b09575A43051b51511P0201
$$ -94110 -312836 39101 -264213 -497297 -82604 19041 -209575 143051 -251511 -181310
10833a81310c2473k26727G8995A6453b05165A40089a54058q1666a01112F4302
$$ -181310 -32473 -259200 78995 16453 -205165 140089 -154058 -235724 -101112 64302
10822A81566a54045A86368a36993r3882A42406a77207O4416A62976b81520B23177
$$ 181566 -154045 186368 -136993 -230875 142406 -177207 -112791 162976 -281520 223177
10811H4314d9814l6316j99603I4940e7557k57667C3392R4216b46423M1489O8125
$$ 84314 -49814 -86130 -285733 94940 -57557 -315224 33392 127608 -246423 -204934 -136809
10800a36809A55679J76586b6511D1265J8274j2138c35570d2129j74452r6345a50937
$$ -136809 155679 332265 -26511 41265 59539 47401 -335570 -42129 -216581 -312926 -150937
10788a03347k68503A25902A1219g0292F8185J57828a69724R382D03142a41283
$$ -103347 -371850 125902 11219 -70292 68185 226013 -169724 -160342 403142 -141283
10777A03146n1159c36582A59614c35798D4305h9740A37830a40757I274a26634
$$ 103146 51987 -336582 159614 -335798 44305 -89740 137830 -140757 9274 -126634
10766C74883G1358Q281h8855p2421k43262a50818A11115J4092b00611r0653A7260
$$ 374883 71358 79639 -88855 -161276 -404538 -150818 111115 125207 -200611 -291264 17260
10754a74289O8580j23065B11580f7458R661A58097F2198a17771A99249O1521I189
$$ -174289 -105709 -228774 211580 -67458 -57797 158097 62198 -117771 199249 260770 9189
10742A33503J05342C54J5459d13207J62022i2474A55827D936K31572c05591o6522
$$ 133503 238845 354 15813 -413207 -251185 -92474 155827 4936 236508 -305591 -372113
10731c72113a15310A48295L1033a90170P4837e5827o3879A93006c73764E4553
$$ -372113 -115310 148295 179328 -190170 -115333 -55827 -119706 193006 -373764 54553
10720A01844E902b02247A26917k8321f0463B56720f72816a07285j44497A47758
$$ 101844 5902 -202247 126917 98596 -60463 256720 -672816 -107285 -251782 147758
10709C13148d8436B43999a01430r6419d3448k19323f0143A15234n5962a75432
$$ 313148 -48436 243999 -101430 -197849 -43448 -262771 -60143 115234 59272 -175432
10698C21440b23629d9113E9545h5386A42134b13821P9897B94054D7098i4854q0371
$$ 321440 -223629 -49113 59545 -85386 142134 -213821 -133924 294054 47098 -94854 -175225
10687a75225O224A43514o3991l2728a02341B98034d01582g8033B4029d9746E4997
$$ -175225 -169001 143514 79523 46795 -102341 298034 -401582 -78033 24029 -49746 54997
10675B04340F8786k0824d07196a55741E8854e4185I9626Q7129h3831j2292J3400
$$ 204340 68786 47962 -407196 -155741 58854 -54185 99626 186755 -83831 -96123 -82723
10664h2723n8279k17562p299L058a3923q9124A95124b90150h3397l898A7973b7422
$$ -82723 -141002 -358564 -365863 -362805 -13923 -103047 195124 -290150 -83397 -87295 17973 -27422
10651A05138k5504k3213g2809o8778j2036B37169F2436a29754j15394e8173l7931
$$ 105138 79634 56421 -72809 -141587 -153623 237169 62436 -129754 -245148 -58173 -96104
10640i6104c1383B89560c85632c8085A85146i004C0307g8023q983p8647F2480
$$ -96104 -31383 289560 -385632 -38085 185146 -9004 30307 -78023 -87006 -165653 62480
10628a15088A85262F1760f8533n9080e8793a4706p6658E893a49039r5370j11037
$$ -115088 185262 61760 -68533 -127613 -58793 -14706 -91364 5893 -149039 -244409 -355446
10617c55446a26663o7519A53419b38819A77678d0165i958D2782h1837A43681b91806
$$ -355446 -126663 -194182 153419 -238819 177678 -40165 -9958 42782 -81837 143681 -291806
10605B87056c48374a51683C5486a38376H4714L6737c90589a14131m10997h4650
$$ 287056 -348374 -151683 35486 -138376 84714 121451 -390589 -114131 -525128 -84650
10594b66367A02635a09887a5059m0596k3923k40259e8489j6370k05528B31311
$$ -266367 102635 -109887 -15059 -55655 -79578 -319837 -58489 -74859 -280387 231311
10583a55481B68402G4053a28150E3446i6107l9951f5167K4284B57648A13796C8325
$$ -155481 268402 74053 -128150 53446 -96107 -136058 -65167 -40883 257648 113796 38325
10571D3684a68154C0870a3006E1622N458Q9243o6219f975k22958n7542H2954b85495
$$ 43684 -168154 30870 -13006 51622 57080 146323 80104 -6975 -229933 -287475 82954 -285495
10558A61806d7181k24450j99048a38710d4620l15381a25020j35339A81691o7864
$$ 161806 -47181 -271631 -470679 -138710 -44620 -360001 -125020 -260359 181691 113827
10548A13827a57104G0365j5929c18649j35148f7792j27404F379K14040g053q5791
$$ 113827 -157104 70365 54436 -318649 -453797 -67792 -195196 6379 220419 -7053 -92844
10537i2844H4047J43004o8881p3448a49278M5114A08520B3285J0698g7537m285
$$ -92844 84047 227051 158170 84722 -149278 -104164 108520 23285 33983 -77537 -81822
10526h1822q0125A6239G068e3461F7988e9531A33832b44269Q2257m2372R1035
$$ -81822 -161947 16239 7068 -53461 67988 -59531 133832 -244269 -162012 -204384 -113349
10515a13349K2208p0493A31834J6177J49890a47817J1222N7338F1105b86339A8795
$$ -113349 -91141 -161634 131834 148011 297901 -147817 -136595 -79257 61105 -286339 18795
10503g5053A42276a30348c0167p4923B12110a30264B28211b99246A13644n4036
$$ -75053 142276 -130348 -30167 -105090 212110 -130264 228211 -299246 113644 59608
10493E9608c9786j63034b3974A40193a85264K5351A25000P179D6813b81898c5702
$$ 59608 -39786 -202820 -23974 140193 -185264 -159913 125000 132179 46813 -281898 -35702
10481B43466J8650J07548Q3139j59593A4125L37508j48676R4788o8890j06297
$$ 243466 262116 369664 452803 293210 14125 351633 202957 297745 228855 122558
10471A22558l1831L3582m2137J39782p4303R0462a10119K7658A371J78572E2633
$$ 122558 90727 124309 82172 221954 147651 238113 -110119 -82461 1371 179943 52633
10459C9612R4693c12180D8881b75093A32516F3755c8464B62993b1394L871l76939
$$ 39612 134305 -312180 48881 -275093 132516 63755 -38464 262993 -21394 -17523 -394462
10448c94462h7005C30407a02471B2883g8532B59390C6436a15578j32697j27550
$$ -394462 -87005 330407 -102471 22883 -78532 259390 36436 -115578 -248275 -375825
10438c75825h6368N096A06334c39615B00722H1274J87305c04322B3721M0113J6481
$$ -375825 -86368 -81272 106334 -339615 200722 81274 268579 -304322 23721 63834 80315
10427H0315a56570o1432P2869I1784D1015P7304c4392j32820A29348b4193E2557
$$ 80315 -156570 -218002 -145133 91784 41015 118319 -34392 -167212 129348 -24193 52557
10415A17347k7336a60559B52255r3419a72811L9395A12561c5970J3492A34739
$$ 117347 90011 -160559 252255 158836 -172811 -133416 112561 -35970 -22478 134739
10404b68590A17346a53893B53566a9835C1166b34372k31858b0007H209J14938
$$ -268590 117346 -153893 253566 -19835 31166 -234372 -466230 -20007 8209 123147
10394A23147n9461a76425a0246e59A83396L3735F7852N1742c05D116K23155B3641
$$ 123147 63686 -176425 -10246 -559 183396 217131 67852 119594 -305 4116 227271 23641
10381a09270B49829p421l0541M2757K02183q0757A75924j1925L64109l5812m4458
$$ -109270 249829 242408 211867 254624 456807 376050 175924 163999 528108 492296 447838
10370D47838A16160L34596A78251J77221K66983j58300k01930J13469J84959B12367
$$ 447838 116160 450756 178251 355472 622455 464155 262225 375694 560653 212367
10359A89109J70553C8334J83650A09179A6819L04935J34910k10875M04948j28600
$$ 189109 359662 38334 221984 109179 16819 321754 456664 245789 650737 522137
10349E22137p8119n7647i6211I4606J52181Q1754P3877J20818A45548L62436N5494
$$ 522137 444018 386371 -96211 94606 246787 328541 402418 523236 145548 507984 563478
10338E63478k11419p5630D1981K51630a77406A20919R1602d6028I4440L07784
$$ 563478 352059 276429 41981 293611 -177406 120919 212521 -46028 94440 402224
10328D02224B4304K49904e4748B08705p3470m6939K03903d9074A87573q4890R6765
$$ 402224 24304 274208 -54748 208705 135235 88296 292199 -49074 187573 102683 199448
10317A99448a56079a9231A93279a16679A04859A8745J32006c02330h9412N412
$$ 199448 -156079 -19231 193279 -116679 104859 18745 150751 -302330 -89412 -84000
10307h4000E3078J36929b76777g9000A62234a71589K2958O8196C939K02685D5702
$$ -84000 53078 190007 -276777 -79000 162234 -171589 -148631 -80435 3939 206624 45702
10295D8200d7305I8997a20694j41920e5162j0760j49161B210J79312d43273a30069
$$ 48200 -47305 98997 -120694 -262614 -55162 -65922 -215083 2210 181522 -443273 -130069
10283a95107C77550A35016B6241J42103c24085h3064B49505b93835A65508d82061
$$ -195107 377550 135016 26241 168344 -324085 -83064 249505 -293835 165508 -482061
10272A3738b00479B64770P9413A8878h2323C3816b5249C9749a50187A39822o251
$$ 13738 -200479 264770 344183 18878 -82323 33816 -25249 39749 -150187 139822 133571
10261A33571R4512K8457a14946C15633J84555A48599J43525q5464q2041a38968
$$ 133571 228083 256540 -114946 315633 500188 148599 292124 206660 124619 -138968
10250B0732f365B64071a49332a2717A45350c8819k4933j63715R8531p2839O0224
$$ 20732 -6365 264071 -149332 -12717 145350 -38819 -63752 -227467 -128936 -201775 -141551
10239a41551m5077A01197l2259b71699l1993C8839L67069G6805H549d2157j47229
$$ -141551 -186628 101197 68938 -271699 -303692 38839 405908 76805 8549 -42157 -189386
10228a89386l9106e5078A22452i1123j19902N9759J7180B21994F1475a23697p8889
$$ -189386 -228492 -55078 122452 -91123 -211025 -151266 -134086 221994 61475 -123697 -202586
10217b02586C8113M2278J01258Q938J22737j30800d3403A2025L0242a25379C684
$$ -202586 38113 80391 181649 190587 313324 182524 -43403 12025 42267 -125379 3684
10205b8604C38452B7522M43234E3011a56269A37372l559A0594B956R4209l7298
$$ -28604 338452 27522 470756 53011 -156269 137372 133813 10594 2956 97165 59867
10194E9867a53039c5152k3365j12428G6966J59772G6941C351M7142e0880G2701
$$ 59867 -153039 -35152 -58517 -170945 76966 236738 76941 3351 50493 -50880 72701
10182D1801J26871a04822B42502b73868M746A50539k9579E6744a81654C25671
$$ 41801 168672 -104822 242502 -273868 -269122 150539 120960 56744 -181654 325671
10171f365F4720c3207a4367q1844d472C7931J44813D2393P3116a72958A63591
$$ -6365 64720 -33207 -14367 -96211 -4472 37931 182744 42393 115509 -172958 163591
10159F7974C588c06667E2951f4082E2468a8316n335m1755p2430F612g878A50751
$$ 67974 3588 -306667 52951 -64082 52468 -18316 -23651 -65406 -137836 6612 -7878 150751
10146a25557G0240J05912l0461J0242a5369B61664I24a77589j01026A93736a81887
$$ -125557 70240 176152 145691 155933 -15369 261664 924 -177589 -278615 193736 -181887
10134F9351a38454r362D9723g0211m3867H2511b8848C9587N6319K00579a38353
$$ 69351 -138454 -147816 49723 -70211 -114078 82511 -28848 39587 95906 296485 -138353
10122c14033A35508a98882j58619B57114b87053J06785f7117A637e0698j17676
$$ -314033 135508 -198882 -357501 257114 -287053 -180268 -67117 1637 -50698 -168374
10112a68374k2436A39272c24512a20368j67832J19650o1634D1301d38211A54605
$$ -168374 -190810 139272 -324512 -120368 -288200 -168550 -230184 41301 -438211 154605
10101F615L00883a7619j86293A18913b35382B3114c4190j25703K5741D0133e3074
$$ 6615 307498 -17619 -203912 118913 -235382 23114 -34190 -159893 -134152 40133 -53074
10089A20339a17535k42140a0094C02176A36004c33561R6243g7295k9563B3033
$$ 120339 -117535 -359675 -10094 302176 136004 -333561 -237318 -77295 -106858 23033
10078c5149B53082c10166J17938j1326n1048Q8020A64792d27352D3481a58114
$$ -35149 253082 -310166 -192228 -203554 -254602 -166582 164792 -427352 43481 -158114
10067C6364f8827A50476i1738l8538j20174F4502K6100K90393c2576O999A26320
$$ 36364 -68827 150476 -91738 -130276 -250450 64502 90602 380995 -32576 -25577 126320
10055c28451M4723q5288F4371a67825p6869B9801a47033J9337j09683g7963A16250
$$ -328451 -283728 -369016 64371 -167825 -244694 29801 -147033 -127696 -237379 -77963 116250
10043a27504a4201p1960K646a0281B05611b8220k00425A06092h7756l4737e1198
$$ -127504 -14201 -86161 -83515 -10281 205611 -28220 -228645 106092 -87756 -122493 -51198
10031a2938k00678J03827L6966A72270N3302b80163M7905A15089f9072D3520K7870
$$ -12938 -213616 -109789 -72823 172270 225572 -280163 -232258 115089 -69072 43520 71390
10020G1390K0726d0142q8879N9450a9455p9766p2497c5920B27843g4434j88774
$$ 71390 92116 -40142 -129021 -69571 -19455 -99221 -171718 -35920 227843 -74434 -263208
10009b63208i6952A38694I636b19260p7576a00521k2574B9554J56258a19331j64985
$$ -263208 -96952 138694 9636 -219260 -296836 -100521 -123095 29554 185812 -119331 -284316
9998b84316J15740j58531B2871N4143a79471B63124a62418e0188j57447m0124
$$ -284316 -168576 -327107 22871 77014 -179471 263124 -162418 -50188 -207635 -247759
9988b47759m6637i728m0236k0745k20860B46556f6769K2694a7071G0616K47009
$$ -247759 -294396 -9728 -49964 -70709 -291569 246556 -66769 -44075 -17071 70616 317625
9977C17625a56449f1205F3230c99864e8608n0732J7040n919j44238B26927b15517
$$ 317625 -156449 -61205 63230 -399864 -58608 -109340 -92300 -98219 -242457 226927 -215517
9965h8222j11280B66137h9477B34566B2964a19764A11728k1705K5672J08617e1790
$$ -88222 -199502 266137 -89477 234566 22964 -119764 111728 90023 115695 224312 -51790
9953f3413B1528b16365q295K9328L7263A82813a31587l58501I0784a14298r253
$$ -63413 21528 -216365 -224660 -195332 -158069 182813 -131587 -490088 90784 -114298 -123551
9942a23551n3162R601j15802I0578J35566b0323j69166o8566C2980M8819P8525
$$ -123551 -176713 -167112 -282914 90578 226144 -20323 -189489 -258055 32980 81799 160324
9931A60324p4740b493D5388b67530l4137J33052B3379i4071E7517a65290g0512
$$ 160324 85584 -2493 45388 -267530 -301667 -168615 23379 -94071 57517 -165290 -70512
9919A6592J96541b3474E17974a28148m7269P153b2893r6309f665q1893K9540l0438
$$ 16592 213133 -23474 517974 -128148 -175417 -168264 -22893 -119202 -6665 -88558 -59018 -89456
9907h9456j2492B37030K5102D5812b31530r6904A18736a12419I5229Q5318h6293
$$ -89456 -101948 237030 262132 45812 -231530 -328434 118736 -112419 95229 180547 -86293
9895c6842A32915J39562e1278Q639c052F5754d1905I4657J3093M723b74586R1299
$$ -36842 132915 272477 -51278 -42639 -3052 65754 -41905 94657 107750 112473 -274586 -183287
9883a83287M323d761j04462A85240Q6807H8377b72607L6286j03920J10971Q771
$$ -183287 -178964 -4761 -109223 185240 272047 88377 -272607 -236321 -340241 -229270 -220499
9872b20499m6165A20785R5869a55208B18992G4421J14511a98577a7436m04639
$$ -220499 -266664 120785 216654 -155208 218992 74421 188932 -198577 -17436 -422075
9862d22075c910E8786B1758a32785k81872a75594f0431j8524j33348P8495r471
$$ -422075 -3910 58786 21758 -132785 -414657 -175594 -60431 -78955 -212303 -133808 -143279
9851a43279A13060b74904k66329E0674L7128J6954a20965d7685C4376K27133E4664
$$ -143279 113060 -274904 -541233 50674 87802 104756 -120965 -47685 34376 261509 54664
9839b2862j24289e4489H0069B3260a86669H1076k4944a96103e4810C6787e5616
$$ -22862 -147151 -54489 80069 23260 -186669 81076 56132 -196103 -54810 36787 -55616
9827B36454M9437a54232B75284a80836l377H4440o554i3610p6659A8934J5508
$$ 236454 285891 -154232 275284 -180836 -184213 84440 77886 -93610 -170269 18934 34442
9816C4442b45130B3437R2517R6634a29731M9443j60995o4534B91607i7613k26801
$$ 34442 -245130 23437 115954 212588 -129731 -80288 -241283 -305817 291607 -97613 -324414
9805c24414a50087O3175l271G9261M5378a05345O396j20475R3820l39762B3338
$$ -324414 -150087 -86912 -90183 79261 124639 -105345 -98949 -219424 -125604 -465366 23338
9793b03941j61356P8051A34564M5837a31495l090K1453l0722k08238o8830d3241
$$ -203941 -365297 -287246 134564 180401 -131495 -134585 -113132 -143854 -352092 -420922 -43241
9781f1131D1470a68186j7091j9100B7421I250a71717B4787e4854C7846A8757Q9171
$$ -61131 41470 -168186 -185277 -204377 27421 9250 -171717 24787 -54854 37846 18757 107928
9769A07928f7267F7080a19681j91113G7444P3176c90868D1901L2869k8208Q7693
$$ 107928 -67267 67080 -119681 -310794 77444 150620 -390868 41901 74770 46562 134255
9758A34255C240f4402A60950g74B27826K953a35845k45031a71411N3961A53763
$$ 134255 3240 -64402 160950 -774 227826 230779 -135845 -380876 -171411 -117450 153763
9746A69729b76026J25925P1802A63985n4683b26562l2178f9161b9795j52213A75553
$$ 169729 -276026 -150101 -78299 163985 109302 -226562 -258740 -69161 -29795 -182008 175553
9734a89485A45281K095m5650a27815A85425b71251p6424a19429k94500a00302
$$ -189485 145281 147376 101726 -127815 185425 -271251 -347675 -119429 -413929 -100302
9723b97309h3995C7961J48118J9653a99956q8325m48J29985d8295A45253i0616
$$ -297309 -83995 37961 186079 205732 -199956 -288281 -288729 -158744 -48295 145253 -90616
9711G8979c57505D3950j8491K83005A4467J8391g8322I2465M8631l3172d6795
$$ 78979 -357505 43950 25459 308464 14467 32858 -78322 92465 141096 107924 -46795
9699A10673L5990c79544c1306p1463A02873a28990J6763A23187d9719a1398j06494
$$ 110673 146663 -379544 -31306 -102769 102873 -128990 -112227 123187 -49719 -11398 -117892
9688a17892j02067A08141D6136J50565q3024j8509e5296k0809a4087C572h536
$$ -117892 -219959 108141 46136 196701 113677 95168 -55296 -76105 -14087 3572 -8536
9676a1303m420B48234d82009H3742K26231a17458B16327a93342C1827a83222A03199
$$ -11303 -15723 248234 -482009 83742 309973 -117458 216327 -193342 31827 -183222 103199
9664d1211j1602J7930f519j65697c492A20339c09693J24148P2479r3318P1059
$$ -41211 -52813 -34883 -6519 -172216 -3492 120339 -309693 -185545 -113066 -206384 -135325
9653a35325O6690k1093J1201j01963P3227A0144e1123j79745J12467j42882j75242
$$ -135325 -68635 -89728 -78527 -180490 -107263 10144 -51123 -230868 -118401 -261283 -436525
9642d36525b3474l74651a25400L6262C5786i9287A40702a28963H655K3858f0299
$$ -436525 -23474 -398125 -125400 -89138 35786 -99287 140702 -128963 8655 32513 -60299
9630C44050b51751a24464q4690A29942e1240a3133j55597H7478k7482b09926I7568
$$ 344050 -251751 -124464 -209154 129942 -51240 -13133 -168730 87478 59996 -209926 97568
9618A24237F0691A4363P6146Q0612a79946B5331b83470G4618k6471b38048A39226
$$ 124237 60691 14363 90509 171121 -179946 25331 -283470 74618 48147 -238048 139226
9606a78137j22802Q1042g5811C18424h8176q9505g7005l9997j02798H3485N4574
$$ -178137 -300939 -219897 -75811 318424 -88176 -177681 -77005 -117002 -219800 83485 138059
9595A38059f1680K8320k13787g994r0156l7243B66600E8678b62613m5473C3188
$$ 138059 -61680 -33360 -247147 -7994 -98150 -135393 266600 58678 -262613 -308086 33188
9583b4319j3234D3883b58477B26285C5064a45492B0441c50083B3174c65767o794
$$ -24319 -37553 43883 -258477 226285 35064 -145492 20441 -350083 23174 -365767 -372561
9572c72561a53554j01529N6829C11211a47842J8322A10141K08961a54522K3942
$$ -372561 -153554 -255083 -198254 311211 -147842 -129520 110141 319102 -154522 -130580
9562a30580O0986G5334N3691a43637q8444d4639j36218j13173D1526K35462j06491
$$ -130580 -69594 75334 129025 -143637 -232081 -44639 -180857 -294030 41526 276988 170497
9551A70497F7828K11786j26669a74986G6809g568B2428b24152G0074J10201C0696
$$ 170497 67828 279614 152945 -174986 76809 -7568 22428 -224152 70074 180275 30696
9539d25387b0715j02489a2327I2828a49908A61272b72844i2031n4832a2392l00940
$$ -425387 -20715 -123204 -12327 92828 -149908 161272 -272844 -92031 -146863 -12392 -313332
9528c13332A86695C7284J5722a48983A69279a65742m8058h3370k23048m836a41021
$$ -313332 186695 37284 53006 -148983 169279 -165742 -213800 -83370 -306418 -311254 -141021
9516a58662K2380l2579j26453J25361E4640O3327a10568c0278j4687j656j63027
$$ -158662 -136282 -168861 -295314 -169953 54640 117967 -110568 -30278 -44965 -46621 -209648
9505b09648P742A16448J16786b27774R5100m5302E3146a49733A59831B1440a39572
$$ -209648 -201906 116448 233234 -227774 -132674 -177976 53146 -149733 159831 21440 -139572
9493a39238C16621j27083h3746H6508J03050D8154F476e5532A08615a82839B61421
$$ -139238 316621 189538 -83746 86508 189558 48154 6476 -55532 108615 -182839 261421
9481b90595O5093B47205b34703f778j63867A91038b53325N8170l82808B85360
$$ -290595 -225502 247205 -234703 -6778 -170645 191038 -253325 -195155 -577963 285360
9470G2202b02208d9022j68579I0632c28260G0541g0723B6156c30329B68266h5103
$$ 72202 -202208 -49022 -217601 90632 -328260 70541 -70723 26156 -330329 268266 -85103
9458A18515j2251M8782p3927b6267j35404j56428l7744J19971O3969A51992a1143
$$ 118515 106264 155046 81119 -26267 -161671 -318099 -355843 -235872 -171903 151992 -11143
9446B09309e56493G3363h3665c1125r1740M5816A22170E8507c17669a09060k05841
$$ 209309 -556493 73363 -83665 -31125 -122865 -77049 122170 58507 -317669 -109060 -314901
9435c14901A67697R5842d4801A4430R8074b41554R2452M8866H6129e6789j75801
$$ -314901 167697 263539 -44801 14430 112504 -241554 -149102 -100236 86129 -56789 -232590
9424b32590i5209N256K8568C79392H1117B4463d49429b16167j58219d0526B8520
$$ -232590 -95209 -89953 -61385 379392 81117 24463 -449429 -216167 -374386 -40526 28520
9412H4238a87553q6987F1376a666m2854j73851c0549B94084B6774Q9694G799i083
$$ 84238 -187553 -274540 61376 -1666 -44520 -218371 -30549 294084 26774 116468 7799 -9083
9399B02945c35321h9567o0095c3417q6619K2742G4366a54094j4883E9901i1930
$$ 202945 -335321 -89567 -149662 -33417 -120036 -97294 74366 -154094 -168977 59901 -91930
9387b0416k57275c7448j49340B88499g0465j13382A12252a89280d521k01807A12209
$$ -20416 -277691 -37448 -186788 288499 -70465 -183847 112252 -189280 -4521 -206328 112209
9375a65551j2437C4920b24288O0938A33851a95272l7195e0632B32381j08323A2715
$$ -165551 -177988 34920 -224288 -163350 133851 -195272 -232467 -50632 232381 124058 12715
9363a44293j57589E2814b72254c1032j20134j58182A29053b1135A91690d9889
$$ -144293 -301882 52814 -272254 -31032 -151166 -309348 129053 -21135 191690 -49889
9352b48960h059A51475J56501h1530b8854J2096I1177b07155M4260j85599a54207
$$ -248960 -8059 151475 307976 -81530 -28854 -16758 91177 -207155 -162895 -348494 -154207
9340d5890A87942A1937h215k3721l5648l33k96803h7904A16365B3745J50645m4077
$$ -45890 187942 11937 -8215 -31936 -67584 -67917 -364720 -87904 116365 23745 174390 130313
9328A30313A9732b39455R6056A38110b92671d3802k60579c7412p9941D6464L3987
$$ 130313 19732 -239455 -143399 138110 -292671 -43802 -304381 -37412 -117353 46464 80451
9317H0451b89926B03192a05779j2934A74073L1140e5150j07679A24309O7734a01936
$$ 80451 -289926 203192 -105779 -118713 174073 205213 -55150 -162829 124309 192043 -101936
9305a06175D3942a96771k27787A92072f6441b5921A3784f6878K6264q3342B51415
$$ -106175 43942 -196771 -424558 192072 -66441 -25921 13784 -66878 -40614 -123956 251415
9293c69165H1818b32571O4940B10642i4062m1126B07859b81013P9769B42744c04
$$ -369165 81818 -232571 -167631 210642 -94062 -135188 207859 -281013 -201244 242744 -304
9281a36679K2202A22101l4620i2325l68848f0942k37971G0574a24712c5848D4491
$$ -136679 -114477 122101 87481 -92325 -461173 -60942 -298913 70574 -124712 -35848 44491
9269f2866j64626e821A70682a98310e6457r209K3837r1355B74805a96388J6618
$$ -62866 -227492 -5821 170682 -198310 -56457 -65666 -41829 -133184 274805 -196388 -179770
9258a79770c1190Q469G687a60757Q0333a9796n4530E2334L6546a37101b2631B85914
$$ -179770 -31190 -22721 7687 -160757 -80424 -19796 -74326 52334 88880 -137101 -22631 285914
9245B20573e852r9451H1830a58321J0510n2760c9939B10217K5238h0858p0095
$$ 220573 -5852 -105303 81830 -158321 -147811 -200571 -39939 210217 235455 -80858 -150953
9234a50953g3658B7227b12415A10204j659a36378H8108c41781H0212a22671I5897
$$ -150953 -73658 27227 -212415 110204 108545 -136378 88108 -341781 80212 -122671 95897
9222C4525b5671k07568f2437q2974f0880G7725b33801C0212a94807R0126O401
$$ 34525 -25671 -233239 -62437 -145411 -60880 77725 -233801 30212 -194807 -104681 -98280
9211i8280m1552N3799A12795K7510r27a38354H1287a43781F4853b40422A36970
$$ -98280 -139832 -86033 112795 140305 139378 -138354 81287 -143781 64853 -240422 136970
9199a35416o2387c7538r8252B42436b33598L0382A93285a77147n1055e0767B91570
$$ -135416 -197803 -37538 -135790 242436 -233598 -203216 193285 -177147 -228202 -50767 291570
9187a73683C44969C0207b62915m0625A09139d21732f5522A0095c35774a068l52341
$$ -173683 344969 30207 -262915 -303540 109139 -421732 -65522 10095 -335774 -1068 -353409
9176c53409k7627E6544J52605g9316j62807K0882b6264B72006P244p3625n7295
$$ -353409 -381036 56544 209149 -79316 -242123 -221241 -26264 272006 279250 205625 148330
9165A48330j6093b99392J01735j58073i1083j56643G0034b64121j1463J35414
$$ 148330 132237 -299392 -197657 -355730 -91083 -247726 70034 -264121 -275584 -140170
9155a40170A12374d14675a16860A74207c11269B02104e6352C03845i7258C47731
$$ -140170 112374 -414675 -116860 174207 -311269 202104 -56352 303845 -97258 347731
9144D7181J05665i0280C1331J18811a39209n0980B26838b35397m330Q5469P0136
$$ 47181 152846 -90280 31331 150142 -139209 -190189 226838 -235397 -239727 -154258 -84122
9133h4122B13195d23014a97017F4199b35219k55531a9770l15820A94850F3704
$$ -84122 213195 -423014 -197017 64199 -235219 -490750 -19770 -335590 194850 63704
9122a1600A73577a56099A29120C4511a21240k06421A10650F001K4012K80493b33634
$$ -11600 173577 -156099 129120 34511 -121240 -327661 110650 6001 30013 310506 -233634
9110H3024C4616b08746g5606L5010k18532L7858H0800c43085a26613m50422a46930
$$ 83024 34616 -208746 -75606 -40596 -259128 -221270 80800 -343085 -126613 -577035 -146930
9098e15276J90060J16626j5667n4312R3325h1161A31670f0359Q270p0085j77273
$$ -515276 -325216 -208590 -224257 -278569 -185244 -81161 131670 -60359 -52089 -122174 -299447
9087b99447A65675a50775H3357c6279j99150D06344i8435a674j21985A58243b01421
$$ -299447 165675 -150775 83357 -36279 -235429 406344 -98435 -1674 -123659 158243 -201421
9075H7068J13112d9155J8955j47945I776P6395g3873n5426A82776c03399E6611
$$ 87068 200180 -49155 -30200 -178145 9776 86171 -73873 -129299 182776 -303399 56611
9063I1754J57924K7607b94699o5594J62536O6217B5815K44628c1979A0952a32863
$$ 91754 249678 277285 -294699 -360293 -197757 -131540 25815 270443 -31979 10952 -132863
9051b46782K9810r8289F1498b04252g935A10621a28719j68800C9503J31917d92292
$$ -246782 -216972 -315261 61498 -204252 -7935 110621 -128719 -297519 39503 171420 -492292
9039E5021P6929b97109d1876J5614k3974o0477c0785O351j67738N7487M3269K5683
$$ 55021 131950 -297109 -41876 -26262 -50236 -110713 -30785 -24434 -192172 -134685 -91416 -65733
9027f5733q7304c9746A25065b7760E452L5491M3204b32009E4894d4027H8317h5315
$$ -65733 -153037 -39746 125065 -27760 5452 40943 84147 -232009 54894 -44027 88317 -85315
9014a31489e2213j4656p6694D0653J19315a64028m0930N6472M9205F434b24778
$$ -131489 -52213 -66869 -143563 40653 159968 -164028 -204958 -148486 -99281 6434 -224778
9002a1858A53045e7190E0324c49199a62837g8825a3802I3214a20140d9409I7257
$$ -11858 153045 -57190 50324 -349199 -162837 -78825 -13802 93214 -120140 -49409 97257
8990A73245J48209a21131M9957J4596k00101a03750r5319n6442I065K77220d9488
$$ 173245 321454 -121131 -71174 -56578 -256679 -103750 -199069 -255511 9065 286285 -49488
8978A62257a88471F0630h7809j79982h4955F221b61757A09522C406b66112h2992
$$ 162257 -188471 60630 -87809 -267791 -84955 6221 -261757 109522 3406 -266112 -82992
8966F0373c79601A42718a67137H0792c55265A05824A1942J22974J54792A00058
$$ 60373 -379601 142718 -167137 80792 -355265 105824 11942 134916 289708 100058
8955b48796a7285k15614e7675k41621q1919J54675j0116B99803b3196j75618A06903
$$ -248796 -17285 -232899 -57675 -299296 -381215 -226540 -236656 299803 -23196 -198814 106903
8943a26241A01787N5025a86196g4114A75392D469L6724h3940o7385C96651A76515
$$ -126241 101787 156812 -186196 -74114 175392 4469 41193 -83940 -151325 396651 176515
8931a02356A37241b30128d8882j27132H2456K67511D9074P27067K81753J655411
$$ -102356 137241 -230128 -48882 -176014 82456 349967 49074 776141 1057894 2713305
8921B713305J2095636E843075A549941C59257A56396J62255B2678c01219a10773
$$ 2713305 14808941 5843075 1549941 359257 156396 318651 22678 -301219 -110773
8911i6847M419H9397d3136B52589a889j49532D1010b10781j1495A87929a30224
$$ -96847 -92428 89397 -43136 252589 -1889 -151421 41010 -210781 -222276 187929 -130224
8899A09578e1254h304m5251K1733F7372J17288B7419b27056A20153a33691m2792
$$ 109578 -51254 -8304 -53555 -31822 67372 184660 27419 -227056 120153 -133691 -176483
8888a76483N5224D3767a69729O6227k82685a57276j54745a30840c3732j97950
$$ -176483 -121259 43767 -169729 -103502 -386187 -157276 -312021 -130840 -33732 -231682
$$ [...]
##END NTUPLES=NMR SPECTRUM
##END=
