
##TITLE=UV1289_M2_1207-1380_70_7534623_obKTzA1Bue
##JCAMPDX= 6.0         $$ Bruker NMR JCAMP-DX V2.0
##DATA TYPE= NMR SPECTRUM
##DATA CLASS= NTUPLES
##ORIGIN= BRUKER
##OWNER= Administrator
$$ 1.72 TOPSPIN		Version 2.1
$$ 2013-02-21 22:02:18.378 -0500  Administrator@X
$$ Compression mode = diff/dup
##.OBSERVE FREQUENCY= 400.02188249412
##.OBSERVE NUCLEUS= ^1H
##.ACQUISITION MODE= SIMULTANEOUS (DQD)
##.ACQUISITION SCHEME= undefined
##.AVERAGES= 64
##.DIGITISER RES= 22
##SPECTROMETER/DATA SYSTEM= spect
##.PULSE SEQUENCE= noesygpps1d.comp
##.SOLVENT NAME= COFFEE_meoh
##.SHIFT REFERENCE= INTERNAL, COFFEE_meoh, 1, 14.9613
##AUDIT TRAIL= $$ (NUMBER, WHEN, WHO, WHERE, PROCESS, VERSION, WHAT)
$$ ##TITLE= Audit trail, TOPSPIN		Version 2.1
$$ ##JCAMPDX= 5.01
$$ ##ORIGIN= Bruker BioSpin GmbH
$$ ##OWNER= Administrator
$$ $$ E:\/data/COFFEE/nmr/UV1289_M2_1207-1380_70_7534623_obKTzA1Bue/12/pdata/1/auditp.txt
$$ ##AUDIT TRAIL=  $$ (NUMBER, WHEN, WHO, WHERE, PROCESS, VERSION, WHAT)
(   1,<2013-02-21 22:02:12.315 -0500>,<Administrator>,<X>,<go>,<TOPSPIN 2.1>,
      <created by zg
	started at 2013-02-21 21:50:42.247 -0500,
	POWCHK enabled, PULCHK disabled,
       configuration hash MD5:
       86 BA 57 50 F2 9D 5C 9B 26 00 A9 28 5F 66 2E 89
       data hash MD5: 64K
       F8 97 9D A0 AB 3E 38 41 F4 52 2C 4C A6 B6 55 CD>)
(   2,<2013-02-21 22:02:15.487 -0500>,<Administrator>,<X>,<proc1d>,<TOPSPIN 2.1>,
      <Start of raw data processing
       efp LB = 0.3 FT_mod = 6 PKNL = 1 PHC0 = 0 PHC1 = 0 SI = 128K 
       data hash MD5: 128K
       53 6F 22 07 39 BA 2C 93 86 F9 36 BD 6E 4F CD A1>)
(   3,<2013-02-21 22:02:16.581 -0500>,<Administrator>,<X>,<proc1d>,<TOPSPIN 2.1>,
      <pk PHC0 = 251.1914 PHC1 = 0 
       data hash MD5: 128K
       9B E0 90 66 67 3C 5C CC BC 8A 61 19 01 44 81 DF>)
(   4,<2013-02-21 22:02:17.315 -0500>,<Administrator>,<X>,<proc1d>,<TOPSPIN 2.1>,
      <abs ABSG = 1 
       data hash MD5: 128K
       37 8B 08 42 14 61 BC F1 74 47 69 CB 98 FF 5A DA>)
(   5,<2013-02-21 22:02:17.487 -0500>,<Administrator>,<X>,<proc1d>,<TOPSPIN 2.1>,
      <abs ABSG = 2 
       data hash MD5: 128K
       34 43 64 87 9B 37 56 C4 EB 2E AB 26 36 A3 0F 5D>)
(   6,<2013-02-21 22:02:17.628 -0500>,<Administrator>,<X>,<proc1d>,<TOPSPIN 2.1>,
      <abs ABSG = 3 
       data hash MD5: 128K
       8E F9 2A AC B2 A0 A0 CC B8 8C C2 22 03 42 A8 92>)
(   7,<2013-02-21 22:02:17.815 -0500>,<Administrator>,<X>,<proc1d>,<TOPSPIN 2.1>,
      <abs ABSG = 4 
       data hash MD5: 128K
       57 1C 1C E0 5B 32 DD 3F 90 41 EE 3C 74 EB 6E CE>)
(   8,<2013-02-21 22:02:18.018 -0500>,<Administrator>,<X>,<proc1d>,<TOPSPIN 2.1>,
      <abs ABSG = 5 
       data hash MD5: 128K
       C9 5A 08 23 50 B9 83 DF B4 5D DF 74 76 F7 B1 80>)
$$ ##END=
$$ 
$$ $$ hash MD5
$$ $$ F6 9A 08 5C 06 49 F9 4D 7B 73 0F A3 D3 70 58 C8
##$RELAX= 
##$RELAX= 
##$RELAX= 
##$RELAX= 
##$RELAX= 
##$RELAX= 
##$RELAX= 
##$RELAX= 
$$ Bruker specific parameters
$$ --------------------------
##$DU= <E:\>
##$EXPNO= 12
$$ [...]
150 150 150 150 150 150 150 150
##$TP07= 0
##$TPNAME0= <>
##$TPNAME1= <>
##$TPNAME2= <>
##$TPNAME3= <>
##$TPNAME4= <>
##$TPNAME5= <>
##$TPNAME6= <>
##$TPNAME7= <>
##$TPOAL= (0..7)
0.5 0.5 0.5 0.5 0.5 0.5 0.5 0.5
##$TPOFFS= (0..7)
0 0 0 0 0 0 0 0
##$TUNHIN= 0
##$TUNHOUT= 0
##$TUNXOUT= 0
##$USERA1= <user>
##$USERA2= <user>
##$USERA3= <user>
##$USERA4= <user>
##$USERA5= <user>
##$V9= 5
##$VALIST= <valist>
##$VCLIST= <CCCCCCCCCCCCCCC>
##$VD= 0
##$VDLIST= <DDDDDDDDDDDDDDD>
##$VPLIST= <PPPPPPPPPPPPPPP>
##$VTLIST= <TTTTTTTTTTTTTTT>
##$WBST= 1024
##$WBSW= 4
##$XGAIN= (0..3)
0 0 0 0
##$XL= 0
##$YL= 0
##$YMAX_a= 6255742
##$YMIN_a= -11043521
##$ZGOPTNS= <>
##$ZL1= 120
##$ZL2= 120
##$ZL3= 120
##$ZL4= 120
##$ABSF1= 14.9613
##$ABSF2= -5.596882
##$ABSG= 5
##$ABSL= 3
##$ALPHA= 0
##$AQORDER= 0
##$ASSFAC= 0
##$ASSFACI= 0
##$ASSFACX= 0
##$ASSWID= 0
##$AUNMP= <proc_prof1d_extract.lims>
##$AXLEFT= 0
##$AXNAME= <>
##$AXNUC= <1H>
##$AXRIGHT= 0
##$AXTYPE= 0
##$AXUNIT= <>
##$AZFE= 0.1
##$AZFW= 0.1
##$BCFW= 0
##$BC_mod= 0
##$BYTORDP= 0
##$COROFFS= 0
##$CY= 15
##$DATMOD= 1
##$DC= 0
##$DFILT= <>
##$DTYPP= 0
##$F1P= 0
##$F2P= 0
##$FCOR= 0.5
##$FTSIZE= 131072
##$FT_mod= 6
##$GAMMA= 0
##$GB= 0
##$INTBC= 1
##$INTSCL= 1
##$ISEN= 128
##$LB= 0.3
##$LEV0= 0
##$LPBIN= 0
##$MAXI= 10000
##$MC2= 0
##$MEAN= 0
##$ME_mod= 0
##$MI= 0
##$NCOEF= 0
##$NC_proc= -2
##$NLEV= 6
##$NOISF1= 0
##$NOISF2= 0
##$NSP= 0
##$NTH_PI= 0
##$NZP= 0
##$OFFSET= 14.9613
##$PC= 1
##$PHC0= 251.1914
##$PHC1= 0
##$PH_mod= 1
##$PKNL= yes
##$PPARMOD= 0
##$PPDIAG= 0
##$PPIPTYP= 0
##$PPMPNUM= 2147483647
##$PPRESOL= 1
##$PSCAL= 4
##$PSIGN= 0
##$PYNMP= <proc.py>
##$REVERSE= no
##$SF= 400.020009518113
##$SI= 131072
##$SIGF1= 0
##$SIGF2= 0
##$SINO= 400
##$SIOLD= 131072
##$SPECTYP= <>
##$SREGLST= <1H.CDCl3>
##$SSB= 0
##$STSI= 131072
##$STSR= 0
##$SW_p= 8223.68421052631
##$SYMM= 0
##$S_DEV= 0
##$TDeff= 65536
##$TDoff= 0
##$TI= <>
##$TILT= no
##$TM1= 0
##$TM2= 0
##$TOPLEV= 0
##$USERP1= <user>
##$USERP2= <user>
##$USERP3= <user>
##$USERP4= <user>
##$USERP5= <user>
##$WDW= 1
##$XDIM= 131072
##$YMAX_p= 473993121
##$YMIN_p= -13890
##$CURPLOT= <Network HP LaserJet P1505>
##$CURPRIN= <$Network HP LaserJet P1505>
##$DFORMAT= <normdp>
##$LAYOUT= <+/1D_H.xwp>
##$LFORMAT= <normlp>
##$PFORMAT= <normpl>
##$SURQMSG= 1
$$ End of Bruker specific parameters
$$ ---------------------------------
##NTUPLES= NMR SPECTRUM
##VAR_NAME=  FREQUENCY,     SPECTRUM/REAL,   SPECTRUM/IMAG
##SYMBOL=    X,             R,               I
##VAR_TYPE=  INDEPENDENT,   DEPENDENT,       DEPENDENT
##VAR_FORM=  AFFN,          ASDF,            ASDF
##VAR_DIM=   131072,        131072,          131072
##UNITS=     HZ,            ARBITRARY UNITS, ARBITRARY UNITS
##FACTOR=    0.0627417313425164, 1,          1
##FIRST=     8223.62146879497, 452,          -61772
##LAST=      0,             1184,            -61667
##MIN=       0,             -13890,          0
##MAX=       8223.62146879497, 473993121,    0
$$ Real data points
##PAGE= N=1
##DATA TABLE= (X++(R..R)), XYDATA
$$ [...]
63858I99969L3084L1782L0207K8005K4829K1050J7219J3197Q561L600q37m532
63846A206134q224j2513j7026k1061k4571k7930l1091l3570l5321l6880l8434
63835I19513l9356l9104l8196l7672l7671l7142l5135l1986k8973k7000k5808
63824E41470k4422k2172j9351j6912j5570j5086j4489j3061j1029r280q373q026
63812C63699p523o586n581m961m689m406l953l535l366l422l554l625l455k949
63798C02094k353k103k334k762l171l623l979l704k647j677j840k990l910l842
63784B61159l195k586j938j070n32j013k139k643j872n06M06O35O95R35J202J197
63768B48735P88M9p66j213r87l37K8l72j270j912j767r41MN34N03J21l15o02n64
$$ plain form
63858 999969 1033053 1064835 1095042 1123047 1147876 1168926 1186145 1199342 1207903 1211503 1210666 1206134
63846 1206134 1197910 1185397 1168371 1147310 1122739 1094809 1063718 1030148 994827 957947 919513
63835 919513 880157 841053 802857 765185 727514 690372 655237 623251 594278 567278 541470
63824 541470 517048 494876 475525 458613 443043 427957 413468 400407 389378 380098 371725 363699
63812 363699 356176 349590 344009 339048 334359 329953 326000 322465 319099 315677 312123 308498 305043 302094
63798 302094 299741 297638 295304 292542 289371 285748 281769 278065 275418 273741 271901 268911 265001 261159
63784 261159 257964 255378 253440 252370 251838 250825 248686 246043 244171 243665 244071 244706 245401 246336 247538 248735
63768 248735 249523 249572 248806 247593 246606 246269 246297 245925 244655 242743 240976 240035 240039 240573 241076 241197 240882 240280 239716
63749B39716p0O82J173J169J189J882K915L174K306J435J730K756L054K165J203
63734B66479J255K020K432K078J448J048Q83P90Q26J185J910K837L793M718N555
63719B99257O032N869N205M623M459M320L638K512J508P67j16j200j874j766j444
63704C31790j744k680l504l697l419l016k494j645m72O95J488J898K306K999L727
63689C22232L964L640L285L332L549L373K625J644P96R8o77j592k302k299j495
63674C40173m97l7k41o47q62q30n21J36R42J504J734J939K255K431K305J969J330
63657C53083P3j664l085l644l646l629l651l618l764m191m340l674k563j849j709
63642C08129j617j232o72oQ22J586J960K172K840M011M950N054M550M094M109
$$ plain form
63749 239716 239646 240328 241501 242670 243859 245741 248656 251830 254136 255571 257301 260057 263111 265276 266479
63734 266479 267734 269754 272186 274264 275712 276760 277643 278433 279259 280444 282354 285191 288984 293702 299257
63719 299257 305289 311158 316363 320986 325445 329765 333403 335915 337423 338190 338074 336874 335000 333234 331790
63704 331790 330046 327366 323862 320165 316746 313730 311236 309591 309119 309814 311302 313200 315506 318505 322232
63689 322232 326196 329836 333121 336453 340002 343375 346000 347644 348440 348538 347861 346269 343967 341668 340173
63674 340173 339676 339639 339398 338751 337889 337059 336538 336674 337616 339120 340854 342793 345048 347479 349784 351753 353083
63657 353083 353156 351492 348407 344763 341117 337488 333837 330219 326455 322264 317924 314250 311687 309838 308129
63642 308129 306512 305280 304608 304602 305424 307010 308970 311142 313982 317993 322943 327997 332547 336641 340750
63627C40750M698N736O759P177O880O522O846P914R098R827J0169J0725J1982
63614D45083J3861J5879J7726J9488K1268K2923K4380K5913K7803K9905L1842
63603F96071L3342L4060L3354L0729K6437K1177J5284Q703J775m438q809j0933
63591H76752j1189j0255q671o812n286n224p669j2435j7914k2459k5606k7660
63579G15572k8617k8119k6245k3580k0632j7757j5391j3630j1788r112n938l282
63567E11481j391M18K375L740M017L856M161M989N796O285O497O557O718P365
63553E72864Q582J0111J1936J4432J7659K1023K4030K6962L0507L5217M1367M8368
63541H63058N3732N3632M5797L1777J5754J441r339j5985j8627j8336j6630j4254
$$ plain form
63627 340750 345448 351184 357943 365120 372000 378522 385368 393282 402380 412207 422376 433101 445083
63614 445083 458944 474823 492549 512037 533305 556228 580608 606521 634324 664229 696071
63603 696071 729413 763473 796827 827556 853993 875170 890454 899157 900932 896494 887685 876752
63591 876752 865563 855308 846637 839825 834539 829315 821646 809211 791297 768838 743232 715572
63579 715572 686955 658836 632591 609011 588379 570622 555231 541601 529813 520701 514763 511481
63567 511481 510090 510508 512883 516623 520640 524496 528657 533646 539442 545727 552224 558781 565499 572864
63553 572864 581446 591557 603493 617925 635584 656607 680637 707599 738106 773323 814690 863058
63541 863058 916790 970422 1016219 1047996 1063750 1065191 1055852 1039867 1021240 1002904 986274 972020
63529I72020j1152p719n218m583n613p807j1275j6237k2108k7755l2408l5748
63517G84397l7414l7135l5320l2906l0503k8098k5643k3401k1517j9641j7363
63506D75456j4862j2750j1371j0431r353p843o205n092m879n128m957m085l229
63493C75271l137l522l463k721j977j683j434q20k12j06j72L38J471K576L287
63478C63696L847M383M625M539M611N099N463N012L836K646J799R62k28j562k573
63463D06155l235m004n119o125o330n604m419l156j755k14J048J559J309N95k63
63448C70442p41j15J842M315O185P161P721Q203Q594R100J0109J1510J2771J3961
63434D71058J6122K0288K6425L3374L9252M1902L9783L3170K4210J5388Q050K492
$$ plain form
63529 972020 960868 953149 947931 943348 937735 929928 918653 902416 880308 852553 820145 784397
63517 784397 746983 709848 674528 641622 611119 583021 557378 533977 512460 492819 475456
63506 475456 460594 447844 436473 426042 416689 408846 402641 397549 392670 387542 382585 378500 375271
63493 375271 372134 368612 365149 362428 360451 358768 357334 356514 356302 356196 356024 356362 357833 360409 363696
63478 363696 367543 371926 376551 381090 385701 390800 396263 401275 405111 407757 409556 410518 410290 408728 406155
63463 406155 402920 398916 393797 387672 381342 375738 371319 368163 366408 366194 367242 368801 370110 370705 370442
63448 370442 369701 369586 371428 375743 381928 389089 396810 405013 413607 422707 432816 444326 457097 471058
63434 471058 487180 507468 533893 567267 606519 648421 688204 721374 745584 760972 769022 771514
63422G71514j124k388j008K808Q230J4009J9196K3875K8822L4211L9058M2081
63410I79284M2645M0524L5441K7517J7847Q028q14q081j3089j5154j4395j2016
63398A087737r552q049p916r244j2119j6669k2739k9430l5227l8912m0296l9895
63386H17689l8121l5194l1686k8549k6345k4678k2623j9680j6181j2858j0063
63375E51711p574n120k919j475q21k61J030L280O041Q646J0685J2266J3933J6114
63361F05536J8575K0622K1948K3043K4655K7079L0071L3179L6029L8469M0518
63350I19724M1937M1824L9031L3251K5323J6429P427q45p273j1102j2570j2476
63338A080680j1439j0008r095r528j1350j4142j7893k2857k8519l3446l6441l7403
$$ plain form
63422 771514 770390 768002 766994 769802 778032 792041 811237 835112 863934 898145 937203 979284
63410 979284 1021929 1062453 1097894 1125411 1143258 1151286 1150472 1142391 1129302 1114148 1099753 1087737
63398 1087737 1078185 1070136 1062220 1052976 1040857 1024188 1001449 972019 936792 897880 857584 817689
63386 817689 779568 744374 712688 684139 657794 633116 610493 590813 574632 561774 551711
63375 551711 544137 539017 536098 534623 533802 533541 534571 537851 543892 552538 563223 575489 589422 605536
63361 605536 624111 644733 666681 689724 714379 741458 771529 804708 840737 879206 919724
63350 919724 961661 1003485 1042516 1075767 1101090 1117519 1124946 1124101 1116828 1105726 1093156 1080680
63338 1080680 1069241 1059233 1050138 1040610 1029260 1015118 997225 974368 945849 912403 875962 838559
63326H38559l6871l5285l2874k9842k6259k2042j7249j2149o831j278L670N840
63314F27389L097m416j3785k1335k5129k5590k4224k2181j9870j7299j4498j1746
63302D30413r493p979o944n891m735l801l192k614k066k148l142m251m427l729
63288C66001l151l190l376l293l132l063k813k228j665j344r58l33J16P5p8O8
63272C37636J99j88q67j159q47j77P18J686K154J680Q21O51J356K065K149K005
63256C49882K258K823L136K966K618K544K943L604M090M219M308M689N179N436
63242D00695N703O548P802Q512Q295Q140R287J1652J3978J5377J6178J7169J8521
63229E47857J9823K0849K1873K3143K4354K4920K4687K4072K3445K2718K1788
$$ plain form
63326 838559 801688 766403 733529 703687 677428 655386 638137 625988 619157 617879 621549 627389
63314 627389 630486 626070 612285 590950 565821 540231 516007 493826 473956 456657 442159 430413
63302 430413 420920 412941 405997 400106 395371 391570 388378 385764 383698 381550 378408 374157 369730 366001
63288 366001 362850 359660 356284 352991 349859 346796 343983 341755 340090 338746 337788 337455 337571 337646 337568 337636
63272 337636 337835 337647 336780 335621 334774 334597 335315 337001 339155 340835 341656 342307 343663 345728 347877 349882
63256 349882 352140 354963 358099 361065 363683 366227 369170 372774 376864 381083 385391 390080 395259 400695
63242 400695 406398 412946 420748 429260 437555 445695 454982 466634 480612 495989 512167 529336 547857
63229 547857 567680 588529 610402 633545 657899 682819 707506 731578 755023 777741 799529
63218G99529K1098K1247K2090K2803K2960K3144K4060K5311K5537K3832K0587
63207A052198J6779J2723P939K074m439j0741j6217k0662k4105k6768k8957l0645
63195I29179l1263l0238k7713k4388k0824j7225j3769j0593p453l897J01M130
63183G46047P976J1708J5093J7635J9444K1336K3717K5941K7314K8004K8497K8685
63171A001397K8234K7384K6634K5962K5052K3977K2922K1547J9400J6666J3598
63160A252773R501L401m248j1659j7814k3401k9295l5060l9671m2847m4872m5634
63148I71174m4760m2531l9777l6901l3649k9950k6440k3822k2022k0259j7879
63137F33184j5004j2367j0584r610q896p929o538m786k874j229l81m80r95j093
$$ plain form
63218 799529 820627 841874 863964 886767 909727 932871 956931 982242 1007779 1031611 1052198
63207 1052198 1068977 1081700 1089639 1091713 1087274 1076533 1060316 1039654 1015549 988781 959824 929179
63195 929179 897916 867678 839965 815577 794753 777528 763759 753166 745713 741816 741917 746047
63183 746047 754023 765731 780824 798459 817903 839239 862956 888897 916211 944215 972712 1001397
63171 1001397 1029631 1057015 1083649 1109611 1134663 1158640 1181562 1203109 1222509 1239175 1252773
63160 1252773 1262274 1265675 1261427 1249768 1231954 1208553 1179258 1144198 1104527 1061680 1016808 971174
63148 971174 926414 883883 844106 807205 773556 743606 717166 693344 671322 651063 633184
63137 633184 618180 605813 595229 585619 576723 568794 562256 557470 554596 553367 552986 552506 551511 550418
63123E50418l56R45K191K981L392L836M691N951P108P360O219M100K219J596K108
63108F04759K773K969K991L299L643L372K335J058J7q38j805k897l724l814l082
63093F11056k045j434j495j829j965j856j670j390r12l67pJ19J44J62K53N87J254
63076E98605K107K888L443L727L873M261N159O204O813P199Q247J0005J1197J1001
63062F84729J0518J1468J3834J6059J7361J8602K0743K3565K6303K8633L0627
63051I02442L2485L4701L7863M1828M5696M8905N1786N4645N6992N8152N8195
63040A423690N7720N7071N6273N5333N4200N2704N1014M9832M9655N0064N0248
63029B007804M9900M9110M7543M4353L8988L1624K2652J2151O5j3252k6912l9831
$$ plain form
63123 550418 550062 551007 553198 556179 559571 563407 568098 574049 581157 588517 594736 598836 601055 602651 604759
63108 604759 607532 610501 613492 616791 620434 623806 626141 627199 627216 626378 624573 621676 617952 614138 611056
63093 611056 609011 607577 606082 604253 602288 600432 598762 597372 596460 596093 596086 596205 596349 596511 596764 597351 598605
63076 598605 600712 603600 607043 610770 614643 618904 624063 630267 637080 644279 652526 662531 673728 684729
63062 684729 695247 706715 720549 736608 753969 772571 793314 816879 843182 871815 902442
63051 902442 934927 969628 1007491 1049319 1095015 1143920 1195706 1250351 1307343 1365495 1423690
63040 1423690 1481410 1538481 1594754 1650087 1704287 1756991 1808005 1857837 1907492 1957556 2007804
63029 2007804 2057704 2106814 2154357 2198710 2237698 2269322 2291974 2304125 2304190 2290938 2264026 2224195
63017B224195n1103o0152o6720p0815p2659p2502p0434o6450o0809n4143m7080
63006A531328l9814l2242k4334j6169p784O64Q674J5765K1996K7773L3153L7766
62994A556776M1433M4383M6719M8159M8627M8755M9358N0514N1464N1409N0249
62983B087846M8478M6439M3805L9870L4168K6662J7402O441n755j8303l0598m2686
62971B253769n4489o5125p3532p9488q3418q5432q5242q2961p9233p4617o9425
62960A420807o4134n9280n4913n0757m6858m3440m0232l6810l3628l1720l1098
62949I27937l0437k8741k6513k4727k3455k2125k0537j8926j7487j6368j5701
62938F82920j5237j4389j3104j2018j1333j0197q005n715m872n631o585o486n305
$$ plain form
63017 2224195 2173092 2112940 2046220 1975405 1902746 1830244 1759810 1693360 1632551 1578408 1531328
63006 1531328 1491514 1459272 1434938 1418769 1410985 1411649 1420323 1436088 1458084 1485857 1519010 1556776
62994 1556776 1598209 1642592 1689311 1737470 1786097 1834852 1884210 1934724 1986188 2037597 2087846
62983 2087846 2136324 2182763 2226568 2266438 2300606 2327268 2344670 2351111 2345356 2327053 2296455 2253769
62971 2253769 2199280 2134155 2060623 1981135 1897717 1812285 1727043 1644082 1564849 1490232 1420807
62960 1420807 1356673 1297393 1242480 1191723 1144865 1101425 1061193 1024383 990755 959035 927937
62949 927937 897500 868759 842246 817519 794064 771939 751402 732476 714989 698621 682920
62938 682920 667683 653294 640190 628172 616839 606642 598637 592922 588050 582419 575834 569348 564043
62925E64043l722k327j485j345j707k130k300k116j636j228j466k474l537l850
62911E32720l429k923k731k833l287m185n150n520n126m389l592k603j449n73
62897D84930k42j43J43O04R75J106R03K21q02j571j632j300j250j526j455o82
62881D78279J97M52K85N27J390K114K033J370P28K66j53m29m17l94p00j124j217
62864D83207j163j556k311k558j876r48o32r06j119q38n2J008J820J747P05n34
62848D73994j095q72l67LJ34O3j2K07O88Q32J20j128j950j771r46k76j82l26q7
62829D67029O41J192Q90q5r21j236j324j331q02N37K101L041L257L328L616L859
62813D83792L678L143K772L016L773M481M760M821N046N363N480N490N706O012
$$ plain form
62925 564043 560321 557994 556509 555164 553457 551327 549027 546911 545275 544047 542581 540107 536570 532720
62911 532720 529291 526368 523637 520804 517517 513332 508182 502662 497536 493147 489555 486952 485503 484930
62897 484930 484688 484545 484688 485292 486267 487373 488276 488497 487695 486124 484492 483192 481942 480416 478961 478279
62881 478279 478476 478928 479213 479740 481130 483244 485277 486647 487375 487641 487488 487059 486642 486248 485548 484424 483207
62864 483207 482044 480488 478177 475619 473743 472795 472163 471257 470138 469300 469248 470256 472076 473823 474528 473994
62848 473994 472899 472027 471660 471663 471797 471860 471848 472055 472743 473575 473695 472567 470617 468846 467900 467624 467442 467116 467029
62829 467029 467670 468862 469752 469667 468746 467510 466186 464855 464053 464590 466691 469732 472989 476317 479933 483792
62813 483792 487470 490613 493385 496401 500174 504655 509415 514236 519282 524645 530125 535615 541321 547333
62799E47333O134O401P447Q981R873R779R693J0408J1333J1636J1780J2960J5490
62786F79248J8637K1785K4907K8072L1265L4709L8794M3656M9115N4907O0735
62775A085830O6288P1572P6863Q2068Q6497Q9592R1382R1799R0058Q5331P7604
62764A994884O7378N4962M0719K5471J0009n554k1189l6164m9554o1188p1251
62753A948523p9259q4339q6459q6533q5366q3169q0059p6326p2122o7538o2901
62742A084452n8499n4078m9246m4261l9725l5658l1584k7479k3839k0797j7896
62731F81390j4934j2375j0690r726q912p752o107m359l143k567j918o37Q02J588
62717F00660J901K657M095N503O489P631R609J2305J5045J7281J8892K0309K2357
$$ plain form
62799 547333 553467 559868 567315 576296 586169 595948 605641 616049 627382 639018 650798 663758 679248
62786 679248 697885 719670 744577 772649 803914 838623 877417 921073 970188 1025095 1085830
62775 1085830 1152118 1223690 1300553 1382621 1469118 1558710 1650092 1741891 1831949 1917280 1994884
62764 1994884 2062262 2117224 2157943 2183414 2193423 2187869 2166680 2130516 2080962 2019774 1948523
62753 1948523 1869264 1784925 1698466 1611933 1526567 1443398 1363339 1287013 1214891 1147353 1084452
62742 1084452 1025953 971875 922629 878368 838643 802985 771401 743922 720083 699286 681390
62731 681390 666456 654081 643391 633665 624753 617001 610894 606535 603392 600825 598907 598270 599072 600660
62717 600660 602561 605218 609313 614816 621305 628936 638545 650850 665895 683176 702068 722377 744734
62704G44734K5487K9173L2560L5731L9644M4804N0579N5961O0590O4963O9998
62693A254224P6301Q3406Q9892R4767R8355J01160J02326J00263R4547Q6017P5026
62682B256284O0888M3451K4027M242j5170l3906n1331o6764p9896r0357r7541
62671A953927j01347j02501j01650r8781r4012q8353q2901p7756p2290o6219n9860
62660A008257n3632m7814m2630l8186l4407l1231k8605k6195k3486k0474j7822
62649F43775j6132j5286j4733j4034j2962j1477r896q722q107p741p371p000o518
62636E03796n614m225k654j103L72J348J162j70j773k940l786m555m948m578l589
62621D66743k459j532j060j161j411j036J33J392K142K576K984L132K866K695
$$ plain form
62704 744734 770221 799394 831954 867685 907329 952133 1002712 1058673 1119263 1184226 1254224
62693 1254224 1330525 1413931 1503823 1598590 1696945 1798105 1900431 2000694 2095241 2181258 2256284
62682 2256284 2317172 2360623 2384650 2388892 2373722 2339816 2288485 2221721 2141825 2051468 1953927
62671 1953927 1852580 1750079 1648429 1549648 1455636 1367283 1284382 1206626 1134336 1068117 1008257
62660 1008257 954625 906811 864181 825995 791588 760357 731752 705557 682071 661597 643775
62649 643775 627643 612357 597624 583590 570628 559151 549255 540533 532426 524685 517314 510314 503796
62636 503796 498182 493957 491303 490200 490572 491920 493082 492912 491139 488199 484413 479858 474910 470332 466743
62621 466743 464284 462752 461692 460531 459120 458084 458217 459609 461751 464327 467311 470443 473309 476004
62607D76004L085L680L913L983M538N686P069Q625J0538J2562J4149J5273J6616
62594E85721J8795K1828K5358K9059L2747L6317L9594M2206M3793M4417M4396
62583I64231M3609M1356L7176L1439K4785J7409R273P08p698j5623k2994k9575
62571A094096l4889l8489m0221m0434l9970l9493l8733l6866l3831l0668k8234
62560F92268k6258k4108k1835j9794j7787j5434j3023j1206r993q798p449o379
62548E10204n830n387m458k967j460o82r30j632j788j027R7J034J879K706K918
62533D92677K008N79k05k4N12J037J883L278M843O138P265Q644J0481J2582J4513
62518E66211J5952J7107J8696K1310K4869K8864L2936L6996M1092M5380M9924
$$ plain form
62607 476004 479089 482769 486682 490665 495203 500889 507958 516583 527121 539683 553832 569105 585721
62594 585721 604516 626344 651702 680761 713508 749825 789419 831625 875418 919835 964231
62583 964231 1007840 1049196 1086372 1117811 1142596 1160005 1169278 1169986 1162288 1146665 1123671 1094096
62571 1094096 1059207 1020718 980497 940063 900093 860600 821867 785001 751170 720502 692268
62560 692268 666010 641902 620067 600273 582486 567052 554029 542823 532830 524032 516583 510204
62548 510204 504374 498987 494529 491562 490102 489420 488490 486858 485070 484043 484140 485174 487053 489759 492677
62533 492677 494685 495264 495059 495035 495547 496584 498467 501745 506588 512726 519991 528635 539116 551698 566211
62518 566211 582163 599270 617966 639276 664145 693009 725945 762941 804033 849413 899337
62507H99337N4233N7436N9282O0418O1142O0389N6855N0703M3252L5143K5882
62496A464072J5280M294n824j4449k1235k5626k7327k6788k4765k1628j7470j2654
62484A285880p755l055J711P066J3314K0057K6036K9489K8980K4159J6186P447
62472A449515L27m573r055j5730k5539l6960m7367n4804n8623n9350n8350n7186
62460A022305n6612n6126n4628n1429m6634m0907l5076k9781k5175k0986j7091
62449E87860j3861j1799j0754r796q017n423k876j189m01pM17J028J944L228M607
62434E34961N572N883N691N144M264L166K044P18j248l781o106p641q635r513
62420E30519j0032r683q629p672p321p327p129o405n316m452m377m955n318m824
$$ plain form
62507 899337 953570 1011006 1070288 1130706 1191848 1252237 1309092 1359795 1403047 1438190 1464072
62496 1464072 1479352 1483646 1477822 1463373 1442138 1416512 1389185 1362397 1337632 1316004 1298534 1285880
62484 1285880 1278125 1275070 1276781 1283847 1297161 1317218 1343254 1372743 1401723 1425882 1442068 1449515
62472 1449515 1449842 1445269 1436214 1420484 1394945 1357985 1310618 1255814 1197191 1137841 1079491 1022305
62460 1022305 965693 909567 854939 803510 756876 715969 680893 651112 625937 604951 587860
62449 587860 573999 562200 551446 541650 533633 528210 525334 524145 523744 523737 524154 525182 527126 530354 534961
62434 534961 540533 546416 552107 557251 561515 564681 566725 567443 566195 562414 556308 548667 540032 530519
62420 530519 520487 510804 502175 494503 487182 479855 472726 466321 461005 456553 452176 447221 441903 437079
62406D37079l813l057k778k611k294j862j336p33l06k61k53L23J497K625L110
62391D25330K953K544K267K254K346K272K030J954K230K686L226M118N442O618
62377D68270O998O696O352O279O355O556P026P735Q542R421J0254J0730J0928
62364E72142J1602J3238J5216J6746J8281K1038K5230K9879L4372L9073M4177
62353H40994M9090N3378N7404O1297O4129O4715O2656N7999N0579M0574K9362
62342A432177J8842R931K247m773j1087j6553k1621k7084l3163l9074m3638m6249
62330A219955m7121m6615m4762m1652l7932l4353l1028k7670k4503k2271k1261
62319H40787k0911k0593k0299k0311k0625k0987k1113k0719j9613j8000j6350
$$ plain form
62406 437079 433266 430209 427431 424820 422526 420664 419328 418595 418289 418028 417775 418098 419595 422220 425330
62391 425330 428283 430827 433094 435348 437694 439966 441996 443950 446180 448866 452092 456210 461652 468270
62377 468270 475268 481964 488316 494595 500950 507506 514532 522267 530809 540230 550484 561214 572142
62364 572142 583744 596982 612198 628944 647225 668263 693493 723372 757744 796817 840994
62353 840994 890084 943462 1000866 1062163 1126292 1191007 1253663 1311662 1362241 1402815 1432177
62342 1432177 1451019 1460950 1463197 1458424 1447337 1430784 1409163 1382079 1348916 1309842 1266204 1219955
62330 1219955 1172834 1126219 1081457 1039805 1001873 967520 936492 908822 884319 862048 840787
62319 840787 819876 799283 778984 758673 738048 717061 695948 675229 655616 637616 621266
62308F21266j4879j3412j1858j0394r100p833o586n527m570l471k445k042k181
62295E26968j976r72R9M33L75P73J510J660R93M44Q18J762K370K323K015J838
62279E41433J790J760J817K007K078J682R49O27J364K897M294N009N449O326P759
62264E87241R282J0571J1849J3585J6081J9381K3410K7991L2847L7756M2803M8312
62252H81109N4355O0325O5174O8159O9142O8109O4676N8380M9453L9054K8662
62241A506598J9242J0817K793n267j3166k0553k7647l4952m2201m8176n1903n3428
62229A242157n3127n0967m7116m2544l8184l3944k9426k5240k2417k0789j9143
62218H59260j7079j5503j5051j5162j5110j4962j4988j5017j4922j4974j5100
$$ plain form
62308 621266 606387 592975 581117 570723 561623 553790 547204 541677 537107 533636 531191 529149 526968
62295 526968 524992 524020 524119 524552 524927 525700 527210 528870 529863 530307 531125 532887 535257 537580 539595 541433
62279 541433 543223 544983 546800 548807 550885 552567 553516 554143 555507 558404 562698 567707 573156 579482 587241
62264 587241 596523 607094 618943 632528 648609 667990 691400 719391 752238 789994 832797 881109
62252 881109 935464 995789 1060963 1129122 1198264 1266373 1331049 1389429 1438882 1477936 1506598
62241 1506598 1525840 1536657 1539450 1534183 1521017 1500464 1472817 1437865 1395664 1347488 1295585 1242157
62229 1242157 1189030 1138063 1090947 1048403 1010219 976275 946849 921609 899192 878403 859260
62218 859260 842181 826678 811627 796465 781355 766393 751405 736388 721466 706492 691392
62207F91392j4610j3276j1961j1450j1262j0410q786p025n428l879k513j645j129
62194E88018m40O39J956L373M739N709O179O688P699Q727Q882Q215P816Q505J0003
62179F76708J1471J2281J2133J0972R086O993N105L641K841K924L886N665Q419
62166G72125J2252J6765K1369K5992L0985L6269M1182M5232M8400N0412N0264
62155A151247M7016M0711L2270K2821J3574N833L61l477p320j2301j8167k3942
62143A248626k9116l3787l7934m0992m2256m1466l8901l5101l0692k6228k2014
62132H70139j8072j4370j1043q293o248n052m827n275n519m780l171j445J8J511
62118G83573L201M677N611O416P801R905J2269J4341J5492J4732J1187N202j381
$$ plain form
62207 691392 676782 663506 651545 640095 628833 618423 609637 602612 597184 593305 590792 589147 588018
62194 588018 587578 588217 590173 593546 598285 603994 610173 616861 624560 633287 642169 650384 658200 666705 676708
62179 676708 688179 700460 712593 723565 732651 739644 744749 748390 751231 754155 758041 763706 772125
62166 772125 784377 801142 822511 848503 879488 915757 956939 1002171 1050571 1100983 1151247
62155 1151247 1198263 1238974 1271244 1294065 1307639 1313472 1313833 1310356 1303036 1290735 1272568 1248626
62143 1248626 1219510 1185723 1147789 1106797 1064541 1023075 984174 949073 918381 892153 870139
62132 870139 852067 837697 826654 818361 812113 807061 802234 796959 791440 786660 783489 782044 782062 783573
62118 783573 786774 791451 797062 803478 811279 821184 833453 847794 863286 878018 889205 894407 893026
62105H93026o341q507q105o087l388p29J145J421l85l751p126q852q326o211l580
62090H24204j100J007K684M069N545P307Q868R449Q980Q373Q519R380J0393J1447
62076I19125J2917J4825J6653J8090J9447K1045K2655K3738K3956K3180K1480
62065A137111J9405J7894J7481J7917J8885K0637K3325K6155K7864K7844K6184
62054A380702K2934J8135J2488P163K776q55m005o899j0287j5168k1525k8031
62042A357428l3486l7928m1916m5354m7666m8723m8915m8440m7111m4825m1862
62031H71202l8648l5474l2418k9434k6497k3710k1125j8539j5702j2837j0587
62020F06231r391r032q907q535p837p125o839p057p350p276o837o086m718k629
$$ plain form
62105 893026 886685 878178 870073 863986 860598 859869 861014 862435 862050 858299 851173 842321 833995 827784 824204
62090 824204 823104 824111 826795 830864 836409 843716 852584 862033 871013 879386 887905 897285 907678 919125
62076 919125 932042 946867 963520 981610 1001057 1022102 1044757 1068495 1092451 1115631 1137111
62065 1137111 1156516 1174410 1191891 1209808 1228693 1249330 1272655 1298810 1326674 1354518 1380702
62054 1380702 1403636 1421771 1434259 1441422 1444198 1443343 1439338 1432439 1422152 1406984 1385459 1357428
62042 1357428 1323942 1286014 1244098 1198744 1151078 1102355 1053440 1005000 957889 913064 871202
62031 871202 832554 797080 764662 735228 708731 685021 663896 645357 629655 616818 606231
62020 606231 596840 587808 578901 570366 562529 555404 548565 541508 534158 526882 520045 513959 509241 506612
62006E06612o09M70J006K282M570O592P248O959O880P491Q499R431R656Q533O172
61991E91792L633J816O51k14o25n56r12k682n593q396j0263j1172j1234j0533
61977E35712r641r368r786j0037r327p741n973m668m076m029m117m083l949l727
61963D45190l215k353j465q80n65m63p18j211j275n02N24R70J036J701L352N308
61947D45434O732P399P523P463P734Q777J0437J2087J3357J4419J5506J6571J7486
61934E90925J8213J8614J8446J7713J6733J5746J4726J3649J2692J1964J1240
61923G60661J0074Q180N622K729k07l138o090q804j0744j1539j1204r828p416
61910G18296m223q99K040M671P346J0129J2781J5024J6555J7035J6363J4715J2184
$$ plain form
62006 506612 506003 506473 507479 509761 514331 520923 528171 535130 542010 549501 558000 567431 577087 585620 591792
61991 591792 595425 597241 597892 597678 597053 596497 595585 592903 587310 578914 568651 557479 546245 535712
61977 535712 526071 516703 506917 496880 487553 479812 473839 469171 465095 461066 456949 452866 448917 445190
61963 445190 441975 439622 438157 437277 436712 436249 435531 434320 433045 432543 433067 434037 435073 436774 440126 445434
61947 445434 452166 459565 467088 474551 482285 491062 501499 513586 526943 541362 556868 573439 590925
61934 590925 609138 627752 646198 663911 680644 696390 711116 724765 737457 749421 760661
61923 760661 770735 778915 784537 787266 787059 783921 777831 769027 758283 746744 735540 725712 718296
61910 718296 714073 713174 715214 719885 727231 737360 750141 765165 781720 798755 815118 829833 842017
61897H42017Q774M910J429j380m158p419j0636j2998j4463j5409j5712j5117j4188
61884G45650j3796j3821j3339j2126j0961j0329r807r053q498q580q973r116q998
61871F08253q881q628p769o138m077k081m18R62K196L196L785M208N148O829Q533
61856F05118R599J0513J2278J4907J7495J9649K1814K4145K6089K7436K8753L0283
61844H48079L1333L1419L1092L0822K9794K6811K1949J6376J0764M884j346p263
61832A074714j2116j5675j7899j8550j7379j4499j0410n825j404K596O351R942
61820I79846J2940J4751J5211J4370J1925P460J358n177j1195j6638k1698k6083
61808I77070k9310l1303l2227l2049l0761k8865k7009k5210k2978k0273j7766
$$ plain form
61897 842017 850791 855701 857130 855750 851592 844173 833537 820539 806076 790667 774955 759838 745650
61884 745650 731854 718033 704694 692568 681607 671278 661471 652418 643920 635340 626367 617251 608253
61871 608253 599372 590744 582975 576837 572760 570679 570261 571223 573419 576615 580400 584608 589756 596585 605118
61856 605118 614717 625230 637508 652415 669910 689559 711373 735518 761607 789043 817796 848079
61844 848079 879412 910831 941923 972745 1002539 1029350 1051299 1067675 1078439 1083323 1081977 1074714
61832 1074714 1062598 1046923 1029024 1010474 993095 978596 968186 962361 960957 963553 969904 979846
61820 979846 992786 1007537 1022748 1037118 1049043 1056503 1057861 1052684 1041489 1024851 1003153 977070
61808 977070 947760 916457 884230 852181 821420 792555 765546 740336 717358 697085 679319
61797F79319j5987j4731j3508j2113j0455q383o200m847m903n614n655m741l788
61784E68394l437l212k443j336o26o05r54j327j670k026k381k610k526k018j272
61769E39951o81m84o70j146j717j941j476o68l04n97q43l44P58J842K556K848
61753E37084K690K122J385O30k29j114j616j506j159j102j433j928k462k961l213
61738E25188l050k547j870j217r17j180j611j512q70l78l15j18M94Q85O09L72
61722E11963J042K316L242L571L677L554K954K206J981K262K490K553K822L196
61708E49829K972J756j17k076l667m467m377l933l799l984m043l843l556l174
61694E13521k715k638l232l846l648k932k806l518m098l769k843k095j921k353
$$ plain form
61797 679319 663332 648601 635093 622980 612525 604142 597942 593095 588192 582578 576923 572182 568394
61784 568394 564957 561745 559302 557966 557340 556735 555781 554454 552784 550758 548377 545767 543241 541223 539951
61769 539951 539270 538786 538116 536970 535253 533312 531836 531168 530864 530267 529424 529080 529838 531680 534236 537084
61753 537084 539774 541896 543281 543911 543682 542568 540952 539446 538287 537185 535752 533824 531362 528401 525188
61738 525188 522138 519591 517721 516504 515587 514407 512796 511284 510414 510036 509721 509603 510097 510982 511591 511963
61722 511963 513005 515321 518563 522134 525811 529365 532319 534525 536506 538768 541258 543811 546633 549829
61708 549829 552801 554557 554440 552364 548697 544230 539853 535920 532121 528137 524094 520251 516695 513521
61694 513521 510806 508168 504936 501090 497442 494510 491704 488186 484088 480319 477476 475381 473460 471107
61680D71107l152l827m018l905l796l535k972k645l015l365k613j079k16m70p83
61665D31716m65k14p03j355j342q97p89j094j240q46J2J007J607J404O94K96N22
61648D28313Q97J073J354K003K677K965K941K858K785K833L121L306K761J514
61634D61401L66j50l46o59j124j791k861m049m596m345m022m080m070l656l270
61619D22748l180k787j669n14r6j1N30J185Q85m77j841k445k660l194m127m954
61603C97393n169m744m199m182m760n259n022m113l044k179j649j585j961k393
61589C47134k404j883j143o98r84k000l093l446k865j854r12j77K19P1m92j053
61573C24420j495j962k183j549j92P78N76l03q53p63m09j56j50m23q06r53p06
$$ plain form
61680 471107 467955 464128 460110 456205 452409 448874 445902 443257 440242 436877 434264 433185 432969 432499 431716
61665 431716 431251 431037 430334 428979 427637 426740 425951 424857 423617 422771 422783 423790 425397 426801 427495 427791 428313
61648 428313 429210 430283 431637 433640 436317 439282 442223 445081 447866 450699 453820 457126 459887 461401
61634 461401 461767 461617 461271 460612 459488 457697 454836 450787 446191 441846 437824 433744 429674 426018 422748
61619 422748 419568 416781 415112 414598 414502 414491 415021 416206 417091 416614 414773 412328 409668 406474 402347 397393
61603 397393 392224 387480 383281 379099 374339 369080 364058 359945 356901 354722 353073 351488 349527 347134
61589 347134 344730 342847 341704 341006 340022 338022 334929 331483 328618 326764 325852 325675 325894 325965 325473 324420
61573 324420 322925 320963 318780 317231 317039 317817 318393 318090 317237 316474 316065 315909 315759 315336 314530 313577 312871
61556C12871j63O71J776K643K635J953J542J704J664Q88mj65L31R04J356J685
61540C32291J625J045M45M23R85J794K700L563M011L873L476L139K721J974R36
61525C65001k85j565k419k263j383q61j215j772j819j570j497j455j155q39q43
61510C44060j014j038q61m61J83O13K22o35r06m82m12j024j238n22J8m08p42O9
61492C35422J009N62o72r17j6O25N37O04J062J033K82j79K41R17J271J614K167
61475C45562K398J977J452J377J457J173O80M77N61M37o1l57K43J513K205J414
61459C62508j73j047q78p46j210j457q95l33m21k60J109K718K855J586M83K20
61443C64059J61Q9O25J691K226J905J808K857M541N706N811N077M076L419L267
$$ plain form
61556 312871 312708 313379 315155 317798 320433 322386 323928 325632 327296 328184 328180 328015 328346 329250 330606 332291
61540 332291 333916 334961 335406 335829 336814 338608 341308 344871 348882 352755 356231 359370 362091 364065 365001
61525 365001 364716 363151 360732 358469 357086 356225 355010 353238 351419 349849 348352 346897 345742 344903 344060
61510 344060 343046 342008 341147 340686 340869 341482 341704 341069 340163 339681 339269 338245 337007 336485 336503 336095 335353 335422
61492 335422 336431 336993 336321 335404 335388 336013 336550 337154 338216 339249 339531 339352 339593 340510 341781 343395 345562
61475 345562 347960 349937 351389 352766 354223 355396 356076 356553 357114 357551 357490 357133 357376 358889 361094 362508
61459 362508 362335 361288 360410 359664 358454 356997 356102 355769 355348 355088 356197 358915 361770 363356 363839 364059
61443 364059 364220 364309 364934 366625 368851 370756 372564 375421 379962 385668 391479 396556 400632 404051 407318
61428D07318L032K149J050O39R60J207R74O58O66J029J719K546K847K193J302
61413D30289J326K257K893K354Q39r99k525l117k698k137k305k832k728j961j411
61398D17245j415j538j609j801j802j152l58m61j414k136k131j830j407o13J99
61383C97777L20L2K69Q12M63o58q14P66K622L250L070L219L656L607K871J714
61367D22976L22q24q42L62J601J924J836K254K991L210K752K200K026K407L449
61352D48644M903O084O621P033Q004R454J0598J0669R430P446N870N419N513N077
61338E50765M129L650L919M137L840L454L100K099K33j596k646l236l761l892
61324E64195l447l083l252l381k798j728o22O30K032K981L221L448M093M372L601
$$ plain form
61428 407318 410350 412499 413549 414188 415148 416355 417329 417987 418653 419682 421401 423947 426794 428987 430289
61413 430289 431615 433872 436765 439119 439958 438959 436434 433317 430619 428482 426177 423345 420617 418656 417245
61398 417245 415830 414292 412683 410882 409080 407928 407570 407109 405695 403559 401428 399598 398191 397578 397777
61383 397777 398097 398129 398398 399210 399673 399015 398201 398967 401589 404839 407909 411128 414784 418391 421262 422976
61367 422976 423298 422474 421632 421994 423595 425519 427355 429609 432600 435810 438562 440762 442788 445195 448644
61352 448644 453547 459631 466252 473285 481289 490743 501341 512010 521440 528886 534756 540175 545688 550765
61338 550765 554894 558544 562463 566600 570440 573894 576994 579093 579326 577730 575084 571848 568087 564195
61324 564195 560748 557665 554413 551032 548234 546506 545884 546514 548546 551527 554748 558196 562289 566661 570262
61309E70262K713L237N248P443R020J0386J2114J4020J5371J5405J3722J0613
61297F89554O967L624R06j203k861m458o297q007q873q911q880r092r078q643
61283F24748q322q349q145p322o323n577m818l814k820j841l63J585L101L781
61269E75521M396N453O188N868N120M898N061N038N188O281Q136R881J1160J2137
61255F70326J2690J2414J1231R382P196N215L917K925J293r39k472k651k515l145
61241G24867m113m566m753n209n412m645l474k990l183l301l213l203k997k241
61227F71567j380q76p5J764L910M978M903M719M841M937N147N919O852P112O871
61212G31189O971P307O924N626M193K990J701N10J89Q13J577K060K661L611M595
$$ plain form
61309 570262 572975 576212 581460 588903 597923 608309 620423 634443 649814 665219 678941 689554
61297 689554 696521 700145 701051 699848 696987 692529 686232 678225 669352 660441 651561 642469 633391 624748
61283 624748 616426 608077 599932 592610 586287 580710 575892 572078 569258 567417 567054 568639 571740 575521
61269 575521 579917 585370 591558 597426 602546 607444 612505 617543 622731 629012 637148 647029 658189 670326
61255 670326 683016 695430 706661 716043 723239 728454 732371 735296 736589 735650 733178 730527 728012 724867
61241 724867 720754 716188 711435 706226 700814 696169 692695 689705 686522 683221 680008 676805 673808 671567
61227 671567 670187 669311 669236 671000 674910 679888 684791 689510 694351 699288 704435 710354 717206 724318 731189
61212 731189 738160 745467 752391 758017 762210 765200 766901 767411 767600 768413 769990 772050 774711 778322 782917
61197G82917N564P016R269J2172J5529J9008K1786K3148K3271K2569K0634J6969
61185I79852J2463Q841O613M875L070J640P80j23j381k554l548n111p630j0253
61171I87534j1756j1833j1185j0813j1381j2722j3971j4518j4719j5200j5860
61160H43576j6279j6654j7326j7723j6887j4900j2751j0877q936o877n063l307
61148F95996r32J957M292N276M934L427Q14k363n212p348q856r456q723p091n625
61133F61090m725l940k945j784k14K070M637O791Q685J0892J3066J4405J5315
61120G23343J7077J9812K2255K3782K5121K6806K8368K9511L0618L1616L1729
61109A010038L0838K9848K9161K8104K6365K4579K2931K0537J6947J2965R215
$$ plain form
61197 782917 788481 795497 804766 816938 832467 851475 873261 896409 919680 942249 962883 979852
61185 979852 992315 1001156 1007769 1012644 1015714 1017354 1018134 1018011 1016630 1014076 1010528 1005417 997787 987534
61171 987534 975778 963945 952760 941947 930566 917844 903873 889355 874636 859436 843576
61160 843576 827297 810643 793317 775594 758707 743807 731056 720179 711243 704366 699303 695996
61148 695996 695064 697021 701313 706589 711523 714950 715764 713401 708189 700841 691985 682529 673806 666715 661090
61133 661090 656365 652425 649480 647696 647482 649552 654189 660980 669665 680557 693623 708028 723343
61120 723343 740420 760232 782487 806269 831390 858196 886564 916075 946693 978309 1010038
61109 1010038 1040876 1070724 1099885 1127989 1154354 1178933 1201864 1222401 1239348 1252313 1261528
61098A261528N169L56m597r043j3282j7625k1501k4421k6892k9446l1580l2576
61086A056090l2567l2069l1173k9901k8643k7517k5966k3640k1036j8714j6634
61075G68230j4660j2985j1577j0032q366p110o304n372m241l481k997j945l10
61062F78850Q07J065J574K998M465N267O124P702R177R568R362R650J0632J2017
61048G69258J3859J6046J7917J9361K1204K3684K5839K7168K8446K9896L0354
61037A023032K9526K9289L1038L3371L4240L3950L3952L4171L3761L3422L4537
61026A384289L6785L8812M0617M3095M5821M7335M7211M6051M4203M2376M2601
61015A859196M6399N2871O0604P0274Q2872R6665J08871J19532J31047J45137
$$ plain form
61098 1261528 1266697 1267053 1262456 1253413 1240131 1222506 1201005 1176584 1149692 1120246 1088666 1056090
61086 1056090 1023523 991454 960281 930380 901737 874220 848254 824614 803578 784864 768230
61075 768230 753570 740585 729008 718976 710610 703500 697196 691824 687583 684102 681105 679160 678850
61062 678850 679657 680722 682296 685294 689759 695026 701150 708852 718029 727597 736959 746609 757241 769258
61048 769258 783117 799163 817080 836441 857645 881329 907168 934336 962782 992678 1023032
61037 1023032 1052558 1081847 1112885 1146256 1180496 1214446 1248398 1282569 1316330 1349752 1384289
61026 1384289 1421074 1459886 1500503 1543598 1589419 1636754 1683965 1730016 1774219 1816595 1859196
61015 1859196 1905595 1958466 2019070 2089344 2172216 2268881 2377752 2497284 2628331 2773468
61005B773468J63607J90425K28745K76896L31882L95787M73680N67256O78521
60996F080267Q19290J008293J259253J582567J991245K466538K887335L021144
60988B1115932K657924J804153P37008j65882o64193p35571m73147J7660N91941
60979B4885825J001873R69481L84857n75914j557800k261401k587935k605117
60971A7653869k430989k161656j863355j579120j327194j106809r14416p51265
60963E519065o16959n05393m11084l34051k75279k31637j98135j71875j51132
60954B623520j33339j16662j01605q8942p7572o6071n4693m4261l4665k6150k0542
60943A859018j9262k1084k3426k5092k6367k7312k7577k7295k6910k6420k5866
$$ plain form
61005 2773468 2937075 3127500 3356245 3633141 3965023 4360810 4834490 5401746 6080267
60996 6080267 6899557 7907850 9167103 10749670 12740915 15207453 18094788 21115932
60988 21115932 23773856 25578009 26315017 26149135 25484942 24749371 24276224 24293884 24885825
60979 24885825 25887698 26857179 27242036 26666122 25108322 22846921 20258986 17653869
60971 17653869 15222880 13061224 11197869 9618749 8291555 7184746 6270330 5519065
60963 5519065 4902106 4396713 3985629 3651578 3376299 3144662 2946527 2774652 2623520
60954 2623520 2490181 2373519 2271914 2182972 2105400 2039329 1984636 1940375 1905710 1879560 1859018
60943 1859018 1839756 1818672 1795246 1770154 1743787 1716475 1688898 1661603 1634693 1608273 1582407
60932A582407k5895k6907k8130k8592k8440k8431k8723k9075k9603l0377l0784
60921A267450l0341k9576k9185k8849k7933k6741k5976k5431k4440k3203k2365
60910I73410k1553j9815j7400j5722j5314j5049j3825j1941j0393r584r193q695
60898H04926p734o501n825o314p416p967p644p132o904o751o615o869p441p533
60884G06280o727n654n113n138n366n713o179o484o430o278o366o684p077p522
60870F19549p954q153q049p764p262o330n138m283m095m222m122l620k843k048
60856E43666j510j170m38J004K297K114L56j659k855l266l097k059k48J300J738
60841E36173J311N55o55k516m503n995p046p792p793o765n383m431l702k684j693
$$ plain form
60932 1582407 1556512 1529605 1501475 1472883 1444443 1416012 1387289 1358214 1328611 1298234 1267450
60921 1267450 1237109 1207533 1178348 1149499 1121566 1094825 1068849 1043418 1018978 995775 973410
60910 973410 951857 932042 914642 898920 883606 868557 854732 842791 832398 822814 813621 804926
60898 804926 797192 790691 784866 778552 771136 763169 755525 748393 741489 734738 728123 721254 713813 706280
60884 706280 699553 693899 688786 683648 678282 672569 666390 659906 653476 647198 640832 634148 627071 619549
60870 619549 611595 603442 595393 587629 580367 574037 568899 564616 560521 556299 552177 548557 545714 543666
60856 543666 542156 540986 540548 541552 543849 545963 546319 544660 541805 538539 535442 533383 533135 534435 536173
60841 536173 537484 538039 537384 534868 530365 524370 517324 509532 501739 494974 489591 485160 481458 478774 477081
60826D77081j325j225n75M98J156J272J545K194K638K547K269K065J719J083L44
60811D93286l55r81j323j220j066j422k183k648k343j368j53N74L8j642l111l170
60795D70913k232j563j581j875k465l696n066n490m866m159l842l469k970l049
60781D24590l876m547m337l597k984k717k857l398l724k983j407k47q1j52K13
60766C87896P46J255K231L662M470M097L590M041M843M721L778L273L716M369
60752D36688M473M016L309K606K093J725J248P77R44J898K606J881j73k388l965
60737D57738n038o037p097q019q329p600o177n183n318n918n860n052m344m161
60723C73605l947l113j854q67o16j043j736k307k593k542j987r02K30P70P60P86
$$ plain form
60826 477081 475756 474531 473956 474454 475610 476882 478427 480621 483259 485806 488075 490140 491859 492942 493286
60811 493286 492931 491950 490627 489407 488341 486919 484736 482088 479745 478377 478224 478798 478836 477194 474083 470913
60795 470913 468681 467118 465537 463662 461197 457501 452435 446945 442079 437920 434078 430609 427639 424590
60781 424590 420714 416167 411830 408233 405249 402532 399675 396277 392553 389570 388163 387916 387835 387683 387896
60766 387896 388642 389897 392128 395790 400260 404357 407947 411988 416831 421552 425330 428603 432319 436688
60752 436688 441161 445177 448486 451092 453185 454910 456158 456935 457879 459777 462383 464264 464091 461703 457738
60737 457738 452700 446663 439566 431547 423218 415618 409441 404258 398940 393022 387162 382110 377766 373605
60723 373605 369658 366545 364691 363824 363208 362165 360429 358122 355529 352987 351000 350098 350328 351098 351858 352644
60707C52644J013R20L73P9N31J144J091M77J5k1J10K49N02R78J815L007L961L769
60689C72657K521J661K283L613M037L257K458K543L167L573L591L588L896M461
60675D17306M844M662M215M265M912N186M372L136K604K688K271Q11j107k816
60661D57349m265n544o417o612o104m994l527k226j573j468j346q79k40K92O24
60646D13070Q21J050J467J884J729O67r29k396l468m224m668m712m417l859l052
60631C88963k229j835j885j725q59L34J180J533J573J280P16L88O34J012R57O31
60615C90668M73L42o5l72j12J83l88j548k009j332n00m15p49p29k59K19M21L60
60597C84188J30j01j26N0K58N01J000J874K976M040M710M599L661K404J453R42
$$ plain form
60707 352644 353657 354577 354950 355029 355560 356704 357795 358272 358287 358266 358376 358625 359127 360105 361920 364927 368888 372657
60689 372657 375178 376839 379122 382735 386772 390029 392487 395030 398197 401770 405361 408949 412845 417306
60675 417306 422150 426812 431027 435292 440204 445390 449762 452898 455502 458190 460461 461272 460165 457349
60661 457349 453084 447540 441123 434511 428407 423413 419886 417660 416087 414619 413273 412394 412154 412446 413070
60646 413070 413891 414941 416408 418292 420021 420688 419759 417363 413895 409671 405003 400291 395874 392015 388963
60631 388963 386734 384899 383014 381289 380430 380764 381944 383477 385050 386330 387046 387434 388068 389080 390037 390668
60615 390668 391141 391483 391418 391046 390934 391117 390729 389181 387172 385840 385340 384925 384176 383447 383188 383407 383828 384188
60597 384188 384318 384217 384091 384141 384399 384900 385900 387774 390750 394790 399500 404099 407760 410164 411617 412559
60581D12559O34L26p4o25j066q48J31J150J532J497J645K036K463L170M485N992
60565D35007O930P338Q019R428J1231J2901J4135J4695J4446J3467J1691Q772
60553E68060M755N31l048n916q095q896p889o113n060m747m061k701j433m86Q17
60538E15718K683M498O105Q157J0802J3235J4998J6584J8273J9391J9256J7938
60526F67638J5563J1908P229K621j156m344p171r006r217q196o870n758n062n002
60512F43177n471n809n500m692l716k639j613r66n71K33J654L064M107N458P917
60497F34633J1367J5244J9455K4160K9077L3703L7970M2100M6038M9359N1451
60486I94557N1555M9066M4178L7820L0702K2844J4167M965m537j4357k4080l2685
$$ plain form
60581 412559 413193 413519 413445 412820 411754 410906 411037 412187 413719 415216 416861 418897 421360 424530 429015 435007
60565 435007 441937 449275 457294 466722 477953 490854 504989 519684 534130 547597 559288 568060
60553 568060 572815 573346 570298 564382 556287 547391 539502 533389 528329 523582 519521 516820 515387 514901 515718
60538 515718 518401 522899 529004 537161 547963 561198 576196 592780 611053 630444 649700 667638
60526 667638 683201 695109 702338 704959 703803 699459 692288 683282 674065 665869 658999 653241 648179 643177
60512 643177 637706 631897 626397 621705 617989 615350 613737 612771 612200 612433 614087 617151 621258 626716 634633
60497 634633 646000 661244 680699 704859 733936 767639 805609 847709 893747 943106 994557
60486 994557 1046112 1095178 1139356 1177176 1207878 1230722 1244889 1249854 1245317 1230960 1206880 1174195
60474A174195l9584m5201m9983n3390n4485n3110m9902m5527m0424l5036k9870
60463F77683k5433k2215k0297j8925j7149j5049j3545j2816j1879j0154q392p372
60451D94457o694n743m907m768m820m189l102k538k653k707k332j843j420q96
60437D45845l53j32j84k41m14r57j454j174k15M38J82o07j232j378j071n88m05
60420D36060o85q02m4J212J781J255N56N92J078J204Q93P69J119J463J286P62
60404D48499N35Q88J365J421J150J091J317J336R76P91J192J708J725J448J461
60389D66903J659J551J386J999L366M348M210L609L470L636L380K808K785L498
60375E08608L988L393K132J362J547K078K254K102K080K296K376K035J431R55
$$ plain form
60474 1174195 1134611 1089410 1039427 986037 931552 878442 828540 783013 742589 707553 677683
60463 677683 652250 630035 609738 590813 573664 558615 545070 532254 520375 510221 501829 494457
60451 494457 487763 482020 477113 472345 467525 463336 460234 457696 455043 452336 450004 448161 446741 445845
60437 445845 445492 445360 445176 444935 444521 443564 442110 440936 440721 441159 441341 440734 439502 438124 437053 436465 436060
60420 436060 435375 434573 434529 435741 437522 438777 439333 439925 441003 442207 443100 443869 444988 446451 447737 448499
60404 448499 449034 449922 451287 452708 453858 454949 456266 457602 458578 459369 460561 462269 463994 465442 466903
60389 466903 468562 470113 471499 473498 476864 481212 485422 489031 492501 496137 499517 502325 505110 508608
60375 508608 512596 515989 518121 519483 521030 523108 525362 527464 529544 531840 534216 536251 537682 538637
60361E38637Q47J057J320J393J344J564K275L136L558L445L312L653M526N740
60347E75807P161Q625R885J0837J1566J1997J1689J0133P228L413n38l891o344
60334F57568q071r311j0017j0128r971r879r566q433o559m853m086m177m565m740
60320E53212m391l562k913l166m022m209l014j184J60R39J807K947L950M743N811
60305E47108P428R341J1363J3787J6883K0353K3598K6217K7869K7742K4792J8872
60293G75353J1347L993k716r673j7197k3772k7277k7145k4624k1222j7692j4374
60281F05001j1617r535p993o931o276n608m607l811m057n099n685n246m557m334
60267E19645m183l592l003l067l435l276k589k085j986j780j203o99p24r95q05
$$ plain form
60361 538637 539484 540541 541861 543254 544598 546162 548437 551573 555131 558576 561888 565541 570067 575807
60347 575807 582968 591593 601478 612315 623881 635878 647567 657700 664928 668341 667803 663912 657568
60334 657568 649497 640186 630169 620041 610070 600191 590625 582192 575633 570780 566694 562517 557952 553212
60320 553212 548821 545259 542346 539180 535158 530949 527935 526751 526911 527850 529657 532604 536554 541297 547108
60305 547108 554536 563877 575240 589027 605910 626263 649861 676078 703947 731689 756481 775353
60293 775353 786700 790693 787977 778304 761107 737335 710058 682913 658289 637067 619375 605001
60281 605001 593384 583849 575856 568925 562649 557041 552434 548623 544566 539467 533782 528536 523979 519645
60267 519645 515462 511870 508867 505800 502365 499089 496500 494415 492429 490649 489446 488747 488023 487028 486223
60252D86223R9J103J353Q07L77P68J484J571J054Q17J132J239O19k41p39r56j111
60235D95599r94m98q0o0j00K00P57J488K672M202N208N146M630M499M583M228
60219E31480L478K934K786K884L374M485N804O586O723O774P149P767Q413Q962
60205F09599R298R347R104Q442P295O128N646N786N649M789L798L164K442J208
60191F91695L4m25n96j268k320l139l773m594n270n227m823m909n402n391m655
60176F39937l992m063m739n610o230n955m453k457j153p85o14k73k05o70j164
60161E97574j181q39n22m10m88o00m52k5J85r9k43N26J821K430K029J573J903
60144F03182K703L197L154K898K823L203M034M824M942M332L577L211L324L775
$$ plain form
60252 486223 486322 487425 488778 489585 489962 490730 492214 493785 494839 495656 496788 498027 498646 498405 497666 496710 495599
60235 495599 494605 494107 494027 493967 493867 494067 494824 496312 498984 503186 508394 513540 518170 522669 527252 531480
60219 531480 534958 537892 540678 543562 546936 551421 557225 563811 570534 577308 584457 592224 600637 609599
60205 609599 618897 628244 637348 645790 653085 659213 664859 670645 676294 681083 684881 688045 690487 691695
60191 691695 691729 691304 690708 689440 687120 683981 680208 675614 670344 665117 660294 655385 649983 644592 639937
60176 639937 635945 631882 627143 621533 615303 609348 604895 602438 601285 600500 599886 599613 599408 598738 597574
60161 597574 596393 595554 595032 594622 594134 593534 593082 593057 593242 593143 592900 593426 595247 597677 599706 601279 603182
60144 603182 605885 609082 612236 615134 617957 621160 625194 630018 634960 639292 642869 646080 649404 653179
60130F53179M398M958N280N368N150M326K945J751J406J568J422R37Q43J422K144
60115F97097K521K642K650K404J875J345R60N35j28j060k247l501m330m431m271
60100F92061m564n195n308m566l664l345l435l196k317j199m24j30O3N95J452
60085F56828K261K830L243L444L247K870K852L101K710J218o53k092l344n070
60071F73445p094q677r513r682r082p843o934p290q543r365q934p360n146l030
60057E64952j987k368l294l703l609l473k969j586P7R57J218J898L053L786M038
60042E56990M866O662Q413R095Q620P263N372L822L428L549K617L76j608k197
60028F17268k125k650l857n099o069o708o897o865p226q000q376p857o949o220
$$ plain form
60130 653179 657577 662535 667815 673183 678333 682659 685604 687355 688761 690329 691751 692688 693531 694953 697097
60115 697097 699618 702260 704910 707314 709189 710534 711494 712029 711901 710841 708594 705093 700763 696332 692061
60100 692061 687497 682302 676994 672428 668764 665419 661984 658788 656471 655272 654848 654718 654781 655376 656828
60085 656828 659089 661919 665162 668606 671853 674723 677575 680676 683386 684604 683951 681859 678515 673445
60071 673445 666351 657674 648161 638479 629397 621554 614620 607330 598787 589422 580488 573128 567982 564952
60057 564952 562965 560597 557303 553600 549991 546518 543549 541963 542040 542997 544215 546113 549166 552952 556990
60042 556990 561856 568518 576931 586026 594646 601909 607281 611103 614531 618080 620697 621073 619465 617268
60028 617268 615143 612493 608636 603537 597468 590760 583863 576998 569772 561772 553396 545539 538590 532370
60014E32370n544m776m334m515m913n077n090n083m878m455m139l827k912j357
60000D71470j8O34J222K241L046K853K030J525J511J468J275J326J839K625L497
59985D98544M366N030N249M973M296L370K371J296k04k329m460n552n320m552
59971E07078m170m455n159n758n520m134k310j102o12r7O86J212J354J666K262
59956D80941K431J822J060P28O01L44J52J93K69L85Q87J675K116K059J993J885
59940D99541J009n63j555j270o34o48r10o66k78l93m98L94K105L525M147M353
59924E07659M414M207L829L668L906M466N279O129O581O538O486O687O607N676
59910E82132M126K497Q40r33k382k999k979k793k408j651j072j522k881l924l597
$$ plain form
60014 532370 526826 522050 517716 513201 508288 503211 498121 493038 488160 483705 479566 475739 472827 471470
60000 471470 471452 472086 473308 475549 478595 481448 483478 485003 486514 487982 489257 490583 492422 495047 498544
59985 498544 502910 507940 513189 518162 522458 525828 528199 529495 529291 526962 522502 516950 511630 507078
59971 507078 502908 498453 493294 487536 482016 477882 475572 474470 473858 473761 474447 475659 477013 478679 480941
59956 480941 483372 485194 486254 486982 487583 487927 488079 488272 488541 488926 489813 491488 493604 495663 497656 499541
59940 499541 500550 499987 498432 497162 496528 495880 494970 494304 494026 493633 493135 493529 495634 499159 503306 507659
59924 507659 512073 516280 520109 523777 527683 532149 537428 543557 550138 556676 563162 569849 576456 582132
59910 582132 586258 588755 589595 588662 586280 583281 580302 577509 575101 573450 572378 570856 567975 564051 560454
59895E60454k026k22R04J274J547K264L123L495L571M310N989P575Q010P509P029
59880F14806O911O709O096N361N059N429O127O421N854M628L080J083j511m051
59866F72002n633o349o998p615p408o330n503n576n841n490m743m078l387k545
59852E94506j932j678j179n6J169K008K808M087N816P921J0574J3335J4864J4238
59838F66481J1780Q166L755n19k849k238L10L131N531P292P623N861K500j416
59824G15408n277q545j0370j0615j0394j0564j0506r440p916o822n829m229k516
59811F12385j697j674j721j986l029m378n006m909m831m726l912k555j624j461
59797E68876j557j650j890k089j932j845k486l516l879l280k395j763j390j238
$$ plain form
59895 560454 558428 558206 559110 560384 561931 564195 567318 570813 574384 578694 584683 592258 600268 607777 614806
59880 614806 621717 628426 634522 639883 644942 650371 656498 662919 668773 673401 676481 677564 676053 672002
59866 672002 666369 660020 653022 645407 637999 631669 626166 620590 614749 609259 604516 600438 597051 594506
59852 594506 592574 590896 589717 589661 590830 592838 595646 599733 605549 613470 624044 637379 652243 666481
59838 666481 678261 686427 690182 689663 686814 684576 684886 688017 693548 700840 708463 714324 716824 715408
59824 715408 710131 701586 691216 680601 670207 659643 649137 639697 631781 624959 619130 614901 612385
59811 612385 610688 609014 607293 605307 602278 597900 592894 587985 583154 578428 574516 571961 570337 568876
59797 568876 567319 565669 563779 561690 559758 557913 555427 551911 548032 544752 542357 540594 539204 537966
59783E37966j232r85l72n9n39j170j043l54J99P43J749K691K664J963J690J960
59767E45871J883J174M67J55J69P74K185L571L779L031K588K797K885K569K444
59752E76342K659K745K883L791N062N194L824K500K534L359L739L506L286L266
59738F24690L121K618J722N32o04j249j337j058l71O60J325R82K06K59J267K035
59722F34798J829J309J309J668J741J347P54K51Q9L30O14N08J29p7n2o4l1L74
59704F46826J050J634K157K797L240L085K656K502K344J637Q44R54J819K312K108
59689F77965J985K177J833N08j057k072k596k846k677k195j953k066k060j932
59675F63014k410l714n044n759o245p001p670p589o737n626m731m288m221m058
$$ plain form
59783 537966 536734 535749 535377 535318 534779 533609 532566 532212 532411 533154 534903 537594 540258 542221 543911 545871
59767 545871 547754 548928 549395 549550 549719 550493 552678 556249 560028 563059 565647 568444 571329 573898 576342
59752 576342 579001 581746 584629 588420 593482 598676 602500 605000 607534 610893 614632 618138 621424 624690
59738 624690 627811 630429 632151 632683 632079 630830 629493 628435 628064 628724 630049 631031 631237 631496 632763 634798
59722 634798 636627 637936 639245 640913 642654 644001 644755 645006 645095 645425 646039 646547 646676 646599 646547 646483 646452 646826
59704 646826 647876 649510 651667 654464 657704 660789 663445 665947 668291 669928 670772 671726 673545 675857 677965
59689 677965 679950 682127 683960 684468 683411 681339 678743 675897 673220 671025 669072 667006 664946 663014
59675 663014 660604 656890 651846 646087 639842 632841 625171 617582 610845 605219 600488 596200 591979 587921
59661E87921l388k493j884j354k54J281K317K511K538K934L401L622L839M211
59647F05202M304L633K219L41j711l510m694n374n798n787n134m343m063m015
59633E71270l448k490j900j626r48l4O2q31j645j901k409l640m709m730m023l210
59617E33788k154o80N54P82R7r22j937k640k529j548k95Q55K169L614M344L771
59601E37269K551J760J544J191K56r79j879j963j217j43O91J147J337J208P73
59586E43546M52N16M73k49j264j763j843k196k743k788k442k537l047l023k311
59571E18781j923k243k314j479m97k20k68J24P66Q52J29q80j462j212l93J60n5
59554E07866m77l06K75N38O05J221K389L461M253M822M506K864J271J653L749
$$ plain form
59661 587921 584533 582040 580156 578802 578548 579829 582146 584657 587195 590129 593530 597152 600991 605202
59647 605202 609506 613139 615358 615699 613988 610478 605784 600410 594612 588825 583691 579348 575285 571270
59633 571270 567822 565332 563432 561806 560858 560824 560886 560055 558410 556509 554100 550460 545751 541021 536998 533788
59617 533788 531634 530954 531508 532290 532387 531465 529528 526888 524359 522811 522516 523371 525540 529154 533498 537269
59601 537269 539820 541580 543124 544315 544571 543592 541713 539750 538533 538390 539081 540228 541565 542773 543546
59586 543546 543998 544514 544987 544738 543474 541711 539868 537672 534929 532141 529699 527162 524115 521092 518781
59571 518781 516858 514615 512301 510822 510325 510105 509837 509961 510727 511579 511708 510828 509366 508154 507761 507921 507866
59554 507866 507389 507083 507358 507896 508501 509722 512111 515572 519825 524647 529153 532017 533288 534941 538690
59539E38690N627O908R102J2598J6036J9256K3775K8797K9625K2651J0261j390
59527G21936q262j0338r283o656l819j415J005L568N000M258K411J292Q59m37
59513G00119l173o380r192j1501j3051j3364j2700j2045j1885j1752j0994r465
59501E74617p516n798m828m415l849k959k351k299k271k015k084k633k686j517
59487E27396J09J034J301J686K333K812K988K982K804K685L200M366N289N417
59473E66402N362N832O528O865O860O555N475L599J974J395J277P62J05J8M40
59458F19449J051K224M278O531Q083R064J0087J1034J1285J0708R649Q466P609
59445G19518P388P192N842L255N99j720m748q775j2079j3096j2463j1550j0385
$$ plain form
59539 538690 544317 551225 560327 572925 588961 608217 631992 660789 690414 713065 723326 721936
59527 721936 713674 703336 694053 687397 683578 682163 683168 686736 691736 695994 698405 699697 700556 700119
59513 700119 696946 690566 681374 669873 656822 643458 630758 618713 606828 595076 584082 574617
59501 574617 567101 561303 556475 552060 548211 545252 542901 540602 538331 536316 534232 531599 528913 527396
59487 527396 527505 528539 529840 531526 533859 536671 539659 542641 545445 548130 551330 555696 560985 566402
59473 566402 571764 577596 584124 590989 597849 604404 609879 613478 615452 616847 618124 618886 618991 619009 619449
59458 619449 620500 622724 627002 633533 641616 650680 660767 671801 683086 693794 703443 711909 719518
59445 719518 726906 734098 739940 743195 743794 742074 737326 728551 716472 703376 690913 679363 668978
59432F68978q549o761n866n269m075k703j795o45J485L652M677N313O970R288
59418F64700J1068J2660J5134J7858J9312J9687K0357K1440K2473K4805K9746
59407H79240L4190L1618J9088Q87j5802k6796l1587l0893k5905j8467r799M13
59395H06187J1919K1198K2720J3738k451j8440k8099l0424k8513k5448k1948j7741
59383G02698j3470j0057p292m526k141q70j82J058K680L500L321L125L331L409
59369F84584L250L429L947M117L845L762L933L762L305L316L834M079M000M499
59355G37662N804O968P406P704Q446R454J0644J2464J4865J6852J7679J7746J7886
59342H91580J8428J9190J9606J8726J5983J2132Q571N552K041k430o897j0249
$$ plain form
59432 668978 660429 653668 647802 642533 638458 635755 633960 633315 634800 638452 643129 648442 655412 664700
59418 664700 675768 688428 703562 721420 740732 760419 780776 802216 824689 849494 879240
59407 879240 913430 945048 964136 965023 949221 922425 890838 859945 834040 815573 805774 806187
59395 806187 818106 839304 862024 875762 873311 854871 826772 796348 767835 742387 720439 702698
59383 702698 689228 679171 671879 667353 665212 664342 664160 665218 667898 671398 674719 677844 681175 684584
59369 684584 687834 691263 695210 699327 703172 706934 710867 714629 717934 721250 725084 729163 733163 737662
59355 737662 743466 750434 757840 765544 773990 783444 794088 806552 821417 838269 855948 873694 891580
59342 891580 910008 929198 948804 967530 983513 995645 1004216 1009768 1011809 1009379 1002482 992233
59330I92233j2479j4240j5893j7411j8583j9036j8591j7657j6771j5776j4207
59319H11589j2311j0857j0021r311q513p792p031o042n332n592o465o894o666
59306G08762o487o543o221n336m432l679k597j083L85J781L668O204R101J2689
59292G06212J7493K2208K3477J8722Q667l290j3521j9797k1732k0568j8112j5325
59280F84434j2098q396m849k065M3J996M316P269J0491J2950J3974J4194J4745
59267G37004J5688J6025J5187J3561J1611R361O810M063J077k068m873p059r162
59254H07225j1571j3478j3856j3004j1911j0551q306n756m304m052l667k566j539
59241G02664r39J17K185M524O338P780R074R808R690R134Q528P733O638N376L788
$$ plain form
59330 992233 979754 965514 949621 932210 913627 894591 876000 858343 841572 825796 811589
59319 811589 799278 788421 778400 769089 760576 752784 745753 739711 734379 728787 722322 715428 708762
59306 708762 702275 695732 689511 684175 679743 676064 673467 672384 672769 674550 678218 684422 693523 706212
59292 706212 723705 745913 769390 788112 796779 793489 779968 760171 738439 717871 699759 684434
59280 684434 672336 663940 659091 657026 657069 659065 663381 670650 681141 694091 708065 722259 737004
59267 737004 752692 768717 783904 797465 809076 818437 825247 829310 830387 828319 823446 816387 807225
59254 807225 795654 782176 768320 755316 743405 732854 724548 718792 714488 710436 706769 704203 702664
59241 702664 701725 701842 704027 708551 714889 722669 731743 741551 751241 760375 768903 776636 783274 788650 792438
59226G92438J575q50k620l666m757o128p142p475p534p481o964o075n547n617
59212G22157n748n652n689n946n993n761n694n860n786n357m967m720m375m061
59198F46548l992l654k477j115p35j115r09J59R45Q73P04J028J469J819K512L529
59182F45589M120M054L941M055M035L964M416N166N288M774M739N682O862P693
59168G14378Q379R069R727J0875J2847J4357J3621J1036Q723P269N141J773j246
59155H25949k924m495p056r730j1509j3023j4896j6028j5268j3443j2171j1667
59143F93739j1124j0332r630r054q636q737r285r477q954q200p296n660l596k543
59129E81215k881l053j899l34M40Q27J650K485K745L146M568O387P382P579P873
$$ plain form
59226 792438 794013 793163 790543 786877 782120 775992 768850 761375 753841 746360 739396 733321 727774 722157
59212 722157 716409 710757 705068 699122 693129 687368 681674 675814 670028 664671 659704 654984 650609 646548
59198 646548 642556 638902 636425 635310 634575 633460 632551 632710 633655 634528 635232 636260 637729 639548 642060 645589
59182 645589 649709 653763 657704 661759 665794 669758 674174 679340 684628 689402 694141 699823 706685 714378
59168 714378 722757 731826 741553 752428 765275 779632 793253 804289 813012 820281 825422 827195 825949
59155 825949 823025 818530 811474 801744 790235 777212 762316 746288 731020 717577 705406 693739
59143 693739 682615 672283 662653 653599 644963 636226 626941 617464 608510 600310 593014 587354 583758 581215
59129 581215 578334 575281 573382 573048 573488 574315 575965 578450 581195 584341 588909 595296 602678 610257 618130
59114F18130Q589R525J0736J2179J3219J3408J3057J2398J1170R612Q717Q660
59102G49400Q217O610M686L326K112O14l79l23l04j527l359m345m224l659k858
59087G53987j739p88n09o33q00j337k491l819n073o708q607r557q957p869p324
59072F87776o828n677m479m095m255m523n346o784p436o238m314l395l387l079
59058F17940k376k168k572k917k989k941k532j658j095j496k260k448k054j429
59044E87005m04Q74J304L09r53j209r81j438k307k415j599n55N36J778K606K489
59028E85040K063K314L161M058N299P364R625J1034J1601J2114J2803J3334J3509
59015F93319J3022J1253Q236N096K671N88j474k882l276l370l459k578m36J425
$$ plain form
59114 618130 626719 636244 646980 659159 672378 685786 698843 711241 722411 732023 740740 749400
59102 749400 757617 764227 768913 772239 774351 774965 774586 774263 773959 772432 769073 764728 760504 756845 753987
59087 753987 752248 751460 750951 750318 749518 748181 745690 741871 736798 730090 721483 711926 702969 695100 687776
59072 687776 680948 675271 670792 666697 662442 657919 652573 645789 638353 632115 627801 624406 621019 617940
59058 617940 615564 613396 610824 607907 604918 601977 599445 597787 596692 595196 592936 590488 588434 587005
59044 587005 586601 587475 588779 589088 588135 586926 585945 584507 582200 579785 578186 577631 578167 579945 582551 585040
59028 585040 587103 589417 592578 596636 601935 609299 618924 629958 641559 653673 666476 679810 693319
59015 693319 706341 717594 725830 730926 733597 734185 732711 729829 726553 723183 719724 717146 716710 718135
59001G18135J953K496M556P016P790P107O897P657Q136P658O782N896M840L673
58987H00592K457P11j724l967n353o468p700p969o427m171k586j185J008L224
58973G60442M197M526N645P352Q597R771J1814J3877J4363J3707J3652J4239J4042
58960H96224J3025J2539J2626J1753R395O528L468n66n477r963j3494j6698j9512
58947H99848k0871k0529j9585j8861j8247j7653j7108j5923j3356j0070p425n556
58935G14664l690k034j520j857j719q64l13m05m93n56j293k520l166l013k867
58920F88354k952k744k340k384k608k087r52k57j28L41J361K201K621L032L337
58905F84795L167L195M520O816Q700R887J1447J3875J6479J8600J9974K0065J8667
$$ plain form
59001 718135 720088 722584 727140 734156 741946 749053 755950 763607 771743 779401 786183 792079 796919 800592
58987 800592 803049 803760 802036 798069 792716 786248 778548 770579 764152 759981 757395 756210 757218 760442
58973 760442 764639 769165 774810 782162 790759 800530 812344 826221 840584 854291 867943 882182 896224
58960 896224 909249 921788 934414 946167 955562 962090 965558 964992 959515 949552 936058 919360 899848
58947 899848 878977 858448 838863 820002 801755 784102 766994 751071 737715 727645 720220 714664
58935 714664 710974 708940 707420 705563 703844 702980 702667 702262 701769 701213 699920 697400 694234 691221 688354
58920 688354 685402 682658 680318 677934 675326 673239 672287 672030 671902 672243 673604 675805 678426 681458 684795
58905 684795 687962 691157 695677 702493 711193 721080 732527 746402 762881 781481 801455 821520 840187
58892H40187J6992J6558J7208J7743J8221J9807K2604K5420K7517K8791K8466
58881A079514K5567K0751J5911J1875Q071M141K00m323j0093j6203k0859k3713
58869A090839k5728k6951k6317k3720k0470j7590j5233j3549j2593j1610j0096
58858H86982r101r787j1266j1819j1594j1938j2671j2434j1342j0732j0540r437
58846G54321p542o489o728p091p053p153p313p001o915q050r284q583o377n028
58832F53714n007m537l170k573l308l829l302k663k167p12J658L236L469L794
58818F34603M876N535N138M647M532M064L331L528M525M597L251J882J153K27
58804F85889q54q55Qj24j560k561k658l414n008n416m215l885n648p218o601n206
$$ plain form
58892 840187 857179 873737 890945 908688 926909 946716 969320 994740 1022257 1051048 1079514
58881 1079514 1105081 1125832 1141743 1153618 1161689 1165830 1166030 1161707 1151614 1135411 1114552 1090839
58869 1090839 1065111 1038160 1011843 988123 967653 950063 934830 921281 908688 897078 886982
58858 886982 877881 868094 856828 845009 833415 821477 808806 796372 785030 774298 763758 754321
58846 754321 746779 740290 733562 726471 719418 712265 704952 697951 691036 682986 673702 665119 658742 653714
58832 653714 648707 644170 641000 638427 635119 631290 627988 625325 623158 622446 624104 627340 630809 634603
58818 634603 639479 645014 650152 654799 659331 663395 666726 670254 674779 679376 682627 684509 685662 685889
58804 685889 685035 684180 684188 684064 682504 679943 677285 673871 668863 663447 659232 655347 649699 642481 635880 630674
58788F30674n045n403m575k758j062M50J915K674K759L534N325O386N682M671
58774F45227M740M931L881K061L65j654m341o505p168p194p686q249q222q004
58760F02182p806o785m752l063k457j761p8J584K232K573L321L568K522J293J303
58745E93876K269L153L884M878N963O861P641Q098P918P690Q151Q464P264N486
58731F81596N557P498Q767Q375Q062Q595Q336O694N537N571M738K139K42J002
58717G62709K781L552M154N869P490P663P641Q823R701Q126M868K145K79j707
58703H34094l723n301p249j0386j3861j6622j9000k1153k1823k0528j9095j8966
58691F56387j8840j7020j4195j1865r852p549n792n303n019m040l475m352n506
$$ plain form
58788 630674 625629 620226 615651 612893 611831 612281 614196 616870 619629 623163 628488 634874 640556 645227
58774 645227 649967 654898 658779 660840 661205 659551 655210 648705 641537 634343 626657 618408 610186 602182
58760 602182 594376 587591 582839 579776 577319 575558 575480 577064 579296 581869 585190 588758 591280 592573 593876
58745 593876 596145 599298 603182 608060 614023 620884 628525 636623 644541 652231 660382 668846 676110 681596
58731 681596 687153 694651 703418 711793 719855 728450 736786 743480 749017 754588 759326 761465 761707 762709
58717 762709 765490 769042 773196 779065 786555 794218 801859 810682 820383 828509 833377 835522 835801 834094
58703 834094 830371 825070 817821 807435 793574 776952 757952 736799 714976 694448 675353 656387
58691 656387 637547 620527 606332 594467 584615 577066 571274 565971 560952 556912 553437 549085 543579
58678E43579n495m810m288l340j715p76j043o43J546L595L721L436M862P206Q684
58663E54519R856J2130J4644J5537J4747J3014R811M833j55l436n670p798q740
58650F23292p683o561p329q794q859q016p644o913m619k210j743k337j844n00
58636E48240J62N18J788L233L497L426M438N488M788L105K338K147J098k34l89
58621E83643J1m93j236o49Q53K074L573O076Q023P948P533Q969J0844J0271P550
58606F54990N071L060K87k294k698j773j969l091l138k526l471n635o347m977
58592F25489l456k619j450J23J073J817L771O535Q397R364J0849J2760J3733J3715
58578G00101J3639J3185J1576R740Q903Q082N921L794L982N943P607R106J1798
$$ plain form
58678 543579 538084 533274 528986 525646 523931 523155 522112 521469 523015 526610 530331 533767 538629 545835 554519
58663 554519 564375 576505 591149 606686 621433 634447 644258 649091 648936 645500 639830 632032 623292
58650 623292 615609 609048 601719 592925 584066 576050 568406 561493 556874 554664 552921 550584 548740 548240
58636 548240 548402 548920 550708 553941 557438 560864 565302 570790 575578 578683 581021 583168 584266 584032 583643
58621 583643 583654 583161 581925 581276 582129 584203 587776 593852 601875 609823 617356 626325 637169 647440 654990
58606 654990 660061 663121 663408 661114 658416 656643 654674 651583 648445 645919 642448 636813 630466 625489
58592 625489 622033 619414 617964 618087 619160 620977 624748 631283 639680 649044 659893 672653 686386 700101
58578 700101 713740 726925 738501 748241 757144 765226 771147 774941 778923 784866 792473 801579 813377
58565H13377J4883J6684J8281K1986K7115L0981L3225L5279L6439L4469K9644
58554A112363K4239J8502J1009K570m071q177j1063j2637j1681r136p391o655
58542A097872n629n142p308j1573j5408j8486k2263k5991k7277k6303k5461k4961
58530H82070k2813j9013j5724j3350j0349o808m487l364j863k05K61M82K426M874
58516G92137M752K217K45m71j814l745m190l363l712n327n833m875m438m642l604
58501G53337j591q73j395j020l0p95k965l678k691k491l233k482k42Q06N03J588
58485G32748M319N816N498O099Q452J0375J1539J4366J8885K1819K1980K1717
58473H83613K1765J9592J4289Q313L022k849q975j2567j3177j3713j5241j5336
$$ plain form
58565 813377 828260 844944 863225 885211 912326 943307 976532 1011811 1048250 1082719 1112363
58554 1112363 1136602 1155104 1166113 1168683 1164612 1156435 1145372 1132735 1121054 1111918 1104527 1097872
58542 1097872 1092243 1087101 1079793 1068220 1052812 1034326 1012063 986072 958795 932492 907031 882070
58530 882070 859257 840244 824520 811170 800821 794013 789526 786162 784299 784094 784355 784837 787263 792137
58516 792137 796889 799106 799351 798880 797066 793321 789131 785768 782056 776729 770896 766021 761583 756941 753337
58501 753337 751746 750873 749478 748458 748428 747633 744668 740990 738299 735808 732575 730093 729851 730657 731160 732748
58485 732748 737067 742883 748381 754480 762932 773307 784846 799212 818097 839916 861896 883613
58473 883613 905378 924970 939259 947572 950594 947745 938770 926203 913026 899313 884072 868736
58461H68736j2943j0185p944m420M02L682M669O213R690J2943J4619J6002J7073
58448I18537J5508J1073O494K523l049j0067j4737j5392j4729j4566j3207r881
58436H58507o974n707m090j100J355K285L208M522M707M301N963R512J1767J2278
58422I00534J3919J6732J6906J3373R678P555M471n91m717o569q528j1208j1633
58409I39922r251p974r691j1351j0918j0572j1420j0886q054o059o350o008l394
58396H27994r66j6J728M757N934M481L863N177M887J829l6J151J760k46j391O01
58380H61507K606K274K031L283L035J94j129J372M096M355M879P500Q964P423
58366I12390O710R534J2559J2813J2849J5037J6862J6461J6618J8762J9175J5768
$$ plain form
58461 868736 855793 845608 837664 833244 833646 837328 841997 848210 857900 870843 885462 901464 918537
58448 918537 934045 945118 951612 954135 951086 941019 926282 910890 896161 881595 868388 858507
58436 858507 851533 845826 841736 840636 841991 844276 847484 852006 856713 861014 866977 876489 888256 900534
58422 900534 914453 931185 948091 961464 971142 978697 983168 982577 977860 971291 962763 951555 939922
58409 939922 930671 922697 913006 901655 890737 880165 868745 857859 849805 843746 837396 831388 827994
58396 827994 827028 827012 828740 833497 839431 843912 847775 852952 857839 859668 859632 860783 862543 862297 860906 861507
58380 861507 864113 866387 868418 871701 874736 874930 873801 875173 879269 883624 888503 896003 904967 912390
58366 912390 919100 928634 941193 954006 966855 981892 998754 1015215 1031833 1050595 1069770 1085538
58354A085538J2331J1491J0005N631K036J908J879o26k181j74J949J494J707M875
58340A137863P181O071N697R232J2761J2799J2847J6229J9435J9048J8362K0546
58328A298071K2088J9629J6485J5755J3938Q160K753J675J433j454l188k28L210
58315A398327K807K148N379Q984Q755P893J0217J2359J0829R703J3004J6575J5862
58302A522842J4578J7095J9629J7762J5407J7250J9608J7834J5524J7154J9048
58291A713731J6992J5250J8485K2358K1811K0887K4422K8067K6793K5114K8291
58280A962201L1719K9947K7866L1634L6780L6900L5696L8776M2019M0240L8635
58269B352413M3212M8645M8281M7128N1910N7609N7475N6887O3033P0336P0720
$$ plain form
58354 1085538 1097869 1109360 1119365 1124996 1127032 1128940 1130819 1130193 1128012 1127838 1129787 1131281 1132988 1137863
58340 1137863 1145044 1151115 1156812 1166044 1178805 1191604 1204451 1220680 1240115 1259163 1277525 1298071
58328 1298071 1320159 1339788 1356273 1372028 1385966 1394126 1396879 1398554 1399987 1398533 1395345 1395117 1398327
58315 1398327 1401134 1403282 1408661 1417645 1426400 1434293 1444510 1456869 1467698 1477401 1490405 1506980 1522842
58302 1522842 1537420 1554515 1574144 1591906 1607313 1624563 1644171 1662005 1677529 1694683 1713731
58291 1713731 1730723 1745973 1764458 1786816 1808627 1829514 1853936 1882003 1908796 1933910 1962201
58280 1962201 1993920 2023867 2051733 2083367 2120147 2157047 2192743 2231519 2273538 2313778 2352413
58269 2352413 2395625 2444270 2492551 2539679 2591589 2649198 2706673 2763560 2826593 2896929 2967649
58258B967649O8884P2328P5941P2085O6272O6853O9000O5276O1938O7731P6649
58247C730606P9259Q0663Q9309R9053J01059J02267J12444J24414J27480J28718
58237D775272J39665J53897J60022J64601J78993J96022K03959K10846K29643
58228F412920K52434K65597K76911L00138L27098L44072L60839L92823M30114
58219I362946M56741M84190N31090N86828O32363O79325P48933Q30841R05398
58210A5218655R87138J100614J233747J364402J511638J708018J945286K205698
58202B7275196K521415K938924L452151M040291M739062N596586O599055P735469
58194F4898149R097533J0816263J2961473J5639936J9130160K3755488K9680432
$$ plain form
58258 2967649 3036533 3108861 3184802 3256887 3323159 3390012 3459012 3524288 3586226 3653957 3730606
58247 3730606 3809865 3890528 3979837 4078890 4179949 4282216 4394660 4519074 4646554 4775272
58237 4775272 4914937 5068834 5228856 5393457 5572450 5768472 5972431 6183277 6412920
58228 6412920 6665354 6930951 7207862 7508000 7835098 8179170 8540009 8932832 9362946
58219 9362946 9819687 10303877 10834967 11421795 12054158 12733483 13482416 14313257 15218655
58210 15218655 16205793 17306407 18540154 19904556 21416194 23124212 25069498 27275196
58202 27275196 29796611 32735535 36187686 40227977 44967039 50563625 57162680 64898149
58194 64898149 73995682 84811945 97773418 113413354 132543514 156299002 185979434
58187A85979434L6925261M5164466N2773505N6067829N0642523L4759318J1680785
58180D73993121j1862765k9880153m0030378m3199138m1458472l6888751l1483243
58173B39190221k6915343k3912737k2102100k0650702j8994155j7022641j4878286
58166I4714257j2761436j0834597r165395p737829o524879n517369m688729l991170
58158C3492853l399734k916165k525235k190929j898481j658240j465975j298644
58150A6139450j149876j031431r39037q52953p71964p11511o68368o21143n65851
58141H827316n18275m80883m39266l92164l54300l27551k98055k63933k38853
58132E514036k26246k15442k04561k02186k05147j99123j83184j70775j65022
$$ plain form
58187 185979434 222904695 268069161 320842666 376910495 427553018 462312336 473993121
58180 473993121 462130356 432250203 392219825 349020687 307562215 270673464 239190221
58173 239190221 212274878 188362141 166260041 145609339 126615184 109592543 94714257
58166 94714257 81952821 71118224 61952829 54215000 47690121 42172752 37484023 33492853
58158 33492853 30093119 27176954 24651719 22460790 20562309 18904069 17438094 16139450
58150 16139450 14989574 13958143 13019106 12166153 11394189 10682678 10014310 9393167 8827316
58141 8827316 8309041 7828158 7388892 6996728 6642428 6314877 6016822 5752889 5514036
58132 5514036 5287790 5072348 4867787 4665601 4460454 4261331 4078147 3907372 3742350
58123C742350j55429j40204j29609j25300j17686j05734r8987r8126r3279q3472
58113B594524p8458p9493p7116o9825o6512o8399o6571n9589n6021n7347n5408
58102A859785m9039m6527m9146m8667m3594m1850m4798m4354l8790l5931l7698
58091A379391l6388k9660k4742k4422k2725j7839j5813j8004j7938j4068j2986
58080A144806j6741j9152j7952j8512k2466k4334k2539k2345k4900k4705k0716
58069I10444j8821k0495k0094j6163j4341j6169j5979j1946r435j0289r503n667
58057G41542m287p244r193p796p661j0677j2201j0350r597j1626j1884q630o371
58044F24025p015o496l388k070m094n172l818m174p192p911m809l029m897o040
$$ plain form
58123 3742350 3586921 3446717 3317108 3191808 3074122 2968388 2869401 2771275 2677996 2594524
58113 2594524 2516066 2436573 2359457 2289632 2223120 2154721 2088150 2028561 1972540 1915193 1859785
58102 1859785 1810746 1764219 1715073 1666406 1622812 1580962 1536164 1491810 1453020 1417089 1379391
58091 1379391 1343003 1313343 1288601 1264179 1241454 1223615 1207802 1189798 1171860 1157792 1144806
58080 1144806 1128065 1108913 1090961 1072449 1049983 1025649 1003110 980765 955865 931160 910444
58069 910444 891623 871128 851034 834871 820530 804361 788382 776436 767001 756712 747209 741542
58057 741542 737255 730011 720818 713022 705361 694684 682483 672133 662536 650910 639026 630396 624025
58044 624025 617010 610514 607126 605056 600962 595790 591972 587798 580606 572695 567886 564857 559960 553920
58030E53920m425m447q123j0824r823q898j0393j0746q070o290p482p784n144
58017D51471l604n524o874m806k809l828m932l377j630j953k093m63L44r91j417
58002D07514M52J323k44n74K243M446L425K242L302L743J281j239j402j675m039
57987D20798n660m228k412k866l744l176l188n231o681n686m732n703o159m177
57973C57155k146k147k263r37j84j118j151Q59J714l18j914n96Q31l38j858j101
57957C44488K37L3k21P56P51j462k906j658o90k415m005k580m85p42j533m6K115
57940C29637K314K034L820O269O832O642Q112J0375J1412J2025J3660J4837J3593
57927D41562J1050R004O649L040L2q07j361l634o056o487o083o735p468o767n752
$$ plain form
58030 553920 549495 545048 536925 526101 516278 507380 496987 486241 478171 471881 464399 456615 451471
58017 451471 447867 442343 435469 430663 427854 424026 419094 415717 414087 412134 410041 409578 409922 408931 407514
58002 407514 407966 409289 409045 408471 410714 415160 418585 420827 424129 427872 429153 427914 426512 424837 420798
57987 420798 415138 410910 408498 405632 401888 398712 395524 390293 383612 377926 373194 367491 361332 357155
57973 357155 355009 352862 350599 349662 349478 348360 347209 348068 349782 349464 347550 346954 347785 347447 345589 344488
57957 344488 344725 344758 344537 345293 346044 344582 341676 340018 339328 336913 332908 330328 329843 329101 327568 327522 329637
57940 329637 331951 333985 337805 344074 350906 357548 365660 376035 387447 399472 413132 427969 441562
57927 441562 452612 461616 468265 471305 471337 470530 469169 465535 459479 452992 446909 440174 432706 425939 420187
57912D20187n777n584m072k960l576l943k311n60q79k071k439l154n329o884n973
57897C64675m607n232o525o146m845m331l817k233j055j472j515M99K578K516
57883C28490J772K314K682J109n18J89J720J537N48O42M91j772m136l577j223
57868C30268l27r28p30M26J068J437K412K794J334j52O27K524L161L066L921M735
57852C55636L769K318K602L560K755P94r9l26j699l526l962l864n274p259p292
57837C38133n688m882n245n292m973n218n305m111k789k812k783p52J830K242
57823B92355J109R75J652J109j87lJ324J495N14M48J417J680J265J768K860K569
57807C12350P87q46k160m218o418p098o606o568o726n625l752k700k010j93J838
$$ plain form
57912 420187 414410 408826 404754 401794 398218 394275 391964 391404 390525 388454 386015 382861 377532 370648 364675
57897 364675 360068 354836 348311 342165 337320 332989 329172 326939 325884 324412 322897 323396 325974 328490
57883 328490 330262 332576 335258 336367 335849 336038 337758 339295 339843 340485 340976 339204 335068 331491 330268
57868 330268 329941 329013 328283 328709 329777 331214 333626 336420 337754 337602 338229 340753 343914 346980 350901 355636
57852 355636 359405 361723 364325 367885 370640 371434 371335 371009 369310 365784 361822 357958 352684 345425 338133
57837 338133 332445 327563 322318 317026 312053 306835 301530 297419 294630 291818 289035 288283 290113 292355
57823 292355 293464 294439 296091 297200 297013 297010 298334 299829 300343 300791 302208 303888 305153 306921 309781 312350
57807 312350 313137 312291 310131 305913 299495 292397 285791 279223 272497 266872 263120 260420 258410 258217 260055
57792B60055K000R53J145K476K636J523J511L305N005N452N360N024L988K990
57778C03423L370M536M751M111M032M360L896L195L663M394L202L98j711k742
57764C42878m370o751q148q127p970p876o839n261m741n195n019l995l299k942
57750B62345k022j089j345j856o75J652K754K319K214L059L746M036M544M596
57736B84278L240J832K296L437K505r6j452j113j374k727l198k412k290l232l430
57721B76264k602k591l673m011l334l403m182l539j506q69k391l460k795k495
57707B35413l812m726l752k653l122l851l154j842j358j358j150j357k296k726
57693A98256j860q06n85n76k13k26r72j438j093q81j332j491p75J3M64J485L454
$$ plain form
57792 260055 262055 263008 264153 266629 269265 270788 272299 275604 280609 286061 291421 296445 300433 303423
57778 303423 306793 311329 316080 320191 324223 328583 332479 335674 339337 343731 346933 347331 345620 342878
57764 342878 338508 331757 323609 315482 307512 299636 292797 287536 282795 277600 272581 268586 265287 262345
57750 262345 260323 259234 257889 256033 255358 257010 259764 262083 264297 267356 271102 275138 279682 284278
57736 284278 287518 289350 291646 295083 297588 297492 296040 294927 293553 290826 287628 285216 282926 279694 276264
57721 276264 273662 271071 267398 263387 260053 256650 252468 248929 247423 246554 244163 240703 237908 235413
57707 235413 231601 226875 223123 220470 217348 213497 210343 208501 207143 205785 204635 203278 200982 198256
57693 198256 196396 195590 195005 194429 194216 193990 193018 191580 190487 189606 188274 186783 186008 186021 186485 187970 191424
57676A91424N333O515P849R980J2428J5002J8394K2839K7955L4321M3382N5416
57664D50838O8953Q1564Q8858Q3735O1038K4361j4689m5341o3964p2016p1879
57653E91458o6359n8829n1254m3442l5415k8500k3293j8856j4862j2236j0711
57642B27701q475n260l237l525m306l735k332j225l43K75j25j082p45J029J852
57627A96467M33j354j549q01m39k58O9l44j743k637k229j854k444k737j727p02
57611A76151r05j295n82L50P9r56j595j963k550k766k097j298r80m82M46N77p68
57594A59366k254k587k303k227j941j293j477k923l975l379k328k278k506j780
57580A26115p80q06j490j685j489j596j781j627j567j808j537n55j95j237k386
$$ plain form
57676 191424 196757 203272 211121 221101 233529 248531 266925 289764 317719 352040 395422 450838
57664 450838 519791 601355 690213 773948 834986 859347 844658 799317 735353 663337 591458
57653 591458 525099 466270 415016 371574 336159 307659 284366 265510 250648 238412 227701
57642 227701 219226 213966 210729 207204 202898 199163 196831 195606 195263 195538 195413 194331 193586 194615 196467
57627 196467 196900 195546 193997 193196 192757 192499 192568 192224 190481 187844 185615 183761 181317 178580 176853 176151
57611 176151 175246 173951 173369 173719 173798 172842 171247 169284 166734 163968 161871 160573 159593 159111 159557 160134 159366
57594 159366 157112 154525 152222 149995 148054 146761 145284 142361 138386 135007 132679 130401 127895 126115
57580 126115 125335 124529 123039 121354 119865 118269 116488 114861 113294 111486 109949 109394 109199 107962 105576
57565A05576k323j683j523j478j060j029j835k225j266j76l28r31o10J47J07m40
57549H8923m97k26q2O92K799N071N758M798L182J167j202k878k860j760q26l15
57533A01744r0o23k007l107l133k871l045k855j573j96J21r5R8K68j53k82P93
57516H2994K177K571K299K293K240J571J096J795K980L366L003K626K172J497
57502A14680J318J889K001R23l9L66J100O02o09j085r24j108j479j421j426k065
57486A12723k490j837r79r81j089k61O39L03n68n00K00L91L69Q89J073k39j977
57469A05666k260j503j529k382k553j870j568j866j849j471j452j514q91j67m97
57454H2294j408j556j176j533k379k290j234m93k43N41J770K088J136J1n96r22
$$ plain form
57565 105576 103253 101570 100047 98569 97509 96480 94645 92420 91154 90978 90650 89719 89109 89256 89363 88923
57549 88923 88426 88200 88118 88810 91609 96680 102438 107236 110418 111585 110383 107505 104645 102885 102059 101744
57533 101744 101654 101031 99024 95917 92784 89913 86868 84013 82440 82244 82365 82270 82368 82636 82483 82201 82994
57516 82994 85171 87742 90041 92334 94574 96145 97241 99036 102016 105382 108385 111011 113183 114680
57502 114680 115998 117887 119888 120811 120772 121138 122238 122840 122231 121146 120222 119114 117635 116214 114788 112723
57486 112723 110233 108396 107417 106436 105347 105086 105725 106028 105460 104960 105160 105551 105920 106809 107882 107643 105666
57469 105666 103406 101903 100374 97992 95439 93569 92001 90135 88286 86815 85363 83849 82958 82791 82294
57454 82294 80886 79330 78154 76621 74242 71952 70718 70225 69982 70523 72293 74381 75517 75528 74932 74010
57438G4010r13k15O75Q94O61P15P85K36l63j39K59l11j262j175l73l56j087j091
57420G0950q5O87O54L89M2p07j269p64J56O0q60j173o81m57o00j48P94R76J43
57401F8107o85j094j532j799j211k05R4k12j37J39l18j076p29O54J641J890K371
57384F5898L183L372K955K921L194K675J433O93N92J01p53q30j78j36r76j634
57368H2510j926k722l750l638k480j957k424k273q16N37P02L40J41k07n95q1J238
57351F2599J901J369Q55J137J418J070P19P82P01L23L91R49Q64k97j447j684j373
57334G0277j060p74p23j222j693j275n74j024k405k948k071j052o84l88N2J8k66
57317E2188K17J148J014j61n76K81P84R5m80q6J87m21q59l81j2n01p66J43J283
$$ plain form
57438 74010 73097 72882 73557 74451 75112 75827 76612 76848 76485 76346 76605 76294 75032 73857 73484 73128 72041 70950
57420 70950 70865 71552 72206 72595 72637 71930 70661 69897 70053 70113 69253 68080 67399 66942 66342 66194 66988 67964 68107
57401 68107 67422 66328 64796 62997 61786 61581 61675 61463 61326 61465 61147 60071 59342 59996 61637 63527 65898
57384 65898 69081 72453 75408 78329 81523 84198 85631 86324 86916 87017 86264 85434 85256 85120 84144 82510
57368 82510 80584 77862 74112 70474 67994 66037 63613 61340 60524 61061 61763 62103 62244 62037 61442 61361 62599
57351 62599 64500 65869 66724 67861 69279 70349 71068 71850 72551 72874 73265 74214 75078 74781 73334 71650 70277
57334 70277 69217 68443 67720 66498 64805 63530 62956 61932 59527 56579 54508 53456 52772 52384 52436 52454 52188
57317 52188 52405 53553 54567 54406 53830 54111 54895 54990 54510 54424 54611 54190 53331 52950 52938 52437 51671 51814 53097
57298E3097J474J105R35O34j57p11m36M5O1n4P4J29Q7N58J456J805J467J528K347
57279F5444K922K767K677K968K845K151J848K050J622M84Q3P37Q51j70o76K30
57263H8833Q60k09j614j370K29J590K075J658R0k042k976k120j169j485k043j540
57247G8767o84o53r33n65l4p1O2J173K374K451J828J509J269N64j3J53L01l48
57229H7150j041q57l94n17o73j06N35M32K17P29J362J390J557K574L300K440Q98
57212I8996M85J256K052K696L625M246L711K668K357K574K259J525J334J707J928
57197A33419J994K357K781K907L231M219N146N251N149N694O358O275N982O471
57183A97234P408P858P932Q150Q083P321O858P750R214R797R641R817J0323J0570
$$ plain form
57298 53097 54571 55676 56611 57245 57088 56377 55941 55986 56047 55993 56067 56196 56283 56841 58297 60102 61569 63097 65444
57279 65444 68366 71133 73810 76778 79623 81774 83622 85672 87294 87778 87861 88598 89449 89279 88603 88833
57263 88833 89693 89484 87870 86500 86729 88319 90394 92052 92142 90100 87124 85004 83835 82350 80307 78767
57247 78767 78083 77430 76497 75932 75898 75827 75889 77062 79436 81887 83715 85224 86493 87057 87044 87197 87498 87150
57229 87150 86109 85252 84858 84341 83668 83562 84097 84529 84746 85475 86837 88227 89784 92358 95658 98098 98996
57212 98996 99481 100737 102789 105485 109110 113356 117067 119735 122092 124666 126925 128450 129784 131491 133419
57197 133419 135413 137770 140551 143458 146689 150908 156054 161305 166454 172148 178506 184781 190763 197234
57183 197234 204642 212500 220432 228582 236665 243986 250844 258594 267808 277605 287246 297063 307386 317956
57169C17956J1068J2665J4729J6005J6615J7425J8053J7481J6042J4927J4254
57158D87220J3630J4058J7104K2338K7575L1483L4268L6057L6521L6123L5985
57147G92362L6369L6680L6826L7150L7171L5833L2939K9181K5012K0623J6556
57136A136702J3060R352M765J31l114m422l502O94Q752J9567L2008M6732O4154
57123A324879Q1260R2728R5162Q8880P6569O2395N1523M7584M9997N5459O1898
57112B088334O9288P7198Q4102Q9394R4282J00409J09119J21884J39686J62056
57102C135752J88367K20027K59949L10395L73134M51080N47503O63736P99474
57093F949417R54996J130913J325934J536861J759984J989917K217168K429305
$$ plain form
57169 317956 329024 341689 356418 372423 389038 406463 424516 441997 458039 472966 487220
57158 487220 500850 514908 532012 554350 581925 613408 647676 683733 720254 756377 792362
57147 792362 828731 865411 902237 939387 976558 1012391 1045330 1074511 1099523 1120146 1136702
57136 1136702 1149762 1159114 1163879 1164010 1160896 1156474 1152972 1153666 1162418 1181985 1213993 1260725 1324879
57123 1324879 1406139 1498867 1594029 1682909 1759478 1821873 1873396 1920980 1970977 2026436 2088334
57112 2088334 2157622 2234820 2318922 2408316 2502598 2603007 2712126 2834010 2973696 3135752
57102 3135752 3324119 3544146 3804095 4114490 4487624 4938704 5486207 6149943 6949417
57093 6949417 7904413 9035326 10361260 11898121 13658105 15648022 17865190 20294495
57085B0294495K614054K759219K852817K890553K884063K851808K791136K658671
57077D2596816K386420J926514J287640N34600k44048r72396j604806k122682
57069D3788058k522693k807716k982822l054265l030540k924863k755820k544126
57061B1165213k308602k065215j827716j606363j406174j228302j073104r40359
57053H709378q27275p29032o42052n65243m98052m39259l88074l44534l08060
57044C967797k76884k49347k24661k02311j82041j64445j50087j37974j26367
57035B253680j15065j05134r6456q7540p7983o9017o1088n2895m3617l4179k5316
57024A485390j6068n200P635K3271M3400O6712Q4936Q5578O1014J5765l5234p6261
$$ plain form
57085 20294495 22908549 25667768 28520585 31411138 34295201 37147009 39938145 42596816
57077 42596816 44983236 46909750 48197390 48731990 48487942 47515546 45910740 43788058
57069 43788058 41265365 38457649 35474827 32420562 29390022 26465159 23709339 21165213
57061 21165213 18856611 16791396 14963680 13357317 11951143 10722841 9649737 8709378
57053 8709378 7882103 7153071 6511019 5945776 5447724 5008465 4620391 4275857 3967797
57044 3967797 3690913 3441566 3216905 3014594 2832553 2668108 2518021 2380047 2253680
57035 2253680 2138615 2033481 1937025 1849485 1771502 1702485 1641397 1588502 1544885 1510706 1485390
57024 1485390 1469322 1464122 1471757 1495028 1538428 1605140 1690076 1775654 1836668 1852433 1817199 1740938
57012A740938r9959j08517j07696j01378r1521q0448p0531o2341n4994m8145m2261
57001H73147l7419l3447l0755k9521k8497k6335k3634k1919k0971j9200j6325
56990E85124j3669j1762r675o851l709k68M019Q891J3231J6315J7537J5375Q806
56977F23364k99q293j3458j6669j8658j8965j7740j6100j4258j1469q201o066
56965D73188n168l877j618M50K105M814R066J3471J7454K2222K7563L0043K6215
56952F15928J6268L267r566j9751k5634k7285k6422k4459k1610j8183j5061j2334
56940D35158r135n532k735q01J889O059J0462J4319J8888K5381L2964L9544M2701
56927F09162L9307K7093Q183j0957k4867l2925l6970l7673l5182l1156k7585k4659
$$ plain form
57012 1740938 1640979 1532462 1424766 1323388 1231867 1151419 1080888 1018547 963553 915408 873147
57001 873147 835728 802281 771526 742005 713508 687173 663539 641620 620649 601449 585124
56990 585124 571455 559693 550018 543167 539458 539190 543209 552100 565331 581646 599183 614558 623364
56977 623364 623065 614772 601314 584645 565987 547022 529282 513182 498924 487455 479254 473188
56965 473188 468020 464143 462525 462975 465080 469894 478960 492431 509885 532107 559670 589713 615928
56952 615928 632196 635463 625897 606146 580512 553227 526805 502346 480736 462553 447492 435158
56940 435158 426023 420491 417756 416955 418844 424903 435365 449684 468572 493953 526917 566461 609162
56927 609162 648469 675562 683745 672788 647921 614996 578026 540353 505171 474015 446430 421771
56915D21771k1642j8721j6353j3930j0871q074o671o254n721m966m465m118l707
56902B96278l587l813l608k698j944j692q91J036K867L444L520M325N681O991
56888C05909Q901J2377J7012K1620K5483K7658K6203J9830R797r66r978j5801
56876D48045j7863j6981j5072j3203j0716p084l250j18K864O330R580J2015J4795
56863D09342J9513K6157L3817M2513N2624O2847O9619O8474N6077L2824M354k1062
56851H57099l8097m6841m9711m8112m3055l6534l0069k3215j5280p211j93O286
56839E25067J3318K0771K8406L7462M9464O4431Q1539R9569J14281J17100J00122
56828A251530O3414J6084k9653o4710q5372r2711r0699q3499p3666o2655n1855
$$ plain form
56915 421771 400129 381408 365055 351125 340254 332180 325509 319255 313534 308568 304103 299985 296278
56902 296278 292691 288878 285270 282572 280628 278936 278045 279081 281948 285392 288912 293237 298918 305909
56888 305909 314810 327187 344199 365819 391302 418960 445163 464993 474790 473824 463846 448045
56876 448045 430182 413201 398129 384926 374210 367126 363876 363758 366622 372952 382532 394547 409342
56863 409342 428855 455012 488829 531342 583966 646813 716432 784906 840983 873807 878161 857099
56851 857099 819002 772161 722450 674338 631283 594749 564680 541465 526185 518974 518781 525067
56839 525067 538385 559156 587562 625024 674488 738919 820458 920027 1034308 1151408 1251530
56828 1251530 1314944 1331028 1301375 1236665 1151293 1058582 967883 884384 810718 748063 696208
56817F96208m2131l3216k4596j6358q412J7R244J8585K7995L9031N2894O8117
56805G87378Q0658Q5157P6224N1485J5373k1857n0965o8933p7227p7667p2086
56794G27540o3566n4842m6265l7287k8810k2022j6317j0520n028n77L895R942
56782D56143J7246K4717L2557M0517M5098M1513K8548R625j0447k7841l9863m5467
56770E72346m5974m3616l9510l4172k8948k5063k1976j8536j5054j2554j0820
56759B76123r040p472o645n859m381l180l380l987l366j996j541j963j949j484
56745B19880j653k428k872k955l127k759j233K43J38q27r01k93m81j304j343n79
56729A97506j45J5O48R79k01j753j414N26J664J393J391K176K297J287N89R15
$$ plain form
56817 696208 654077 620861 596265 579907 571495 571512 580756 599341 627336 666367 719261 787378
56805 787378 868036 953193 1029417 1080902 1096275 1074418 1023453 954520 877293 799626 727540
56794 727540 663974 609132 562867 525580 496770 474748 458431 447911 442883 442306 446201 456143
56782 456143 473389 498106 530663 571180 616278 657791 686339 695964 685517 657676 617813 572346
56770 572346 526372 482756 443246 409074 380126 355063 333087 314551 299497 286943 276123
56759 276123 267083 259611 252966 247107 242726 239546 236166 232179 228813 226817 225276 223313 221364 219880
56745 219880 218227 215799 212927 209972 206845 204086 202853 203096 203234 202407 201506 201213 200732 199428 198085 197506
56729 197506 197361 197376 198024 199003 198802 197049 195635 196161 197825 199218 200609 202785 205082 206369 206958 207873
56713B07873J259J126J314J885J691O23J56R66J863J791J127O24N41J127K322
56698B26288L012K154N46j51J30K13l8J46L88l50j492j405k23L28j39k92K58L86
56680B29759j84l06L64Q26P42R48J587J773J341J057R35L32l36pR55J177O74O01
56662B42238R25O94M48J612L567M097K981K312K903L187K264J250Q24Q5j243j909
56646B66235j398r07j115j104l23L72M26M31O32L47m85r96r82j133j535j704k075
56629B54686l389m763m662l634l563m393m275l003k278k452k073j106j355l034
56615B10706l988l253k343k081j190P48J968J533R47J322J520N95l63l77k66p38
56599B04740r21k14M12K27j1L54Q37J208J915K446J494n23j421n06M76L92K12
$$ plain form
56713 207873 209132 210258 211572 213457 215148 215771 215927 216893 218756 220547 221674 222298 222839 223966 226288
56698 226288 229300 231454 232000 231849 231979 232192 232154 232300 232688 232338 230846 229441 229218 229546 229407 229115 229373 229759
56680 229759 229575 229269 229633 230459 231201 232149 233736 235509 236850 237907 238842 239174 238838 238831 239786 240963 241637 242238
56662 242238 243163 243857 244305 245917 249484 253581 256562 258874 261777 264964 267228 268478 269302 269387 268144 266235
56646 266235 264837 263930 262815 261711 261388 261760 262186 262617 263249 263596 263111 262115 261133 260000 258465 256761 254686
56629 254686 251297 246534 241872 238238 234675 230282 226007 223004 220726 218274 216201 215095 213740 210706
56615 210706 206718 203465 201122 199041 197851 198599 200567 202100 203047 204369 205889 206484 206121 205744 205478 204740
56599 204740 203819 203605 204017 204244 204233 204587 205424 206632 208547 210993 212487 211964 210543 210037 210513 210905 211117
56582B11117O38Q63O57J038J910J637P0o73L74J471J244O76Q40J216J480K380
56566B26938L664L798K826K796M273N353N363O263Q992J1718J3315J5186J7570
56553C28055J7571J3381P561L488J289l27r93k62J72j126k744k835k226k580l363
56538C55061l227k703l056l897m154m007l934l462k610k808m538n910n459m416
56524C00880m339m586m084l584l978m267l374k171j797j714j304j406k408k898
56510B58970k106j555k326k954k174j335j797k282j382m39j150k354j992n47J77
56495B34754J07J83J24n85r74j69P27N57K29Q21J341N94n26p34n92q47n94P04
56477B35120J411L82o92mJ340J600J533K442L171K054J21n36rM70J074K209K554
$$ plain form
56582 211117 211755 212618 213275 214313 216223 217860 217930 217257 217631 219102 220346 221022 221862 223078 224558 226938
56566 226938 230602 234400 237226 240022 244295 249648 255011 261274 270266 281984 295299 310485 328055
56553 328055 345626 359007 366568 370056 371345 371018 370025 369763 369935 368809 366065 363230 361004 358424 355061
56538 355061 351834 349131 346075 342178 338024 334017 330083 326621 324011 321203 316665 310755 305296 300880
56524 300880 296541 291955 287871 284287 280309 276042 272668 270497 268700 266986 265682 264276 261868 258970
56510 258970 256864 255309 252983 250029 247855 246520 244723 242441 241059 240620 239470 237116 235124 234577 234754
56495 234754 234861 235044 235168 234583 233609 233440 234167 234724 234953 235774 237115 237709 237183 236449 235857 235010 234416 235120
56477 235120 236531 236913 236221 236217 237557 239157 240690 243132 246303 248357 248478 247942 247933 248403 249477 251686 254240
56460B54240J116m84n12p1q35j792j185J48M48K40Q09J256K59r51n87L60N9o01
56442B51917K44J676J577M97M60J118P28k40O5J274J528R46J063J612J064l03
56426B65226r08p31p90p44K05J042N11k25N80J932J732N24L87J186J203N03M36
56409B72069O72m3j079r48k74o02j268o11O55N16p34j134n12k49m26j43K22n7
56391B66054j4J299K378J605M87J299K986K989J714J493K245K030R12M80M59n42
56375B87874j774j478l85n03j357r81L42Q96J015K025K921J954L45N50J897J970
56359B95311J106J303J857N70j590j652K20J259J110J806L250L340K247K101K686
56344C14924J822j58p31K81P07L24Q36J969J912J273K193L895L683J956J598K720
$$ plain form
56460 254240 255356 254872 254360 254289 253454 251662 250477 250625 251073 251313 252122 253378 253637 252686 252099 252459 252518 251917
56442 251917 252161 253837 255414 255911 256371 257489 258217 257977 258042 259316 260844 261790 262853 264465 265529 265226
56426 265226 264318 263587 262797 262053 262258 263300 263811 263586 264166 266098 267830 268354 268741 269927 271130 271633 272069
56409 272069 272741 272698 271619 270671 270397 269795 268527 267916 268571 269087 268353 267219 266707 266458 266032 265889 266111 266054
56391 266054 266040 267339 269717 271322 271809 273108 276094 279083 280797 282290 284535 286565 287477 287957 288416 287874
56375 287874 286100 284622 284237 283734 282377 281396 281738 282634 283649 285674 288595 290549 290894 291444 293341 295311
56359 295311 296417 297720 299577 300147 298557 296905 297125 298384 299494 301300 304550 307890 310137 312238 314924
56344 314924 316746 316588 315857 316138 316845 317169 318005 319974 321886 323159 325352 329247 332930 334886 336484 339204
56328C39204K790J699J843L270L704L305M414O446O207L558J733J705J187l28
56314C80737p03K16R6j103q94P05R09l99k05J915K823J547Q16J730K076J202J554
56297C93022L846N486N267N073N696N522M467M537N434M451J862J309L555M992
56283D54519L942L268M879O698P120P707R300R925Q753Q002Q901R774R736J0300
56269E62824J1784J2296J1648J2128J4120J5286J5238J6445J9384K1487K2166
56258G34806K4052K7982L1659L4650L9561M6800N3319N8264O4605P3434Q1886
56247A271018Q8657R6344J06209J15719J23351J30730J38012J42320J42808J42025
56237B497193J40116J33168J19667J03124Q5791O5246M0026J3340j1695l5499
$$ plain form
56328 339204 341994 343693 345536 348806 352510 355815 360229 366675 372882 376440 378173 379878 381065 380737
56314 380737 380034 380250 380346 379243 378349 379054 379963 379564 379359 381274 384097 385644 386460 388190 390266 391468 393022
56297 393022 396868 402354 407621 412694 418390 423912 428379 432916 438350 442801 444663 445972 449527 454519
56283 454519 458461 461729 466608 473306 480426 488133 497433 507358 516111 524113 533014 542788 552524 562824
56269 562824 574608 586904 598552 610680 624800 640086 655324 671769 691153 712640 734806
56258 734806 758858 786840 818499 853149 892710 939510 992829 1051093 1115698 1189132 1271018
56247 1271018 1359675 1456019 1562228 1677947 1801298 1932028 2070040 2212360 2355168 2497193
56237 2497193 2637309 2770477 2890144 2993268 3079059 3144305 3184331 3197671 3185976 3150477
56227C150477n8006p6394q9760j01090j11801j19178j21863j22717j23481j21825
56217B104362j16590j10794j06358j00967r3166q5574q0001p4372o7462o1593
56207A207485n7737n3143m6794m1867l9744l7137l2315k8506k7646k6504k2736
56196G93356j9208j8285j7313j3914j0603r843r517p502n877o468o912n215l600
56183F59099m028m413l078k209l296l914k463j287j710j185J233K160J31j021
56169F34019J161L427L051K579M277N611M554L770N283O551N900O051Q302R271
56155G03807P565P267J0443J2852J1760J1156J4229J7491J7897J8845K3354K8091
56143H84757L0171L3361M1135N0107N6753O4294P6226Q9200R9115J08048J18078
$$ plain form
56227 3150477 3092471 3016077 2926317 2825227 2713426 2594248 2472385 2349668 2226187 2104362
56217 2104362 1987772 1876978 1770620 1669653 1576487 1490913 1410912 1336540 1269078 1207485
56207 1207485 1149748 1096605 1049811 1007944 968200 931063 898748 870242 842596 816092 793356
56196 793356 774148 755863 738550 724636 714033 704190 694673 687171 681294 674826 667914 662699 659099
56183 659099 655071 650658 647580 645371 642075 638161 635698 634411 632701 631516 632749 634909 635040 634019
56169 634019 635180 638607 641658 644237 648514 654125 658679 662449 667732 674283 680183 686234 694536 703807
56155 703807 711372 718639 729082 741934 753694 764850 779079 796570 814467 833312 856666 884757
56143 884757 914928 948289 989424 1039531 1096284 1160578 1236804 1326004 1425119 1533167 1651245
56132A651245J24170J20578J09172R4839P8430O0964M8658M5918M8107M8022M4475
56121B474578L8399K6955R073q690j9364k3834k5891k5450k3667k7995m3654o5338
56109B285122q4732j00569j14104j21383j18655j09866j00508q9449p4506o0036
56099A311314n0752m3720l4696k6424k2632j9994j4513r513q749q120l112K098
56087A071187K194P27L132O418N574L719N795Q551P044M771O981J0209R004O695
56073A152001Q819J2162J1204R111J1268J4310J2801J0395J2900J6761J5987J3966
56061A301685J6509J9919J8194J5256J7468K0834J8576J4557J5831J8733J6115
56050A493677J1693J3130J7396J7142J5118J7880K1914K0656J8477K2664K8403
$$ plain form
56132 1651245 1775415 1895993 2005165 2100004 2178434 2239398 2288056 2333974 2382081 2430103 2474578
56121 2474578 2512977 2539932 2549005 2540315 2520951 2497117 2471226 2445776 2422109 2394114 2350460 2285122
56109 2285122 2200390 2099821 1985717 1864334 1745679 1635813 1535305 1445856 1371350 1311314
56099 1311314 1260562 1216842 1182146 1155722 1133090 1113096 1098583 1089070 1080321 1072201 1069089 1071187
56087 1071187 1073381 1074108 1077240 1083658 1089232 1092951 1098746 1107297 1114341 1119112 1126093 1136302 1145306 1152001
56073 1152001 1160820 1172982 1184186 1193297 1204565 1218875 1231676 1242071 1254971 1271732 1287719 1301685
56061 1301685 1318194 1338113 1356307 1371563 1389031 1409865 1428441 1442998 1458829 1477562 1493677
56050 1493677 1505370 1518500 1535896 1553038 1568156 1586036 1607950 1628606 1647083 1669747 1698150
56039A698150K7273K3571K6284L1919L1746K9077L2290L7667L6610L3095L6130
56028B043812M1774M0848L7534M1516M8646M8709M5423M8814N4774N2885M7520
56017B552255M9999N6610N6240N2882N8005O7330O8531O5499P1070Q2045Q5779
56006C266245Q5106R1773J01752J02891J00297J07563J19706J22416J20783J30059
55996D348591J45273J50403J50440J62578J82504J92462J96077K10935K33196
55987E972459K45209K51735K71560K99656L16301L27016L53134L89632M14921
55978H841623M35309M74791N27804N69772O07377O67922P46039Q14801Q82325
55969A4567763R80041J102420J220126J345353J517947J735254J968279K238884
$$ plain form
56039 1698150 1725423 1748994 1775278 1807197 1838943 1868020 1900310 1937977 1974587 2007682 2043812
56028 2043812 2085586 2126434 2163968 2205484 2254130 2302839 2348262 2397076 2451850 2504735 2552255
56017 2552255 2602254 2658864 2715104 2767986 2825991 2893321 2961852 3027351 3098421 3180466 3266245
56006 3266245 3351351 3443124 3544876 3647767 3748064 3855627 3975333 4097749 4218532 4348591
55996 4348591 4493864 4644267 4794707 4957285 5139789 5332251 5528328 5739263 5972459
55987 5972459 6217668 6469403 6740963 7040619 7356920 7683936 8037070 8426702 8841623
55978 8841623 9276932 9751723 10279527 10849299 11456676 12124598 12870637 13685438 14567763
55969 14567763 15547804 16650224 17870350 19215703 20733650 22468904 24437183 26676067
55961B6676067K601732L058734L578250M188468M954241N874670O918031Q149049
55953F5999242R698506J1630769J4003907J7048004K1096007K6347682L2865791
55946A98689908M0533091M8256131N2947074N0214285L7393901J6390814o864284
55939D37560920k6137723l8258972m3479805m3681138m0806116l6400647l1578915
55932A77217604k6946475k2697567j8909079j5672495j2995324j0776425q934364
55925F0285875p451755o281605n324269m519423l868503l351766k908190k510456
55917B4069908k181342j921908j693202j480031j306522j176276j057423r38187
55909A2315017q41180p71722p04345o30804n72308n34063m93747m44573m06157
$$ plain form
55961 26676067 29277799 32336533 35914783 40103251 45057492 50932162 57850193 65999242
55953 65999242 75697748 87328517 101332424 118380428 139476435 165824117 198689908
55946 198689908 239222999 287479130 340426204 390640489 428034390 444425204 437560920
55939 437560920 411423197 373164225 329684420 286003282 245197166 208796519 177217604
55932 177217604 150271129 127573562 108664483 92991988 79996664 69220239 60285875
55925 60285875 52834120 46552515 41228246 36708823 32840320 29488554 26580364 24069908
55917 24069908 21888566 19966658 18273456 16793425 15486903 14310627 13253204 12315017
55909 12315017 11473837 10702115 9997770 9366966 8794658 8260595 7766848 7322275 6916118
55900F916118l83474l56534l19685k91817k78633k62248k36723k18154k11174
55891D357676j99712j79255j65387j62310j54411j37076j25401j24399j19729
55882B989996j05940r5801r3916q7968p3838o3584o1437n6948m8611m9296o1211
55871B191446o9678o8691o9192p5324p5979o7377o1213o2577o1317n2919m7066
55860A480113m7845m5835l7445l2505l5058l5601k9757k6191k8732k8728k2559
55849A109857j9134k2708k5155k2268k1156k4661k4960j9454j6853k0599k2170
55838H70739j7697j5420j9530k2048j8225j5091j7246j8436j4623j1690j2934
55827F87799j2308p140m383p383r265o248m780q718j1944j0424r357j1768j2201
$$ plain form
55900 6916118 6532644 6176110 5856425 5564608 5285975 5023727 4787004 4568850 4357676
55891 4357676 4157964 3978709 3813322 3651012 3496601 3359525 3234124 3109725 2989996
55882 2989996 2884056 2788255 2694339 2606371 2532533 2468949 2407512 2350564 2301953 2252657 2191446
55871 2191446 2121768 2053077 1983885 1908561 1832582 1765205 1703992 1641415 1580098 1527179 1480113
55860 1480113 1432268 1386433 1348988 1316483 1281425 1245824 1216067 1189876 1161144 1132416 1109857
55849 1109857 1090723 1068015 1042860 1020592 999436 974775 949815 930361 913508 892909 870739
55838 870739 853042 837622 818092 796044 777819 762728 745482 727046 712423 700733 687799
55827 687799 675491 668351 663968 656585 647320 641072 636292 627574 615630 605206 595849 584081 571880
55814E71880q267o360r332j0381n877k365m050n060j228J996O01j21L846P419
55800E32701O540N938R477J2451J0593P501O382L677k656p601q244r408j3964
55787E53387j6805j4535j2025j2895j2595p498k144j035j638j677m613j1538j6238
55774D38151j4758j1744j1191r518l958R50J940L472Q666J2050Q635K503q58l203
55760D21137p451j0377q856o647p597q568o019l343m634p153o912n982p624r640
55746C20334r044q003r058r686p469n312n869o252l761j368j909k540m77J395
55732B50981K18j189N2J290j21j427j53N21k212n051m567l309m267m933k849j319
55716B21665l382n570l947j147j076j718L56L200L640L532N562P252N464K643
$$ plain form
55814 571880 563613 557253 547921 537540 531663 529298 525248 520188 518960 520956 521557 521436 525282 532701
55800 532701 539241 545179 554656 567107 577700 585201 591583 595260 592604 585003 576759 567351 553387
55787 553387 536582 522047 510022 497127 484532 477034 474890 473855 472217 470540 465927 454389 438151
55774 438151 423393 411649 400458 390940 386982 387932 389872 393344 402010 414060 422695 425198 424340 421137
55760 421137 413686 403309 394453 387806 380209 371641 365622 362279 357645 350492 343580 337598 329974 320334
55746 320334 311290 303287 294229 284543 277074 271762 265893 259641 255880 254512 252603 250063 249586 250981
55732 250981 251199 250010 250062 251352 251231 249804 249651 250172 247960 242909 238342 235033 230766 225833 222984 221665
55716 221665 218283 212713 208766 207619 206543 204825 205181 208381 212021 215553 221115 228367 233831 236474
55702B36474K385K945J169j313j773k111m906p733p362n681n746n908l628j116
55688A95696j301k131o40J244P05j41J694M143M109L540N481P880P405N754N995
55673B39433O272L433m67j593j079k099l423k197k28j019l224l198j659j696k502
55658B24754j195J259J868J327K316L998L770K463K618L449K628J000N64P0k486
55643B48403n319n759n218o355p895p306n960o466p431o219m245m238m787l153
55629A68052q75j048k483k183j147k033l440k425m37q46k651k585j345j755k714
55614A40085j231J277R82j487k345j445j643k626j604P02R10q24j240j24k84j898
55598A27205k370j430j172j455m47R46K87j415j189K87j58k113k244m47J33j000
$$ plain form
55702 236474 238859 241804 242973 241660 239887 237776 232870 225137 217775 212094 206348 200440 196812 195696
55688 195696 194395 192264 191624 192868 193573 193432 195126 199269 203378 206918 212399 220279 227684 233438 239433
55673 239433 245705 249138 248671 247078 245999 243900 240477 238280 238052 237033 233809 230611 228952 227256 224754
55658 224754 223559 224818 226686 228013 230329 234327 238097 240560 243178 246627 249255 250255 250819 250889 248403
55643 248403 243084 237325 232107 225752 217857 210551 204591 198125 190694 184475 180230 175992 171205 168052
55629 168052 167177 166129 163646 161463 160316 158283 154843 152418 151981 151135 148484 145899 144554 142799 140085
55614 140085 138854 140131 141113 139626 137281 135836 134193 131567 129963 130665 131575 130751 129511 129387 129103 127205
55598 127205 124835 123405 122233 120778 120331 121277 121564 120149 118960 119247 119089 116976 114732 114285 114418 113418
55582A13418j270l40n14j716j315P97J846J149Q43J488J540J196K217L940L932
55567A27211K482K075K670K053N17N00J742J597M9k82Q23Q86m50r98n08j012k449
55550A36906k530j192p61j481j217J70N55k11j39P12L23r26n11J400J998R45Q00
55533A34841J971J979M45j9J261J714K54j031j005j216k307k654j772j383k050
55518A29028k261j678j792k606k250o53jq20j125k21J66o87j404j460j845k316
55502A08075j352O01J352Q03J089K507K921J745Q40R28O01n03j090j186k239l813
55486A11279l784k218j432j814j374J22N12o83j401r55q79j305m07J690K420J160
55470A00931K49O84O04q36j821j382q47q52k91P23M50r94j397m83m88j768j835
$$ plain form
55582 113418 112148 111808 111294 109578 108263 109060 110906 112055 112898 114386 115926 117122 119339 123279 127211
55567 127211 129693 131768 134438 136491 137008 137508 139250 140847 140896 140614 141437 142323 141873 140875 140367 139355 136906
55550 136906 134376 133184 132423 130942 129725 129895 130450 130239 130100 130812 131135 130209 129698 131098 133096 134041 134841
55533 134841 136812 138791 139236 139217 140478 142192 142446 141415 140410 139194 136887 134233 132461 131078 129028
55518 129028 126767 125089 123297 120691 118441 117788 117787 116967 115842 115621 115787 115100 113696 112236 110391 108075
55502 108075 106723 107324 108676 109479 110568 113075 115996 117741 118581 119509 120110 119607 118517 117331 115092 111279
55486 111279 107495 105277 103845 102031 100657 100779 101291 100608 99207 98252 97373 96068 95661 97351 99771 100931
55470 100931 101180 101864 102468 101632 99811 98429 97582 96730 96439 97162 97612 96618 95221 94738 94250 92482 90647
55453I0647J22J691J489J077J306P19q83j169O06J835Q42o01p57n34p90l91J062
55436I6271J710O04m96k13L80L55O07J430J373P0p05k88l76j634k155r02M44O89
55418I7164J008J983K004N45j36J333K998K880J950J737J628P07j70j31l6o38
55402A14826j184j258j745k665k503j071l63j192j694o34O08Q61J097J897J858
55387A06838L56q65o81m29j017j019M25J595J197O93J488K249J398n8l84J75N98
55370A12559R89J410Q56p74j714j018k03n95j207r08m90q93j436j460j620k073
55354A01423j582M5R82L18m23j64r1r78j354k40Q13M65p6N34J338J072L89J69
55336A02640k04j052j121O4P85l3r35o13r9l70l34P69J410M23p37n91r8l87m30
$$ plain form
55453 90647 90769 92460 93949 95026 96332 97051 96168 94999 95605 97440 98282 97681 96924 96390 95600 95209 96271
55436 96271 97981 98585 98089 97876 98256 98611 99218 100648 102021 102091 101386 101098 100722 99088 96933 96031 96475 97164
55418 97164 98172 100155 102159 102704 102568 103901 106899 109779 111729 113466 115094 115801 115631 115500 115464 114826
55402 114826 113642 112384 110639 107974 105471 104400 104037 102845 101151 100517 101125 101986 103083 104980 106838
55387 106838 107194 106329 105648 105219 104202 103183 103608 105203 106400 107093 108581 110830 112228 112170 111786 111961 112559
55370 112559 113548 114958 115814 115040 113326 112308 112105 111510 110303 109395 108905 108012 106576 105116 103496 101423
55354 101423 99841 99886 100868 101186 100763 100599 100508 99530 98176 97936 98749 99214 99138 99672 101010 102082 102471 102640
55336 102640 102436 101384 100263 100327 101112 101079 100144 99531 99432 99062 98728 99497 100907 101330 100593 100002 99904 99517 99087
55317I9087O64J411N12n87j89O83L82l64j29L55l03j459j665j131p04l1J187J714
55299I9433P88j09M20J319J140N90R32J529J262O87O57N24k42m26P66J822J285
55282A12377K00M6J99m00r99p40o22j431j760m52J033J094P34J240J377k34j968
55265A09694j625j85L5o18k82O57L42r59j206O4J455K185K413J872M78n71m44
55248A13305l46j501k760k483j374j016j014j69Q26N53l44k48N76P12J96K8L8
55231A04979l52m08N98J507J032J17K03N07m08j693j597n01N8J96Q28J263M32
55214A06761n77r9J117J200L89J35J60o45j470q46L07Nj232j251K8Q55R22J289
55196A07048J698J032j3K04J161R56k21m48L97N75k40o41l42m35q38l20Q92J225
$$ plain form
55317 99087 99751 101162 101674 101087 100898 101581 101963 101599 101470 101825 101522 100063 98398 97267 96563 96532 97719 99433
55299 99433 100221 100112 100532 101851 102991 103581 104513 106042 107304 107991 108648 109172 108930 108504 109270 111092 112377
55282 112377 112577 112623 112822 112422 111423 110683 110061 108630 106870 106418 107451 108545 109279 110519 111896 111662 109694
55265 109694 108069 107884 107919 107301 107019 107676 108018 107059 105853 105917 107372 109557 111970 113842 114320 113749 113305
55248 113305 112959 111458 108698 106215 104841 103825 102811 102642 103468 104021 103677 103429 104005 104717 104913 104941 104979
55231 104979 104627 104219 104817 106324 107356 107473 107676 108183 107775 106082 104485 103984 104042 104238 105066 106329 106761
55214 106761 106184 106085 107202 108402 108791 108926 109086 108441 106971 106125 106432 106437 105205 103954 103982 104837 105759 107048
55196 107048 108746 109778 109765 109969 111130 112086 111865 111417 111814 112389 112149 111508 111166 110731 109893 109573 110465 111690
55178A11690N43K11M65K78k64l0Q15J007N96O04O01o56k407k513r54J51j9j94
55160A09924J58K4p72r56r2P19Q01N73J93n36r94n21J9n33j339q28M31O71J34
55141A07076M49J363J156P5N2J082J135j24p97l37m06j454j626o9J512J707J222
55124A12016R12L96l99o09k24l84j106r76K34Q90K43l44K05J130J506J532J383
55107A16405O58l12l94M43Q50K94k36p1K44L38N42P60M67k6j9M0o75j336m38J417
55087A18951K154J523J145J342Q03m27o60K35L74p06j147j85M58j52m27P87K057
55070A26125J806O99J4l73q85j001m78j91n54p28l85m69j273j602q49p4jJ55Q12
55051A20748Q65l31j616j834j398r52j61J004J440O40k25j70J41j56n55k85K65
$$ plain form
55178 111690 112233 112444 112909 113187 112923 112893 113708 114715 115311 115915 116516 115860 113453 110940 109986 110137 110118 109924
55160 109924 110082 110106 109334 108378 108286 109005 109806 110379 110572 110036 109042 108521 108540 108007 106668 105840 106271 106942 107076
55141 107076 107525 108888 110044 110119 110171 111253 112388 112264 111467 111130 110724 109270 107644 107575 109087 110794 112016
55124 112016 112928 113324 112925 112316 112092 111708 110602 109626 109860 110750 110993 110649 110854 111984 113490 115022 116405
55107 116405 117063 116751 116357 116800 117650 117944 117708 117637 117881 118219 118761 119521 119988 119962 119943 119983 119308 117972 117534 118951
55087 118951 121105 122628 123773 125115 125918 125491 124831 125066 125440 124734 123587 123402 123860 123708 123281 124068 126125
55070 126125 127931 128630 128644 128271 127386 126385 125907 125716 125162 124434 124049 123580 122307 120705 119856 119782 119781 119936 120748
55051 120748 121613 121282 119666 117832 116434 115482 115321 116325 117765 118405 118180 118010 118151 117995 117440 117155 117420
55034A17420L16o8l84m07L5R66J620J115l8m92j54r6l49J45J205J246Pq42n02
55015A20743k24q15j151l18P73J065R09Q40N28n4r0M86N75q5k94M38R45N76L68
54996A25215J038J626J311P05L80j64r91j079j79M53K19J68P85Q85o2o22J71J072
54978A30931P79J6q6O2k16l37K22O10J48l33o5K59M8J72J197J965J484P02P64
54959A38322J026M92k17j28J87k72j056j213r58q87o22K00P15K10m23j52M28L02
54941A35954p1K89J007J034L54l32q49j166p53M44J338J228R31J332J939K094
54925A44773K282K912L168K565K320L558N346O192O342O824P242O384M294K056
54911B06258J26j625k908l480l959m847n472n130m419m180m089l582l251l805
$$ plain form
55034 117420 117736 117668 117284 116877 116912 117878 119498 120613 120575 120083 119929 119833 119484 119629 120834 122080 122087 121245 120743
55015 120743 120519 119704 118553 118235 119008 120073 120982 121822 122350 122296 122206 122692 123267 123182 122888 123326 124271 124847 125215
54996 125215 126253 127879 129190 129895 130275 130111 129120 128041 127862 128315 128534 128702 129487 130372 130310 129688 129859 130931
54978 130931 131710 131726 131640 131702 131486 131149 131371 131981 132129 131796 131731 131990 132038 132210 133407 135372 136856 137558 138322
54959 138322 139348 139840 139623 139495 139682 139410 138354 137141 136183 135296 134674 134874 135589 135799 135376 135224 135652 135954
54941 135954 135883 136172 137179 138213 138567 138235 137386 136220 135467 135911 137249 138477 139408 140740 142679 144773
54925 144773 147055 149967 153135 155700 158020 161578 166924 173116 179458 186282 193524 199908 204202 206258
54911 206258 206384 204759 201851 198371 194412 189565 184093 178963 174544 170364 166275 162693 159442 155637
54897A55637m607m613l940l111j820L4J173N55o76o01P52J778J820J580J518J493
54881A46972J682K420L246L453L377L965N338O784P802Q197P692O319M694L070
54867B15011P95k369n281o763p072p023o614n618m688m498m510l847k760k076
54853A52687j808j475j157j203j428j482j498j550j298p79o12q08n38K17K52p53
54837A36767j319n49K41l28j464j721j327j227j136l60N11N80K98M72O68L20K79
54820A30705J362K409J844K67m85j59L4k64m24m31o98p80n6P52N94L3L53J210
54802A36266J192K96j34K72N55L47K97N00K35n69j088r00m01J00N32M95k55r29
54784A36811m64J001K352K869K537J543M45J52P97J314J080R95J841K741K618
$$ plain form
54897 155637 151030 146417 142477 139366 137546 137580 138753 139308 138632 138031 138783 140561 142381 143961 145479 146972
54881 146972 148654 151074 154320 157773 161150 165115 170453 177237 185039 193236 200928 207247 211941 215011
54867 215011 215806 213437 208156 201393 194321 187298 180684 175066 170378 165880 161370 157523 154763 152687
54853 152687 150879 149404 148247 147044 145616 144134 142636 141086 139788 139009 138397 137589 137051 137268 137520 136767
54837 136767 135448 134899 135140 134812 133348 131627 130300 129073 127937 127577 128088 128668 128966 129438 130106 130426 130705
54820 130705 132067 134476 136320 136587 136102 135943 135977 135713 135289 134858 134160 133380 133324 134076 134670 134703 135056 136266
54802 136266 137458 137754 137620 137892 138447 138794 139091 139591 139826 139257 138169 137269 136868 136968 137500 137995 137740 136811
54784 136811 136347 137348 139700 142569 145106 146649 147094 147246 148043 149357 150437 151432 153273 156014 158632
54769A58632K106K417L362M049M613N566O357O348O292P082P879P326N671L846
54755B31546J493k025n495p106p119p136p361o848n896n705o035n548m235l252
54741A59278k602j312L35J059R55J251J822J345p2q21n38n25j134j131q2Q89J291
54724A60008K086L676N044N628O203P228P960P765O878N377K965R9k184l808n558
54709B09367p294p963p468o787o079m615k763k077k869l623l332k635k107j266
54695A48489l5N85J67l20q0M34N62L56o9q26j475j276n02k10n10n15j59l75j242
54676A42999j615j079n73o34o27j93J25K00O18J211R56j57q19n57m12q34p42M43
54658A38310J493J260L30k04l53n22m14K29P75N92L8k43k42j95p4Q8R7J37N92
$$ plain form
54769 158632 160738 163155 166517 170566 175179 180745 187102 193450 199742 206824 214703 222029 227700 231546
54755 231546 233039 231014 225519 218413 211294 204158 196797 189949 184053 178348 172313 166765 162530 159278
54741 159278 156676 155364 155699 156758 157713 158964 160786 162131 162059 161238 160700 160175 159041 157910 157828 158717 160008
54724 160008 162094 165770 170814 176442 182645 189873 197833 205598 212476 217853 220818 220917 218733 214925 209367
54709 209367 202073 194110 186642 179855 173776 169161 166398 164321 161452 157829 154497 151862 149755 148489
54695 148489 148454 149039 149206 148886 148806 149240 149802 150158 150089 149263 147788 146512 146010 145800 145290 144775 144616 144241 142999
54676 142999 141384 140305 139732 139098 138471 138278 138403 138603 139221 140432 141388 141231 140412 139855 139443 138609 137867 138310
54658 138310 139803 141063 141393 141189 140836 140314 139900 140129 140904 141496 141534 141291 141049 140854 140780 140868 140965 141102 141694
54639A41694J169J156O52M01M00j2o47n70J11J70o44j018j50J057J497J183N07
54622A46956l59q67k96Q94J203K34p54q69o68o53k48Q21J561J119P3n28m76j37
54604A47006J52Np26j272p10M14N68m73j316j160o78l07M63J555J847J027K73
54587A46668K98L42j38m71l23n40j382j579l14J322J973J760J330N96m64j016
54571A48062o31j56l43p14o97o12o57k73N44P55L7l59L81J222J100O23O63O94
54553A49639K2o20k38O94J131J106J109Q38m4p77m88L83Q50Q18O79L94K8K61J306
54534A57091K182K134J680J322M58j150k152j410K8L30n43j239j152p08j08O97
54518A57460J269J179P29K34o95k077k753j906n70k13p11j014r67r73o48M83J581
$$ plain form
54639 141694 142863 144019 144671 145072 145472 145460 144813 144243 144354 144524 143880 142862 142712 143769 145266 146449 146956
54622 146956 146597 145730 145434 146328 147531 147765 147011 146142 145474 144821 144573 145394 146955 148074 148147 147619 147143 147006
54604 147006 147158 147163 146437 145165 144455 144869 145437 144964 143648 142488 141810 141503 141966 143521 145368 146395 146668
54587 146668 146966 147308 147170 146699 146376 145836 144454 142875 142561 143883 145856 147616 148946 149542 149078 148062
54571 148062 147431 147275 146932 146218 145521 144909 144252 143979 144523 145278 145315 144956 145337 146559 147659 148282 148945 149639
54553 149639 149661 149041 148803 149497 150628 151734 152843 153681 153637 152860 152372 152755 153605 154423 155102 155496 155524 155785 157091
54534 157091 159273 161407 163087 164409 164867 163717 161565 160155 160183 160513 159970 158731 157579 156871 156763 157460
54518 157460 158729 159908 160637 160871 160176 158099 155346 153440 152870 152657 151946 150932 149965 148992 148344 148827 150408
54501A50408J398K06o93q95q76n82L48J257J067J07j89N36J066M55q14j665j530
54484A49604n34O43J125P28K71M63R43J069J002J130J127O02O1J52M85M08K93
54467A59572P92J364J015N2l03O2J16l95m56M67J491J575Q44J41k6K48N99P28
54449A67886O05L82P2l92p23m70J27K12m04q72p04n94j117j605j257m67n8P2M03
54430A61096O55L94J13M88J072J006M59J50r4q72j612r90R95K719K928J979R29
54413A71415L05J3j86l98m31m2M45K36p14j252m82Q84J528J291J027J146J285
54396A76070J112N40m82j620j929q83O91J543J464J106Q47O92Q07J169J136L02
54380A82565o43q53o81j011j653j637q21j18r0l83n43n37m27j65L02J042K052
$$ plain form
54501 150408 151806 152012 151319 150424 149548 148966 149314 150571 151638 151745 151556 152092 153158 153613 152799 151134 149604
54484 149604 149070 149713 150838 151566 151837 152300 153243 154312 155314 156444 157571 158173 158234 158386 158871 159279 159572
54467 159572 160364 161728 162743 162795 162492 162554 162670 162275 161819 162286 163777 165352 166196 166337 166311 166559 167158 167886
54449 167886 168491 168873 168945 168553 167830 167360 167487 167699 167295 166423 165719 165125 164008 162403 161146 160679 160621 160693 161096
54430 161096 161751 162145 162258 162746 163818 164824 165283 165433 165339 164467 162855 161865 162860 165579 168507 170486 171415
54413 171415 171720 171733 171547 171149 170718 170676 171121 171357 170643 169391 168909 169793 171321 172612 173639 174785 176070
54396 176070 177182 177722 177240 175620 173691 172808 173499 175042 176506 177612 178459 179151 179958 181127 182263 182565
54380 182565 181922 181069 180388 179377 177724 176087 175266 175148 175058 174675 174132 173595 173168 173003 173305 174347 176399
54363A76399K787K406J039K4K56J044J443J752K594L374L074K052J673K401L532
54348B05850M424M824M237K379J57j031j027j002j785l015l918m092l610k992
54334A99399k915l378l473k642j580j152j160r58o17m17M1J023J674J121L0l44
54318A84652j12l17j027j355j104q70p06j55M57K58o17j110r04o94p31m59J99
54301A75405M87P0m39m86k35j1J77L49N12Q01J072O91m79j399j128l18k50q30
54283A73989r23l27J02J71O84J815K570K216J170J27p35j406j752j704j213j02
54267A74682J348K065J376J98qQ17J518J499J146P34K66J28O92J379J324P78N97
54250A90539O74K69l83l60J43l1r99j581j237p34n89l87L2J08l06o51p58j066
$$ plain form
54363 176399 179186 181592 182631 182655 182911 183955 185398 187150 189744 193118 196192 198244 199917 202318 205850
54348 205850 210274 215098 219335 221714 221871 220840 219813 218811 217026 214011 210093 206001 202391 199399
54334 199399 196484 193106 189633 186991 185411 184259 183099 182141 181524 181107 181148 182171 183845 184966 184996 184652
54318 184652 184540 184223 183196 181841 180737 179867 179161 179006 179463 179721 179104 177994 177090 176396 175665 175206 175405
54301 175405 175892 175962 175523 175037 174802 174791 174968 175317 175829 176630 177702 178393 177914 176515 175387 175069 174819 173989
54283 173989 173066 172739 172841 173012 173696 175511 178081 180297 181467 181594 180859 179453 177701 175997 174784 174682
54267 174682 176030 178095 179471 179669 179661 180478 181996 183495 184641 185375 185641 185769 186461 187840 189164 189942 190539
54250 190539 191213 191482 191099 190739 190882 190851 189852 188271 187034 186300 185711 185324 185356 185464 185158 184507 183749 182683
54232A82683j383q92L10R67M61l62n94l34L5M81Q08O24K58O35J755K429J975J102
54214A90958O73N40K73J2jK0j81m70o95r46j215j426j784k443k859k315j042k8
54196A77071K31pm90j036j081k99N52N06m1O3P74R43K59l45l62l28o30j021j427
54177A73332j915j869o05J103J702J083O37R83J326J243J249J275M54j005j635
54162A77358j016n27j000j441r72l15k50j81N19J126Q25J65Q4M15M80L08K81L24
54144A76183L00L83M65K0q50j216p20p5L00Q34J455J192o5q03pJ300J692J312
54126A81700R89O30j75q68o72P4N85R09J435J767J354O83O83J254J490J069M73
54109A93380P8j62k70j67J9P8l0k32l76j10P24J506J350L02o92j056r69n17L85
$$ plain form
54232 182683 181300 180408 180718 181685 182146 181784 181190 180856 180891 181372 182180 182804 183062 183697 185452 187881 189856 190958
54214 190958 191631 192171 192444 192456 192455 192475 192294 191824 191129 190183 188968 187542 185758 183315 180456 178141 177099 177071
54196 177071 177302 177295 176805 175769 174688 174389 174941 175447 175406 175469 176243 177186 177445 177100 176738 176410 175780 174759 173332
54177 173332 171417 169548 168943 170046 171748 172831 173468 174451 175777 177020 178269 179544 179998 178993 177358
54162 177358 176342 175815 174815 173374 172402 172087 171837 171656 172175 173301 174126 174291 174375 174790 175270 175578 175859 176183
54144 176183 176483 176866 177331 177351 176501 175285 174565 174490 174790 175624 177079 178271 178206 177403 177396 178696 180388 181700
54126 181700 182689 183319 183144 182276 181604 181678 182263 183172 184607 186374 187728 188411 189094 190348 191838 192907 193380
54109 193380 193458 193296 193026 192859 192878 192956 192926 192694 192318 192208 192932 194438 195788 196090 195398 194342 193373 192856 193241
54090A93241J214J196O93Q30J570J615O18j67pK34PL12J831L381L632L177L475
54073B16852M770O371Q032R682J0470R410O548K650j650n567p950q371p707o893
54059B36647n828m361l229l028l112k578j635j000p60o53o82o30J08J365J983
54044B12607J524J090J490J927J620J381K149L257L688L907M789N720N660N217
54030B56026N742O898P089N962M724M124L759L323L052K884K534K322K755L374
54016C14568L208K322J755J903K057J530M17p34j259o72O35J353O39q83k181l145
54000C21513m073m721m959n544o889p870p268n831n286n783n916n036l905l118
53986B45314k433j751j396j258q32k93m14j258j990k127k043k082k028j651j043
$$ plain form
54090 193241 194455 195651 196344 197174 198744 200359 200977 200810 200803 201037 201044 201356 203187 206568 210200 213377 216852
54073 216852 221622 227993 236025 245707 256177 265587 272135 274785 273135 267568 259618 251247 243540 236647
54059 236647 230819 226458 223229 220201 217089 214511 212876 211876 211116 210463 209781 209151 209259 210624 212607
54044 212607 214131 215221 216711 218638 220258 221639 223788 227045 230733 234640 239429 245149 250809 256026
54030 256026 261768 268666 275755 281717 286441 290565 294324 297647 300699 303583 306117 308439 311194 314568
54016 314568 317776 320098 321853 323756 325813 327343 327760 327026 325767 325095 325730 327083 327722 326839 324658 321513
54000 321513 317440 312719 307760 302216 295327 287457 280189 274358 269072 263289 257373 252337 248432 245314
53986 245314 242881 241130 239734 238476 237644 237351 236937 235679 233689 231562 229519 227437 225409 223758 222715
53971B22715l97R3K21J23K28M30L4q96j095k5Q86K39j019r63L86J402J585J922
53953B25869K592K468J274L49O36J482K054K527L150L388K903K391K579L159L406
53938B60227L372L718M752O095P146P610P729P972Q408Q635Q545Q742R766J1449
53924C64166J3703J7111K1665K5301K5029J9641J0565L60q636j4540j6301j4459
53912D43605j0832p187m456k866k036j131L11J700K129J512M14p93j852k281k038
53897D14199j981k693l385l094k370k464l308l839l961m551n663o389o609p165
53883C56727q013p911o459n060m948n529n506m724m025l865l915l692l104k503
53869B87473k396k935l683m185m449m517l994k679j291p44j017j493k043k847
$$ plain form
53971 222715 222318 222411 222632 222755 222983 223413 223447 222551 221456 221431 222317 222556 221537 220574 220960 222362 223947 225869
53953 225869 228461 230929 232203 232552 233188 234670 236724 239251 242401 245789 248692 251083 253662 256821 260227
53938 260227 263599 267317 272069 278164 285310 292920 300649 308621 317029 325664 334209 342951 352717 364166
53924 364166 377869 394980 416645 441946 466975 486616 497181 497541 488905 474365 458064 443605
53912 443605 432773 425586 421130 418264 416228 415097 415408 417108 419237 420749 421163 420370 418518 416237 414199
53897 414199 412218 409525 406140 403046 400676 398212 394904 391065 387104 382553 376890 370501 363892 356727
53883 356727 348714 340803 334344 329284 324336 318807 313301 308577 304552 300687 296772 293080 289976 287473
53869 287473 285077 282142 278459 274274 269825 265308 261314 258635 257344 256600 255583 254090 252047 249200
53855B49200l545l576l134k804k529j931j274j026q07k5Q01O80j96o99n45l86
53839B28204l71q2K69J07j31M81J464J368K32k75M75J189R61N85P00M48q21k042
53821B32761j947r60k74n7K93Q34J226J551J980K123J602R26R10J582K241K378
53805B47169K092J886K277L244L982L795L240L485M473M804L833K717K726L532
53791B93255M009L913L840M037M139L808L030J989J114Q75J151J157L77q49j939
53776C23906k822l699m479m869m815m483m046l593l106k540k100k223k930l485
53762B74716l273k717k670l189l651l749l506k672j183j1k73j520k174j719j174
53747B41235j199j121l51N19O63J67l99p32p18l30O4mk89j14M79Q08Q25J159J792
$$ plain form
53855 249200 245655 242079 238945 236141 233612 231681 230407 229381 228574 228549 229350 230030 229834 229135 228590 228204
53839 228204 227833 227751 228020 228127 227996 228477 229941 231309 231541 231266 231741 232930 233891 234476 235176 235624 234803 232761
53821 232761 230814 229854 229580 229523 229816 230650 231876 233427 235407 237530 239132 240058 240968 242550 244791 247169
53805 247169 249261 251147 253424 256668 260650 264445 267685 271170 275643 280447 284280 286997 289723 293255
53791 293255 297264 301177 305017 309054 313193 317001 320031 322020 323134 324009 325160 326317 326694 325845 323906
53776 323906 321084 317385 312906 308037 303222 298739 294693 291100 287994 285454 283354 281131 278201 274716
53762 274716 271443 268726 266056 262867 259216 255467 251961 249289 248106 248095 247822 246302 244128 242409 241235
53747 241235 240036 238915 238564 239083 239746 239913 239514 238782 238064 237734 237798 237794 237505 237391 237870 238678 239503 240662 242454
53728B42454J883J195M78R1l98r21o44M31J080P58N38J229J881J283q4q22m62
53711B49970M52J444K235K469K273K477L422M148L659K404J611J627J848J925
53697B81964K170K895M074N382O261O204N403M686M443M140L274K146J246M78
53683C34766m31j227j444j060m78j19l08j029j658j510q15n37j059j771k047j869
53667C17404j320m44K14r1j113j697j360p72m40r5K21k14j443k259j803o70J87
53650C04305O44Q29M83k89o65k71K37M87J085K215K804K105R87N68O01M08L46
53633C16879R94J717J506O11Q2K01N64J089J832K272J981J533J672K126K291K470
53617C39820L254M208M449M118M024M190M047L754M000M707N107N075N237N767
$$ plain form
53728 242454 244337 245532 246010 246101 245703 244782 244138 244569 245649 246407 246945 248174 250055 251338 251254 250432 249970
53711 249970 250422 251866 254101 256570 258843 261320 264742 268890 272549 274953 276564 278191 280039 281964
53697 281964 284134 287029 291103 296485 302746 308950 314353 319039 323482 327622 330896 333042 334288 334766
53683 334766 334335 333108 331664 330604 330126 330007 329699 328670 327012 325502 324687 324150 323091 321320 319273 317404
53667 317404 316084 315640 315854 315763 314650 312953 311593 310821 310381 310286 310507 310293 308850 306591 304788 304118 304305
53650 304305 304949 305778 306261 305972 305307 305036 305273 305760 306845 309060 311864 313969 314956 315524 316125 316533 316879
53633 316879 317873 319590 321096 321707 321789 321990 322554 323643 325475 327747 329728 331261 332933 335059 337350 339820
53617 339820 343074 347282 351731 355849 359873 364063 368110 371864 375864 380571 385678 390753 395990 401757
53603D01757O195O395O762P265P330O828O300O007N431M043K059K20q84j263j517
53588D62928k231l219l704l363k718k285k040j962k283k751k543j576r73j476
53574D29804k237k056j066k20J46J70l43j493k571k825k524k270j842p63N34J247
53558D11691J435J624J630J012K03L2L68N05N26J036J799J924J345R06R48R88
53542D27972Q11P47Q01N86L20Q29K313L930M848N085N189N646O596P595P813P066
53526D88147O408O960Q376R355R477R571J0346J1569J2712J3635J4360J4796J4926
53513F30638J5017J5563J7000J9197K1148K1845K1694K2230K3946K5464K5605
53502H59347K5171K5500K6247K6035K4707K3398K2714K2244K1718K1326K0998
$$ plain form
53603 401757 407952 414347 421109 428374 435704 442532 448832 454839 460270 464313 466372 466592 465708 464445 462928
53588 462928 460697 457478 453774 450411 447693 445408 443368 441406 439123 436372 433829 432253 431280 429804
53574 429804 427567 425511 424445 424225 424371 424541 424198 422705 420134 417309 414785 412515 410673 409910 410444 411691
53558 411691 413126 414750 416380 417392 417595 417627 417995 418500 419026 420062 421861 423785 425130 426036 426984 427972
53542 427972 428783 429530 430331 430917 431237 432066 434379 438309 443157 448242 453431 459077 465673 473268 481081 488147
53526 488147 494555 501515 509891 519246 528723 538294 548640 560209 572921 586556 600916 615712 630638
53513 630638 645655 661218 678218 697415 718563 740408 762102 784332 808278 833742 859347
53502 859347 884518 910018 936265 962300 987007 1010405 1033119 1055363 1077081 1098407 1119405
53491A119405K0523K0236K0558K0995K0763K0115J9914K0094J9826J8990J8270
53480A339689J7854J7345J6888J7146J8056J8767J8855J8540J7767J6188J4035
53469A531130J1895R658O864L899J565m14l133o698j0132j2972j5517j7417j7718
53456A481010j6649j5772j5822j5933j5544j5595j6959j8959k0396k1043k1331
53445A287007k1412k1339k1362k1396k0899j9802j8761j8024j6893j4861j2376
53434A079882j0009p730n602m257l952l906l307k293j296j30J520L360M913O240
53420A053433P603Q905R990J1119J2512J3894J5009J6175J7809J9759K1671K3550
53408A231429K5504K7236K8346K8951K9575L0608L2156L4126L6196L7999L9598
$$ plain form
53491 1119405 1139928 1160164 1180722 1201717 1222480 1242595 1262509 1282603 1302429 1321419 1339689
53480 1339689 1357543 1374888 1391776 1408922 1426978 1445745 1464600 1483140 1500907 1517095 1531130
53469 1531130 1543025 1552683 1559547 1563446 1565011 1564597 1561464 1554766 1544634 1531662 1516145 1498728 1481010
53456 1481010 1464361 1448589 1432767 1416834 1401290 1385695 1368736 1349777 1329381 1308338 1287007
53445 1287007 1265595 1244256 1222894 1201498 1180599 1160797 1142036 1124012 1107119 1092258 1079882
53434 1079882 1069873 1062143 1056541 1052284 1048332 1044426 1041119 1038826 1037530 1037400 1038920 1042280 1047193 1053433
53420 1053433 1061036 1069941 1079931 1091050 1103562 1117456 1132465 1148640 1166449 1186208 1207879 1231429
53408 1231429 1256933 1284169 1312515 1341466 1371041 1401649 1433805 1467931 1504127 1542126 1581724
53397A581724M1538M4167M7122M9722N1626N2951N3990N4977N5957N6795N7471
53386B148040N8173N8926N9343N9089N8348N7338N5699N3030M9814M7013M4798
53375B749611M2456L9544L6262L2657K8323K3243J8164J3714R610N111k18o325
53363B992152j2958j9867k7008l4426m1718m7913n2352n5373n7618n9008n9191
53352B524720n8577n7911n7079n5355n2771n0189m8004m5852m3715m2227m1717
53341A971323m1888m2551m3647m4421m3751m1630l9300l7511l5760l3579l1471
53330A535814k9869k8165k5625k2515j9607j7108j4825j2990j2253j2917j4514
53319A325426j6014j6483j5796j4673j3723j2730j1383j0157r596r142p770n568
$$ plain form
53397 1581724 1623262 1667429 1714551 1764273 1815899 1868850 1922840 1977817 2033774 2090569 2148040
53386 2148040 2206213 2265139 2324482 2383571 2441919 2499257 2554956 2607986 2657800 2704813 2749611
53375 2749611 2792067 2831611 2867873 2900530 2928853 2952096 2970260 2983974 2993584 2998695 2998477 2992152
53363 2992152 2979194 2959327 2932319 2897893 2856175 2808262 2755910 2700537 2642919 2583911 2524720
53352 2524720 2466143 2408232 2351153 2295798 2243027 2192838 2144834 2098982 2055267 2013040 1971323
53341 1971323 1929435 1886884 1843237 1798816 1755065 1713435 1674135 1636624 1600864 1567285 1535814
53330 1535814 1505945 1477780 1452155 1429640 1410033 1392925 1378100 1365110 1352857 1339940 1325426
53319 1325426 1309412 1292929 1277133 1262460 1248737 1236007 1224624 1214467 1204871 1195729 1187959 1182391
53307A182391l525j954l98J004J632J933L202N469P266Q047R172J1673J4521J6367
53293A256800J7601J9455K1949K4077K5394K6278K7104K8038K9186L0160L0032
53282A536074K8450K6297K4568K3213K1725K0177J8904J7653J5821J3115R414
53271A755411M635o27n010p723r494j1477j3786j5873j7723j9822k2262k4665
53259A611584k6756k8385k9290k9439k9331k9460k9833l0356l1109l1804l1641
53248A284180l0323k8707k7770k7456k7081k6378k5563k4836k4449k4759k5600
53237I91258k6161k5954k5438k5070k4504k3336k1974k0899j9679j7666j5194
53226G45383j3140j1609j0072q510p545p469p943q632r509j0565j1715j2952j4129
$$ plain form
53307 1182391 1178866 1176912 1176514 1177518 1179150 1181083 1184285 1189754 1197020 1205067 1214239 1225912 1240433 1256800
53293 1256800 1274401 1293856 1315805 1339882 1365276 1391554 1418658 1446696 1475882 1506042 1536074
53282 1536074 1564524 1590821 1615389 1638602 1660327 1680504 1699408 1717061 1732882 1745997 1755411
53271 1755411 1760046 1759419 1754409 1746686 1737192 1725715 1711929 1696056 1678333 1658511 1636249 1611584
53259 1611584 1584828 1556443 1527153 1497714 1468383 1438923 1409090 1378734 1347625 1315821 1284180
53248 1284180 1253857 1225150 1197380 1169924 1142843 1116465 1090902 1066066 1041617 1016858 991258
53237 991258 965097 939143 913705 888635 864131 840795 818821 797922 778243 760577 745383
53226 745383 732243 720634 710562 702052 694507 687038 679095 670463 660954 650389 638674 625722 611593
53213F11593j4806j4714j4211j3882j3905j4082j4105j3524j1920r602p693o978
53201D62171p035o933o403n790n345n197n597o555p469p706p318o790o355n989
53187C71689n701n397m862m268m174m612m733l907k697k008j838j573j163j171
53173C23585j828k723l305l259k535j488q07q63j334j675j698j435r08l51k04
53158B99172n04p74p88r25j388j732j602j313j255j271j115r05o65j18N65N81
53142B85963l28j298j555j414j329r01J99J147R46Ll99J49R98J630K021K068J684
53125B89584J255J222J369J211Q07M56O8m01l58O37J891K321J902J399J024M44
53109C04831j87l19q6k19q34j282j302j367j779k227k442k593k825k974k837k310
$$ plain form
53213 611593 596787 582073 567862 553980 540075 525993 511888 498364 486444 476842 469149 462171
53201 462171 455136 448203 441800 436010 430665 425468 419871 413316 405847 398141 390823 384033 377678 371689
53187 371689 365988 360591 355729 351461 347287 342675 337942 334035 331338 329330 327492 325919 324756 323585
53173 323585 321757 319034 315729 312470 309935 308447 307640 306777 305443 303768 302070 300635 299727 299376 299172
53158 299172 298668 297894 297106 296181 294793 293061 291459 290146 288891 287620 286505 285600 284935 284817 285382 285963
53142 285963 285635 284337 282782 281368 280039 279138 279337 280484 281430 281433 281034 281183 282181 283811 285832 287900 289584
53125 289584 290839 292061 293430 294641 295448 295904 295972 295571 295213 295850 297741 300062 301964 303363 304387 304831
53109 304831 304644 304325 304239 304020 303186 301904 300602 299235 297456 295229 292787 290194 287369 284395 281558 279248
53093B79248j311o5P16N40j47m99l75l26o05r21j004q37l81L05Q05O98J38l58
53075B75621m81j59O36J567J876J258L85J0q2m52r01q33l65j72m49q78j433k285
53057B72863l036k898j714j96P77P29j57r51n45J003K277K230J461J001P61K50
53041B73855o2M72J146P72l23q28o69r53j727j744p32o0m60p80R3J406J712Q92
53023B72010n1m97n77m88k94j13J3J81L34K90K66P92J834K601K489J779J082O61
53005B82312N63Q70J433J770J511O91m61j606k184j797q46k22k69n56o97p42o20
52988B79150J9J107J923J917J352Q29N78M83M37M32N52R98J834K656K945K712
52972B99924K421K255K010J645J421J361J108M87j96n47m48OO05J037J140J102
$$ plain form
53093 279248 277937 277872 278588 279128 278981 278482 278107 277781 277176 276255 275251 274414 274033 274338 275143 275841 275979 275621
53075 275621 275140 274981 275617 277184 279060 280318 280703 280713 280631 280179 279278 278445 278080 277908 277459 276581 275148 272863
53057 272863 269827 266929 265215 265019 265796 266525 266368 265417 264872 265875 268152 270382 271843 272844 273605 273855
53041 273855 273793 274265 275411 276183 275860 275032 274363 273410 271683 269939 269207 269147 268687 267907 268000 269406 271118 272010
53023 272010 271959 271462 270885 270397 270103 269990 270003 270184 270518 270808 271074 271866 273700 276301 278790 280569 281651 282312
53005 282312 282875 283745 285178 286948 288459 289150 288689 287083 284899 283102 282256 282034 281765 281209 280512 279770 279150
52988 279150 279169 280276 282199 284116 285468 286297 286875 287358 287795 288227 288779 289777 291611 294267 297212 299924
52972 299924 302345 304600 306610 308255 309676 311037 312145 312632 312436 311889 311441 311447 312052 313089 314229 315331
52956C15331J062P38j69j368k240k580k611k442k058j710j744k045k147j792j087
52941B93138k64L12K49k80n24j96n1o95j466j386p17m42o27n33j35j97p72q58
52923B84556M3J145J433P59l55j266j453r01l08k43k75K91J076J107M22J0J34
52906B86175J09k21j35M71O06k20j126j219q39o98p51o24m33m59n94o71p92q83
52888B77696m59P11K083K870K668J489j79j273r34L15R36K30q65j121m38M55R80
52871B85164R85O20L23M20O51N83N23J178K418L237L124K630K361K310K306K194
52855C11027J448k95k110k503j611j304k501l760l451k059j230j496k190k877
52841B85088l588m054l831l081k417k091j968j957j955j655r63k84N6L34R19J653
$$ plain form
52956 315331 316393 317131 316962 315594 313354 310774 308163 305721 303663 301953 300209 298164 296017 294225 293138
52941 293138 292874 293186 293435 293155 292631 292435 292384 291689 290223 288837 288120 287678 287051 286518 286383 286186 285414 284556
52923 284556 284599 285744 287177 287936 287581 286315 284862 283961 283653 283410 283135 283426 284502 285609 286031 286041 286175
52906 286175 286284 286063 285928 286399 287005 286785 285659 284440 283601 282903 282152 281528 281095 280636 280042 279371 278579 277696
52888 277696 277237 277948 280031 282901 285569 287058 286879 285606 284672 284987 285923 286153 285288 284167 283729 284184 285164
52871 285164 286149 286769 287092 287512 288163 288746 289269 290447 292865 296102 299226 301856 304217 306527 308833 311027
52855 311027 312475 312180 310070 307567 305956 304652 302151 298391 294940 292881 291651 290155 287965 285088
52841 285088 281500 277446 273615 270534 268117 266026 264058 262101 260146 258491 257528 257244 257300 257634 258553 260206
52825B60206K181K419K332J700N71m96j084j347j419j006l9P87P57N8n24m87J92
52808B64801J307K427L050L106K970K713J866K63j451k484k694k402j940j599
52794B69933j557j568j240p96r29j711k373k348j795r38K14J266J580J411J789
52779B60938K765K934J516k16n50M35J334J386Q98K57m00q07p88o83q31r53o45
52762B66590j44K2j80m89r29j556j940j580o11M06J145J558J616J431J280J170
52746B67789Q19L97N78J469K139J839J003N54P50J317K087K780K807J991J003
52731B89322M63J42l17n30pQ72J388J506J602J529Q89q0o48n41j91j98q63j925
52713B92413k500j840m91J00n38j300j280j099j538j994j488m27L6j52r5L47M77
$$ plain form
52825 260206 262387 264806 267138 268838 269409 268913 267829 266482 265063 264057 264018 264805 265562 265620 265096 264609 264801
52808 264801 266108 268535 271585 274691 277661 280374 282240 282503 281052 278568 275874 273472 271532 269933
52794 269933 268376 266808 265568 264772 263843 262132 259759 257411 255616 254678 254892 256158 257738 259149 260938
52779 260938 263703 266637 268153 267937 267387 267822 269156 270542 271440 271697 271297 270490 269702 269019 268188 267235 266590
52762 266590 266446 266468 266288 265799 264870 263314 261374 259794 259183 259589 260734 262292 263908 265339 266619 267789
52746 267789 268608 269005 269583 271052 273191 275030 276033 276587 277337 278654 280741 283521 286328 288319 289322
52731 289322 289785 289927 289610 289080 289073 289945 291333 292839 294441 295970 296859 296779 296131 295590 295399 295201 294338 292413
52713 292413 289913 288073 287582 287682 287144 285844 284564 283465 281927 279933 278445 278018 278054 277902 277807 278154 278631
52696B78631K37M34J257J832J556R75Q24R32O09k23p80l15Q83J614J151K16N5
52679B89888P13J078O43R0j37n91j495j941j294m25l73p53o74l71n92j032q01
52662B81933l1M05M15N98Q75O03q1k79K29P78J033J428K250L252M128M535L814
52645C05885J742n82j699j608j535j933j964j113o4M38M88L47k05j206j945j706
52629B93340o50N52J524K289K855L095K860K044O84r34k375l257l322k593j607
52614B94505j088j112j010m19R2m5l96j15P86J455J275M29m23o44r5O09P20M53
52596B94977P28J525J570L14q99o18O12J206Q21L69L23L41L04M27N54M11L48P67
52578C04080J196J016P09J092J686J283K8o27q5O51O00m0o61j037j102q38o10
$$ plain form
52696 278631 278868 279302 280559 282391 283947 284922 285746 286678 287287 287064 286284 285969 286852 288466 289617 289833 289888
52679 289888 290601 291679 292322 292412 292275 291684 290189 288248 286954 286529 286156 285403 284729 284358 283766 282734 281933
52662 281933 281902 282307 282722 283320 284195 284798 284717 284438 284667 285445 286478 287906 290156 293408 297536 302071 305885
52645 305885 307627 307045 305346 303738 302203 300270 298306 297193 297129 297567 298055 298402 298197 296991 295046 293340
52629 293340 292690 293242 294766 297055 299910 303005 305865 307909 308593 307659 305284 302027 298705 296112 294505
52614 294505 293417 292305 291295 290876 290968 290923 290527 290412 291198 292653 293928 294357 293934 293290 293195 293804 294524 294977
52596 294977 295705 297230 298800 299114 298215 297597 298209 299415 300236 300605 300928 301269 301573 302000 302554 302965 303313 304080
52578 304080 305276 306292 307001 308093 309779 311062 311090 310463 310378 311029 311629 311589 310928 309891 308789 307951 307341
52561C07341q12j084p38O0M79K78q1m91j238k057k264j925j788j957j706p46L44
52544B91615J111J667J954J602P16r7n96j021j322j173p70n98m93R7R70J368J264
52527B96294J323J684J879J873J984J892J118L00N08J257R39n43j411p25L19N55
52511C09246O36J569K865L412L226L210L777M516M761L917J916l66j806k424l209
52496C35246m364m971m654m275m326m006k704j250p01q01o68k53j73n79j034j031
52480B99456k61J150K382K581K022J718J741J107l24j258q76k3L46O17J390K118
52464C13886K095J841K238L073L624L989M594M899L927J832k10j482k274l065
52450C38967l985m869n300m819l622k640k414k400j903j140p47p68q27q41q80
$$ plain form
52561 307341 306529 305445 304707 304767 305246 305524 305443 304952 303714 301657 299393 297468 295680 293723 292017 291271 291615
52544 291615 292726 294393 296347 297949 298665 298568 297972 296951 295629 294456 293686 293088 292595 292692 293662 295030 296294
52527 296294 297617 299301 301180 303053 305037 306929 308047 308347 308855 310112 311051 310508 309097 308372 308691 309246
52511 309246 309882 311451 314316 317728 320954 324164 327941 332457 337218 341135 343051 342685 340879 338455 335246
52496 335246 330882 325911 321257 316982 312656 308650 305946 304696 303995 303194 302526 302273 302100 301521 300487 299456
52480 299456 299195 300345 302727 305308 307330 309048 310789 311896 311572 310314 309438 309415 309761 310378 311768 313886
52464 313886 315981 317822 320060 323133 326757 330746 335340 340239 344166 345998 345788 344306 342032 338967
52450 338967 334982 330113 324813 319994 316372 313732 311318 308918 307015 305875 305128 304360 303533 302692 301812
52435C01812p81n40n67r31q96N7J244J613J087L85p2l20l66k46l15p50j067o95
52417B98652K47J171J723J803J425R99J231K233L275L895M522N475O204O320O681
52402C45856Q362J1084J3501J4632J4105J1592P046J358m135q615j1620j2520
52390C90646j1199q915p338o729n992m502k903j998j682j290m47O18J270J007
52376C40546Q7m84K6J299K531L407M142M871N638O598P599P794O419L845J316
52361C95634l50j253j746j911j657r88m3Q07J093P13J43r0N0L57P39J077J048
52344C93623N53Q7K02Q33J496J974K486L253M145M731M641M140M141N260O904
52329D38469P954Q264Q699R668J0564J0980J1485J2722J4493J6163J7255J7360
$$ plain form
52435 301812 301031 300491 299924 298993 298097 298154 299398 301011 302098 302483 302411 302091 301725 301479 301164 300414 299347 298652
52417 298652 298899 300070 301793 303596 305021 306020 307251 309484 312759 316654 321176 326651 332855 339175 345856
52402 345856 354218 365302 378803 393435 407540 419132 426178 427536 423401 414786 403166 390646
52390 390646 379447 370532 363194 356465 350473 345971 343068 341070 339388 338098 337651 338269 339539 340546
52376 340546 340633 340149 340175 341474 344005 347412 351554 356425 362063 368661 376260 384054 390473 394318 395634
52361 395634 395284 394031 392285 390374 388717 387729 387686 388493 389586 390299 390442 390352 390402 390759 391498 392575 393623
52344 393623 394176 394263 394465 395298 396794 398768 401254 404507 408652 413383 418024 422164 426305 431565 438469
52329 438469 446423 454687 463386 473054 483618 494598 506083 518805 533298 549461 566716 584076
52317E84076J6374J5203J5167J6135J6393J5070J3561J3621J5112J6728J7991
52306G55431J9208K0188K0411K0056J9685J9288J8691J8493J9374K0755K1304
52295I72884K0567J9061J7006J4092J0528P173M535K413N25j188k805m268n174
52282A055349n381n546o293p107o935n720m481l933l791l444k603j332NR50J560
52267A001298K574M385O299P433P940Q557R324R685R637R835J0659J1884J3210
52254A112720J4507J5657J6706J7917J9120J9515J8701J7391J6317J4991J2492
52243A296034R055N866L575J949O79l92j612l085m198m459m454n059o049o588
52229A281262o689p047p650p840p628p714q191q340p829p107o546o044n464m655
$$ plain form
52317 584076 600450 615653 630820 646955 663348 678418 691979 705600 720712 737440 755431
52306 755431 774639 794827 815238 835294 854979 874267 892958 911451 930825 951580 972884
52295 972884 993451 1012512 1029518 1043610 1054138 1061311 1065846 1068259 1068784 1067596 1064791 1060523 1055349
52282 1055349 1049968 1044422 1038129 1031022 1024087 1018367 1013886 1009953 1006162 1002718 1000115 998783 998788 999738 1001298
52267 1001298 1003872 1008257 1014556 1021989 1029929 1038486 1047810 1057495 1067132 1076967 1087626 1099510 1112720
52254 1112720 1127227 1142884 1159590 1177507 1196627 1216142 1234843 1252234 1268551 1283542 1296034
52243 1296034 1305089 1310955 1314530 1316479 1317158 1316766 1315154 1312069 1307871 1303412 1298958 1293899 1287850 1281262
52229 1281262 1274573 1267526 1259876 1252036 1244408 1236694 1228503 1220163 1212334 1205227 1198681 1192637 1187173 1182518
52215A182518l289j490k94m02p99J57K514M807O155O925P398P313O824O550O412
52200A231299N703M515L900M348N301O326P507Q532Q722Q262Q124Q445Q316P465
52186A326765O715O305N245L067P81p41k109m177o584q473r721j0534j0692j0100
52172A285747r401r103q799p983o994o315n658m547l279k425j818q76M24J576
52158A220549K277K558K476K176J912J662J041j5r59j333j291j121p61k02K50
52143A229219M60O97J054J170Q58L83j62j064k214k919k898k706k653k120o38
52128A216467J187K568L788N672Q378J1398J4371J7130J9390K1047K2475K3868
52116A367739K4746K4737K4440K4659K5142K4896K3587K1869K0351J9025J7732
$$ plain form
52215 1182518 1179229 1177739 1177445 1177043 1176244 1176401 1178915 1183722 1189877 1196802 1204200 1211513 1218337 1224887 1231299
52200 1231299 1237002 1241517 1245417 1249765 1255066 1261392 1268899 1277431 1286153 1294415 1302539 1310984 1319300 1326765
52186 1326765 1333480 1339785 1345030 1348097 1348878 1348137 1346028 1341851 1335267 1326794 1317073 1306539 1295847 1285747
52172 1285747 1276346 1267243 1258444 1250461 1243467 1237152 1231494 1226947 1223668 1221243 1219425 1218549 1218973 1220549
52158 1220549 1222826 1225384 1227860 1230036 1231948 1233610 1234651 1234636 1233677 1232344 1231053 1229932 1229171 1228969 1229219
52143 1229219 1229679 1230376 1231430 1232600 1233458 1233841 1233679 1232615 1230401 1227482 1224584 1221878 1219225 1217105 1216467
52128 1216467 1217654 1220222 1224010 1229682 1238060 1249458 1263829 1280959 1300349 1321396 1343871 1367739
52116 1367739 1392485 1417222 1441662 1466321 1491463 1516359 1539946 1561815 1582166 1601191 1618923
52105A618923J6622J5990J5970J6506J7263J7765J7783J7552J7269J6596J4970
52094A803209J2291R054N795K649p12m762r488j4034j7217j8570j8585j7975j7119
52081A714536j6263j5614j4983j3825j2059j0365r360q869q289p255n684l583
52069A588387j191J073L099N109O971Q126Q525R052J0433J2232J3483J4001J4410
$$ plain form
52105 1618923 1635545 1651535 1667505 1684011 1701274 1719039 1736822 1754374 1771643 1788239 1803209
52094 1803209 1815500 1824554 1830349 1832998 1832286 1827524 1818036 1804002 1786785 1768215 1749630 1731655 1714536
52081 1714536 1698273 1682659 1667676 1653851 1641792 1631427 1622067 1613198 1604909 1597654 1591970 1588387
52069 1588387 1587196 1588269 1591368 1596477 1603448 1611574 1620099 1629151 1639584 1651816 1665299 1679300 1693710
$$ [...]
##END NTUPLES=NMR SPECTRUM
##END=
