
##TITLE=UV1290_M2_1207-1380_90_7534491_v0N7eArwV8
##JCAMPDX= 6.0         $$ Bruker NMR JCAMP-DX V2.0
##DATA TYPE= NMR SPECTRUM
##DATA CLASS= NTUPLES
##ORIGIN= BRUKER
##OWNER= Administrator
$$ 1.72 TOPSPIN		Version 2.1
$$ 2013-02-22 00:50:28.069 -0500  Administrator@X
$$ Compression mode = diff/dup
##.OBSERVE FREQUENCY= 400.02188249412
##.OBSERVE NUCLEUS= ^1H
##.ACQUISITION MODE= SIMULTANEOUS (DQD)
##.ACQUISITION SCHEME= undefined
##.AVERAGES= 8
##.DIGITISER RES= 22
##SPECTROMETER/DATA SYSTEM= spect
##.PULSE SEQUENCE= zg30
##.SOLVENT NAME= COFFEE_meoh
##.SHIFT REFERENCE= INTERNAL, COFFEE_meoh, 1, 14.98509
##AUDIT TRAIL= $$ (NUMBER, WHEN, WHO, WHERE, PROCESS, VERSION, WHAT)
$$ ##TITLE= Audit trail, TOPSPIN		Version 2.1
$$ ##JCAMPDX= 5.01
$$ ##ORIGIN= Bruker BioSpin GmbH
$$ ##OWNER= Administrator
$$ $$ E:\/data/COFFEE/nmr/UV1290_M2_1207-1380_90_7534491_v0N7eArwV8/10/pdata/1/auditp.txt
$$ ##AUDIT TRAIL=  $$ (NUMBER, WHEN, WHO, WHERE, PROCESS, VERSION, WHAT)
(   1,<2013-02-22 00:50:19.725 -0500>,<Administrator>,<X>,<go>,<TOPSPIN 2.1>,
      <created by zg
	started at 2013-02-22 00:49:13.241 -0500,
	POWCHK enabled, PULCHK disabled,
       configuration hash MD5:
       86 BA 57 50 F2 9D 5C 9B 26 00 A9 28 5F 66 2E 89
       data hash MD5: 64K
       B2 21 C0 E3 90 A6 AD 01 CD 8D 02 85 D1 3E 07 6C>)
(   2,<2013-02-22 00:50:22.850 -0500>,<Administrator>,<X>,<proc1d>,<TOPSPIN 2.1>,
      <Start of raw data processing
       efp LB = 0 FT_mod = 6 PKNL = 1 PHC0 = 0 PHC1 = 0 SI = 32K 
       data hash MD5: 32K
       38 01 48 B6 75 5B 08 13 A5 4B F0 D0 1B A2 43 72>)
(   3,<2013-02-22 00:50:23.350 -0500>,<Administrator>,<X>,<proc1d>,<TOPSPIN 2.1>,
      <pk PHC0 = 64.3689 PHC1 = 0 
       data hash MD5: 32K
       81 6B 04 1A 44 6A 8B BE 5E AD 60 7A 97 2E EF 66>)
(   4,<2013-02-22 00:50:23.616 -0500>,<Administrator>,<X>,<proc1d>,<TOPSPIN 2.1>,
      <abs ABSG = 1 
       data hash MD5: 32K
       11 21 8E F0 3B 73 5E A9 A3 B8 56 78 89 41 86 92>)
(   5,<2013-02-22 00:50:23.772 -0500>,<Administrator>,<X>,<proc1d>,<TOPSPIN 2.1>,
      <abs ABSG = 2 
       data hash MD5: 32K
       BA 71 12 DC 0F 41 1A 87 39 4E 3F FD EF 9D B1 81>)
(   6,<2013-02-22 00:50:23.913 -0500>,<Administrator>,<X>,<proc1d>,<TOPSPIN 2.1>,
      <abs ABSG = 3 
       data hash MD5: 32K
       AB 86 F7 A3 5E DC B1 CB 02 6F 48 71 51 21 17 AB>)
(   7,<2013-02-22 00:50:24.069 -0500>,<Administrator>,<X>,<proc1d>,<TOPSPIN 2.1>,
      <abs ABSG = 4 
       data hash MD5: 32K
       FB E3 A4 AC 68 6E CE AC 74 E0 79 F3 00 9E 83 90>)
(   8,<2013-02-22 00:50:24.225 -0500>,<Administrator>,<X>,<proc1d>,<TOPSPIN 2.1>,
      <abs ABSG = 5 
       data hash MD5: 32K
       13 A8 3E 37 DF A5 84 DD F7 0D 8E 7E D6 45 60 A7>)
$$ ##END=
$$ 
$$ $$ hash MD5
$$ $$ 50 5C 8E 6E C0 D6 1D DA 08 0C AB 25 C1 4B ED D3
##$RELAX= 
##$RELAX= 
##$RELAX= 
##$RELAX= 
##$RELAX= 
##$RELAX= 
##$RELAX= 
$$ Bruker specific parameters
$$ --------------------------
##$DU= <E:\>
##$EXPNO= 10
$$ [...]
##$TP= (0..7)
150 150 150 150 150 150 150 150
##$TP07= 0
##$TPNAME0= <>
##$TPNAME1= <>
##$TPNAME2= <>
##$TPNAME3= <>
##$TPNAME4= <>
##$TPNAME5= <>
##$TPNAME6= <>
##$TPNAME7= <>
##$TPOAL= (0..7)
0.5 0.5 0.5 0.5 0.5 0.5 0.5 0.5
##$TPOFFS= (0..7)
0 0 0 0 0 0 0 0
##$TUNHIN= 0
##$TUNHOUT= 0
##$TUNXOUT= 0
##$USERA1= <user>
##$USERA2= <user>
##$USERA3= <user>
##$USERA4= <user>
##$USERA5= <user>
##$V9= 5
##$VALIST= <valist>
##$VCLIST= <CCCCCCCCCCCCCCC>
##$VD= 0
##$VDLIST= <DDDDDDDDDDDDDDD>
##$VPLIST= <PPPPPPPPPPPPPPP>
##$VTLIST= <TTTTTTTTTTTTTTT>
##$WBST= 1024
##$WBSW= 4
##$XGAIN= (0..3)
0 0 0 0
##$XL= 0
##$YL= 0
##$YMAX_a= 540758
##$YMIN_a= -531865
##$ZGOPTNS= <>
##$ZL1= 120
##$ZL2= 120
##$ZL3= 120
##$ZL4= 120
##$ABSF1= 14.98509
##$ABSF2= -5.573092
##$ABSG= 5
##$ABSL= 3
##$ALPHA= 0
##$AQORDER= 0
##$ASSFAC= 0
##$ASSFACI= 0
##$ASSFACX= 0
##$ASSWID= 0
##$AUNMP= <proc_prof1d_extract_pilot.lims>
##$AXLEFT= 0
##$AXNAME= <>
##$AXNUC= <1H>
##$AXRIGHT= 0
##$AXTYPE= 0
##$AXUNIT= <>
##$AZFE= 0.1
##$AZFW= 0.1
##$BCFW= 0
##$BC_mod= 0
##$BYTORDP= 0
##$COROFFS= 0
##$CY= 15
##$DATMOD= 1
##$DC= 0
##$DFILT= <>
##$DTYPP= 0
##$F1P= 0
##$F2P= 0
##$FCOR= 0.5
##$FTSIZE= 32768
##$FT_mod= 6
##$GAMMA= 0
##$GB= 0
##$INTBC= 1
##$INTSCL= 1
##$ISEN= 128
##$LB= 0
##$LEV0= 0
##$LPBIN= 0
##$MAXI= 10000
##$MC2= 0
##$MEAN= 0
##$ME_mod= 0
##$MI= 0
##$NCOEF= 0
##$NC_proc= -8
##$NLEV= 6
##$NOISF1= 0
##$NOISF2= 0
##$NSP= 0
##$NTH_PI= 0
##$NZP= 0
##$OFFSET= 14.98509
##$PC= 1
##$PHC0= 64.3689
##$PHC1= 0
##$PH_mod= 1
##$PKNL= yes
##$PPARMOD= 0
##$PPDIAG= 0
##$PPIPTYP= 0
##$PPMPNUM= 2147483647
##$PPRESOL= 1
##$PSCAL= 4
##$PSIGN= 0
##$PYNMP= <proc.py>
##$REVERSE= no
##$SF= 400.02
##$SI= 32768
##$SIGF1= 0
##$SIGF2= 0
##$SINO= 400
##$SIOLD= 32768
##$SPECTYP= <>
##$SREGLST= <1H.CDCl3>
##$SSB= 0
##$STSI= 32768
##$STSR= 0
##$SW_p= 8223.68421052631
##$SYMM= 0
##$S_DEV= 0
##$TDeff= 65536
##$TDoff= 0
##$TI= <>
##$TILT= no
##$TM1= 0
##$TM2= 0
##$TOPLEV= 0
##$USERP1= <user>
##$USERP2= <user>
##$USERP3= <user>
##$USERP4= <user>
##$USERP5= <user>
##$WDW= 1
##$XDIM= 32768
##$YMAX_p= 470208924
##$YMIN_p= -696830
##$CURPLOT= <Network HP LaserJet P1505>
##$CURPRIN= <$Network HP LaserJet P1505>
##$DFORMAT= <normdp>
##$LAYOUT= <+/1D_H.xwp>
##$LFORMAT= <normlp>
##$PFORMAT= <normpl>
##$SURQMSG= 1
$$ End of Bruker specific parameters
$$ ---------------------------------
##NTUPLES= NMR SPECTRUM
##VAR_NAME=  FREQUENCY,     SPECTRUM/REAL,   SPECTRUM/IMAG
##SYMBOL=    X,             R,               I
##VAR_TYPE=  INDEPENDENT,   DEPENDENT,       DEPENDENT
##VAR_FORM=  AFFN,          ASDF,            ASDF
##VAR_DIM=   32768,         32768,           32768
##UNITS=     HZ,            ARBITRARY UNITS, ARBITRARY UNITS
##FACTOR=    0.250966925370066, 1,           1
##FIRST=     8223.43324360094, -46208,       -110004
##LAST=      0,             89559,           7939
##MIN=       0,             -696830,         0
##MAX=       8223.43324360094, 470208924,    0
$$ Real data points
##PAGE= N=1
##DATA TABLE= (X++(R..R)), XYDATA
$$ [...]
$$ plain form
19582 -27700 -147266 269227 -268065 -190141 19788 35306 -163472 236231 177453 -189190
19571 100266 -12184 -68836 -82278 13032 56208 89943 80691 184557 -54095 -76569 62713
19559 -138694 -122899 -183692 -201807 -192826 -90436 -60502 -363342 -226180 105969 28625 -5883
19547 21817 -78537 153979 39796 -93823 -88601 -37578 82690 65405 -88450 122065 -94471
19535 -35038 3091 85182 -288348 82977 -204766 -273206 51161 -2756 98443 -167231 -71642
19523 86408 -60631 -335642 -101329 -278366 -27337 -202021 -48214 -24712 58497 178515 74723
19511 157798 -177204 -134607 196279 23047 -17751 54666 -19542 -113993 -52454 37148 97769
19500 97769 175062 36853 -93391 -181560 244613 -151737 77856 1649 78193 -507664 -88269
$$ packed form
19582b7700j19566B69227b68065P7924A9788J5518a63472B36231n8778a89190
19571A00266a2184n6652j3442A3032M3176L3735r252J03866e4095k2474F2713
19559a38694J5795o0793j8115Q981i0436K9934l02840J37162A05969B8625e883
19547B1817g8537A53979C9796i3823N222c7578H2690j7285h8450A22065i4471
19535c5038C091Q2091b88348H2977b04766o8440E1161b756I8443a67231g1642
19523H6408f0631k75011a01329j77037b7337j74684d8214K3502E8497J20018G4723
19511A57798a77204M2597A96279B3047a7751E4666a9542r4451e2454C7148O0621
19500I7769P7293C6853i3391q8169B44613a51737G7856A649P6544e07664h8269
$$ plain form
19488 -31160 -290913 -79644 -303909 -97947 -30046 -244147 25608 -6461 -176400 -178294 -21211
19476 -138776 -299760 -204282 267221 248926 -40193 47186 54900 -144723 -300871 -174564 -77059
19464 247764 151586 92182 274322 -38309 48955 -195176 41535 68148 18847 -399484 175551
19452 198583 -103749 -169814 -77312 -254093 -69499 -71837 -345651 -34543 -127487 -78123 -157530
19441 -157530 -38997 -209146 136186 -113984 -61915 -2937 -355134 -62589 74696 7716 -351358
19429 -246320 40245 -51220 45221 -78692 -22560 -35175 -77754 -141205 83339 -300863 -22636
19417 157249 5770 -220411 -471663 -253332 -112695 -327846 174226 119443 88072 -347573
19406 -108963 146910 53253 -33794 -278902 51513 -166522 379075 -70301 -81756 -17410 -352887
$$ packed form
19488c1160k59753g9644k24265i7947c0046k14101B5608f461j69939j894b1211
19476a38776j60984R5478B67221j8295d0193D7186P714a44723j56148J26307g7059
19464B47764r6178n9404J82140c8309D8955a95176D1535K6613A8847c99484A75551
19452A98583a03749o6065g7312j76781f9499k338k73814c4543r2944M9364p9407
19441a57530c8997j70149A36186a13984N2069b937l52197f2589G4696G716c51358
19429b46320D0245e1220D5221g8692b2560j2615m2579o3451H3339c00863b2636
19417A57249E770b20411k51252K18331a12695k15151A74226n4783l1371c47573
19406a08963A46910E3253c3794k45108E1513a66522C79075g0301j1455a7410l35477
$$ plain form
19395 -352887 -71227 -212959 -402747 516 178366 250908 166088 445908 -42430 94829 -113326
19383 -6815 101439 -451481 -74779 -67709 75454 98938 -221251 124072 118511 -168254 -97880
19372 -97880 137038 175293 -47669 -349523 -102877 -34009 -65461 180586 -126559 -53277 184424
19360 100767 -275962 -356840 -147198 17819 161638 21680 85588 -67983 95440 8596 -9809
19348 92698 -98920 85254 71217 88215 -363273 215566 -497675 -116440 -173165 -256213 -80632
19336 -69641 -138317 -52681 -400844 117285 90819 106962 -14661 -199924 -281905 12940 54935
19325 54935 -102110 201047 -158205 147986 -94299 -27287 -268031 -70547 62087 -73047 174573
19313 -152161 -259547 -88845 -11583 30117 -166796 -10059 -24435 -170298 -345777 -200840
$$ packed form
19395c52887g1227j41732j89788E16J77850P2542q4820K79820d2430I4829a13326
19383f815A01439d51481g4779P070G5454K3484b21251A24072n561a68254P0374
19372i7880A37038L8255d7669l01854a02877c4009l1452A80586a26559e3277A84424
19360A00767b75962q0878a47198A7819J43819B1680O3908f7983I5440H596i809
19348I2698i8920H5254j4037J6998c63273B15566d97675a16440n6725q3048h0632
19336f9641o8676e2681l48163A17285k6466J6143a4661j85263q1981A2940M1995
19325E4935a02110B01047a58205A47986i4299b7287k40744g0547F2087g3047A74573
19313a52161j07386h8845a1583C0117a66796a0059j4376j45863j75479J44937
$$ plain form
19303 -200840 -213066 237470 -61293 210321 -84703 -95504 -298436 -136877 140485 -6723 -3240
19291 158158 58469 2544 -250607 190431 -130678 159251 83403 -81723 -168602 -420131 -279758
19280 -279758 -120701 -197006 -12584 86694 216890 61192 -154760 -77026 142512 36670 -31412
19268 -206797 -79287 -62022 67027 -98307 -274359 -26475 16914 -142404 -92612 -308570 51995
19256 43391 67044 -119238 135915 -155394 69407 -301521 20941 76296 -41540 -76996 -196493
19245 -196493 53462 -373898 177347 -501523 -247099 47096 -152604 -299693 -107652 4666
19234 -289883 -233655 -114467 -99922 -279939 29132 -12541 -80631 -9430 -302559 51592 98865
19223 98865 -330200 -174409 203478 -119171 27152 239415 -177646 -9835 134444 117611
$$ packed form
19303b00840j2226B37470f1293B10321h4703j0801k02932a36877A40485f723c240
19291A58158E8469B544b50607A90431a30678A59251p5848h1723q6879k51529J40373
19280b79758a20701p6305a2584H6694J30196F1192a54760g7026A42512C6670c1412
19268b06797g9287J7265F7027i8307j76052b6475A6914a42404M9792k15958E1995
19256D3391K3653a19238A35915a55394F9407c01521B0941N5355d1540l5456j19497
19245a96493E3462c73898A77347e01523b47099D7096a52604j47089a07652D666
19234b89883N6228a14467J4545j80017B9132a2541o8090i430k93129E1592M7273
19223I8865c30200J55791B03478a19171B7152K12263a77646i835A34444j6833
$$ plain form
19213 117611 -259264 10686 137183 -302609 -256656 104555 -161497 -158209 -53547 -49212 47078
19201 37163 64587 -202716 -193048 -143206 -4896 175256 -44402 126661 -208583 -86280 99922
19189 -35459 -145572 -22387 -148695 135665 -94459 338021 -109359 150525 -491530 23170
19178 -39295 80259 175129 -65809 238230 -159097 -200926 -90446 -398705 -194229 -1281 -122083
19167 -122083 76627 63689 198235 -69670 -258080 30920 -54656 -187788 -18990 -57575 -280855
19156 -280855 -72103 -8087 -196943 -243082 -533810 -148370 66503 142787 -6749 -263938 116519
19144 189165 34296 -111013 -70578 -65201 -116363 -134343 44420 4047 -149573 75503 -216789
19132 -129964 31036 -619045 62474 162825 8018 -4769 -220980 123715 -27771 23040 -129083
$$ packed form
19213A17611b59264A0686J26497c02609M5953A04555a61497L288e3547M335D7078
19201C7163K7424b02716R668M9842d896A75256d4402A26661b08583h6280I9922
19189c5459j10113b2387j26308A35665i4459C38021a09359A50525d91530B3170
19178c9295H0259R4870f5809B38230a59097m1829i0446l08259a94229a281j20802
19167a22083G6627j2938J34546f9670j88410C0920e4656j33132a8990l8585k23280
19156b80855g2103h087j88856m6139k90728a48370F6503P6284f749k57189A16519
19144A89165C4296a11013M0435N377n1162j7980D4420D047a49573G5503b16789
19132a29964C1036f19045F2474J00351H018d769k16211A23715b7771B3040a29083
$$ plain form
19120 -56196 -387654 -26112 195765 5848 314599 241568 -2893 -214628 203702 -191286 -300311
19109 -300311 18936 234102 -403647 -216242 -163438 -126649 -522249 20146 -118584 135450
19098 252964 -113842 -159756 -197840 52690 101060 -444034 119505 -244518 -101297 -170339
19088 -170339 17062 -101430 -54173 -118129 -90677 172579 177852 133788 -116819 -354953 -57815
19076 49834 -295756 -231058 -73139 83183 -144100 136166 -252462 29867 -96742 146269 -200467
19064 -19486 41487 -124059 106521 -110177 -48609 61709 -352302 11431 -255559 -81219 -139778
19053 -139778 331318 -38789 106415 -256760 256286 -2956 53203 -204777 237891 43090
19042 -102239 -72198 -139855 248197 160448 -285764 195666 -122856 -80065 -162452 148671
$$ packed form
19120e6196l31458b6112A95765E848L08751p3031b893k11735B03702a91286j09025
19109c00311A8936K15166d03647J87405N2804L6789l95600B0146a18584A35450
19098B52964a13842m5914l8084E2690M8370d44034A19505b44518a01297o9042
19088a70339A7062a01430M7257o3956K7452A72579N273m4064a16819k38134e7815
19076D9834b95756O4698g3139H3183a44100A36166b52462B9867i6742A46269b00467
19064a9486D1487a24059A06521a10177d8609F1709c52302A1431b55559h1219n8559
19053a39778C31318c8789A06415b56760B56286b956E3203b04777B37891D3090
19042a02239L0041o7657B48197q7749b85764A95666a22856M2791q2387A48671
$$ plain form
19031 -86484 71636 156211 -97102 91961 164594 -142067 253539 482468 218445 -209382 80519
19019 122646 -145107 -368728 253877 104500 -39112 -27573 -125664 -99610 65861 -2194 190039
19007 88099 60287 135384 -21967 -167030 -91245 73683 -117735 189897 158458 -28584 -89104
18996 -89104 -338469 -473541 -263158 -376952 -93818 51951 -149011 -273311 -182336 -32773
18985 281510 35687 -239647 80799 122731 -297736 236236 -96280 -10832 -375946 -19794 -3430
18973 230763 -410739 -122538 33923 183386 -78312 -8319 -206989 14553 -279466 -201176 77661
18961 88197 84605 -111863 -455615 -34837 -91972 -26850 -41594 -211716 -172539 -39819 138587
18949 93918 -3296 -127641 25133 -7451 -130911 108530 270344 -96220 455648 -315358 40595
$$ packed form
19031h6484G1636Q4575i7102I1961P2633a42067B53539K28929B18445b09382H0519
19019A22646a45107k23621B53877A04500c9112J1539r8091K6054F5861b194A90039
19007H8099k7812P5097b1967j45063P5785G3683a17735A89897l1439b8584o0520
18996h9104k49365j35072K10383j13794i3818E1951a49011j24300R0975c2773
18985B81510C5687b39647H0799M1932b97736B36236i6280a0832l65114a9794c430
18973B30763d10739a22538C3923J49463g8312h319j98670A4553b79466P8290G7661
18961H8197l592a11863l43752c4837n7135b6850j4744j70122L9177c9819A38587
18949I3918c296j24345B5133g451j23460A08530J61814i6220D55648c15358D0595
$$ plain form
18937 -12639 -195520 -82985 35543 -68302 37074 131226 -7112 -91570 -16897 -110541 -183754 -12777
18924 60358 134826 -88249 -337358 -353572 -57121 133047 -64868 -179515 -18250 -236907 93186
18912 -401874 104519 -231592 -53658 81499 -104505 -209756 -51420 -166811 -188856 -238752
18902 -238752 -122566 -122654 -358562 -13851 130674 -87101 -160891 -148409 256692 213816 -42341
18890 -362558 -158859 33341 140922 351120 -135261 29720 204310 -130276 -240122 -6181
18879 -31122 -80494 -118306 152799 -172403 -105964 5277 -250815 168771 -144260 -202731 -152554
18868 -152554 94481 -255098 -160332 98059 40337 -11204 -64564 271171 -154300 -149449 -302325
18857 -302325 -136004 74948 168295 51260 309484 -294315 -30792 307896 35958 49014 35439
$$ packed form
18937a2639j82881h2985C5543f8302C7074R4152g112q4458a6897r3644p3213a2777
18924F0358P4468h8249k49109j6214e7121A33047f4868j14647a8250k18657I3186
18912d01874A04519b31592e3658H1499a04505j05251e1420j15391k2045m9896
18902b38752J16186q8k35908a3851A30674h7101p3790J2482B56692m2876d2341
18890c62558a58859C3341J07581K10198a35261B9720J74590a30276j09846f181
18879c1122m9372l7812A52799a72403O6439E277b50815A68771a44260n8471N0177
18868a52554I4481b55098R4766I8059D0337a1204n3360B71171a54300M851j52876
18857c02325a36004G4948R3347E1260K58224b94315c0792C07896C5958J3056j3575
$$ plain form
18846 35439 -44258 -242990 -186392 -126255 -90659 168827 334740 58024 191537 -122977 -202199
18835 -202199 -57664 62595 170493 96183 319249 -32341 -369085 -66060 88415 -485887 -102909
18823 -92353 -437729 147518 -3113 -36943 34023 41416 267831 -128724 -119499 -25640 -230836
18812 -230836 133039 210721 331038 -111573 104221 219271 237737 -109980 -232536 71953
18801 81289 74387 -308815 158110 118647 113906 325014 -267610 8499 -43027 131534 -32814
18789 -202051 -21107 106025 -10490 -124099 -77589 -202560 57654 -64393 52097 -358292 121164
18777 -170058 100265 -219059 118372 -30015 128499 81732 -178283 -7456 25934 -85233 -98834
18766 -98834 -114747 -429061 -363786 28106 -468168 24898 4321 -220979 -44962 -132721 -18689
$$ packed form
18846C5439d4258j98732N6598O0137L5596A68827J65913E8024J33513a22977p9222
18835b02199e7664F2595J07898p4310K23066c2341l36744f6060H8415d85887a02909
18823i2353l45376A47518c113l3830C4023P393K26415a28724R225b5640k05196
18812b30836A33039P7682J20317a11573A04221J15050J8466a09980j22556G1953
18801H1289o902c08815A58110l9463m741K11108b67610H499d3027A31534c2814
18789b02051b1107A06025a0490j13609M6510j24971E7654f4393E2097c58292A21164
18777a70058A00265b19059A18372c0015A28499m6767a78283g456B5934h5233j3601
18766i8834j5913l14314O5275B8106d68168B4898D321b20979d4962q7759a8689
$$ plain form
18754 -112704 -129639 -64293 -174273 180154 -175061 27397 453175 -232095 378736 79072
18743 -159590 -160595 -257130 186674 -16489 -211470 -28927 121023 46816 -334086 -180514 -300962
18732 -300962 -120589 -21501 37767 -17075 -190559 133659 -372201 -112966 326787 -54011
18721 132492 -161569 -62605 15420 98155 -17110 -322667 -58455 -696830 -374630 -285374 226866
18709 -96774 407174 59505 -310319 3961 249281 97890 -195464 -156726 73701 -266640 -177224
18698 -177224 -17223 -214590 364418 -34343 -58392 189469 -162127 -298573 -197094 98482
18687 135080 -177569 -272361 74270 -11392 -416991 52806 -181859 -94610 -154550 224910 155238
18676 155238 12197 -204527 2292 -465498 225345 -129553 63641 -58273 -21525 86908 -99844
$$ packed form
18754a12704j6935f4293j09980A80154a75061B7397M25778b32095C78736G9072
18743a59590j005r6535A86674a6489j94981b8927A21023D6816c34086J53572j20448
18732c00962a20589b1501C7767a7075j73484A33659c72201a12966C26787e4011
18721A32492a61569f2605A5420Q2735a7110l05557e8455o38375L22200Q9256B26866
18709i6774D07174E9505c10319C961K45320I7890a95464L8738G3701b66640Q9416
18698a77224a7223j97367C64418c4343k4049A89469a62127j36446J01479I8482
18687A35080a77569r4792G4270a1392m05599E2806a81859Q7249n9940B24910o9672
18676A55238A2197b04527B292d65498B25345a29553F3641e8273b1525H6908i9844
$$ plain form
18664 -233846 36812 -102127 -92601 -345542 -315747 -60247 10110 72641 -121960 204001 -114760
18652 4437 176457 -51740 -140591 41792 75231 211273 -73182 382234 110159 -38035 37041
18640 -38746 -128598 -78496 -151925 -225357 -28691 121435 -69626 -46604 -38753 -166530 201227
18628 -123477 -166876 -159290 74074 -160370 -59084 -319072 93568 -68948 5624 -174049 80930
18616 -67706 -386712 -201490 46384 86436 7005 -201520 -364509 101285 25041 -46768 84193
18604 -81679 -172779 -163729 -26244 40480 45632 -297859 -381327 -29647 192047 18236 -332860
18592 40066 103093 -236860 139060 8476 -131134 -27400 155051 -97694 -311042 -125429 -225489
18581 -225489 -162615 -42177 -70040 -157098 19809 -87477 124794 63872 354547 56746 -93721
$$ packed form
18664b33846C6812a02127R526k52941K9795f0247A0110O2531a21960B04001a14760
18652D437J72020e1740q8851D1792L3439J36042g3182C82234A10159c8035C7041
18640c8746q9852N0102p3429p3432b8691A21435f9626K3022P851j27777B01227
18628a23477m3399P586G4074a60370e9084k59988I3568f8948E624a74049H0930
18616f7706l19006J85222D6384M0052G005b01520j62989A01285B5041d6768H4193
18604h1679r1100R050b6244D0480N152b97859q3468b9647A92047A8236c32860
18592D0066O3027b36860A39060H476a31134b7400A55051i7694k13348a25429j00060
18581b25489O2874d2177k7863q7058A9809h7477A24794o0922K90675E6746i3721
$$ plain form
18569 -114464 -77828 -299518 77907 23162 115173 253107 -173629 -10235 10992 67305 8353
18557 -75987 334747 -53313 -41715 -60011 -187635 248770 -330712 -265250 226306 -98145 8496
18545 -116255 156275 -179258 -113659 165853 203911 -119047 -9743 -268065 -241661 -175490 -40491
18533 -36790 78116 -3978 109632 -88406 183198 -116500 -99041 -242245 118088 -157615 35431
18521 -124836 -193008 -159784 176687 -144544 -247912 -180564 -142572 77267 196721 45140 -314152
18509 207566 82456 68084 116676 130414 -91952 109891 333514 189781 8586 -56852 -2754
18497 -297710 203295 -64861 -92363 42579 -76141 175361 -395105 53191 151785 -172608 -56440
18485 -164872 -306606 248230 93056 68252 76882 -103093 -24689 102986 37014 -255825 15494
$$ packed form
18569a14464L6636k21690G7907B3162R2011J37934a73629a0235A0992N6313H353
18557g5987C34747e3313J1598j8296j27624B48770c30712O5462B26306i8145H496
18545a16255A56275a79258O5599A65853L8058a19047i743k58322K6404O6171d0491
18533c6790G8116c978A09632h8406A83198a16500J7459j43204A18088a57615C5431
18521a24836o8172L3224A76687a44544j03368O7348L7992G7267J19454D5140c14152
18509B07566H2456j4372M8592J3738i1952A09891K23623j43733H586e6852b754
18497b97710B03295f4861k7502D2579g6141A75361c95105E3191R8594a72608e6440
18485a64872j41734B48230I3056k4804Q630a03093b4689A02986C7014b55825A5494
$$ plain form
18473 13583 -94101 -52394 -155278 -106888 196393 -2436 -279922 -173516 143937 -64533 38492
18461 239620 220314 -28819 265969 -145641 -81178 148822 -24644 32204 10137 64994 -2401
18449 51132 -104512 29885 40258 -209959 84925 -214585 -261056 105684 -31141 -312057 -259742
18438 -259742 -183566 158282 -184768 -112141 -128483 38801 -204561 44452 -472662 -58934 54573
18426 -331814 86125 -210544 94870 96070 -14541 184968 -349214 -259863 -1298 106769 146315
18415 146315 -71121 -203331 63483 382616 -198638 -175078 -133179 -21146 224898 -170668
18404 -22436 183964 205538 -36952 -79174 -98686 164432 52095 113617 -207890 -187764 -136410
18393 -136410 77351 267677 -82948 324884 -283169 134143 10011 3264 -349982 264634
$$ packed form
18473A3583i4101M1707j02884M8390A96393b436k77486J06406A43937f4533C8492
18461B39620j9306b8819B65969a45641O4463A48822b4644C2204A0137N4857b401
18449E1132a04512B9885J0373b09959H4925b14585m6471A05684c1141k80916N2315
18438b59742P6176A58282a84768P2627j6342C8801b04561D4452d72662e8934E4573
18426c31814H6125b10544I4870J200a4541A84968c49214Q9351a298A06769L9546
18415A46315g1121j32210F3483L19133a98638K3560M1899b1146B24898a70668
18404b2436A83964K1574c6952m2222j9512A64432E2095O1522b07890K0126N1354
18393a36410G7351J90326h2948C24884b83169A34143A0011C264c49982B64634
$$ plain form
18382 -32688 200275 -114640 -177316 -35047 -78574 -7991 -42094 -200544 3615 -286778 -337486
18371 -337486 9858 -337488 55145 12179 130518 -90179 18018 -124703 347510 366994 -186806
18359 -130114 -48918 105650 16248 -24984 -244277 -42856 279664 -434540 90971 27228 -172793
18347 -80378 -175009 -97624 -157816 -1094 -177056 80604 -218328 -3685 -89952 -115612 -150864 -253685
18335 -253685 -176259 -245116 179434 -358146 -170474 72631 31638 -88200 -368132 98252 -126089
18323 198691 -28958 181071 44780 44761 4521 43570 276669 32499 -77723 -143809 -21165 9504
18310 101483 -78958 -297032 -213218 -74824 45697 207834 -199978 -134085 22426 -4663 125166
18298 38721 -111672 91648 -32375 1951 -131089 -367299 -127779 -97970 -2396 149354 -244043
$$ packed form
18382c2688B00275a14640o2676c5047m3527g991l4103j58450C615b86778n0708
18371c37486I858c37488E5145A2179J18339i0179A8018a24703C47510J9484a86806
18359a30114d8918A05650A6248b4984k19293d2856B79664d34540I0971B7228a72793
18347h0378r4631P7385o0192a094j75962H0604b18328c685q6267k5660l5252j02821
18335b53685P7426o8857A79434c58146a70474G2631C1638h8200k79932I8252a26089
18323A98691b8958A81071D4780j9D521L9049K33099C2499g7723o6086b1165I504
18310A01483g8958k18074Q3814g4824D5697J62137a99978O5893B2426d663A25166
18298C8721a11672I1648c2375A951a31089k36210a27779K9809b396A49354b44043
$$ plain form
18286 -249148 -290660 -95029 197589 150482 -184873 -73313 103400 -38781 -173599 86823 163614
18275 163614 74787 154727 -112414 -125616 71379 51321 91555 106612 -8988 -179996 -186714
18264 -186714 -65051 -166403 -40850 278565 -63466 71814 -144428 140801 46875 156362
18254 156362 123825 84938 17580 -18720 164136 -225683 27403 -362275 -187226 58891 -34779
18242 83615 -180728 -144425 -54616 301289 341524 126938 131782 50043 12804 -40725 88767
18230 -119722 -23144 268419 -74347 -259886 255929 -147092 -126743 -74655 -247126 178947
18219 71389 37335 -169084 285149 -81556 14704 185564 -19056 169978 114213 -98798 -39260
18207 -135078 -189083 -25925 -223396 -238250 -238687 -98561 83245 68245 125812 44183 -100579
$$ packed form
18286b49148m1512i5029A97589m7107a84873g3313A03400c8781j34818H6823P6791
18275A63614G4787P9940a12414j3202G1379k0058M0234J5057h988j71008o718
18264a86714f5051j01352d0850B78565f3466G1814a44428A40801D6875J09487
18254A56362l2537l8887A7580a8720A64136b25683B7403c62275J75049E8891c4779
18242H3615a80728L6303e4616C01289M0235A26938M844E0043A2804d0725H8767
18230a19722b3144B68419g4347j85539B55929a47092K0349N2088j72471A78947
18219G1389l4054a69084B85149h1556A4704J70860a9056A69978n5765i8798c9260
18207a35078n4005b5925j97471j4854m37i8561H3245j5000N7567D4183a00579
$$ plain form
18195 -5988 -154943 83773 -104196 -155269 181535 -117504 39382 -268405 -32588 -102300 -123249
18184 -123249 1904 -70389 -102379 11821 -208734 59213 270819 40352 -54805 104777 362778
18173 362778 16918 -250614 -242717 182087 -253571 197696 -268613 -150494 -114569 71916
18162 341610 157228 -4127 -260679 17834 -180422 -2503 -99116 -37074 -206079 -21912 56676
18150 -203931 -289970 -164796 -201861 -117614 -236516 222390 73150 -180105 -58288 36575 38057
18139 38057 373889 63570 -150119 60576 -129479 -205747 -163999 -317642 -197473 36728 -197619
18127 -98033 350844 -55802 58235 205917 182742 7940 187130 136782 -158487 -9848 236511
18115 197005 -200938 -123647 102329 -154088 -59727 11496 155636 -378995 -235404 140369
$$ packed form
18195e988j48955H3773a04196n1073A81535a17504C9382b68405c2588o9712k0949
18184a23249A904g0389l1990A1821b08734E9213K11606D0352e4805A04777K58001
18173C62778A6918b50614P897A82087b53571A97696b68613J18119L5925G1916
18162C41610A57228d127k56552A7834a80422b503r6613c7074j69005b1912E6676
18150b03931q6039J25174l7065Q4247j18902B22390G3150a80105e8288C6575J482
18139C8057L35832F3570a50119F0576a29479p6268M1748j53643J20169C6728a97619
18127i8033C50844e5802E8235J47682k3175G940J79190n0348a58487i848B36511
18115A97005b00938P7291A02329a54088e9727A1496J44140c78995J43591A40369
$$ plain form
18104 47320 -47490 -113614 -213502 19593 51206 -9608 -47307 -217481 12972 66316 -605868
18092 -176528 47816 -314008 -62895 -59437 -173166 42621 -33776 41394 44749 4815 150752
18081 150752 -6552 -343626 207053 -53479 227766 -275681 161513 -112211 -207567 236984
18070 52937 -84389 -106445 -92841 219175 36625 38007 -73464 21495 -43586 -191370 -274208
18059 -274208 -225804 196369 21677 43058 -12839 31483 281103 -17558 92586 315 -30552
18047 185522 23731 -262305 -226374 -92633 -5694 -63066 -173287 -258548 -2234 11435 343028
18036 343028 58899 -72998 51780 -96184 289172 -2296 -91152 46814 -234918 -166276 145227
18024 20948 52679 -4868 245038 109013 -117325 -20997 52388 -52054 -94048 -186888 -147629
$$ packed form
18104D7320d7490o6124r9888A9593L1613i608l7699j70174A2972N3344f05868
18092a76528D7816c14008f2895L458j13729D2621c3776D1394L355D815J45937
18081A50752f552l37074B07053e3479B27766b75681A61513a12211r5356B36984
18070E2937h4389k2056J3604B19175C6625J382g3464B1495d3586j47784q2838
18059b74208M8404A96369B1677K1381a2839C1483K49620a7558I2586C15c0552
18047A85522B3731b62305L5931i2633e694n7372j10221q5261b234A1435L31593
18036C43028E8899g2998E1780i6184B89172b296q8856D6814b34918O8642A45227
18024B0948L1731d868B45038A09013a17325b0997E2388e2054m1994r2840L9259
$$ plain form
18013 -147629 1117 -146352 -83029 -136679 -98327 -80075 114369 -241829 -5590 -127738 162512
18001 -224764 -201796 119557 -267667 48536 -7072 -4336 78564 123942 191489 -267134 -119033
17989 -124468 200929 16689 245547 55352 223470 22186 327730 -121943 181485 -146401
17978 -37281 -92123 25253 -13428 -133340 11483 -141513 -100826 215165 216469 -121131 118798
17966 164088 -80518 -143332 -223043 -143194 -106303 -10572 119520 194072 -177934 244364 98177
17954 346651 -86982 133971 -133332 60184 148545 82613 -208670 -7323 -162954 155521 70204
17942 -73155 -67977 49742 -3560 -92034 -203762 -57237 -47631 -113006 22068 -53639 -82007 148035
17929 -13347 -32284 -133483 304736 -194387 -91625 -48986 -128831 -283613 -88765 7020 -81843
$$ packed form
18013a47629A117a46352O3323n3650L8352J8252A14369b41829e590j22148A62512
18001b24764K2968A19557b67667D8536g072K736G8564M5378O7547b67134a19033
17989a24468B00929A6689K28858E5352J68118B2186L05544a21943A81485a46401
17978c7281n4842B5253a3428j19912A1483a41513M0687B15165J304a21131A18798
17966A64088h0518o2814p9711P9849L6891a0572A19520P4552a77934B44364I8177
17954C46651h6982A33971a33332F0184Q8361o5932b08670g323j55631A55521G0204
17942g3155N178D9742c560q8474j11728e7237R606o5375B2068e3639k8368A48035
17929a3347j8937j01199C04736a94387i1625M2639p9845j54782h8765G020h1843
$$ plain form
17917 22252 -3584 -48113 130906 130258 185117 407738 131303 231979 -90692 170045 281977
17906 281977 148399 8214 26924 -46650 36601 24568 -169978 98335 104917 -242473 -259525
17895 -259525 -271889 200386 189481 172720 136819 -166511 348612 260960 -103607 -3747 166109
17883 -26790 9224 -151912 127429 125488 -216539 60406 51431 -214400 205800 -80174 97682
17871 -39086 -217956 74178 -39586 207517 -206528 -185574 -132053 -22085 -11280 44825 -30994
17859 89832 -98924 -35443 280073 196561 43180 308200 54957 -325469 -43879 -242916 23940
17847 -328436 79124 -102656 5791 243762 19184 149951 -100389 33254 -84832 167953 138805
17836 138805 -345166 -194368 169734 -40328 187520 -235865 -81426 -71118 -49644 424559
$$ packed form
17917B2252c584m4529A30906o48N4859K22621A31303J00676i0692A70045J11932
17906B81977j33578H214J8710d6650C6601j2033a69978I8335O582b42473j7052
17895b59525j2364B00386j0905j6761l5901a66511C48612q7652a03607c747A66109
17883b6790I224a51912A27429j941b16539F0406q975b14400B05800h0174I7682
17871c9086j78870G4178c9586B07517b06528K0954N3521b2085J0805D4825c0994
17859H9832i8924c5443B80073q3512D3180K65020E4957c25469d3879j99037B3940
17847c28436G9124a02656E791K37971A9184J30767a00389C3254h4832A67953k9148
17836A38805c45166J50798A69734d0328A87520b35865h1426J0308K1474D24559
$$ plain form
17825 222972 -223379 24396 281747 -67976 -221226 -58766 37161 -256468 271844 -5034 63002
17813 76817 -119654 151066 -210782 -38778 2585 181266 74738 -168748 -268489 -70655 -69174
17802 -69174 182610 59215 113123 -177119 -158105 256074 -14160 -186616 -117571 21870 -152893
17790 -954 138999 12368 74293 126671 304138 -229225 24919 201360 109897 -209325 114848
17778 -26352 135985 -252760 -214845 298618 67084 48291 217845 89266 142564 -307360 31182
17766 -165697 218809 92055 279968 205 70464 -75622 -44447 -402785 -7307 -7816 -79355 41417
17753 -86448 -725 -70136 -4796 36703 -139321 -174080 -43770 -123418 13889 173454 28349 -168973
17740 -33068 132010 174916 91150 81853 305489 119366 63905 97432 284008 -156761 245177
$$ packed form
17825B22972b23379B4396K57351f7976j53250e8766C7161b56468B71844e034F3002
17813G6817a19654A51066b10782c8778B585J78681G4738a68748r9741g0655J481
17802f9174A82610E9215N3908a77119J9014B56074a4160j72456O9045B1870a52893
17790i54A38999A2368O1925N2378J77467b29225B4919J76441r1463b09325A14848
17778b6352A35985b52760L7915B98618F7084j8793J69554H9266N3298c07360C1182
17766a65697B18809I2055J87913B05P0259g5622L1175l58338g307n09p1539D1417
17753h6448g25o9411d796C6703a39321l4759d3770p9648A3889J59565B8349a68973
17740c3068A32010M2906q3766r297K23636A19366n5461L3527J86576a56761B45177
$$ plain form
17728 -125015 -146736 -69351 54394 198764 -111513 -43918 -92860 -132200 38832 -19601 -198501
17717 -198501 -60275 -66864 138118 7531 127358 -76660 205419 3105 144885 -190086 -52824
17705 76233 101540 -368272 -220928 275601 137680 -223881 -136810 241100 177464 65443
17694 209944 79201 -80984 -87580 -111457 200608 89253 16403 72674 133957 -143704 58874
17682 39340 123665 171867 -156877 76237 53726 149719 207505 36431 178949 155814 303884
17671 303884 124725 -3107 179351 164126 -70945 204652 44311 224338 -212996 -35426 14320
17659 -251834 359665 80338 -6955 -76673 17613 -65991 -98127 173922 29686 304530 -226086
17647 -46390 -83063 -368307 269655 144582 66254 -270391 -68261 25833 67404 -74005 294590
$$ packed form
17728a25015k1721f9351E4394J44370a11513d3918m8942l9340C8832a9601j78900
17717a98501f0275o589A38118G531J19827g6660B05419C105J41780a90086e2824
17705G6233K5307c68272J47344B75601A37680b23881Q7071B41100o3636F5443
17694B09944G9201h0984o596k3877B00608H9253A6403N6271O1283a43704E8874
17682C9340Q4325M8202a56877G6237k2511R5993N7786C6431J42518k3135J48070
17671C03884A24725c107A79351j5225g0945B04652D4311J80027b12996c5426A4320
17659b51834C59665H0338f955o9718A7613f5991l2136A73922B9686K74844b26086
17647d6390l6673k85244B69655j25073F6254b70391f8261B5833M1571g4005B94590
$$ plain form
17635 -167489 -65949 -166955 72332 267801 267759 -139379 -26998 155392 243546 149774 105396
17624 105396 315620 -89088 -88235 177468 -38138 160116 -176319 -31684 200744 -284894 -16366
17612 -2771 66439 -135485 106615 37509 85509 -264757 -441200 91829 101540 -22813 -167516
17601 -167516 192367 -131937 22127 461635 50689 22000 23889 222972 59960 69640 -351365
17589 37865 35353 89192 150074 128364 194417 27522 -242268 -357662 -28790 -65010 -31580
17577 -44937 191343 -260439 15145 445135 -91362 195936 18575 87174 -220477 63673 220824
17566 220824 -229882 22210 -130929 67611 -201485 -190868 267693 -96339 142238 115589
17556 115589 -128867 -116720 57957 76184 29017 -47367 80740 -144982 346202 84282 11998
$$ packed form
17635a67489f5949j01006G2332J95469m2a39379b6998A55392Q8154r3772m4378
17624A05396K10224h9088Q53A77468c8138A60116a76319c1684B00744b84894a6366
17612b771F6439a35485A06615C7509M8000b64757j76443I1829R711b2813j44703
17601a67516A92367a31937B2127M39508E0689B2000J889J99083E9960R680c51365
17589C7865k512N3839O0882k1710O6053B7522b42268j15394b8790l6220c1580
17577d4937A91343b60439A5145M29990i1362A95936A8575O8599b20477F3673J57151
17566B20824b29882B2210a30929F7611b01485J0617B67693i6339A42238k6649
17556A15589a28867J2147E7957J8227B9017d7367H0740a44982C46202H4282A1998
$$ plain form
17544 229153 329530 -41955 150061 -12252 125159 15058 -75104 96990 207039 265083 559150
17533 559150 -153381 199694 -146939 -43429 186924 106298 -77934 14436 321325 27577
17522 -59254 -83584 -64489 171597 193872 -78098 362498 -115313 320107 266426 121602 3055
17510 -65070 57163 -148006 102789 115434 5192 -106489 121 17246 -144389 189056 78750
17498 92138 -124163 187829 3852 6062 -138796 -20093 127074 372528 303865 70554 560412
17487 560412 -170756 226053 284456 111523 168248 329738 36780 485780 28279 228819
17477 228819 241590 18120 -89184 463744 118287 268344 357116 117044 208714 86484 401196
17466 401196 307406 91696 359267 410529 347614 286801 -150887 171263 -25672 15731 295527
$$ packed form
17544B29153J00377d1955A50061a2252A25159A5058g5104I6990J10049N8044K94067
17533E59150a53381A99694a46939d3429A86924q0626g7934A4436L06889B7577
17522e9254k4330J9095A71597K2275g8098C62498a15313C20107n3681A21602C055
17510f5070E7163a48006A02789J2645E192a06489A21J7125a44389A89056G8750
17498I2138a24163A87829C852K210a38796b0093A27074K45454o8663G0554M89858
17487E60412a70756B26053N8403A11523N6725J61490C6780M49000B8279K00540
17477B28819J2771A8120h9184D63744A18287J50057Q8772A17044R1670H6484L14712
17466D01196r3790I1696K67571N1262o2915o0813a50887A71263b5672A5731K79796
$$ plain form
17455 295527 -26525 93376 279278 21478 -76295 271412 247081 446881 703843 205701
17444 272007 218110 72585 92404 -214108 196869 287599 359817 171436 409295 283637
17434 283637 267764 412073 311192 231813 -21571 346291 349965 218992 291 207908 96855
17422 248176 292257 416062 358505 -175288 518924 671057 302828 209483 206612 196129 357801
17411 357801 192864 129612 340597 317462 164017 310103 -17155 -19149 -91796 123685 352374
17400 352374 171027 167696 -156264 19529 531184 71393 133014 249843 345251 258970 75435
17388 509487 -227899 473939 198848 251493 401260 -127427 174770 114285 16948 -90013
17377 -25121 115306 256242 77632 32879 114624 298910 18531 -57018 114868 80239 395466
$$ packed form
17455B95527b6525I3376J85902B1478g6295B71412k4331J99800K56962B05701
17444B72007n3897G2585J9819b14108A96869R0730P2218A71436K37859j25658
17434B83637j5873J44309j00881p9379b1571C46291L674j30973B91K07617I6855
17422B48176M4081J23805n7557a75288E18924J52133C02828r3345k871j0483J61672
17411C57801j64937o3252K10985k3135j53445J46086a7155j994p2647A23685K28689
17400C52374A71027l331a56264A9529N11655G1393O1621J16829R5408q6281G5435
17388E09487b27899D73939A98848N2645J49767a27427A74770o0485A6948i0013
17377b5121A15306J40936G7632C2879Q1745J84286A8531e7018A14868l4629L15227
$$ plain form
17366 395466 -81345 312730 261669 27533 -47750 18172 101759 95843 -39874 257148 472261
17355 472261 -45200 232521 326948 247127 44300 355244 61599 364078 153438 103761 280061
17344 280061 121527 323378 337427 223638 295061 119540 83422 83801 176437 -6743 167447
17332 259414 -111231 58220 311165 -954 343316 306993 440359 364815 254484 405763 -38527
17320 76668 127568 -41271 333441 309160 484521 50796 261381 474605 331631 -20130 173798
17308 67999 41553 203534 124299 110820 -34700 -21060 175205 84446 370630 -52839 447124
17296 290100 393724 208826 183225 90317 314150 272527 283417 237859 268781 143713 168926
17285 168926 355448 380434 20043 143638 178375 186767 149406 42697 56156 94669 77545
$$ packed form
17366C95466h1345C12730n1061B7533d7750A8172Q3587n916c9874B57148K15113
17355D72261d5200B32521R4427p9821D4300L10944F1599L02479A53438m9677J76300
17344B80061A21527K01851J4049j13789P1423A19540l6118L79R2636f743A67447
17332B59414a11231E8220K52945i54C43316l6323J33366p5544j10331J51279c8527
17320G6668N0900d1271C33441k4281J75361E0796K10585K13224j42974b0130A73798
17308F7999k6446J61981p9235j3479c4700J3640A75205H4446K86184e2839D47124
17296B90100J03624j84898k5601I0317K23833m1623J0890m5558L0922j25068K5213
17285A68926J86522K4986B0043J23595L4737Q392l7361D2697J3459L8513j7124
$$ plain form
17274 77545 195305 274133 139984 -198049 64713 244741 181667 241778 135047 149593 80026
17263 80026 -33843 242296 45090 86770 -467911 190327 147483 438947 146350 -200884
17252 256356 455618 535483 378055 220990 306717 -12393 62489 264586 338252 -42843 314267
17240 50914 24992 30835 -22573 396985 -16093 254240 -170947 201770 126974 73976 302980
17229 302980 374957 138560 573778 172860 474767 352796 418233 71447 118963 287830
17219 287830 276051 387239 269765 368187 218566 69804 388742 496267 353578 296688
17209 296688 295420 -43217 158013 275031 229145 389037 243092 192154 65519 286652 85323
17197 304712 301652 461612 285193 215054 378836 792645 321550 168172 -172768 -81119
$$ packed form
17274G7545J17760P8828j34149a98049F4713J80028o3074O0111j06731J4546o9567
17263H0026c3843B42296D5090M1680d67911A90327m2844K91464A46350b00884
17252B56356J99262P9865j57428j57065Q5727a2393F2489K02097P3666d2843C14267
17240E0914B4992N843b2573C96985a6093B54240a70947B01770p4796n2998K29004
17229C02980P1977A38560M35218A72860L01907j21971O5437G1447M7516J68867
17219B87830j1779J11188j17474R8422j49621F9804L18938J07525j42689n6890
17209B96688j268d3217A58013J17018m5886J59892j45945n0938F5519K21133H5323
17197C04712l060J59960j76419p0139J63782M13809C21550j53378a72768h1119
$$ plain form
17186 237161 451948 81927 368368 734275 237128 513324 328592 242400 289515 514240
17176 514240 324785 424213 360091 233217 405466 -121712 482807 321923 317563 360835
17166 360835 279132 243244 387626 52770 260102 201469 485789 396723 483441 257148 428182
17155 428182 510314 179438 339283 403446 271100 130408 29179 204312 233644 239080 387862
17144 387862 175559 201154 157286 239355 205265 -69022 318849 223654 575747 211359 64218
17132 316649 12053 357592 521635 176120 411230 520675 165768 189886 136574 609844
17122 609844 538619 98991 442195 636977 516413 462775 204701 260323 550934 620229
17112 620229 547896 463039 467332 491227 -29766 215844 390749 371532 561798 385289 486021
$$ packed form
17186B37161K14787H1927K86441L65907B37128K76196j84732q6192M7115K24725
17176E14240j89455R9428o4122j26874J72249a21712D82807j60884m360M3272
17166C60835q1703l5888J44382E2770K07332n8633K84320q9066Q6718k26293J71034
17155D28182Q2132A79438J59845O4163j32346A30408B9179J75133K9332N436J48782
17144C87862A75559K5595m3868Q2069l4090f9022C18849r5195L52093B11359F4218
17132C16649A2053L45539J64043A76120K35110J09445A65768K4118n3312M73270
17122F09844p1225I8991L43204J94782j20564n3638B04701N5622K90611O9295
17112F20229p2333q4857M293K3895b9766B15844J74905j9217J90266j76509J00732
$$ plain form
17101 486021 458132 464994 209721 558439 544104 233968 286933 575640 247623 321526 449824
17090 449824 311693 651540 382928 421355 334485 246652 208230 409142 492528 422071 408058
17079 408058 338145 242446 502103 646386 554345 385593 391218 176312 341973 297875 281148
17068 281148 405259 499430 491884 558554 719300 134610 671427 623330 343528 377322 555449
17057 555449 679652 358599 589372 580783 690918 790479 651815 556516 524552 486529 861719
17046 861719 353623 340994 596524 446265 601828 387719 547782 868441 591332 557125
17036 557125 582202 366057 424870 709772 556311 622534 573285 462080 573009 850700
17026 850700 501629 552262 647836 840693 767149 552611 437407 646679 570088 472322
$$ packed form
17101D86021k7889O862B09721L48718j4335B33968N2965K88707B47623P3903J28298
17090D49824j38131L39847k68612L8427q6870q7833l8422K00912Q3386p0457j4013
17079D08058o9913r5699K59657J44283r2041j68752N625A76312J65661m4098j6727
17068B81148J24111R4171p546O6670J60746A34610N36817m8097k79802L3794J78127
17057E55449J24203l21053K30773q589J10135R9561j38664r5299l1964l8023L75190
17046H61719C53623j2629K55530j50259J55563k14109J60063L20659k77109l4207
17036E57125K5077k16145N8813K84902j53461O6223m9249j11205J10929K77691
17026H50700l49071N0633R5574J92857p3544k14538j15204K09272p6591r7766
$$ plain form
17016 472322 476997 807608 876439 612346 777480 540067 730187 596226 719140 824367
17006 824367 460062 645486 767696 666016 894229 712574 433171 822297 574468 679602
16996 679602 760744 818455 679919 896138 635910 608952 1041075 916843 705700 797394
16986 797394 753734 1056271 904541 640767 591326 903068 841988 782151 1100215 1273410
16976 1273410 877036 909697 743590 1178730 923266 926346 902704 945339 1154433 1279875
16966 1279875 965472 999764 968078 1002960 993594 1048512 1045471 1169319 1426001 1416851 1148895
16955 1148895 1042671 1179402 1412572 1217213 1211684 1212858 1023815 1304742 1009767 948477
16945 948477 1092994 1159622 1253427 1018588 1197612 1446746 1244277 1121832 1320756 1210638
$$ packed form
17016D72322M675L30611O8831k64093J65134k37413J90120j33961J22914J05227
17006H24367l64305J85424J22210j01680K28213j81655k79403L89126k47829J05134
16996F79602Q1142N7711j38536K16219k60228k6958M32123j24232k11143R1694
16986G97394m3660L02537j51730k63774m9441L11742o1080n9837L18064J73195
16976A273410l96374L2661j66107M35140k55464L080k3642M2635K09094J25442
16966A279875l14403L4292l1686L4882r366N4918l041J23848K56682r150k67956
16955A148895j06224J36731K33170j95359n529J174j89043K80927k94975o1290
16945I48477J44517O6628R3805k34839J79024K49134k02469j22445J98924j10118
$$ plain form
16935 1210638 1173286 1202740 1441685 1013172 1448850 1633565 1280574 1265601 1258692 1420774
16925 1420774 1223024 1399671 1503553 1203177 1396562 1478494 1522320 1608557 1506054 1332615
16915 1332615 1506181 1879716 1477919 1700577 1513816 1742026 1697684 1461295 1865109 1605386
16905 1605386 1699795 1838871 1897484 1742704 1798291 1718014 1729816 1972992 1880782 1758080
16895 1758080 1797555 1839238 1835133 2007389 2194234 2217955 2168497 1989895 2382336 1854518
16885 1854518 2290390 2239968 2252339 2273806 2421578 2336744 2283033 2295585 2284592 2346240 2114325
16874 2114325 2566007 2802551 2402976 2445178 2731892 2673739 2924002 2605555 3201767 2752316
16864 2752316 3037239 2832951 2793152 2917528 2956289 2838389 3226378 3410750 3385695 3398279
$$ packed form
16935A210638l7352K9454K38945m28513M35678J84715l52991j4973o909J62082
16925A420774j97750J76647J03882l00376J93385Q1932M3826Q6237j02503j73439
16915A332615J73566L73535m01797K22658j86761K28210m4342k36389M03814k59723
16905A605386R4409J39076N8613j54780N5587q0277J1802K43176r2210j22702
16895A758080L9475M1683m105J72256J86845K3721m9458j78602L92441n27818
16885A854518M35872n0422J2371K1467J47772q4834n3711J2552j0993O1648k31915
16874B114325M51682K36544l99575M2202K86714n8153K50263l18447N96212m49451
16864B752316K84923k04288l9799J24376L8761j17900L87989J84372k5055J2584
$$ plain form
16854 3398279 3274634 3679974 3675499 3326849 3590201 3425056 3575219 3648560 3570193 3910882
16844 3910882 3899115 4005388 3367186 3992134 3808749 3931655 4247086 4267308 4436402 4363083
16834 4363083 4214829 4384117 4715069 4382102 4674034 4798426 5136450 5287861 5080173
16825 5080173 4947979 5216779 5408970 5577344 5483349 5421179 5969626 6036412 5948038 6025130
16815 6025130 6007865 6315017 6458987 6726195 6517625 7001243 7004020 6813283 7400277 7564872
16805 7564872 7633345 7764058 8151108 8049263 8119155 8417547 8721815 9064909 9065379 9119178
16795 9119178 9382169 9898609 9806858 10304631 10384270 11052164 11372641 11275047 11618945 12539112
16785 12539112 12338295 12715651 13066764 13532135 14099174 14585376 14683929 15249207 15940375
$$ packed form
16854C398279j23645M05340m475l48650K63352j65145J50163P3341p8367L40689
16844C910882j1767J06273o38202O24948j83385J22906L15431K0222J69094p3319
16834D363083j48254J69288L30952l32967K91932J24392L38024J51411k07688
16825E080173j32194K68800J92191J68374r3995o2170N48447O6786q8374P7092
16815F025130j7265L07152J43970K67208k08570M83618K777j90737N86994J64595
16805G564872O8473J30713L87050j01845O9892K98392L04268L43094M70N3799
16795I119178K62991N16440r1751M97773P9639O67894L20477r7594L43898R20167
16785A2539112k00817L77356L51113M65371N67039M86202R8553N65278O91168
$$ plain form
16776 15940375 16299157 16472828 17426885 17892065 18241438 19330331 20012940 20556101 21573607
16767 21573607 22107456 22757588 23818757 24927461 25490415 26888098 28164946 28989561 30077943
16758 30077943 31220666 32962634 34538997 35933807 37877019 39059287 41376943 43049371
16750 43049371 45450595 47564251 50206776 52734943 55673250 58528995 61554725 64923279
16742 64923279 68894647 72668358 76896245 81043114 85870765 90914517 96277683 101788793
16734 101788793 108058135 113718620 120151211 126687408 133696489 140346338 147057904 153745517
16726 153745517 160049587 166009600 171306749 175804459 179620000 182313493 183959526 184512954
16718 184512954 183558799 181709167 178845201 175039336 170038868 164498630 158758167 152172850
$$ packed form
16776A5940375L58782J73671R54057M65180L49373J088893O82609N43161J017506
16767B1573607N33849O50132J061169J108704N62954J397683J276848Q24615J088382
16758C0077943J142723J741968J576363J394810J943212J182268K317656J672428
16750D3049371K401224K113656K642525K528167K938307K855745L025730L368554
16742F4923279L971368L773711M227887M146869M827651N043752N363166N511110
16734A01788793O269342N660485O432591O536197P009081O649849O711566O687613
16726A53745517O304070N960013N297149M497710L815541K693493J646033N53428
16718A84512954r54155j849632k863966l805865n000468n540238n740463o585317
$$ plain form
16710 152172850 145514303 138613503 131776423 125213497 118211703 111608817 105732906 99608064
16702 99608064 94038511 88541963 83449313 78511759 74449661 70371783 66422593 63066097
16694 63066097 59436448 56183807 53258314 50520727 48001299 45796434 43509540 41137790
16686 41137790 39538015 37600485 35760769 34010576 32738077 31316938 29740892 28693431
16678 28693431 27167012 26069661 25564538 24432650 22891595 22686901 21647775 20860575
16670 20860575 19984883 19257464 18678255 17633734 17304407 16620686 15661148 15537582 14844289
16661 14844289 14808008 14008554 13375128 13138626 13014667 12903369 12225051 11691701 11500116
16652 11500116 11008564 10715390 10572119 9845799 9921539 9696615 9268478 9202138 8895373 8856065
$$ packed form
16710A52172850o658547o900800o837080o562926p001794o602886n875911o124842
16702I9608064n569553n496548n092650m937554m062098m077878l949190l356496
16694F3066097l629649l252641k925493k737587k519428k204865k286894k371750
16686D1137790j599775j937530j839716j750193j272499j421139j576046j047461
16678B8693431j526419j097351n05123j131888j541055k04694j039126p87200
16670B0860575q75692p27419n79209j044521l29327o83721r59538j23566o93293
16661A4844289l6281p99454o33426k36502j23959j11298o78318n33350j91585
16652A1500116m91552k93174j43271p26320P5740k24924m28137o6340l06765l9308
$$ plain form
16642 8856065 8503072 8298469 7773930 7672264 7759917 7426119 6991254 6991898 6861906 6500034
16632 6500034 6499258 6311271 6171096 6118244 5769711 5940132 5771617 5472342 5659091 5513564
16622 5513564 5338789 5055400 5249055 4796161 4818160 4939658 4803716 4451729 4004648 4226232
16612 4226232 4190160 4241292 3756818 4129663 3923954 3919484 3893154 3644467 3758444 3422437
16602 3422437 3358413 3487328 3241600 3662527 3359685 3245655 3110829 2821060 3124948 2889727
16592 2889727 2904827 3119607 2974541 2855044 2522295 2709601 2614506 2399947 2556132 2397308
16582 2397308 2751510 2452291 2624230 2231983 2117430 2151977 2167259 2222164 2571499 1977849
16572 1977849 2150026 2168577 1958083 2083732 2060470 1895274 1983728 1865418 1923357 1764405
$$ packed form
16642H856065l52993k04603n24539j01666Q7653l33798m34865O44j29992l61872
16632F500034p76j87987j40175n2852l48533J70421j68515k99275J86749j45527
16622E513564j74775k83389J93655m52894K1999J21498j35942l51987m47081K21584
16612D226232l6072N1132m84474L72845k05709m470k6330k48687J13977l36007
16602C422437o4024J28915k45728M20927l02842j14030j34826k89769L03888k35221
16592B889727J5100K14780j45066j19497l32749J87306r5095k14559J56185j58824
16582B397308L54202k99219J71939l92247j14553L4547J5282N4905L49335n93650
16572A977849J72177J8551k10494J25649k3262j65196Q8454j18310N7939j58952
$$ plain form
16562 1764405 1880178 1817114 1968535 1743829 1743551 1761143 1828394 1932374 1974813 1558534 2012844
16551 2012844 1385797 1599547 1441579 1274407 1323386 1586157 1604085 1706181 1418157 982429
16541 982429 1320106 1540651 1588468 1427978 1268632 1279138 1383453 1572433 1469862 981264
16531 981264 1113441 1174091 1354864 960366 1196708 952873 1090986 1186334 1361699 1237850
16521 1237850 1013517 1424158 1048596 1041227 1210788 998833 752579 1082666 1330580 963010
16511 963010 833387 904165 924648 1279300 851244 1067692 792191 911491 849024 691311
16501 691311 1181605 1084095 845400 917623 929810 756733 1362800 627420 1015448 712590
16491 712590 938496 623691 689823 781394 711634 693786 835089 864376 518181 437621 631021
$$ packed form
16562A764405J15773o3064J51421k24706k78J7592O7251J03980M2439m16279M54310
16551B012844o27047K13750j57968j67172M8979K62771J7928J02096k88024m35728
16541I82429L37677K20545M7817j60490j59346J0506J04315J88980j02571m88598
16531I81264J32177O0650J80773l94498K36342k43835J38113R5348J75365j23849
16521A237850k24333M10641l75562p369J69561k11955k46254L30087K47914l67570
16511I63010j29623P0778K0483L54652m28056K16448k75501J19300o2467j57713
16501F91311M90294r7510k38695P2223J2187j73077O06067F27420L88028l02858
16491G12590K25906l14805O6132R1571o9760j7848J41303K9287l46195q0560J93400
$$ plain form
16480 631021 643574 668880 405654 758104 893404 413739 689601 665198 910666 856669
16470 856669 540853 928111 980386 700173 615122 783292 758771 813474 442918 444876 539662
16459 539662 345021 506931 545208 783238 406815 599690 674339 685566 725847 985144
16449 985144 945061 960436 591877 614948 689367 1066435 314835 420723 651951 223200
16438 655761 444978 256171 694942 409885 623265 664603 627840 434034 393496 58890
16427 500188 411486 509342 354375 421235 209326 733020 610939 491526 353796 650985
16417 650985 -30761 920271 177529 283594 410237 708492 439030 467139 586350 572254
16407 572254 484131 568232 427315 676711 454747 400785 354654 329009 294712 483660 239287
$$ packed form
16480F31021J2553K5306k63226L52450J35300D13739K75862k4403K45468n3997
16470H56669l15816L87258N2275k80213q5051J68170k4521N4703l70556J958R4786
16459E39662j94641J61910L8277K38030l76423J92875P4649J1227M0281K59297
16449I85144m0083J5375l68559K3071P4419L77068C14835J05888K31228B23200
16438F55761k10783j88807M38771k85057K13380M1338l6763j93806m0538E8890
16427E00188q8702R7856j54967O6860B09326N23694j22081j19413j37730K97189
16417F50985c0761I20271A77529J06065J26643K98255k69462K8109J19211j4096
16407E72254q8123Q4101j40917K49396k21964n3962m6131k5645l4297J88948B39287
$$ plain form
16395 236387 336979 653190 317460 358814 202782 355152 382220 45124 189097 174187
16385 174187 317594 90445 342271 67652 493550 559675 457158 410976 295796 120004
16374 474350 409028 -97586 184683 6133 331786 249341 277291 620985 254661 111321 186954
16363 186954 246235 227439 20937 158746 372250 358929 -88980 427332 -101451 255208
16352 144701 222059 -91922 212636 40554 250273 252240 515200 366653 413604 446196 112542
16340 289708 369772 223586 98000 523838 395150 303267 116410 -118367 176391 307554
16330 307554 -126778 419476 412626 202854 195318 294469 432983 171726 66303 319044 334153
16319 334153 371520 -63690 260919 72213 211419 183699 57782 74531 14861 302558 392354
$$ packed form
16395B36387J00592L16211C17460M1354j56032J52370K7068D5124J43973j4910
16385A74187J43407I0445K51826F7652M25898O6125j02517m6182j15180A20004
16374D74350o5322i7586A84683F133L25653q2445K7950L43694B54661A11321P5633
16363A86954N9281j8796B0937J37809K13504j3321h8980D27332a01451B55208
16352A44701P7358i1922B12636D0554K09719J967K62960j48547M6951L2592A12542
16340B89708Q0064j46186I8000M25838j28688r1883A16410a18367A76391J31163
16330C07554a26778D19476o850B02854p536R9151J38514A71726F6303K52741J5109
16319C34153L7367f3690B60919G2213J39206k7720E7782J6749A4861K87697Q9796
$$ plain form
16308 392354 84502 216974 124458 5818 359105 -68129 631787 286706 90246 145064 165097
16297 165097 311775 61068 135249 -52693 200134 38322 17767 163680 74566 231259 84960
16285 62644 391212 -80668 17371 265497 96149 19758 -248034 93261 -129717 54894 57792
16274 57792 -20025 358966 336736 126107 310192 162884 138286 297611 204181 105826 74539
16263 74539 90026 -39984 20364 54751 154226 113885 217887 257965 508927 666004 217708
16251 140695 63576 153869 169732 -27593 117040 228193 168016 -76503 122078 8435 -15529
16239 28602 18419 428237 60271 -33210 -3321 283536 68404 266125 243026 -245077 32356
16227 240971 -93697 -122879 -80063 -194570 72141 6745 -40232 92225 -11084 145042 -397785
$$ packed form
16308C92354H4502J32472r2516E818L53287f8129F31787B86706I0246N4818K0033
16297A65097J46678F1068P4181e2693B00134C8322A7767J45913G4566J56693H4960
16285F2644L28568h0668A7371K48126I6149A9758b48034I3261a29717E4894K898
16274E7792b0025C58966k2230A26107J84085j47308k4598J59325r3430r8355l1287
16263G4539J5487c9984B0364L4387R9475m0341J04002M0078K50962J57077B17708
16251A40695F3576R0293J5863b7593A17040J11153o0177g6503A22078H435a5529
16239B8602j0183M09818F0271c3210c321B83536F8404J97721k3099b45077C2356
16227B40971i3697k9182M2816j14507G2141F745d0232I2225a1084A45042c97785
$$ plain form
16215 148195 143349 380254 -7529 72217 96622 57737 -132904 78898 -80130 9722 -348987
16203 318045 25708 491592 -68133 433616 198242 178750 -44106 35596 178951 -66945 357223
16191 1000 290507 52673 274080 271802 448742 -48258 -93677 93761 -101267 228613 -42226
16179 213101 110166 41668 -63826 138856 -30338 96651 -125995 161457 87444 439272
16169 439272 218844 -128557 -331710 96655 524732 -29116 -44872 59789 -223990 250172
16158 -15546 146142 198703 -43182 -178700 -102654 106973 64974 -115016 281932 132988
16147 56934 290801 38609 78887 110423 72920 -69006 24953 64659 99112 324356 -104655
16135 57780 -127495 -397873 148581 153481 95373 49512 241949 -174420 54993 12890 90961
$$ packed form
16215A48195m846K36905g529G2217K4405l8885a32904G8898h0130I722c48987
16203C18045B5708M65884f8133D33616A98242j9492d4106C5596J43355f6945C57223
16191A000K89507E2673K21407k278J76940d8258m5419I3761a01267B28613d2226
16179B13101j02935D1668f3826A38856c0338I6651a25995A61457p4013L51828
16169D39272B18844a28557k03153I6655M28077b9116j5756E9789b23990B50172
16158a5546A46142N2561d3182j35518P6046A06973m1999a15016B81932A32988
16147E6934K33867C8609M0278L1536l7503f9006B4953L9706L4453K25244a04655
16135E7780a27495k70378A48581M900n8108m5861J92437a74420E4993A2890P8071
$$ plain form
16124 90961 167151 10070 226770 146074 260551 38934 -127053 -187710 315539 -13400 -99924
16113 -99924 -82863 358500 -110993 19643 44336 174254 266955 -131675 -33813 -64175 77612
16101 89560 116269 -222980 -24969 17452 -88692 -47200 -93533 -288253 114858 85639 137887
16090 137887 6574 -7454 -275526 146407 -86054 279364 -144491 213050 -130283 -52656 -57853
16079 -57853 152838 52186 -60834 -255814 254012 78756 -64639 29138 243152 184575 -152760
16067 -162715 8831 106235 44042 153248 -23424 -42837 -171561 -188524 -52503 113050 -184043
16055 40774 90967 283764 -186687 -218759 -40028 -3782 -276680 -130702 40309 -112724 283124
16043 32168 45309 -133016 -244783 -39355 5156 47985 92677 140404 -521029 217024 12960
$$ packed form
16124I0961P6190A0070K16700q0696J14477C8934a27053o0657C15539a3400q6524
16113i9924J7061C58500a10993A9643K4693J29918R2701a31675c3813l0362G7612
16101H9560K6709b22980b4969A7452h8692M1492m6333j94720A14858k9219N2248
16090A37887F574g454k68072A46407h6054B79364a44491B13050a30283e2656n197
16079e7853A52838E2186f0834j94980B54012G8756f4639B9138K14014n8577a52760
16067a62715H831R7404D4042J09206b3424j9413j28724j6963e2503A13050a84043
16055D0774N0193J92797a86687l2072d0028c782k72898a30702D0309a12724B83124
16043C2168J3141a33016j11767c9355E156M2829M4692M7727e21029B17024A2960
$$ plain form
16031 327164 22453 -100764 -60336 -84747 -21322 134818 83126 -127694 129709 141449 14697
16019 102272 -92286 -134726 -154779 -301826 45390 -274933 -98332 116385 7850 -216823 -342921
16008 -342921 106092 82442 -134089 -145727 -356552 -228670 -44317 -39494 -47465 2325 -343110
15996 26143 -74498 -69144 -71146 -151931 277380 440950 57280 111702 -358948 -249551 66197
15984 116738 374961 289473 -6945 154581 234831 343693 358973 124689 -127260 -75251 182818
15972 40767 -81517 159026 -68115 278311 11132 111874 3983 87801 13150 185862 -327490
15960 197368 -141062 104145 -107978 -49009 -258833 -76815 -40956 222452 -144277 -201253
15950 -201253 -233792 52811 32833 187186 149165 146563 -105696 106630 -124097 -244013 100807
$$ packed form
16031C27164B2453a00764M0428k4411b1322A34818n1692a27694A29709J1740A4697
16019A02272i2286m2440k0053j47047D5390b74933i8332A16385G850b16823j26098
16008c42921A06092k3650a34089j1638k10825J27882d4317M823p971B325c43110
15996B6143g4498N354k002q0785B77380J63570E7280N4422c58948J09397F6197
15984A16738K58223q5488f945A54581Q0250J08862J5280A24689a27260N2009A82818
15972D0767h1517A59026f8115B78311A1132J00742C983Q3818A3150J72712c27490
15960A97368a41062A04145a07978d9009k09824g6815L5859B22452a44277n6976
15950b01253l2539E2811j9978J54353l8021k602a05696A06630a24097j19916A00807
$$ plain form
15938 129590 -92566 140758 -225319 44 81227 -74899 -46917 -16986 210309 -183835 -145321
15927 -145321 -85988 346154 -175634 -25136 -59541 -143405 -57597 64584 145350 -108492 -37525
15915 -167224 -201450 233022 181421 29586 -93017 -97074 -28702 -374676 143892 -33934 -48233
15904 -48233 -27557 -408795 -101714 175180 101828 -384718 -418256 -518015 -1453 94863 216375
15893 216375 17598 -46848 -111988 -197190 -4364 107018 -113652 39628 251806 233719 235098
15882 235098 154308 -114718 301697 -8103 -229266 -7256 51462 -59691 -160675 -2727 29401
15870 193004 13679 173419 -72591 -432984 81127 56693 96513 -132632 160676 146464 139444
15859 139444 -145684 77122 -285704 -131258 95827 -94605 129033 -117786 223743 192518
$$ packed form
15938A29590i2566A40758b25319D4Q1183g4899K7982a6986B10309a83835L8514
15927a45321N9333C46154a75634b5136l4405q3864e7597F4584Q0766a08492c7525
15915a67224l4226B33022n1601B9586i3017m057b8702l45974A43892c3934j4299
15904d8233K0676l81238a01714A75180p3352c84718l3538r9759a453I4863J21512
15893B16375A7598d6848o5140q5202d364A07018a13652C9628K12178j8087J379
15882B35098q0790a14718C01697h103k21163g256E1462e9691j00984b727B9401
15870A93004A3679J59740g2591l60393H1127k4434L9820a32632A60676j4212p020
15859A39444a45684G7122b85704a31258I5827i4605A29033a17786B23743l1225
$$ plain form
15849 192518 72680 139500 -29800 52684 -142207 -265986 -7109 -62916 -236050 320944 165582
15838 165582 -32714 -279454 370386 24265 -326237 97052 -105651 -92975 73955 13236 -107474
15826 -252883 -96942 105818 26719 -171381 92145 -100378 -90509 -78137 183582 -59738 104753
15814 -386714 46934 -120612 -159374 -106932 -154800 16811 -87551 -107798 -66191 -240751 -197498
15803 -197498 25871 38699 132523 -106086 -153443 257858 67629 -37136 201435 -73118 120255
15791 -253409 273246 -305206 168073 136977 81308 140757 -153442 295072 174347 52141
15780 -192373 82217 -113775 -133933 -169091 -31458 130862 -61364 69684 -146241 -444044 -7341
15768 -42893 -120270 -140158 -138773 10049 380296 -86170 -75514 -34943 -99078 159965 269694
$$ packed form
15849A92518G2680O6820b9800E2684a42207j23779g109n5807j73134C20944j55362
15838A65582c2714k46740C70386B4265c26237I7052a05651J2676G3955A3236a07474
15826b52883i6942A05818B6719a71381I2145a00378R869J2372A83582e9738A04753
15814c86714D6934a20612l8762N2442m7868A6811h7551k0247M1607j74560M3253
15803a97498B5871J2828R3824a06086m7357B57858F7629c7136B01435g3118A20255
15791b53409B73246c05206A68073l1096n5669N9449a53442B95072j20725E2141
15780a92373H2217a13775k0158l5158c1458A30862f1364F9684a46241k97803g341
15768d2893p7377j9888J385A0049L70247h6170J0656c4943o4135A59965J09729
$$ plain form
15757 269694 -174853 504738 -258225 -195993 282167 -9379 -74882 -1025 -104747 204843 8848
15745 -278931 -119284 222512 -101601 200108 -218098 -167605 6304 -94512 57094 187891
15735 187891 225701 -162793 -36435 -30346 -339840 -34838 64391 50497 220036 96796 -77492
15723 -245584 274440 -205000 -78435 41814 63370 -152684 58407 -106089 210105 -6899 140166
15711 -1299 -6373 -50972 -110999 110718 -62181 -473269 278188 -322515 378509 132934 35133
15699 -188874 -63794 28785 -64908 -174695 -170197 -258099 -93627 -8129 239922 166219 210909
15688 210909 -281375 -91131 -12243 -8192 123374 -227983 -191712 -88218 113596 27170 -203338
15676 13665 -110365 -110929 -279753 -112515 -182732 202256 651930 140804 169859 103223 -195102
$$ packed form
15757B69694a74853E04738b58225O2232B82167i379o5503a025j03722B04843H848
15745b78931a19284B22512a01601B00108b18098N0493F304i4512E7094J30797
15735A87891L7810a62793c6435O089l09494c4838F4391j3894J69539I6796g7492
15723b45584B74440b05000g8435D1814K1556a52684E8407a06089B10105f899A40166
15711a299n074m4599o0027A10718f2181m11088B78188c22515C78509A32934C5133
15699a88874f3794B8785f4908j09787M498q7902i3627h129B39922p3703M4690
15688B10909b81375i1131a2243M051A23374b27983L6271h8218A13596B7170b03338
15676A3665a10365n64j68824a12515p0217B02256M49674A40804K9055o6636a95102
$$ plain form
15664 -284294 254262 197743 260907 -56987 -206266 145296 14536 -282558 179799 40523
15653 227539 -102429 -104138 -108541 -137348 316003 -23977 -55497 32 52568 16496 -130488 83104
15640 -161581 -120925 228162 18160 344446 23837 -184057 53257 183765 289459 -136537
15629 47935 -264633 234834 -56751 232812 -117232 -207407 15543 102754 3335 -82416 -175886
15618 -175886 -55838 257228 -267098 128751 -339702 104533 -109996 -306222 167700 -182190
15607 -215617 -509987 -66370 59566 58907 -60587 427264 41019 -130196 -352062 -219640 -123767
15596 -123767 80733 275136 -346433 234585 -187309 -47860 -179508 -20374 43555 -28498
15585 367616 50562 179994 11159 -490586 271882 -125427 -72649 83432 225432 106416
$$ packed form
15664b84294B54262n6519O3164e6987j49279A45296A4536b82558A79799D0523
15653B27539a02429j709m403k8807C16003b3977l1520C2N2536A6496a30488H3104
15640a61581M0656B28162A8160L26286B3837a84057E3257J30508J05694a36537
15629D7935b64633B34834e6751B32812a17232r0175A5543Q7211C335h2416r3470
15618a75886e5838B57228b67098A28751c39702A04533a09996j96226A67700a82190
15607b15617k94370f6370E9566o59f0587D27264D1019a30196k21866J32422R5873
15596a23767H0733J94403c46433B34585a87309d7860j31648b0374D3555b8498
15585C67616E0562J29432A1159d90586B71882a25427N2778H3432J42000A06416
$$ plain form
15574 -350520 -106554 114716 -25355 243613 -153998 -96199 84551 -182210 15672 54565
15564 54565 188726 15403 86481 187650 170630 -129293 -97983 318720 -175064 192929
15553 40147 71426 14859 -119431 157405 163169 194552 -152265 -5400 -182364 -250928 -53927
15541 141537 -61411 101882 123978 23061 -211083 -138892 224011 -121839 -83039 289321
15530 31513 17284 -105729 95876 17042 -137009 -13600 134865 145939 129434 -94218 16725
15518 233224 -184598 -128111 -139145 109791 -306532 -7632 221151 -144755 -131646 374689
15507 -84497 104448 -44486 -238066 57889 -30659 -101902 -129 -223551 61654 -1761 -144118
15496 -144118 -233043 -60980 -204049 -248315 81817 326581 -191391 -236485 -132075 -84037 167211
$$ packed form
15574c50520a06554A14716b5355B43613a53998N7799H4551a82210A5672L8893
15564E4565J34161A5403P1078J01169j7020a29293L1310C18720a75064A92929
15553D0147L1279A4859a19431A57405N764L1383a52265e400j76964o8564e3927
15541A41537f1411A01882K2096B3061b11083P2191B24011a21839L8800B89321
15530C1513j4229a05729I5876A7042a37009a3600A34865J1074j6505i4218A6725
15518B33224a84598N6487j1034A09791c06532g632B21151a44755J3109C74689
15507h4497A04448d4486j93580E7889c0659p1243a29k23422F1654a761j42357
15496a44118q8925f0980j43069m4266H1817K44764a91391m5094J04410M8038A67211
$$ plain form
15484 -45103 -304312 122355 -258175 182693 -156557 14442 -72725 -119519 190920 78422
15473 -191041 84128 -91157 -79268 117350 206833 -186261 94119 178032 343777 71495 -6005
15461 1474 17663 -120927 -252582 161252 -74596 -191678 129605 132039 13281 -2867 -74793
15450 -74793 -145862 -203049 159442 -100247 -99306 -116951 -262764 -13621 164996 -252837 -160413
15439 -160413 409975 -127483 81551 -120758 3948 380776 20595 331318 395704 261100
15429 261100 255565 -33712 -81487 135645 -219990 -76787 -49889 -111621 208960 313022 151747
15417 -323577 35781 52803 -104672 -85901 -20867 193536 73742 44702 32139 -91355 223081
15405 -120949 -173694 -200966 -275224 139753 -238997 -53216 -151611 125147 114455 -157436 278596
$$ packed form
15484d5103k59209A22355b58175A82693a56557A4442g2725m6794A90920G8422
15473a91041H4128i1157J1889A17350Q9483a86261I4119Q3913J65745G1495f005
15461A474J6189a20927j31655A61252g4596j17082A29605K434A3281b867p1926
15450g4793p1069n7187A59442a00247R41j7645j45813a3621A64996b52837R2424
15439a60413D09975a27483H1551a20758C948L76828B0595L10723O4386j34604
15429B61100n535c3712m7775A35645b19990g6787K6898o1732B08960J04062A51747
15417c23577C5781J7022a04672J8771b0867A93536G3742k9040j2563i1355B23081
15405a20949n2745k7272p4258A39753b38997e3216r8395A25147j0692a57436B78596
$$ plain form
15393 179443 -30601 -48247 -65747 -211318 -15324 -76509 41971 -85382 99346 -227689 74591
15381 -147158 158879 26055 141247 -44688 68333 280939 268442 24585 104549 163956 94135
15370 94135 172567 -101035 181489 73253 60519 87383 -201504 -33512 91897 30907 8341
15358 138980 -228331 106059 -55944 215097 -194600 -68733 103408 205830 -24958 -22912
15348 -22912 -8784 216779 -101247 332498 217124 330971 41604 182033 -67358 129359
15337 44399 171969 41503 -159155 -95378 -69470 86260 -3303 -74315 -93151 -169633 260369
15325 -190837 140972 -9208 178242 -249908 -56986 235721 270107 -119091 -5595 -114382 -48527
15313 151207 40982 136543 256031 -67122 243467 -374955 157352 33654 81052 162843 -123200
$$ packed form
15393A79443c0601j7646j7500j45571a5324o1185D1971h5382I9346b27689G4591
15381a47158A58879B6055J15192d4688F8333K12606j2497B4585P9964N9407o9821
15370I4135P8432a01035A81489G3253j2734K6864b01504c3512I1897C0907H341
15358A38980b28331A06059e5944B15097a94600f8733A03408J02422b4958K046
15348b2912h784B16779a01247C32498j15374J13847D1604J40429f7358A29359
15337D4399J27570D1503a59155O3777K5908H6260c303p1012j8836p6482B60369
15325a90837A40972i208A78242b49908e6986B35721L4386a19091e595j08787d8527
15313A51207D0982R5561J19488f7122B43467c74955A57352C3654M7398Q1791a23200
$$ plain form
15301 -188815 -170270 15985 316288 409813 372529 -55977 467682 -400714 -86753 -199988 239700
15289 230749 -17480 100887 20825 -56596 13641 -84016 92842 63222 206544 83711 292403
15278 292403 274086 -33850 11806 70929 121012 109321 -362495 221090 7764 -144832 34654
15266 70615 -133742 127767 91108 -14004 350127 239351 80212 314074 24359 -170623
15255 278924 -105144 -134433 67940 159834 437040 176249 221346 639401 1251406 1551909
15245 1551909 1514464 1718823 1192813 343425 191154 449920 40594 -36082 143395 159831
15235 159831 125120 -237163 227365 101752 148204 -261617 43627 -244595 -166219 -8860 264914
15223 257585 117722 52082 171302 -46635 -157314 -177392 -303403 -82441 103434 55499
$$ packed form
15301a88815J8545A5985L00303R3525l7284e5977D67682d00714h6753j13235B39700
15289B30749a7480A00887B0825e6596A3641h4016I2842k9620J43322H3711K08692
15278B92403j8317c3850A1806N9123N0083j1691c62495B21090G764a44832C4654
15266G0615a33742A27767l6659a4004C50127j10776H0212K33862B4359a70623
15255B78924a05144k9289F7940R1894K77206A76249M5097M18055O12005L00503
15245A551909l7445K04359n26010C43425j52271K58766D0594c6082A43395J6436
15235A59831l4711b37163B27365A01752M6452b61617D3627b44595P8376h860B64914
15223B57585A17722E2082J19220d6635j10679k0078j26011h2441A03434m7935
$$ plain form
15213 55499 90477 -163912 -65728 -253590 198796 26156 109102 186420 -125733 92025 183152
15202 183152 -95355 24723 134795 155864 -96440 -211578 62336 -51882 -131704 267179 54992
15190 339976 32894 -107431 -216739 160628 108462 -7295 254866 -166016 -71238 102041
15179 224696 131636 211760 45222 206836 89659 79100 249360 -85874 -162375 325164 245424
15168 245424 -146148 122353 251864 -175002 227091 182256 -71193 101998 -11330 98845
15157 150829 312504 265979 30737 7316 -212820 128928 42047 160220 -205786 215955
15146 69189 -128804 70339 117391 224997 -30646 221896 -1005 -66418 33210 186066 215571
15135 215571 170642 241709 38331 -86484 269336 158726 304968 -159128 346214 443827
$$ packed form
15213E5499L4978a63912f5728j87862A98796B6156Q2946P7318a25733I2025R1127
15202A83152i5355B4723J10072K1069i6440j15138F2336e1882p9822B67179E4992
15190C39976C2894a07431j09308A60628n2166g295B54866a66016g1238A02041
15179B24696r3060Q0124D5222J61614H9659j0559J70260h5874p6501C25164p9740
15168B45424a46148A22353J29511a75002B27091m4835g1193A01998a1330I8845
15157A50829J61675m6525C0737G316b12820A28928D2047J18173b05786B15955
15146F9189a28804G0339M7052J07606c0646B21896a005o5413C3210J52856K9505
15135B15571m4929P1067C8331h6484B69336j10610J46242a59128C46214R7613
$$ plain form
15125 443827 347952 299500 257704 -83892 -119988 146724 216854 330033 81396 69855 63245
15114 63245 144965 221994 144191 522564 227180 83660 218650 377915 129451 68739 157354
15103 157354 -6426 -115005 436857 95910 188596 -31203 188024 250994 -39489 169450 272652
15092 272652 146244 173174 297342 143701 341 130940 99676 -54101 -27298 147706 100181
15081 100181 169415 1924 171856 103403 -113025 200009 152509 214791 371979 308924 342858
15070 342858 247692 330060 277620 109309 110880 146984 333639 3473 -136643 -29606 99819
15058 -57256 -56561 240377 28070 376633 171020 316960 266326 434283 -1271 84632 96814
15047 96814 354514 -74063 147633 -18287 173336 158077 344123 351143 331540 227672 -55512
$$ packed form
15125D43827r5875m8452m1796h3892l6096A46724P0130J13179H1396j1541o610
15114F3245Q1720P7029p7803L78373B27180H3660J34990J59265A29451o0712Q8615
15103A57354f426j08579D36857I5910R2686c1203A88024O2970c9489A69450J03202
15092B72652j26408K6930J24168A43701C41J30599l1264e4101K6803A47706m7525
15081A00181O9234A924J69932o8453a13025B00009m7500O2282J57188o3055L3934
15070C42858r5166Q2368n2440A09309J571L6104J86655C473a36643b9606I9819
15058e7256O95B40377B8070L48563A71020J45940n0634J67957a271H4632J2182
15047I6814K57700g4063A47633a8287A73336j5259J86046P020j9603j03868e5512
$$ plain form
15035 90692 31776 -12479 90296 61331 370720 -162365 163170 114085 -54214 -10833 266141
15023 72652 319089 60080 508744 230235 285579 278807 323072 70355 -64538 397272 -70778
15011 84987 48455 30994 113204 217691 448415 -12561 208898 68707 535681 236681 179212
15000 179212 324026 20473 -23313 294232 153976 38532 415281 337001 184231 148920
14990 148920 217122 65555 345632 382688 88250 104623 308482 173331 165337 226802 156265
14979 156265 111665 390039 498000 -1307 216281 307611 388593 230235 522477 346015
14969 346015 415748 107771 284786 258739 381874 -93318 82824 405779 130403 135059 301244
14958 301244 15569 160722 34857 113446 332284 348640 285367 360393 163529 388127 299090
$$ packed form
15035I0692C1776a2479I0296k8965L09389a62365A63170m9085e4214a0833B66141
15023G2652K46437F0080M48664B30235N5344o772M4265G0355f4538C97272g0778
15011H4987l6532j7461Q2210J04487K30724a2561B08898F8707M66974B36681n7469
15000A79212J44814B0473b3313B94232j40256C8532L76749p8280j52770l5311
14990A48920O8202F5555K80077L7056H8250J6373K03859j35151p994O1465p0537
14979A56265m4600K78374J07961a307B16281R1330Q0982j58358K92242j76462
14969C46015O9733A07771J77015k6047J23135i3318H2824L22955A30403M656J66185
14958C01244A5569J45153C4857P8589K18838J6356o3273P5026A63529K24598q9037
$$ plain form
14947 299090 246504 482736 -21601 117690 408436 157116 253902 60595 194515 164195
14937 164195 390647 402384 528061 486886 142510 430151 491437 105513 301031 421374
14927 421374 154245 147672 72053 -40611 327394 -117888 339527 131544 272886 236488
14917 236488 386197 378287 289374 541233 -43796 146554 312960 456385 495234 426743 355529
14906 355529 302926 226156 304121 162063 312029 226270 401087 231566 262204 462123
14896 462123 471442 331123 127686 16569 736180 189520 464606 108290 474093 422223
14886 422223 587071 324489 616147 181791 469417 204364 97807 385082 475987 432593
14876 432593 589099 537807 10932 243789 435320 473392 348420 374439 518744 560481
$$ packed form
14947B99090n2586K36232b1601A17690K90746A57116R6786F0595J33920l0320
14937A64195K26452J1737J25677m1175A42510K87641O1286A05513J95518J20343
14927D21374A54245o573G2053d0611C27394a17888C39527A31544J41342l6398
14917B36488J49709p910q8913K51859d3796A46554J66406J43425L8849o8491p1214
14906C55529n2603p6770P7965j42058J49966q5759J74817j69521L0638J99919
14896D62123R319j40319A27686A6569P19611A89520K75086A08290L65803n1870
14886D22223J64848k62582K91658A81791K87626B04364I7807K87275R0905m3394
14876D32593J56506n1292A0932K32857J91531L8072j24972K6019J44305M1737
$$ plain form
14866 560481 690203 467642 99920 415329 614406 517856 197548 61790 244612 298873
14856 298873 542634 402538 192031 493210 480820 721608 425244 172835 406773 634098
14846 634098 191455 622405 453921 484797 303681 267580 117962 435832 177326 698500
14836 698500 153616 409335 582137 509150 829344 775065 329877 542135 279031 403908
14826 403908 557760 502773 597523 359588 622786 198398 481178 261181 695152 484210
14816 484210 440405 724955 275477 522539 351351 592180 677897 583238 365305 725169
14806 725169 467138 454052 529668 579127 382371 893788 786036 338245 696319 614240
14796 614240 544245 905050 777934 582261 632142 801625 917740 610454 366783 530628
$$ packed form
14866E60481J29722k22561I9920L15409J99077r6550A97548F1790J82822N4261
14856B98873K43761j40096A92031L01179j2390K40788k96364A72835K33938K27325
14846F34098A91455M30950j68484L0876j81116l6101A17962L17870A77326N21174
14836F98500A53616K55719J72802p2987L20194n4279C29877K12258k63104J24877
14826D03908J53852n4987R4750k37935K63198A98398K82780k19997M33971k10942
14816D84210m3805K84550B75477K47062j71188K40829Q5717r4659k17933L59864
14806G25169k58031j3086P5616M9459j96756N11417j07752C38245L58074q2079
14796F14240o9995L60805j27116j95673M9881J69483J16115l07286k43671J63845
$$ plain form
14786 530628 809140 350374 426079 540156 389384 322928 714162 668961 282165 909408
14776 909408 435341 201723 704129 322310 204895 811763 251789 857526 715827 461969
14766 461969 567929 667805 662752 627146 691979 477111 532426 777093 479094 500063 749404
14755 749404 389145 354378 729168 598417 865376 890245 852285 677322 707511 524358
14745 524358 727328 502333 576320 874190 509512 674438 722045 801856 796085 797228 715253
14734 715253 616922 837665 524235 379723 385307 805581 745360 713875 480171 817904
14724 817904 712696 647722 964392 696527 626540 972729 714030 718933 629369 582712 611803
14713 611803 818812 747388 885288 312183 892459 941953 657843 876010 843803 656469
$$ packed form
14786E30628K78512C50374P5705J14077j50772o6456L91234m5201B82165O27243
14776I09408D35341B01723N02406C22310j17415O06868B51789O05737j41699k53858
14766D61969J05960R9876n053l5606O4833k14868N5315K44667k97999K0969K49341
14755G49404l60259l4767L74790j30751K66959K4869l7960j74963L0189j83153
14745E24358K02970k24995P3987K97870l64678J64926M7607P9811n771J143q1975
14734G15253r8331K20743l13430j44512N584M20274o0221l1485k33704L37733
14724H17904j05208o4974L16670k67865o9987L46189k58699M903q9564m6657K9091
14713F11803K07009p1424J37900C12183N80276M9494k84110K18167l2207j87334
$$ plain form
14703 656469 1028498 714689 882753 955525 780464 920489 1006863 809910 976348 849726
14693 849726 1108023 969755 883317 663192 940441 890138 938707 1039736 993274 991665 950995
14682 950995 603950 533801 838091 790184 883326 967358 1201110 858201 1032233 767001
14672 767001 1194899 1022346 967747 1182085 997027 885439 1177264 1575272 660295 832465
14662 832465 1238512 1122965 1267755 996086 1247847 880894 981366 1205196 1331112 773761
14652 773761 1036440 885614 1275187 1237543 1346376 1157592 1421165 1106082 1648365 960180
14642 960180 1142019 1345812 1016732 1063848 1023334 1189443 1496113 1164572 1360545 1373806
14632 1373806 1223136 1413646 1378488 1566874 1460583 1085381 1244891 1481080 1381705 1558399
$$ packed form
14703F56469L72029l13809J68064P2772j75061J40025Q6374j96953J66438j26622
14693H49726K58297j38268q6438k20125K77249n0303M8569J01029m6462j609m0670
14682I50995l47045p0149L04290m7907R3142Q4032K33752l42909J74032k65232
14672G67001M27898j72553n4599K14338j85058j11588K91825L98008F60295J72170
14662H32465M06047j15547J44790k71669K51761l66953J00472K23830J25916n57351
14652G73761K62679j50826L89573l7644J08833j88784K63573l15083N42283o88185
14642I60180J81839K03793l29080M7116m0514J66109L06670l31541J95973J3261
14632A373806j50670J90510l5158J88386j06291l75202J59510K36189r9375J76694
$$ plain form
14622 1558399 1179059 1400621 1436204 1364719 1708433 1401895 1654745 1311672 1327906 1674770
14612 1674770 1517175 1272385 1322608 1273180 1408037 1857881 1300493 1492478 1578898 1304548
14602 1304548 1759504 1672508 1485964 1574347 1641542 1752628 1763804 1614769 1502703 1632757
14592 1632757 1940688 1565660 1313090 1781801 2071271 1842067 2079569 1801508 1714145 1631834
14582 1631834 2030334 1788802 1880403 1823236 1664010 1765907 1922204 2207603 2089673 1845329
14572 1845329 1876986 2099170 2169264 2417938 2171869 2288410 2180754 2341297 2719951 2412097
14562 2412097 2458125 2927744 2940523 2614822 2909885 2495500 2958677 3467294 2933047 3674293
14552 3674293 3804864 4285602 5216077 7169129 10772419 21139041 35299582 48109181
$$ packed form
14622A558399l79340K21562L5583p1485L43714l06538K52850l43073J6234L46864
14612A674770j57595k44790N0223m9428J34857M49844n57388J91985Q6420k74350
14602A304548M54956q6996j86544Q8383O7195J11086J1176j49035j12066J30054
14592A632757L07931l75028k52570M68711K89470k29204K37502k78061q7363q2311
14582A631834L98500k41532R1601n7167j59226J01897J56297K85399j17930k44344
14572A845329L1657K22184P0094K48674k46069J16541j07656J60543L78654l07854
14562B412097M6028M69619J2779l25701K95063m14385M63177N08617n34247P41246
14552C674293J30571M80738R30475J953052L603290J0366622J4160541J2809599
$$ plain form
14544 48109181 24210930 10200914 6028890 3130862 2127459 2014545 1856983 1831565
14536 1831565 1950916 2008459 2068833 2220795 2158824 1632578 1897314 1783471 1960538 2362238
14526 2362238 2008260 2212101 2344972 2189638 2603005 2243960 2551452 2637210 2331844 2567725
14516 2567725 2563785 2424287 2670029 2582570 2342067 2795150 2486613 2981665 2937996 2694897
14506 2694897 2828898 2790664 2948090 2889013 2733297 2823203 3245987 2996388 3236558 3149096
14496 3149096 3435104 3054081 3404942 3424214 3405059 3629684 3407532 3485594 3405720 3443724
14486 3443724 3495671 3629037 3471589 3796245 3885678 3436250 4042295 3669310 3425125 3753526
14476 3753526 4288993 4052861 4126217 4280171 4317048 4296058 4430933 4291127 4717255 4408249
$$ packed form
14544D8109181k3898251A0200914m172024k898028j003403j12914j57562k5418
14536A831565J19351N7543O0374J51962o1971n26246K64736j13843J77067M01700
14526B362238l53978K03841J32871j55334M13367l59045L07492Q5758l05366K35881
14516B567725l940j39498K45742q7459k40503M53083l08537M95052m3669k43099
14506B694897J34001l8234J57426n9077j55716Q9906M22784k49599K40170q7462
14496C149096K86008l81023L50861J9272j9155K24625k22152P8062p9874L8004
14486C443724N1947J33366j57448L24656Q9433m49428O06045l72985k44185L28401
14476C753526N35467k36132P3356J53954L6877k0990J34875j39806M26128l09006
$$ plain form
14466 4408249 4482370 4420016 4560253 4840597 4865021 4872323 4707310 4474675 4566635 4735505
14456 4735505 5115808 5519493 4881932 5436929 5063407 5330610 5545165 5753534 5332553
14447 5332553 5126697 5865851 5712519 5850519 5852526 5943243 6099217 6228936 6159992 6299191
14437 6299191 6193616 6055716 6157310 6506326 6603898 6702903 6942198 6930901 7035404 7216323
14427 7216323 6797573 7239126 7446240 7451152 7285563 7619748 7510119 7884343 7881548 7814529
14417 7814529 8210304 8396579 8314173 8736014 8786846 8826356 9016518 9001008 9314254 9185010
14407 9185010 9225026 9414542 9745482 9956205 9934194 9948498 10136342 10601568 10705773 10606751
14397 10606751 11212338 10935967 11293040 11557568 11550297 11938009 12075734 12089005 11992307 12565756
$$ packed form
14466D408249P4121o2354J40237K80344K4424P302j65013k32635R1960J68870
14456D735505L80303M03685o37561N54997l73522K67203K14555K08369m20981
14447E332553k05856P39154j53332J38000K007R0717J55974J29719o8944J39199
14437F299191j05575j37900J01594L49016R7572R9005K39295j1297J04503J80919
14427G216323m18750M41553K07114M912j65589L34185j09629L74224k795o7019
14417G814529L95775J86275q2406M21841N0832L9510J90162j5510L13246j29244
14407I185010M0016J89516L30940K10723k2011J4304J87844M65226J04205r9022
14397A0606751O05587k76371L57073K64528p271L87712J37725J3271r6698N73449
$$ plain form
14387 12565756 12700809 12977981 13073276 13228628 13544910 13796780 14380441 14409696 14623778 14813580
14377 14813580 14995469 15783880 16055365 16213947 16494662 16588604 17018453 17107686 17359732 17795111
14367 17795111 18295020 18753312 19077295 19506679 20010845 20839847 20932309 21483899 22080954
14358 22080954 22280716 22920876 23659093 23685548 24261527 25116562 25385166 26062645 26603782
14349 26603782 27310594 28216989 28585224 29378048 30048149 31524824 32019687 32844098 33436308
14340 33436308 34498410 35700922 36445540 37578251 38668520 40124267 40952147 42331072
14332 42331072 43423265 44764576 46551171 47644257 49184481 50794796 52608231 54262050
14324 54262050 55866892 58293204 60283683 62537744 64684686 67283807 69607156 72052364
$$ packed form
14387A2565756J35053K77172R5295J55352L16282K51870N83661K9255K14082J89802
14377A4813580J81889P88411K71485J58582K80715R3942M29849Q9233K52046M35379
14367A7795111M99909M58292L23983M29384N04166Q29002R2462N51590N97055
14358B2080954J99762O40160P38217K6455N75979Q55035K68604O77479N41137
14349B6603782P06812R06395L68235P92824O70101J476675M94863Q24411N92210
14340C3436308J062102J202512P44618J132711J090269J455747Q27880J378925
14332D2331072J092193J341311J786595J093086J540224J610315J813435J653819
14324E4262050J604842K426312J990479K254061K146942K599121K323349K445208
$$ plain form
14316 72052364 74595859 78116972 80947458 84196061 87494002 91400709 94965728 98917056
14308 98917056 103648130 108247811 112819977 118364148 123731722 129432707 135856412 142271073
14300 142271073 149294221 156506013 164449880 173196773 181901282 191477374 201623477 212167327
14292 212167327 223106617 235132356 247775033 260867585 274763089 288888257 303617408
14285 303617408 318959153 334688889 350437685 366626759 382463377 397426604 412683013
14278 412683013 426834278 439336051 450344005 459581469 466348584 470208924 469749721 463823405
14270 463823405 459579149 459010476 453753002 448044299 438926225 426836483 413528560 399256024
14262 399256024 384130144 368531298 352630560 336461438 320760422 305041821 290246355
$$ packed form
14316G2052364K543495L521113K830486L248603L297941L906707L565019L951328
14308I8917056M731074M599681M572166N544171N367574N700985O423705O414661
14300A42271073P023148P211792P943867Q746893Q704509R576092J0146103J0543850
14292B12167327J0939290J2025739J2642677J3092552J3895504J4125168J4729151
14285C03617408J5341745J5729736J5748796J6189074J5836618J4963227J5256409
14278D12683013J4151265J2501773J1007954R237464O767115L860340m59203n926316
14270D63823405m244256n68673n257474n708703r118074j2089742j3307923j4272536
14262C99256024j5125880j5598846j5900738j6169122j5701016j5718601j4795466
$$ plain form
14255 290246355 275541937 261729891 249305159 236586342 224548535 213027484 202119164
14248 202119164 192010903 182525396 173721912 165021510 157656021 149813741 142704596 136161687
14240 136161687 129770090 124059987 118590525 113860434 108662475 104158434 99460659 95252222
14232 95252222 92102355 88335561 84847107 81202864 78371980 74985762 72526778 69803239
14224 69803239 66984638 64844471 62553360 60179019 58544100 56600178 54773203 52572332
14216 52572332 51103646 49473658 48224688 46774781 45128859 43529067 42280658 41262292
14208 41262292 40344861 39302661 38290228 37193592 36236445 34426865 33806424 33147486 32539272
14199 32539272 31809088 30651062 29620189 29180962 28391539 27595054 27198596 26270001 25809335
$$ packed form
14255B90246355j4704418j3812046j2424732j2718817j2037807j1521051j0908320
14248B02119164j0108261r485507q803484q700402p365489p842280p109145o542909
14240A36161687o391597n710103n469462m730091n197959m504041m697775m208437
14232I5252222l149867l766794l488454l644243k830884l386218k458984k723539
14224F9803239k818601k140167k291111k374341j634919j943922j826975k200871
14216E2572332j468686j629988j248970j449907j645922j599792j248409j018366
14208D1262292r17431j042200j012433j096636r57147j809580o20441o58938o08214
14199C2539272p30184j158026j030873m39227p89423p96485l96458r28595m60666
$$ plain form
14190 25809335 24970362 24489793 23797259 23110034 23004686 22193819 21850334 21252709 20812150
14181 20812150 20245684 20141283 19192125 18970173 18547014 18459694 17835270 17640198 17365168
14172 17365168 16519940 16253155 16173887 16103879 15624594 14898410 14907551 14796807 14186217 13924371
14162 13924371 13845578 14005686 13118814 13514724 13041075 13106926 12707736 12550807 12060559 11815359
14152 11815359 11318639 11306577 11018098 10899500 10622070 10921594 10559387 10360354 10338846 10020641
14142 10020641 9941513 9816380 9584435 9763089 9300206 9140391 9066043 9008526 8686940 8328892
14132 8328892 8752645 8356992 8194949 8143636 7889228 7684990 7903486 7501819 7583465 7442599
14122 7442599 7338759 7311244 7282710 7151268 7211370 7088979 6873837 6457656 6635874 6581353
$$ packed form
14190B5809335q38973m80569o92534o87225j05348q10867l43485n97625m40559
14181B0812150n66466j04401r49158k21952m23159q7320o24424j95072k75030
14172A7365168q45228k66785p9268p0008m79285p26184R141j10744o10590k61846
14162A3924371p8793J60108q86872L95910m73649O5851l99190j56929m90248k45200
14152A1815359m96720j2062k88479j18598k77430K99524l62207j99033k1508l18205
14142A0020641p9128j25133k31945J78654m62883j59815p4348n7517l21586l58048
14132H328892M23753l95653j62043n1313k54408k04238K18496m01667Q1646j40866
14122G442599j03840k7515k8534j31442O0102j22391k15142m16181J78218n4521
$$ plain form
14112 6581353 6558750 6836059 6081305 6330773 6102084 6003646 6124752 6002665 5709346 5582878
14102 5582878 5596904 5559153 5793216 5360613 5374298 5406195 5497813 5243463 5279208 5079069
14092 5079069 5329689 5045249 5181391 5026774 4932607 4839799 4844462 4860235 4782301 4537114
14082 4537114 4489081 4317921 4897754 4420620 4098185 4128005 4145717 4187452 4004151 4142724
14072 4142724 4203332 3995092 3946886 3805093 4083779 3935117 3990320 3672772 3918669 3888088
14062 3888088 3724517 3385935 3924832 3734152 3769986 3605761 3440807 3620672 3459547 3596598
14052 3596598 3757527 3457335 3380843 3331026 3092233 3131090 3201602 3068495 2850041 3044209
14042 3044209 3082002 2821479 3331172 2916310 3086376 2922588 2605832 2841898 2984380 3054590
$$ packed form
14112F581353k2603K77309p54754K49468k28689r8438J21106j22087k93319j26468
14102E582878J4026l7751K34063m32603J3685L1897R1618k54350L5745k00139
14092E079069K50620k84440J36142j54617r4167r2808M663J5773p7934k45187
14082D537114m8033j71160N79833m77134l22435K9820J7712M1735j83301J38573
14072D142724O0608k08240m8206j41793K78686j48662N5203l17548K45897l0581
14062C888088j63571l38582N38897j90680L5834j64225j64954J79865j61125J37051
14052C596598J60929l00192p6492m9817k38793L8857P0512j33107k18454J94168
14042C044209L7793k60523N09693m14862J70066j63788l16756K36066J42482P0210
$$ plain form
14032 3054590 2924639 3095547 2962626 2514942 2963039 2602354 2780907 2336285 2396156 2780027
14022 2780027 2431224 2461202 2398900 2450692 2418279 2444118 2220006 2420597 2162444 2216093
14012 2216093 2186507 2436969 2369480 1988272 2056458 2177934 2041418 2229983 1928140 2141496
14002 2141496 1959073 1902586 1769038 2097626 1966027 1800983 1999540 1855806 1942520 1653873
13992 1653873 1978392 2238424 2303763 2792802 5129071 13898062 28238000 47497847 30020315
13983 30020315 13332356 7623252 5083518 4319679 3894587 3598779 3128016 2845935 2885201
13974 2885201 2739247 2804932 2389219 2585821 2005299 2116888 2160253 2219497 2189537 2071544
13964 2071544 2267674 2068043 1916235 1661442 1959258 2228606 1850746 1749985 1674127 2050476
$$ packed form
14032C054590j29951J70908j32921m47684M48097l60685J78553m44622N9871L83871
14022B780027l48803K9978o2302N1792l2413K5839k24112K00591k58153N3649
14012B216093k9586K50462o7489l81208O8186J21476j36516J88565l01843K13356
14002B141496j82423n6487j33548L28588j31599j65044J98557j43734Q6714k88647
13992A653873L24519K60032O5339M89039K336269Q768991J4339938J9259847j7477532
13983C0020315A3332356n709104k539734p63839m25092k95808m70763k82081L9266
13974B885201j45954O5685m15713J96602n80522J11589M3365N9244k9960j17993
13964B071544J96130j99631j51808k54793K97816K69348l77860j00761p5858L76349
$$ plain form
13954 2050476 2019973 1840168 2209308 1837366 1800672 2149679 1527312 1821000 1828345 1608073
13944 1608073 1748352 1660604 1605566 1715766 1514867 1725649 1723215 1533593 1728809 1718959
13934 1718959 1473613 1366124 1545315 1405922 1288235 1755992 1628694 1592941 1321385 1677688
13924 1677688 1445335 1288995 1225554 1333839 1536089 1645585 1338087 1571114 1388229 1626441
13914 1626441 1331091 1377271 1322352 1299010 1201763 1361836 1325595 1038184 1276079 1350410
13904 1350410 1435054 1332093 1357138 1423482 1443083 1394940 1435993 1087621 1520267 1127951
13894 1127951 903744 997443 1121044 909297 1021332 1388196 956792 1255413 983081 944370
13884 944370 1056398 1158946 1131153 1345106 1012888 961960 1077820 1080651 1303024 1233898
$$ packed form
13954B050476l0503j79805L69140l71942l6694L49007o22367K93688P345k20272
13944A608073J40279q7748n5038J10200k00899K10782k434j89622J95216r850
13934A718959k45346j07489J79191j39393j17687M67757j27298l5753k71556L56303
13924A677688k32353j56340o3441J08285K02250J09496l07498K33027j82885K38212
13914A626441k95350M6180n4919k3342r7247J60073l6241k87411K37895P4331
13904A350410Q4644j02961K5045O6344J9601m8143M1053l48372M32646l92316
13894A127951k24207R3699J23601k11747J12035L66864m31404K98621k72332l8711
13884I44370J12028J02548k7793K13953l32218n0928J15860K831K22373o9126
$$ plain form
13874 1233898 1105922 1065829 987195 1116597 953751 1170828 1043514 675557 929184 902483
13864 902483 1329802 1298047 1004269 872665 1116418 992963 948666 880483 947256 1004210
13854 1004210 1069250 898330 889558 628246 839209 921851 1120473 857238 967558 1108046
13844 1108046 888879 1009884 740817 720846 1100663 948804 933646 600467 690903 940851
13834 940851 776420 779333 972460 778221 782840 759241 870324 663321 967310 796710
13824 796710 657290 502608 1099338 1044095 700818 745888 690281 865699 743389 1061369
13814 1061369 654034 622257 1007595 613372 1013768 408672 618644 838815 770733 1117701
13804 1117701 1084316 872706 609424 733479 1048269 613273 703670 709583 792718 277742
$$ packed form
13874A233898j27976m0093p8634J29402j62846K17077j27314l67957K53627k6701
13864I02483M27319l1755k93778j31604K43753j23455m4297o8183O6773N6954
13854A004210O5040j70920q772k61312K10963Q2642J98622k63235J10320J40488
13844A108046k19167J21005k69067j9971L79817j51859j5158l33179R0436K49948
13834I40851j64431K913J93127j94239M619k3599J11083k07003L03989j70600
13824G96710j39420j54682N96730n5243l43277M5070n5607J75418j22310L17980
13814A061369m07335l1777L85338l94223M00396D08672K09972K20171o8082L46968
13804A117701l3385k11610k63282J24055L14790m34996R0397N913Q3135B77742
$$ plain form
13793 965590 811515 852563 783997 466773 581202 997158 567268 795827 907904 789903
13783 789903 884655 536200 792946 810521 697313 548452 485825 676004 821189 976763
13773 976763 694196 483880 543210 317594 617769 857797 742166 689122 523598 883051
13763 883051 572832 811731 764868 620141 297503 724044 897111 821409 338140 650300
13753 650300 309420 761237 629323 851391 476167 591282 886378 442537 430568 510781
13743 510781 565511 581708 701347 342025 442953 701492 433581 713104 620293 273991
13732 626189 744090 483533 578464 197273 542836 617832 807300 477380 388691 578655
13722 578655 367697 341186 547881 347947 625243 375016 371084 298802 457743 431528
$$ packed form
13793I65590j54075M1048o8566l17224J14429M15956m29890K28559J12077j18001
13783G89903R4752l48455K56746J7575j13208j48861o2627J90179J45185J55574
13773I76763k82567k10316N9330k25616L00175K40028j15631n3044j65524L59453
13763H83051l10219K38899m6863j44727B97503M26541J73067p5702C38140L12160
13753F50300C09420M51817j31914K22068l75224J15115K95096D42537j1969Q0213
13743E10781N4730J6197J19639C42025J00928K58539k67911K79523r2811B73991
13732F26189J17901k60557R4931A97273L45563P4996J89468l29920q8689J89964
13722E78655k10958k6511K06695j99934K77296k50227l932p2282J58941k6215
$$ plain form
13712 431528 132198 519494 569218 439378 552712 606556 539393 632770 676198 369187
13702 369187 218693 504717 712278 595704 579095 320351 645121 463132 484446 494524
13692 494524 734302 322928 363047 683826 456332 495053 264106 388222 600385 484775
13682 484775 235739 98905 463657 704392 519338 197244 466914 387304 358400 258385
13672 258385 209033 334205 437295 252897 313705 305444 293255 303450 592501 568416 532627
13661 532627 368459 193513 426071 388720 558589 514270 128411 347484 425451 493410
13651 493410 333326 -24724 294627 583925 114717 246334 309432 264879 454413 335602
13641 335602 537341 148754 805560 582829 227181 205736 655165 623583 110851 901007
$$ packed form
13712D31528A32198L87296M9724j29840J13334N3844o7163R3377M3428l07011
13702C69187j50494K86024K07561j16574j6609k58744L24770j81989K1314J0078
13692D94524K39778C22928M0119L20779k27494L8721k30947J24116K12163j15610
13682D84775B35739I8905L64752K40735j85054A97244K69670p9610k8904j00015
13672B58385m9352J25172J03090j84398O0808q261j2189J0195K89051k4085l5789
13661E32627j64168j74946K32558l7351J69869m4319A28411K19073P7967O7959
13651D93410j60084b4724B94627K89298A14717J31617O3098m4553J89534j18811
13641C35602K01739A48754O56806k22731B27181k1445M49429l1582A10851P90156
$$ plain form
13631 901007 226445 384251 434822 131478 401101 285914 336762 439635 390567 428347
13621 428347 406028 355172 494777 286158 467642 450356 564735 69102 439604 404096
13611 404096 138506 581097 471799 308283 90276 521959 736662 194436 202149 459887
13601 459887 330289 417294 76943 436440 239953 193400 532153 377322 170506 452457
13591 452457 277338 608051 82000 355324 332897 -169011 111540 125911 211106 134947
13581 134947 362668 -36443 45524 17199 381079 301129 196093 284579 94261 459863 317019
13570 317019 363961 418044 344066 97516 303653 215021 722140 101047 330681 313519 177937
13559 177937 381742 264349 346478 437631 345943 395448 167245 172635 106472 376990 76268
$$ packed form
13631I01007B26445J57806N0571A31478K69623j15187N0848J02873m9068L7780
13621D28347k2319n0856J39605k08619J81484j7286J14379F9102L70502l5508
13611D04096A38506M42591j09298j63516I0276M31683K14703A94436P713K57738
13601D59887j29598Q7005G6943L59497j96487m6553L38753j54831A70506K81951
13591D52457j75119L30713H2000K73324k2427a69011A11540J4371Q5195p6159
13581A34947K27721c6443D5524A7199L63880p9950j05036Q8486I4261L65602j42844
13570C17019M6942N4083p3978I7516K06137q8632N07119A01047K29634j7162j35582
13559A77937K03805j17393Q2129R1153r1688M9505A67245N390o6163K70518G6268
$$ plain form
13547 325580 407969 403075 391578 -108801 -8908 139747 144462 -85006 -125764 11645 145260
13536 145260 399195 13079 298177 376301 461245 473515 246396 519067 535320 36208 84220
13525 84220 154574 157510 232822 253310 406956 243666 93799 -16374 76774 -27157 406759
13513 320289 57522 14654 185250 -166333 330357 515138 178285 264474 470145 203106
13502 47767 92142 593905 134630 322444 143520 108692 386966 30518 165272 139590
13492 139590 332244 -14822 50402 164737 200796 105670 218485 115536 141831 84240 92661
13481 92661 240052 163305 72687 44706 482243 -184219 289093 82128 -34866 331401 351510
13470 351510 585451 -394185 190504 153151 29735 292013 -231299 450275 186179 24093
$$ packed form
13547C25580Q2389m894j1497a08801h908A39747M715h5006m0758A1645J33615
13536A45260K53935A3079K85098P8124Q4944J2270k27119K72671J6253C6208M8012
13525H4220P0354K936P5312K0488J53646j63290I3799a6374G6774b7157D06759
13513C20289E7522A4654J70596a66333C30357J84781A78285Q6189K05671B03106
13502D7767M4375N01763A34630J87814A43520l4828K78274C0518J34754k5682
13492A39590J92654a4822E0402J14335L6059r5126J12815j02949K6295n7591Q421
13481I2661J47391p6747G2687k7981M37537a84219B89093H2128c4866C31401K0109
13470C51510K33941c94185A90504l7353B9735K62278b31299D50275A86179B4093
$$ plain form
13459 182275 140548 363104 123269 318223 102742 156352 58615 362325 508589 375772
13449 375772 120282 58628 211869 259687 394377 329850 -43614 302885 81061 113992 222930
13438 222930 175038 391470 488302 159299 368991 422201 169967 -62451 373016 190708
13428 190708 22524 250748 212170 344642 173712 67932 318092 290090 243094 383965
13418 383965 146422 374667 68370 632919 -90309 344117 128688 85661 230185 472266
13408 472266 353161 -261387 382360 169500 202125 426954 267667 105869 130714 52729
13397 442629 137930 375516 219580 120851 245557 211125 217621 -41053 -70738 51218 216880
13386 216880 399631 368198 355218 -16839 -782 171678 257609 193916 281425 358041 112304
$$ packed form
13459A82275m1727K22556A23269J94954A02742N3610E8615L03710J46264j32817
13449C75772A20282E8628J53241M7818J34690o4527d3614C02885H1061L2931J08938
13438B22930m7892K16432R6832A59299K09692N3210A69967f2451C73016j82308
13428A90708B2524K28224l8578J32472j70930F7932K50160k8002m6996J40871
13418C83965A46422K28245F8370N64549i0309C44117A28688m3027J44524K42081
13408D72266j19105b61387C82360A69500L2625K24829j59287A05869K4845E2729
13397D42629A37930K37586j55936r8729J24706l4432O496d1053k9685E1218J65662
13386B16880J82751l1433j2980a6839g82A71678Q5931o3693Q7509P6616A12304
$$ plain form
13374 284123 115669 212970 286718 -148584 393184 315984 227782 207364 434345 297819
13364 297819 -5007 84154 58057 213400 167700 206535 140190 51927 185168 237135 148641
13353 148641 215120 307642 915 365026 381745 272680 285846 48876 257799 438604 159507
13341 93455 277662 368424 409411 206247 98447 162899 161678 545813 446611 465352 132112
13329 359639 303130 411228 219768 265607 46968 338028 210167 641744 382054 -52599
13318 484672 -224266 129314 -69022 -50521 128839 195339 304894 -44252 427570 287629
13308 287629 20848 97017 146610 -51196 -92136 115825 31148 401617 -47543 81952 123496
13297 123496 229942 212615 -33844 117232 380728 -75103 -38199 26075 559955 -107468
$$ packed form
13374B84123A15669R7301P3748a48584C93184p7200q8202k0418K26981j36526
13364B97819e007H4154k6097J55343m5700L8835o6345E1927J33241N1967q8494
13353A48641O6479R2522I15L64111J6719j09065J3166D8876K08923J80805A59507
13341I3455J84207R0762M0987k03164I8447O4452j221L84135r9202J8741A32112
13329C59639n6509J08098j91460M5839D6968K91060j27861M31577k59690e2599
13318D84672b24266A29314f9022J8501A28839O6500J09555d4252D27570j39941
13308B87629B0848P6169M9593e1196m0940A15825C1148L70469d7543H1952M1544
13297A23496J06446j7327c3844A17232K63496g5103L6904B6075N33880a07468
$$ plain form
13286 12135 -92287 210798 273621 200837 113760 190626 76474 575880 -16175 344975 171074
13274 168839 7545 31180 -191201 473050 -25076 289961 113933 -9124 100146 -5990 -102700
13263 -102700 41932 32852 285472 337913 201568 -113840 132841 32102 -37251 18332 157014
13252 157014 159566 -178812 292847 290642 130600 -6541 -244367 -16835 3901 250676 -12230
13240 310676 115705 92836 92590 120185 77264 139741 -124164 378684 85789 234109 48719
13228 25225 -31655 322043 -144560 312723 -311458 191131 -54140 66857 163615 2274 379386
13217 379386 23582 116121 34658 -117317 183326 -45095 83704 -3084 -211195 64149 13238
13205 62732 193865 58066 128307 5974 116842 113134 111638 -15782 2313 419009 -175229 152729
$$ packed form
13286A2135i2287B10798O2823p2784q7077P6866G6474M99406a6175C44975A71074
13274A68839G545K3635a91201D73050b5076B89961A13933i124A00146e990r6710
13263a02700D1932r080K52620N2441j36345a13840A32841C2102c7251A8332J38682
13252A57014K552a78812B92847k205A30600f541k37826a6835C901K46775a2230
13240C10676A15705k2869k46K7595m2921O2477a24164C78684H5789J48320D8719
13228B5225c1655C22043a44560C12723c11458A91131e4140F6857R6758B274L77112
13217C79386B3582R2539C4658a17317A83326d5095H3704c084k08111F4149A3238
13205F2732J31133E8066P0241E974J10868l708j496a5782B313M16696a75229A52729
$$ plain form
13192 -58496 -20453 343113 -148368 -1344 69863 -118827 159197 -121666 177885 -143470
13181 -175227 -177429 362283 69977 318803 -22983 125923 341269 183473 40127 -10751 -87609
13170 -87609 -232961 234588 160170 72233 43561 35640 -254218 30899 -284794 49123 80327
13159 80327 210717 -145612 139511 -61773 -219509 83037 192056 15276 12840 -105576 -158275
13148 -158275 82220 90124 105269 -46203 76626 -200038 139729 -223240 18218 93163 306562
13137 306562 168613 86735 245219 8513 296678 -59661 162352 -13262 233409 187702 -25292
13125 -28909 205393 -88041 -104400 -44111 63775 86756 172550 -480886 326175 91176 -47392
13113 115951 138180 53379 -139468 118145 -134220 -36132 8530 -40027 98112 134451 226032
$$ packed form
13192e8496b0453C43113a48368a344F9863a18827A59197a21666A77885a43470
13181a75227k202C62283F9977K48826b2983A25923K15346j57796D0127a0751p6858
13170h7609j45352B34588p4418G2233k8672p921b54218C0899b84794D9123L1204
13159H0327J30390a45612A39511f1773j57736H3037J09019A5276k436a05576n2699
13148a58275H2220P904J5145d6203G6626b00038A39729b23240A8218P4945K13399
13137C06562j37949q1878J58484H513K88165e9661A62352a3262B33409m5707b5292
13125b8909B05393h8041j6359d4111F3775K2981Q5794d80886C26175I1176d7392
13113A15951K2229E3379a39468A18145a34220c6132H530d0027I8112L6339R1581
$$ plain form
13102 226032 79928 436145 196865 75903 156928 -17529 268279 185935 -72628 194526 -32060
13090 -273210 -312993 -212725 253879 382402 -152574 -65900 53060 140442 178158 -36222 382217
13078 87155 129839 98915 -35556 -222423 40620 901 379307 114194 -191266 340927 239698
13067 239698 -6513 16269 39912 147740 41353 341302 448187 -82558 44506 83336 -19307
13055 140054 -516627 -151066 362479 -130418 135490 -88301 206746 150443 257660 312010
13045 312010 -2019 190621 303868 82304 67550 -332151 151116 223170 214495 235306 42600
13033 82556 72473 238769 124244 44823 78816 143241 -127426 414554 109343 -28269 -91641
13022 -91641 69659 208280 166298 260826 84339 105415 132562 116053 95428 305828 -248931
$$ packed form
13102B26032G9928L56217A96865G5903Q1025a7529B68279q2344g2628A94526c2060
13090b73210l9783J00268B53879J28523a52574f5900E3060Q7382L7716c6222C82217
13078H7155M2684l0924c5556j86867D0620I01L78406A14194a91266C40927j01229
13067B39698f513A6269K3643J07828D1353K99949J06885h2558D4506L8830a9307
13055A40054e16627a51066C62479a30418A35490h8301B06746n6303J07217N4350
13045C12010b019A90621J13247H2304j4754c32151A51116P2054q675K0811D2600
13033H2556j0083J66296j14525D4823L3993O4425a27426D14554A09343b8269o3372
13022i1641F9659J38621m1982R4528H4339K1076K7147j6509k0625K10400b48931
$$ plain form
13010 -154140 175984 255280 54868 -98 -61938 -27746 24640 268901 -95886 142193 -19809
12998 283168 365684 24761 -239481 200421 -264164 185117 109206 81121 46962 169567
12988 169567 -68358 106103 -244304 -83759 178903 124802 340799 111005 124049 160998
12978 160998 205879 78316 260428 142655 -113877 -78218 158360 181615 396218 132117
12967 -210544 -99585 -69599 -64487 -21766 407149 -47754 -138540 34210 -45945 -103620 101379
12955 96142 -118064 -241277 269046 -381255 229838 -48634 76136 35947 219596 306651
12945 306651 431673 456189 -158700 109284 -87632 220135 -127860 -224779 268337 338457
12935 338457 107210 52490 72094 151977 56643 -71598 101666 83041 -224401 -43555 -40864
$$ packed form
13010a54140A75984P9296E4868i8o1840b7746B4640K44261i5886A42193a9809
12998B83168Q2516B4761b39481B00421b64164A85117p5911k8085l4159J22605
12988A69567f8358A06103b44304h3759A78903n4101K15997A11005J3044L6949
12978A60998M4881G8316J82112j17773a13877L5659A58360K3255K14603A32117
12967b10544i9585K9986N112b1766D07149d7754r0786C4210d5945n7675A01379
12955I6142a18064j23213B69046c81255B29838d8634G6136C5947J83649Q7055
12945C06651J25022K4516a58700A09284h7632B20135a27860r6919B68337P0120
12935C38457A07210E2490J9604P9883E6643g1598A01666j8625b24401d3555K691
$$ plain form
12924 -40864 -241602 269611 132079 47411 -60641 215014 120443 -322702 197497 420600
12914 420600 99866 292388 -140313 4736 69295 241564 -203259 -132935 96244 -115492 -178989
12903 -178989 37450 -73207 21134 -301461 -15689 294448 89347 -177809 320373 -105506
12892 30226 158447 126134 185562 176274 -118158 -23847 -247388 49880 162328 -138565 49033
12880 -86370 -165443 283025 229740 -90862 324723 27676 38571 42636 -217628 -73853 231033
12868 25211 106858 -169658 20492 34103 -35705 402799 -206583 -108323 169115 38248 -154252
12856 -32946 -111179 -49581 -22040 268212 -26037 -91480 -102137 -89606 -129120 -34887 -111871
12845 -111871 29104 41840 177189 299619 -170070 371428 -305319 52230 -79290 -42536
$$ packed form
12924d0864k00738B69611A32079D7411f0641B15014r4571c22702A97497K23103
12914D20600I9866J92522a40313D736O4559J72269b03259P0324I6244a15492o3497
12903a78989C7450g3207B1134c01461a5689B94448H9347a77809C20373a05506
12892C0226J28221l2313N9428r288a18158b3847k23541D9880J12448a38565D9033
12880h6370p9073B83025n3285i0862C24723B7676J0895M065b17628g3853B31033
12868B5211Q1647a69658B0492J3611c5705D02799b06583R8260A69115C8248a54252
12856c2946p8233d9581b2040B68212b6037o5443j0657J2531l9514c4887p6984
12845a11871B9104J2736J35349J22430a70070C71428c05319E2230g9290L6754
$$ plain form
12835 -42536 220372 -2729 112864 -176455 -227344 -100509 140930 211657 -309785 -65504 22798
12823 -20600 120423 173912 -119545 -193524 -13886 48217 64194 -44676 148043 -17204 45950
12811 221537 -27369 178501 37915 -161131 -41625 -208685 125903 174593 57079 -70527 184134
12799 -238049 -8899 216204 441320 166560 -91035 -161430 -84263 37313 17305 -169199 -246222
12788 -246222 172416 -192958 108159 -31505 -84270 -112198 67536 -103300 -370389 -118884
12777 92690 144849 253486 119440 -48811 57626 204512 -131282 309248 18911 17586 190008
12766 190008 -93783 -84204 72060 8775 36449 -418167 384287 140156 184414 -221144 -295150
12755 -295150 199046 5998 276200 270345 149899 -14440 -281703 157244 -20929 -102689 -281175
$$ packed form
12835d2536B20372b729A12864a76455n0889a00509A40930P0727c09785f5504B2798
12823b0600A20423N3489a19545p3979a3886D8217J5977d4676A48043a7204D5950
12811B21537b7369A78501C7915a61131d1625j67060A25903M8690E7079g0527A84134
12799b38049h899B16204K25116A66560i1035p0395P7167C7313A7305a69199p7023
12788b46222A72416a92958A08159c1505n2765k7928F7536a03300k67089a18884
12777I2690N2159J08637A19440d8811E7626J46886a31282C09248A8911j325J72422
12766A90008i3783R579G2060H775K7674d18167C84287A40156M4258b21144p4006
12755b95150A99046E998K70202n855j20446a4440k67263A57244b0929q1760j78486
$$ plain form
12744 -281175 179052 234013 233178 41978 8732 -117782 33612 40212 308219 45023 279968
12733 279968 96978 -11881 415487 -90147 127136 -92372 -200851 172492 -217100 146403
12722 320032 -81159 38927 -136418 22023 -64577 97319 126610 197459 4407 137941 270830
12711 270830 326701 -93637 97049 301856 282861 -27236 71527 89990 232627 123564 87905
12700 87905 284830 -64429 55548 525942 279689 20108 -135589 -108301 134439 -57829 64876
12688 505 158511 136072 -244364 -312804 -158721 -259584 291729 216328 152503 288318 140252
12676 110926 445710 175442 -268978 189578 -29001 190621 -93997 -59455 139436 -122301
12665 -112646 417232 282031 112175 125186 107737 -58171 96532 -3491 52142 68865 321911
$$ packed form
12744b81175A79052N4961q35D1978H732a17782C3612O600K68007D5023K34945
12733B79968I6978a1881D15487i0147A27136i2372j08479A72492b17100A46403
12722C20032h1159C8927a36418B2023f4577I7319K9291P0849D407J33534J32889
12711B70830N5871i3637I7049K04807j8995b7236G1527J8463J42637j09063l5659
12700H7905J96925f4429E5548M70394k46253B0108a35589K7288A34439e7829F4876
12688E05J58006k2439b44364o8440J54083j00863B91729p5401o3825J35815A40252
12676A10926L34784A75442b68978A89578b9001A90621i3997L4542A39436a22301
12665a12646D17232j35201A12175J3011j7449e8171I6532c491E2142J6723K53046
$$ plain form
12654 321911 48408 278953 350254 -142614 101955 -105641 -115173 20036 85399 438569 9788
12642 -61136 -50205 -55941 -11764 -127687 189545 113248 188058 11296 80554 159846 6477 58485
12630 58485 -154359 280082 145966 114218 223961 256967 25904 173801 134854 32680 -3972
12618 102306 256743 -10491 200385 122620 -83044 -166897 97677 -47185 -18733 138605 94422
12607 94422 224010 183209 -75127 -96887 138932 -227803 176943 244877 -155393 279829
12596 182219 -44899 171378 -164242 16562 137113 -217293 61540 7774 -218745 38086 108581
12585 108581 -102969 83059 70016 301037 27024 84574 -92053 -171448 18444 -129163 -131122
12574 -131122 -197712 -127995 98287 -71204 265854 120667 93740 227386 379599 -43644 114277
$$ packed form
12654C21911D8408K30545P1301a42614A01955a05641r532B0036O5363L53170I788
12642f1136J0931n736a1764j15923A89545p6297P4810A1296O9258P9292F477N2008
12630E8485a54359B80082j34116l1748J09743L3006B5904J47897l8947C2680c972
12618A02306J54437a0491B00385p7765h3044q3853I7677d7185a8733A38605m4183
12607I4422J29588m0801g5127k1760A38932b27803A76943O7934a55393B79829
12596A82219d4899A71378a64242A6562J20551b17293F1540G774b18745C8086P0495
12585A08581a02969H3059j3043K31021B7024N7550i2053p9395A8444a29163j959
12574a31122o6590O9717I8287g1204B65854A20667k6927J33646J52213d3644A14277
$$ plain form
12562 -206927 268285 12033 178160 76216 -29773 196207 -25632 -297477 152376 -128560
12551 94671 177041 342069 -158401 -378794 -137369 -107430 194747 142982 55577 -244018
12540 -62223 61858 -419066 317494 -64563 273872 -16801 187391 -54070 -49189 -34894 91336
12528 23468 -142061 -100648 183643 169102 251121 118296 -176394 -29574 -21907 161128 78643
12516 -235403 22520 99659 6381 -260058 -58035 198651 -305052 -74517 197153 63268 6289
12504 84649 -35015 -75703 -164148 -29021 37002 -89626 279961 -216368 121707 -13947 73177
12492 13433 134990 210051 88427 41907 116732 -45114 362243 242885 -259570 -132756 -199697
12481 -199697 -88216 -75168 48667 164067 84542 323838 125393 9648 -232282 4699 -36818
$$ packed form
12562b06927B68285A2033J66127G6216b9773A96207b5632k71845A52376a28560
12551I4671Q2370J65028a58401k20393a37369K9939A94747n1765E5577b44018
12540f2223F1858d19066C17494f4563B73872a6801A87391e4070M881J4295I1336
12528B3468a42061M1413A83643j4541Q2019A18296a76394b9574P667A61128G8643
12516b35403B2520P7139F381b60058e8035A98651c05052g4517A97153F3268F289
12504H4649c5015m0688q8445b9021C7002h9626B79961b16368A21707a3947G3177
12492A3433J21557P5061H8427D1907P4825d5114C62243j19358b59570J26814o6941
12481a99697h8216J3048D8667J15400p9525K39296A25393I648b32282D699c6818
$$ plain form
12469 71090 31238 86932 59608 122874 -364212 -45893 -32251 26171 -178413 -218093 100135
12457 305236 126318 182648 -91953 151958 -118996 22273 221913 285789 -100788 -315323
12447 -315323 103866 -20783 10217 137112 -271907 -4888 -51094 -225956 -311732 -210868 19979
12435 -282182 180182 -219600 66092 -99853 51010 17802 -221785 -221607 -278106 183636 154203
12424 154203 213522 313234 -115628 -238646 -56417 -60995 -89779 -168074 -103807 -328193 -19852
12412 159848 105424 -142500 -18932 643 -121778 -93633 -135193 -15546 -35762 172038 -5947
12400 5440 -272077 254049 443068 43843 -181234 -274232 -115715 210303 90724 -172409
12389 -147965 -127954 30196 -63457 9191 -168802 -38121 -279134 383887 -71184 47269 -123034
$$ packed form
12469G1090C1238N5694k7324O3266c64212d5893J3642B6171a78413l9680A00135
12457C05236A26318N6330i1953A51958a18996B2273J99640O3876a00788k14535
12447c15323A03866b0783A0217J26895b71907d888m6206j74862q5776J00864A9979
12435b82182A80182b19600F6092i9853E1010A7802b21785J78n6499A83636k9433
12424A54203N9319R9712a15628j23018e6417m578k8784p8295O4267k24386a9852
12412A59848n4424a42500a8932F43a21778K8145m1560a5546k0216A72038e947
12400E440b72077B54049J89019D3843a81234r2998a15715B10303I0724a72409
12389a47965K0011C0196f3457I191a68802c8121k41013C83887g1184D7269a23034
$$ plain form
12377 71392 -223621 42071 262433 -278173 -442672 5936 51741 -26873 -218354 19431 137981
12366 137981 -76334 -3230 236607 416205 45296 -169665 3702 -416456 145426 6874 -356850
12354 -439525 -54638 -8746 -201759 -84248 311753 18553 -95194 71216 -43036 -374313 136105
12342 -123526 -44898 -180044 -8610 -61038 -89415 64780 162301 193781 174450 -52703 22488
12330 -109554 98060 3773 31513 404972 -85130 341246 45550 -20154 140606 255619 -288365
12318 188449 -205300 -203421 -18677 -71914 275712 -64047 -140577 -219702 -23447 -88755 3993
12306 71652 103509 173685 114725 -102609 -68834 -132089 94894 263692 232229 143170 426069
12295 426069 -60774 71997 -21621 62315 82488 132172 31513 33792 88085 16123 -71466 121378
$$ packed form
12377G1392b23621D2071K20362b78173j64499E936M5805b6873j91481A9431J18550
12366A37981g6334c230B36607J79598D5296a69665C702d16456A45426F874c56850
12354d39525e4638h746j93013h4248C11753A8553i5194G1216d3036l31277A36105
12342a23526d4898j35146h610n2428k8377F4780R7521L1480j9331e2703B2488
12330a09554I8060C773K7740L73459h5130C41246D5550b0154A40606J15013b88365
12318A88449b05300J879a8677n3237B75712f4047p6530p9125b3447o5308C993
12306G1652L1857P0176n8960a02609L3775o3255I4894J68798l1463q9059K82899
12295D26069f0774G1997b1621F2315K0173M9684C1513K279N4293A6123g1466A21378
$$ plain form
12282 176424 -52291 -118456 169523 -78815 94381 -82456 -55565 225982 360606 16474 47328
12271 47328 227602 237382 -211974 132685 -259665 -69395 -166016 103879 146882 -3694 -18664
12260 -18664 123732 -10883 -97890 39839 144926 172626 -151992 -71538 -56314 -33561 139349
12248 163788 391533 116176 277027 55696 -52557 -288470 138278 307882 47192 27268
12238 27268 -96166 -74961 33163 569624 38964 116265 -30712 107645 187167 123951 -190916
12226 142491 144380 294101 423296 192229 141895 -65930 153759 127332 135965 114337 199437
12215 199437 328841 173212 140426 293056 12657 300835 100881 379494 -25568 238165
12204 253077 215337 83161 337671 109917 26914 116815 208718 43238 521089 90684 81590
$$ packed form
12282A76424e2291o6165A69523g8815I4381h2456K6891B25982J34624A6474L0854
12271D7328J80274R780b11974A32685b59665f9395r6621A03879M3003c694j4970
12260a8664A23732a0883q7007C9839J05087K7700a51992g1538J5224K2753A39349
12248A63788K27745A16176J60851E5696e2557k35913A38278J69604D7192j9924
12238B7268i6166K1205C3163N36461C8964P7301c0712A07645P9522o3216a90916
12226A42491J889J49721J29195A92229n0334f5930A53759k6427Q633k1628Q5100
12215A99437J29404j55629l2786J52630A2657K88178A00881K78613b5568B38165
12204B53077l7740H3161K54510A09917B6914Q9901R1903D3238M77851I0684r094
$$ plain form
12193 81590 158923 207583 315302 185256 411812 -93915 416862 42971 -85750 18313 -188345
12181 60548 69156 144327 82570 282500 264700 108999 404991 34790 453659 -15957 -6799
12169 383576 67909 325454 -1016 28661 240131 -51107 52352 324038 203189 -4684 108015
12157 -199852 25996 53833 -114857 -141458 -99134 117224 46039 -162954 -117674 91068 -7483
12145 293501 -49093 179453 64976 -126046 166652 92637 -115871 -14135 -234572 31998
12134 91329 154516 -93517 98049 111525 -278130 96488 89766 -122612 183481 134756 113253
12123 113253 192076 95454 4970 53598 -219659 264002 301700 -313284 -286617 21907 -574227
12111 -96830 916 -99056 -185393 81660 5754 -71828 123650 216495 132305 90969 92535 122126
$$ packed form
12193H1590P7333M8660J07719j30046K26556i3915D16862D2971h5750A8313a88345
12181F0548Q608P5171o1757J99930j7800A08999K95992C4790M18869a5957f799
12169C83576F7909K57545a016B8661K11470e1107E2352K71686j20849d684A08015
12157a99852B5996K7837a14857k6601M2324A17224D6039a62954M5280I1068g483
12145B93501d9093A79453F4976a26046A66652p4015a15871a4135k20437C1998
12134I1329O3187i3517I8049J3476b78130I6488o722a22612A83481m8725k1503
12123A13253P8823I5454D970M8628b19659B64002L7698c13284K6667B1907e74227
12111i6830I16i9056q6337H1660E754g1828A23650R2845q4190m1336J566K9591
$$ plain form
12099 122126 -6531 72835 -20074 -208037 -118968 -133565 -161351 36458 21709 -202059 185213
12087 -17179 142825 -321196 -37489 -105069 216092 264200 -24936 -11988 -214380 214761 174089
12076 174089 71896 -168827 86874 376991 847409 1744809 1201527 30876 265454 -238949
12065 -112694 -82140 -369915 209396 -127386 157833 -35921 -287230 -117210 -311867 -81316
12054 51161 231425 190586 185000 195270 37076 102455 124682 -195985 159494 -92741 34156
12042 -1895 180091 -265442 132240 86349 393532 -149415 -234955 27749 111466 6206 138497
12031 138497 54360 -160396 -99131 25788 210411 -128124 117729 172295 -224647 -35102
12020 -198077 50260 130209 -38866 -232421 226325 46035 20263 -56000 -13072 153426 -27165
$$ packed form
12099A22126f531G2835b0074j87963Q9069j4597k7786C6458j4749b02059A85213
12087a7179A42825c21196c7489o7580B16092M8108b4936a1988k02392B14761m0672
12076A74089G1896a68827H6874K90117M70418Q97400n43282C0876K34578b38949
12065a12694L0554k87775B09396a27386A57833c5921k51309a17210j94657h1316
12054E1161J80264m0839n586J0270C7076O5379K2227a95985A59494i2741C4156
12042a895A80091b65442A32240m5891L07183a49415q5540B7749Q3717F206J32291
12031A38497E4360a60396O1265B5788J84623a28124A17729N4566b24647c5102
12020a98077E0260P9949c8866j93555B26325D6035B0263e6000a3072A53426b7165
$$ plain form
12008 193084 91578 -24613 -315355 75034 -177444 -127082 -193862 -108093 31097 -55267 -136799
11997 -136799 -32265 -381221 84769 184680 14553 96460 -67252 -79409 45392 -255451 -118810
11985 -121652 61919 -196592 115957 -8133 153914 -279854 85433 144522 29683 -158924 146264
11973 98473 -192763 -62360 -75163 -195984 102274 -54625 -285046 92276 321156 -301122
11962 173333 154818 -526329 277981 99344 24549 -111571 -457110 -298800 181188 -69760
11951 175337 -229856 84569 171887 205535 -305018 160740 24846 -113434 -129752 -230446
11941 -230446 -77864 391030 -270912 71782 156807 57266 -312248 -154492 -175776 -19265 -157696
11930 -157696 311307 -61580 361213 5501 -197093 -293289 35610 -19906 -86847 33678 107670
$$ packed form
12008A93084I1578b4613k90742G5034a77444N0362o6780Q5769C1097e5267q1532
11997a36799c2265l48956H4769R9911A4553Q1907f7252j2157D5392b55451a18810
11985a21652F1919a96592A15957h133A53914b79854H5433N9089B9683a58924A46264
11973I8473a92763f2360j2803j20821A02274e4625k30421I2276K28880c01122
11962A73333j8515e26329B77981I9344B4549a11571l45539J58310A81188f9760
11951A75337b29856H4569Q7318L3648c05018A60740B4846a13434j6318j00694
11941b30446g7864C91030b70912G1782Q5025E7266c12248a54492k1284a9265j38431
11930a57696C11307f1580C61213E501a97093r6196C5610a9906o6941C3678P3992
$$ plain form
11919 107670 -16913 31980 32914 103765 187670 -195000 -247125 -47362 90422 25441 -263410
11907 173290 219773 26302 186088 -144466 153577 -20156 35738 -34535 37866 151464 68141
11895 -201315 -205968 60133 -66693 -14775 -172352 231952 24634 52570 -43992 -248249 -77459
11883 226795 163718 -206333 -170194 -135537 -55166 145212 39171 212553 2675 -118892 -330714
11872 -330714 -363379 197964 8269 -250018 94724 -138544 -82078 -41649 153271 -197556 -195772
11861 -195772 228356 24245 -287435 -46890 106700 214914 40437 -240625 200767 -103567
11850 -235765 -18478 170171 -71198 -132043 -104340 46414 -79031 171543 36648 48242 92264
11839 92264 217107 228718 -132453 -186253 9893 98417 116869 -86533 179624 158723 -168408
$$ packed form
11919A07670a6913C1980R34P0851Q3905a95000n2125d7362I0422B5441b63410
11907A73290M6483B6302J59786a44466A53577b0156C5738c4535C7866J13598F8141
11895b01315m653F0133f6693a4775j57577B31952B4634K7936d3992k04257g7459
11883B26795o3077b06333L6139L4657e5166A45212C9171J73382B675a18892k11822
11872c30714l2665A97964H269b50018I4724a38544N6466M0429A53271a97556J784
11861a95772B28356B4245b87435d6890A06700J08214D0437b40625B00767a03567
11850b35765a8478A70171g1198o0845K7703D6414g9031A71543C6648J1594M4022
11839I2264J24843J1611a32453n3800I893Q8524J8452h6533A79624k0901a68408
$$ plain form
11827 -151382 18495 172220 -382425 -54937 -259165 -70229 116923 -66667 -53785 -35270 -243111
11816 -243111 -62094 -180463 -117433 -210470 181504 29795 -105097 -97404 -111457 -21603 21337
11804 -30677 -92749 -65101 -187453 -111849 102127 93410 132183 270191 72092 183768 -182416
11792 96890 -164748 -97134 -29067 -93642 222407 184789 -261196 56955 -48043 102007 -168485
11780 -447479 -136040 70984 196392 103796 81075 -85057 128486 -83185 -113064 34494 -188791
11768 89858 -165087 -94811 -507671 -152699 168466 -7478 126864 95498 37080 48516 -36614
11756 -175552 -157212 -187870 29619 -197705 208085 134713 -43004 -6989 17243 444080 47096
11744 5296 64859 -292325 108910 160998 -396716 375616 30680 97785 -57390 -59370 310700
$$ packed form
11827a51382A8495J53725c82425e4937k04228g0229A16923f6667J2882J8515k07841
11816b43111f2094j18369O3030r3037A81504B9795a05097P693j4053b1603B1337
11804c0677o2072K7648j22352P5604A02127q717L8773J38008G2092J11676a82416
11792I6890a64748O7614b9067o4575B22407l7618b61196E6955d8043A02007a68485
11780d47479a36040G0984J25408r2596k2721h5057A28486h3185k9879C4494a88791
11768H9858a65087P0276m12860a52699A68466g478A26864l1366C7080J1436c6614
11756a75552J8340l0658B9619a97705B08085p3372d3004f989A7243M26837D7096
11744E296N9563b92325A08910N2088c96716C75616C0680O7105e7390j980C10700
$$ plain form
11732 -21428 210408 199504 10910 104128 -16830 -54609 -18170 270413 97285 -98472 -174316
11721 -174316 76589 -8591 -32140 -284756 -201990 -28872 40340 -4486 -200258 -60544 -140493
11710 -140493 -217782 -25347 -344047 137283 -58212 229151 69233 78204 29105 117903 105169
11699 105169 4581 172433 -33652 244838 33071 204763 444599 260381 -112761 -50350
11688 251498 -169403 -28100 -40902 287121 129728 -150385 243676 45685 -44000 206528
11677 -19724 71526 301397 -307377 34618 381606 -135176 33948 121995 -213456 238507
11666 -270328 33970 365585 21179 339619 10544 -79968 14792 185696 -26380 274641 -99937
11654 -271665 12325 11319 -169703 94867 234926 168790 46630 77437 -144863 -207179 -183876
$$ packed form
11732b1428B10408j0904A0910R3218a6830l7779a8170B70413I7285i8472p5844
11721a74316G6589h591k3549k52616Q2766b8872D0340d486j95772f0544p9949
11710a40493p7289b5347l18700A37283e8212B29151F9233Q971B9105Q8798j2734
11699A05169D581J67852c3652B44838C3071J71692K39836j84218a12761e0350
11688B51498a69403b8100j2802B87121A29728a50385B43676D5685d4000B06528
11677a9724G1526K29871c07377C4618L46988a35176C3948Q8047b13456B38507
11666b70328C3970L31615B1179L18440A0544g9968A4792J70904b6380B74641i9937
11654b71665A2325j006a69703I4867J40059o6136D6630L0807a44863o2316K3303
$$ plain form
11643 -183876 185377 81278 -133618 -57157 -98038 -28399 376767 150846 120608 224618
11633 224618 -144598 -121130 38942 -32576 292557 9873 290007 -28357 109124 -329152 -13686
11621 160690 82517 -389173 -215524 58486 113069 370474 -207751 -231055 -312000 -349432 13820
11609 464966 -191889 340108 21115 -226565 97878 -50061 -42139 -185110 -107532 45730 251717
11598 251717 175349 8915 -41916 19343 -47819 -90600 115507 -99366 74266 86378 212138
11587 212138 294305 -62747 163262 294851 -94361 45833 -52605 -138108 -138689 139303 8125
11575 74748 -28252 90104 29817 -287102 228314 -145515 -247866 144216 20359 92423 -203486
11563 163376 72863 79491 171716 282540 -50705 -66247 -138342 -103193 87607 -182378 200409
$$ packed form
11643a83876A85377H1278a33618e7157m0881b8399C76767A50846l0238J04010
11633B24618a44598K3468C8942c2576B92557I873K80134b8357A09124c29152a3686
11621A60690p8173c89173J73649E8486N4583K57405b07751k3304q0945l7432A3820
11609D64966a91889C40108B1115b26565I7878e0061P922j42971P7578D5730K05987
11598B51717p6368H915d1916A9343d7819m2781A15507i9366G4266J2112J25760
11587B12138Q2167f2747A63262J31589i4361D5833e2605q5503n81A39303H125
11575G4748b8252I0104B9817b87102B28314a45515j02351A44216B0359P2064b03486
11563A63376G2863O628R2225J10824e0705j5542p2095L5149H7607a82378B00409
$$ plain form
11551 -101882 91135 62880 -141074 261476 -29272 -2262 199206 281191 -8879 70822 111492
11540 111492 33868 -84150 -12345 -48347 297714 202726 44975 266522 354583 487692 291043
11529 291043 300608 396672 -92462 89725 -76397 -91017 -50902 79789 -90869 -50684 176355
11517 108504 307632 74479 222792 -229976 -59609 224404 349762 237646 281885 82971
11506 194085 192603 -31363 -107307 -66195 198059 14023 95388 241546 -120065 88962 188207
11495 188207 187569 272561 127173 173767 12979 265344 -72338 104003 63489 337807 197980
11484 197980 -9254 336253 378744 236843 153264 237209 337877 170534 -9676 185606 254775
11473 254775 505585 59833 -202092 357431 -265366 -55996 205104 88433 -67319 181804
$$ packed form
11551a01882I1135k8255a41074B61476b9272b262A99206Q1985h879G0822M0670
11540A11492C3868h4150a2345l6002B97714r4988D4975K21547Q8061J33109j96649
11529B91043R565R6064i2462H9725g6397j4620M0115G9789i0869M0185A76355
11517A08504J99128G4479J48313b29976e9609B24404J25358j12116M4239H2971
11506A94085j482c1363p5944M1112A98059A4023Q1365J46158a20065H8962R9245
11495A88207o38Q4992A27173M6594A2979K52365g2338A04003m0514K74318j39827
11484A97980i254C36253M2491j41901q3579Q3945J00668j67343i676A85606O9169
11473B54775K50810E9833b02092C57431b65366e5996B05104H8433f7319A81804
$$ plain form
11462 435322 285529 119515 -214869 351873 -156587 386601 -260806 65962 98817 45406
11451 -85218 27667 -16396 18910 204046 303542 -133468 254603 170547 -159660 400853 113969
11439 -75645 343843 50813 227036 -132220 -38884 135322 -75005 -47011 248943 217604 -53699
11427 -141330 163853 21188 -816 130449 -149699 50819 -26766 -59464 197962 120965 527
11415 9344 244130 -240972 -486176 95165 354031 -184062 -176068 -41613 7502 112639 -119723
11403 51080 -200383 86334 -7770 271552 -75778 -21491 268656 -211015 9609 87370 19187
11391 -121244 150324 141836 130773 247322 86169 -165024 132083 323384 186986 28975
11380 -210972 -67030 134253 -102603 -98663 196276 303675 182171 130779 13874 73168 98416
$$ packed form
11462D35322j49793A19515b14869C51873a56587C86601b60806F5962L2855D5406
11451h5218B7667a6396A8910J85136R9496a33468B54603q4056a59660D00853A13969
11439g5645C43843E0813J76223a32220c8884A35322g5005K7994B48943l1339e3699
11427a41330A63853B1188h16A30449a49699E0819b6766l2698A97962p6997E27
11415I344K34786b40972k45204I5165K58866a84062P994d1613G502J05137a19723
11403E1080b00383H6334g770B71552g5778b1491B68656b11015I609P7761A9187
11391a21244A50324q488j1063J16549H6169a65024A32083J91301j36398B8975
11380b10972f7030A34253a02603L940A96276J07399j21504n1392A3874N9294K5248
$$ plain form
11369 98416 -8948 -227562 85263 156336 -16707 -175411 -93941 -205459 -70566 191751 30783
11357 142579 -98251 -49598 137624 -270223 -3880 -221914 -90804 -418198 41284 63627 -30357
11345 -143026 -214840 -20575 128165 -277197 27639 -282587 305261 50238 -209248 -57405
11334 -220316 -103004 5858 -198911 72377 289703 73979 127647 7226 -4417 -268138 -113886
11322 -64366 173627 -21819 328301 3634 -17376 -58439 163238 -152409 -22282 64426 -58267
11310 192257 370906 22944 -19539 10203 -56316 -71598 189735 -91296 -340215 146475 -76874
11298 -160658 -71510 -3920 -100165 229211 151166 -136948 282816 66987 21380 -133382 -265791
11287 -265791 -204306 -297139 335885 278160 -16630 -23952 100587 88613 196539 -292006 140534
$$ packed form
11369I8416h948k18614H5263P1073a6707j58704Q1470j11518g0566A91751C0783
11357A42579i8251M8653A37624b70223c880k18034i0804l27394D1284K2343c0357
11345a43026p1814b0575A28165b77197B7639b82587C05261E0238b09248e7405
11334b20316a03004E858a98911G2377K17326G3979N3668G226d417k63721a13886
11322f4366A73627b1819C28301C634a7376m1063A63238a52409b2282F4426e8267
11310A92257J78649B2944a9539A0203e6316j5282A89735i1296k48919A46475g6874
11298a60658g1510c920r6245B29211p8045a36948B82816F6987B1380a33382j32409
11287b65791O1485r2833C35885n7725a6630p322A00587j1974J07926b92006A40534
$$ plain form
11275 -125126 -233976 -98224 -167900 361968 274219 -285573 -143662 -134568 -199992 59197 -103480
11263 -321057 81 -94835 149519 -377603 -109379 -216167 -107904 -32987 -61269 26512 154847
11252 154847 -6410 20017 -85332 -826 -135582 -257270 -190714 66306 64400 -46350 -185672 34257
11239 8643 -297288 144441 -139304 -201438 226171 336521 130389 -307534 55234 254601
11229 254601 -304162 -28384 -123307 -52538 34223 -116690 -340580 -87788 98734 -300157 -248342
11218 -248342 -83660 -337387 -62551 259034 -242909 -177874 43928 145156 211632 -215227
11207 -290929 78346 -79261 -190495 -411867 -169713 -29648 145329 -197518 -262069 20255
11196 -287168 124141 96279 28851 89121 -29126 -27937 -255090 84597 1593 -113928 -163369
$$ packed form
11275a25126j08850i8224o9676C61968q7749b85573J41911R094o5424E9197a03480
11263c21057H1i4835A49519c77603a09379j06788a07904c2987k8282B6512J28335
11252A54847f410B0017h5332h26j34756j21688O6556F6306j906d6350j39322C4257
11239H643b97288A44441a39304o2134B26171J10350A30389c07534E5234J99367
11229B54601c04162b8384r4923e2538C4223a16690k23890h7788I8734c00157N1815
11218b48342h3660k53727f2551B59034b42909O5035D3928J01228O6476b15227
11207b90929G8346g9261j11234k21372a69713b9648A45329a97518o4551B0255
11196b87168A24141k7862B8851O0270b9126J189k27153H4597A593a13928m9441
$$ plain form
11185 -163369 -118040 259753 -263945 55823 12401 263382 289941 -235130 -139345 -265377
11175 -265377 89577 -41364 -222046 -202666 306863 72410 -230866 -150186 240733 -233645
11164 37686 114706 217739 -13805 107267 129240 -207315 104798 -153282 -197036 179006
11153 134479 -222205 -221814 -143530 -40698 -18175 103785 144298 -20678 -117254 -183701 -88161
11141 1861 265890 86566 246984 -398663 -504902 14445 81649 -1609 -17905 -15578 -211133
11130 -211133 -252540 -260753 86385 66151 -48233 163696 135817 -217606 -27289 137265 125767
11119 125767 -22171 -39283 66471 244778 -42930 -197380 -134876 41729 134687 -46681 71124
11107 91395 206391 334923 191929 -82572 215218 -131422 277578 391244 17786 222244
$$ packed form
11185a63369M5329B59753b63945E5823A2401K50981K6559b35130R5785j26032
11175b65377H9577d1364j80682J9380C06863G2410b30866Q0680B40733b33645
11164C7686P7020J03033a3805A07267K1973b07315A04798a53282m3754A79006
11153A34479b22205L91P8284d0698a8175A03785M0513b0678r6576o6447h8161
11141A861K64029H6566J60418c98663j06239A4445O7204a609j6296K327j95555
11130b11133m1407q213H6385k0234d8233A63696k7879b17606b7289A37265j1498
11119A25767b2171j7112F6471J78307d2930j54450O2504D1729R2958d6681G1124
11107I1395J14996J28532j42994h2572B15218a31422B77578J13666A7786K04458
$$ plain form
11097 222244 274792 125351 19862 19466 309094 141801 25495 88433 96065 96273 24380 163271
11085 163271 -7452 426017 155474 442349 49100 129559 -121998 746619 29061 14716 10254
11074 10254 148929 140035 313361 341225 73811 326358 381592 485882 191006 341812 292353
11063 292353 570779 347450 238207 784230 815908 414023 569057 601194 726503 228221
11052 694576 758490 492608 719193 434259 872315 1049999 819275 836647 1032543 766239
11042 766239 843693 899982 575716 949123 825097 939665 498526 990238 778266 536938
11032 536938 774409 851270 857081 938088 778955 706571 816309 1065012 1116891 637472 744733
11021 744733 648705 762345 568340 718144 657098 627074 571611 826458 393532 448752
$$ packed form
11097B22244N2548A25351A9862l96K89628A41801B5495O2938P632K08B4380J38891
11085A63271g452D26017A55474K86875D9100Q0459a21998G46619B9061j4345m462
11074A0254J38675q894J73326K7864G3811K52547N5234J04290A91006J50806m9459
11063B92353K78426k23329j09243N46023L1678m01885J55034L2137J25309B28221
11052F94576O3914k65882K26585k84934M38056J77684k30724J7372J95896k66304
11042G66239P7454N6289l24266L73407j24026J14568m41139M91712k11972k41328
11032E36938K37471P6861N811Q1007j59133p2384J09738K48703N1879m79419J07261
11021G44733r6028J13640j94005J49804o1046l0024n5463K54847C93532N5220
$$ plain form
11011 448752 596272 833008 293582 510174 638128 413904 721098 888098 607505 582061
11001 582061 781155 456942 705468 959012 745768 570746 586308 701936 509158 704595
10991 704595 605691 936880 1128332 996792 616879 890141 771689 1112689 785962 907812
10981 907812 954509 1123347 1321747 1138430 1665283 1818150 2115209 2174197 2683582 2509926
10971 2509926 2743001 3089976 3057319 2737138 2692757 2332016 2160517 1800596 1914198 1910237
10961 1910237 1524152 1579926 1908062 1864851 1785929 1629815 1899518 1692980 1567815 1503165
10951 1503165 882152 953365 776033 490059 561132 522096 515138 435979 392297 341355 264447
10940 264447 282211 251887 114063 104760 447416 159152 127003 410812 213394 367500
$$ packed form
11011D48752J47520K36736B93582K16592J27954k24224L07194J67000k80593k5444
11001E82061J99094l24213K48526K53544k13244j75022J5562J15628j92778J95437
10991G04595r8904L31189J91452j31540l79913K73262j18452L41000l26727J21850
10981I07812M6697J68838J98400j83317N26853J52867K97059N8988N09385j73656
10971B509926K33075L46975l2657l20181m4381l60741j71499l59921J13602l961
10961A910237l86085N5774L28136m3211p8922j56114K69703k06538j25165o4650
10951A503165o21013P1213j77332k85974P1073l9036o958p9159m3682n0942p6908
10940B64447J7764l0324A14063r303L42656A59152l2149K83809j97418J54106
$$ plain form
10930 367500 -25654 80376 -55243 66471 -103470 -148272 -233771 157693 -101097 -39764 172283
10918 279465 -108421 336586 15570 402099 -2661 -64194 201403 108077 -136294 106649
10907 -186478 70019 391582 -254593 82975 184025 62123 -5897 -336968 -134528 175252
10896 37146 116702 -243017 26251 -166304 315031 -176777 -17017 -364916 170483 76492
10885 -111705 91831 -103054 -95008 86349 -133476 -157762 83705 307863 -35232 -159524 -6546
10873 144498 146059 13980 -4422 59520 -238250 -147766 79500 -55804 216539 75225 13551
10861 79644 111247 -134298 385222 -71945 215124 -42039 134950 -203293 -254395 -104513
10850 133646 -144559 -484815 55569 -430686 -12659 99983 -94190 -94679 61748 -65422 107528
$$ packed form
10930C67500b5654H0376e5243F6471a03470m4802q5499A57693a01097c9764A72283
10918B79465a08421C36586A5570L86529b661o1533B01403r3326a36294A06649
10907a86478G0019L21563b54593H2975J01050F2123e897l31071a34528A75252
10896C7146P9556b43017B6251a66304C15031a76777a7017l47899A70483G6492
10885a11705I1831a03054Q046H6349a33476k4286H3705K24158c5232j24292f546
10873A44498J561A3980d422E9520b38250R0484G9500e5804B16539G5225A3551
10861G9644L1603a34298C85222g1945B15124d2039A34950b03293n1102a04513
10850A33646a44559l40256E5569d30686a2659I9983i4190m89F1748f5422A07528
$$ plain form
10838 84090 -72325 17071 -49872 -36852 232283 13351 34879 -180319 -240094 -41302 -63297
10827 -63297 -67352 -78341 -265044 12722 13694 -2362 -95496 47845 68458 -86503 116438 120209
10815 120209 -59612 -262397 -5862 -146413 -194052 64659 61320 11549 -104148 50604 119555
10804 119555 18403 222515 -231056 -187615 -196637 -110858 228735 -378279 -12917 -91426 105546
10792 15221 -257568 20771 -346662 -167892 -384487 -138077 -139319 -365360 -338782 -17221 -8109
10780 43573 51163 -154170 227 -28083 72650 -73276 -177980 -28925 -163975 -321008 148299
10768 131706 -24165 158292 -51399 128745 -18147 -185149 59243 -167393 69161 276447
10758 276447 -108561 -278417 -345799 119845 -101009 -27763 104752 -97069 335205 51171
$$ packed form
10838H4090g2325A7071d9872J3020B32283A3351K1528a80319n9775d1302k1995
10827f3297m055j0989j86703A2722R72b362r3134D7845K0613h6503A16438L771
10815A20209e9612k02785e862j40551m7639F4659l339A1549a04148E0604O8951
10804A19555A8403K04112b31056M3441r022Q5779B28735c78279a2917p8509A05546
10792A5221b57568B0771c46662a67892k16595a38077j242k26041K6578a7221h109
10780D3573P590a54170B27b8083G2650g3276j04704b8925j35050j57033A48299
10768A31706b4165A58292e1399A28745a8147j67002E9243a67393F9161K07286
10758B76447a08561j69856o7382A19845a01009b7763A04752i7069C35205E1171
$$ plain form
10747 -167508 -114087 -303557 -298596 -49695 108154 -206363 -177523 -155685 58239 -85637 -375965
10736 -375965 -244387 -156936 -150654 46640 -514636 -91089 -252740 241649 165554 -102442 -156869
10725 -156869 47494 68901 143301 -69077 -87699 -145666 -212464 -273557 -153834 197973 48803
10713 -28804 -78042 -63582 -116234 -195337 -247066 -311598 68323 -11604 -122210 -32245 -70115
10702 -70115 -122232 -95588 292188 -12399 -100774 -62891 -182647 71146 -98374 23543 -144400
10690 -56961 6466 -68081 -42122 -99088 -316494 -36886 99076 -133853 105642 -139167 -140455
10679 -140455 229336 -298835 -21912 77654 130054 31107 169731 -16331 28121 -199467 32526
10667 -227999 -57675 -354381 183808 25242 228682 317082 125098 -72452 4295 168723 223784
$$ packed form
10747a67508N3421j89470M961d9695A08154b06363K8840K1838E8239h5637k90328
10736c75965J31578Q7451O282D6640e14636i1089j61651B41649p6095a02442n4427
10725a56869D7494K1407P4400f9077j8622n7967o6798o1093J19723A97973D8803
10713b8804m9238J4460n2652p9103n1729o4532F8323a1604j10606c2245l7870
10702g0115n2117K6644B92188a2399q8375L7883j19756G1146i8374B3543a44400
10690e6961F466f8081K5959n6966k17406c6886I9076a33853A05642a39167j288
10679a40455B29336b98835b1912G7654N2400C1107J38624a6331B8121a99467C2526
10667b27999e7675k96706A83808B5242K03440Q8400A25098g2452D295J64428N5061
$$ plain form
10656 223784 67738 -76033 171088 -212917 -97364 81757 179210 65643 -9182 -2444 228580
10644 57370 -10575 -62605 54924 127879 -156441 68027 264783 -104640 51821 52489 -126999
10632 9254 -164962 -259895 -314241 80136 13742 83834 62844 -50497 -246644 -148912 109755
10620 38454 -43445 -307351 -157861 -22007 -125639 -95349 33146 -160698 -129813 148977 -56689
10608 -90373 -61972 -258317 170023 -181279 -71801 19568 -37539 -262093 -161404 42799 -121193
10596 181574 170502 -178132 304995 86968 266473 -66240 -399131 -131704 -149880 -20834
10585 -200089 36076 -129483 -7862 -85314 78988 -389032 127559 137229 60095 9817 196258
10574 196258 -140753 -10691 -30783 -236300 389513 -79895 153522 -5941 -69457 -294223 -232151
$$ packed form
10656B23784F7738g6033A71088b12917i7364H1757R7453F5643i182b444B28580
10644E7370a0575n2030E4924P2955a56441F8027J96756a04640E1821O68a26999
10632I254a64962r4933n4346H0136A3742P0092k0990e0497j96147R7732A09755
10620C8454d3445k63906J49490b2007j03632L0290C3146a60698L0885A48977e6689
10608i0373K8401j96345A70023a81279g1801A9568c7539k24554J00689D2799a21193
10596A81574j1072a78132C04995H6968J79505f6240l32891a31704j8176b0834
10585b00089C6076a29483g862p7452G8988c89032A27559R670F0095I817J86441
10574A96258a40753a0691k0092k05517C89513g9895A53522e941o3516k24766O2072
$$ plain form
10563 -232151 70059 155479 -222034 -115579 -167484 21357 134162 -92748 -69968 3110 147682
10552 147682 127967 164682 -107291 -43225 112442 141636 253854 -135848 -281682 -191312
10542 -191312 154967 -142764 264767 -51397 -12304 105181 -44110 -101020 -8451 -63290 -12197
10530 -88770 -166393 61500 -93730 -248765 -68712 -111739 26590 -343339 64627 196841 -65991
10518 -204713 -124254 -57556 142904 -109275 153651 -119895 -205166 -7736 -103403 41801 -152240
10506 -341946 44538 126234 -36732 219305 -113754 134455 -15611 -9848 265377 -197616 292070
10494 26569 115360 -176990 -4756 -140493 101805 -14821 -69175 225471 157015 3256 -139820
10482 29416 171807 89964 162488 372996 517991 147760 379316 167336 -23658 263395
$$ packed form
10563b32151G0059Q5420b22034J06455n1905B1357J12805i2748K2780C110J44572
10552A47682j9715L6715a07291d3225A12442K9194J12218a35848j45834R0370
10542a91312A54967a42764B64767e1397a2304A05181d4110n6910h451n4839a2197
10530h8770p7623F1500i3730j55035f8712m3027B6590c43339F4627J32214f5991
10518b04713Q0459e7556A42904a09275A53651a19895q5271g736r5667D1801a52240
10506c41946D4538Q1696c6732B19305a13754A34455a5611N763B65377a97616B92070
10494B6569Q8791a76990d756j35737A01805a4821n4354B25471o8456C256a39820
10482B9416J42391q1843P2524K10508J44995A47760K31556A67336b3658B63395
$$ plain form
10471 21609 -290270 466652 -177482 105577 26631 54369 -14814 -288477 -308433 2598 -78741
10459 -168234 -156957 -302691 22784 -9643 -177796 -138365 151831 -3702 104662 -243524 356968
10447 -205071 -249601 38596 -24046 -102392 50604 105480 -94012 34504 -17570 -269446 -76162
10435 116079 -83461 -190856 -354220 -91400 -56194 308370 -175781 92957 -70000 80869 -465958
10423 8427 -111350 -42683 218600 -275096 143061 93413 139028 -124917 -6896 -145032 -81176
10412 -81176 -139659 -64877 -25617 -185061 -174333 -245930 -312040 68081 52808 -16051 237293
10400 17519 22384 -288541 -144850 353647 86159 -53340 -63059 99308 134507 58525 302512
10389 302512 80754 76558 693180 211999 -137056 -171910 132026 -164449 34206 66463 -102485
$$ packed form
10471B1609b90270D66652a77482A05577B6631K7738a4814k73663j9956B598g8741
10459a68234J1277j45734B2784i643j68153L9431A51831c702A04662b43524C56968
10447b05071m4530C8596b4046p8346E0604N4876i4012C4504a7570k51876g6162
10435A16079h3461j07395j63364i1400L5206C08370a75781I2957g0000H0869d65958
10423H427a11350d2683B18600b75096A43061m9648M5615a24917f896j38136O3856
10412h1176n8483f4877b5617j59444J0728p1597o6110F8081j5273a6051B37293
10400A7519M865b88541J43691C53647H6159e3340r719I9308L5199E8525K43987
10389C02512H0754m196O16622B11999a37056l4854A32026a64449C4206L2257a02485
$$ plain form
10377 243926 192231 199564 182632 344797 531969 -28138 303670 138948 374469 305393 490603
10366 490603 465005 584808 373547 715273 519516 346752 198275 428136 -183959 245544
10355 290909 -109213 -75370 435623 133369 277706 689218 520562 458506 159166 320142
10345 320142 169974 283747 553063 439488 435935 360481 200077 21745 223659 392247
10335 392247 285331 303737 162734 -122105 -41857 68659 205573 111591 311310 -133710
10324 47015 -19295 37190 -12136 166897 218636 107173 56851 -117477 226335 282646 115588
10312 163761 -55283 -77944 -29617 -324997 -441698 -170881 -64437 -188874 105327 123897
10302 123897 -315430 -124199 16860 -203174 101676 109044 235708 20586 236310 515073
$$ packed form
10377B43926n1695P333j6932J62165J87172b8138C03670A38948K35521o9076J85210
10366D90603k5598J19803k11261L41726j95757j72764j48477K29861a83959B45544
10355B90909a09213L3843D35623A33369J44337M11512j68656o2056A59166J60976
10345C20142j50168J13773K69316j13575l553p5454j60404B1745K01914J68588
10335C92247j06916J8406j41003a22105d1857F8659J36914r3982J99719a33710
10324D7015a9295C7190a2136A66897N1739A07173n0322a17477B26335N6311A15588
10312A63761e5283k2661b9617k95380j16701a70881f4437j24437A05327J8570
10302A23897c15430a24199A6860b03174A01676P368J26664B0586K15724K78763
$$ plain form
10292 515073 -264066 263939 -255055 19007 161752 114273 -103617 -156901 109689 92415
10282 92415 41191 -266237 122557 -164613 291038 -226785 -200663 397674 21608 -293219
10271 46511 -251397 -69835 24330 14343 -204811 160919 -270688 -184402 -162454 -54587 435265
10259 88253 542018 419927 523215 186276 149086 392603 381547 12465 -141835 111293
10248 242006 -73399 -217446 -167809 -55145 -124187 5177 -168891 10461 -180120 -39259 -156070
10237 -156070 149623 71045 -117403 -140076 -398956 -418767 -31155 -161346 -22187 -41797 -245686
10226 -245686 -520570 -36080 33712 134051 -82226 232749 147825 53398 -51800 -187431 52081
10214 48203 295305 25788 -280584 -195071 -355990 -223238 184547 -167319 7608 -83443 -174331
$$ packed form
10292E15073b64066B63939b55055A9007J42745m7479a03617n3284A09689j7274
10282I2415D1191b66237A22557a64613B91038b26785K6122C97674B1608b93219
10271D6511b51397f9835B4330r987b04811A60919b70688Q6286K1948e4587D35265
10259H8253M53765j22091J03288A86276l7190K43517j1056A2465a41835A11293
10248B42006g3399j44047M9637e5145o9042E177a68891A0461a80120c9259j16811
10237a56070A49623G1045a17403k2673k58880j9811c1155j30191b2187j9610k03889
10226b45686k74884c6080C3712J00339h2226B32749q4924E3398e1800j35631E2081
10214D8203K47102B5788b80584Q5513j60919J32752A84547a67319G608h3443r0888
$$ plain form
10203 -174331 -176576 -2726 -136581 12934 311280 -314514 -246691 36819 -35906 -187580 -377419
10192 -377419 114488 -21298 1432 -88066 126624 197419 -226320 23594 64798 -193256 -6608
10180 -125800 81180 -103451 76267 164547 -27214 72277 -187306 -31640 -131959 -137350 68493
10168 -230676 -109746 -209804 -73730 -166404 120076 120541 -455330 365105 -85775 -214347 -158098
10157 -158098 -243326 -131108 -17025 -362971 -195568 -36260 -404666 55611 46226 -4261 -121850
10146 -121850 -3947 -25573 -112503 85359 49661 -58889 -86209 -30069 -162417 258867 144536
10135 144536 -74050 -68737 50822 -49726 6437 -180406 247994 -25424 325226 15441 11855
10124 11855 60677 110369 186867 -35430 286675 -108244 16255 164177 -64756 10875 -117514
$$ packed form
10203a74331k245b726j33855A2934K98346c14514O7823C6819c5906j51674j89839
10192c77419A14488b1298A432h8066A26624P0795b26320B3594M1204a93256f608
10180a25800H1180a03451G6267Q8280b7214G2277a87306c1640j00319n391F8493
10168b30676a09746j00058g3730r2674A20076M65d55330C65105h5775j28572N6249
10157a58098q5228J12218a7025l45946J67403c6260l68406E5611r385d261j17589
10146a21850c947k1626q6930H5359l5698e8889k7320c0069j32348B58867j14331
10135A44536g4050N313E0822d9726F437a80406B47994b5424C25226A5441l586
10124A1855M8822M9692P6498c5430B86675a08244A6255J47922f4756A0875a17514
$$ plain form
10112 218604 -19693 -252382 -289568 -320817 99115 -228574 -18379 28418 -197466 169723 58047
10100 -11036 -17216 -263392 -40895 -117092 -328156 58986 -171886 3520 -180179 -99512 -420905
10089 -420905 -75762 13802 -38848 -397783 -61911 -210011 40109 1139 -204149 -60237 33630
10077 66859 -137074 -206159 -33058 -114219 -156460 27253 324620 31865 -168108 -140762 221104
10065 -141604 -72310 4532 71996 14021 219738 -121858 -334454 194968 -104373 -25691 -110308
10054 -110308 -325070 -142509 -191920 -135147 -56043 -402541 4341 -101814 92016 -133270 -4546
10042 -102366 5304 -407785 169549 -284271 -105892 -300827 7262 271969 -33472 99876 46143
10030 -321858 67988 -5246 -52580 -77260 -357786 -80776 -365306 -26122 251933 111680 25973
$$ packed form
10112B18604a9693k32689l7186l1249I9115b28574a8379B8418a97466A69723E8047
10100a1036o180k46176d0895p6197k11064E8986a71886C520a80179Q0667l21393
10089d20905g5762A3802c8848l58935f1911j48100D0109A139b04149f0237C3630
10077F6859a37074o9085c3058q1161m2241B7253K97367C1865a68108K7346B21104
10065a41604O9294D532O7464A4021K05717a21858k12596A94968a04373b5691q4617
10054a10308k14762a42509m9411N6773e6043l46498D341a01814I2016a33270d546
10042a02366E304d07785A69549b84271a05892j94935G262K64707c3472I9876D6143
10030c21858F7988e246m7334k4680k80526h0776k84530b6122B51933A11680B5973
$$ plain form
10018 -69974 -1902 -31549 28252 -181513 138010 -23584 -142133 -52984 -29378 21832 -288295
10006 32512 -101201 70815 173010 29024 -379242 37763 -148634 -227627 107520 218221
9996 218221 -69779 289489 -188499 -194850 -1346 -434899 255317 -205051 -259274 178577 52814
9984 271014 10030 34931 -89166 -204851 -58214 -24818 -173272 -88585 14906 -403921 -125413
9972 -128550 153270 -22921 7181 166876 209239 -143803 -100291 -299855 83371 208541 -153473
9960 -329423 -66248 -29122 -137351 -244477 293444 -158139 -132531 -123566 -141311 -78029 269199
9948 -108919 -203821 -140557 -33845 145335 240006 -46495 -340193 18102 -159365 240998 -95640
9936 -167084 94879 -91457 -283077 -380067 -282837 -36747 111245 -343011 -123387 -115151 -142979
$$ packed form
10018f9974a902k9647B8252a81513A38010b3584j18549e2984K3606B1832b88295
10006C2512a01201G0815J02195B9024c79242C7763a48634p8993A07520J10701
9996B18221f9779B89489a88499o351a346m33553B55317b05051n4223A78577E2814
9984B71014A0030K4901h9166j15685e8214b4818j48454Q4687A4906d03921a25413
9972a28550A53270b2921G181J59695M2363a43803M3512j99564H3371J25170a53473
9960c29423f6248b9122j08229j07126B93444a58139K5608Q965j7745O3282B69199
9948a08919r4902O3264c3845A45335R4671d6495k93698A8102a59365B40998i5640
9936a67084I4879i1457j91620r6990R7230c6747A11245c43011a23387Q236k7828
$$ plain form
9925 -142979 -114122 -7057 -116755 -30396 -97882 -141547 217633 219556 -125263 165669 -53378
9913 -177138 -498139 -71380 -407770 -94336 -26248 -226368 -349112 -31211 -377787 -101003
9902 147669 138122 -68283 -59951 137270 -107280 241037 -3090 -157068 34848 53465 68759
9891 68759 -189027 225137 101175 14650 88317 220710 -67246 -95127 -184237 -9049 -73310
9880 -73310 -222870 -241124 -258944 -75749 128062 -112404 42241 -83159 -379150 25545 -171230
9868 3019 102084 -134831 238859 -265809 -79148 -172542 -361140 -153248 86167 -89486 -273941
9857 -273941 -361086 107770 -112356 -223192 147529 -206313 -84143 -109636 247909 -516519
9846 -222892 -105181 -335938 387902 139939 -122811 -241447 -7985 -35301 -24670 -142987
$$ packed form
9925a42979K8857g057j09698c0396o7486m3665B17633J923a25263A65669e3378
9913a77138l21001g1380l36390i4336b6248k00120j22744c1211l46576a01003
9902A47669r547f8283Q332A37270a07280B41037c090j53978C4848J8617J5294
9891F8759a89027B25137A01175A4650P3667J32393f7246k7881q9110i049o4261
9880g3310j49560j8254j7820g5749A28062a12404D2241h3159k95991B5545a71230
9868C019R9065a34831B38859b65809g9148r3394j88598a53248H6167h9486j84455
9857b73941q7145A07770a12356j10836A47529b06313h4143k5493B47909e16519
9846b22892a05181k30757C87902A39939a22811j18636g985k7316J0631j18317
$$ plain form
9836 -142987 191882 -357673 102059 137409 -2116 -7499 -163145 -7969 40349 68370 -128956
9824 -173435 4656 -9188 -27652 -13773 177118 261292 -79901 123485 -188655 63499 -163530
9812 88166 -286047 -148647 -427672 -166071 396119 24981 -197574 -46449 -57270 77119 -122178
9800 161506 50937 -16848 -182926 58806 -5700 69793 -309468 -142425 197240 -287916 -64627
9788 -262612 32350 -260602 27806 -51067 -351470 137003 -161180 149384 -237467 189449
9777 100347 -196226 67026 40495 -43641 -134225 -148359 115059 667 -142703 349610 -242592
9765 383440 -148145 -91602 -261091 -7082 -152839 -86556 11798 -157324 77499 136577 -224297
9753 -13298 182639 -82801 -63626 -198798 10911 -195460 64150 177464 182021 -334313 -37378
$$ packed form
9836a42987A91882c57673A02059L5350b116n383j55646g969D0349K8021a28956
9824a73435D656i188j8464a3773A77118Q4174g9901A23485a88655F3499a63530
9812H8166b86047J37400k79025a66071C96119B4981a97574d6449j0821G7119a22178
9800A61506E0937a6848j66078E8806e700F9793c09468a42425A97240b87916f4627
9788b62612C2350b60602B7806e1067l00403A37003a61180A49384b37467A89449
9777A00347a96226F7026k6531d3641r0584j4134A15059F67a42703C49610b42592
9765C83440a48145N6543j69489g082j45757O6283A1798a57324G7499N9078b24297
9753a3298A82639h2801J9175j35172A0911a95460F4150J13314M557c34313c7378
$$ plain form
9741 30131 103885 -53666 -37958 -281080 24816 -92976 -9924 -175546 -507066 -309209 -258181
9730 -258181 -100472 -290653 24105 -124861 70351 -199821 -70566 -461208 -50766 -11027 185508
9718 -184702 -118611 -15769 327746 -388328 116306 -330042 -189660 83736 -130892 -152706
9708 -152706 341098 -111574 -402069 16708 113736 250282 -23691 -100794 126430 -235998
9697 -92280 -131571 -83914 90465 267989 -271403 -199252 35206 -108476 -25993 -188955 -96918
9686 -96918 -90436 -178529 -423787 -293269 98959 -293173 -27554 -250401 -158178 171202 -236911
9674 -322125 -112870 65350 -201758 -266953 -157033 -79955 -195606 74431 12703 -109602 -184722
9663 -184722 61066 26065 -105134 -252504 158344 -143109 -315509 30911 4128 230873 -275999
$$ packed form
9741C0131P3754e3666J5708k43122B4816i2976i924j65622l31520J97857N1028
9730b58181a00472j90181B4105a24861G0351a99821g0566l90642e0766a1027A85508
9718a84702O6091a5769C27746c88328A16306c30042J40382H3736a30892k1814
9708a52706C41098a11574k90495A6708R7028J36546b3691p7103A26430b35998
9697i2280l9291M7657I0465J77524b71403P2151C5206a08476b5993j62962R2037
9686i6918O482q8093k45258J30518I8959b93173b7554k22847R2223A71202b36911
9674c22125a12870F5350b01758o5195J09920P7078j15651G4431A2703a09602p5120
9663a84722F1066B6065a05134j47370A58344a43109j72400C0911D128K26745b75999
$$ plain form
9651 29565 5031 -149081 -269589 -127603 -53977 65359 209146 -71826 -30349 64828 203480
9640 203480 -181772 -163448 -439427 -133384 -167220 -11368 251338 18692 17553 -230330 -193173
9629 -193173 139956 -150310 28279 158811 -343934 -47036 -148207 -106186 -83110 99810 344351
9618 344351 -248893 -368508 359032 81448 -176429 129369 -584395 -389119 7574 -213741
9607 -140261 93883 -114487 -94207 -168926 -87789 -16074 -586851 -3481 -245033 -247284 -106169
9595 -140013 282215 -95776 -203418 67889 -72690 94500 -49471 153273 179263 46162 -14613
9583 -14657 -143687 -342725 -32044 -82399 -417347 -165365 159143 -146810 24593 -108816
9572 -357332 -126370 -94832 342819 -444060 225581 -22244 79719 -41508 -258795 184697
$$ packed form
9651B9565E031a49081j20508a27603e3977F5359J43787g1826c0349F4828J38652
9640B03480a81772J8324k75979a33384l3836a1368B51338A8692j139b30330L7157
9629a93173A39956a50310B8279J30532c43934d7036j01171M2021K3076I9810K44541
9618C44351b48893j19615C59032H1448a76429A29369e84395J95276G574b13741
9607a40261I3883a14487K0280p4719Q1137a6074n70777c481k41552k251a06169
9595a40013B82215i5776j07642F7889g2690I4500d9471A53273K5990D6162a4613
9583a4657j29030j99038c2044n0355l34948a65365A59143a46810B4593a08816
9572c57332a26370L1538C42819d44060B25581b2244G9719d1508k17287A84697
$$ plain form
9561 11323 -15732 -201538 -196707 -157352 -13023 112919 43530 -37857 -22224 -315278 -104982
9549 1041 -231836 -179810 332444 -408690 -115058 -233291 -35618 -136946 159255 -59780 58236
9537 -22069 23556 -113295 -87770 57881 175383 -187635 -105076 -35066 -273297 64875 328594
9526 328594 -195759 -42147 -227547 -44996 -254460 -324575 149639 -178526 -78843 39339 -145041
9514 -195061 -136126 -394445 -77372 -154562 14030 164225 -228656 -125730 -202465 -135693 -209560
9503 -209560 -42785 -334849 -140023 -141943 291758 -73113 -161523 11530 79949 96119 -215991
9491 -116167 -14015 -553493 -104568 462005 305305 -16931 143328 -274722 125194 -416915
9480 -156191 -110956 90819 124582 -32624 -234353 -18302 228791 13297 -8847 -43865 162718
$$ packed form
9561A1323a5732j85806M831L9355a3023A12919D3530c7857J5633k93054a04982
9549A041b31836N2026C32444d08690a15058j18233c5618j01328A59255e9780E8236
9537b2069B3556a13295K5525E7881J17502a87635Q2559c5066k38231F4875K63719
9526C28594a95759d2147j85400d4996k09464p0115A49639a78526g8843C9339a45041
9514a95061N8935k58319g7372p7190A4030J50195b28656J02926p6735O6772p3867
9503b09560d2785k92064a40023j920B91758g3113q8410A1530O8419J6170b15991
9491a16167a4015n39478a04568D62005j56700a6931A43328b74722A25194d16915
9480a56191M5235I0819L3763c2624k01729a8302B28791A3297h847l5018A62718
$$ plain form
9468 79689 -353489 -222604 179102 -223067 -259845 165604 -30918 -197042 22633 -12108 6317
9456 63068 152397 85687 53857 -424301 43413 -173348 -389454 -145731 -96511 44652 -19750
9444 24165 248201 105770 -68487 22150 -10200 9914 -181720 -5494 -242378 -52542 197258
9432 -258938 158287 -52418 43758 2141 -129602 235460 87922 -164659 -242997 -119627 156615
9420 19193 110487 -34929 -119052 153318 -77860 -56650 -194237 -221151 31940 162573 -98334
9408 179000 -161335 -329738 95116 -215684 -39527 -49334 -293225 15099 9360 -161436 -50242
9396 -198389 9731 -102609 129762 -124157 202939 87254 -167502 -243588 45003 -22724 -4324
9384 72326 -217391 -200469 -99243 -213165 -166491 30848 -77546 14617 -361858 -214401 -178600
$$ packed form
9468G9689c53489J30885A79102b23067l6778A65604c0918j66124B2633a2108F317
9456F3068Q9329o6710l1830d24301D3413a73348k16106a45731M9220D4652a9750
9444B4165K24036A05770f8487B2150a0200I914a81720e494k36884e2542A97258
9432b58938A58287e2418D3758B141a29602B35460H7922a64659p8338a19627A56615
9420A9193R1294c4929q4123A53318g7860K1210j37587k6914C1940J30633i8334
9408A79000a61335j68403I5116b15684c9527r807k43891A5099n739a61436e0242
9396a98389I731a02609A29762a24157B02939H7254a67502p6086D5003b2724d324
9384G2326b17391J6922i9243j13922M6674C0848g7546A4617c61858J47457L5801
$$ plain form
9373 -178600 -219106 -299661 -245379 164406 2825 19689 -182632 335433 -242284 -26701 -251372
9362 -251372 23316 -116935 -111987 78108 270313 -365185 -151620 -175835 145939 -98860 -145220
9351 -145220 51507 21005 -191057 -359865 -245230 78968 154037 -353537 187978 14397 -102515
9339 -15881 -25648 -129761 42295 3005 -28625 -115126 -345170 -140233 197944 -80779 40978
9327 61504 123141 -1395 -96805 107238 106061 10755 -305172 -99029 205284 -331942 243254
9315 -3940 85335 -238871 78840 -44853 -120529 223626 -28074 77847 235166 40228 -228747
9303 40591 -34471 -224876 -142422 -51282 -196474 109827 132290 -251244 39968 -231009 11962
9291 -99913 23147 75849 61986 -113606 -171782 -205031 -71498 -148804 -318712 218692 243654
$$ packed form
9373a78600m0506q0555N4282A64406B825J6864a82632C35433b42284b6701k24671
9362b51372B3316a16935M948G8108J92205c65185a51620k4215A45939i8860m6360
9351a45220E1507B1005a91057j68808J14635G8968P5069c53537A87978A4397a02515
9339a5881r767j04113D2295C005b8625q6501k30044a40233A97944h0779D0978
9327F1504O1637a395r5410A07238j177A0755c05172i9029B05284c31942B43254
9315c940H5335b38871G8840d4853p5676B23626b8074G7847J57319D0228b28747
9303D0591c4471j90405Q2454e1282j45192A09827K2463b51244C9968b31009A1962
9291i9913B3147N2702j3863a13606n8176l3249g1498p7306j69908B18692K4962
$$ plain form
9280 243654 121658 -3963 -33412 94855 51833 -13301 -146959 -189143 109555 -264399 -105461
9268 326273 87452 58654 43585 29757 -42281 165596 -129969 -107949 -134523 -293652 -38438
9256 120507 -70868 -29012 45170 162470 -92246 13316 -165006 34310 -62364 -233224 135431
9244 -287549 -175905 121622 35651 -39937 11033 -259975 22602 6465 131922 -265864 80801
9232 -83445 -50869 -205566 -251725 -125128 -70906 -114597 -168210 -81147 -127791 -148780 -64165
9220 -212477 233688 -128115 -91445 -27782 -231921 -144035 -3134 -232907 173117 65121 -151890
9208 -113302 -27820 -169505 133244 -139174 -224415 -115863 -66788 12700 10751 -90999 278904
9196 117960 67815 101956 -48732 -284170 11944 -18041 -118665 204126 4233 -53188 -183741
$$ packed form
9280B43654A21658c963k9449I4855m3022a3301j33658m2184A09555b64399a05461
9268C26273H7452k8798j5069j3828d2281A65596a29969K2020k6574j59129c8438
9256A20507g0868b9012D5170J17300i2246A3316a65006C4310f2364j70860A35431
9244b87549J11644A21622C5651c9937A1033b59975B2602F465J25457b65864H0801
9232h3445L2576j54697m6159a25128N4222m3691n3613h1147m6644k0989f4165
9220b12477B33688a28115L6670b7782k04139Q7886c134k29773A73117F5121a51890
9208a13302b7820j41685A33244a39174q5241J08552M9075A2700j949i0999B78904
9196A17960n0145L4141d8732k35438A1944a8041j00624B04126D233e3188j30553
$$ plain form
9185 -183741 -456958 -119083 -166650 -293734 64691 137899 -154086 -406861 8316 -111720 125825
9173 239658 109358 9227 84792 -214099 49877 -21356 -111375 105780 -206793 15150 -14075
9161 -285078 -35031 73785 -426074 67349 -192220 -180287 -301447 111285 114891 -310603 -39278
9149 99521 24094 -229391 -121969 -163401 -366831 -411515 60459 -82638 -330223 80219 72310
9138 72310 -114094 -127583 -66876 8865 -261695 -172565 8054 -35330 -111628 50955 -187262 -83645
9125 -116524 172859 135730 75451 -90876 56137 101455 133038 -11969 -348922 126152 -180750
9113 -367753 -153589 36340 12647 -48043 37620 124067 -111866 258538 -76168 -212170 -135207
9102 -135207 -54389 84734 -31127 60205 48891 192862 -180907 209021 -36632 -41869 -315305
$$ packed form
9185a83741k73217a19083m7567j27084F4691P3208a54086k52775H316a11720A25825
9173B39658A09358I227P5565b14099D9877b1356r0019A05780b06793A5150a4075
9161b85078c5031G3785d26074F7349a92220J1933j21160A11285L606c10603c9278
9149I9521B4094b29391J07422m1432k03430m4684F0459h2638k47585H0219p909
9138G2310a14094j3489O0707H865b61695Q9130H054c5330p6298E0955a87262h3645
9125a16524A72859l7129o0279i0876E6137M5318L1583a1969l36953A26152a80750
9113c67753a53589C6340A2647d8043C7620Q6447a11866B58538g6168j36002P6963
9102a35207e4389H4734c1127F0205j1314J43971a80907B09021c6632n237k73436
$$ plain form
9091 -315305 -143496 -307048 -196347 -135596 -44159 49110 -158887 -429374 -84476 -122822 -46683
9079 -246192 -280440 -83435 39591 -260899 -176380 -110561 -124713 -302330 -306291 25599 -97175
9067 -244817 -451205 -173935 -129734 270415 -160832 -84840 -146831 -134311 -95391 -279610 48445
9055 -83183 -107071 -12971 -223314 -21240 48508 7971 57575 133016 -87057 -52652 47098 13406
9042 107931 252235 -38246 111105 -124609 161684 -218193 -255028 102227 -804 -153747 40059
9030 96321 -164773 -18613 109476 -157196 -226139 117950 -140758 -39358 56116 -225263 -81566
9018 209597 -89528 44283 169074 -174996 134 202958 -295878 -114042 -192907 -160258 -89993
9007 -89993 41639 -319976 -184764 190533 170602 -339463 -76679 -68772 -139904 -261507 112851
$$ packed form
9091c15305a43496j63552J10701O0751d4159D9110a58887k70487h4476l8346d6683
9079b46192l4248h3435C9591b60899Q4519O5819j4152j77617l961B5599i7175
9067b44817k06388a73935M4201B70415a60832P5992o1991J2520L8920j84219D8445
9055h3183k3888a2971k10343b1240D8508G971M9604P5441h7057L4405D7098A3406
9042A07931J44304c8246A11105a24609A61684b18193l6835A02227h04j52943D0059
9030I6321a64773a8613A09476a57196o8943A17950a40758c9358E6116b25263h1566
9018B09597h9528D4283J24791a74996A34K02824b95878a14042p8865L2649P0265
9007h9993D1639c19976J35212A90533j9931c39463g6679P907p1132j21603A12851
$$ plain form
8995 195484 -68165 -113325 211076 39186 38770 -249787 -21901 -347671 -381464 -297481 220969
8983 -165235 21318 -113642 288118 -314877 -144360 -155235 143380 -317382 157828 -58137
8972 -78886 -191452 41409 -321457 -140947 201465 210549 -84234 101757 -147979 88638 -209177
8960 41991 -17366 -44928 -349154 -121465 153377 115906 164505 -214381 197273 -310688 -249121
8949 -249121 58039 -43200 -264151 -64430 -277807 98677 -252397 -3896 59535 88488 -204741
8937 -151752 -217394 -60207 68408 102452 -147829 244961 -236322 -51250 -297731 -324326 161814
8925 57723 387963 275084 1431039 4747962 10577925 6297251 1363328 464622 409024
8916 409024 273204 23658 -176592 -159080 118927 297774 40225 23121 96660 89904 151608
$$ packed form
8995A95484f8165m5160B11076C9186m16b49787b1901l25770l3793Q3983B20969
8983a65235B1318a13642B88118c14877a44360j0875A43380c17382A57828e8137
8972g8886j12566D1409c21457a40947B01465R084h4234A01757a47979H8638b09177
8960D1991a7366k7562l04226a21465A53377l7471M8599b14381A97273c10688O1567
8949b49121E8039d3200k20951f4430k13377I8677b52397c896E9535K8953b04741
8937a51752o5642f0207F8408L4044a47829B44961b36322e1250k46481k6595A61814
8925E7723L30240j12879J155955L316923N829963m280674A363328D64622n5598
8916D09024j35820B3658a76592J7512A18927J78847D0225j7104P3539o756O1704
$$ plain form
8905 151608 -61709 261218 -173492 56605 160193 -184841 159091 -311256 57559 -265360
8894 364190 -184207 -73725 -130670 8461 -192333 95891 -2128 60390 -145465 -13772 33119
8882 336084 -53849 -45668 128389 -46471 -179470 346734 -278680 -190624 -81168 236713 -16817
8870 -397301 104606 -52946 119682 99533 -344203 -232003 -120329 35674 -79800 -109738 -184252
8859 -184252 -158912 -224619 -30548 262701 2882 -185708 -254212 222129 -397718 -267722 79196
$$ packed form
8905A51608f1709B61218a73492E6605J03588a84841A59091c11256E7559b65360
8894C64190a84207g3725n6945H461a92333I5891b128F0390a45465a3772C3119
8882C36084e3849Q181A28389d6471j32999C46734b78680Q8056h1168B36713a6817
8870c97301A04606e2946A19682k0149c44203J12200J11674C5674g9800k9938p4514
8859a84252K5340o5707c0548B62701B882a85708o8504B22129c97718J29996G9196
$$ [...]
##END NTUPLES=NMR SPECTRUM
##END=
